##TITLE=1H_Pr 22-S
 CDCl3+DMSO, 8 sc, 
 1.7.2019
##JCAMPDX= 6.0         $$ Bruker NMR JCAMP-DX V2.0
##DATA TYPE= NMR FID
##DATA CLASS= NTUPLES
##ORIGIN= UXNMR, Bruker Analytische Messtechnik GmbH
##OWNER= root
$$ XWIN-NMR		Version 3.5
$$ Mon Jul  1 16:25:06 2019 Russian Standard Time (UT+4h)  she@DPX200
##.OBSERVE FREQUENCY= 200.13155
##.OBSERVE NUCLEUS= ^1H
##.DELAY= (6, 6)
##.ACQUISITION MODE= SIMULTANEOUS
##.ACQUISITION SCHEME= undefined
##.AVERAGES= 8
##.DIGITISER RES= 18
##SPECTROMETER/DATA SYSTEM= spect
##.PULSE SEQUENCE= zg30
##.SOLVENT NAME= CDCl3
##.SHIFT REFERENCE= (INTERNAL, CDCl3, 0, 15.7039)
##AUDIT TRAIL= $$ (NUMBER, WHEN, WHO, WHERE, WHAT)
$$ ##TITLE= Audit trail, XWIN-NMR		Version 3.5
$$ ##JCAMPDX= 5.01
$$ ##ORIGIN= Bruker BioSpin GmbH
$$ ##OWNER= she
$$ F:/spectra/data/she/nmr/H-F/1/audita.txt
$$ ##AUDIT TRAIL=  $$ (NUMBER, WHEN, WHO, WHERE, WHAT)
(   1,<2019-07-01 16:24:08.39 +0400>,<she>,<DPX200>,
      <created by zg, POWCHK disabled, PULCHK disabled
       configuration hash MD5:
       00 E9 B6 7A A2 85 ED C7 34 08 36 98 17 FE 4E 26
       data hash MD5: 16K
       E3 E0 06 1C CF 03 1A 0F 43 93 0C 95 EE BF 19 82>)
$$ ##END=
$$ 
$$ hash MD5
$$ B5 EF 9D 69 37 3F CE B2 56 2B A3 C7 99 CC 71 48
##$RELAX= 
##$RELAX= 
##$RELAX= 
##$RELAX= 
##$RELAX= 
##$RELAX= 
$$ Bruker specific parameters
$$ --------------------------
##$DU= <F:/spectra>
##$EXPNO= 1
##$NAME= <H-F>
##$PROCNO= 1
##$TYPE= <nmr>
##$USER= <she>
##$AMP= (0..31)
100 100 100 100 100 100 100 100 100 100 100 100 100 100 100 100 100 100 
100 100 100 100 100 100 100 100 100 100 100 100 100 100 
##$AQSEQ= 0
##$AQ_mod= 1
##$AUNM= <au_zg>
##$AUTOPOS= <>
##$BF1= 200.13
##$BF2= 200.13
##$BF3= 200.13
##$BF4= 200.13
##$BF5= 200.13
##$BF6= 200.13
##$BF7= 200.13
##$BF8= 200.13
##$BYTORDA= 1
##$CFDGTYP= 0
##$CFRGTYP= 5
##$CHEMSTR= <none>
##$CNST= (0..31)
1 1 145 1 1 1 1 1 1 1 1 1 1 1 1 1 1 1 1 1 1 1 1 1 1 1 1 1 1 1 1 1 
##$CPDPRG= <>
##$CPDPRG1= <>
##$CPDPRG2= <>
##$CPDPRG3= <>
##$CPDPRG4= <mlev>
##$CPDPRG5= <mlev>
##$CPDPRG6= <mlev>
##$CPDPRG7= <mlev>
##$CPDPRG8= <mlev>
##$CPDPRGB= <>
##$CPDPRGT= <>
##$D= (0..31)
0 1.2 0 0 0 0 0 0 0 0 0 0.03 0 0 0 0 0 0 0 0 0 0 0 0 0 0 0 0 0 0 0 0 
##$DATE= 1561983847
##$DBL= (0..7)
120 120 120 120 120 120 120 120 
##$DBP= (0..7)
150 150 150 150 150 150 150 150 
##$DBP07= 0
##$DBPNAM0= <>
##$DBPNAM1= <>
##$DBPNAM2= <>
##$DBPNAM3= <>
##$DBPNAM4= <>
##$DBPNAM5= <>
##$DBPNAM6= <>
##$DBPNAM7= <>
##$DBPOAL= (0..7)
0.5 0.5 0.5 0.5 0.5 0.5 0.5 0.5 
##$DBPOFFS= (0..7)
0 0 0 0 0 0 0 0 
##$DE= 6
##$DECBNUC= <off>
##$DECIM= 24
##$DECNUC= <off>
##$DECSTAT= 4
##$DIGMOD= 1
##$DIGTYP= 9
##$DL= (0..7)
0 120 120 120 120 120 120 120 
##$DP= (0..7)
150 150 150 150 150 150 150 150 
##$DP07= 0
##$DPNAME0= <>
##$DPNAME1= <>
##$DPNAME2= <>
##$DPNAME3= <>
##$DPNAME4= <>
##$DPNAME5= <>
##$DPNAME6= <>
##$DPNAME7= <>
##$DPOAL= (0..7)
0.5 0.5 0.5 0.5 0.5 0.5 0.5 0.5 
##$DPOFFS= (0..7)
0 0 0 0 0 0 0 0 
##$DQDMODE= 0
##$DR= 18
##$DS= 0
##$DSLIST= <SSSSSSSSSSSSSSS>
##$DSPFIRM= 0
$$ [...]
##$SUBNAM2= <"">
##$SUBNAM3= <"">
##$SUBNAM4= <"">
##$SUBNAM5= <"">
##$SUBNAM6= <"">
##$SUBNAM7= <"">
##$SUBNAM8= <"">
##$SUBNAM9= <"">
##$SW= 24.9336996594482
##$SWIBOX= (0..15)
0 0 2 0 0 0 0 0 0 0 0 0 0 0 0 0 
##$SW_h= 4990.01996007984
##$TD= 16384
##$TD0= 1
##$TE= 0
##$TE2= 300
##$TE3= 300
##$TEG= 300
##$TL= (0..7)
0 120 120 120 120 120 120 120 
##$TP= (0..7)
150 150 150 150 150 150 150 150 
##$TP07= 0
##$TPNAME0= <>
##$TPNAME1= <>
##$TPNAME2= <>
##$TPNAME3= <>
##$TPNAME4= <>
##$TPNAME5= <>
##$TPNAME6= <>
##$TPNAME7= <>
##$TPOAL= (0..7)
0.5 0.5 0.5 0.5 0.5 0.5 0.5 0.5 
##$TPOFFS= (0..7)
0 0 0 0 0 0 0 0 
##$TUNHIN= 0
##$TUNHOUT= 0
##$TUNXOUT= 0
##$USERA1= <user>
##$USERA2= <user>
##$USERA3= <user>
##$USERA4= <user>
##$USERA5= <user>
##$V9= 5
##$VALIST= <valist>
##$VCLIST= <CCCCCCCCCCCCCCC>
##$VD= 0
##$VDLIST= <DDDDDDDDDDDDDDD>
##$VPLIST= <PPPPPPPPPPPPPPP>
##$VTLIST= <TTTTTTTTTTTTTTT>
##$WBST= 1024
##$WBSW= 4
##$XGAIN= (0..3)
0 0 0 0 
##$XL= 0
##$YL= 0
##$YMAX_a= 99173
##$YMIN_a= -77527
##$ZGOPTNS= <>
##$ZL1= 120
##$ZL2= 120
##$ZL3= 120
##$ZL4= 120
##$ABSF1= 10
##$ABSF2= 0
##$ABSG= 5
##$ABSL= 3
##$ALPHA= 0
##$AQORDER= 0
##$ASSFAC= 0
##$ASSFACI= 0
##$ASSFACX= 0
##$ASSWID= 0
##$AUNMP= <proc_1d>
##$AZFE= 0.1
##$AZFW= 0.1
##$BCFW= 1
##$BC_mod= 2
##$BYTORDP= 1
##$COROFFS= 0
##$CY= 11.3945322036743
##$DATMOD= 1
##$DC= 2
##$DFILT= <>
##$DTYPP= 0
##$F1P= 18.9103706918063
##$F2P= -1.10871071338519
##$FCOR= 0.5
##$FTSIZE= 0
##$FT_mod= 4
##$GAMMA= 1
##$GB= 0.15
##$INTBC= 1
##$INTSCL= 1
##$ISEN= 128
##$LB= 0.24
##$LEV0= 0
##$LPBIN= 0
##$MAXI= 10000
##$MC2= 0
##$MEAN= 0
##$ME_mod= 0
##$MI= 1.114404
##$NCOEF= 0
##$NC_proc= 0
##$NLEV= 6
##$NOISF1= 3.799351
##$NOISF2= 2.8
##$NSP= 1
##$NTH_PI= 0
##$NZP= 0
##$OFFSET= 15.70392
##$PC= 1
##$PHC0= -8670.037
##$PHC1= 26.60097
##$PH_mod= 1
##$PKNL= yes
##$PPARMOD= 0
##$PSCAL= 0
##$PSIGN= 0
##$REVERSE= no
##$SF= 200.130013532006
##$SI= 16384
##$SIGF1= 3
##$SIGF2= 2
##$SINO= 400
##$SIOLD= 16384
##$SREGLST= <1H.CDCl3>
##$SSB= 0
##$STSI= 0
##$STSR= 0
##$SW_p= 3612.71676300578
##$SYMM= 0
##$S_DEV= 0
##$TDeff= 0
##$TDoff= 0
##$TI= <>
##$TILT= no
##$TM1= 0
##$TM2= 0
##$TOPLEV= 0
##$USERP1= <user>
##$USERP2= <user>
##$USERP3= <user>
##$USERP4= <user>
##$USERP5= <user>
##$WDW= 1
##$XDIM= 8192
##$YMAX_p= 0
##$YMIN_p= 0
$$ End of Bruker specific parameters
$$ ---------------------------------
##NTUPLES= NMR FID
##VAR_NAME=  TIME,          FID/REAL,        FID/IMAG
##SYMBOL=    X,             R,               I
##VAR_TYPE=  INDEPENDENT,   DEPENDENT,       DEPENDENT
##VAR_FORM=  AFFN,          ASDF,            ASDF
##VAR_DIM=   8192,          8192,            8192
##UNITS=     SECONDS,       ARBITRARY UNITS, ARBITRARY UNITS
##FACTOR=    0.0002004,     1,               1
##FIRST=     0,             0,               0
##LAST=      1.6414764,     0,               0
##MIN=       0,             -77527,          0
##MAX=       1.6414764,     99173,           0
$$ Real data points
##PAGE= N=1
##DATA TABLE= (X++(R..R)), XYDATA
0 0 0 0 0 0 0 0 0 0 0 8 -8 8 -8 8 -16 16 -24 24 -31 32 -40 48 -56 64 -72 80 -92 104 -120 136 -152 171
32 171 -191 213 -238 267 -297 330 -365 405 -448 495 -549 607 -674 746 -830 925 -1033 1159
50 1159 -1306 1486 -1704 1979 -2339 2828 -3542 4684 -6808 12115 -55066 -55741 66538 53643
64 53643 -14618 -77527 -51985 13556 49721 9895 -34968 -44676 -7235 30237 29181 -8824 -24727
77 -24727 -11219 16183 28412 8109 -19569 -3332 25989 20341 -2795 -6940 4418 20446 19134
90 19134 -573 -8856 3327 13923 15689 4622 -8998 -3949 10349 10137 3822 -2243 -9481 -1959
104 -1959 11265 3039 -8822 -3062 3621 1448 -2473 -6397 -3286 3335 500 -3350 -1911 -3637 -2669
119 -2669 3894 538 -5765 -3424 -2157 442 6501 -1560 -13182 -4540 8237 4423 -5138 -9122 -3836
134 -3836 4979 1821 -6067 -3717 -1162 -2926 214 890 -2858 -1520 -2351 -4479 3184 5801 -4328
149 -4328 -5532 3192 4691 1429 -1385 -1405 4631 5849 -722 -403 5087 4541 3189 1803 -1299 3363
165 3363 8172 2701 -223 2702 1036 1129 5392 2815 -1646 -788 463 2575 3384 -2643 -4949 236
181 236 1728 456 -841 -5853 -5353 2740 2386 -4262 -4961 -4083 -1383 3294 -143 -6684 -4487 433
197 433 1400 749 -2811 -3939 981 1044 -2136 583 1874 -769 -48 138 -1335 2453 3736 -516 -878
214 -878 788 -335 2265 4739 907 -2407 -2152 303 5899 4907 -3562 -4882 1305 3715 3358 28
230 28 -4409 -1318 4164 1209 -1853 201 -30 -405 424 -1176 -653 2023 -97 -1750 -405 -1228 -243
247 -243 2601 261 -2368 -876 -894 291 3474 86 -4149 -1383 1863 1794 1110 -2150 -3326 1129 2454
264 2454 -435 -1103 -882 -490 1619 -162 -2724 473 2037 -688 -955 -774 -948 1782 1915 -1885 -1686
281 -1686 332 499 1662 954 -2208 -1565 844 1333 1948 408 -3047 -889 3271 1850 -250 -993 -1618
298 -1618 1208 3460 15 -1889 449 861 659 619 -899 -118 1868 28 -1230 630 105 69 1036
315 1036 -718 -1431 925 733 -404 435 -1149 -1815 809 1436 -427 -1108 -1945 -889 2265 902 -2508
332 -2508 -1850 -130 626 1347 -1026 -3086 -144 1646 -200 -843 -1165 -1240 668 896 -1338 -770 10 -323
350 -323 496 450 -1139 -291 881 176 498 133 -1348 560 2555 239 -1135 -304 405 1914 1765 -1137
368 -1137 -1240 1452 1840 933 78 -1370 303 2560 943 -713 65 10 461 1641 32 -947 251
385 251 353 93 608 -621 -1137 717 821 -416 -672 -1053 -575 1342 -65 -2203 -1057 257 440 63
403 63 -1276 -2119 155 1245 -383 -1268 -1235 -627 988 656 -1280 -889 -97 -118 757 498 -1125 -510 771
422 771 429 294 89 -860 397 1620 176 -584 7 349 1158 1005 -933 -506 1439 1211 275 -139 -815
441 -815 438 1787 444 -847 -230 309 706 1019 -337 -1033 80 445 279 398 -655 -1043 635 597
459 597 -491 -381 -620 -364 900 45 -1392 -647 420 141 -50 -832 -1042 480 622 -655 -649 -426 -84
478 -84 840 379 -1106 -516 536 176 368 -22 -863 -75 1038 446 1 -273 -601 569 1073 -99 -675
497 -675 46 303 819 386 -945 -428 1041 733 -210 -340 -655 204 1086 -181 -863 24 212 337 253 -841
517 -841 -747 254 468 -71 -338 -735 -509 723 338 -728 -568 -245 34 652 -266 -1177 54 868 302
536 302 -70 -649 -509 891 719 -423 -382 76 264 797 274 -736 12 796 380 224 -103 -402 452 1024
556 1024 -12 -208 -103 15 676 598 -447 -289 357 524 274 -117 -800 -101 844 182 -545 -464 -200 213
576 213 490 -441 -693 158 173 103 -102 -593 -340 387 126 -204 -191 -525 -371 535 130 -699 -218 -81 1 150
598 150 -214 -562 6 354 -70 -4 -374 -200 426 241 -225 194 81 -122 364 391 -311 13 453 49 101
619 101 6 -93 275 313 41 22 17 -401 366 356 -392 -82 224 -274 114 174 -586 -315 446 131 -377 -154 -103
642 -103 -90 136 -171 -225 60 -159 -19 139 -332 -325 345 -4 -278 177 -182 -147 326 286 -333 -274 99 304 257
665 257 -206 -315 264 242 9 129 -337 -196 399 304 -423 -30 108 -104 159 36 -321 -53 330 126 -132
686 -132 -247 -276 277 36 -546 -218 -131 108 179 81 -424 -157 322 27 -191 -216 -284 73 384 9 -176 -332
708 -332 100 383 232 -458 -333 462 121 -38 32 -236 21 623 114 -428 28 177 218 165 -159 -184 6 177
730 177 293 -23 -488 -190 497 243 -247 -270 -146 26 277 85 -631 -67 473 115 -147 -245 -188 275 127
751 127 -154 -91 -175 -133 328 79 -394 -195 205 79 -42 -3 -165 -69 304 -5 -292 -118 -50 248 149 -234 -170
774 -170 164 58 198 116 -299 -36 482 227 -51 145 -47 -76 290 45 -52 -23 -15 119 84 -61 89 175 11
797 11 -57 151 47 -38 334 29 -262 30 158 31 34 -126 -226 66 200 -47 -158 -172 -140 228 51 -308 -101
820 -101 -2 -98 58 89 -292 -88 141 -63 -36 -117 -65 11 4 -21 -13 54 -40 61 -38 -274 37 224 -79 -51 -60 -207
846 -207 120 345 -86 -264 -25 111 104 10 -158 -146 7 28 137 -87 -263 -142 289 21 -144 36 23 -99
868 -99 227 -61 -193 -103 124 135 111 -58 -96 109 127 -28 -44 -16 60 320 90 -318 -47 152 171 105 41 -213
892 -213 -96 192 100 -1 -82 -91 159 199 60 -124 113 80 134 59 -174 -147 217 92 29 6 -155 31 5 -10 -42
917 -42 20 31 187 42 -327 -164 15 161 36 -79 -180 -27 261 178 -99 -91 16 -55 159 42 -118 -8 62
940 62 148 104 -179 -153 204 105 -45 53 -4 -49 179 27 -151 46 151 24 99 -5 -142 136 187 -54 -48 -72 -44
965 -44 159 50 -249 3 66 24 73 81 -220 -44 121 -22 -22 -6 5 98 167 7 -50 -27 -55 38 -4 -134 -123 94
991 94 -41 -157 13 -98 83 72 77 -136 52 96 175 110 15 -183 -7 152 8 71 -74 47 176 202 4 44
1015 44 -88 19 72 163 -168 124 22 -12 46 49 22 133 -1 2 -60 26 41 -26 -44 -168 -105 -20 1 -166 -84 -221
1041 -221 -108 190 -43 -244 -62 -10 49 70 -104 -47 64 69 -29 -2 -87 -133 67 11 -55 101 -15 83 32 89 -35
1066 -35 137 98 -134 104 -105 24 94 75 -34 23 -83 38 22 30 6 9 80 78 -22 0 -68 190 120 -112 -75 -60
1092 -60 -170 -38 6 -117 14 -55 -71 17 -42 -125 3 40 -75 -104 -16 -134 -42 157 -141 -167 -68 -81 95 -15 -113
1117 -113 -191 5 61 43 66 -49 -28 -26 80 -64 -139 -39 62 120 -104 -106 0 18 -47 62 -146 -88 144 63 -37
1142 -37 -29 -36 -43 48 -30 -85 133 82 28 41 -100 -127 37 85 84 20 -35 -27 183 50 -44 -45 -14 105 -46 -55 -172 -23 40
1171 40 -8 56 -86 104 116 -57 95 -114 100 60 -60 -112 -74 -17 139 2 -17 41 -59 20 88 -128 -121 -1 -136
1196 -136 111 -14 -19 6 42 -3 5 -10 -107 3 176 8 -72 45 13 10 59 -109 -105 -1 86 16 80 -40 60 37 2
1223 2 -49 -103 -9 -29 83 -90 -159 -62 83 -58 -27 -21 -26 -68 62 -46 -46 4 13 -52 82 14 -23 36 189 2 46 -37
1251 -37 13 67 52 -24 -22 -64 16 9 -68 -59 28 -1 39 -31 -80 -38 -14 18 40 15 -96 110 9 -54 -41 4 -72 -48 7 -37
1281 -37 -39 -64 59 -170 -124 -35 101 -8 -96 -37 30 -13 -6 13 3 61 32 41 -19 -4 115 -48 86 77 -36 61 177 -242
1309 -242 83 98 -96 57 -9 13 -30 -57 37 -19 66 97 -2 -91 -126 60 44 -12 -55 -14 9 -7 61 28 -67 69 -23
1336 -23 -19 -60 -13 0 49 -94 -35 -74 77 35 113 -196 -40 -32 17 1 -159 -1 -11 94 57 -36 89 -3 92 112 29
1363 29 -62 177 -26 -36 -34 -144 -35 82 84 -74 29 -41 -25 0 -36 18 3 -82 -98 -57 25 -75 25 13 -37 -53 -114
1390 -114 -154 -69 9 -7 -1 82 28 26 -32 -9 41 57 -14 36 -76 12 87 33 -42 -106 -73 41 31 42 -44 -30 13 16 -12 49
1420 49 34 -92 99 40 45 1 14 128 -27 -110 -25 71 -181 16 -12 -127 3 -16 -29 35 11 34 81 -52 29 -108
1446 -108 -28 -100 35 -25 -85 13 118 -78 -41 -143 49 30 83 -5 -77 78 -27 -14 -50 -31 -52 69 -38 -29 -146
1471 -146 -63 3 -60 -156 10 0 56 -98 3 10 66 -135 -81 63 46 -42 -100 55 -42 -29 -23 57 -55 -44 95 27 2
1498 2 -18 71 18 -34 118 13 61 11 21 34 -103 6 -20 121 14 0 36 78 -75 -21 -74 -15 28 0 34 -43 -77
1525 -77 -32 57 18 50 64 128 -105 -93 14 87 -5 -24 -110 -21 -53 99 -38 -22 -18 -21 33 -107 27 -2 49 -23 -2 -73
1553 -73 1 57 27 3 -24 -23 -105 -65 71 26 6 0 -12 19 53 -45 59 29 -36 -42 -80 13 78 72 -13 81 103 16 121 30 55
1584 55 -139 40 80 67 -56 22 39 20 -146 -109 -2 -47 53 -119 108 -28 -109 -36 -8 -22 43 25 -61 -5 15 -57
1610 -57 9 -25 10 -167 8 -94 -12 123 123 -47 77 66 57 154 14 23 -31 -101 117 -70 -38 35 7 87 -101 -13 -6
1637 -6 -1 107 -22 24 22 47 145 -13 64 110 77 113 -52 104 55 -22 8 -31 152 -25 22 -66 -57 -55 45 88 43 -8 67
1666 67 -9 -86 18 6 13 -138 -29 -3 74 74 -97 18 -9 -131 32 57 -196 -143 -102 -4 -80 4 23 31 96 -9 30
1693 30 -14 -38 -16 54 -50 24 -42 144 -79 80 -69 -42 53 -29 -110 37 -41 23 16 61 46 -127 -45 -6 58 -2 -28
1720 -28 -49 67 36 -109 53 -62 -74 -1 -12 17 71 -10 -43 -32 -46 34 16 -16 -34 62 70 2 -5 -49 -31 119 39 65 -7
1749 -7 -93 82 53 38 -92 -60 -51 109 -38 -53 -70 -30 31 -30 15 -8 24 -1 -30 -136 -22 -44 38 -50 123 24 -49 -135
1777 -135 -46 -103 -35 8 -14 -90 52 -2 54 78 -39 -156 44 70 86 65 -119 130 131 -60 24 63 -129 52 67 -39
1803 -39 102 46 2 -8 69 -125 -149 122 -72 -28 -73 137 -32 34 32 47 -72 110 -20 -55 -108 22 64 4 51 17
1829 17 42 40 70 -43 112 -84 -87 76 -130 -28 -7 -18 -27 -66 51 21 70 37 127 86 -47 103 -61 -14 32 -175
1855 -175 -19 83 43 74 90 142 -119 -147 28 -127 2 -121 28 51 57 66 -67 68 45 -56 6 144 70 -78
1879 -78 53 -94 -27 -7 -101 84 37 29 -84 103 43 -20 16 1 -19 -4 120 -17 47 -48 -19 44 -7 30 12 105 -38
1906 -38 70 -37 -162 -26 -21 166 54 -27 -77 54 64 10 154 -35 -12 -84 38 82 -187 -31 93 -41 -55 102
1930 102 2 -61 -19 -28 12 -96 25 -55 -52 -57 2 88 119 47 -44 -38 -89 2 -24 91 50 39 -41 50 -58 -64 -42 -6 70 5
1960 5 144 -56 50 -75 72 32 -6 57 -87 -69 34 -99 -11 3 -73 33 20 -165 19 -77 110 -214 -8 82
1984 82 -19 113 58 -112 -108 83 52 -32 -27 -147 -58 19 -128 -88 -24 -42 43 -122 13 7 -32 90 -29 -40 -75 -43 62
2011 62 49 -25 57 -89 28 -55 39 -100 -68 -65 1 -5 -54 -34 23 0 -81 -12 68 -3 101 56 -95 38 -28 -42 81 37
2039 37 -13 -26 35 129 -99 0 64 -45 12 -31 -140 -36 34 -73 -62 -39 -15 -5 11 -92 49 100 19 145 -28 -83
2065 -83 -12 -36 -80 -15 -33 -53 -15 -35 27 97 -81 -71 -3 -105 13 -101 16 41 -108 -11 -17 -16 19 -130 -16 -22 29 -33
2093 -33 -69 -73 -12 -47 103 -7 70 -40 -21 25 -36 -33 29 -7 9 113 -135 39 105 2 -20 70 -107 -12 -24 -104 -5
2120 -5 16 4 -56 14 71 -65 -31 12 69 -74 36 -161 0 16 -50 -4 37 -12 -10 -84 -5 61 -34 15 10 18 27 -41 -37 -65 -5
2151 -5 30 -94 1 23 14 -14 54 117 -31 -6 -147 -5 15 29 -70 16 18 -21 -33 66 46 -25 28 105 80 -111 -21 92 -16
2180 -16 -143 -167 -71 -46 -51 121 -44 4 -24 -6 13 -9 -61 -23 1 -57 -28 60 -22 63 58 -47 -77 101 -107 11 80 20
2208 20 51 91 18 -39 46 6 54 -55 66 -80 20 -49 25 15 -62 -121 -6 77 -125 18 -78 -32 32 -14 -80 -4 -45
2235 -45 29 16 20 53 -122 15 -27 18 2 -64 60 86 -18 -3 41 23 -90 -23 26 -46 23 28 70 44 2 47 75 -68
2263 -68 -34 -65 -99 -21 -89 119 -103 68 -17 14 27 -77 -30 -74 -89 -24 100 -38 -9 -110 39 29 83 57 -46 31
2289 31 44 -162 54 64 10 75 -5 -36 30 -115 47 -47 -48 89 -66 -22 -104 41 16 -15 -73 -32 30 56 9 94 69
2316 69 69 -120 38 129 -56 -89 -40 34 129 30 -53 147 -30 -33 -23 -25 73 28 -17 16 122 29 -25 18 87 -25 -22 64 87
2345 87 50 58 45 36 82 19 -12 -51 29 138 -99 -1 -16 1 43 -69 53 64 23 55 9 -48 80 -32 12 81 31 132
2373 132 -81 -17 21 -85 58 0 -60 32 15 -13 -56 89 -112 -34 -116 -53 45 -10 69 -59 -28 -4 -46 -13 45 -105
2399 -105 28 -11 -18 75 48 -35 -58 3 -9 28 -57 68 -135 -46 -14 54 21 -30 -86 -67 84 35 -20 75 -49 -15 29 32
2427 32 -6 25 61 -102 45 -24 -19 95 202 7 86 19 18 81 65 75 20 -23 -135 47 44 72 -95 -44 25 42 87 65
2455 65 3 82 45 35 31 20 -92 -6 -3 -18 -98 10 -62 12 1 -28 -12 -88 8 -25 -21 0 0 -169 -4 -11 -36 6 59 49 82
2486 82 -32 104 -35 104 15 29 -8 70 28 -11 -33 -92 33 42 46 38 -45 -31 140 91 -61 27 -9 -6 36 40 -22 53 -1
2515 -1 89 -18 16 9 112 25 -18 73 97 -7 -30 46 26 -26 -66 -13 -37 11 21 -37 -3 -11 36 -15 -31 -47 -28 -8 -21 48
2545 48 61 -20 41 -5 112 38 -7 -19 43 19 -24 -66 -14 -32 20 64 -18 -44 -103 39 77 112 4 62 33 -54 7 -41 -55
2574 -55 -45 23 28 19 -95 -69 20 87 59 -87 130 -24 -77 16 -11 7 30 -61 -6 56 -53 11 -13 -96 -18 23 -7 103
2602 103 -65 70 -139 -105 75 55 171 82 76 95 -115 -18 -25 -50 -1 72 -65 3 -1 -6 118 133 17 -28 16 -38 24
2629 24 -25 -46 -14 -17 47 72 -71 34 -41 33 48 71 34 -95 -29 24 -101 11 19 -63 -74 -2 -57 55 -86 5 -20 -37
2657 -37 177 -36 -74 -69 48 -8 -62 94 60 -59 -33 68 -109 22 -119 80 16 -21 -69 -20 -21 66 -42 38 45 92
2683 92 20 -63 36 -11 42 -230 -78 -38 90 -6 -20 -17 -17 -74 -200 0 -76 -38 -19 12 0 -8 -79 1 -28 33 93 61 20
2712 20 11 -23 -11 76 -121 -52 53 -57 105 -156 -21 38 19 -78 51 -5 -28 -49 174 27 -71 37 -20 51 -97
2737 -97 6 -71 32 54 -80 -89 -61 58 24 3 116 46 64 -28 117 -1 7 -28 9 -96 19 12 -44 -40 -98 -66 39
2764 39 -46 69 -36 -64 -43 75 -56 -52 -47 16 64 43 -103 6 6 -2 -46 51 -33 -53 -109 -13 -27 -45 79 114 21 -145
2792 -145 10 48 -112 -64 81 10 -55 -5 128 120 51 -137 -110 -45 -65 11 -8 -31 -49 51 -2 -6 25 37 -115 53 8
2819 8 -67 15 59 11 83 -80 104 -13 59 29 46 25 -59 -10 -102 89 63 32 -71 -3 -37 84 54 59 -13 16 35 -88
2847 -88 -96 31 126 16 -71 36 11 64 -82 33 -41 -30 67 -106 -69 82 -34 0 1 -28 -9 -27 -14 -40 3 37 139
2874 139 80 -42 -50 114 -11 -6 -45 -64 -69 -63 26 70 -100 -134 110 -37 33 -57 64 20 -6 65 79 15 107 91 -127 -33
2902 -33 96 33 -133 42 103 -44 -9 29 -82 24 33 -35 42 -103 1 -51 11 -14 116 -136 -134 24 -51 143 -6
2927 -6 111 -2 -129 57 7 -18 53 16 128 -27 89 26 58 82 -118 83 -31 109 -72 71 42 10 -176 -36
2951 -36 -120 84 52 -37 -42 40 82 -52 -17 -146 53 124 103 -5 -35 28 125 22 -114 -15 53 -91 15 -38 1 -13
2977 -13 5 -141 195 19 -38 -42 -99 59 -56 -2 1 -36 203 13 -36 -30 -59 56 23 24 20 30 -17 -4 35 20 -35 -55 151
3006 151 -61 14 51 47 98 32 -107 -28 20 0 -16 -65 1 50 -68 62 -86 -56 -26 47 127 42 -40 -22 -57 -12 19 48
3034 48 -134 -48 -54 -36 -154 7 -12 99 27 81 -2 0 144 -61 69 54 164 -71 -78 -49 -27 28 56 109 -95 68
3060 68 13 110 7 110 71 5 29 -90 70 87 52 -19 0 32 -54 -51 97 -53 -34 -68 39 10 -11 -85 1 102 -59
3087 -59 45 -12 16 -28 -34 80 22 22 -83 -52 78 5 -87 19 75 -16 -5 -11 -30 -7 27 18 131 -29 -92 -59 -71 -20 40
3116 40 20 15 51 -72 9 -38 10 86 -46 13 -7 -123 22 -38 -12 -39 -94 30 -74 -89 0 -90 44 141 74 76 -81
3143 -81 8 123 -54 6 -22 -51 62 -28 -8 112 -5 -2 -59 3 -78 -7 89 -38 95 65 40 -20 29 71 40 -15 15
3170 15 6 64 18 49 -84 -63 95 -84 -56 34 -143 45 -162 -63 -78 35 -101 11 95 47 84 -101 169 -122 -21
3195 -21 -33 21 14 -30 25 -11 -134 83 -109 67 168 -135 -2 46 69 -69 -25 48 22 -28 -26 -13 -46 86 128 -73
3221 -73 -39 -17 51 -39 69 114 35 -65 114 7 96 60 78 -36 6 97 -11 40 -52 -10 26 46 139 -2 -38 -1 -120
3248 -120 -2 26 -83 -95 -44 58 -25 106 24 134 36 -29 -94 27 -4 84 109 -52 -20 27 -31 13 34 -33 17 -46
3274 -46 43 -3 -23 -80 157 -84 -10 -62 14 -68 -91 41 156 -33 18 -52 -120 81 114 -58 -86 117 174 -26 -39 34
3300 34 -4 55 -33 14 -48 -39 -26 49 -57 -58 -47 -24 31 10 41 71 85 -33 32 8 -27 -55 96 65 -74 13 -77 41 -22
3329 -22 3 -63 -5 -42 67 -91 148 -31 84 -55 31 66 -45 1 28 27 93 75 78 -56 -29 105 -31 -52 -155 -25
3355 -25 -43 -46 147 -45 7 23 -32 50 58 -16 -47 110 16 -11 42 -83 55 -1 43 16 -67 -34 -189 -44 -38 22 -1 -50
3383 -50 -36 37 41 -60 39 -92 -88 7 -10 -43 -107 23 -127 -32 -65 10 -45 -89 61 11 56 -102 14 81 -4 54 52 24
3411 24 85 -131 155 -22 62 45 69 66 51 -59 65 52 63 73 -21 -10 -28 43 -33 129 -58 110 151 107 -60 8
3437 8 -50 91 -92 -4 8 3 -25 -76 74 51 -39 8 25 -64 -22 4 77 -142 17 77 37 -16 62 -74 -70 28 -85 9
3465 9 -60 -73 -65 -19 59 52 -44 24 47 -44 -29 92 -92 31 -63 92 -6 -49 36 -30 93 11 80 -2 -39 -33 -26 -33 1 -77 122
3496 122 116 98 -133 5 13 -207 -104 -54 -72 -58 -20 118 33 13 -30 11 -43 35 127 -72 -5 -41 122 -18 -158 -106
3522 -106 52 51 -66 -9 13 -81 43 -67 -93 -39 -6 -193 21 14 165 -6 176 92 -30 54 -50 44 2 -29 -38 12
3548 12 -10 -66 -82 21 157 -102 113 76 27 20 -54 56 61 -147 204 52 11 -42 -15 23 114 -53 -9 46 34 -7 -67
3575 -67 187 -24 4 69 -15 -74 -67 23 13 46 52 99 3 -105 -53 -86 23 19 113 14 -30 -16 -87 -115 -126 -58 -10 -10 -72 64
3605 64 -23 -39 -4 -66 124 10 -37 -17 -80 4 14 -27 -9 15 45 -62 -6 62 -79 -34 -104 -48 71 54 -46 48 3
3632 3 37 44 60 -69 -107 67 -1 -12 -40 -65 -8 11 78 -53 31 76 -96 126 2 -18 73 -11 -134 87 -10 47 -21
3659 -21 59 0 90 2 -110 91 -4 -44 -88 -17 27 -89 13 -12 4 -44 42 55 8 -100 -32 72 -15 99 -6 34
3685 34 -5 9 -25 23 65 -35 -13 18 -33 79 -107 -41 -58 -11 -21 -8 113 -53 -39 -52 21 -9 -5 36 -17 -48 -19 -19 -6
3714 -6 1 -167 117 63 46 -113 -70 -86 -155 -65 -33 -45 -76 -9 -59 147 -115 -8 -78 -151 26 47 30 -55 242 39 -30
3741 -30 7 -5 63 117 -30 33 58 -28 83 93 -116 -39 68 -17 -6 -40 27 70 -84 -12 47 -10 -2 113 5 -33 -27 -64
3769 -64 103 -94 13 -2 60 57 -66 -31 63 19 83 4 -15 36 -17 -18 34 -21 54 -26 -23 -49 63 33 -27 0 16 -35 1
3798 1 2 39 -39 -25 -38 -38 -91 -23 3 22 54 36 -11 -65 -40 -12 -94 -2 81 67 142 -65 -101 -112 25 149 -146 28 64
3827 64 10 -30 -22 -1 176 16 57 110 -83 -47 10 44 85 -38 40 -34 -67 36 -149 -36 -23 150 32 113 -61 -4
3853 -4 -89 125 81 -104 68 -97 -45 22 72 85 52 96 6 -108 121 -116 -64 -54 -35 25 -75 1 76 18 39 35 28 -90
3881 -90 86 -68 -44 58 -15 -120 -41 -101 -3 -30 -43 110 16 -12 23 -29 -41 -55 64 14 56 118 65 45 -129 -73 11
3908 11 -24 71 -39 -62 -19 -46 83 -186 -194 112 30 -40 -23 9 122 19 -51 -28 -148 -3 7 -35 -3 -162 98 -69
3934 -69 57 -11 17 -71 -42 -2 -153 -38 86 -156 -33 -55 -126 -89 -41 42 23 100 80 187 -167 20 65 -18 -59 21
3960 21 -7 60 -12 181 -77 10 -24 -56 -91 3 -5 -14 -58 33 47 -30 28 -149 29 -92 -79 -2 48 67 68 26 -8 74 -87
3989 -87 49 78 154 136 33 127 22 -1 9 -133 -120 50 52 -38 -38 -8 -10 -7 39 -53 84 -71 -34 -79 -36 -77 -67 -4 -14
4018 -14 -65 54 38 0 25 -152 -107 -15 30 13 77 -18 -41 12 69 127 -59 2 -72 40 60 78 -46 -28 157 28 -33
4045 -33 15 18 -14 33 11 25 40 101 -21 -33 -66 60 37 72 -67 -16 19 -49 -42 -32 149 51 44 14 133 -48 108 -14
4073 -14 -37 62 -74 -61 44 49 -72 -64 90 3 48 -45 -32 -107 -46 56 9 -6 -45 116 149 -13 5 -49 78 -28 124
4100 124 48 -9 -2 45 133 -57 65 -154 160 -1 -28 -53 1 -36 91 3 47 126 108 -76 62 15 92 100 -2 144
4126 144 -19 -19 -72 -11 -70 138 127 -7 -49 64 6 -19 -89 100 -26 -69 53 -3 -73 11 -55 10 13 -107 -39 25 3
4153 3 -84 -5 10 0 36 38 -4 -47 87 62 7 -73 75 4 -110 169 102 29 -22 115 -61 16 -12 49 3 -35 -1 10
4181 10 -150 -49 -14 63 -87 39 -39 -47 -7 -73 -1 -88 -23 -13 -129 62 12 -77 -10 -105 42 -46 -24 -12 43 -42 24
4208 24 14 -32 13 21 68 -3 42 128 17 39 46 27 -6 1 -55 -28 41 -50 12 58 -29 -36 58 -4 0 41 62 -27 9 -62 56 -16
4240 -16 55 66 -102 -43 69 -105 -28 115 -55 167 94 58 100 18 -52 -112 -19 69 -78 15 -2 11 -20 40 -34 -36 66
4267 66 -167 -13 38 -62 70 -15 45 97 29 -83 -48 121 75 -62 8 -53 75 -57 -110 -112 -75 124 -49 15 29
4292 29 23 47 124 -13 -49 49 -38 72 -96 -10 34 -114 130 -40 64 -26 -111 14 -154 -23 -107 129 -10 13 -7
4317 -7 121 12 -167 90 52 62 -19 -106 55 -7 10 125 -118 10 6 80 74 8 23 -52 -62 -3 84 61 -96 -56 -89
4344 -89 -74 -144 -20 -22 -4 -39 -61 -55 -6 72 1 -48 73 128 -71 -3 64 8 -160 -59 -5 -57 -38 -20 -37 89 -81 -3
4372 -3 21 -56 -36 -7 105 -50 28 12 48 60 -98 -111 -67 -44 -133 32 12 35 -7 -150 30 -81 -67 78 -20 39 54
4399 54 10 -44 16 -70 -27 -54 -67 37 86 26 -42 3 24 109 -28 -16 32 -42 -5 102 23 -161 -30 -28 -56 -8 -40 -25
4427 -25 -30 -43 -19 -4 -17 58 -16 53 52 20 42 65 61 17 -65 21 28 -30 -76 -52 4 98 22 -25 24 -40 -65 28 -32 42 32 13
4459 13 -96 21 29 0 66 -22 25 -69 77 44 149 23 -49 -65 119 -11 -4 42 -35 71 -37 115 33 -19 36 3
4485 3 29 47 51 42 112 39 -64 -61 -118 41 39 150 -6 74 24 -23 79 55 -16 -12 -45 -159 83 14 -23 20 11 13 -57 60
4515 60 75 -68 43 -59 -133 -84 -14 -20 2 68 -17 16 11 21 39 11 -11 70 59 95 40 8 -17 -155 -6 -5 -80 48 -13
4544 -13 -53 -16 41 72 79 56 8 133 97 35 18 -22 47 -45 32 -26 -86 36 -109 8 7 67 85 11 -39 37 63 15 27
4573 27 28 118 -26 70 64 -19 -75 6 17 -52 114 -12 -24 28 -12 43 -48 -29 -35 10 -41 -53 28 -12 -85 -44 33 -31 25 25 -5
4604 -5 -4 -9 -89 -27 143 -93 -60 55 -3 173 -12 -4 44 -5 82 55 -81 -1 171 -112 83 26 13 -66 -43 -66 4 70
4632 70 60 66 47 45 31 50 -60 -69 -139 -15 -50 -79 -30 -26 44 -83 10 -65 -95 -23 -19 -32 21 94 46 -161 32 85 -41 10
4662 10 14 54 21 41 53 26 -48 45 26 47 -77 14 -156 19 72 -4 61 32 -9 -92 -40 -42 80 21 -104 -47 118 -22
4690 -22 92 28 -36 54 -27 18 -7 55 10 -34 8 -57 -100 80 149 -56 -72 -40 19 -107 76 -1 24 -8 -40 -108 -8
4717 -8 51 -80 -63 -95 -29 190 73 -1 38 -6 -38 -84 32 61 10 -9 137 4 -35 -73 -16 14 -88 -90 13 -147 73
4744 73 7 -67 -52 -13 -15 54 -86 67 6 -50 42 14 -59 6 48 28 88 63 73 48 -27 -76 -48 -35 12 -109 -9 -2 74
4773 74 74 7 -47 -21 16 44 1 93 48 134 17 -132 -2 -22 -10 11 33 40 141 60 66 61 12 111 -66 26 103 -33 -12
4802 -12 -76 43 -77 -12 144 -57 61 31 1 75 -20 30 -112 -33 23 -58 4 66 9 -83 -28 94 -5 76 11 -23 16
4829 16 -101 -64 -20 68 -8 82 8 45 89 15 67 71 -100 -89 9 103 -44 50 -11 100 59 -57 19 -103 -80 18 -60 12
4857 12 24 -45 28 -17 -9 14 -9 -107 20 -56 76 106 45 -32 11 -119 25 -44 -16 27 -43 -23 -2 58 5 75 -64 -39
4885 -39 75 40 -19 33 -98 -49 -32 -86 -61 43 -67 -182 -150 46 -67 4 -18 -52 -27 -66 -35 -80 135 -83 17
4910 17 -3 50 -56 95 -72 92 81 -14 32 -23 65 30 -5 -55 -50 104 2 -60 112 -6 -48 -78 84 -4 45 -59
4936 -59 51 12 -76 70 20 -62 0 56 13 -50 24 4 6 99 87 -26 -28 41 -28 28 77 90 -31 -107 100 -67 70 -20
4964 -20 -4 -28 -9 -40 52 -54 -77 62 -13 109 -3 13 78 -7 -94 11 -12 -109 93 15 57 71 13 -13 36 -54 -47 28
4992 28 9 52 53 105 -34 -12 79 -139 -60 79 26 -13 -37 70 -163 -128 34 43 -37 4 105 21 -107 -51 71 -24 98
5019 98 -21 66 -6 -46 30 71 31 -27 24 -21 -14 41 -21 -52 14 97 28 72 -96 -106 20 33 162 2 51 86 8 11 88
5048 88 -200 -37 61 94 -51 -22 -77 85 22 106 1 -96 -117 -61 -69 -87 97 93 32 -1 -68 -41 88 -28 -73 37 31
5075 31 21 -57 12 42 156 -93 -89 -18 -26 -4 -67 72 -87 40 22 -67 -8 117 -11 22 99 1 118 65 -116 44
5101 44 -38 -90 25 148 -70 -45 -75 -33 -20 12 -16 -18 -114 33 48 -12 51 -36 14 7 29 84 -99 13 -38 55 116 -4
5129 -4 43 57 -73 14 95 -18 -5 -108 26 -89 21 -30 41 -1 46 -124 -45 100 64 -45 -32 30 -36 99 -25
5154 -25 19 -56 57 -16 4 38 -28 77 48 -28 47 -54 -43 -4 -122 131 -23 -97 -9 -23 -33 -13 -195 -38 -29 -27 7
5181 7 -29 -10 -116 -54 16 2 -51 -9 56 53 4 -78 27 95 -57 16 -30 51 -5 -108 -75 53 -15 -110 66 -52 -29 118
5209 118 30 -65 7 -98 51 105 -117 35 -19 -8 -44 79 -80 3 23 94 59 12 23 8 -54 -8 -34 -32 39 -7 21
5236 21 2 99 42 55 65 0 94 20 -8 -16 -16 141 74 41 -52 19 34 61 -82 37 65 73 30 105 20 18 60 -9 13 154
5266 154 95 -75 29 1 -18 27 -63 46 73 4 24 -11 11 50 -9 188 69 -85 -55 31 -41 -28 -90 5 144 -10
5292 -10 15 9 -24 50 13 -56 2 -3 153 42 67 -54 14 -4 -27 -11 -82 10 -44 31 66 106 44 -100 12 115 -68 -89
5320 -89 53 -48 -55 5 36 24 64 -9 54 58 81 100 -41 32 44 26 -74 79 41 -46 70 -10 93 -62 -72 103 0
5347 0 -38 -70 99 34 -20 -10 -11 69 30 9 -61 2 78 -57 -56 63 -37 41 62 -22 64 15 45 -20 10 2 27 -6 -37 22
5377 22 -124 -94 -142 20 -77 34 107 -54 -31 -159 97 32 162 10 21 -27 -65 -66 -75 -99 -135 127 -15 -169 12
5402 12 -65 97 -8 188 35 54 27 -9 118 -25 37 -86 47 44 -4 9 -36 28 -82 -4 -48 14 18 -78 32 73
5428 73 -27 -85 27 50 -30 46 95 44 90 69 99 67 24 -57 -39 -61 45 78 -60 11 21 -40 -113 -26 17 22 -42 -70 5
5457 5 26 -9 2 32 39 -29 78 -79 -47 -36 -65 -66 -29 -132 68 19 -39 -10 -67 -16 56 44 28 139 3 40 78 -64
5485 -64 74 -32 -93 77 -28 -22 73 -16 15 -32 98 -45 138 81 111 148 101 -17 -61 2 -63 -62 -103 -39 -133 -48 36
5512 36 20 4 -26 7 -70 -24 -41 30 -74 -65 -80 -57 5 132 -82 -84 133 -80 -80 -93 2 -44 8 69 -17 27 -87 32
5540 32 -36 -71 107 -11 11 -91 35 -29 26 49 36 114 -92 -77 -11 37 29 -12 104 143 -23 -44 -80 -81 69 -31 -2
5567 -2 -76 61 45 -73 -67 -68 3 -19 75 -11 68 -67 137 42 -8 -84 23 -5 -42 9 1 -5 73 -22 3 3 -4 -1 -99 29 -74
5598 -74 -67 -50 130 18 -34 -63 54 3 37 -25 18 -2 -65 -29 -119 -85 51 -24 76 -13 75 42 21 -1 31 -42 37 136
5626 136 -31 -55 -17 83 -24 -137 -62 33 54 9 2 25 -25 86 1 106 -18 -137 212 46 -64 -95 -108 -83 14
5651 14 90 -2 59 -50 -167 5 65 8 -91 20 55 -79 25 5 -89 -69 2 -73 6 23 -43 25 -28 -7 -84 89 -28
5678 -28 13 -57 -94 -32 -64 12 99 41 -94 13 -37 -29 38 -63 47 128 -97 -15 -37 66 -27 -18 33 37 18 -44 137 -109
5706 -109 199 -14 10 90 3 -28 -81 16 -21 100 61 -46 72 -31 -111 -33 14 19 -26 6 -55 -49 142 -65 -51 -98 19
5733 19 -3 -9 -14 -106 60 -4 -94 15 -41 67 67 -29 -32 -34 -13 -110 57 86 85 -79 89 -78 8 46 -2 121 137 23 122
5762 122 37 -9 -12 -61 32 -13 5 -59 27 -50 80 18 -97 -38 -86 -125 -70 -79 37 -29 -32 45 -36 -115 36 95 18 -57 50
5791 50 24 21 13 -47 -113 -22 -117 63 -35 28 20 -38 84 -20 -69 4 107 -74 49 41 64 141 66 95 -6 5 101 -13
5819 -13 -18 9 42 -59 1 87 50 56 -12 38 -37 27 91 61 94 -84 43 -34 -22 19 80 -135 120 -56 -74 114 -13
5846 -13 44 -75 -20 -21 19 25 -87 16 33 -47 -11 66 -38 46 46 -81 -102 9 75 -41 -74 38 3 74 19 -137 -42
5873 -42 170 -127 120 77 59 36 -23 -5 -33 49 19 -13 -145 -52 71 -26 42 1 -13 -48 35 -22 -55 -8 137 43 42 93
5901 93 62 69 77 -141 -28 76 -28 47 -109 -65 57 70 -51 81 91 -5 17 64 -71 107 -115 -12 -8 126 25
5926 25 46 3 -14 -73 1 7 -32 -187 -4 40 15 -17 34 -29 -23 -11 -116 50 -59 69 33 42 12 40 -43 54 -63 -54 -2
5955 -2 44 -29 51 50 67 76 -29 -13 -44 -81 -77 -28 -46 17 -16 -21 -21 -97 -38 -104 -67 46 -88 -91 -99 16 -55 0 -46 47 75 -99
5987 -99 -23 -37 87 -37 -20 39 51 75 32 -63 89 52 -52 5 25 30 24 96 83 18 -78 -22 21 -35 26 -17 -47 61 46
6016 46 -57 3 -3 -26 -46 -152 52 81 -6 23 -58 9 89 -107 40 -32 -25 -92 -3 -64 -113 61 5 3 15 45 5 -45 58
6045 58 -55 51 -25 -7 38 7 -116 -51 156 21 38 30 -83 94 -42 -19 -17 -24 10 34 -44 4 29 -60 -72 -20 -69 -2
6073 -2 -195 72 49 45 50 31 31 6 0 -78 114 57 -66 16 -12 47 -59 6 3 -1 -86 -36 51 -36 -50 -11 7 98 -59 -89 -11
6104 -11 145 -19 55 61 -117 -12 53 -7 -83 168 56 -51 25 -17 -41 -54 -18 34 -103 18 51 -21 31 -58 14 -113
6130 -113 -22 -149 -23 -98 -62 -2 5 78 40 109 26 31 -16 91 3 117 41 -40 122 -47 22 -24 63 19 22 -68 -31 37
6158 37 111 -154 -48 20 -9 37 -5 -14 13 -17 -109 38 48 -26 0 -47 84 -35 23 -32 -114 -10 -8 53 -111 -49 49 -24
6186 -24 -161 -1 72 4 53 0 -57 34 20 -41 9 -92 0 23 70 28 13 -78 -19 -37 12 -41 -25 92 -81 70 -14
6213 -14 -3 7 -117 13 122 -115 4 29 -7 -1 -163 68 -90 -31 62 -19 19 -17 -153 74 21 82 103 73 -75
6238 -75 -76 -72 -10 -18 -6 -61 20 49 14 2 -188 -78 -62 27 -9 -3 72 -55 -74 15 111 -93 -14 135 -9 47 21 -12 24
6267 24 -33 55 -110 -2 23 -3 -41 -5 150 67 -39 23 9 129 35 -131 21 -65 -70 17 49 -36 -78 31 22 88 47
6294 47 -56 48 -14 -16 -107 -23 14 -100 -17 40 -31 -48 -3 -6 -16 -30 -3 -206 25 -43 -45 -28 -7 -56 37 -44 -28 72 24
6323 24 42 -14 -21 51 64 27 19 83 5 -41 -1 -75 12 112 43 -22 -38 37 -18 -6 63 -89 74 -6 58 -140 -89 21 91
6352 91 42 -99 -83 -63 26 -83 41 42 -35 -29 64 -19 80 -40 -46 -34 -26 -30 104 19 -30 55 -2 91 -64 -7 -45 9 -16 110
6382 110 -23 -60 62 92 -48 12 -14 -53 85 -6 -8 155 -99 32 -50 -7 40 40 -40 -62 -8 6 -3 2 77 -111 15
6409 15 -17 23 -12 -24 -71 21 -19 -76 134 -85 -6 109 15 116 -60 -126 -39 6 15 27 93 -75 -121 -29 107 33 65
6436 65 -102 12 23 76 -83 32 20 38 55 -70 -111 -103 34 54 -33 23 -28 30 -55 -39 50 -23 34 36 75 58 -13 37
6464 37 -21 -22 61 15 -36 -55 74 14 -59 -59 -123 80 -40 -51 109 35 128 -6 -45 -4 -17 -44 16 27 -49 64 -5 18
6492 18 -24 109 35 -60 -8 -94 79 -43 58 18 -72 51 1 87 -44 25 20 -18 -39 185 3 12 21 -78 26 37 -64
6519 -64 -48 40 36 169 26 -56 41 152 -53 -15 8 40 8 14 1 -7 -28 1 108 -35 54 41 -122 16 48 29 16 -93
6547 -93 -25 102 115 -68 -71 70 36 -37 -6 58 -66 17 65 30 -1 38 -93 -58 -63 -19 99 81 115 -76 -32 66 43 124
6575 124 61 -30 28 9 -120 46 -96 -22 60 -108 94 -33 -40 -29 -42 4 32 67 -82 -16 33 2 -75 1 45 -90
6601 -90 58 -45 -43 -17 -9 160 -122 48 -17 79 119 52 -107 33 -82 -43 33 21 107 43 86 -70 52 101 77 14
6627 14 -44 60 28 -66 2 116 -27 -125 166 79 -12 -48 23 42 117 -48 90 57 99 -74 42 144 8 -5 -65
6652 -65 48 -88 -14 -119 46 50 -33 -86 -8 175 20 -59 88 46 -14 -2 -81 -33 24 -52 -31 55 -8 -29 58 92 -7
6679 -7 23 -14 9 -47 78 -51 14 112 -100 -3 52 -129 -53 33 10 -92 122 48 64 74 59 -97 41 12 -51 -31 149
6706 149 -84 55 29 53 38 3 -5 -71 -111 6 40 -73 -132 -99 -19 -41 131 29 4 8 -18 -1 -15 17 49 8 51 -1
6734 -1 -87 55 10 -10 -22 25 47 0 -39 -118 -23 -134 40 -15 -167 25 -150 -3 112 -101 35 45 14 72 -18 -105
6760 -105 -58 3 -7 1 12 71 -97 -191 -74 84 -36 -10 -76 -7 100 68 54 71 38 -51 -58 6 55 30 -79 -36 -89 4
6788 4 -32 39 -52 -33 -107 -64 5 -52 62 -160 101 -60 64 62 -18 83 41 50 -2 -25 -45 35 -37 -47 63 9 24 -83
6816 -83 -10 -24 -108 -3 36 -81 60 20 78 -94 -25 7 -40 45 52 63 -4 22 45 79 -134 -99 -72 45 -3 -60 42
6843 42 -12 42 -52 74 -112 21 -10 -102 -84 71 155 -34 132 102 14 10 -58 -38 55 -88 71 -99 106 -92 -74
6868 -74 149 1 66 7 29 21 -3 35 -2 -48 3 64 64 10 27 -25 0 50 50 -105 3 0 -61 26 14 131 70 -85 -52
6897 -52 56 -149 10 76 -18 -51 -16 61 6 -30 -109 -52 -35 3 28 69 49 28 23 21 20 -105 -53 -132 19 61 -86 76
6925 76 41 -36 -12 -13 63 132 26 -53 41 -23 -111 20 21 3 -16 10 -94 63 -20 121 -24 -12 -4 98 -15 25 22 -42
6953 -42 -74 85 -28 132 46 66 87 3 66 -135 -47 23 3 -23 -54 -50 -41 -18 -1 -105 81 41 -117 -57 -20 -62 -47 -40
6981 -40 -43 -13 -52 -28 42 18 -39 12 -46 -78 37 -6 -51 -35 7 -92 -93 1 -65 42 21 59 54 129 44 -2 -76 164 161 60
7011 60 5 -70 2 -61 62 41 -31 -64 22 0 -64 1 -125 -19 -12 11 -49 -104 2 120 -27 -55 31 2 30 19 -48 -55
7039 -55 64 -45 -74 18 3 -124 41 50 22 -11 -38 73 -39 117 -37 -44 150 -20 -101 77 -44 -72 -114 -13 98
7064 98 76 117 77 59 35 28 52 -61 2 54 145 -137 104 60 -85 -33 -92 108 -22 -114 49 24 -80 26 -48 121
7090 121 -1 26 50 15 87 38 -9 91 -10 85 -130 -26 104 76 -64 47 96 -36 -101 -19 2 21 52 -134 4
7115 4 -72 -37 -27 70 -32 -50 -23 -32 18 -12 -31 38 60 -63 -1 -40 11 -6 49 7 -242 -84 -53 48 -18 6 45 34 66
7144 66 -37 71 11 -51 -23 -25 -32 -25 28 -56 111 -24 -37 21 -37 163 66 -22 -70 -2 89 48 -63 146 98 47 23 46
7172 46 -139 -4 -30 91 -65 -114 -123 22 -112 -120 29 -55 -20 83 -16 -6 35 -43 -53 -63 46 -49 -6 -13 2 -22 85
7199 85 32 -37 86 43 48 -40 -46 -26 22 116 173 -73 0 -78 116 -36 -88 30 -76 -19 97 -19 -1 -91 105 -68
7225 -68 11 -26 -16 -17 76 24 33 37 -40 -30 22 -60 -5 14 -35 -6 -24 -51 -104 1 71 -44 38 -43 -11 -70 -17 51 -118 -100
7255 -100 -8 44 104 49 -120 -47 91 153 -46 59 -45 94 25 -71 20 -44 -81 64 -62 15 42 -14 34 12 -31 -138
7281 -138 -106 27 -11 18 39 -31 -50 -14 -37 -27 55 82 3 107 6 -23 -13 -40 25 -25 77 -55 -43 5 -19 128 40
7308 40 9 -60 36 -21 10 7 87 28 -30 -20 144 -63 9 35 29 61 -55 -54 -54 20 86 60 134 -134 -52 -128 4 -40 22 -4
7338 -4 8 85 48 -119 -24 -33 -46 -86 91 100 -63 -6 -11 -39 72 -34 -68 -6 20 -75 -47 87 -66 42 32 -40 -12 -35
7366 -35 61 53 24 -45 -34 80 105 -54 -42 4 0 -14 64 63 -132 13 25 130 -131 -4 28 23 -15 -23 18 0 37 -16 30
7395 30 14 29 -88 54 -11 46 -65 -10 -29 14 -49 -17 126 -12 46 -44 -21 -157 18 2 -138 -83 36 -125 -44
7420 -44 -25 96 -51 -8 29 -109 -67 -46 -77 -39 -46 94 25 -114 -94 56 -49 -67 -19 125 -62 21 34 13 -49 -56 -10
7447 -10 8 -54 -17 -14 87 18 -17 14 70 -93 -9 -34 -11 7 -140 51 -28 -17 52 23 21 -16 23 31 58 41 74 -13 19 -35
7477 -35 -8 121 49 43 31 -43 -91 -1 -38 -24 -40 44 -19 52 -81 -10 66 -90 -121 4 -27 99 75 23 -56 72 -130
7504 -130 42 52 -26 44 51 29 9 1 -37 121 70 -38 -100 -67 74 -124 17 29 2 110 -18 39 138 -3 29 -41
7530 -41 26 61 -47 -40 18 -19 -67 57 -103 52 -115 -114 14 41 -32 22 2 88 94 83 12 129 -41 13 -63 79 28
7557 28 -50 36 20 58 -25 36 -115 76 1 12 17 64 76 -64 -105 22 36 79 53 -14 146 80 -141 -108 -36 11 70 -29
7585 -29 30 -35 65 35 147 -71 20 23 -85 -83 -50 41 27 55 -34 -68 -45 9 76 -60 110 -1 -3 4 -1 -60 15 54 9
7614 9 35 -51 -38 151 145 -27 67 41 48 46 52 -25 18 57 16 44 12 -48 -68 94 38 1 -32 25 63 18 -54 -13 -17 -85 -34 21
7646 21 8 -13 21 41 21 -50 5 -95 -43 -63 -35 -73 -88 9 -53 -2 32 41 -43 132 21 26 83 34 -18 -61 67 5 -27
7675 -27 31 22 -10 54 40 -39 -88 -45 44 -27 -1 23 -76 -44 -35 -21 25 57 -95 73 -13 -53 23 120 -118 39 -31 84 92
7704 92 62 11 -26 14 16 -7 -19 -19 13 37 -8 -98 17 149 -40 -20 27 97 153 20 -2 -21 -38 50 11 38 11 23 51
7733 51 -69 38 8 -48 -143 -69 -85 3 13 -73 21 49 -2 33 11 -36 47 4 30 19 78 -58 29 19 7 -97 -37 -80
7761 -80 -41 -1 4 -74 13 15 -88 2 32 16 -58 30 137 -15 -19 -30 -60 -92 -61 84 -64 62 25 -3 63 25 -51 54
7789 54 -107 -62 88 -51 62 51 -38 -69 -33 -41 -57 -71 76 -54 77 58 42 25 46 22 -14 -132 -59 -26 -10 -47 21
7816 21 -1 10 -8 -63 -45 -83 -53 -13 203 34 -83 21 83 -34 -17 112 149 -29 44 68 3 26 71 60 -107 104
7842 104 0 140 62 72 116 31 -42 34 47 38 81 -115 53 -122 69 65 -10 -34 93 -56 110 159 -44 91 6
7867 6 4 -59 -49 -14 -42 -8 30 -13 -88 60 -130 152 30 4 54 7 -67 -58 19 -124 157 -28 -75 -46 -55 -19 76 -100
7895 -100 -36 97 105 27 72 22 -18 27 45 70 52 35 66 133 -24 -26 62 -13 -68 50 -65 -153 34 -61 13 0 2 59 -46
7924 -46 -65 -32 142 -22 54 -90 -111 -24 103 -38 56 82 9 24 31 -25 -4 52 -81 94 16 54 -61 -104 84 7
7950 7 -8 103 -47 -81 -95 -48 90 76 105 -40 67 19 -13 87 19 97 -51 -31 -15 61 2 -155 -67 12 6 -25 93
7977 93 -31 -25 4 -13 -49 -36 95 14 12 -72 31 62 -70 49 35 -96 33 -81 -122 -23 5 -6 35 9 53 4 -101
8004 -101 -57 30 15 58 4 0 21 16 9 7 81 23 -18 -73 149 -61 33 105 51 23 -101 -76 24 -59 -90 -108 5 63 4
8033 4 95 90 -29 -2 -47 -10 -98 -30 -26 213 58 -1 17 86 -135 56 45 -29 153 -14 -33 -13 58 -90 -20 -51 -55 -74
8061 -74 -16 -20 -120 -66 -17 57 142 -9 5 -92 -83 40 115 -61 -24 -16 52 37 -145 -31 -92 -99 -108 -15 -39 73 -1 -1 -23 -149
8091 -149 99 -90 -36 25 -172 -37 -28 37 -41 -61 -14 1 102 -40 72 -52 -113 143 -48 -45 -11 28 17 30 102 -122
8117 -122 1 -8 54 45 14 -23 83 3 -41 117 -28 -62 -45 -120 64 84 9 -4 49 84 22 16 -116 6 88 -44 71
8144 71 -18 3 37 7 -5 -31 -6 -2 -1 32 -21 -29 187 -38 -46 102 49 -59 -18 43 39 66 45 -78 55 54 -63 -9 -65 109
8174 109 17 -25 10 20 -16 119 -104 -67 -59 12 58 75 -54 131 38 -73 -42
8191d2
$$ Imaginary data points
##PAGE= N=2
##DATA TABLE= (X++(I..I)), XYDATA
0 0 0 0 0 0 0 0 0 0 0 0 0 0 0 0 0 0 2 -3 7 -8 8 -8 8 -8 10 -14 16 -16 18 -22 23 -26 30 -33 35 -40 44 -48 56 -60
40 -60 66 -74 82 -91 100 -113 124 -138 157 -178 201 -232 272 -322 392 -493 654 -935 1538 -3339
60 -3339 19498 99173 57559 -36665 -69516 -19270 49790 59612 2278 -42145 -27857 16912 43395
73 43395 24163 -17841 -26803 5 23486 23396 -1429 -23666 -5239 24446 12707 -14580 -13837
86 -13837 3155 13405 6646 -12723 -16927 57 9814 4093 -7637 -16442 -8254 7090 4066 -7217
100 -7217 -10532 -11268 -3975 7161 -797 -13974 -6877 2712 -1313 -6126 -6934 -3289 2835 -81 -5513
115 -5513 -2794 -1545 -1515 3694 1244 -5581 -1669 2999 3140 5796 477 -8595 920 13958 7324 -3996
131 -3996 -4001 3435 10529 6739 -2426 231 5871 3514 4150 5126 926 1080 2896 823 4815 7089 -2693
148 -2693 -4792 4950 5839 -461 -2783 -1574 2557 3234 -3495 -4338 1858 1176 -2675 -2992 -4218 -1326
164 -1326 3279 -2155 -6669 -2288 -1602 -3056 526 -1127 -5871 -3817 -821 -227 -227 -4528 -6215 184
180 184 2480 -1229 -2457 -4238 -3148 3942 3655 -4216 -4165 65 1940 4322 1270 -5008 -1895 4710
196 4710 3999 1472 -857 -1424 3094 4218 271 1522 3887 992 847 2615 1290 2978 4634 92
212 92 -910 2354 1810 2370 4100 166 -3174 -508 2325 4824 2832 -5008 -5460 2444 4263 561
228 561 -2497 -5010 -1969 3526 204 -4191 -1669 -724 -2015 -1100 -1683 -1972 255 -1179 -3476 -1322
244 -1322 -752 -878 990 -638 -3484 -1272 376 247 1947 -453 -4310 -740 3189 1780 -127 -2024
260 -2024 -2346 1976 3608 -461 -1485 127 526 1800 710 -1943 823 3008 -366 -1332 393 520
276 520 1747 1751 -1729 -1582 1677 1513 934 567 -1725 -1058 2202 2001 1098 -33 -2347 -331 3963 1807
294 1807 -1516 -1211 -519 1498 2992 -278 -2575 421 1523 243 52 -869 -558 1239 -235 -1831
310 -1831 112 360 -692 95 -838 -1925 426 593 -1203 -759 -906 -1757 564 1221 -1235 -1968 -1258 -352
328 -352 1893 615 -2864 -1775 1131 1093 709 -1067 -2537 537 2756 183 -1064 -111 -131 1140 1560
345 1560 -693 -564 1015 668 724 1045 -460 -154 1683 741 135 457 -476 601 2269 139 -1742 14
363 14 968 1339 1038 -1500 -1453 1259 1507 -303 -874 -1234 -145 1909 110 -1971 -801 45 -121 560
381 560 -566 -1621 -291 280 -608 -270 -731 -1375 248 598 -1074 -1017 -394 -403 951 41 -2077 -634 1295
400 1295 658 -185 -754 -1318 912 2071 -172 -1022 -206 574 1539 1106 -850 -616 1197 850 754 669 -691
419 -691 -76 1451 913 -31 237 -294 528 1642 80 -1078 50 495 520 358 -1136 -904 1260 901
437 901 -939 -918 -775 -14 1061 -317 -1848 -638 153 -57 73 -929 -1497 -13 495 -261 -213 -855 -1176
456 -1176 401 579 -713 -675 -143 -143 708 171 -1157 -257 1047 451 97 -389 -427 960 1333 -436 -623
475 -623 506 620 955 560 -731 -115 1128 725 466 212 -465 126 1221 418 -234 -164 -135 671 1071 -397
495 -397 -917 232 513 280 61 -934 -553 979 512 -837 -688 -286 169 617 -439 -1224 -281 283 -26
514 -26 -151 -947 -771 445 472 -444 -601 -484 -382 619 401 -959 -581 253 150 357 -291 -942 68 1018
534 1018 120 -294 -482 -230 850 803 -671 -513 374 532 548 169 -742 39 1011 253 -240 -96 -139 374
554 374 839 -155 -649 19 199 462 348 -540 -522 480 429 81 -158 -689 -181 913 -24 -911 -57 158
574 158 215 328 -518 -700 332 474 -46 28 -245 -331 527 309 -337 -93 -70 50 666 233 -599 -117 305
595 305 189 84 -26 -356 165 593 101 -151 -179 -256 424 217 -496 -160 214 -175 132 91 -583 -150 468
616 468 -77 -344 -57 -184 14 188 -307 -246 33 -226 27 190 -433 -290 181 76 9 94 -416 -164 473
637 473 143 -304 -82 276 154 226 -160 -230 242 100 -29 350 2 -78 495 197 -168 189 51 -153 380
658 380 336 -290 -21 285 313 153 -154 -352 294 328 -208 -161 -119 -151 246 179 -401 -375 178 -239 -30 -48 -313
681 -313 -322 87 65 -278 -275 -52 174 9 -491 -384 166 -109 11 42 -480 -121 552 -22 -369 -197 4 149
703 149 547 26 -399 -34 340 389 192 -464 -187 487 381 -135 -40 -124 -9 570 111 -365 -146 295 137
724 137 -52 -204 -216 66 261 -23 -2 -292 -150 524 190 -486 -282 100 61 194 -140 -590 -78 373 115
745 115 -216 -199 -129 145 149 -110 -271 -23 -77 266 65 -398 -42 283 -42 -131 -78 -184 13 417 69 -219 -86
768 -86 154 259 53 -222 -129 110 98 -30 105 -231 -119 302 205 -286 -37 26 63 227 -16 -178 67 139 65
791 65 -10 -161 -52 231 29 -127 158 151 -138 222 93 -128 22 238 65 -88 -110 -130 92 167 12 -143 -59
814 -59 -29 171 182 -217 -53 201 -58 -147 21 -142 -53 166 -27 -48 -16 -71 -78 108 18 -66 102 22 111 -80 -99
839 -99 113 211 -33 -156 -19 -79 62 202 -42 -266 68 64 109 5 -28 -194 74 169 -55 75 -205 -14 121
862 121 76 -198 41 41 -20 30 -25 -116 -101 169 31 -226 -21 7 96 257 -18 -38 70 70 218 118 -177 -127 172
887 172 -29 -19 -116 -361 60 229 41 -144 -52 -58 122 118 -161 -321 19 49 71 8 -174 32 121 -62 -98 34
911 34 90 17 153 -32 -111 63 79 118 110 -210 -62 267 147 24 9 -133 -18 297 133 -288 45 139 36 105
935 105 41 -226 -17 185 39 -49 -113 -109 71 32 -139 6 7 113 140 125 -239 -70 92 11 41 -45 -22 87 81 -12
961 -12 45 -91 14 -13 40 -254 -134 145 -132 -126 -13 -92 -18 113 41 -108 62 -53 -43 99 -120 -117 -18 131 51
986 51 54 -85 -1 61 16 28 -94 54 104 199 49 34 40 52 94 206 -31 13 120 175 -135 47 -193 -90 69 157
1012 157 -9 -32 4 5 0 -5 -218 -41 -25 -132 -20 -14 -66 -52 -101 -123 54 -2 16 10 -54 -113 7 103 48 -84 -37 -115
1040 -115 -56 63 -84 -91 86 111 113 50 -63 63 63 -8 -8 -3 16 98 175 21 -123 4 87 -19 29 -6 22 124 180
1067 180 -41 36 -25 -47 191 -28 -14 27 83 -63 48 33 -201 28 83 -35 -79 -98 -30 103 100 46 -100 -141 148
1092 148 99 -45 -138 -20 44 -10 -2 40 -187 43 215 -49 -130 -119 -130 60 113 -75 -31 19 80 106 58 -38 -139 84
1118 84 -65 51 -69 53 67 139 -76 -95 52 10 123 115 -24 -10 97 38 42 -28 -17 40 37 66 -143 -119 1 -7 99
1145 99 -23 -112 1 32 -25 -4 -4 54 111 -12 -26 -50 59 79 -27 76 -100 65 -90 188 28 22 -84 170 198
1170 198 36 49 -18 -31 13 54 -60 -45 15 63 34 21 -40 -63 109 -37 -88 16 -78 -16 128 -121 -80 -118 -18 -83
1196 -83 77 -65 -45 112 19 -22 -111 7 71 38 25 -64 -3 113 -90 -32 -104 -45 -63 49 -69 34 48 49 28 -8
1222 -8 -32 -22 60 102 39 -68 -50 -78 2 -30 81 -15 -83 -31 63 -81 -144 -20 -29 -31 38 -24 -21 127 -31 162 45 -90
1250 -90 101 71 -40 -94 61 -90 -37 50 -56 -34 69 -13 -102 6 -15 -88 135 24 -104 -36 -2 55 -75 -124 -165
1275 -165 28 136 91 -44 -37 -117 -48 35 -119 -13 -199 -61 69 71 12 85 17 -25 18 -22 -211 -104 25 -64 72
1300 72 145 27 11 84 10 23 -35 -5 -49 -51 -67 -29 165 65 42 -76 53 90 -70 -130 -108 -53 24 5 49 17 -70 118
1328 118 -32 -37 -40 16 -105 -79 -27 -124 -133 89 -72 21 37 -62 22 42 61 26 -164 3 19 32 -93 -51 21 26 79 -167
1356 -167 9 -7 98 11 87 21 -26 89 96 -87 -89 -144 -102 73 23 -102 -138 -8 37 110 43 48 57 146 57 -30 -71 45
1384 45 21 95 -44 0 -17 -45 119 -113 -156 -79 168 4 61 -5 -44 -76 90 -81 -24 -19 -45 80 87 -125 75 104
1410 104 -36 -93 50 51 12 19 211 19 -29 16 -25 25 -9 -44 5 59 -2 15 -60 -89 9 90 1 -24 -44 -176 35 -6
1438 -6 -88 -100 -111 113 -130 -99 -66 -38 -91 -18 5 13 -78 -34 121 -115 -54 1 -44 90 -22 -66 -63 166 18 48 66 57
1466 57 17 -31 -49 52 -105 6 39 58 -39 51 -50 -8 93 57 20 -9 -73 -24 7 -17 164 -62 -65 6 47 -63 185
1493 185 -40 47 -21 -1 45 14 -55 -12 78 -6 89 -137 -4 -24 -25 10 18 -33 -52 51 104 -74 -50 33 -78 112 7
1520 7 -35 -17 2 66 -8 79 26 -15 -80 117 -29 18 -5 -70 -28 -12 73 -13 4 -85 29 31 88 101 -91 -29 12 32 96
1549 96 -61 2 -59 -15 44 77 86 24 -53 -116 70 107 26 -103 56 119 82 -37 8 108 -53 -29 1 -14 -2 16 130
1576 130 66 -119 57 -18 46 -42 -15 -72 -64 -80 17 37 39 -28 -7 -145 -7 -8 9 43 146 4 -86 113 65 -11 -13 10
1604 10 16 -13 -24 -63 82 -8 76 -29 -223 -71 145 -40 -35 53 -11 101 16 126 48 26 91 128 94 -12 -14 79 32
1631 32 77 75 41 24 -45 82 122 79 -16 48 -9 -109 23 -9 40 -35 95 19 -33 26 217 7 104 -9 -57 53 22
1658 22 111 -102 -9 -83 -49 27 -12 -9 -144 -49 -141 -73 -39 -34 44 -91 100 55 27 78 -59 16 -81 14 -103 -37 -83 59
1686 59 62 4 88 -29 -66 7 64 72 -50 35 28 77 -136 -22 39 76 -58 -10 -47 -128 19 -106 9 -39 8 13 20 -26 50
1715 50 -60 -11 -51 -25 7 15 23 -54 0 -71 195 2 27 11 60 -77 56 29 -57 76 26 82 -43 -46 2 -47 -44 101
1743 101 137 -88 -31 -33 92 23 65 38 65 -19 -20 39 -7 -9 4 50 -13 9 9 -51 -48 90 -40 111 -26 -27 -110 -23 34 130
1773 130 38 -20 -14 30 -30 -43 -51 5 -19 -41 37 -65 -1 13 16 118 81 7 6 -49 -84 -8 51 -36 110 12 58 -23 55 64 -49
1804 -49 51 15 13 -21 -42 10 36 -69 18 65 78 103 -29 22 22 -32 22 -91 90 -49 -72 -61 -23 78 -35 -19 148
1831 148 -178 52 29 5 -62 128 -92 80 100 -11 1 36 124 88 24 -106 63 -112 -28 3 -37 103 49 -13 -16
1856 -16 -4 -39 63 -31 -42 -77 121 62 -68 11 131 -27 -76 8 -40 3 13 50 -39 64 87 -175 -65 113 -79
1881 -79 17 91 -167 6 -84 106 20 -71 -97 110 20 -40 70 56 -15 116 -75 29 32 22 -42 -51 -39 59 59 -61 79
1908 79 88 35 -29 35 -80 -132 19 58 35 49 105 -20 46 -63 -51 94 -48 11 103 -46 4 22 8 -28 31 68 125
1935 125 -70 84 72 -63 -16 37 -2 -47 65 -159 -9 39 -34 -2 6 -13 -166 112 -68 -42 54 105 46 18 26 -68
1961 -68 17 58 -108 -13 -66 -89 -35 -33 -31 -74 30 78 -51 53 39 -17 21 67 44 90 -1 100 -27 62 28 -12 -5 -145
1989 -145 22 -2 8 43 99 -11 47 5 65 -11 4 -4 -73 -11 -37 -35 -14 -50 36 -18 -47 -138 -55 64 -70 -48 43 4 -61
2018 -61 -43 24 143 -16 -16 -52 5 48 44 21 -24 -92 24 -19 42 -36 57 -3 42 -99 23 -20 50 42 33 58 -181 -13 107
2047 107 48 48 76 -87 37 -28 -23 16 46 -74 35 96 -35 104 19 -16 -151 -20 -11 11 149 -48 30 25 43 -65
2073 -65 -51 -108 -27 -30 -24 16 82 71 -19 65 -32 -63 -49 144 65 24 37 101 -37 11 -42 13 -109 38 31 -26 -5 -99 54
2102 54 -24 25 -27 9 76 47 -96 -57 48 150 36 34 -112 83 34 63 -58 68 85 107 -8 74 -22 -123 31
2127 31 90 121 -30 33 70 -25 74 97 -44 -43 74 -10 63 -18 7 -35 -110 -104 10 34 2 39 50 52 28 18 -60 157 1
2156 1 -46 -15 18 3 38 81 -25 37 0 59 -27 10 54 -53 -111 63 38 100 -31 -135 -66 72 -7 -69 105 -24 38
2183 38 74 55 34 46 4 34 50 22 158 -16 -18 -40 40 37 86 18 -16 17 5 94 5 -24 1 -29 -45 25 -1 20 26 5 71
2214 71 -66 2 -36 90 -30 -27 -35 26 -20 125 19 45 18 5 0 -74 57 33 6 -54 2 -2 2 -52 -15 -91 2 43 -49 26
2244 26 25 65 -84 -97 96 24 -155 -18 26 23 63 -4 95 -10 24 -123 54 142 -95 71 60 121 44 -18 179 123
2270 123 -97 -14 -34 32 -27 -66 0 -21 37 34 -3 -98 -96 -250 -17 59 17 -14 -112 22 -34 37 17 2 97 -24 39 -60
2298 -60 12 65 14 -41 66 -83 -68 -55 45 32 -39 60 76 -35 65 21 -63 115 -36 -138 50 51 64 -65 -3 30
2324 30 -17 45 -4 -18 23 208 -30 45 -21 -55 45 -49 39 37 33 36 28 -167 9 -121 20 91 77 109 -19 -15 11 56 105
2353 105 -12 -33 6 17 89 -14 16 117 37 49 55 107 -57 -45 7 -136 99 -14 67 80 29 38 -41 -22 24 -11 42
2380 42 70 85 124 79 56 -22 -47 39 6 -95 -8 -15 85 -50 59 11 13 73 17 27 -46 -28 -7 -22 124 3 49 -75
2408 -75 -32 -72 43 9 -63 -57 -100 -10 -13 -24 -7 32 62 -28 -6 127 62 17 11 -51 -21 23 13 13 -59 -42 -64 56 38 -27 -93
2439 -93 39 -50 -46 28 23 -42 -39 -10 59 36 7 23 -50 34 138 24 106 22 59 90 21 43 105 148 18 6 57 115 -3
2468 -3 55 -21 94 123 -43 -19 -11 -43 43 -23 -101 -33 -30 90 -51 13 -16 67 40 81 95 15 5 34 -32 99 -16 -55 -37
2497 -37 -21 -14 85 36 -12 -51 -28 -26 25 -5 16 52 7 -88 -52 29 -8 -34 56 -13 63 65 28 -2 33 126 107 52 -141 -45 141
2528 141 193 69 -53 17 -6 -39 -76 107 -42 -14 -26 -18 -81 157 150 -8 109 23 65 -60 7 17 29 44 -103 19
2554 19 25 -56 -23 -23 122 66 17 -16 32 -24 101 20 -62 -15 -97 -49 -37 -69 -8 27 -35 11 -100 42 2 -5 104 -23 3
2583 3 78 -9 -21 0 -74 54 96 15 -143 -81 45 -101 191 6 -60 -12 36 38 -74 80 18 -4 -68 60 -17 -28 -47
2610 -47 19 83 -104 34 -170 -19 -18 -86 -46 3 25 0 -50 4 -43 64 58 25 -45 -158 -27 -55 39 -23 6 67 14 -68
2638 -68 -107 -48 -55 -35 -49 0 -46 114 83 -28 -138 -25 73 -74 -125 16 -89 -21 84 -8 116 -42 -86 -45 63
2663 63 27 -51 248 -8 -70 150 45 124 -19 150 47 24 73 -11 -22 -74 19 23 -8 73 25 -33 63 60 -64 -9 119
2690 119 -36 36 34 18 85 57 -107 -51 98 -34 11 134 45 -45 -77 -34 53 -131 -28 -4 -16 88 -15 -36 76
2715 76 93 88 -96 90 18 21 36 -129 -16 -64 -31 -26 13 -67 -49 11 -136 65 -23 -121 -16 131 -59 48 -56 -23
2741 -23 -27 -68 -2 -3 -7 -8 82 -13 -6 7 77 -2 -74 136 19 57 23 -14 52 -24 -80 -33 -80 27 -4 60 -77 65 60 -7 -49
2772 -49 29 -5 -98 62 22 50 21 -58 -103 -7 -80 -107 31 -3 95 -13 -39 -52 -32 12 -40 13 48 -62 -123 -95 17 -26
2800 -26 117 -5 7 11 161 138 18 -57 -55 44 -17 -164 52 -31 -15 20 -43 -48 6 -34 -76 65 129 68 4 -16 -50 16
2828 16 118 -23 66 -15 -79 -48 18 39 87 -84 109 38 -14 -1 69 145 -100 -3 -82 15 -64 -21 48 -70 -49 -30 -104
2855 -104 20 -81 35 13 50 94 -106 -33 42 14 -3 -41 182 45 1 -42 24 6 -95 154 -7 29 50 31 67
2880 67 -36 60 -18 28 24 -12 26 27 111 -22 -3 52 20 78 -6 -20 -38 -33 85 -67 -10 159 -113 18 18 59 -11 -99 -62
2909 -62 -67 77 -45 -4 -26 53 93 105 -73 37 -16 113 7 51 40 -86 115 42 -26 91 75 -72 31 8 86
2934 86 99 40 -63 -63 -112 -5 141 -93 119 22 7 -16 -29 -17 36 -64 8 -83 -9 -88 11 22 -88 -124 51 -30 -4
2961 -4 54 -39 107 -45 182 -45 150 -89 -59 -223 126 -7 20 -107 29 58 -88 -45 -35 -25 -65 51 -100 6
2985 6 -67 -23 24 -48 -73 83 -7 -8 -44 40 101 22 1 56 43 -26 -19 -145 122 44 -60 0 -50 18 -134 28 -2 -14 62
3014 62 105 13 -68 -33 -60 -72 22 29 33 -35 56 3 -47 100 -43 -13 62 -8 68 124 88 -63 -67 -11 -50 -2 31 -28 39 -90
3044 -90 22 197 2 -66 21 9 42 -103 21 70 -15 2 -30 -37 -84 -23 134 -2 -66 128 5 -58 171 53 -79
3069 -79 -2 22 -9 29 17 32 -63 49 180 -42 13 -87 52 -18 -29 3 -15 -32 -111 33 89 -51 14 30 -42 107
3095 107 25 46 137 -1 -116 -58 42 39 39 28 34 -60 -72 86 -1 -15 19 -41 98 -6 -63 -29 50 111 96 15 114 61
3123 61 -25 -127 26 -21 3 16 41 16 -3 78 32 18 48 32 -132 45 -9 -9 150 -100 108 -81 -20 97 74 -7
3149 -7 10 -20 -17 54 -68 32 -67 23 -14 46 19 53 -92 110 -19 -76 17 -22 37 -34 -11 40 44 -45 8 170 -51 18
3177 18 -34 -18 89 9 16 -64 -139 -12 24 53 -67 -6 115 94 16 7 -43 47 79 52 76 76 76 17 92 46 -38 4 -4 27 64
3208 64 25 -31 0 -95 -22 151 127 -85 88 12 -52 98 -88 -25 16 127 87 41 57 35 17 13 113 63 -36 49 -79
3235 -79 -33 85 61 -86 69 73 -117 54 -99 -126 84 -12 -11 29 9 -13 4 -54 15 80 7 63 55 -72 28 68 62 33
3263 33 -16 36 -18 11 -48 87 -81 -17 13 -17 32 12 -6 17 -53 -22 92 -143 194 55 1 -65 -15 -6 13 77 -15 -51
3291 -51 31 -100 -41 81 140 2 30 18 -48 -42 34 76 26 -8 3 -82 -28 59 -3 31 23 129 -181 -41 38 52 12 80
3319 80 11 -28 76 15 11 29 -2 -26 -50 -85 61 -31 -63 -22 139 -16 -3 -18 82 12 -47 64 147 55 -47 -36 -45 -39
3347 -39 32 41 -71 73 23 -22 -63 8 68 -29 53 -50 147 -10 -59 27 4 -47 108 29 -20 17 4 -6 -49 -65 93
3374 93 -119 -17 88 2 -99 54 127 -8 62 105 -10 65 -66 56 1 -83 -10 -2 34 53 20 102 21 42 46 -65
3400 -65 -43 0 215 58 -33 -131 -44 56 -112 27 -39 -56 63 46 34 60 37 -27 49 8 33 -13 26 21 -33 38 96 9
3428 9 45 -26 -53 -11 8 3 -47 -98 19 -13 16 -167 47 0 -37 31 46 31 1 -41 26 11 60 -48 5 -1 23 -54 -11 -6
3458 -6 -27 -5 -60 47 -95 53 22 -63 19 -20 39 -36 19 48 -18 54 -4 -140 -76 -1 23 46 -8 141 2 -21 -31 -43
3486 -43 122 37 -26 -34 87 -12 125 180 -55 115 109 63 -74 -76 63 4 39 91 56 -4 -39 19 -57 -30 14 152 -3
3513 -3 46 -35 -72 -73 -126 48 87 22 -63 -47 -21 -70 8 -72 -52 109 41 -61 13 6 -172 -219 62 103 83 12 65 79 85 -53
3543 -53 -45 115 88 -70 79 12 30 -4 -21 84 -17 42 -5 -56 52 -82 79 -50 -79 -29 4 65 -53 48 -44
3568 -44 -5 -59 24 -45 -65 -21 49 -42 -47 -48 -43 80 -31 104 16 -12 68 12 -9 71 108 -83 16 -88 -82 -76 -5 -16 112 -59
3598 -59 -87 62 -69 98 68 10 27 21 32 55 -49 29 12 -26 -47 -44 -29 131 -17 -95 -49 -29 -18 149 -63 -35 -8
3625 -8 -37 27 -70 43 63 -16 -12 37 -24 130 -52 4 -41 87 -106 49 15 -25 -120 87 -54 -30 57 -35 -46 9 -63
3652 -63 -20 -26 -19 36 -80 -83 34 -27 73 -53 -40 -44 115 -2 -52 60 14 162 -27 45 -131 97 201 208 153 41
3678 41 -61 7 106 -34 44 -55 29 82 -134 -54 -24 -21 -41 -54 -96 -33 -105 36 -69 -29 52 -12 14 3 -37 -71 -6 -40
3706 -40 116 -11 28 12 41 -75 56 29 36 26 -6 -11 -21 -28 99 -38 -19 100 -35 -80 20 -56 -34 20 63 49 51 -137
3734 -137 -5 45 -14 -20 -39 -45 -29 -77 -6 -11 -65 48 48 32 -78 -57 -6 -119 12 75 92 33 46 6 49 57 2 -44 11 104
3764 104 10 -49 -80 -42 12 -64 -115 -77 -41 55 -54 -52 -87 -16 6 -76 -3 18 -22 18 80 -9 -132 37 -108 -68 -109 -81
3792 -81 86 23 35 45 53 33 -118 9 146 70 -55 95 -109 78 -77 5 -59 -9 58 96 66 93 81 -5 66 -25
3818 -25 131 -1 28 103 -123 90 -30 39 -80 -98 44 99 -103 -135 55 -121 215 24 24 51 -13 -6 66 89 56
3843 56 9 9 -14 -9 99 88 59 71 -20 113 50 -41 -19 6 -14 -33 71 138 130 74 113 38 -45 -59 47 38 -19 -99 39 58
3873 58 -22 -26 89 112 22 28 5 17 -20 5 15 -25 -3 -24 77 62 -40 -22 67 -7 80 9 15 51 16 68 -37 -29 2 11 53
3904 53 14 -63 42 -60 57 -35 -41 -38 -59 -73 -94 19 83 46 12 82 63 -55 42 -40 -94 20 134 42 68 71 71 32 -8
3933 -8 67 99 -117 -30 -189 -48 -12 -50 -43 -31 45 2 109 -61 -9 67 1 -94 53 -19 33 16 -85 100 44 53 37 -114
3961 -114 -60 -20 9 41 -189 26 -19 29 -28 -31 -7 -108 -107 -57 125 13 -119 69 16 69 -54 -74 59 43 -71 -132
3987 -132 38 -145 149 96 -77 -48 75 70 16 -17 -56 -98 124 125 105 133 -123 -7 59 28 13 59 26 -57 4 -79 53
4014 53 -87 -15 17 -77 86 51 64 40 -30 29 -7 44 -54 -49 116 -69 64 -39 20 -17 -64 -100 -12 58 4 15 -3 -119
4042 -119 -33 42 -64 10 -8 -86 63 -20 -38 -101 83 10 -4 -16 12 -41 49 7 39 -17 -42 3 130 42 18 59 37 -13
4070 -13 -81 23 -79 -13 76 78 -37 26 -40 28 -21 -84 15 24 32 -3 -42 7 33 -2 -83 -35 54 -55 43 -97 -73 30 16
4099 16 -1 -70 -56 7 -12 -58 -13 43 -102 10 -46 31 -60 -66 13 -87 31 34 31 66 -78 37 -71 120 -30 -81 -6
4126 -6 -82 -41 -56 -95 6 -85 -103 21 24 189 6 64 -16 -41 87 20 55 10 -9 -1 88 56 109 -107 52 1 69 -61
4154 -61 91 6 51 47 -42 48 -30 30 -2 58 -5 76 -23 58 36 102 -35 65 47 108 -71 -42 6 -112 -28 4 -5 -7 -21
4183 -21 -4 98 19 -4 -92 40 38 -44 27 12 -30 -19 -17 -56 19 9 -76 -22 18 -114 -117 23 -89 -68 -80 40 64 72 58
4212 58 -68 -64 -15 -33 -73 57 -53 25 20 -109 28 -24 -39 -69 -88 -6 -89 -71 -60 -5 -40 25 74 106 31 -79 5 16
4240 16 37 -112 14 -149 -79 -56 -44 2 116 87 5 -36 49 8 -87 5 -59 -64 -30 11 -89 22 -16 -30 48 -20 -103 39
4268 39 40 66 -28 -159 -23 -87 -7 -6 -57 90 -98 40 -107 -38 37 70 -60 -2 -100 22 52 50 103 -74 38 26 35
4295 35 5 54 -66 -1 1 157 0 -37 6 43 26 -38 104 17 -70 113 44 59 11 47 -109 -18 -13 -38 -74 22 0 -15
4323 -15 -31 65 30 -119 -94 90 32 -61 -19 13 54 9 -82 -46 -61 -20 157 -29 7 -2 70 -41 -5 -15 19 16 30 -26 -30
4352 -30 -57 -19 -32 73 -43 22 20 38 45 2 -75 -17 -80 -17 61 -188 55 -40 -30 -106 -12 -74 -87 55 163 43 -25 -111
4380 -111 41 48 12 -5 -8 57 -47 80 -43 43 155 67 -56 52 -71 -48 -61 -29 81 -20 31 6 -136 -30 97
4405 97 22 -68 11 -34 30 7 -35 15 28 9 -4 69 26 3 127 17 18 25 39 -133 -35 35 40 109 -96 43 -30 -63 -134
4434 -134 -65 -132 139 75 42 -9 -68 -131 -44 -56 19 80 -85 -52 87 2 33 39 3 7 47 52 16 9 -55 58 -112 51 -30
4463 -30 60 -4 27 -88 196 -110 38 -73 -33 7 40 -38 -89 17 -38 -11 -114 -25 -95 -26 -5 -61 4 12 -38 34 -19
4490 -19 35 -37 75 30 -15 -83 -18 -48 60 -39 -17 -31 37 -45 -32 19 -58 41 -43 112 -12 66 46 -63 -63 -29 -37 -47 16
4519 16 9 -45 74 -19 9 -92 -141 -41 37 -88 30 -68 -29 -5 69 -52 -57 30 51 49 83 -42 -108 -13 145 16 58
4546 58 62 -25 70 -24 20 42 69 60 -35 -32 67 61 -1 64 -90 31 -36 -22 1 -26 -126 -14 34 53 20 -98 -117 62 31
4575 31 -48 -15 -12 51 -32 35 7 4 -94 -83 -36 84 -42 46 84 5 75 -17 -25 36 39 10 -18 86 86 -56 -3 -53 31 -104
4605 -104 45 31 -67 39 -51 1 -89 59 122 40 -32 64 -73 12 -3 16 59 10 -36 9 4 -21 -50 -45 7 -131 89 -36
4633 -36 -89 -19 -40 -8 11 -147 -99 -54 1 -1 -36 69 -26 8 -44 18 50 -101 -50 63 16 -136 28 59 19 -37 -26 48
4661 48 -23 53 69 81 -41 63 10 -58 51 19 -13 22 -9 17 30 10 -21 -85 45 49 30 14 80 30 -7 -35 42 3 -47
4690 -47 20 57 15 40 19 113 -53 -24 -17 -57 -41 41 -9 91 100 -43 119 68 -65 41 -87 -43 -57 116 73 50 -75
4717 -75 96 46 -47 65 -102 -13 28 -33 45 95 49 -55 -9 -47 -10 -1 -161 35 23 28 6 16 65 -51 -32 97 23
4744 23 56 115 146 -56 122 30 2 -120 5 -17 -49 97 49 25 58 -29 57 67 -80 56 74 103 -7 40 63 -34
4770 -34 140 -95 22 64 6 -18 -16 148 29 120 4 76 -4 77 -87 68 33 65 -37 -72 -35 45 81 84 28 -42 68
4797 68 -93 -36 -80 6 3 -29 -97 -22 33 -4 -85 52 62 -58 -9 -28 40 9 -48 -7 -59 34 78 -50 18 -12 118 -67
4825 -67 -27 44 48 48 76 -12 45 -60 33 -73 -28 92 -118 11 74 -17 -42 -9 39 40 -40 29 -21 96 -1 -21 154 33
4853 33 98 20 11 -1 -113 123 16 -14 3 71 -82 45 146 97 15 -90 -26 -7 -65 12 -71 -23 0 -137 -68 -37 0
4880 0 -77 -72 18 -68 45 -30 55 -35 9 22 -57 84 13 61 16 66 -63 52 35 -55 169 -23 -53 -10 64 -36 16 22
4908 22 88 114 19 -55 -25 -49 -11 -104 15 -154 63 -29 -62 -170 -4 5 84 79 69 5 16 28 -18 25 -114 -29 33 -10
4936 -10 -33 83 47 -22 -171 -129 79 -19 -29 -97 5 18 0 98 5 113 19 44 27 -126 -5 79 -67 -3 -13 26
4962 26 -8 91 -47 4 -32 54 140 -101 29 -67 -21 25 62 14 149 59 -59 38 -70 -44 0 -31 59 63 63 -144 -89 37
4990 37 35 71 -115 15 24 19 -1 34 -24 31 -88 -90 -14 -56 -108 60 -3 -69 107 30 -62 79 -13 26 -32 5 18 25 67 -34
5020 -34 -5 -27 -2 11 -1 -57 -15 -141 1 -45 -43 12 82 40 34 66 115 25 -6 94 22 58 17 23 41 -97 -20 -50 24 -201
5050 -201 64 43 1 -160 -65 111 -48 57 -65 -45 59 -150 30 27 -53 14 -16 14 40 43 50 -16 -5 -53 20 -32 136
5077 136 174 -1 -73 17 -64 10 -28 -10 -47 -74 -2 10 62 -43 23 -33 -31 -9 -71 -132 -49 63 -84 122 83 -4 -71 -18
5105 -18 34 -57 -35 91 -8 -18 -103 37 -26 -2 73 25 36 129 -7 -48 -45 -146 -8 165 -72 88 33 -77 -44 40
5131 40 0 -22 -21 -50 17 40 -113 55 106 -46 34 -136 76 -52 -14 -5 62 -14 25 -18 -69 20 -7 -82 12 5 -112 -54
5159 -54 -56 84 20 78 72 -1 -17 -15 -49 -20 7 -18 -23 1 1 31 15 -78 58 30 -20 -46 35 -80 -52 -2 -96 0 39 -15 -70
5190 -70 30 10 -48 -80 -35 47 -31 -41 77 -7 108 17 67 -89 -75 123 57 84 -5 13 -106 -80 -8 44 -48 -42 57 -5
5218 -5 -26 63 -6 18 -12 -43 -69 -40 105 -13 -36 -44 24 31 -160 38 -27 -7 52 22 -1 -45 1 -179 -3 -98 -94 -12 -51
5247 -51 -108 44 -59 -59 101 -49 -47 64 -9 77 154 -28 7 -34 -52 9 95 19 -107 20 -99 20 -32 20 141 -121
5273 -121 -12 -86 -21 -58 -41 27 -42 -76 56 -2 -54 40 -66 6 74 98 -59 -32 108 34 -11 -77 -110 41 -11 -41 88
5300 88 -90 -9 -124 -23 15 56 -38 -165 -17 -25 -58 -72 52 -9 -14 63 -29 69 27 76 57 84 -70 -56 -37 -13 -4 18
5328 18 7 -68 68 17 57 -1 0 55 -40 -9 -43 -92 -37 4 -41 105 -67 45 1 -90 99 -120 30 61 75 -17 13
5355 13 -102 -27 -173 -32 25 116 18 8 4 -5 34 -32 -25 -99 61 98 49 -3 10 26 5 -15 -63 -37 -26 -47 -22 88 -160
5384 -160 65 1 -41 -25 -15 97 38 -26 82 15 -111 17 57 8 -106 84 44 -231 -53 75 -11 -58 -3 109
5408 109 -53 47 59 -156 9 45 -61 -32 42 28 0 -15 6 44 -25 -173 127 -43 -126 -40 -101 -45 15 -70 7 -180
5434 -180 -19 38 71 6 -17 35 -53 -83 63 32 -83 -7 39 26 12 75 -29 73 -93 -45 1 120 20 24 -73 -45
5460 -45 -65 -23 -22 9 -16 6 -21 -80 4 58 4 -99 -32 -119 -31 -48 4 72 -29 -14 -35 -53 -40 73 -35 55 4 28 -109
5489 -109 -155 -70 -13 1 -103 -48 32 -62 46 -22 80 -44 -74 16 16 8 -90 96 -87 21 -31 41 -67 -72 -26 -61 9
5516 9 30 62 -35 -3 -37 -79 -175 -75 -163 -14 -46 31 -12 -116 -30 10 -109 48 42 -18 11 -16 92 -13 50 -97 -107
5543 -107 92 -9 111 -53 123 40 -117 -16 -12 109 -2 -183 -156 -32 -18 13 81 32 22 35 41 5 -18 37 12
5568 12 -15 56 0 -12 42 13 -38 -14 86 94 -17 -59 79 -40 15 41 -24 -27 22 51 -52 46 -4 -67 61 -7 58 24
5596 24 12 -102 33 38 13 0 46 -80 -84 38 -38 -8 31 10 75 -33 -23 -77 -21 -45 -78 -52 40 29 -40 -53 -19 -33 -62
5625 -62 -46 85 16 -14 -59 4 24 -51 135 -36 5 -164 81 71 16 64 -83 -44 13 -27 -19 10 -120 11 -5 45 -26
5652 -26 3 -14 -22 -55 110 65 -16 -71 -23 44 -33 -54 100 7 -76 -127 13 32 51 -52 53 -2 -49 -14 25 1 -50 33
5680 33 15 80 -81 54 31 6 -5 -92 9 -4 -56 35 53 -7 56 98 -35 7 50 -60 72 87 -17 3 4 -52 -27
5707 -27 -121 -111 18 98 -11 20 44 -88 -19 73 -63 -44 -138 18 59 101 -7 0 -19 97 100 -6 -57 20 39 164 51
5734 51 -92 22 -36 40 -37 56 -33 7 -27 82 137 -19 -88 73 -4 -3 -88 37 -34 -126 42 -1 100 69 -53 3
5760 3 34 58 -29 34 87 -19 0 23 68 7 4 -7 -5 -60 -33 -27 -32 78 -34 97 33 -27 -81 -59 76 105 -23 78 24
5789 24 -2 -159 44 92 12 30 0 64 2 47 33 10 -9 -54 34 -114 -141 -8 60 -25 -68 44 35 37 125 -41 -83 -69
5817 -69 54 77 -121 49 11 -44 -59 -80 -12 33 39 -201 153 127 -181 33 -74 55 24 71 -60 5 -97 -8 4
5842 4 -14 -40 -40 -4 9 0 -1 8 -65 -46 -26 37 60 -35 -111 -53 34 -27 3 -94 7 -29 -46 77 8 -85 137 -118 13 -64
5872 -64 62 60 -22 -46 -3 113 61 -29 -5 95 66 -42 21 38 -38 24 -11 23 -6 16 27 -129 -3 -18 -112 -76 30
5899 30 -27 39 -42 -39 -104 -10 29 -28 50 -60 -8 18 -43 -39 -50 -32 29 -83 96 -170 0 -8 71 49 51 -42 -115 -1 -123
5928 -123 -54 -32 59 -158 -4 185 -73 15 29 -34 -23 -6 48 -52 50 25 -14 -14 -55 4 28 -31 -31 40 2 56 -75
5955 -75 2 -91 27 93 134 -33 -16 39 -85 -59 52 114 163 -110 34 88 -63 -63 -36 53 8 -18 -11 28 22 53 -28 171
5983 171 -74 -45 -30 108 -5 52 -58 -13 -11 2 10 -86 99 -5 -20 29 -77 23 -3 -8 68 16 38 7 49 47 -40 -115
6011 -115 85 -17 -1 -90 -14 73 -2 -20 124 1 -101 35 17 31 -36 73 72 53 76 -38 22 66 -13 -22 -88 -96 -83
6038 -83 19 52 27 64 69 -120 27 37 22 54 -65 78 78 -38 -32 -23 -122 36 13 5 25 66 -31 5 140 116 -43 -25
6066 -25 -4 40 47 46 -21 -14 26 -5 61 -41 88 -149 -16 -23 85 27 22 30 53 93 -8 53 26 13 68 64 -75 136 2
6095 2 4 -90 37 -192 -35 55 51 -12 -9 3 -32 16 2 63 -30 -46 -67 -25 -82 -81 -16 164 77 58 -17 -1 36 8 -34 21 -33
6126 -33 -62 53 -17 -105 -100 -64 34 34 -46 -122 15 -10 -64 -14 -58 -46 -7 -111 -50 -79 -56 -58 1 31 77 -39 160 -41 53
6155 53 -101 -102 -63 21 -166 -29 -66 -76 -12 14 -7 -93 -53 -78 63 49 7 71 62 -71 -91 19 6 9 81 -62 -1 -2 -8
6184 -8 80 56 -47 -82 40 19 112 87 20 -8 -29 -98 -141 -37 59 -55 -43 70 31 55 -64 20 46 -43 64 -24 24
6211 24 -135 53 151 18 38 -137 99 41 -4 -29 -55 45 45 102 18 -82 14 100 18 116 60 67 -35 -52 -163 126
6237 126 59 8 -1 28 27 -19 -21 -7 45 -86 98 -36 -94 72 37 4 148 -5 -110 19 -73 -30 -97 -21 -131 65
6263 65 -21 -29 -66 52 -94 -9 -21 56 68 29 -109 17 17 -195 80 -39 -54 -118 53 89 74 19 89 -40 49 -153
6289 -153 -46 -30 -17 -63 121 -23 32 38 -194 -33 -4 0 -51 -71 -51 81 -39 -60 -42 -93 -39 -49 -52 -18 -19 14 32 -20
6317 -20 62 23 18 -21 -80 -5 23 67 -11 4 -54 -17 51 25 35 66 59 -32 -27 -33 91 47 46 -57 -44 2 10 14 4 80 109 -47
6349 -47 -15 -16 23 -13 24 -29 100 82 18 45 141 -5 53 95 -3 -34 -92 54 35 97 48 -12 -61 34 11 33 16 -64 -85
6378 -85 137 59 -60 8 39 -114 -52 -65 24 28 -4 51 -73 9 -104 -123 53 -6 77 12 22 33 -29 -94 -16 19 54 -69
6406 -69 -11 103 -122 -92 -3 111 -36 -71 -51 -80 -24 -14 -41 -22 3 -34 -65 104 25 10 -57 11 -12 13 78 -75 26
6433 26 -65 2 2 115 84 -14 24 24 -13 95 3 -91 202 30 55 65 59 -6 -125 -99 -91 -7 -41 -49 40 -106 -37 -156 -111
6462 -111 -6 -47 98 55 64 -144 -71 -4 35 52 29 -76 -1 -28 -41 -32 -61 -32 -40 46 -29 -24 -47 39 26 25 0 -24 -83 32
6492 32 67 2 -50 45 8 -51 5 -74 24 -48 -32 -82 -4 -16 -24 -122 24 -11 49 111 112 101 4 -52 19 180 7 82 24 142
6522 142 104 69 94 50 43 160 99 36 -28 3 -36 1 -23 32 10 -38 -25 34 -58 70 -134 7 -42 34 34 67 121 -20
6550 -20 -54 -23 -14 -22 82 114 48 -91 -57 7 5 97 -19 1 -29 5 18 29 27 -27 61 -41 51 151 45 17 57 -6 -47
6579 -47 17 -22 18 6 -71 167 104 55 64 -73 103 37 -83 -106 120 36 62 61 49 -39 -4 -7 66 62 15 5 32 38 -97 -38
6609 -38 11 7 -42 -102 74 -2 46 119 94 71 -76 0 -20 85 4 -51 34 -11 62 -18 33 -23 56 6 -10 103 -5 -2 -23
6638 -23 -13 46 17 -31 93 86 -89 -75 -32 22 -89 107 -71 32 54 74 57 -60 36 111 -7 -140 119 -66 -59 6
6664 6 7 2 -3 53 -22 -117 -121 -13 -17 -70 -23 -73 5 -103 110 67 -64 -24 -83 4 39 -182 -89 20 10 22 -106 40 -56
6693 -56 9 -128 44 60 -88 -80 -49 155 -67 100 1 13 17 77 -21 -64 32 -13 -70 -74 4 8 -38 33 3 -38 97 104 -68
6722 -68 91 17 -1 36 -34 18 98 68 20 71 -35 5 -13 86 -7 -6 -30 -6 -62 -91 74 -103 -90 -26 -67 53 -58 56
6750 56 -30 -131 14 88 -57 188 173 -68 -20 -93 35 6 26 39 -9 9 -74 -111 -71 -110 -40 23 -56 -163 42 -37
6776 -37 44 166 70 -85 51 37 -87 49 4 45 91 -69 -81 55 -121 -208 -137 -80 -73 -92 -29 3 -103 -8 22 26 12
6803 12 -63 73 -96 35 -29 -40 -53 -41 115 111 -60 41 -118 -49 -35 32 -48 73 95 104 12 -24 289 -35 65 71
6829 71 -58 76 -8 29 65 -9 -58 -60 -79 -49 -94 55 34 45 -86 38 -67 101 40 19 56 22 147 29 93 -166
6855 -166 30 -16 -6 -30 52 20 -33 -34 -24 -11 -54 -125 5 -53 -134 103 21 -58 5 116 -82 -70 -1 -2 -118 19 45
6882 45 60 33 114 44 -45 66 24 65 -1 7 -28 -35 0 19 -17 -30 7 -49 58 40 18 128 -12 -54 4 -38 -72 -79 -36 47
6912 47 -65 -15 1 43 -103 125 -85 14 -22 44 6 41 85 81 -110 6 33 -82 -82 55 75 -13 -18 -20 10 -86 -29 -12
6940 -12 -6 -82 -4 -9 69 7 -71 -45 -4 -3 42 94 -59 -78 13 -33 -163 -14 -39 122 25 132 -63 -62 116 12 -33 104
6968 104 145 37 -137 51 85 -46 52 79 20 -11 9 -60 -5 -88 4 -57 -120 -73 -76 43 -82 -95 -139 -84 153 16
6994 16 -66 -53 48 -64 51 21 -32 0 40 -79 58 -7 -1 45 34 58 36 163 -62 131 -46 -10 -68 28 -80 24
7020 24 -14 -152 -67 -65 55 90 6 87 -121 -85 -27 86 -13 1 -88 27 -35 -88 6 -9 3 -61 63 33 -63 38 -95
7047 -95 -39 -4 -36 -4 21 69 32 82 -27 -38 29 -109 153 15 29 85 100 46 134 -123 53 -24 77 38 -9 25 65
7074 65 49 44 -96 -13 3 89 23 10 27 -108 85 13 -14 82 0 11 59 53 78 -114 3 23 -93 30 108 41 27 61
7102 61 1 -67 -84 18 -51 -58 110 -41 29 -94 -40 13 -8 -122 -11 17 -81 -71 -58 82 -16 31 -11 -67 -51 86 98
7129 98 4 -81 23 43 0 57 77 6 -6 79 6 110 -99 18 -130 67 -45 -10 5 1 52 -53 5 -125 -10 -52
7155 -52 -74 61 45 20 55 38 -58 55 -64 -96 3 -58 -47 4 -28 -60 -16 -34 46 -39 -78 39 54 81 -80 -46 -25 20
7183 20 33 -11 -10 -2 65 -23 37 76 32 -101 -65 -88 57 27 60 39 2 91 -90 -24 62 -28 -60 55 -37 93 82 25 -8
7212 -8 76 21 20 35 15 -29 -26 -90 56 16 53 59 -45 -170 106 -110 -13 -44 41 120 -69 -79 -116 -14 100 58 55 114 3
7241 3 -29 -36 -4 78 11 54 21 -61 145 -72 1 50 -45 128 33 139 37 76 -100 -87 69 -2 -8 -90 -59 78 41 -8
7269 -8 -17 135 50 -146 -65 58 -53 33 -23 88 -115 -103 56 -44 83 39 -162 -122 31 9 72 12 -41 16 -2 14
7295 14 -44 12 115 -33 98 -29 -48 60 -50 64 -32 -92 76 89 46 -37 13 33 -20 -11 49 135 -7 -73 -49 -82
7321 -82 -47 35 -143 -56 25 67 -123 27 -5 -21 -34 -20 -56 16 53 -190 -20 75 17 -27 36 25 -78 -82 -32 -33 48 -28
7349 -28 56 112 66 -20 65 53 -112 -34 -15 55 -85 5 -61 -59 -152 -41 -24 83 -70 -78 -100 -9 2 122 0 22 110 28
7377 28 37 -55 -53 -124 -27 13 -74 63 -27 108 46 -73 45 -103 48 -62 -22 35 -55 65 43 -134 84 -6 -68 -30
7403 -30 -39 86 -72 37 64 15 -3 -21 -50 86 28 68 35 -39 20 -56 5 72 70 23 -54 -11 63 46 71 -11 -46 97 -56
7432 -56 -83 -78 53 -13 -15 25 -9 35 -4 35 20 75 -151 -1 103 25 -79 23 -13 58 -12 -68 -67 6 -95 106 -6
7459 -6 31 12 -2 -52 -34 18 -34 -60 -82 3 53 41 -45 -84 30 14 -9 -8 -94 47 81 -24 -72 -34 -19 -18 79 -57 31 29
7489 29 17 34 110 -64 20 -102 7 -34 8 17 -61 -24 -30 -50 13 17 -6 -5 -125 6 -43 58 -83 20 5 -115 -8
7516 -8 -54 19 -62 -67 25 -41 -116 126 26 93 -109 96 9 -87 3 -20 -22 -29 29 -92 8 -30 -114 -53 -20 1 34 102 -3
7545 -3 98 -70 35 -13 37 14 16 101 36 142 -68 135 61 64 -27 -28 17 -14 57 -14 39 -69 -39 -76 -6 51 4 111
7573 111 58 114 58 -16 76 -35 18 -5 -56 -92 -15 -29 -6 73 -19 130 131 15 -29 62 36 47 -19 58 10 39 13 83 -8
7602 -8 55 10 -65 106 -11 43 10 -41 33 2 76 9 -93 -120 -20 -45 76 64 16 29 72 2 -110 -46 84 -13 -99
7629 -99 -109 65 21 -36 30 -72 72 72 52 104 -7 50 -27 14 23 -8 -29 -57 19 -142 10 -107 45 100 86 -37 -85
7656 -85 -61 -34 16 57 -67 -9 -23 -92 51 -70 -31 6 -89 -67 -31 55 0 183 88 -94 5 45 -71 -51 -26 -74 -54
7683 -54 15 -59 -66 -20 -53 51 25 60 44 17 22 123 44 30 18 -12 -43 -54 66 -188 -60 86 85 71 -62 43 28 6
7711 6 72 -93 8 14 73 57 -18 -74 8 -32 -19 36 -1 40 -52 44 -71 -62 88 42 -7 -16 -24 18 4 -26 -72 -66 -87 18 -63
7742 -63 -79 -20 64 -10 51 -106 64 -3 71 -24 -27 23 42 -52 -135 2 66 8 10 -55 102 94 173 -21 -45 -147 46 -28
7770 -28 171 0 -84 45 -57 91 50 -25 3 53 4 -40 -9 -36 89 23 88 58 6 -111 3 83 64 -56 -16 14
7796 14 25 85 -35 -30 114 42 -11 29 -43 -51 -85 4 -18 44 80 35 -29 -26 -25 -68 -92 59 -117 -112 133 65 28 -11 23 -66
7826 -66 -72 -97 -23 110 62 71 3 -9 61 75 56 -98 -21 -108 -4 -44 30 -31 -17 14 -45 55 26 11 -9 3 31 40 23 64
7856 64 3 -22 -27 -11 89 78 -41 -9 -60 -14 106 186 -74 -29 84 -28 11 -97 29 33 -16 59 31 29 67 -11 6 -18
7884 -18 39 -9 -14 -76 13 47 56 38 -42 -19 17 57 -79 -31 68 -31 -93 92 122 -36 65 -60 -12 0 174 5 6 -51
7912 -51 94 -26 -22 -56 -7 -70 52 28 -35 12 40 55 18 102 -42 -18 14 9 47 12 -113 22 19 -9 69 -73 -57 -81
7940 -81 0 -35 -98 140 3 85 -6 63 16 -42 -42 55 88 62 -10 15 27 -18 -62 35 -37 32 134 80 -28 -78 -52 27 -75
7969 -75 -17 26 -76 54 24 -140 -33 108 -65 38 7 12 50 12 -30 -72 56 105 -69 -66 27 -11 -24 -147 65 42
7995 42 122 -62 -10 44 -31 1 -32 -49 -30 10 -30 15 -21 -33 15 32 -54 52 -35 -28 58 -79 -4 -28 -50 26 31 35 -20 -42
8025 -42 -2 40 -31 12 -71 33 35 38 -7 29 28 -59 -128 55 -24 -143 -48 4 -32 -81 59 -37 -47 27 63 -123 -100 -85 -76 -19
8055 -19 104 -7 -86 62 -33 32 26 137 5 87 -4 35 -75 -91 -10 49 45 69 78 46 -7 -47 -33 -105 -14 125 -96 93
8083 93 -20 21 23 -9 -64 102 95 -109 -75 36 4 124 -21 -3 -13 -43 -8 -55 -48 13 53 -41 -3 -128 -66 7 -44 7
8111 7 -30 -54 6 127 45 84 49 5 -6 -29 -84 19 -36 -29 114 -54 46 -11 -3 -95 -99 120 -39 -8 59 -83 9 93
8139 93 72 -46 140 27 81 -14 -186 57 75 27 77 7 -40 86 -6 112 -68 34 -48 -39 -30 -9 -22 28 94 -17
8165 -17 73 64 -7 115 67 12 47 2 -28 84 -87 34 38 15 114 -69 -115 -75 -37 -17 61 -53 91 -57 -10 -39
8191c9
##END NTUPLES=NMR FID
##END=
