##TITLE=1H_Pr 2162
 CDCl3,8 sc, 
 1.03.2021
##JCAMPDX= 6.0         $$ Bruker NMR JCAMP-DX V2.0
##DATA TYPE= NMR FID
##DATA CLASS= NTUPLES
##ORIGIN= UXNMR, Bruker Analytische Messtechnik GmbH
##OWNER= root
$$ XWIN-NMR		Version 3.5
$$ Mon Mar  1 11:59:27 2021 Russian Standard Time (UT+4h)  she@DPX200
##.OBSERVE FREQUENCY= 200.1315066352
##.OBSERVE NUCLEUS= ^1H
##.DELAY= (6, 6)
##.ACQUISITION MODE= SIMULTANEOUS
##.ACQUISITION SCHEME= undefined
##.AVERAGES= 8
##.DIGITISER RES= 18
##SPECTROMETER/DATA SYSTEM= spect
##.PULSE SEQUENCE= zg30
##.SOLVENT NAME= CDCl3
##.SHIFT REFERENCE= (INTERNAL, CDCl3, 0, 15.7039)
##AUDIT TRAIL= $$ (NUMBER, WHEN, WHO, WHERE, WHAT)
$$ ##TITLE= Audit trail, XWIN-NMR		Version 3.5
$$ ##JCAMPDX= 5.01
$$ ##ORIGIN= Bruker BioSpin GmbH
$$ ##OWNER= she
$$ F:/spectra/data/she/nmr/H-F/1/audita.txt
$$ ##AUDIT TRAIL=  $$ (NUMBER, WHEN, WHO, WHERE, WHAT)
(   1,<2021-03-01 11:58:19.42 +0400>,<she>,<DPX200>,
      <created by zg, POWCHK disabled, PULCHK disabled
       configuration hash MD5:
       00 E9 B6 7A A2 85 ED C7 34 08 36 98 17 FE 4E 26
       data hash MD5: 16K
       61 5B 4A 26 ED 0A 21 30 7A EF E4 33 64 E8 41 DD>)
$$ ##END=
$$ 
$$ hash MD5
$$ 05 2C 41 92 82 4A D9 B0 05 EB F0 66 84 41 34 24
##$RELAX= 
##$RELAX= 
##$RELAX= 
##$RELAX= 
##$RELAX= 
##$RELAX= 
$$ Bruker specific parameters
$$ --------------------------
##$DU= <F:/spectra>
##$EXPNO= 1
##$NAME= <H-F>
##$PROCNO= 1
##$TYPE= <nmr>
##$USER= <she>
##$AMP= (0..31)
100 100 100 100 100 100 100 100 100 100 100 100 100 100 100 100 100 100 
100 100 100 100 100 100 100 100 100 100 100 100 100 100 
##$AQSEQ= 0
##$AQ_mod= 1
##$AUNM= <au_zg>
##$AUTOPOS= <>
##$BF1= 200.13
##$BF2= 200.13
##$BF3= 200.13
##$BF4= 200.13
##$BF5= 200.13
##$BF6= 200.13
##$BF7= 200.13
##$BF8= 200.13
##$BYTORDA= 1
##$CFDGTYP= 0
##$CFRGTYP= 5
##$CHEMSTR= <none>
##$CNST= (0..31)
1 1 145 1 1 1 1 1 1 1 1 1 1 1 1 1 1 1 1 1 1 1 1 1 1 1 1 1 1 1 1 1 
##$CPDPRG= <>
##$CPDPRG1= <>
##$CPDPRG2= <>
##$CPDPRG3= <>
##$CPDPRG4= <mlev>
##$CPDPRG5= <mlev>
##$CPDPRG6= <mlev>
##$CPDPRG7= <mlev>
##$CPDPRG8= <mlev>
##$CPDPRGB= <>
##$CPDPRGT= <>
##$D= (0..31)
0 1.2 0 0 0 0 0 0 0 0.06 0 0.03 0 0 0 0 0.0002 0 0 0 0 0 0 0 0 0 0 0 0 
0 0 0 
##$DATE= 1614585498
##$DBL= (0..7)
120 120 120 120 120 120 120 120 
##$DBP= (0..7)
150 150 150 150 150 150 150 150 
##$DBP07= 0
##$DBPNAM0= <>
##$DBPNAM1= <>
##$DBPNAM2= <>
##$DBPNAM3= <>
##$DBPNAM4= <>
##$DBPNAM5= <>
##$DBPNAM6= <>
##$DBPNAM7= <>
##$DBPOAL= (0..7)
0.5 0.5 0.5 0.5 0.5 0.5 0.5 0.5 
##$DBPOFFS= (0..7)
0 0 0 0 0 0 0 0 
##$DE= 6
##$DECBNUC= <off>
##$DECIM= 32
##$DECNUC= <off>
##$DECSTAT= 4
##$DIGMOD= 1
##$DIGTYP= 9
##$DL= (0..7)
0 120 120 120 120 120 120 120 
##$DP= (0..7)
150 150 150 150 150 150 150 150 
##$DP07= 0
##$DPNAME0= <>
##$DPNAME1= <>
##$DPNAME2= <>
##$DPNAME3= <>
##$DPNAME4= <>
##$DPNAME5= <>
##$DPNAME6= <>
##$DPNAME7= <>
##$DPOAL= (0..7)
0.5 0.5 0.5 0.5 0.5 0.5 0.5 0.5 
##$DPOFFS= (0..7)
0 0 0 0 0 0 0 0 
##$DQDMODE= 0
##$DR= 18
##$DS= 0
##$DSLIST= <SSSSSSSSSSSSSSS>
$$ [...]
##$SUBNAM2= <"">
##$SUBNAM3= <"">
##$SUBNAM4= <"">
##$SUBNAM5= <"">
##$SUBNAM6= <"">
##$SUBNAM7= <"">
##$SUBNAM8= <"">
##$SUBNAM9= <"">
##$SW= 16.9725356469052
##$SWIBOX= (0..15)
0 0 2 0 0 0 0 0 0 0 0 0 0 0 0 0 
##$SW_h= 3396.73913043478
##$TD= 16384
##$TD0= 1
##$TE= 0
##$TE2= 300
##$TE3= 300
##$TEG= 300
##$TL= (0..7)
0 120 120 120 120 120 120 120 
##$TP= (0..7)
150 150 150 150 150 150 150 150 
##$TP07= 0
##$TPNAME0= <>
##$TPNAME1= <>
##$TPNAME2= <>
##$TPNAME3= <>
##$TPNAME4= <>
##$TPNAME5= <>
##$TPNAME6= <>
##$TPNAME7= <>
##$TPOAL= (0..7)
0.5 0.5 0.5 0.5 0.5 0.5 0.5 0.5 
##$TPOFFS= (0..7)
0 0 0 0 0 0 0 0 
##$TUNHIN= 0
##$TUNHOUT= 0
##$TUNXOUT= 0
##$USERA1= <user>
##$USERA2= <user>
##$USERA3= <user>
##$USERA4= <user>
##$USERA5= <user>
##$V9= 5
##$VALIST= <valist>
##$VCLIST= <CCCCCCCCCCCCCCC>
##$VD= 0
##$VDLIST= <DDDDDDDDDDDDDDD>
##$VPLIST= <PPPPPPPPPPPPPPP>
##$VTLIST= <TTTTTTTTTTTTTTT>
##$WBST= 1024
##$WBSW= 4
##$XGAIN= (0..3)
0 0 0 0 
##$XL= 0
##$YL= 0
##$YMAX_a= 469497
##$YMIN_a= -384741
##$ZGOPTNS= <>
##$ZL1= 120
##$ZL2= 120
##$ZL3= 120
##$ZL4= 120
##$ABSF1= 10
##$ABSF2= 0
##$ABSG= 5
##$ABSL= 3
##$ALPHA= 0
##$AQORDER= 0
##$ASSFAC= 0
##$ASSFACI= 0
##$ASSFACX= 0
##$ASSWID= 0
##$AUNMP= <proc_1d>
##$AZFE= 0.1
##$AZFW= 0.1
##$BCFW= 1
##$BC_mod= 2
##$BYTORDP= 1
##$COROFFS= 0
##$CY= 11.3945322036743
##$DATMOD= 1
##$DC= 2
##$DFILT= <>
##$DTYPP= 0
##$F1P= 15.9154993809931
##$F2P= -4.1035820241983
##$FCOR= 0.5
##$FTSIZE= 0
##$FT_mod= 4
##$GAMMA= 1
##$GB= 0.15
##$INTBC= 1
##$INTSCL= 1
##$ISEN= 128
##$LB= 0.24
##$LEV0= 0
##$LPBIN= 0
##$MAXI= 10000
##$MC2= 0
##$MEAN= 0
##$ME_mod= 0
##$MI= 1.114404
##$NCOEF= 0
##$NC_proc= 0
##$NLEV= 6
##$NOISF1= 3.799351
##$NOISF2= 2.8
##$NSP= 1
##$NTH_PI= 0
##$NZP= 0
##$OFFSET= 15.70392
##$PC= 1
##$PHC0= -10758.58
##$PHC1= 9.200939
##$PH_mod= 1
##$PKNL= yes
##$PPARMOD= 0
##$PSCAL= 0
##$PSIGN= 0
##$REVERSE= no
##$SF= 200.130013532006
##$SI= 16384
##$SIGF1= 3
##$SIGF2= 2
##$SINO= 400
##$SIOLD= 16384
##$SREGLST= <1H.CDCl3>
##$SSB= 0
##$STSI= 0
##$STSR= 0
##$SW_p= 3612.71676300578
##$SYMM= 0
##$S_DEV= 0
##$TDeff= 0
##$TDoff= 0
##$TI= <>
##$TILT= no
##$TM1= 0
##$TM2= 0
##$TOPLEV= 0
##$USERP1= <user>
##$USERP2= <user>
##$USERP3= <user>
##$USERP4= <user>
##$USERP5= <user>
##$WDW= 1
##$XDIM= 8192
##$YMAX_p= 0
##$YMIN_p= 0
$$ End of Bruker specific parameters
$$ ---------------------------------
##NTUPLES= NMR FID
##VAR_NAME=  TIME,          FID/REAL,        FID/IMAG
##SYMBOL=    X,             R,               I
##VAR_TYPE=  INDEPENDENT,   DEPENDENT,       DEPENDENT
##VAR_FORM=  AFFN,          ASDF,            ASDF
##VAR_DIM=   8192,          8192,            8192
##UNITS=     SECONDS,       ARBITRARY UNITS, ARBITRARY UNITS
##FACTOR=    0.0002944,     1,               1
##FIRST=     0,             0,               0
##LAST=      2.4114304,     0,               0
##MIN=       0,             -384741,         0
##MAX=       2.4114304,     469497,          0
$$ Real data points
##PAGE= N=1
##DATA TABLE= (X++(R..R)), XYDATA
0@%%%%%%%%qJ6j6J6j6K4l8M6n6O8p9R6j17J40j64J92k27K65l07L55m11M74n39
31b86O11o94P86q87R99j122J257j404J563j736J928k139K369k622K897l193L517
48A844l874M268m702N180n711O299o956P700q549R524j0658J1995j3597J5560
62H323j8029K1240k5590L1839m1587N8890r8246L33806P5425n39191M69915l00451
74b3656P0393L56346n80164J55931L98343l91832K90985j27137k49592N69880
84D69497k79183k23201K76459k93134K28565O5547m96456L20820P4116k21124
94g8094K96729l50951O5681M32525m29585Q2188J01457k76021L97017j87272l83190
105c29516M52240j85809o8956K59637m71038K84874K74811m53647K45287j2144
$$ y = [0, 0, 0, 0, 0, 0, 0, 0, 0, -8, 8, -8, 8, -8, 16, -22, 24, -32, 36, -43, 53, -64, 76, -88, 104, -123, 142, -165, 190, -221, 253, -286, 325, -369, 417, -470, 529, -593, 664, -740, 823, -913, 1015, -1124, 1245, -1377, 1520, -1673, 1844, -2030, 2238, -2464, 2716, -2995, 3304, -3652, 4048, -4501, 5023, -5635, 6360, -7237, 8323, -9706, 11534, -14056, 17783, -23804, 35086, -63160, 270646, 346071, -193120, 276795, -23656, 46737, 403083, -177081, -21150, 377193, -14639, 276346, 149209, -100383, 469497, 190314, -32887, 243572, -49562, 179003, 244550, -251906, 68914, 143030, -78094, 218635, -132316, -66635, 365890, -63695, 18493, 119950, -156071, 240946, 53674, -329516, 122724, -63085, -132041, 127596, -343442, -58568, 216243, -237404, 7883, -4261]
115d261j81152M28748l23321j95817M22767k81173Q0313R3112l91443L85729N0227
126H3729l12902K64829j33154J4496L15930l94746O5303K45249k68004K27346
136A08076j31734k17027M14265j78011j27928K29095k49307K01883J57949m15932
146b08671K71598N1522k00718K90526k80502n0621L69053l02908J2858J50036
156A02173k72392L01271j3431l33342L35314r6089p4451K25439l22677J06324
166d1861K32748l08733J29429R728j81866L28278j92708j49237K89016k01820
176h7026Q7755Q8988l04212K49496N1772k46308K23722j44730l7093K94658l15126
187a38104M7255J89048k35900K04732m1784k33997L16606r8863j42734K33785
$$ y = [-4261, -185413, 243335, -79986, -275803, 146964, -134209, -53896, 39216, -352227, 33502, 83729, -229173, 35656, -97498, -83002, 232928, -161818, -96515, 148734, -119270, 108076, -23658, -240685, 173580, -4431, -132359, 96736, -152571, 49312, 207261, -208671, 62927, 114449, -86269, 204257, -76245, -126866, 242187, -60721, -47863, 102173, -170219, 131052, 117621, -215721, 119593, 23504, -50947, 174492, -148185, -41861, 190887, -117846, 11583, 21311, -160555, 167723, -24985, -174222, 114794, -87026, 729, 89717, -214495, 35001, 86773, -159535, 64187, -80543, -117636, 177022, -138104, -90849, 98199, -137701, 67031, 25247, -208750, 107856, 8993, -133741, 100044]
197A00044k33154R9433J87447l19994J74561O3745j76080K34600j43482j09250
207a22130K86880j97191n473J43863k40951K07390K3936k36557K32309p1773o4249
218d3946K11240k27341M5304J97129k49142J37665Q098j93729K66965j33065j21210
229a02032K31253j80284M9411J48036k61545J74336P2244k21388K21641j12614
239A9058r3781K44358k20773P83J59531k16637J36900M1868k17762K36125o1030
250B8640j13763K17129j86717L4459J53707k30265J11705M5186j87724J93705
260F6062q3947j16024K28747j72450K3925J49933k11272J46045M4790j90645J93520
271G8684p1044j16769K12899j85113K984J62667k23552J32998N2968j85402K02479
$$ y = [100044, -133110, -33677, 153770, -166224, 8337, 72082, -103998, 130602, -12880, -122130, 164750, -32441, -37914, 105949, -135002, 72388, 96324, -140233, 92076, 20303, -43946, 167294, -60047, -14743, 182386, -66756, 70909, 79007, -114722, 152243, 19178, -102032, 129221, -51063, -1652, 146384, -115161, 59175, 131419, -89969, 131672, 19058, -74723, 169635, -51138, -50355, 109176, -107461, 29439, 71307, -146455, 89670, 28640, -85123, 132006, -54711, -20252, 133455, -96810, 14895, 60081, -127643, 66062, -17885, -133909, 94838, -77612, -53687, 96246, -115026, 31019, 75809, -114836, 78684, 7640, -109129, 103770, -81343, -78359, 84308, -139244, -6246, 46722, -138680, 63799]
282F3799n5591j06792K13511j59436r367J64515k15161J11164M5201j93441J92209
293E0611n5730j08953J92384j35132O584J64536k03014J05180P0324j80096J77741
304H4435p5140j06118J97683j43131j5705J41035j79716J14000P0137j95877J83725
315G5328l3530r7758J85879j60544k458J61643j85535O6997N9866j70974J85071
326H3985m2944j36688K01193j14222J941J33654j93395R5622Q7536j79306J28796
337F6172l9170j04593K01455j46895l7218J56116j52217R2398M1529j76063J68220
348F9734o667j27505J50568j25181j296J58312k03121O0324P5786j37358J43535
359E7131n3786j18385J96259q7888n0105J22814j64112R9035P3766j96659J21908
$$ y = [63799, 8208, -98584, 114927, -44509, -53876, 110639, -104522, 6642, 51843, -141598, 50611, -5119, -114072, 78312, -56820, -50236, 114300, -88714, 16466, 86790, -93306, 84435, 9295, -96823, 100860, -42271, -57976, 83059, -96657, 17343, 87480, -108397, 75328, 41798, -55960, 129919, -30625, -33083, 128560, -56975, 10022, 69888, -101086, 83985, 41041, -95647, 105546, -8676, -6735, 126919, -66476, 29146, 116682, -62624, 66172, 27002, -77591, 123864, -23031, -60249, 95867, -56350, 36048, 77577, -98486, 69734, 63067, -64438, 86130, -39051, -40347, 117965, -85156, -24832, 50954, -86404, 57131, 3345, -115040, 81219, -6669, -56774, 66040, -98072, 963, 74729, -121930, -22]
370b2m522q2754J49487j30187l2739J77225j39025L5918N3893j47300J68580k4580
382B3974j41874J45626p2338p543J16528j76208O2955J15440j49626J04622l2094
393a0538q3983J89825j10175n9830J28213j09524O6068N0518j79560J39635K9681
404E0330j14075J27156j03294J875J60541j57255J6190Q3276j08806J18356l4469
415C9825j38246J76564n1960m9396R7505j37576Q6002R3314j65427P7682J9193
426D7480p4331J40636j16891o0601J65849j11980K2922L8297j34669J46872R923
437G3507j39877J17393m6667j3561J24781j73638L2276J14477j28192P6737l3533
448C703r2553J72267o9354q4288J17706r2617N9655O7492j80480J09702M1138
$$ y = [-22, -4544, -87298, 62189, -67998, -100737, 76488, -62537, -26619, 27274, -120026, 48554, 23974, -117900, 27726, -44612, -52155, 64373, -111835, -48880, 66560, -83066, 21556, -10538, -94521, 95304, -14871, -74701, 53512, -56012, 10056, 60574, -118986, 20649, 50330, -63745, 63411, -39883, -38008, 122533, -34722, -18532, 64744, -44062, 74294, 39825, -98421, 78143, 26183, -23213, 74292, -63284, 22718, 116032, -49395, 28287, 47480, -26851, 113785, -3106, -63707, 102142, -9838, 13084, 51381, -83288, 63584, 73507, -66370, 51023, 4356, -9205, 115576, -58062, -25786, 88691, -39501, 37236, 3703, -88850, 83417, 14063, -70225, 47481, -45136, 14519, 82011, -98469, 11233, 52371]
459E2371r9412R8008r4743k1781J55328j26003j4742Q1499j01387J19489j5761
470C2866j39882J50533k8020m3486Q3728j28269N2069J10729j52264N1583K2102
481A1689p5019J45590r4279p0960J48776p7105J5264M5988j34631J17227M1598
492G4138j41037R7666m3386k0298J28954j47209P247J11330r8083O4011j1537
503B1796j05413J54741l8265q9511J01033q8762M8318P3654j58936P2461M9573
514D0689q3150Q9557p1437m9024J57095j01744k2079O9957j01655J03991L273
525C5473j35801J13673q369m8392R0895j18000K3940J21308j32781M3250J6803
536A999p7883J31499o4394q4175J25172n9896N788O2773j35233R5245N5466j21606
$$ y = [52371, -47041, 50967, -43776, -65557, 89771, -36232, -50974, 30525, -70862, 48627, 32866, -107016, 43517, 15497, -27989, 55739, -72530, -20461, 90268, -61996, -10413, 11689, -63330, 82260, -12019, -82979, 65797, -11308, 3956, 49944, -84687, 32540, 74138, -66899, 30767, -12619, -32917, 96037, -51172, -43925, 67405, -30678, 33333, 21796, -83617, 71124, 32859, -56652, 44381, -44381, 3937, 77591, -81345, -8884, 40689, -42461, 47096, -24341, -73365, 83730, -18014, -40093, 29864, -71791, 32200, 35473, -100328, 13345, 4976, -43416, 47479, -70521, -46581, 74727, -58054, -14804, 1999, -75884, 55615, -8779, -92954, 32218, -27678, -21890, 40883, -94350, 895, 56361, -65245]
548f5245Q7025m0791k7960J25427j15075j7763J04244q9809O0307Q713j15675
559h6602J40171j8809p6287R4384q0904L1017Q8102j37315M5383N5859q7940R5144
571F2203n5552o4405J43515p7556j7569O8700r4129Q0492L3287j28017R0727l684
583C8012n6445R8823j06443P67J08733j07257L5758K4407q3474J11606k7290q9856
595e2659J11603n9395l449P3120j29429O2625N1505j05037P3285k7120n1356J20425
607F4118q2645k9997R9284r1795N4343K3718j14352J04102r047p4042Q5413o9872
619d0772k012R6121j13586L4319N4027q8272R2363l1116o9194J14873n8170k4978
631c6397P3289r4437M8397N0407j15298Q1955l911n7243J01027p4735j3344R6738
$$ y = [-65245, 21780, -19011, -46971, 78456, -36619, -54382, 49862, -39947, 20360, 29073, -86602, 53569, 34760, -41527, 52857, -28047, 2970, 91072, -46243, -860, 54999, -32941, 62203, 6651, -57754, 85761, 8205, -9364, 59336, -34793, 45699, 78986, -49031, 41696, 38012, -18433, 80390, -26053, -25286, 83447, -23810, 11948, 36355, -47119, 64487, 37197, -52659, 58944, -451, -3900, 69220, -60209, 2416, 53921, -51116, 22169, -4951, -56307, 64118, -18527, -48524, 50760, -41035, 13308, 37026, -77326, 26776, 17729, -56313, 29100, -40772, -42784, 53337, -60249, -25930, 28097, -60175, 32188, 1072, -68122, 46751, -11419, -36397, 36892, -57545, -9148, 41259, -74039, 7916, 4005, -53238, 47789, -26946, -40290, 56448]
643E6448q6784K6972M1736r5872R1150j0170q3622J01101n8188j0674Q1017r9448
655d6334L9323N6942r3333P2169o351o8743J08855o5307k8047Q7062q9857L7145
667C524M0059r7723P7359L235p2730R4629n5185k0405R2959r5456L0742M7058
679D8066q9976P2243p353p1808R3370m8069l0925Q7097q7866L1187N1025r4641
691d7650P3409j412o6398Q7131m7735k9575Q5483q5214K1354N3817r4908P1300
703A9602k510o7475R0921m6845k8718Q2612p7323K0730N3805r6428O9209M509
715B2089p2805Q7069m9989k3990Q3103p9718J5100N6077q5090O4102L715p5689
727e6026R4557m2435l0515P5698p6620K3578N2887r0129N3386J4827o7754Q5621
$$ y = [56448, -30336, -3364, 38372, -57500, 33650, 23480, -60142, 40959, -17229, -27903, 53114, -46334, -7011, 49931, -43402, 28767, 22416, -46327, 62528, -2779, -30826, 56236, -33621, 3524, 43583, -54140, 23219, 26454, -46276, 48353, -6832, -27237, 65722, -29734, 1008, 48066, -41910, 30333, 22980, -48828, 44542, -3527, -34452, 52645, -35221, -4034, 46991, -47650, 25759, 24347, -42051, 45080, -2655, -32230, 53253, -31961, -10607, 43210, -51698, 19602, 17092, -50383, 40538, -6307, -35025, 47587, -29736, -9006, 44799, -51629, 17580, 22089, -50716, 36353, -13636, -37626, 45477, -34241, -19141, 36936, -48154, 15948, 19663, -56026, 38531, -3904, -34419, 41279, -35341, -11763, 41124, -49005, 4381, 19208, -48546, 37075]
739C7075m7126l2249Q9744p1695J4296M4554p8694O2958J1385p8480P7719k9577
751i0k9694P9627q3516J7846O0701p9541M8999M684o1571Q7103l4189m6449Q1306
764D5216o3701J7695M7738r4323O0436J8168o6918O6442l5858k7397Q8286p2706
776a6922k241N9826p4008N8540O34p6295Q2784k2119l8254O2851o5768J5996O4510
789D9534r0443M0218K0113n7060P7750m3563l8838Q3356n1394j943M2320p6866
801d6816N7268K3054q2946O7050k1259k3336P2974p3723L500O7074o5958L2909
813I791R477o6143Q6818k4854n3270P0733n1981J7421M6641q6508M3397L5229
825C6751o2284N6723l0269l3287R1742o4647j0649N0882o1223N0534P745p8102
$$ y = [37075, -10051, -42300, 47444, -24251, -9955, 34599, -44095, 18863, 30248, -48232, 29487, -90, -29784, 49843, -33673, -15827, 44874, -34667, 14332, 19016, -42555, 44548, 10359, -36090, 45216, -18485, -790, 46948, -47375, 13061, 31229, -35689, 30753, -5105, -32502, 55784, -16922, -19163, 40663, -33345, 25195, 25829, -50466, 32318, 10199, -28055, 34796, -30972, -14976, 49534, -40909, -691, 19422, -37638, 40112, -3451, -42289, 41067, -10327, -12270, 30050, -46816, 10452, 33506, -49440, 17610, -3649, -26985, 45989, -27734, -24234, 42840, -23118, 9791, 19268, -46875, 39943, 15089, -38181, 32552, -19429, -2008, 44633, -41875, 1522, 36751, -25533, 31190, 921, -32366, 59376, -5271, -15920, 34962, -26261, 24273, 32018, -46084]
837d6084O9856l850m1421O0891o3149J0861O9098q1762K7331J8838n0073O7941
849C8477l1110n2521P8548l8527q130M3348p7332N1845K9897p5665N0822j4109
861d457k4293O9273o3593j4087O9189o0080K8230R311o8097Q0213j3773n2143
873d4307N7736m0051R257N3565q2549K8691M1382n9387N4193k9984l5925Q4580
885C7201m8215j8239M6618n2486M1753K1611q0442O1656L193l7284N8491n9090
897b5233M565O7392o5792J4460K3122m9962O4682j7670n7869P4244l1733m628
909d422M1713p1115M1276L6525o6402L9433p094l0902P2259n5552k1059O4736
921C9396n2663K7413J1192o4797O6661L26n2033N2073l5997O92N9346p8255K0498
$$ y = [-46084, 23772, 19922, -21499, 39392, -23757, -12896, 56202, -25560, 1771, 20609, -29464, 38477, 7367, -45154, 33394, -5133, -13263, 30085, -47247, 4598, 34495, -41170, 9652, -4457, -28750, 40523, -23070, -37157, 32032, -28048, 182, 9493, -58604, 21609, 7836, -44307, 13429, -26622, -17365, 36200, -46349, -17658, 23724, -35663, 18530, -11454, -47379, 37201, -11014, -29253, 17365, -35121, 6632, 28243, -52199, 9457, 12650, -24634, 33857, -25233, -20668, 46724, -19068, -4608, 18514, -31448, 33234, 15564, -42305, 31939, 206, -4422, 37291, -33824, 7452, 43977, -22425, 17008, 9914, -20988, 51271, -4281, -25340, 39396, -13267, 14146, 25338, -39459, 27202, 27528, -24505, 27568, -8429, -7737, 51609, -26646, -6148]
934f148L6769n2664M8656k3417m0907P4367l3348k4336M7590n4446L6161K8442
946C6719p6917N1113K271l4523N3198m9422r547O6046n6138Q553K5764n4126O2063
959B5054j0425n5009O2898k6754o458M1985o4002K4683M2411o3122L6901n641
971B521l5751P0744m5319k1191N5808m4483K1383J9901o4037N3730Q131n1786
983c0349N2413l6569m382N8603o5751J3558L4521m7197M2862q768m8416O8622
995B9147k6752k3949M7695n4887K8618L0218o5496L9814O255l6429N2867l6733
1007i632j9445O4174n1030R712K6673n4600N1809j698n0684N2647k0599j4842
1019a7515M8997n7337J5647M2140n8035L6889k548l7973O0756l1313k4893N1751
$$ y = [-6148, 30621, -22043, 26613, 3196, -37711, 36656, 3308, -21028, 26562, -27884, 8277, 36719, -40198, 10915, 13186, -21337, 31861, -17561, -27108, 38938, -17200, -8647, 17117, -37009, 25054, 14629, -40380, 22518, -4236, -10694, 31291, -32711, -8028, 34383, -28739, 8162, 2521, -33230, 37514, -7805, -28996, 26812, -17671, 3712, 23613, -40424, 13306, 21437, -30349, 22064, -14505, -18887, 39716, -26035, -12477, 22044, -25153, 17709, 8941, -39475, 29147, 2395, -21554, 26141, -28746, -128, 30090, -35406, 4408, 10663, -25766, 27101, -9632, -29077, 35097, -15933, -6221, 20452, -34148, 17661, 15963, -34721, 17926, -2673, -17515, 31482, -25855, -10208, 31932, -26103, 10786, 8238, -29735, 31021, -292, -25185, 26566]
1031B6566m1898J3155L0219o3270M5449R667m6709N0912l0471j1278N3933n1361
1043a5086M975L7150n1586L9067P45m9737O0782k4551k0119M6489m7168J6310
1055b729L4210n6883L2441J0481m3622N2689k9338k1673N5982m6074Q489K8836
1067B2809m9704L7889P863m8700N0171j8615k1865N1861n1262J0494L5800n2303
1079b5562L2480N085m1426N1825k0199k6966N3027m3513Q411L4322n6382L6733
1091G835Q011m3974M7010k0864k1660N1836m3622L270L8873n2942L5690N546m3943
1104b8934N0246k0027k3419M7376l9268L001L6557n3563L2339J1221m3623M8633
1116B0539k0770k0449M7156l8387J022L6049m9873K8744J1976m7699N0707j8095
$$ y = [26566, -15332, -2177, 28042, -35228, 10221, 19888, -26821, 24091, -6380, -17658, 36275, -15086, -10111, 27039, -24547, 14520, 15265, -34472, 26310, 1759, -18360, 28129, -19039, -2729, 31481, -25402, 7039, 17520, -26102, 26587, -2751, -24424, 31558, -14516, -6027, 22809, -26895, 10994, 18857, -29843, 20328, 1713, -20152, 31709, -19553, -9059, 26741, -25562, 6918, 12003, -29423, 22402, 2203, -24763, 28264, -15249, -6838, 27484, -28898, 7835, 15846, -28128, 18882, -1982, -23642, 28194, -15428, -12158, 26715, -26227, 9463, 15009, -28934, 21312, 1285, -22134, 25242, -14026, -11025, 25532, -28031, 4308, 15529, -28094, 20539, -231, -20680, 26476, -11911, -10889, 25160, -24713, 4031, 16007, -31692, 19015, 920]
1128I20k3941M7313l8841N852L3795m8818K6813J4876m5051M6044j9491k4058
1140b4587N2343m1570J817L4106m4776K8216J1540m4175M5360j1857k6632M6621
1152B6406l9857M630L5821m8820K5644J1249l8799M2645j4051k8657N1574l4566
1164f781p18L4826m9652L1671J2007m4195L8845j0810k2664M6134l6828l803M1890
1177B9922m5751K4045J0161m2066M7009j2530k9501M2833l0239k64L5996n1562
1189b1947K3912K0172m3349M0070j5941k2742M8887l3377q002L5385m1256K3753
1201E565J4081n0276M3731p146k6668M1296l5548J293L9525m5439J5011J8252
1213A3677l9938M1635j3371l3339M9620k8975m319L0386m3785K4135K1100m5995
$$ y = [920, -23021, 24292, -14549, -8697, 25098, -23720, 3093, 17969, -27082, 18962, -529, -24587, 27756, -13814, -11997, 22109, -22667, 5549, 17089, -27086, 18274, 6417, -20215, 26406, -13451, -8821, 27000, -21820, 3824, 15073, -23726, 18919, 4868, -23789, 27785, -6781, -7499, 27327, -22325, 9346, 21353, -22842, 16003, 5193, -17471, 28663, -8165, -11968, 29922, -15829, 8216, 18377, -23689, 23320, 10790, -18711, 24122, -6117, -6381, 29615, -21947, 1965, 22137, -21212, 18858, 2917, -19825, 29062, -4315, -12317, 23068, -18188, 5565, 19646, -30630, 13101, 5955, -20713, 20583, -14965, -13672, 25853, -19586, -4575, 13677, -26261, 15374, 2003, -31336, 18284, -10691, -15010, 15376, -28409, -4274, 16826, -29169]
1225b9169L3029l628k5368M7051l6762o977M0816l8959J6924J0926m0057M1257
1237I083k493l4743M1448k4607j715L8027m9124J9119K2218l7336L1681r806k6814
1250b5062M8629k5797j4041L6793l8346K3482J6256m6996L7141J86k5816L6551
1262B2980k9117n596M3880m2830R752J9406l6479L9478r825l2736M3637j9087
1274C463q153K9821m0344J7790K5421m5977K9263l874k3077M3391l0965j1712
1286a4953L8776l2165J0520J4960m1058L7428J327l4858L6131k3380k590L5364
1298B5502m2504R609K4869l4810K7319n333l0749M8028k2103j5344L1374l4283
1310a8425J8485J8183m2771K7449O792k7726L5937k4937j0401M2899l6609O616
$$ y = [-29169, 3860, 232, -25136, 21915, -14847, -21824, 18992, -19967, -3043, 7883, -32174, 9083, 6590, -28153, 13295, -11312, -13027, 25000, -24124, -5005, 17213, -20123, 11558, 1752, -25062, 23567, -2230, -16271, 20522, -17824, 5658, 21914, -25082, 12059, 12245, -13571, 22980, -6137, -11733, 32147, -10683, -931, 18475, -18004, 21474, 11649, -21087, 22550, 3463, -4690, 25131, -15213, 2577, 27998, -17979, 11284, 7410, -15667, 27724, -3241, -14953, 23823, -8342, 2178, 17138, -23920, 13508, 14835, -20023, 16108, -7272, -9862, 25502, -17002, -7393, 17476, -17334, 9985, 4652, -26097, 21931, -172, -15516, 15858, -18425, 60, 18243, -24528, 2921, 9713, -18013, 17924, -7013, -17414, 25485, -11124, -4508]
1322d508J7461l3608L4173l322l4431L8187j3028j0810L1999l9480J4428K6895
1334B3956m0163K3891q13k4266L9337k2146j7795L7597k8510Q163J8005m1511
1346b4255L2697N788l2024L1712j7574p803L6185l7185L039K6167l4884K6816
1358H679l569l1572M2392j6303j5118K9932k9965J1914K3678m2961K3661P461
1370H229k8986L5818k3908j2527L9020l0211K817K0074l3089K8755M657l6098
1382b5449L6434j2495j2002L2189l6460Q685K6312l5288J9286L827k6889L8517
1394A6667j6260j9276L7563k7601Q211J9369l8028K5983Q274l0966K9374j3850
1406e40j3407L8120l3048K190K6335l2604K4671J295l0206L5853j0462j8439L1037
$$ y = [-4508, 12953, -20655, 13518, 10196, -24235, 13952, 924, -9886, 22113, -17367, -2939, 23956, -16207, 7684, 6871, -17395, 21942, -204, -17999, 19598, -8912, -749, 17256, -24255, 8442, 14230, -17794, 13918, -3656, -11459, 24726, -12459, -9420, 16747, -18137, 8679, 5110, -26462, 15930, -373, -15491, 14441, -15524, -3610, 20068, -22893, 768, 8229, -20757, 15061, -8847, -21374, 17646, -12565, -9748, 10326, -22763, 5992, 10649, -25449, 10985, -1510, -13512, 18677, -17783, -9098, 17214, -18074, 1212, 5039, -21850, 16667, 407, -18869, 18694, -8907, -696, 18673, -19355, 6628, 14902, -16064, 13310, -540, -13947, 24173, -8875, -6685, 19650, -12954, 11717, 13012, -17194, 18659, 8197, -10242, 20795]
1419B0795k8909O118K5991m0162K1303P285k6669L2338j5938j5542L6145k5245
1431b490r92K2880l4690K3907O436l4426L1756j1166j3422L0639k8976K066K7584
1444A9106l3276J7248P371l0027L5460j3915j8852L2304k4630K433K1647l4838
1456a9969J9196J1816l1330K9732j0953j5656L5733k8372J99K3960l0548J8302
1468B110O795l1178L1445p611j9589L2507k6910L867K5043l3724J7657R278k7289
1481a7599K8769r597j9467L4982k4485j184K4202l2975K0105Q255k9421K8102
1493I687o493j7239L1414k4167j091K7203l2501J6359Q962k8814K9433q834j8478
1506a4559L0811k0699k552K5370l2033J6828J1611l0332K8259q314j6428L0658
$$ y = [20795, -8114, -1996, 23995, -16167, 5136, 12421, -14248, 18090, 2152, -13390, 22755, -2490, -3482, 19398, -15292, 8615, 15051, -19375, 12381, 1215, -12207, 18432, -10544, -8478, 19106, -14170, 3078, 10449, -19578, 15882, 1967, -16885, 15419, -9211, -6778, 14869, -19969, -773, 11043, -20287, 9445, -1508, -17164, 18569, -9803, -9604, 14356, -16192, 2110, 8905, -22273, 9172, 1561, -18028, 14479, -12431, -8564, 16479, -17245, 412, 9690, -17599, 11170, 1573, -17894, 17088, -7397, -8581, 15621, -17354, 2751, 11006, -18415, 9687, 3194, -14045, 17369, -6798, -7889, 19314, -13187, 3172, 12134, -16680, 12753, 3919, -14559, 16252, -4447, -6999, 18371, -13662, 3166, 14777, -15555, 12704, 4390, -12038, 18620]
1518A8620k2578l043K5240k9496J4023J0910l0222K8942p224j8805L0733k1824
1530d724j015K3872k9466J3247J2612k9718K6450o371j9518L1963k2879k526K3517
1543A5444k7821J3360J1033k8772K5722l364k0565L0512k1385k287K4530k9921
1555a3514J2673J1072k6963K3663m001k0710L1234j9251m874K5361k8650J4384
1567D24J0724k8260K3843k891j9201K7471j9029n210K6988k9055J1582J2084k6766
1580a7296K5305m720j9050K8235j5976o101K4367k8298J1712J3873k9462K3523
1592F112m189j7160K8768j7979o192K5244k4435R379J3123k8783K4916k424k0813
1605a4433K6657j7274l255K3106k6419Q565J5542k5891K1502k591j9963L0155
$$ y = [18620, -3958, -7001, 18239, -11257, 2766, 13676, -16546, 12396, 5172, -13633, 17100, -4724, -5739, 18133, -11333, 1914, 14526, -15192, 11258, 4887, -14631, 17332, -5547, -8073, 15444, -12377, 983, 12016, -16756, 8966, 5602, -14963, 15549, -5836, -8123, 16407, -13514, -841, 10231, -16732, 6931, 2930, -17780, 13454, -5797, -10671, 14690, -13960, 424, 11148, -17112, 6731, 3840, -15361, 12110, -6919, -12129, 14859, -14196, -2614, 9470, -17296, 8009, 3289, -15761, 12474, -3502, -9603, 14764, -13534, -1822, 12051, -17411, 6112, 1923, -15237, 13531, -4448, -10640, 14604, -9831, -452, 12671, -16112, 8804, 6380, -14433, 12224, -5050, -8305, 14801, -11618, -3053, 12489, -13402, 8100, 5509, -14454, 15701]
1617A5701j7010o706K2386k4139R969J2434k8125K0999Q53j9998K6986j7459m859
1630h968K6028k5870Q262J2333k3819K0743j790k1748K7385j3459p198K2982k6552
1643a1671J0903J4525k6310J8905k36j7209K6441j5478r521K5754k3519P658J1995
1656A2237k6961K2182L85k0064K3597j2277o212K4351k4825N600J6399k5051J9157
1669H518k546j8937K6532j3031r335K1501k0744P110J5354k7820J8913K279j8889
1682a1095K4206j5161o784K3917k1629L143J4124k3878J8966R77k2580K5813j1550
1695a531o835K1079k2703O348J6183k4541J4283K573j9406K5680j3577j0308K3853
1708A1098k0329N515J2162k3773J7554L851k0807K1625r943p962K4101k3375L793
$$ y = [15701, -1309, -8015, 14371, -9768, 201, 12635, -15490, 5509, 6362, -13636, 13350, -4109, -8968, 17060, -8810, -548, 11785, -12034, 8709, 6919, -14829, 12556, -903, -8101, 14881, -11671, -768, 13757, -12553, 6352, 6116, -11093, 15348, -130, -9651, 16103, -7416, 242, 12237, -14724, 7458, 7843, -12221, 11376, -901, -7113, 17238, -7587, -1987, 14412, -10639, 8518, 5972, -12965, 13567, 536, -8799, 12702, -8042, -932, 14422, -13398, 5515, 7794, -11095, 13111, -2050, -8834, 15083, -6546, -3403, 10721, -13157, 5809, 6786, -15794, 10019, -1531, -8366, 12713, -9990, -3642, 12541, -12000, 2283, 4856, -14550, 11130, -2447, -12755, 11098, -9231, -3716, 8446, -15327, 2227, 6078, -14729, 6896, -3047, -11009, 13092, -10283, -6490]
1721f490J5301k1961J5788M68j9240K3918q580j1541K2520k0042O030J5081k5496
1734a4244J5765L463j7410K0997j0833r346K4095j9157J733J4701k2594J7785
1746D955K075k0502K2033p754q549K0471j9663K912J7846k3721J3580L269j8359
1759a1407K3460j0871j0169K1447j6218K567J3893k2888J4691N836k0444K0638
1771A0535r477p886K1714j9268J439J5210j9857J2274L960k0194K2175o970j1372
1784g717K0321j7983M352J4109k2207J1708N690j8001J9119q279j1235K3383j7698
1797d438J099J3681k0668J4198L992j9601J8446n065j0809K0601j7783Q31J6821
1810A1305k1387J1417L777j6996J9555o546j2125K0382j4513K20J5224k2388J3022
$$ y = [-6490, 8811, -13150, 2638, 3106, -16134, 7784, -796, -12337, 10183, -9859, -3829, 11252, -14244, 1521, 4984, -12426, 8571, -2262, -11608, 12487, -6670, -4937, 9764, -12830, 4955, 7030, -13472, 8561, 807, -7742, 12729, -6934, -4022, 13824, -9897, 3683, 6952, -11407, 12053, 1182, -8987, 12460, -3758, -1191, 12702, -10186, 4505, 10341, -10103, 10535, 1058, -6828, 14886, -4382, -2943, 12267, -7590, 4684, 8644, -11550, 10625, 3655, -7717, 12604, -5379, -1027, 13082, -9125, 2583, 8273, -9728, 9391, 1112, -10123, 13260, -4438, -3339, 10342, -10326, 3872, 7864, -11737, 6709, 1644, -9165, 11436, -6347, -5516, 11305, -10082, 1335, 5112, -11884, 7671, 1125, -11000, 9382, -5131, -4911, 10313, -12075, 947]
1823I47N716j8486J7947o816r198J9991j5558j071J6000j9467J1190N124j9262
1836a2943J9806n532j0672J8098j4422R72J5402k0250R491P195j8163J8398o836
1849E44j0300K0123j4525j93J3813j8441J0366O484j9143J7710m311j0951J9779
1862A0955j5649L60J4660j8257R036N899j7303J7418m205j2485J9696j3592j54
1875c621J3870j8868J0091O165j7043J5448l685j1227J9423j3727k308J6000j8981
1888h463J0347M898j6994J6441l322j1184J7584j2626j654J5766j9100Q718O286
1901F697j6465J5917m754j0447J8150j1551k975J5152j7610Q647O981j8008J6025
1914E759l626j0408J6946j1898k175J4814j6687P044P769j7660J6120l364j1436
$$ y = [947, 6663, -11823, 6124, -692, -9890, 10101, -5457, -6528, 9472, -9995, 1195, 6319, -12943, 6863, 1331, -9341, 8757, -5665, -4693, 10709, -9541, -50, 7145, -11018, 7380, 544, -9756, 10367, -4158, -4351, 9462, -8979, 1387, 7871, -11272, 6438, 2127, -8824, 10955, -4694, -4334, 10326, -7931, 1105, 7004, -10299, 7119, 2914, -9571, 10125, -3467, -3621, 10249, -8619, 1472, 7637, -9406, 6042, 2357, -8870, 10553, -3174, -5482, 10518, -8463, 1884, 6782, -10212, 6229, 2907, -8277, 9307, -3319, -4973, 10793, -8307, 411, 6697, -9768, 6149, 1395, -9052, 9098, -2453, -5428, 9724, -7886, 761, 7742, -10266, 5759, 2133, -8275, 8671, -3227, -5402, 9412, -7275, -231, 7538, -10122, 5998, 2634, -8802]
1927h802J7750j1613j721J3630j6424O795P754j7406J4678k373j1021J7706j2487
1940c534j615J4266j5538O198P146j6281J3981j420j2540J7756j1486k497J4584
1953I020j7324P624P138j5027J2731j080j2167J7421j0087m256J4374j5632O530
1966g35O878j5436J2743p83j0391J4578q879l365J4576j5168N562P394j5224J2749
1980D499k857r672J5120q674m235J3810j4544N464Q629j6174J2862j070j0553
1993g395J5668r841l484J4157j4252M072Q952j6329J2946o79j1943J6282r293
2006a139k887J3220j4132M849Q567j5459J1751m36j1845J6418r774l852J3618
2019H899j3542M355P910j4931J1476J115j2611J5569q961l649J4078j4691M174
$$ y = [-8802, 8948, -2665, -4386, 9244, -7180, -385, 7369, -10037, 4641, 2268, -8753, 8953, -3534, -5149, 9117, -6421, -223, 6923, -9358, 4623, 3203, -9337, 8419, -3067, -5564, 9020, -8304, -680, 6458, -8569, 4162, 3082, -9085, 8336, -1751, -6007, 8367, -7265, -735, 6143, -9293, 3450, 2667, -7724, 6854, -2025, -5390, 9186, -5982, -420, 6974, -8250, 4499, 1642, -8030, 7090, -1584, -5819, 7991, -6553, -1089, 7540, -8634, 4228, 3158, -7395, 8273, -1568, -5052, 9105, -5147, -1075, 7877, -8452, 4494, 3815, -8128, 8154, -1139, -4026, 9194, -4938, -89, 8478, -6981, 4770, 4334, -7511, 8907, -867, -4719, 8899, -4643, -288, 7622, -7309, 4167, 5282, -7329, 8240, -721, -4370, 9708, -4983, -809]
2032h09P809j3961J0374K12j2095J5189p114n332J4083j3914M901P750j4979J0698
2046B812N26j1025J3592p516n359J4403j3459L552Q151j4598J1514J03j1250J3912
2060E358o347n056J3243j3082K801R609j5368J0612J74j0833J4267p089n116J3206
2074F379j1307K519Q888j4742J0650J195j1652J3853p552l892J2792j2097K005
2087b961R100j3526R468J839j1891J4791o766n009J2633j1848L243Q080j3918
2100f765Q857K255j1612J3520o845m957J3931j2054K643P780j2561Q901K057j1721
2114f571J2640n229o229J3551j2591K693Q946j3443Q697J598j0426J2364m890
2127A110o823J3860j1191J891Q397j4140R644J614j1136J1926n027n314J2745
$$ y = [-809, 7000, -6961, 3413, 3625, -8470, 6719, -395, -5727, 8356, -5558, -657, 7093, -7886, 2812, 3338, -7687, 5905, -1611, -6970, 7433, -6026, -2474, 5677, -8921, 2593, 2696, -8554, 5358, -989, -6045, 7198, -5884, -3083, 6526, -8842, 1770, 1944, -8889, 5378, -1711, -6827, 6379, -4928, -2409, 6479, -8263, 2387, 3582, -8070, 5783, -1769, -5661, 7131, -4966, -2961, 6139, -7387, 2081, 3920, -7971, 6820, 54, -4955, 7678, -4170, -927, 7153, -6765, 2092, 4347, -7265, 6255, -590, -5547, 8384, -3670, -1027, 6753, -5808, 3093, 5150, -6571, 6069, 840, -5389, 8162, -4429, -1736, 7210, -6233, 2464, 4062, -6364, 6000, 1110, -5713, 8147, -3044, -1153, 7244, -6896, 2748, 4362, -6774, 5152, 125, -5189, 7556]
2140G556j0934J079R279j2962Q746J629j1417J2903n530n534J1599r983J311Q927
2154F669j3435Q115K697j1029J2547n486n163J2142r785N84Q618j2426P692K422
2168D162j1840J2570m957n217J1821j0310J442Q618j1862O744L186j1256J2202
2181E303m641o770J2832j0531J462P930j2076P353L236j1340J1498l644o221J2534
2195F925j0638J044Q588j1747P169J896j0406J0831l344o552J2202r661O36R389
2209F332j2550P320K637j0080J0562l880o155J1704q638n24R013j1993P329K499
2223C576j0549J0974l321n696J0854q505j90R510j1735N973L290j0823J1315m043
2237F30n852J0935p892k50Q881j1353O044M051j1275J0911l478n918J1264q855
$$ y = [7556, -3378, -2299, 6980, -5982, 2764, 4393, -7024, 5879, 349, -5185, 6414, -3569, -2258, 6669, -6766, 1349, 4046, -6983, 5564, 78, -5085, 7057, -2728, -2144, 6474, -5952, 1740, 4162, -7678, 4892, -65, -5282, 6539, -3771, -2329, 6289, -5573, 1171, 4357, -6899, 5303, 662, -6108, 6724, -3807, -2345, 5585, -6491, 862, 4098, -7242, 4256, 612, -5609, 6925, -3713, -2669, 5919, -5828, 1341, 3237, -7169, 3662, 318, -6234, 5968, -3693, -3057, 6332, -6218, 1102, 3739, -6341, 4221, 341, -5814, 5890, -2748, -3272, 5741, -6252, 1077, 3576, -6973, 4001, 680, -5016, 5838, -2667, -2857, 6653, -5082, 891, 4181, -6642, 4673, 630, -5222, 5713, -2179, -2429, 6452, -4901, 1143, 5194, -6081, 4830, 1352, -4566, 6698, -2157]
2251b157l02Q752j0818N438L668j0727J0789k661o973J1458q481L61Q223j0918
2265d348N128L771r964R038k335o861J1781q468k37Q225j0854O114L310r887R108
2280C521k061o978J1070p908j126R286j1092N630L081r592R485k329o339J0598
2294E246o814j407R100j1339N536L561j0025R364k644n952J0048o643j454R120
2308E697j0505N050L931j0413R845k276o524J0220p400m28Q265r866M227M749
2322D572j0813R421j863o302J0506p271p39P856r228M156M431j0256Q663j420
2336A713p052J0888p361r12Q377r762M423L684r135Q425j311p058J0571o743j240
2351b493Q095r785M410L899r454Q045q49o852J0482o804j744Q942r991M471L666
$$ y = [-2157, -2459, 6293, -4525, 913, 4581, -6146, 4643, 1982, -4991, 6467, -2014, -1653, 6570, -4348, 780, 4551, -5413, 3625, 1290, -5571, 6210, -2258, -2495, 5730, -5124, 990, 4300, -5587, 3521, 1460, -5518, 5552, -2356, -3482, 5804, -5288, 342, 3423, -6169, 3316, 987, -5352, 5246, -1568, -2975, 6125, -5214, 322, 3883, -6142, 3222, 578, -5374, 4674, -1969, -3423, 5697, -4808, 242, 4173, -6240, 3605, 1329, -5195, 5025, -2375, -2803, 5462, -4404, -177, 4572, -6241, 3180, 1317, -4985, 5521, -1750, -2489, 5367, -3861, 295, 4726, -5530, 3133, 1713, -5339, 5549, -1812, -2724, 5653, -4109, 314, 3998, -5137, 3288, 1977, -5081, 5490, -1253, -2493, 5602, -4183, 227, 4126, -5328, 2717, 1868, -4984, 5498, -1306, -3050, 5892, -4099, 372, 4038]
2366D038r292Q074r46o777R642n787k109Q943r962M081M357r270Q028j154o304
2381d438R172n719k255Q464q858L354M564r958Q493j156o495R522n893j695Q263
2396E365q770K918M677r456Q056j159o820R757o106j600P890q575L172M888r636
2411e399P642o40o773R921o108j745P969q689L007M385q689O863j60o930R764
2426D418n628k046Q372r111L268M508q601O738k18o866R251m973k765Q450q458
2441c661L095M352q487O764N4o492Q521m792k640Q611q777L046M703r015P258
2456B540q55n860Q308m572k721Q234q296K904M802r219P253m32o343Q656n035
2471f36k256P774p399J794N255r130O770J4o789Q916m934k101P356p532K289M906
$$ y = [4038, -5254, 2820, 1874, -4903, 4739, -1048, -3157, 5786, -4176, -95, 4262, -5008, 3020, 1866, -4438, 4734, -985, -3240, 5224, -3634, -280, 4284, -5674, 2819, 1663, -4832, 4690, -1203, -2898, 5365, -3405, -487, 4190, -5266, 2790, 1631, -5189, 4568, -1538, -3138, 4752, -3823, -651, 4237, -5399, 2243, 1603, -5170, 4751, -1357, -3102, 4867, -3822, -815, 3570, -5119, 1744, 1584, -5346, 4418, -1210, -3256, 5116, -3995, -727, 3781, -4820, 1918, 1700, -5166, 4085, -888, -3653, 4797, -3661, -566, 3786, -4701, 2063, 2117, -4375, 4146, -646, -3286, 5325, -3452, -406, 4297, -4718, 2540, 1685, -4175, 4133, -439, -3160, 5074, -3222, -318, 4484, -4735, 2518, 2086, -4257, 4399, -636, -2892, 4882, -2517, -723, 4532, -4598, 2172, 2186, -4603, 4313, -621, -2722, 4634, -2898, -609, 4297]
2487D297q680O072N27o859Q749m633k588P623p537K755M260q469O220P60p066
2502d569Q378m289k686Q048q072K329M514p733N507P95o924Q246l865l061Q158
2517D776p783K277M482q006N861J83o178P627l443l099Q064p569J701M987q283
2532d403O283K02o355P444k991l414P658p071J576N182q432O194J03o416P987
2547C547l842k636P317o759J230N280q318N650Q94o793P939m118k264O992o312
2562b193Q29N183p716N262R21o693Q184m004k921P084o569J509M760p546N120
2577A210J122o761P756l549l183P886p074J671M585p443N102J068o314P321l227
2592A70l390P662p037J612M876p649N187R44o076O783k799l385P466o309P93N373
$$ y = [4297, -4383, 1689, 2216, -4643, 4106, -527, -3115, 4508, -3029, -274, 3986, -4483, 1737, 2497, -4569, 3809, -480, -3166, 4882, -3190, -861, 3653, -4080, 1427, 2222, -4702, 3544, -321, -3382, 4776, -3007, -730, 3752, -4254, 1607, 1790, -4388, 3239, -204, -3303, 4761, -2808, -1107, 3880, -4403, 1880, 2082, -4273, 3171, 180, -3234, 4424, -2647, -1071, 4111, -4321, 1873, 1976, -4440, 3547, -295, -2931, 4386, -2373, -1143, 4137, -4181, 1469, 2363, -4430, 3509, -609, -2873, 4119, -2193, -1364, 3819, -3897, 1365, 2286, -4407, 3777, -227, -3148, 3936, -2633, -1124, 3636, -3910, 1210, 2332, -4429, 3327, -222, -3405, 4481, -2593, -922, 3663, -3780, 1322, 2390, -3924, 3397, 170, -3220, 4442, -2595, -983, 3893, -3756, 1431, 2375, -3701, 3082, 283, -3102, 4364, -1945, -1152, 4221]
2608D221q021N254Q14n988O789k944l038P020n875O11N358p801N023R29o096O998
2624C254l212k716O538n753N14N162p406M591J143o365P673l436l185O800n923
2639b321R07M714o880M392J294o452P150l103l117O954o099R69M944o979M020
2654C93J635o280O794k682l350P127n811J100M312o862M366J280o212O645k285
2669A70l550P009n600P05M776o829M274J256n781O197k200l387O823n469L65M961
2685C720p051M530J153n489N895k160l275O703n284j90N519p176M089J680o228
2700c564O523k576l120O464n031J14M825o663L767J846o178O746k793l167O305
2715C498n032R5M811o355L394K031o252O339k096l232O246n235M99M421o189L464
$$ y = [4221, -3800, 1454, 2268, -3720, 3069, 125, -2913, 4107, -1768, -1157, 4201, -3600, 1423, 2352, -3744, 3254, 42, -2674, 3864, -1889, -1375, 3787, -3619, 972, 2115, -4250, 3423, -13, -3198, 3602, -2321, -1414, 3300, -3580, 812, 2106, -4346, 2804, -299, -3416, 3538, -2561, -1592, 3352, -3627, 393, 2028, -4252, 2542, -140, -3490, 3637, -2174, -1074, 3238, -3624, 742, 2022, -4190, 2455, 170, -3380, 3629, -1971, -1266, 3510, -3319, 955, 2211, -3570, 2627, 427, -2960, 3863, -1606, -1241, 3720, -3331, 1199, 2352, -3137, 2758, 598, -2677, 4026, -1258, -1448, 4071, -3105, 984, 2664, -3564, 2959, 383, -2737, 3727, -1304, -1190, 3635, -3028, 739, 2585, -3593, 3153, 360, -2807, 3498, -1534, -1439, 3372, -2983, 411, 2442, -3810, 2529, 433, -2799, 3447, -1788, -1289, 3132, -3057, 407]
2731D07J830o181O056j588l857O947n539O16M439o287L823J427n556N572j494
2746F15l764O654n301K64M902o463L766J451n370N366j265l936O546m717k57M958
2762C449o559L729J648n410N275j570l286O028m383m59N040o440L361J854n834
2777c557N759k023l108N801m372m88N170o236L178J925n599N794k017l191N978
2792C014m509k22M874o198L022K061n835N809j848l201O302m635m2M349n565K757
2808A33J969n520N447j364l876O516m695j94M852n953L172J961n526N106j049
2823I79l735O174m658j2M637n941L212J688n034M848r52l721N684l962n54M954
2839C607o281L411J567n196N172j323l535N565l827p06N045o002K857K072n535
$$ y = [407, 2237, -3944, 2112, 524, -3333, 3614, -1925, -1309, 3130, -3157, 666, 2093, -3463, 2109, 615, -3149, 3505, -1796, -1532, 3370, -3093, 673, 2124, -3246, 2120, 855, -3081, 3465, -1252, -1509, 3449, -3110, 619, 2267, -3143, 2132, 562, -2724, 3304, -1079, -1538, 3502, -2938, 423, 2277, -3557, 2202, 179, -2929, 2872, -1500, -1988, 3182, -3054, 124, 2049, -3550, 2244, 227, -2964, 3014, -1495, -1717, 3157, -3041, -19, 2042, -3793, 2016, 168, -3033, 3269, -1366, -1408, 2941, -2624, 133, 2102, -3418, 2029, 665, -3211, 3305, -1390, -1584, 3268, -2685, 487, 2448, -3078, 2028, 979, -2756, 3418, -1240, -1252, 3385, -2556, 656, 2344, -2690, 2158, 1206, -2515, 3169, -793, -1347, 3607, -2674, 737, 2304, -2892, 2280, 957, -2578, 2987, -840, -1546, 3499, -2503, 354, 2426, -3109]
2854c109N059j448k907N414l927n42M681n853K974K071n853N433j461l287N603
2869B848m092m99M819n570K367K438n808N301j112l735N823m202j95M415n073
2884b275K202K557n818M907p65l811N646m042j72M576n691K801K176n232M429
2899A488m61m188N969l995n75M983n926K763K140n089M467o71l822N644l423j256
2915a952N102n507K545K043n489M863r33l343N171l232j063N311o023K595K452
2930B540n575M760j095l347N397l309j271M929n150J836K801n759N025j151l274
2945b643N335l502q45M289m791J912K809n582M435l62l892N738l745o58M299m747
2961a950J673K650n341M074L6m011N760l809p72M849n180J723K783n403L953K47
$$ y = [-3109, 1950, 502, -2405, 3009, -918, -1460, 3221, -2632, 342, 2413, -3440, 1993, 532, -2755, 2848, -1244, -1743, 3076, -2494, -127, 2311, -3497, 1804, 692, -3043, 2780, -1422, -1617, 2798, -2275, -73, 2484, -3334, 1573, 808, -3003, 2643, -1399, -1571, 3005, -2686, 115, 2291, -2941, 1488, 1027, -3161, 2808, -1187, -1762, 3221, -2705, 58, 2198, -2891, 1576, 905, -2917, 2727, -696, -1952, 3150, -2357, 188, 2231, -3258, 1605, 672, -2671, 2500, -732, -1795, 3516, -2507, 88, 2540, -3035, 1725, 630, -2717, 2680, -629, -1900, 3029, -2121, -285, 2516, -3243, 1782, 631, -2643, 2692, -810, -1655, 2634, -2157, -245, 2564, -3018, 1417, 1055, -2837, 2901, -844, -1502, 2797, -1950, -277, 2373, -2968, 1106, 1142, -2869, 2891, -918, -1690, 3159, -2021, -298, 2485, -2918, 1035, 1282]
2977A282m302N619l304j278N030n170K069K545n272M335l07l894N261l109j310
2992a805N089n435J920K615n195M377l61l755N046k711j751N056n222J729L221
3007B818n785M428m88l629N210l019j322M657m690J160L333n548M165j92m086
3022b988N467k991j197M282m517J397K942n174L898J92m501N810l232j188M462
3037B662m505J281K922m962L432L65m408N718l009j501M906m760J406K658m890
3052b685L983O0m357N447k875j500M794m880J836K660n164L690M94m196M997k407
3068a03k010N250m787J393K929n340M014k2l856M824k362j685M761m596J017L063
3084B490n218M087R3l786M640k525j674M489m171J060L273n692L757K47m080N253
$$ y = [1282, -3020, 2599, -705, -1983, 3047, -2123, -54, 2491, -2781, 1554, 1247, -2647, 2614, -495, -1805, 3284, -2151, -231, 2384, -2811, 1566, 1205, -2550, 2496, -215, -1966, 3090, -2132, -403, 2818, -2967, 1461, 973, -2656, 2554, -465, -1787, 2870, -1820, -660, 2673, -2875, 1290, 1098, -2988, 2479, -512, -1709, 2573, -1944, -547, 2395, -2779, 1119, 1311, -3190, 2620, -612, -1800, 2662, -1843, -562, 2360, -2602, 830, 1195, -3213, 2505, -504, -2005, 2901, -1859, -453, 2205, -2685, 1298, 1358, -2999, 2448, -427, -1927, 2867, -2013, -177, 2483, -2681, 1009, 1503, -2693, 2304, -103, -2113, 3137, -1650, -257, 2672, -2668, 1346, 1324, -2532, 2292, -70, -1755, 3006, -1590, -573, 2490, -2728, 1359, 1452, -2334, 2306, -219, -1893, 2596, -1575, -515, 2758, -2934, 823, 1070, -3010, 2243]
3100B243k801j630M702l915O97L328n355L457O21m337N211k839j570M848m112
3115a452O81K934m724L092P34m140N176k590j836M856m446J166K815m602K823
3130D87J037m486N059k113k144N124m801J241K972m759L114P43m136M479j869
3145e2k298N194m311R37K968n146L475P33m045M304j574k301M720m039M06L612
3161B583m993L278M45l889M530j819k238M607l779K22L826n251L332O03m174N046
3177B329k185j926M408l687K48L343m722L005P89m341M854k054j780M374l962
3192a307K16L669m559K774J074m639M870j646k580M788l960R30K933m680K814
3207F97J248m332M397j460k557M963m107O52K961m780L055Q08l953M166j376k598
$$ y = [2243, -558, -2188, 2514, -1401, -704, 2624, -2731, 726, 1347, -2990, 2221, -618, -2188, 2660, -1452, -771, 2163, -2561, 531, 1265, -2875, 2301, -289, -2125, 2731, -1715, -549, 2266, -2336, 487, 1524, -2962, 2097, -16, -2160, 2964, -1837, -596, 2376, -2383, 731, 1474, -2662, 1817, -52, -2350, 2844, -1467, -530, 2438, -2708, 767, 1500, -2545, 1759, 185, -2116, 2604, -1435, -1029, 2583, -2410, 868, 1313, -2576, 1954, 135, -2103, 2504, -1275, -1053, 2773, -2478, 854, 1457, -2717, 2329, 144, -1782, 2626, -1061, -813, 2530, -2192, 813, 1602, -2739, 2115, 61, -1719, 2655, -1307, -1091, 2578, -1981, 793, 1867, -2772, 2098, 452, -2128, 2660, -1300, -370, 2563, -2117, 697, 1945, -2387, 2010, 550, -2007, 2956, -1151, -499, 2462, -2318, 737, 1545, -2408, 1758, 382, -2216]
3223b216N032l907K05L389n045L098Q61l820L869j103k718M859l555l33L827n087
3239b644L107R31m239M662k109j972M563l401j87L565m703K833J113m396M949
3254B072k037k023M207l196k47L799m829K345J533m487M547j824k157M774l694
3269a217J33L348m296K226J556m589M658j545k821N141l817L12L281m593K463
3284B40J446m163M243j273k779M942m037M61L260m435K435J332m110L848r23k681
3300b194M541l602k20M146m848K573J082l817L644p24k729M376l109l47L987m626
3316a867K345J392m336M140j087k544M242k865q93M075m718K295J583m451M163
3331A474q80k577M331k965o32M077m589J946J832m388L998r72k749M291l077M
$$ y = [-2216, 2816, -1091, -886, 2503, -2542, 556, 1417, -2403, 1466, 363, -2355, 2504, -1051, -1384, 2443, -2644, 463, 1394, -2845, 1817, -292, -2264, 2299, -1102, -1289, 2276, -2427, 406, 1519, -2877, 2072, 35, -1988, 2219, -977, -1224, 2575, -2254, 91, 1624, -2863, 1684, -140, -2297, 2477, -1217, -1084, 2264, -2032, 194, 1750, -2839, 1819, 274, -2547, 2594, -1223, -911, 2370, -2223, 240, 1686, -2477, 1766, 493, -2286, 2656, -1381, -920, 2340, -2095, 340, 1672, -2438, 1410, 487, -2194, 2347, -1255, -1475, 2671, -2177, 396, 1478, -2339, 1305, 581, -2148, 2228, -881, -1228, 2759, -1867, 478, 1870, -2466, 1674, 587, -1957, 2285, -580, -1473, 2602, -2116, 179, 1762, -2689, 1474, 594, -1983, 2348, -617, -1249, 2828, -1761, 185, 2017, -2371, 1627, 655, -2094, 2197, -880, -876]
3347h76L188m101J798K046m408L925r05k834M582l284j73L537m321J940J910m208
3363b184L702q10k975N012l502l79L443m192K069J520m044L501k99l136M501k975
3379g48q05L906m323K037J497l949L524n39k957M490k822q38M003m517J961J883
3395A803m527M054p54k958M047k558q66M157m331J601K371m779M151q75k702M128
3411A962k264r30L752m261J258K388m287L507O15m152N020l417m02L897m453J489
3427b78K360m605L917J61m224N131l008r48L962l793J000K403m423L604m7l429
3443b217M521k599j013L789m177J636J596l497K938P9l316M519k715j130M044
3458B458m295J816J852m131L250j47l097L814j966j274L980m219J701K207m104
$$ y = [-876, 2312, -1789, 9, 2055, -2353, 1572, 667, -2167, 2415, -869, -1042, 2495, -1826, 114, 2024, -2184, 1518, 708, -2267, 2745, -757, -1136, 2307, -1885, 184, 1704, -2340, 1161, 862, -2274, 2227, -748, -1553, 2353, -1970, 67, 1564, -2385, 1139, 600, -2357, 2133, -689, -1527, 2476, -2041, -80, 1803, -2724, 1330, 576, -2382, 1665, -893, -1759, 2398, -1933, -332, 2039, -2740, 1411, 536, -2166, 1962, -302, -1232, 2520, -1741, -483, 1905, -2382, 1125, 1740, -2412, 2608, -809, -1211, 2686, -1767, -278, 2082, -2523, 1394, 1555, -2669, 2462, -546, -1494, 2468, -1325, -325, 2078, -2345, 1259, 1212, -2217, 2304, -295, -1308, 2481, -1696, -60, 1536, -1961, 977, 1056, -2260, 2259, -456, -1586, 2458, -1837, -21, 1831, -2300, 950, 803, -2294, 1520, -446, -1720, 2260, -1959, -258, 1949, -2155]
3473b155L279m60k853L937k332j339M248l896O56K769m278L392P2l203L951k267
3489d79j090L980l781J042K307m147L095r1l214M369k131j356L747l691J177K493
3505B230m330K947L70l308M209k061j293L662l654R85K272m174K966L87l247M259
3521B220k412j163L557l698J202K322m063K828N74l326L878k027j761M201l753
3536a421P55K435l880K675N41l394L768j888j319L906l539Q35K472m079K734N94
3552A195l402L754j358j834M032l782P91K677m218K595J066l665L920j468j857
3567a554L896l498O91K516m032K790K27l216M030j808j343L366l028M40K695l993
3583a821K589P40l811M165k039j358L490l098N34K349l653K393P47l443M044j768
$$ y = [-2155, 1124, 664, -2189, 1748, -584, -1923, 2325, -1571, -915, 1854, -2424, 968, 1040, -2163, 1788, -479, -1569, 2411, -1370, -328, 1979, -2168, 927, 836, -2378, 1991, -140, -1496, 2251, -1440, -263, 2230, -2100, 847, 1217, -2091, 2118, 57, -1236, 2426, -1228, -243, 2029, -2145, 821, 1208, -2039, 2220, -192, -1355, 2202, -1496, -294, 2028, -2035, 793, 1367, -1959, 1919, -108, -1869, 2332, -1421, -666, 1769, -2111, 564, 1105, -2289, 1479, -409, -1728, 2178, -1361, -526, 1946, -2133, 601, 1195, -2207, 1547, 189, -1645, 2387, -1395, -604, 2073, -2145, 450, 1516, -2149, 1771, 303, -1554, 2342, -1156, -465, 2051, -1981, 809, 1036, -2180, 1850, 42, -1301, 2065, -963, -523, 2172, -1821, 768, 1508, -2303, 1862, -177, -1535, 1955, -1143, -609, 1740, -1913, 480, 1227, -2216, 1828, 60]
3599F0j872L894l378L89K648l793K328Q45l576L722j198j811L776l265L31K754
3615A854l902K362P00l220L392j352j789M027l421L62K944m076K619M70k918L247
3631A299q59k201L838k993K14K611l990K510Q92l354L340j137j660L709l103L04
3647e80K913m083K044J178l511L641j352j763L572k563r4K709l863K442O08l178
3663a880L698j580j586L230k773L76K284l383K082J050l877L831j018k353M103
3678B204l206L76K606l792K050J153l509L442q79k299M035l281L67K631l612J891
3694A77J080l259L314q38k480L995k792j14K831l788K224J124l545L307o43k137
3710a544L436k691r1L107l877J938J164l289L165j189j787L464k277n64L337l924
$$ y = [60, -1812, 2082, -1296, -907, 1741, -2052, 276, 1121, -2455, 1267, 69, -1742, 2034, -1231, -900, 1854, -2048, 314, 1014, -2206, 1186, -166, -1955, 2072, -1349, -987, 1957, -2119, 500, 970, -1948, 1299, 440, -1761, 2077, -916, -702, 1909, -2081, 429, 1321, -2033, 1307, 170, -1490, 2219, -884, -580, 2333, -1750, 294, 1472, -2039, 1602, 250, -1513, 2059, -504, -598, 2111, -1752, 690, 1298, -1880, 1818, 238, -1348, 1882, -891, -515, 1769, -1614, 468, 1518, -2359, 1472, 454, -1899, 2204, -1002, -626, 1980, -1812, 238, 1391, -2118, 1324, 445, -1854, 2181, -1100, -733, 1898, -1714, 177, 1257, -2002, 1312, 474, -2006, 1989, -803, -917, 1914, -1874, 350, 1474, -2071, 1236, 593, -1544, 1892, -799, -890, 2217, -1660, 278, 1442, -1847, 1318, 129, -1658, 1806, -471, -1035, 2302, -1622]
3726a622J780J572l870L545j169j662L438k426m76K907l545J424J498l496L433
3741A331j066j958L685k774j91K581l168J640J449l664L182n66k260L765k805
3756h19j55K799l390J774J208l345L061n43k493L620k393k64K716l568J862J224
3772A294l056K562m53k375L692k151n71L124l588J685J272l330K767n91j773L210
3788A718k142q01L186l567J847J301l660L405j032j859L289k096q27L210l531
3803a559J502J723l675L437r77j840L117k095p68K888l034J106J904l662L209
3818A276o23k414L316k245l90L042l286J002J904l447K784m39k139L583k711k95
3834a082K771l298J645J300l136K788m46k248L257k309l71K931l236J362J351
$$ y = [-1622, 158, 1730, -2140, 1405, 236, -1426, 2012, -414, -890, 2017, -1528, -104, 1394, -2102, 1331, 265, -1693, 1992, -782, -973, 1608, -1560, 80, 1529, -2135, 1047, 481, -1779, 1986, -819, -974, 1825, -1565, 209, 1417, -1928, 1133, 590, -1903, 1717, -676, -940, 1776, -1792, 70, 1294, -1762, 800, 347, -2028, 1664, -487, -1058, 2066, -1522, 163, 1435, -1895, 872, 281, -1492, 1718, -424, -1225, 1961, -1606, 241, 1542, -2118, 1287, 255, -1604, 1685, -411, -1238, 1972, -1559, -57, 1666, -2009, 1428, 451, -1389, 1728, -367, -1135, 1753, -1281, -175, 1729, -1933, 1276, 653, -1761, 1555, -690, -1080, 1962, -1324, -322, 1582, -1865, 919, 480, -1659, 1924, -787, -1082, 1689, -1609, 36, 1336, -1800, 988, 542, -1706, 1551, -758, -1129, 1802, -1434, -72, 1279]
3849A279l031K450N2k321L311k198p97L216l429J395J387l100K517J9k456L129
3865A423j533q47L049l445J356J599l394K828n90j924L009j548j143L012k896
3880a044Q68J683l194K721l83k153L139j813r19K862k770J005J630l198K558j48
3896H44k306K835j670m60K610l017Q13J774l108K357K25k699L379k020o37K858
3912A778l060Q58J837k921K040J25k466L147j666q68K911l014R78J749l371K635
3928F92Q9k335K762j476r15K876k979R58J913l176K219J29k557L084j286j193
3944a195K966k872O64K020l177K255K2k278K729j022j538L261k706M22K042l391
3960a798K383L00k407K973j622j042K805k523M29K193l224J795M40k516L186j717
$$ y = [1279, -1752, 698, 750, -1571, 1740, -458, -1255, 1961, -1468, -73, 1314, -1786, 731, 750, -1706, 1423, -110, -957, 2092, -1353, 3, 1602, -1792, 1036, 446, -1478, 1531, -17, -1160, 1852, -1044, -176, 1507, -1687, 1034, 651, -1502, 1637, -176, -1095, 1767, -1003, 2, 1632, -1566, 992, 844, -1462, 1373, -297, -757, 1853, -1164, -351, 1423, -1685, 672, 897, -1802, 1577, -443, -1080, 1778, -1282, -424, 1413, -1508, 532, 657, -1809, 1338, -328, -1196, 1715, -1299, -321, 1428, -1943, 692, 781, -1554, 1208, -268, -1183, 1693, -1286, -328, 1585, -1591, 628, 757, -1800, 1284, -2, -1195, 1771, -1101, -437, 1583, -1594, 661, 683, -1595, 1134, 112, -1426, 1835, -871, -449, 1593, -1798, 585, 885, -1522, 1451, -171, -1213, 1592, -931, -502, 1691, -1533, 262, 702, -1814, 1372, -345]
3976c45q98K722k336L44J962k972K004K94k561L024j373j258L174k572L41J681
3992A231k604J670O31k612K721q49j568L133k495L22J947k969J675O81k501K754
4008A167j054j419L077k589L27K119k970J645N51k277K746j048j461K658k215
4023g43PK244k832J684N64k460K659q73j425K787k137J28J988l170J862O49k236
4040a304K229q35j168K600k120m65K681l130J558N85k672L448j692j129L041j765
4056a38o25K212k630J500Q60l029L302j712p39K248j540L60J112k171J164P71
4072I45k314J797n8j956K863j996Q41J542k961J339R58k992K931o53j666K864
4088A484j837m32K334k671Q77R59j854J764K80k430K869k204j13K559k858J758
$$ y = [-345, -1243, 1479, -857, -513, 1449, -1523, 481, 775, -1786, 1238, -135, -1393, 1781, -791, -450, 1231, -1373, 297, 928, -1684, 1037, 188, -1380, 1753, -742, -420, 1527, -1442, 233, 914, -1587, 1167, 113, -1306, 1771, -818, -491, 1628, -1342, 303, 854, -1423, 1323, 275, -1186, 1472, -743, -736, 1508, -1324, 360, 924, -1536, 1123, 250, -1175, 1612, -525, -397, 1591, -1579, 283, 932, -1304, 925, 90, -1078, 1522, -598, -1063, 1618, -1512, 46, 631, -2041, 1407, -285, -1414, 1627, -138, -763, 1449, -1181, 319, 1179, -1850, 1452, -260, -999, 1249, -291, 69, 1181, -990, 174, 945, -1369, 428, 370, -1586, 1277, -719, 122, 1664, -1297, 42, 1000, -1992, 939, 286, -1380, 1484, -353, -785, 1549, -1122, -245, 714, -1140, 624, 904, -1526, 1343, -861, -974, 1585, -1273, 485]
4104D85J58k051K272o47j339K272j863r8K215k806J613Q34k706K707r95j363K719
4121A407j974j17J914k284J302O90k499K433p10j267K558j925q0J788k368R88
4137a44J381k928K513n24j456K713k104P8J868k194O95J145k528K316k51j942
4153a362K489j549m64K338k326J040J079k212J642n60j137K754k186n2J711k454
4169a249J379J136k564K242p58j202K595j789o35K268k290R81P19k354J758j93
4185D4j024K670k515m23L150k834R70R29k602K237l52j268K556j808o39K344k486
4202a051R37J247k698K313n54j245K121j492m58K177j886M03J338k587K062k27
4218D00j638K609j869l12K155k119Q85J112k436J897j18j624K193j623k25K052
$$ y = [485, 643, -1408, 864, 217, -1122, 1150, -713, -811, 1404, -1402, 211, 1045, -1661, 1046, 51, -1312, 1407, -567, -684, 1230, -1054, 248, 938, -1561, 872, 162, -1105, 1453, -472, -552, 1236, -1132, -144, 1237, -1691, 822, 298, -1158, 1555, -549, -471, 1397, -797, -102, 1043, -1485, 831, 580, -1362, 1127, -422, -886, 1452, -874, 166, 1245, -967, 675, 115, -1022, 1732, -454, -506, 1205, -1249, 130, 1266, -1298, 944, 186, -1016, 1579, -210, -845, 1423, -867, 114, 833, -1521, 237, 44, -980, 1690, -825, -1248, 1902, -932, 38, 967, -1635, 602, 250, -1018, 1538, -270, -909, 1435, -1051, -114, 1133, -1565, 748, 194, -1051, 1070, -422, -880, 1297, -589, -186, 1152, -1435, 627, 400, -1238, 1371, -498, -810, 1345, -774, 111, 1223, -1213, 684, 566, -1058, 1135, -488, -713, 1339]
4234A339j911M20J090k102J725j08j661K435j446m29K015k322J140R84k580K046
4250F35J45j860K010q78q02K186k410J067J280k573K073l89j735K407j419n18
4266g81K256k516Q36J273k478K306n81j458K326j317q37K382k104K88J506k497
4282a396J815q4j603K334j396n22K210k311Q22J042k895K739l53j589K099j259
4298c47k73J619j834M22J226k257J703M17k248K980j764p40K105j713J23J352
4314G71j817J608N02k694K573p86r24K153k072P98J039k309J350L10j636J942
4330H08p12j069K530k371O45J047k110J778n6j694K095q04r55K225j947M18J497
4347A325k549J824l84j468K104o98j091K335j938J54J519k202J549J72j790K048
$$ y = [1339, -572, -152, 938, -1164, 561, 453, -1208, 1227, -219, -648, 1367, -955, 185, 1169, -1411, 635, 780, -1080, 930, 52, -750, 1436, -974, 93, 1373, -1200, 873, 484, -1251, 1156, -263, -781, 1475, -1041, -205, 1068, -1410, 896, 315, -1143, 1183, -134, -971, 1411, -693, -405, 1101, -1396, 419, 335, -1268, 1066, -330, -852, 1358, -953, -131, 911, -1984, 755, 402, -1187, 912, -347, -620, 999, -835, -413, 813, -1444, 259, 676, -1572, 1408, -356, -1096, 1009, -704, -581, 771, -1046, 562, 1064, -1630, 943, 157, -767, 1386, -686, 112, 1151, -1158, 192, 502, -1134, 808, 96, -973, 1557, -814, -169, 878, -1232, 546, 490, -1204, 891, 87, -868, 1357, -590, -172, 1325, -1224, 600, 216, -1252, 852, 154, -937, 1398, -540, -386, 1133, -1069, 480, 652, -1138, 910]
4363I10j066r27K288j783J60J619k265J578K11j661J955j266m90K142k084N9J632
4380A012k081J208N51k051K534j120q93J954j799L82J517k025J382m7j595J875
4396H04j048o68J932j593L10J412k130J111O10j712J797q19j085K218j863M54
4412b70J205k070J574J74j747J979m17j550K063j661M04J265k116J200O59j711
4428a019J879o63j158K088j773K49J432j933J308K14j785J802p32p51J814j688
4444g16K30J405j714R84O03k010K253j106q25J803j404m1J674k246J447K67j794
4461a190K058r79n18J652j579J65J224j752J026N81j758J798m91j386K186j573
4477e36LJ660k014J011N78j742J449k76j210K124j538j40J431j691J095L25j723
$$ y = [910, -156, -1083, 1205, -578, -418, 1201, -1064, 514, 725, -936, 1019, -247, -737, 1405, -679, -620, 1012, -1069, 139, 690, -1361, 1173, 53, -840, 1114, -685, -303, 1214, -811, 571, 524, -1071, 804, -244, -912, 1020, -573, -263, 1149, -981, 130, 740, -972, 825, 6, -1079, 1139, -724, -270, 935, -1135, 439, 613, -1134, 845, 428, -1122, 941, -720, -316, 949, -1167, 33, 692, -1019, 860, 197, -961, 1127, -646, -397, 1035, -898, 410, 624, -1161, 641, -91, -842, 972, -716, -486, 919, -795, 189, 792, -1218, 1035, -71, -896, 907, -497, -538, 1136, -1110, 337, 604, -1190, 868, -111, -629, 1023, -556, -391, 833, -919, 107, 688, -1070, 728, 237, -1149, 1037, -536, -533, 1127, -887, 124, 702, -1040, 409, 133, -1077, 1047, -491, -631, 800, -891, 204, 529, -1194]
4494a194J814l56j099J822j494o0J653k097J325K35j507J540l53j033J712j364
4510d56n2J650k227J132O50j692J510o18o87J732j273j87J624j713P11O25j926
4527a197J895m31j114J803j116m45J603j886J034P89k048J850n06j042J865j114
4543f0l50J342j801Q36O64j758J807l37j425K164j674J23J498j718Q87M53j510
4560h59J377k96j306J875q43l61J361j736J020M25j583J591k88j157J711j046
4576a15m23J393j611P59O46j756J506m0j377J988j315k72J696j733P43O31j606
4593h86J560m72o85J178p87p35J815j664P86N16j673J486j26r16J367j272o4J666
4611A094j831O68Q25j766J563j56j218J727j168j12J047j270N53P19j451J039
$$ y = [-1194, 620, 264, -835, 987, -507, -567, 1086, -1011, 314, 549, -958, 582, 229, -804, 908, -456, -508, 1142, -1085, 47, 697, -995, 515, -103, -790, 942, -331, -518, 1106, -607, 104, 729, -1197, 698, 267, -847, 956, -160, -605, 998, -888, 146, 935, -1113, 737, 231, -811, 1054, -60, -410, 932, -869, -33, 631, -1127, 680, 343, -1082, 1082, -592, -469, 1029, -689, 198, 651, -859, 518, 222, -1084, 791, -52, -413, 948, -788, 232, 657, -926, 665, 377, -780, 931, -115, -538, 855, -756, 3, 649, -1107, 399, 359, -1018, 970, -345, -617, 1079, -654, 89, 720, -886, 674, 202, -483, 695, -92, -827, 988, -676, 110, 626, -1047, 439, 313, -603, 764, -508, -572, 1094, -737, -69, 756, -1010, 553, 397, -821, 906, -262, -374, 673, -597, -44, 675, -776, 263]
4627B63j08j162K095j444o2J145j478P79O51j478J084J50j337J862j119n62J617
4644H96j571N36P08j475J312n2j019J629q77o69J452j505M98P86j757J600j20
4661C72j490J657o48n30J719j684O21O14j638J408j65r70J699j260k23J444j667
4678g41L92P11j440J469O2j414K219j342n28J143j565Q45R09j741J507m33j244
4695a191K017q30o89J999j995P39Q60j874J508n3j211J549p83q28J776j203J20
4712h9Q48j284R45j20j078J744j234k22J313j312L92P50j471R86J84j216J659
4729G95q70m40J484j622O69Q47j914J318o7r84J306n28o28J465j436M58R38j956
4747a165J529nr90J181o03n04J323j317J10R95j408J098R4j095J280o01n18J540
$$ y = [263, 155, -1007, 1088, -356, -418, 727, -751, 28, 679, -799, 285, 435, -902, 960, -159, -721, 896, -675, -139, 569, -906, 406, 354, -665, 964, 87, -582, 870, -635, -137, 649, -1108, 492, 372, -1118, 539, -109, -639, 1080, -604, 17, 631, -1007, 401, 236, -734, 965, -295, -518, 926, -741, -349, 362, -1078, 391, 453, -961, 1258, -84, -612, 531, -1034, -189, 720, -1021, 486, 53, -1191, 826, -4, -693, 1306, -689, 50, 910, -964, 544, 491, -720, 829, 46, -782, 994, -209, -89, 759, -525, 420, 300, -778, 966, -268, -490, 823, -489, -97, 653, -818, 168, 352, -864, 795, -75, -515, 969, -653, 16, 863, -1051, 267, 200, -784, 522, -6, -634, 831, -605, -147, 791, -1165, 364, 359, -631, 550, -53, -557, 766, -551, -441, 554, -854, 244, 338, -757, 523, -78, -596, 944]
4765I44j500L08J208j886J305O5j398J753r15m57J346j385L93O97j192R85N2j529
4783a206J823q25n13J490j291L93Q24j400J051J90j285J337p00l16J125j286N63
4800b6O97j397J112k3j380J712r61l21J717j697K08R75j682J293J1j155J584r18
4818b51m09J742j445K83P14j282J009j12r91J426r22k65J149j100L03J062j680
4835g69J130kq90J324p50k81J142j439L04Q24j115R11J82j459J508p68m66J674
4853A060j493L90J041j807J031L05j221J446r61k76J084p96k7R14j318P56L16
4870D44j254J385m26p28J436j366R9R05j120N50M20j106J067j27r44J617j152
4887c00J95P48j405Q00k07q42J509n57o04J304j285J64J118r65J12O4n97J659
$$ y = [944, -556, -248, 960, -926, 379, 444, -954, 799, -116, -573, 773, -612, -219, 478, -714, 271, 323, -1206, 617, -208, -721, 769, -522, -129, 695, -705, 346, 536, -749, 588, -112, -428, 697, -589, -26, 671, -726, 386, 363, -1017, 695, -266, -587, 1130, -567, -359, 616, -1066, 227, 238, -917, 667, -251, -660, 1082, -363, -80, 634, -648, 361, 249, -742, 684, -238, -503, 646, -454, -151, 911, -769, 361, 359, -531, 793, 43, -238, 904, -535, -231, 593, -522, 389, 571, -888, 620, -148, -614, 1060, -433, -43, 998, -809, 222, 527, -694, 752, -209, -485, 599, -197, -224, 690, -628, 128, 444, -810, 575, 149, -579, 857, -509, -410, 495, -625, -75, 345, -761, 306, 179, -765, 852, -300, -105, 643, -762, 38, -169, -1011, 498, -59, -663, 641, -644, -480, 638, -327, -215, -151, -748, 911]
4905I11j077o21J618j253L05K34j402J243J187j686Q65r2n26J292p37l17R91j114
4923a79N15n6j767J524K04r26J867n52r85K58k81N30M98j564J922m56j315J668
4941I05j480L74P49j133Q7J222j796J737n17q57J713j349r8J100j235M39O10j142
4959f71J088l26p00J433j194J21J283j723N87L49q53Q72j78o65J197r03k43J087
4977E61j277J002L20j332J212m17o66J185r56n8J426j793J078L27j317J272l78
4994A89p50R04o85K1J126j556J212J3j350J549o62m28J119j020J24R35j292O95
5012A44K21j322J412l88r52J756j111p5R44j158N97N56j421J435o09q28J545j097
5030c51J28P85j216P27L42j264J173j22p47J466j133n0Q44j121P66L37j388J343
$$ y = [911, -166, -787, 831, -422, -117, 117, -1285, -42, 1145, -541, 324, 232, -294, 998, 261, -56, 935, -179, 336, 280, -1487, 37, 241, -685, 1182, 630, -355, -97, -378, 152, 650, -914, 1008, 552, -763, 905, -575, -201, 548, -585, -498, 724, -1072, 665, 148, -709, 1004, -345, -443, 657, -578, -139, 471, -671, 417, 91, -609, 824, -370, -249, 1034, -689, -102, 247, -606, 266, 88, -577, 620, -283, -526, 561, -716, 286, 606, -726, 486, 69, -597, 588, -368, -426, 1000, -793, 285, 612, -705, 567, 189, -561, 343, -342, -321, 805, -751, 461, 474, -876, 673, 11, -417, 702, -318, -194, 741, -551, 144, 365, -957, 455, 67, -885, 871, -240, -315, 629, -529, 68, 624, -797, 638, 29, -799, 746, -351, -223, 562, -654, 73, 415, -849, 324, 202, -545, 921, -212, -262, 582, -539, 227, 564, -824, 519]
5048E19k93o82J515j015k82P17r86N74M69j220J125lj066J221q18j26R17r65L72
5067b7N14j016J016l87o30J169p18k13J030j287O92N17j415J212m52o29J378j091
5085c37K10Q40j113N71M96j428J180k13j042J142m98l25J016r20M11O61j407J219
5103D63k18j204J440q53j2Q00j214O87L01p41N28J42p14J292r68r0J036j384O77
5122c2M54j025Q31j4j025J329r77O3J003j078N51M49j223J194j82p31J063q37
5140a87j91J295j404L87N83j398J516o13m81Q30n34j34J097j399O08O18j316R94
5158B71J1j155J466q58n1Q12j020M92O12j045O80O8j153J510r52O1P61r09K00
5177a99O48j092Q79l4j042J380q34k71J047j048O47K87j138J096m0j020J261o79
$$ y = [519, 226, -456, 1059, 44, -238, 479, -507, 67, 536, -684, 441, 438, -628, 593, -225, -351, 566, -399, -27, 487, -529, 487, 100, -530, 639, -79, -292, 738, -549, 143, 660, -755, 457, 5, -624, 754, -337, -127, 713, -400, 171, 667, -761, 419, 206, -836, 306, -192, -517, 499, -421, -10, 651, -756, 463, 245, -959, 481, -372, -384, 416, -798, -111, 190, -551, -23, 119, -595, 697, -271, -361, 675, -709, -32, 422, -603, 228, 214, -811, 518, -459, -396, 607, -471, 80, 529, -694, 500, 318, -413, 650, -187, -378, 917, -487, -100, 483, -915, 601, -12, -493, 337, -197, -331, 766, -633, -25, 593, -723, 271, 282, -873, 593, -265, -316, 496, -524, -32, 580, -465, 215, 283, -870, 640, -312, -251, 510, -399, -199, 449, -643, 236, 202, -840, 540, -294, -565, 482, -566, 81, 368, -770, 326, 286, -734, 527, -152]
5195a52q0Q64j296O87K71r56J001k30p71J050l57m50J183j165K53Q66j232Q48
5213C34j20p54R36l22m55J068r76J73O18j104J097l35n24P01l89j04P73r66j47
5232d96J286j581J303k63j028J265n53l65J029r01J39P49j314J328l68p95J209
5249F44q79n8P44j016M38Q46j597R63L63j309J636j115J20R83j371O91N46j224
5267e95R12m1r92J311o05o20J320j414N30P30j154J043l7q15R85n57m69J052j052
5286d68L38O42j033Q66k37q57J258m42o33J237r27O2Q69j155Q16j12p10Q39m52
5305i9j43Q51j050J01Q60j167Q44j0p80J030n97l49J040o63k19J030j247P27L29
5324D88j028J024p10k25J149j173M39P98j210P49N0q90R89k76q13J103q14L39
$$ y = [-152, -232, 632, -664, 23, 294, -662, 339, 109, -662, 388, 31, -419, 764, -401, -148, 718, -514, 334, 214, -540, 396, 74, -381, 687, -289, -116, 502, -602, 495, 160, -364, 337, -52, -156, 617, -349, -496, 790, -791, 512, 249, -779, 486, -67, -432, 597, -304, -165, 584, -730, 598, 230, -565, 644, -235, -293, 451, -565, -127, 719, -878, 85, 448, -861, 775, -340, -220, 763, -608, 83, 629, -595, 317, 276, -716, 595, -10, -630, 690, -724, -194, 536, -618, 425, 388, -427, 558, 1, -468, 584, -468, -130, 512, -521, 345, 108, -749, 509, 67, -566, 671, -256, -194, 675, -480, 336, 224, -486, 353, -99, -242, 609, -441, -340, 520, -647, 197, 187, -593, 437, -160, -509, 531, -132, -351, 679, -568, 159, 488, -540, 484, -226, -451, 698, -475, -36, 762, -448, 301, 351, -539, 450, 174, -639, 464, -350, -11]
5342a1M37j063P22M25j251J092k57n53J132r61K68M17r20O22L85q98Q43n24m09
5361e04J127p86N4O14j260J077l53n32R24l63n65J026r30L92O98j261O58L41r21
5380e64J000j65o06J006q96p2O83o98M75J83j138J403n24o34R85n93J62P12j122
5399d03P26M4r07R18l03n24Q95p87K08O61r49N74M20j110P23j56m01R08q16K35
5419d4P08j081N29K64r70R39k86p24J312j126L02O71r23O26K35j148J162o32m95
5438f81J479j230L99M28q80N15L57q39P93j00o24P66m56k01R02r08O07qj043J092
5458C68k37n85R47o44n0R47j655P09O01r13J084p09l79P79p04j66J391j041P1
5477a86N44r44R15o69K14N43o08m7O87p48M91j40r05J219l37n74J101r46J32Q23
$$ y = [-11, 426, -637, 85, 510, -741, 351, 94, -459, 673, -288, -20, 397, -523, 99, 484, -414, 429, -95, -504, 623, -163, -109, 505, -755, 322, -31, -563, 361, -2, -567, 459, -471, -79, 619, -642, 16, 357, -564, 436, 271, -335, 671, -225, -297, 386, -312, 163, 346, -792, 611, 87, -547, 438, -155, 7, 719, -403, 323, 367, -540, 378, 75, -449, 446, -341, -133, 528, -421, 153, 573, -537, 186, 30, -371, 537, -279, -44, 664, -417, 112, 376, -594, 345, 59, -665, 647, -479, -177, 494, -429, 197, 432, -716, 446, -186, -681, 798, -432, -33, 395, -485, 30, 387, -452, 341, 241, -383, 383, -73, -274, 628, -280, 327, 319, -724, 368, 131, -454, 493, -151, -201, 746, -909, -200, 401, -512, 572, -137, -516, 263, -441, -607, 784, -257, -186, 358, -586, 329, -340, -126, 417, -191, -238, 449, -299, 192, 52, -853, 366, 29, -545, 556, -390, -258, 565]
5497E65j064M89O06j864J154L01q81J137q26L24O96j165M45O28j190J057p55q72
5515a215J788j099N0Q47m23L81k11r56J082P47j647J398k46p02R27o70N67J67
5533G85j488Q34J41r58Q67n1k06P06j167J21O81j205O67O11o94K01m62N54P54
5552F91p49k4R14o28l5K29j175J498j626P78J178j301J77Q76r29N8N71j258J625
5571H70j436L44M98q25K90J557j596Q12l32J58K0r15N11Q80p65o66Q61q73Q67
5590B60k78j27Q95j041n8J398j505R09l68o26J460r70j128K045j541O7J062j300
5608h46J488m78p04R89Q5p64P52n65l10P96o78R9J10p75J211j76o33N36l66l4
5628b63R29r21J3P49j173R24R0q53R89q72M71N43q96P2Q57j008M14k60m59J346
$$ y = [565, -499, -10, 596, -1268, -114, 187, -694, 443, -383, -59, 637, -528, -83, 545, -645, 412, -343, -1215, 573, -526, -476, 371, -52, 329, 118, -838, 244, 991, -656, 742, 496, -206, 721, 51, 618, 785, -703, 131, 272, -686, 181, 130, -76, 630, -537, -416, 265, -940, -273, 338, -356, -155, -617, -63, 691, -58, -82, 832, 204, 169, 398, -777, 721, -905, -127, 1051, -250, -73, 803, -126, -68, 503, -755, 870, -566, -222, 276, -549, -259, 1298, -298, 514, 182, 340, 360, -555, -44, 836, 71, -595, 266, -607, 260, -18, -145, 750, -291, -349, 1049, -456, 453, 85, -541, 919, -51, -1179, 866, -675, -608, 454, -846, 642, 164, -540, 449, 534, -230, 522, -43, -353, 443, -235, -136, -26, -801, 410, 234, -399, 137, -229, -263, 666, -255, -242, 507, -666, 258, 348, -505, 484, -388, 83, 626, -270, -198, 659, -349, 65, -195, -654, 692]
5648F92l84n26P64l99K64J09p99N10l48J73J09K79m58M80r27O60L6o16L86L84
5668C89o86P82o08l68J111j273O98K92o32O43j37o04N86m1n17J122j156L67L30
5687B98r33O78K1m00L35p5k27P96r80L23P36j155Q71j53o49J014o18j32Q00r72
5707d22N79N49r87M32o0l38O07k62l99P29q98O28m6o27M70O44j143J348j325N2
5727d69O63j351J307j1n26K55O41r07N06j92K72m79N56p93P63j119R40P60j239
5746d23O19j0j61J53m89j49R64j203K09O45J25m55k50M77M96j058j52R03j177
5765i36J630k72j188R41K62k31j1O6j119J160j467J421n9j232J106n82J07K29
5783a75o19L78J111j394J092n20j09J60J16j045J158j29m51J81q8L76K51j170
$$ y = [692, 308, -218, 546, 147, 411, 520, -279, 231, -117, 56, 165, 444, -14, 466, -461, 199, 235, -381, 5, 389, -297, 485, -123, -491, 620, -653, 45, 337, -295, 348, 211, -393, 193, 152, -365, 757, -399, -32, 298, -635, 43, 64, -336, -1, -76, -303, 493, -487, -164, 572, -583, 288, 135, -514, 500, -118, -250, 550, -422, 157, 706, -281, 151, 91, -247, 360, 98, -301, 428, -470, 158, 112, -515, -45, 599, -544, 804, -521, -469, 194, -1157, 150, 139, -387, -132, 509, -398, 108, -84, 188, -291, 265, -528, 235, -884, 56, 816, -423, 196, 186, 25, 178, -311, -460, 504, -699, -490, 155, 280, -175, -425, 52, 548, -510, -662, 241, -936, 694, 422, -766, 175, 437, 206, 195, 261, -858, 302, -1165, 256, 197, -1035, 71, -511, -404, -175, -794, -416, 695, -699, 393, -127, -236, -76, 40, -1005, 153, 24, -427, -246, -334, 42, 293, -877]
5801h77J290J01q89O45j63r04J789j067L72n08r02J399p69m44J746m85k20N04
5819F18p43J89K9k27R0L19q12R93n42rL80q54M44N44o23J16j86j72N75l13k99
5840d83R24j178J120J26j088O78o83L31R39j319J94J314r71k85N49n42J331m42
5858E15r32L76l11L1N91q50O88J07n68O99n80l0L50l71K5N06n71M36J42o98Q56
5879D11n56m96J013k99l50P30p46M00J50q33Q99k72m24R46o32J41K60o21L06K93
5899C20q20Q49l53k05Q18q29J08N64p44M19j04l18N94j81n67P77n60kQ51j080
5919d63N48J82o03N55n17j95J096o46k54N97o58M52J22p35P88j91o93J060o20
5938a75j39N41n74L69J35n32N18j07k58O51n94m8N04m86L35J88j129J103j93l87
$$ y = [-877, 413, 514, -375, 270, 107, -797, 992, -75, 297, -211, -1113, 286, -483, -927, 819, 334, 114, 618, -125, 64, 93, -134, -44, 275, -537, 456, -86, -95, 285, -569, -125, 419, -204, -88, -274, -446, 129, -184, -483, 441, -737, 383, 509, -579, 99, -584, -253, 686, -633, -439, 875, -96, -381, 168, -374, 957, 515, -417, -41, -352, -321, 270, -580, 108, 215, -353, 346, -234, -264, 86, -285, -260, 246, -325, 111, 253, -445, 411, -145, -641, 372, 73, -277, 453, -293, 107, 257, -576, 323, 51, -373, 573, -59, 82, 342, -279, 27, 320, -500, 349, -4, -209, 609, -220, -112, 452, -292, 127, 23, -295, 299, 118, -449, 328, -232, -234, 617, -463, 85, 267, -336, 219, -298, -493, 603, -43, -297, 300, -358, 94, 216, -519, 269, 78, -615, 445, -175, -314, 227, -347, 22, 157, -375, 143, 36, -222, 429, -165, -213, 291, -195, 140, 328, -801, 302, 109, -278]
5958b78N90o64J08O95j228O54N52j100Q13M6o10Q34m13m27P88p15L25M20p89O14
5978B15j28o55R83p07PN59n07K55K60p50Q26l37l51N18k93k79Q13p77L77J35k10
5999d6K30P7q40J110o02l07P98p88O15j71o34J071m66m05Q03m97k39Q53r72J21
6019b89O02p08P08l42k11Q45o34m56J149j000K74P35j101O92j34m39N82l33k24
6038b84O72p15M90J31q56R47l60m92P50n88J04N94r64M45L12m38O20j92n54R52
6058E74p93J69L46o73M81Q7p01P59k82m20P54m35l0O04r08L01P25q13N96j90n81
6079d30O58k89j63O18o68L60L09q75O08j23l57Q00m72j89M95k92J31L53j068R48
6099C54l04k61N18n16M18J17n67L04M24r94O44j55k82P66o93K05N34p65L10R9
$$ y = [-278, 312, -352, -244, 451, -777, -123, 429, -671, 142, 188, -422, 412, -1, -428, 360, -355, -30, 390, -399, 215, 87, -568, 415, -292, -285, 274, -233, 22, 282, -468, 358, 21, -330, 188, -105, -384, 429, -348, 29, 164, -46, 184, 261, -579, 531, -71, -378, 420, -368, 247, 76, -558, 513, 47, -358, 445, -52, -291, 562, -410, -289, 313, -395, 313, -29, -240, 605, -29, -485, 664, -336, -62, 673, -428, 264, 130, -309, 273, -60, -284, 388, -327, 163, 294, -562, 385, 25, -467, 283, -305, -201, 393, -571, -126, 186, -252, 368, 176, -378, 574, -219, -50, 296, -377, 104, 191, -510, 249, -33, -453, 301, -134, -164, 440, -468, -167, 558, -255, 341, 151, -430, 228, -61, -224, 394, -274, 86, 395, -480, 128, 5, -352, 448, -24, -213, 282, -10, 121, 474, -594, 354, 50, -211, 307, -209, 209, 326, -241, 63, 487, -507, 137, -18, -300, 466, -227, -22, 512, -253, 57, 156]
6119A56r40O94K91m91P28n73k49R23p72J12M72o94L67J99o00P19l28m80J101j008
6139c73J83L21o00P78k10n93Q67l01m12P73o52L0O55j096P85L3o92P47Kn56P75
6160D64p62K17K54n00N15P7p52O28j3m66O74n23o3O61q12P22j93p40R14o10j76
6181d84R26n91J83P1l85K63N9m52O85k71n4K46m45J59L74o37O49n0o01O45j70
6202A20j37J55n13L24K90m32L50J0m84N82l87j35O15r11L95M52o18L58K46o32
6222c52O84m55l56J246r44K62K67q03L86M00p04O36l06l97R25o00JO19q93M31
6242D7l7j27K93j94j57N40n05j84P15o41N20j52m04L61j36j53P09m57j90P37j025
6263d40N67o5n05P86n91o9O15m19j46P43j068N83L51q60N31R9m04P25o78J34K26
$$ y = [156, -784, -90, 201, -290, 438, -135, -384, 539, -233, -121, 351, -343, 24, 223, -377, 342, 14, -466, 635, -373, -190, 131, -469, 309, 99, -494, 373, 72, -340, 433, -219, -189, 466, -630, 155, 188, -504, 243, 245, -311, 464, -298, -81, 173, -327, 188, 265, -487, 141, 128, -338, 336, -187, -250, 411, -401, 321, 128, -612, 302, -308, -484, 442, -149, 34, 105, -280, -17, 42, -410, 275, 4, -50, 196, -249, -90, 284, -353, 296, 246, -355, 290, 120, -17, 138, -375, -51, 239, -193, 157, 167, -317, 265, -122, -257, 358, -553, -158, 294, -324, 34, 280, -352, 332, -123, -479, 767, -177, 85, 352, -451, -65, 335, -369, 267, -39, -436, 489, -111, -110, 509, -384, 47, 10, -117, 176, -18, -175, 365, -140, -324, 391, -250, 270, 118, -286, 75, -61, -214, 495, 38, -152, 585, -440, 127, 62, -443, 343, -248, -317, 298, -121, -267, 476, -592, -9, 342, -518, 13, 112, -292, 433, -245, -111, 115]
6284A15n44J93K06j66O32m84k41P15p19K16M13m48O0J71m92O05q2l84N53m96P9
6305i8L57m93L86K3l32L26K4n52O75l40j80O74q96O98J5p37Q46m48k06M16k41
6326h3k7M39p46N64R6o19P71m31j56O62k78l25N82q13L72J50p03Q02m44n05Q39
6347A47j15j54N44p55K39L90r17Q11k52k3P77q02q2K32r5j06L09o36P51k44l93
6368c74R39o18j45L32m61M10L46r62O72j69n35R03l69l92K89l04O09k34m62O50
6388A25j49k61Q04r65M40M25r02P01J79o69N49l6p39J270o09j97L54o84L06K05
6408A47l20L43K7l77N55p74L12N26q06K57N48r35O23l14q5M13m73K55M50p33N2
6429c09O48j049J232n13l67N83l39j39P27p55L77K71o87P00k71l82P01m01j33
$$ y = [115, -429, -236, -30, -196, 436, -48, -289, 426, -293, -77, 336, -112, -52, 119, -373, 232, 150, -234, 319, -177, -98, 259, -234, 152, 175, -157, 169, 193, -359, 316, -24, -204, 470, -426, 272, 287, -450, 396, -52, -258, 158, -83, -110, 329, -417, 147, 243, -376, 395, -36, -192, 470, 192, -133, 449, -364, 8, 158, -545, 257, -187, -692, 147, 32, -122, 422, -333, -94, 296, -621, 190, -62, -85, 692, -110, -192, 40, -55, -161, 148, -488, 263, 19, -374, 565, -53, -198, 134, -327, 83, 429, -533, 139, -30, -565, 338, -31, -423, -134, -438, 171, -63, -525, 125, -24, -285, 519, -446, -6, 419, -483, 218, 397, -272, 277, 241, -498, 772, 163, -34, 320, -364, -58, 147, -173, 170, 197, -180, 375, -399, -87, 439, -367, -110, 438, -497, 126, -188, -273, 140, -333, -78, 372, -361, -309, 339, -710, 522, 9, -358, 225, -114, -253, 474, -281, 96, 367, -320, 380, 109, -273, 428, 27, -106]
6448a06M55p31L58K39o35O73m9n64P02m97k03Q11p06L79R6m48N45k79l64M26j17
6469a5k85P80p20J7L54n33M32K26p14R28l19l89P43q46M05K54o28N81l15k36O83
6490D03n39k18P13p75M42L43p53O21k10k08N18l76o9J25k71J20O63q81N83k18
6510A3j99K31R4m80P45o19K86K48o03L75o0n12P12l13j06N98q77N16J30n39M06
6531D6L8m10N91l48m8N06r71O64K27l81J40K18n75N65l11l70J018j309O12K23
6551A25l73M46J2l59N97m14k44P82q28J65L28o45O65j27o33Q37n32J54M06l73
6571a1j27M40p95O62J1m26N56k71j45O05q83o2N96n65N33j4j98K75n01J31M82
6592B93n73K37K65q00O07o4l44P76m69j79M48o31M71J12o96Q34j63o83Q03m15
$$ y = [-106, 349, -382, -24, 215, -420, 253, 204, -360, 342, -155, -358, 453, -253, 126, 222, -226, 319, 40, -324, 102, -15, -300, 480, -240, -223, 131, -402, 30, 256, -458, 470, 151, -238, 505, -341, 64, 318, -310, 271, -44, -280, 403, -136, -354, 359, -416, 26, 369, -384, 237, 27, -181, 337, -39, -108, 17, -254, -134, 529, -352, 231, 13, -186, 45, 139, -341, 404, -215, 71, 319, -284, 91, 31, -481, 231, -82, -188, 410, -467, 49, 179, -360, 46, 84, -326, 265, -83, -131, 375, -596, 68, 295, -86, 54, 272, -303, 262, -49, -419, 599, -710, -98, 125, -248, 198, 210, -149, 448, 34, -210, 572, -256, -91, 237, -408, 257, 130, -503, 334, -198, -44, 362, -11, -138, 302, -493, 169, 180, -246, 310, 39, -106, 499, -384, -446, 150, -415, 118, 104, -94, 181, -320, -189, 293, -280, -43, 222, -578, 29, -35, -379, 397, -72, -251, 197, -434, 37, 149, -547, 287, 124, -559, 244, -171]
6612a71k95N89n29K57N27n67K52L9m36O04j84m74P26n61J64M84q70Q67l63m29
6632c70P22k23k41M55o32K03L63n97M20km45J89J4n1N19o36L97K68n82K59K09
6653B39o22P03k12p94J219p39R47J56j365J188N7j142P05n82J87O63q97K67J48
6672A26o47M79L57o46P68m81j95O30o06J03M60n52L82R2n41M47l28l8L57n53K94
6693i2K26k86L67p2m56P11l24k15N07o34L42M49q84N01J70o66O04j29l13O39o47
6714b02J74L65o66N62q4k16K76j35j47K37l06N3N33r34M74Rm61N53n7k93O04o57
6736c18j10R53q50K25M00r02P08l25qO00n59RL70n32L34J23m95O07l13O8P5l31
6758b71J90M46l67K14J5o06M61Rl60M71m52J23M49o02M26Nl86K59q8j35N58o18
$$ y = [-171, -466, 123, -406, -149, 378, -189, 63, 102, -334, 270, 86, -388, 338, -223, -59, 425, -445, 422, 59, -370, 352, 129, -112, 343, -289, -86, 277, -320, 100, 98, -347, -158, -144, -195, 324, -312, 85, 353, -229, 30, 239, -383, 320, 108, -686, 533, -206, 741, 897, -468, 720, 777, -365, 340, -242, -55, 608, -289, -22, 126, -521, -42, 315, -331, 437, -44, -239, 391, -215, -112, 348, -204, 178, 270, -271, 176, -152, -190, 167, -386, -92, 134, -152, 215, 143, -313, 398, 74, -141, 366, -268, 74, 523, -361, 140, 310, -356, 248, 119, -194, 445, -202, -28, 337, -329, 233, 149, -67, 209, 74, -73, 164, -142, -89, 444, -490, -16, -7, -468, 85, 28, -265, 339, -318, -428, 525, -325, -100, 300, -602, 106, -219, -227, 373, -186, -177, 193, -339, -5, 118, -377, 230, -83, -15, 60, -271, -81, 365, -2, 212, 227, -379, 82, 91, -269, 202, -250, -127, 322, -280, 146, 151, -235, 24, -64, -199, 359, -259]
6780b59K50J74n48M76R7n46N56k16k33Q92p85K21K03m82O3N38n74L00r0p6L34
6801B95m25J75J39n09N84j10n30Q22n96k27P49o28j53O59k28N1K01m95N13l89
6821a02j93O48m44j53L86m32L15J59n50L91q9k35N54m51K86L78p01J8O32r39N91
6842F9L1l13N60n33K77J27m89M35M06r74M34O3k99N60m68j29O29o64L14P4m00
6863b90O45j49l99L46m20j55O37n07J96M34o18L74l5j70L97k74l10O19n38K80
6883F3J96n88N68p8l91P58o96J7O51o21J63j8n00M34J32l22L78k89k35N03m44
6904c19K95M23p74O55m21j38P44m72k3L30m01J22K33m72L97p9m89P74m28j4K33
6925A76p71Q26k9n44L49L03p36O53m41K64L01m69P0J50j84J76jo05P08n32l2P14
$$ y = [-259, -9, 165, -383, 93, 190, -356, 200, -16, -249, 643, -142, 79, 282, -200, -137, 401, -173, 127, 37, -39, 295, -130, 45, 184, -325, 259, 149, -381, 441, -155, -382, 367, -261, -414, 245, 17, 68, 269, -226, 287, -102, -295, 353, -91, -244, 142, -290, 25, 184, -366, 25, -64, -299, 255, -196, 90, 468, -233, -215, 417, -522, 69, 100, -213, 347, -186, 91, 218, -271, 164, 570, -404, 30, 93, -206, 354, -114, -243, 386, -278, 36, 110, -290, 355, 206, -193, 153, -267, -422, 215, -292, -96, 338, -280, 94, 59, -111, 286, 12, -298, 321, -217, 63, 259, -329, 239, 161, -230, 528, -168, -151, 500, -121, 42, 24, -476, -42, 90, -232, 146, -143, -378, 125, -319, -24, 399, -375, 280, -141, -279, 465, -7, -30, 300, -101, 21, 254, -218, 179, 100, -389, 385, -43, -57, 176, -595, 231, 202, -342, 7, 310, -426, 227, -214, 50, 351, -118, -48, 102, -82, 94, 93, -512, 196, -336, -368, 346]
6947C46p55K06N19o87N20j66j83L51j55l20O95o70J93L71n79P31k41m44M40k46
6967g4j24M31m49R2L45n61P30q8o70O73n51L1L95k65J60K05o37N92l64r7O94n66
6989i8j59L60p6m6J98m13L29K5j12R76j156P3O56n44j05M5j53M3N84p89O72l9
7011B71n28K09Mj09N77m92L39k32m93L97J58n63J016j243N96K84p18O0N58m07
7031c16P25O81k418K213j266K25J31K57j34j08l27O34m14k99M41l46L10K61n56
7050c06M46q5m34O43k97k85Q08n62J36L65o26L44j9n52N47j00q4L29m00O6L65
7071B99n76M00Qm66P12l87j90M80m50L10j16l83M72J07n35K95Q7k63M49k47M1
7092D7M7k05J26J02m32O73k38j92L17m59J52M86q30O20J28p60P33l82r9M10l10
$$ y = [346, -409, -203, 316, -371, 149, -17, -200, 151, -4, -324, 371, -299, -106, 265, -314, 417, 176, -268, 172, -74, -198, 233, -216, -124, 221, -340, 390, 302, -368, 305, -246, -215, 180, -85, 75, 280, -357, 235, -129, -226, 468, -98, -257, 103, 27, -19, 179, -234, 95, 120, 8, 984, -172, -99, 557, 13, -92, -47, -200, -157, 427, -362, 310, 271, -257, -48, -44, -153, 424, -68, 271, 39, -454, -57, 101, -462, 554, -689, -93, 191, -527, -467, 91, -316, 409, 1090, -1328, 885, -381, -156, -25, 232, 98, -10, -337, 297, -117, -416, 25, -321, -11, 250, -306, 140, 55, -379, 264, -33, -318, 490, -72, 64, 429, -197, 147, 128, -424, 123, 23, -61, 268, -132, -66, 299, -277, 123, 131, -335, 377, -10, -200, 280, -170, 140, 24, -359, 113, 220, -315, -20, 67, -196, 253, 6, 47, 94, -111, 15, 117, -315, 358, 120, -72, 245, -214, -62, 424, -406, 214, 342, -418, 315, -67, -166, 244, -66]
7113f6j19K14j76P5j8k11O90j63m13M37k44k68M67n76M28K7k78L32l61l5L23p0
7135eL26J26r58O17K68m35L98l17j08J75j30j91L47k0j20J34m93O59j97l38O74
7156D12p92K95M28n77K64K37m34N10l22k63O18m96J0K56l39K49M7m40M76k65j21
7177b47P41n83Q7P6l91L93Pm85M86j10k03M17k10o2M25o49L00J83k03O0K2j53
7199i9M16l21j63K57o10O07K5l59M13j51j48K72k33J06M97o58L65j39l61N14m18
7220a88J80J77l89J48N99n30K0J55o89O38M4m45K19j36n14P34n5M6R3m39L74k36
7242a94l85P40mj7m82j81P12Q5l49M64n66q62J107k74M03P09j184K31q4o01J243
7263E11o16o25J122l48m91N49m29N84j18n20N56j35q5J32j89r3N22o61L37J79
$$ y = [-66, -185, 29, -147, -72, -90, -301, 389, 226, -187, 250, 6, -262, 205, -371, 57, 84, -194, 138, -223, -258, 65, -5, 321, 447, -511, 106, 374, -61, 337, 20, -88, 87, -43, -234, 113, 93, -27, 107, -386, 273, 76, -262, 412, -380, -85, 343, -234, 30, 267, -167, 343, 21, -242, 376, -120, -110, 146, -193, 56, 103, -337, 139, -126, -247, 494, -89, -2, 74, -317, 76, 83, -402, 84, -26, -229, 188, -22, -84, 341, -308, -8, 175, -28, 32, 54, -99, 317, -4, -167, 90, -520, 87, 112, -247, 166, 15, -133, 139, -94, 12, 509, -149, 216, 77, -284, 230, -188, -8, 169, -220, -72, 527, -3, 17, 172, -517, 121, 165, -280, -61, -197, -711, 23, -32, 14, 107, -332, 42, -194, -579, 161, 157, 140, -342, -523, 189, 274, -75, 389, -177, -1039, 68, -206, 197, 906, -278, -47, -131, -732, 511, -105, -730, 392, 44, -447, 102, -327, 257, 139, -381, 175, 40, -45, 87, -102, -195, 327, -334, 3, 182]
7283A82l77N15l26n3Q8n2p8L11k75R3L10m72J91J09k63J62q4j50L40j64OL21o46
7306c12K67J43m21M11k16q3L40j87M4J94m29K29O6q4J93l30n4M51m43J23K19o26
7328e05N66K07n16J84j24j17M91m05M32K0n59M42P8n16N32j49m36N38q31Q47Q5
7349B64l92J55K57o13K53mp3M91o52J86K69j93J42J36k52N07o07j77M74k62J25
7370C4J37l03K08N1n70N44o5m03L38K2j89P15j256L86K84j54j06L78k36M59J06
7391C80j168Q24o54P12m24l82P47L99m94N8m39J131Q5j256P20L60j033M33N93
7410E92r96N15n76O26o03k28J300r45J13M11r4p46P94o96L06M44n28P0N75j02
7430B32l91K35j40N2n91L54M03o73M84K69o30L33p9J70k0R9r6L12o67K54L26m61
$$ y = [182, -195, 320, -6, -59, 29, -23, -101, 210, -65, 28, 338, -134, 57, 166, -97, 65, -19, -169, 171, 7, 13, 334, -312, -45, 98, -323, 88, -128, -211, 129, -58, -14, 180, -249, -20, 46, -38, 155, -175, -229, 222, -221, -98, 121, -505, 61, 268, -248, -64, -188, -305, 186, -219, 213, 233, -326, 116, 194, -322, 210, 61, -375, 163, -668, 179, 264, -128, 27, 284, -329, -76, -80, -153, 338, -314, -128, 141, -52, 90, 226, -26, 481, -126, -303, 171, -91, 34, 171, -132, 76, 127, -443, 101, 36, -367, -29, -7, -196, 519, -737, -351, -67, -221, -327, 51, -185, 274, 380, -788, 36, -618, 94, -330, -712, 35, 434, -60, -2, -441, 690, 775, -481, 239, 599, -434, -1, 592, -404, 111, -465, 161, -442, -670, 630, -315, -202, 209, 115, -631, 163, -533, -227, 217, -311, -241, 334, 232, -159, 76, -64, -12, -603, -249, 154, -519, -35, 234, -396, -63, -142, 28, 8, 107, 11, 323, -344, -90, 236, -225]
7452b25L70p6j27L27m64O9N63p84K28M08q83R43r07N79O1p62Q64j41j20k24M60
7473A59J45k81K51q5J2l67M92n6m11r4jK20L77l26m09O40rl79j22j63K84K46k21
7496i8L32o11k32M23j39O60l64j18L51r17l51Q99K17l74P46l06P7Q59j734J232
7516E52j61o21J45m3L34K22j96l5k00o81L48N86k21o0K99m82R01j055n9N46l37
7537b18j7N36k87L69m93J23l5qk98L69l07J72L24l83K79j92j36K28k3j6L9l78
7559c52J85K74l00M34j54m12N75m31K30J86l74mJ5L3J77J03k84K21j83o9M67o96
7581c59K86j7j49L50J34k38L96n17J4M62n67M08o8l97M40j58n18O67m41J22K35
7602H5k23J88P2l69N89l37l51M43N3l53J10m4l1K31qR8l08p7K02J0K3P6r4n1J77
$$ y = [-225, 145, 69, -58, 269, -195, -126, 437, -347, -119, 289, -594, 349, -558, 21, 82, -680, 184, 43, -77, -301, 159, 304, 23, 274, 189, 201, -166, 326, 270, -141, -235, -236, -16, 361, 35, -374, 266, 257, -122, -244, -407, -123, 123, -98, 234, -377, -609, -186, -325, 335, -29, -147, 204, -713, -1064, -165, 52, -322, 424, 118, 195, 1054, -680, 552, 391, -230, -85, -128, 206, 428, 232, 197, -3, -684, -336, 250, 29, -31, 268, -214, 687, -368, -427, 119, -218, -235, 301, 14, 383, -110, 13, -22, -30, -328, 41, -266, -94, 230, -153, 126, -66, -202, 26, 3, -13, 26, -352, -167, 107, -193, 241, 87, -325, 250, -181, 49, 235, -139, -143, -128, -95, 82, 185, -99, 122, -61, -130, 337, -359, -73, -90, -239, 111, 245, 7, 403, -114, -100, 362, -205, 203, 135, -262, 178, 20, -498, 169, -272, -150, 85, -138, 50, 122, -247, 342, 5, -346, 97, 150, -203, -93, -137, -168, 63, 55, 153, -155, -232, -30, -20, 3, 79, -15, -66, 111]
7627A11m41K40K14l07L08j13p0K2k52K41L31p10N15Q4l55L51k82o3K79l96M12
7648A19j0k98N01m78J48J58k05o1k3J35J34r4q5l3J74k38L70k98k31O05n79L93
7670A04o7k04K87l6k53K93j80n3L43n71M44j19j69K67p6j87K35o5j60L08l38J62
7692c5K09l19J04J30m48M31J41j90J62k45J02K91m06R2Q8j13P1k36J06j68j22
7713c55J77J98j35J74j39P6Q4o0j82J84jj02j01J13J23n9j93M34l44J12J94j33
7735F5l04J75j31J30J68l65L25J79l38K71l56j4J43j04M44k96k75K53K55m09K92
7756A08l78K46M1q4LJ09k89J46o8K38J30k66M3r5q3J18K83j58P6j06k1M03m91
7779i5K54p6l30L33j89JL64m30J0L16l53J27J96m17K45J63l89M37j11j01M01n31
$$ y = [111, -330, -90, 124, -183, 125, 12, -58, -36, -288, -47, 284, -426, 89, 173, -182, 169, -113, -176, 103, -293, 119, 109, -189, 312, -166, -18, 140, -65, -126, -149, -14, 120, 26, -59, -92, 82, -156, 214, -84, -315, 290, -289, 104, 37, -167, 120, 84, -169, 124, -56, -109, 234, -337, 107, -12, -181, 86, 10, -177, 58, -7, -167, 141, -197, -35, 174, -145, -41, 89, -359, 72, 213, 23, 185, -60, 42, 333, -73, 19, 107, -6, 65, -171, -65, -233, -355, -178, 20, -115, 59, -80, -4, 80, 20, -162, 22, 21, -81, -182, -69, 54, -5, -198, 236, -108, 4, 198, 65, -239, -64, -195, -65, 103, -262, 63, 242, -96, 175, -181, -195, -52, -156, 288, -8, -283, -30, 225, -184, 108, -270, -24, 17, -67, -64, 45, -244, -98, -166, 72, 202, -64, -21, -116, -199, -81, 202, 44, 120, 14, -7, 396, -95, 159, 83, -247, 86, -103, -102, 262, -168, -158, 158, -195, -68, 128, -289, -44, 119, -270, 167, 56, -45, 356, -175]
7801a75K17J20l27l7K81j85K84k19J9j6J64J37o6l05J2J87j96J1J71l00J88M7
7823A2J25L6l65L32j11n1K89k94q3K15k65J16p1j49M40j33l71N19N6p37O04n5
7845E9p5J19n18L19K75l88K58Or5J39k64K55O9j25o7kM1p4M9O2ol80J17N59k34
7870I9j07K26m73L30m31J74L75l81J68RM9J22j65M4J14j87K6l3k00l1M22l88L01
7893F3J05k72L1K20l20L34k37n5J60k65L38j55lL08k51P3j46m2J22K50l64K85
7915A79l97N3kM9K11o5j6j6K37m07J08K98k03p8k5M8J34j74PM62n33K29l8k17
7939a56M65l23j87J04K0J23J04r8R1n7l03N51k20k19L60k97m3J50k00K6J44k55
7961b20M43l85jL57k54P6k4PR3j04J16m4k15K14oj10k9M12m60j59M87m39K73J29
$$ y = [-175, 42, 162, -165, -202, 79, -106, 178, -41, -22, -38, 126, 263, 197, -108, -96, 91, -105, -94, 77, -223, -35, 12, 137, 173, -192, 140, 29, -22, 267, -27, -110, 105, -160, -44, -115, -264, 176, 43, -328, 191, 247, -490, 114, 59, -16, 103, -415, -96, 179, -209, 49, 55, -40, 99, -165, 90, 159, 34, -33, -35, 6, -68, -19, 43, 37, -343, -226, 333, 99, -8, 218, -255, 75, -356, -182, 193, -188, -20, -11, 38, 160, -5, 39, 153, -34, -8, -41, -241, -272, 150, -238, 63, 168, -104, -73, 147, -173, 161, -76, -131, 29, -236, 102, -53, -56, 252, 1, 74, -72, -114, 8, 258, -106, 179, -218, -165, -167, -118, 93, 28, 12, -4, 233, -174, -66, 232, 29, -49, -74, -26, 108, -66, -59, 403, -130, 99, 61, -156, 309, -14, -201, -97, -77, 46, 150, 52, 143, 86, -217, 334, 114, -105, 255, -42, -85, 65, -135, -109, 35, -220, 223, -162, -163, 194, -60, 16, -8, -1, 92, -12, 104, 60, -155, 59, 53, -57, -86, 326, -134, -293, 194, -245, 28, 157]
7985A57q9J71j76j01J15k20J42k6j06K67o0j89K47k21Rk1j00K49j56J15P6J4j44
8008d7K69l02O0q4j39O2K88n32P15l53l9P4k6J51M2p8q2M7l8P3J37l80L66j92
8032hj11M37n00K35j29P5K04j07k88N8k5Q4L1j12p9L03j73L47j32l09K72k13J25
8055a5J41m17M88J0k42L25k96o4J70k84J28J98N0k10N7K0l6L2l20L40Ql5J39l63
8079a76j2K44k75K86J19k81K51k86O0J57j50p7L08l96L74o4J9j66K5K1K24k95
8101i0J50j71j3K55m7j40J04r5o0J26r5K02k60R7N1L2l32L82Pk52K38j43J28K0
8125I4k55K65j4j47lk0n0K36l16J88J62k38M04k63j49K66l08j4J79m26M20k52
8147b41K63Q0m6O4n7k06L31l9j80j85K17l55M70k38L34J16j24k39K44k25J51j26
$$ y = [157, 68, 239, 63, -38, 77, -143, -1, -27, -133, 134, 74, -115, 132, -89, -80, -101, -201, 48, -108, 7, 83, 97, -47, 222, -80, -20, -104, -243, -181, 107, -425, 290, -63, -102, -28, -54, 97, 139, 61, -21, 26, -12, 61, 198, -182, 184, -8, -119, 318, -182, 53, -76, -1, 203, 96, -192, -134, -159, -75, -44, -156, -235, 68, -105, 242, 110, -199, 73, -140, -15, 126, -291, 197, 207, -35, 290, -6, -70, 100, -184, -56, 142, 192, -18, 39, 59, 23, 55, -265, 75, 83, 48, 187, -176, -188, 56, -219, 67, 186, -95, 156, -130, -70, 87, -63, -140, 168, -228, 146, 82, 101, -65, -40, -19, 205, -90, 60, -111, -124, 131, 84, -56, 48, -47, -107, 19, -76, 126, -134, -37, 14, 46, -286, 96, 103, -149, 89, -54, 74, 94, -161, 104, 90, -57, -60, -80, -130, 106, -210, -22, 140, -98, 306, 43, -106, 160, -148, -162, 17, -409, 11, -241, 22, 102, 56, 120, 63, -143, 188, 149, -31, -216, 1, -354, 116, -122, 212, 328, 204, -35, 209, -16, 135, 9]
8169Ir7K15k33j88M27k43J07J01q3k61K68k34M22k39l91N79k53J50r4r4J83L8
$$ y = [9, -88, 127, -106, -294, 133, -110, -3, 98, 15, -246, 22, -212, 210, -29, -420, 159, -94, 56, -38, -132, 51, 89]
8191H9
$$ Imaginary data points
##PAGE= N=2
##DATA TABLE= (X++(I..I)), XYDATA
0@%%%%%%%%%Qj6J6j6K4l2M0n1N9p2Q8j11J35j60J92k27K67l12L62m20M85n56O38
32C41p28Q26r34J055j190J337j498J676j871K083k313K566k843L145l476L837
48B013m230M661n134N654o229O867p576Q366r258J0271j1430J2775j4358J6250
62H642j8562K1461k5225L0344l7773M9763p3645K10999k69038K62939J48501l46168
74c7762M44169m57820j44388N41889l76496o2998K12963l91361M63806q874m54039
85b70911L88326q1472n2429K50009m74763J26162L06185l95316J51374q1745k04949
96c39529N01849l08617j74672L64815k44720J97684J00979m82530L88031R3828
106I7118l61442L07026k79776k9738M61146m69651K3196K85052k82013L07037
$$ y = [0, 0, 0, 0, 0, 0, 0, 0, 0, 0, 8, -8, 8, -8, 16, -16, 24, -27, 32, -40, 48, -63, 72, -88, 104, -123, 144, -168, 194, -226, 259, -297, 341, -387, 439, -495, 560, -630, 707, -791, 885, -986, 1097, -1216, 1350, -1493, 1652, -1824, 2013, -2217, 2444, -2690, 2964, -3265, 3602, -3974, 4392, -4866, 5405, -6025, 6750, -7608, 8642, -9920, 11541, -13684, 16660, -21113, 28650, -44995, 166004, -103034, 159905, 308406, -37762, 406407, -51413, -195801, 346088, -30408, -93406, 119557, -271804, 192002, 183128, -270911, 117415, 35943, -16486, 233523, -241240, -115078, 191107, -204209, -52835, -134580, -339529, 162320, -146297, -320969, 43846, -200874, -3190, 97789, -384741, 3290, 97118, -264324, 42702, -237074, -266812, 194334, -275317, -252121, 32931, -249082, 57955]
116E7955l8591l73076M82830p2017k09909K77114l31686J62499K61933m43341
126b26289J61899R7973j80219L12315k22252j45914M23509k27349K1109J22395
136A37177l05880L36613J0350l38226K66659j02360m6932K78283l78692P5797
146f7211K98114l15791J90628l3634k28881M04670j66333k13622K89566k10830
156e3324P3333J79500m07222K24393J31397k72045K38677j57754q3793L45991
166B19153k64128n0638K07080k29656J97499P145l10450L12803n9191j27409K11051
177A13259k53820R3838K21687l12621J23529O6636j94804K89412j69939j55856
187a78679L25544k01161K5335J41376k79852K22292Q5775k88918K27075o6432
$$ y = [57955, 19364, -353712, 129118, 57101, -152808, 124306, -207380, -44881, 217052, -226289, -64390, 33583, -146636, 165679, -56573, -202487, 221022, -6327, 14782, 137177, -168703, 167910, 178260, -159966, 106693, 4333, -42599, 235684, -143008, -67211, 230903, -84888, 105740, 72106, -156775, 247895, 81562, -132060, 157506, -53324, 20009, 199509, -207713, 16680, 148077, -123968, 114709, -43045, -126838, 219153, -44975, -95613, 111467, -118189, 79310, 86455, -223995, 88808, 29617, -97792, 113259, -140561, -46723, 174964, -137657, -14128, 52508, -142296, 147116, -22823, -178679, 146865, -54296, -28961, 112415, -167437, 54855, 140630, -148288, 78787, 12355]
197A2355j06298K79891k71202J78K38493k36191J27115L3383k18287K74606n2006
208H2037j81399K35467j68516L0063J75147k93648J37085Q8092k00239J91291
218I5380r5435j10768K76376j83643k8422J83061k28357J68608L8828k55107K29878
229I0399n9547j27711K11583k02039P284K17865k55288J12737Q1251k07857K41413
240A10090q1781j49721K39362j55507k4160J64258k41018J14228R7610k33574
250a60213J94625m6014j12490K32615j64035j4366J80744j95902R2561O8485k16535
261a40525J96535m8166j43349K13542j60005L463J72773k07240J07992Q9152j95536
272a11364J90455l8590j44527K26599j62082k5080J73003k18360R8244Q0534j94760
$$ y = [12355, -93943, 185948, -85254, -85076, 153417, -82774, 44341, 77724, -140563, 134043, 82037, -99362, 136105, -32411, -2348, 172799, -120849, 16236, 104328, -95911, 95380, -55, -110823, 165553, -18090, -46512, 136549, -91808, 76800, 115628, -139479, 90399, 30852, -96859, 114724, -87315, -80031, 137834, -117454, -4717, 76534, -131323, 110090, 28309, -121412, 117950, -37557, -61717, 102541, -138477, -24249, 73361, -160213, 34412, -11602, -124092, 108523, -55512, -69878, 110866, -85036, 7525, 76010, -140525, 56010, 7844, -135505, 78037, -81968, -78505, 94268, -112972, -4980, 84172, -111364, 79091, 40501, -104026, 122573, -39509, -64589, 108414, -109946, -11702, 68832, -125928]
283a25928J80375k0989j37820K22961j29667k9534J75485k04818R3794P7614k02109
294a00636J55702k6059j27421J96902j30866l5984J89991j84538Q4910P6393j84274
305h5880J79320l0370j40018J77774j15664l1640J61698k04913P3830J07213j85798
316i4448J58709l4008j16844K09739j16867n7203J58420j64964O9224Q2897k16995
327a22340J57301L451j32541J72102j23836k0523J82435j71556L4714R5957j63494
338h8330J52729k7604j60496J94102r2307m1879J30341j73337P9913J09431j84579
349a02016J13092O565j09226J88488j30035o2003J74641j43465M5599N6115j70456
360a32701J54145J9684j54132J50771p4756k1427J62970j88467L8992J14898j42832
$$ y = [-125928, 54447, 33458, -104362, 118599, -11068, -40602, 134883, -69935, 23859, 101473, -100636, 55066, 29007, -98414, 98488, -32378, -68362, 121629, -62909, 22001, 98394, -85880, 93440, 63070, -76948, 100826, -14838, -46478, 115220, -89693, -15863, 91350, -94448, 64261, 30253, -86591, 123148, 6281, -50922, 107498, -57466, 11758, 94655, -122340, 34961, 38412, -94129, 77973, -45863, -66386, 116049, -55507, -20793, 75164, -88330, 64399, 36795, -123701, 70401, -21906, -63785, 66556, -106781, -26868, 82563, -102016, 11076, 17641, -91585, 96903, -33132, -95135, 79506, -63959, -18360, 37755, -132701, 21444, 41128, -113004, 37767, -36989, -58416, 104554, -83913, -44921, 69977, -72855]
371g2855J03240k6545j22711J89958p0079q4618J38475j24617P4281Q6121j92819
382a02169J20411L3960j03341J27666j04668m2625J81876j41064K462Q3513j31970
393g5949J46162j0839j48003J58175m1019l9513J10657j53800M7802J27813j68743
404d7257P3820O649r1384J71631r8559p9644J55471q7090K4156O2035j67432J29158
416E1554M6513j50180J09589o7552j8847J45618j56067k36J15382j06149Q3050
427E2675j2727j32084J77413m3938q9140J04658j14835N9632Q9007j79912P1466
438a7785N4875r5299J20375r0790o2252J83123j11890j2754O6282j21262J22928
449C5551J2183j60176J19686j4245m7645J15433j47733K7238J38631j37201N2911
$$ y = [-72855, 30385, 3840, -118871, 71087, 1008, -83610, 54865, -69752, 4529, 90650, -102169, 18242, 52202, -51139, 76527, -28141, -70766, 111110, -29954, -27492, 56021, -75949, 70213, 59374, -88629, 69546, 28527, -10986, 99671, -54129, -6327, 121486, -47257, 26563, 33212, -58172, 113459, 14900, -64744, 90727, 3637, 27793, 89828, -77604, 51554, 98067, -52113, 57476, -10076, -28923, 116695, -39372, -39608, 75774, -30375, 52675, 39948, -92136, 85277, 41339, -47801, 56857, -57978, 1654, 90661, -89251, -17785, 37090, -58209, 62166, -28624, -90876, 92247, -19643, -32397, 33885, -87377, 35551, 47734, -112442, 7244, -7001, -54646, 60787, -86946, -59708, 78923, -58278, -5367]
460e367O176q4885J54304o3635j04984J32971o8919J8086O8057j65209J07685
471e720O3907j21870Q8598n1175k7338J51350j24755l2222J12540r8254P9945
482C5006k980j40133J54539j4739p9075R1768r4825L8066J14413j59822M4325
493a3457N9595r0118J16340p8377p7642J58525p6822k2076O4094j12904R8768
504B5926M7378j53904R9786q078m4503J13062j31567M93J24772j06762L2026J5352
516A3981r6176J40983l0824j10067J19750o3244J8067P3432j50123P0270P1714
527E7763j06621P1995l8684n2575J52588r8623m0667J01737q9635P5033J4914
538D7225j33717J18753P844p8624Q9087q9064J1962J23676j38522L3193N2649
$$ y = [-5367, 809, -84076, 70228, 6593, -98391, 34580, -34339, -16253, 51804, -113405, -5720, 58187, -63683, 24915, -26260, -53598, 97752, -27003, -59225, 53315, -44939, 35006, 32026, -108107, 46432, 31693, -47382, 44386, -50439, -12373, 102040, -57782, -13457, 46138, -43980, 72360, -6017, -83659, 74866, -1956, -24032, 40062, -72842, 25926, 73304, -80600, 19186, 11108, -33395, 79667, -51900, -51407, 73365, -33397, -1371, 13981, -82195, 58788, 27964, -82103, 37647, -25597, -7530, 65902, -84221, -13951, 57763, -48858, 23137, -15547, -68122, 84466, -14157, -54824, 46913, -42722, 32311, 47225, -86492, 32261, 40105, -38519, 50568, -38496, -26534, 97142, -41380, -8187, 44462]
549D4462q1806J10708m9537q7474J36194n3090k9065P3425j18861P8525O0443
560H3924j37955Q4092p754m5102J12595j00403k5265J20421r2327K7464K7538
571D7228j12396J23363j4687j00862R8796n7287L719Q5626j26999L7810P8280
582F2591j00767P3075k8517p1599J34275p6594m3001Q3379q5494N1282M0162j26249
594h7457R0758J7821p7238R7265q0547q869J13341j11193J8792M7287q8278Q9872
606B1554j6851r7137J18624m4209k7349Q5832j07965N4420O6320j11735O7451
617H955p0o2840J05438p0070m2443J08695q6426K8453M3248j03769R6845P268
629C3284q3903R0605m3741k0616R6445j06617K0138O9303r8451P1601j1437p3664
$$ y = [44462, -37344, 73364, 23827, -63647, 72547, 19457, -9608, 63817, -55044, 23481, 83924, -54031, 30061, 22307, -22795, 89800, -10603, -35868, 84553, -7774, 19690, 47228, -65168, 58195, 43508, -57354, 41442, -15845, -12126, 73500, -53499, -15689, 62591, -38176, 34899, 6382, -65217, 69058, -7536, -50537, 32842, -52652, -1370, 38792, -87457, 3301, 21122, -56116, 41149, -39398, -48267, 65074, -46119, -27327, 19960, -68318, 21554, 4703, -92434, 26190, -18019, -45368, 40464, -67501, -13081, 53239, -58496, 8955, 8885, -53955, 51483, -18587, -61030, 47665, -38761, -10308, 32940, -70829, 26016, 33284, -50619, 39986, -3755, -24371, 72074, -34543, -14405, 54898, -43553, 28048, 16611, -57053]
641e7053J09909m7051l9781Q8466p9218L0644O0772j13775P4371J1858p7322R1938
653E3758o0367k9053R7116q6056J1412O0241r3932P6345O809q8837J03007m4357
665F086l1690Q4324q9614K1589O2168r9428N8366J2369p9404R9427m8665l8425
677d2897R5600q0502J9201N4506r2773O3143J4377q3603Q8462l9670l9802R2389
689D8431q5173J6830O0241r0185O0046J3227p5078Q7389l4832m3607R2536p9298
701b9473J1216O0087r3545O1519J1643p6941Q4089l0282m1209Q8311p5400R929
713b0056O8819r5225N7272J3843p3577Q5971l7147m3575Q7062o6110M173O1634
725D3084r2827O0947K1904q1218Q1396l1442l2999Q3720p2259J57O7981q2104
$$ y = [-57053, 52856, 5805, -33976, 54490, -24728, 5916, 66688, -47087, 27284, 39142, -38180, 53758, -6609, -35662, 61454, -24602, -13190, 47051, -46881, 29464, 36273, -52564, 50443, 6086, -25604, 58720, -30894, -9305, 52863, -46565, 11801, 24170, -55234, 44193, -4472, -42897, 52703, -27799, -8598, 45908, -46865, 16278, 30655, -52948, 35514, -4156, -43958, 48431, -36742, -19912, 40329, -49856, 10190, 23417, -51661, 35728, 896, -42711, 49825, -29473, -18257, 41830, -51715, 9804, 21447, -55494, 28595, -1687, -42896, 45415, -29985, -20056, 48763, -46462, 10810, 24653, -48924, 37047, -100, -43675, 43387, -22723, -18550, 43084, -49743, 11204, 33108, -48110, 33286, 1844, -31155, 52565, -19694, -19537, 48444, -33660]
737c3660M6656J5610p9803R0168k8558m6489P8253o1753J1528O0188q9206M3432
749F366L2082p3959P4284l4291m2622R2420o6853m466N4463p4027N1015K0754
761C5166q5276P6240j2067m3994P7863p3490Q031P0035q4416L3779J9225o4685
773d3589P7657k6516n8759Q7534n1014M3N3776q7927N4189L1809p6715N8275j8061
786G02l5541Q3309o7519j5361P2488p0147M0594J2149p4615Q1619r804n1938O5145
799C1081m8578M933O6909r0774L0820L7484o4348O4679l1771m3928Q7996m5623
811a120j8591N3452o5995M6931L0051q9805O5535m540l7822O6243o6261l308P4249
824D9019o9933J7083K4690o3727P8115j8564o3369P7473l9063q59M7246q1240
$$ y = [-33660, 12996, 28606, -51197, 38971, 10413, -36076, 42177, -19576, -8048, 52140, -37066, 6366, 38448, -35511, 38773, 4482, -38140, 54280, -12573, -17039, 37424, -36603, 14412, 35166, -50110, 26130, 14063, -29931, 47932, -25558, -17527, 52508, -31908, 1871, 21096, -43589, 34068, 7552, -51207, 36327, -14687, -14644, 39132, -48795, 5394, 37203, -39512, 18763, 702, -34839, 48470, -19049, -34410, 38078, -32069, 8525, 20674, -53941, 27678, 17874, -34064, 31081, -17497, -12564, 54345, -36429, -5609, 31875, -32473, 32206, 435, -43493, 44503, -1120, -19711, 33741, -32254, 14677, 44728, -45077, 20458, 15918, -21904, 44339, -21922, -25230, 49019, -20914, -3831, 20859, -42868, 35247, 16683, -46686, 30787, -8276, -9135, 38111, -43129]
836d3129L6791M3931p3465M4790j2890l8683Q5584n9937k2438O5103n4682L2600
848C575J5410p5334O7578O531n7184N8342m6200P02O9476q2596J8697L7431n2083
861c5655N5269k0284n2547Q4126l1373k5054N1540o5373M3589L4151q2356M9944
873E977M191l4508O2648n4130j6887P9319n9467J2971K4381o2067P3858q649o1924
886c4287O3217k6213o253N1276p5979K3955N2228o7671M2446j2203l8394Q0529
898E2651m4935k8977N7559m5337K4191K4795p9094N8172J2499n3123N3241m4366
910a2724k732O6564o7845N227L8560n0268N0518j1216o0930P7390k6481k3529
922a7466M5043o1883L2964L9164p4188L5790R524l8460O4123m7916k4575P3914
$$ y = [-43129, -6338, 37593, -35872, 8918, -3972, -42655, 42929, -17008, -39446, 25657, -29025, 3575, 18985, -56349, 11229, 17760, -39424, 18918, -27282, -26580, 42896, -39700, -21003, 16428, -35655, 19614, -670, -53217, 30909, -464, -25518, 26022, -39351, 4238, 38389, -43967, 5977, 10168, -24340, 38308, -15822, -32709, 46610, -12857, 114, 24495, -37572, 36286, 27637, -34287, 28930, 2717, -3536, 47740, -28239, -4284, 47944, -19727, 22719, 10516, -27878, 52651, 7716, -21261, 36298, -9039, 15152, 39947, -39147, 19025, 31524, -21599, 31642, -12724, -15456, 51108, -16737, -11510, 27050, -23218, 27300, 16084, -44846, 32544, 6063, -17466, 27577, -34306, -1342, 37822, -36366, -576, 8948, -29512, 34611, -13305, -37880, 36034]
934C6034n2733J1875K1220n9691N9402M023o1539N3998k1646j1761N7454p1600
946c4964J6723M8740n7285L7816q202m1301P0871k9556l5355N5255m4988K1029
$$ y = [36034, -16699, -4824, 16396, -43295, 16107, 20130, -41409, 12589, -9057, -20818, 36636, -34964, -18241, 30499, -26786, 11030, 2828, -38473, 32398, 2842, -32513, 22742, -22246, -1217]
$$ [...]
8191E6
##END NTUPLES=NMR FID
##END=
