##TITLE=1H_Pr 2161
 CDCl3,8 sc, 
 1.03.2021
##JCAMPDX= 6.0         $$ Bruker NMR JCAMP-DX V2.0
##DATA TYPE= NMR FID
##DATA CLASS= NTUPLES
##ORIGIN= UXNMR, Bruker Analytische Messtechnik GmbH
##OWNER= root
$$ XWIN-NMR		Version 3.5
$$ Mon Mar  1 12:33:43 2021 Russian Standard Time (UT+4h)  she@DPX200
##.OBSERVE FREQUENCY= 200.1315066352
##.OBSERVE NUCLEUS= ^1H
##.DELAY= (6, 6)
##.ACQUISITION MODE= SIMULTANEOUS
##.ACQUISITION SCHEME= undefined
##.AVERAGES= 8
##.DIGITISER RES= 18
##SPECTROMETER/DATA SYSTEM= spect
##.PULSE SEQUENCE= zg30
##.SOLVENT NAME= CDCl3
##.SHIFT REFERENCE= (INTERNAL, CDCl3, 0, 15.7039)
##AUDIT TRAIL= $$ (NUMBER, WHEN, WHO, WHERE, WHAT)
$$ ##TITLE= Audit trail, XWIN-NMR		Version 3.5
$$ ##JCAMPDX= 5.01
$$ ##ORIGIN= Bruker BioSpin GmbH
$$ ##OWNER= she
$$ F:/spectra/data/she/nmr/H-F/1/audita.txt
$$ ##AUDIT TRAIL=  $$ (NUMBER, WHEN, WHO, WHERE, WHAT)
(   1,<2021-03-01 12:32:25.65 +0400>,<she>,<DPX200>,
      <created by zg, POWCHK disabled, PULCHK disabled
       configuration hash MD5:
       00 E9 B6 7A A2 85 ED C7 34 08 36 98 17 FE 4E 26
       data hash MD5: 16K
       48 9E 4F DD 55 05 A9 3A E1 FF D8 35 F7 11 DC AC>)
$$ ##END=
$$ 
$$ hash MD5
$$ EE B5 C8 91 E8 87 22 BB 12 AE DA FA 1A 66 96 08
##$RELAX= 
##$RELAX= 
##$RELAX= 
##$RELAX= 
##$RELAX= 
##$RELAX= 
$$ Bruker specific parameters
$$ --------------------------
##$DU= <F:/spectra>
##$EXPNO= 1
##$NAME= <H-F>
##$PROCNO= 1
##$TYPE= <nmr>
##$USER= <she>
##$AMP= (0..31)
100 100 100 100 100 100 100 100 100 100 100 100 100 100 100 100 100 100 
100 100 100 100 100 100 100 100 100 100 100 100 100 100 
##$AQSEQ= 0
##$AQ_mod= 1
##$AUNM= <au_zg>
##$AUTOPOS= <>
##$BF1= 200.13
##$BF2= 200.13
##$BF3= 200.13
##$BF4= 200.13
##$BF5= 200.13
##$BF6= 200.13
##$BF7= 200.13
##$BF8= 200.13
##$BYTORDA= 1
##$CFDGTYP= 0
##$CFRGTYP= 5
##$CHEMSTR= <none>
##$CNST= (0..31)
1 1 145 1 1 1 1 1 1 1 1 1 1 1 1 1 1 1 1 1 1 1 1 1 1 1 1 1 1 1 1 1 
##$CPDPRG= <>
##$CPDPRG1= <>
##$CPDPRG2= <>
##$CPDPRG3= <>
##$CPDPRG4= <mlev>
##$CPDPRG5= <mlev>
##$CPDPRG6= <mlev>
##$CPDPRG7= <mlev>
##$CPDPRG8= <mlev>
##$CPDPRGB= <>
##$CPDPRGT= <>
##$D= (0..31)
0 1.2 0 0 0 0 0 0 0 0.06 0 0.03 0 0 0 0 0.0002 0 0 0 0 0 0 0 0 0 0 0 0 
0 0 0 
##$DATE= 1614587545
##$DBL= (0..7)
120 120 120 120 120 120 120 120 
##$DBP= (0..7)
150 150 150 150 150 150 150 150 
##$DBP07= 0
##$DBPNAM0= <>
##$DBPNAM1= <>
##$DBPNAM2= <>
##$DBPNAM3= <>
##$DBPNAM4= <>
##$DBPNAM5= <>
##$DBPNAM6= <>
##$DBPNAM7= <>
##$DBPOAL= (0..7)
0.5 0.5 0.5 0.5 0.5 0.5 0.5 0.5 
##$DBPOFFS= (0..7)
0 0 0 0 0 0 0 0 
##$DE= 6
##$DECBNUC= <off>
##$DECIM= 32
##$DECNUC= <off>
##$DECSTAT= 4
##$DIGMOD= 1
##$DIGTYP= 9
##$DL= (0..7)
0 120 120 120 120 120 120 120 
##$DP= (0..7)
150 150 150 150 150 150 150 150 
##$DP07= 0
##$DPNAME0= <>
##$DPNAME1= <>
##$DPNAME2= <>
##$DPNAME3= <>
##$DPNAME4= <>
##$DPNAME5= <>
##$DPNAME6= <>
##$DPNAME7= <>
##$DPOAL= (0..7)
0.5 0.5 0.5 0.5 0.5 0.5 0.5 0.5 
##$DPOFFS= (0..7)
0 0 0 0 0 0 0 0 
##$DQDMODE= 0
##$DR= 18
##$DS= 0
##$DSLIST= <SSSSSSSSSSSSSSS>
$$ [...]
##$SUBNAM2= <"">
##$SUBNAM3= <"">
##$SUBNAM4= <"">
##$SUBNAM5= <"">
##$SUBNAM6= <"">
##$SUBNAM7= <"">
##$SUBNAM8= <"">
##$SUBNAM9= <"">
##$SW= 16.9725356469052
##$SWIBOX= (0..15)
0 0 2 0 0 0 0 0 0 0 0 0 0 0 0 0 
##$SW_h= 3396.73913043478
##$TD= 16384
##$TD0= 1
##$TE= 0
##$TE2= 300
##$TE3= 300
##$TEG= 300
##$TL= (0..7)
0 120 120 120 120 120 120 120 
##$TP= (0..7)
150 150 150 150 150 150 150 150 
##$TP07= 0
##$TPNAME0= <>
##$TPNAME1= <>
##$TPNAME2= <>
##$TPNAME3= <>
##$TPNAME4= <>
##$TPNAME5= <>
##$TPNAME6= <>
##$TPNAME7= <>
##$TPOAL= (0..7)
0.5 0.5 0.5 0.5 0.5 0.5 0.5 0.5 
##$TPOFFS= (0..7)
0 0 0 0 0 0 0 0 
##$TUNHIN= 0
##$TUNHOUT= 0
##$TUNXOUT= 0
##$USERA1= <user>
##$USERA2= <user>
##$USERA3= <user>
##$USERA4= <user>
##$USERA5= <user>
##$V9= 5
##$VALIST= <valist>
##$VCLIST= <CCCCCCCCCCCCCCC>
##$VD= 0
##$VDLIST= <DDDDDDDDDDDDDDD>
##$VPLIST= <PPPPPPPPPPPPPPP>
##$VTLIST= <TTTTTTTTTTTTTTT>
##$WBST= 1024
##$WBSW= 4
##$XGAIN= (0..3)
0 0 0 0 
##$XL= 0
##$YL= 0
##$YMAX_a= 329329
##$YMIN_a= -335826
##$ZGOPTNS= <>
##$ZL1= 120
##$ZL2= 120
##$ZL3= 120
##$ZL4= 120
##$ABSF1= 10
##$ABSF2= 0
##$ABSG= 5
##$ABSL= 3
##$ALPHA= 0
##$AQORDER= 0
##$ASSFAC= 0
##$ASSFACI= 0
##$ASSFACX= 0
##$ASSWID= 0
##$AUNMP= <proc_1d>
##$AZFE= 0.1
##$AZFW= 0.1
##$BCFW= 1
##$BC_mod= 2
##$BYTORDP= 1
##$COROFFS= 0
##$CY= 11.3945322036743
##$DATMOD= 1
##$DC= 2
##$DFILT= <>
##$DTYPP= 0
##$F1P= 15.9154993809931
##$F2P= -4.1035820241983
##$FCOR= 0.5
##$FTSIZE= 0
##$FT_mod= 4
##$GAMMA= 1
##$GB= 0.15
##$INTBC= 1
##$INTSCL= 1
##$ISEN= 128
##$LB= 0.24
##$LEV0= 0
##$LPBIN= 0
##$MAXI= 10000
##$MC2= 0
##$MEAN= 0
##$ME_mod= 0
##$MI= 1.114404
##$NCOEF= 0
##$NC_proc= 0
##$NLEV= 6
##$NOISF1= 3.799351
##$NOISF2= 2.8
##$NSP= 1
##$NTH_PI= 0
##$NZP= 0
##$OFFSET= 15.70392
##$PC= 1
##$PHC0= -10757.21
##$PHC1= 6.000939
##$PH_mod= 1
##$PKNL= yes
##$PPARMOD= 0
##$PSCAL= 0
##$PSIGN= 0
##$REVERSE= no
##$SF= 200.130013532006
##$SI= 16384
##$SIGF1= 3
##$SIGF2= 2
##$SINO= 400
##$SIOLD= 16384
##$SREGLST= <1H.CDCl3>
##$SSB= 0
##$STSI= 0
##$STSR= 0
##$SW_p= 3612.71676300578
##$SYMM= 0
##$S_DEV= 0
##$TDeff= 0
##$TDoff= 0
##$TI= <>
##$TILT= no
##$TM1= 0
##$TM2= 0
##$TOPLEV= 0
##$USERP1= <user>
##$USERP2= <user>
##$USERP3= <user>
##$USERP4= <user>
##$USERP5= <user>
##$WDW= 1
##$XDIM= 8192
##$YMAX_p= 0
##$YMIN_p= 0
$$ End of Bruker specific parameters
$$ ---------------------------------
##NTUPLES= NMR FID
##VAR_NAME=  TIME,          FID/REAL,        FID/IMAG
##SYMBOL=    X,             R,               I
##VAR_TYPE=  INDEPENDENT,   DEPENDENT,       DEPENDENT
##VAR_FORM=  AFFN,          ASDF,            ASDF
##VAR_DIM=   8192,          8192,            8192
##UNITS=     SECONDS,       ARBITRARY UNITS, ARBITRARY UNITS
##FACTOR=    0.0002944,     1,               1
##FIRST=     0,             0,               0
##LAST=      2.4114304,     0,               0
##MIN=       0,             -335826,         0
##MAX=       2.4114304,     329329,          0
$$ Real data points
##PAGE= N=1
##DATA TABLE= (X++(R..R)), XYDATA
$$ [...]
2122b27j206L789m244K177P41l584L891j236j557K962k589L78K731m010K690L08
2138A014k769L958l008m71L018l501J393P88k251K506k13k148L291k388M28K097
2154A744l519K709k31k144K442j397q71K534k134N61J550k695K563o80j421K682
2170A693k026K02J551k314J237Q58k635K311j081p01K451k584J065J085j752J686
2186A046o27j350K048j149l61J583k430J498K10j887J931p73k02J153j035L4J373
2203A062j810J076o9j520K288j712J00J071j323J029n6j004J171Q3j230J509r76
2220c11J13J183j839J307l10n25Q28o21o74J272n05N9O75j283J217m65l91J195
2238I25q54L48K28r05K13M83p06M64k40n12J121q57M24j67J60K37j6l12k27O05
$$ y = [-227, -1433, 2356, -1888, 289, 1030, -2554, 1337, 101, -1456, 1506, -1083, -705, 2026, -1984, 706, 1014, -1755, 2203, -805, -1276, 1742, -1759, -366, 422, -1829, 677, 464, -1684, 1607, -781, -353, 1744, -1775, 934, 703, -1441, 1001, -396, -1267, 1267, -867, -306, 1244, -1451, 1112, 432, -989, 1693, -333, -131, 1420, -894, 343, 1201, -1434, 877, -204, -905, 1546, -1038, 27, 1112, -640, 1046, 419, -931, 1117, -32, -393, 1190, -1240, 258, 468, -1419, 512, -261, -463, 690, -345, -311, 1062, -748, 328, 259, -1261, 1027, -685, -585, 486, -837, 192, 136, -868, 303, 386, -844, 665, -311, -198, 985, -854, 453, 143, -382, 446, -175, -849, 423, -82, -23, 652, -631, 586, 121, -270, 925, 71, 419, 647, -258, -45, 438, -268, 196, -44, -556, 565, -292, 132, -35, 125, 362, 346, 34, -193, 412]
2258D12q13O86r41P08o4l32J33j94L59K2P7l37N68q8j71J40o23P68m11o6j72r4
2280d33L43j80J85j59O10j40j00P3ol0J22l38l17P13n15K93l36r4P23n20K95J21
2302C10K2Q1K63q53N19o6n54O61p89L31L96o34M73j4l75M46O9p24R38l56Q2K54
2324D80j226J158k72n24N62n45J40N06r14M63P76j565J567p53m95J494j183L78
2342D7K3p57P71l2j191J469n63k65J276j645R86K64p77Q81l69o42J239j022l82
2361f89J467j791J372l0j391J877r82J1Q03j122O54Q93j813J363k9j465K143j871
2379f00M65J027j616J188j80j171J613n28q90J833j599N07J097k230J815q46n40
2396f55J337j120k01J607j777P56J122k072J821j072j007K199j740J094j48o47
$$ y = [412, -401, 285, -656, 52, -12, -344, -211, -405, -46, -24, 53, -284, 284, 196, 25, 165, -458, 310, -101, -167, -339, -433, -90, -270, -85, -244, 366, 226, 126, 199, 193, 163, 285, -53, -370, 343, -172, 121, -215, -309, 414, -106, 189, 310, 332, 413, 676, -177, 342, 276, -278, 383, -406, -75, 321, -313, 160, 146, -229, 217, 286, -438, 500, 144, 226, 480, -746, 412, 140, -384, 178, -367, -227, 279, -635, -172, 604, -961, 606, -147, -642, 852, -331, 47, 70, -687, 84, 52, -1139, 330, -233, -498, 778, -867, 119, 383, -394, 487, 118, -524, 715, -307, -689, 778, -1013, 359, 329, -1062, 815, -167, -156, 647, -475, 179, 1072, -741, 622, 593, -872, 1271, -600, -135, 892, -724, 464, 284, -887, 726, 198, -692, 1141, -458, 49, 1146, -1084, 731, -115, -655, 682, -438, -639, 968, -809, -53, 1069, -1003, 818, -254, -1261, 938, -802, 292, 144, -503]
2412e03J102k22j203K157j435j035K107k327J823J75j387J552j023p08K088j715
2428e54l5J428k042J672j22j650K590j540r1J431j791P92Q53k223K078n70j306
2445a080K421k146O43J339k360J754r5j635K091p77j031K282k407R63J107k449
2461a380J989o91q21J761j575Q7J682k163J137P95k256K567j256j110K374k300
2477a160J243N76j880J782j12j620K584j952k89K100k700J897j15j212J993j280
2493a45k90K096j934k46J542k348J967o4j561K259k108O45J505j891P10R85k417
2510a295K300j030r56K453j983N69J022k299J887k59j421J685o31q82K313k609
2526a136J328P57k294K078p41p90J739j571Q2J379j690J023M76j911K450j331
$$ y = [-503, 599, 377, -826, 1331, -104, -1139, 968, -1359, 464, 639, -748, 804, -219, -927, 1161, -554, -589, 839, -1203, 469, 347, -1303, 1287, -253, -344, 1087, -704, 88, 941, -1282, 796, 226, -1080, 1341, -805, -162, 1177, -1183, 571, 476, -1159, 932, 155, -876, 1406, -1001, -38, 1069, -1380, 609, -82, -903, 858, -717, -630, 1052, -1111, 26, 821, -1435, 1132, -124, -1234, 1140, -1160, 83, 659, -1221, 561, 449, -1171, 1413, -539, -828, 1272, -1428, 469, 354, -858, 1135, -145, -435, 1661, -273, -519, 1023, -1325, 642, 578, -983, 1276, -832, -187, 1318, -573, 137, 1122, -1295, 1005, -25, -981, 1472, -511, 58, 1080, -1219, 668, 409, -1012, 673, 42, -840, 1473, -1136, 192, 949, -1345, 733, -8, -798, 941, -630, -548, 831, -859, 164, 640, -1271, 1179, -152]
2542a52n33J909k038R82Q56k114J511J11j644K348j687o0J644k278J457J58j427
2559i57J899j000n50J793j502KJ110j981K035l46j667K293j599J80R71j468R35
2576A48K69j553J926o12j036J780j707Q96O85j767J256q5j040J234p15l85J740
2593A034k125J081P16j812J938j007l98J286j058L07O76j260R23J92j504K258
2609A247j678M0J259j747R69L87j118J147j68r56J361j030J2R39j390J179k55
2626A98o07J143q89m9Q69j095K97P85j330Q92J82j055J333q90J09N02r06N00M37
2645D26j262J274m11o02J344j392N79L59j180J422p90m73J072p15j96R51j116
2662g10O21L70r03J079p50l60J008o06J18N15r35O08K50j052J208n98J5O03q86
$$ y = [-152, -685, 1224, -814, 168, 1024, -1090, 421, 532, -1112, 1236, -451, -511, 1133, -1145, 312, 470, -957, 942, -58, -608, 1185, -317, -315, 795, -1186, 849, 503, -1164, 1129, -470, -290, 681, -787, 148, 417, -1136, 790, 178, -858, 922, -785, 111, 796, -971, 285, 200, -840, 394, -321, -706, 1034, -1091, -10, 706, -1106, 832, -175, -573, 713, -345, -38, 638, -622, 301, 493, -1011, 1247, -431, -391, 868, -879, 90, 477, -641, 506, 338, -618, 743, -287, -275, 664, -726, 453, 198, -409, 734, -155, -204, 665, -430, -133, 652, -678, 214, 396, -659, 674, -216, -107, 395, -511, -11, 426, -836, 438, 27, -575, 769, -623, -44, 315, -865, 557, -233, -706, 366, -349, -545, 406, -710, -89, 281, -622, 457, -293, -653, 355, -251, -133, 382, -553, 55, 305, -747, 461, -137, -122, 481, -405]
2681d05O79K23p17N43L9o04P41n38N5O41j029O37j03n89R04n98K98J83m01J89
2701A48N10r53N40j42m65J024q82k4M49l34J11J93l99N28l37k05J032j069K80
2720EJ37m89O38l62m9k29J25k34P68p14K73M08o28O47m83L7m5K24j46M3k76J27
2742b23M16o27M54k85J87L72n52M08j34J63j84K98l19J97r6p5J58j32J41j99L88
2763C56k25J82K5k99J21r6L4k89N09l02m4J67j64K65k71K10k1J50j72m73M67j86
2785e6J94k1O5m19L52l87J06L59l98J07o8M9L11k30K35j37K5K74n63j89N30j63
2807b4m23N42m19M08j143R29L81j29K24L78o55n68N24m74N55L4n47N74k21l06
2827c60O01q4k05L99q49Q13l65k64P24m93J39O1l26J41L91n28K40K08o21O99l10
$$ y = [-405, 274, 497, -220, 323, 362, -242, 499, -39, 16, 657, -372, 265, 162, -427, 477, -121, 177, 360, -41, 148, 658, -295, 245, 103, -362, 662, -220, -244, 205, -129, -18, 175, -224, 304, -33, -238, 794, -275, 5, 142, -347, 291, -71, -120, -349, -224, -458, 310, -404, -131, 277, -351, 296, -187, -150, -195, 29, -117, -74, -350, -223, 193, -434, 20, -265, -78, 294, -258, 150, 16, 179, -5, 293, -26, 171, 75, 0, 158, 26, 167, -32, 356, 131, 313, 338, 39, 160, 64, 98, -191, 318, 16, -28, 139, -25, 240, -31, 179, 158, 308, 136, -337, 130, -56, 138, 117, 182, -237, 115, -272, -166, 193, -205, -98, -166, -117, 194, -36, 199, 62, 87, 361, -202, -391, 139, -24, -447, 95, -324, 84, -1059, -130, 251, 122, 346, 724, 69, -499, 25, -449, 106, 140, -407, 167, -54, -360, 241, 157, -48, 351, -498, 315, -50, -314, 410, -83, 56, 117, -209, -68, 323, -205, 35, 243, -378, 321, 11]
2848A1L3M71r81R57n75k65M82k14k59R28j172M14N69r30J152o31k23O83o43R3
2868a00J87l81L04J77q11J189o95k67Q82r31M57n5n77R19j06o58J010j031M3J095
2888F51q74L97r2p67J106n59j10M11m33J84N16j060J067l08m92J091r68J76P41
2907F77j132O00J96q14O70K2n39J299j289M67M34j236J012l43l46P69n69l06J012
2926E84j138O61L26j090J243o67k88P09o20N4M97q93Q90J37j242J528r30k26J270
2945H05j485O22L36o80P08l21m81O57n42N2P92j128Q91k96p65J478j015p7J262
2964H13j327M28O93j326J291l33n44J302j763O11M29p68J572o73j212O29L69r33
2982g42J166j043M93O11j343K098j407k82P16m46l49J250j387O36O39j387J426
$$ y = [11, 44, 515, -466, 491, -84, -349, 133, -81, -340, 588, -584, -170, 399, -531, 621, -10, -233, 450, -193, -100, 87, -294, 10, 187, -624, 565, -130, -397, 485, -446, 11, -44, -621, 298, 192, -466, 544, -487, -444, 651, -223, 174, 82, -685, 421, -138, -248, 163, -270, -86, 430, -630, 437, 129, -363, 728, -240, -64, 677, -455, 145, 341, -473, 197, 219, -320, 979, -310, 157, 591, -645, 367, 24, -322, 447, -122, -428, 584, -554, 107, 433, -657, 586, -81, -369, 340, -280, -226, 271, -622, 268, 405, -837, 691, -239, -465, 805, -680, -58, 278, -402, 306, -15, -496, 161, -381, -329, 463, -665, 226, -70, -835, 643, -372, -449, 813, -514, -86, 607, -719, 572, 239, -305, 997, -766, -155, 274, -494, 1078, 405, -807, -178, 191, -742, 424, -619, -126, 485, -858, 1240, -167, -449, 267, -179, -528, 722, -665, -29, 610, -777, 649]
2999F49m45p03J095o46P3M14j133R49J67j242J384m86k88Q23j091N16L02q04Q72
3018D06j89j009J503r57K2J006j514J133P8j334J384o70k54Q31q20K61O54j070
3036e39P50N9p46J416j509K01Q89j001O31J73r23J184m12p02J225j324O10N15
3054D97r70Q84l89n29J036n90k69O69j057Q90K77j154J292n96k17P79p81K28K44
3073B44p36Q60J59j020J335j004J63P55j341R37k46o21Q38m50N7O53j032J02Q59
3092E12j171J173l96n65R91j052K32P10p96J78M54o96Q15l97n24J058p80K17M23
3111C86j043Q98j07m76N70k74k92P81q01L47L07o07P65o02N0K42l57P9P46j024
3131d12P77J63j091J012o33k2N98n63K68K34p53Q04j46o17R02p19J52L14n71M07
$$ y = [649, 204, -499, 596, -50, 23, 437, -696, 253, 420, -822, 562, 76, -212, 611, -480, 36, 338, -466, 406, 217, -792, 711, -246, -224, 782, -732, 401, 479, -855, 529, -141, -395, 436, -384, -123, 531, -539, 211, 270, -476, 940, -569, -368, 521, -480, 151, 324, -599, 585, 173, -529, 696, -628, -18, 497, -473, 411, 22, -507, 529, -61, -330, 339, -718, 172, 449, -705, 587, -9, -226, 553, -228, 0, 244, -492, 368, 527, -493, 842, -162, 1, 756, -585, 352, 106, -515, 323, -127, -70, 583, -449, -347, 512, -659, 514, 118, -447, 544, -508, -276, 434, -362, -184, 270, -426, 389, -8, -532, 526, -254, -37, 386, -657, 241, 134, -342, 228, -46, -338, 443, -358, -11, 296, -311, 454, -148, -98, 144, -213, -134, 612, -412, 365, 528, -563, 449, -184, -206, 392, -171, 97, 331, -422, 382, 236, -381, 521, -198, -46, 268, -303, 104]
3151A04J5n30O79l75n6M26n06J68N13p07M60k30k16M53m39P8J95j79j57P01o98
3172c01O43l07k30O17q44N05p9k73M51j06l97M21j38j56P17p31M32O9l72N70m68
3193B3M6n8J02j46K16m25K40K43n19N19l79J52J07k47P9n2j54K64j6j66L64j98
3215er9J10j27K80j48nK1j23J00J04m92K0N82l07J24j15k53N79m34J20J24j89
3237a33M6M7J53q3K29k72J15l38K28K7O0k4k12J28KJ79k51J65l13J24K1O3K5k8
3261d2K74l46J38l07L04L2N2J0k91L19j13J22k39J70mKJ35n50K97K24k53L7j28
3284a57pR4L53m63L48l65K23J61m94K70j20K65o2j81J66J67k43LN8k99O39n79
3306b23J56kk3M17n88J2K26J30n82N78k71j90N59n42O36m90J82P5j1k12K28j99
$$ y = [104, 119, -411, 268, -107, -163, 263, -243, -75, 438, -269, 191, -39, -255, 198, -241, -163, 32, -147, -304, 397, -301, 342, 35, -195, 422, -422, 83, 4, -269, 182, 76, -321, 100, -38, -194, 523, -208, 224, 293, -79, 491, 23, 69, 11, 113, -33, 183, -242, -2, 241, -278, 241, -138, 14, 121, -126, -47, -99, -253, 11, -5, -171, 193, -5, -104, 6, -121, 159, 11, 6, 27, -96, 4, 108, -384, -364, 218, -89, 35, -80, -333, 246, -188, -68, 56, -133, -87, -40, 113, 30, 259, -13, 102, -236, -8, 19, 79, 55, -157, -29, -27, 152, -99, 66, -247, -123, -102, -39, -14, -42, 232, -114, 24, -283, 21, 53, 105, 115, -176, 143, 30, 152, -87, 83, 79, 81, 216, -334, -37, 187, -66, -29, -157, -164, -70, 283, -180, 168, -197, 26, 187, -307, -37, -157, 108, 46, -135, 31, 198, -45, -42, 16, -283, 356, -223, -67, -69, -92, 325, -263, -251, -25, 105, -477, 101, -170, -360, 199, -343, 293, -197, -15, 60, 49, -163, 65, -134]
3328a34K36l2m43P37l82k30Q39q86K05J95j63j47L18m01O11k57k99P44p05M16
3348B22j88qN57k6p32P13m41q01J463r31K17L88m4P01q30o0N62q84N42k78q71
3369g29J283m71m64N08r94L47N15j07L59p4j10K2n4m76O18q08M42L33o90M50j43
3390b43j12N79j66m21q0L16k11K55l99N15o54M96O87q74M4P47p90M85q76L00O67
3411B65K59r76J029j003M26Q5p56J166p46j96J55m68O41L20m65M10O2m13J026
3430H21q41K6K41l99J91L13p98J019l45o03R36o93J00M24o78L91J9k33N06p09
3450c12J83K25l59q0Q32j039J47R44q49L44l76J92K84n33M98m2p61J054m82j54
3470b84P90r71K61M65o86O05j89o74J051o00j77J078j038M60O5o40O38k58p5M29
$$ y = [-134, 102, 70, -373, 364, -18, -248, 591, -295, -90, 105, -58, -205, 113, -288, 323, 66, -233, 511, -194, 222, 34, 26, 583, 557, -175, 538, 97, -704, 759, -172, 45, 433, 389, 1090, 260, 200, 762, -122, 420, 142, -729, 554, 83, -381, 127, -867, -520, -5, -112, 247, 173, 63, 85, 31, -445, 173, -635, -193, 140, -550, -100, -243, -355, 224, 58, -363, -443, -127, -338, -83, -482, 33, -621, -125, 562, -312, -268, 479, -311, 174, -702, -402, 265, 524, -452, 577, -426, 0, 85, -671, 495, -251, -447, -292, -760, -119, 201, -264, 146, 208, -205, 821, -20, 6, 247, -152, 39, 352, -446, 573, 228, -375, 561, -132, -32, 392, -286, 105, 124, -109, 397, -312, -129, 96, -263, -343, 489, -550, -403, 541, -308, 36, -340, -148, 136, -397, 101, 59, -702, 352, -130, -284, 506, -465, -204, 261, -425, 180, -9, -683, 368, -232, -409, 669, -369, 91, 156, -484, 154, -104, -179, 250]
3490B50m42k0N99p31N27J91p13P67l69k09M81o34M17K13o07P01k21m11P70p13
3510a54mP00j010R08n19q3J74k35O42n65j48L44L87j106J112k75m53N19l95j56
3530c17N02o78N26J3o31Q14l09n78Q61m07L29J2m43M58L11j408J366o34O1K36
3550H4k10M48k98k38K55l32j17R88j012N18K31q36M10K74r80J702j208R46p6o36
3570h7N43k48l13P12k76p82R25p45L17N16q20J94J38j46K71L1l89N26j70M17J76
3591G90j006R02p23r6L91m28l8N42p00M80J11o47R08o82M5N58p22L69M0m58J26
3612b38K59l70L59j64j29M97n30LM2r7M75l19p6M57l16l6M95m68M62j13l59M70
3634C04m37J68J46k80J37L80m64L10o1k86M36k06K8J70n23L13k18r2L53j86j57
$$ y = [250, -192, -212, 387, -344, 183, 374, -339, 428, 59, -150, 331, -303, 114, 327, -280, 421, 200, -211, 559, -154, -158, 542, -468, 440, -79, -162, 12, -223, 419, -146, -294, 50, 437, -669, 443, 168, -285, 234, -161, -317, 185, -493, 33, 46, -585, 229, -80, -658, 203, -204, 125, 137, -306, 152, 463, -945, 421, -213, -152, 84, -126, 322, 24, -214, 41, -291, -408, 580, -432, 86, 317, -519, -109, 165, -815, 887, -321, 625, 549, -87, 456, 208, -105, 607, 331, -451, 474, -271, 46, 562, -258, -64, 74, -72, 199, 230, -159, 367, 197, 614, 790, -216, 686, -37, -133, 258, -170, -208, 334, -366, 114, 225, -422, 486, -196, -151, 407, -315, 54, 94, -364, -238, 21, -349, 10, -154, -283, 214, -316, -313, -271, -368, 107, -212, -288, 169, -147, -183, 312, -156, 306, 193, -166, 304, -133, 35, 181, -99, 38, 418, -46, 264, 203, -83, 353, 147, 175, 345, -178, 135, -83, -175, 178, -8, -165]
3655a65M96n36J25M47p06N90l09j90M54l47J72J25j04Q0o6j92M32o39K58K44l79
3676b10K34Q0j63M11n49n6L44l37J57O1K0l4j78O1L06k26n3J21L2k54L33l34J36
3699i8J80k82N01m29o1L30n7J2k83J61k28K01J51q0o7l6J85k57K41m2P2j33J55
3722A36j63%J75j34J6q4K31k09K96k29j38R2j22L15j96K50k08j56N8J14J85l08
3744g9J49o2O4p6j5j33k83M17j69M1p4J59j5O0j0N6j89Q8K45l52M1L24k21o5K47
3769A48j46j22K34j82J87l01L2K58l28K50Q9J89j96J59k30R5l58K08m2N0K07j39
3791F2l28K33m1O2k22K43l03M56j21J32k75n2K30p2m9L78Jn39L23k25K95M2k37
3814gL73p91R68p05N4o6K7RP8J26k6P7k3m2K1l65J54nJ08K17j56O6k9k53j29P4
$$ y = [-165, 331, -205, -80, 367, -339, 251, -58, -248, 206, -141, 31, 156, 52, 132, 66, -126, 306, -333, -75, 169, -210, 24, 104, -59, 352, -197, -253, 91, -246, -89, -28, -8, -42, -220, -159, 147, -79, -132, -11, 21, -233, 100, -234, -98, 82, -200, 301, -128, -189, 141, 84, 96, -187, -26, -254, -53, 98, 18, -49, -85, 100, -157, 84, 42, 114, -19, 136, -27, -27, 148, 14, 30, -54, 177, -32, 264, 35, -103, -11, -133, 182, -14, 236, 28, -128, -70, 44, 229, -79, 70, 8, 72, -4, -19, -152, -435, -18, -187, -146, -220, -61, -76, -16, -26, 30, -159, -71, 174, -178, -137, 187, -34, -99, 148, 2, -120, 114, -68, 119, -182, -150, 108, -220, 30, 119, 308, 112, 271, 41, 136, -222, -14, -56, -6, 201, 62, -266, -33, -74, -12, -234, 9, -294, 162, 41, 173, -102, -154, 76, 4, -45, 333, 334, -205, 118, -107, 188, 230, -7, 366, -425, 543, -162, -108, -174, -147, -138, -60, 66, 40, 117, 94, 52, 73, -292, -138, -143, -35, 182, 26, 92, 63, -190, -319, -245]
3840b45J42J25k77K71K29n44L42j5m7R1pl75M12j44m7K51m72L57j15k2K09l22
3862b03L5J75j19R1J25l77L93j70j98M74k24j13L62m86K35L08n44M03k64J01M05
3883D09m86L57j27l25N45m86n6L66k11j17K63l67L74k57k49N36k61J0Q3j01K08
3904A08mm87M06K66m68K41o7j55K96k55J8K67l67J13K47l96L30j91j11K35l27
3925c01L52q1k95M15k85O3J30k4j12L12l51K51J9l25L49k05K38n7q1K15R4k40
3947H1kJ3j38J09j23L78j06l29O02n26K90pk99O2l0J32l06K87j23M18l90j37J88
3970D4l04J80J60k40K21P1l59N30n79K40J72m90N93l90J5L02m79L14nl7l02M27
3992H4o62N43K8q5M35m20K5K66k03k21K64k38K77j64j02J48q11Q01J22k53J72
$$ y = [-245, -103, 22, -255, 16, 245, -299, 43, 28, -19, 72, 65, -310, 102, -42, -89, 162, -310, 47, -68, -90, 119, -203, -168, 7, -112, -21, 104, -273, 120, -50, -248, 226, 2, -111, 251, -235, 0, 308, -236, 167, -97, 4, 409, -77, 280, 153, -172, 373, -113, -169, 197, -14, -131, 132, -235, 139, -118, -367, 169, -92, -82, 1, -100, 108, 104, -383, 23, 289, -179, 62, -5, -160, 136, -119, -101, 166, -201, -88, 159, -237, 93, -98, -209, 26, -301, 51, -30, -325, 90, -195, -132, -2, -26, -138, 174, -177, 74, 93, -232, 117, -88, 150, 93, 12, 227, 321, 81, 79, 92, -46, 63, -60, 318, 212, -117, 485, -41, 249, 242, -57, 5, -25, 107, -199, 88, -35, 383, -7, -144, 44, -260, -80, 80, -160, 61, 132, -227, 303, -276, -36, 136, -354, 239, -151, -136, 166, -313, 1, -4, -41, -343, 84, -578, -35, -7, -92, 343, -77, -52, 214, 11, -210, 54, -184, 93, -71, -173, -25, -836, -35, 87, -166, 6]
4013Fj14j36K79m8k20M56n07K51K70l57K97k59j68L32l8j6L9j40J18J03k72L74
4035B50m42p6M58l71P2L97k88K7K94l83J27j08j92L44m75N04O0l62K52k00J5J18
4057B1m0m3K57m77L81p0J45J7m88L04kj30K01p0k53K38l7j34M83l82R9j38p1J17
4081g2j49J06K17m0l7L4Rl04K38N61j7m17J09L0J91m40K00k64O94n83K77O7m55
4104d5j4K57k40K51j92j88K08r1j32L75m30J30K90k34J78k72O0J67j53R8j5J6
4126B4n5p4j14K73J6l90L42l60K02J04n1R7j9j05R7J55j87K07m06K84M4j00n3
4149f9j0jK36J4r6j7L1q3J45k34J78M9K0j0k95L31j82oj36L91m10K08j7j7J05
4174A25k07J54j39J56q1o9j2J06o3R7l4l8P9Q7p4mN3L8k55J41m1o4N8K15p5l38
$$ y = [6, -108, -244, 35, -13, -233, 223, -284, -33, 237, -120, 177, -82, -250, 82, 44, 28, 67, -73, 45, 148, -124, 250, -192, -268, 190, -181, -109, 288, 0, 27, 321, -62, 65, -43, -235, 109, -366, 138, 198, -164, 88, -112, -97, 21, -19, -62, 195, -282, 99, 29, 174, 191, -297, 7, 5, -125, 76, 6, -247, -9, -46, -180, 303, -79, 20, -118, -189, -72, -221, -115, 102, 62, 25, 59, 68, -236, 2, 563, 546, 129, 238, 268, 459, 19, 219, -45, 649, 66, 343, 410, -45, -59, 198, -42, 209, 17, -171, 37, -54, -186, 189, -241, -111, 179, -55, 123, -149, -89, 78, -75, 23, 8, 24, -31, -105, -219, 54, 70, -320, 22, -338, -136, -32, -83, 14, -5, -110, -13, 142, -45, 162, -244, 40, 84, -16, -69, -79, -80, 156, 170, 74, 57, 88, 5, 150, -84, 94, 143, 163, 153, -142, 189, 7, 1, -135, 256, -154, 54, 37, 20, 125, -82, 72, -67, 89, 8, -61, -73, 33, -30, 67, 33, -5, 74, 161, 87, 83, 136, 174, -81, 60, 19, -45, 13, 228, 153, -185]
4200a85K44j15j10N9J05NK12k29J13K45m13J05Lj77k3J98K0k09K64Nj19k90K71
4223b1j86L43N7k47J85l08J75J21O4m4k17J13j4R0l01N3K62j42j66O2K71j11K37
4246B76k54jr2J67K41l35K4J31m0o9p8k1K34j47k09J85rK7k5J40k24M4J92k25
4270f8J45j89q8L51k41n8LL86k77j88N2J43Nk9M0J30j22j45J88k67J13K23j16
4293iJ1j52J03j10J80J06p5j82m7K74j35O6K80k72R4j43Q9K52l08lM0j8lm7Q1
4318G2J29m59K47J88j45M22k79j36j19n2P9K68m65J49K63j42J26k30m1J96j69
4339i8l4J95j81J14l8J19oJ58l44r5O4J03K4j20j51M12l46K21Rk4L18m85J01J42
4363E8j15J28q0m2P9r5j22K18m7K18j35k35K76k65K89N3j30k22J72K10j85n1n6
$$ y = [-185, 59, -56, -166, -107, -2, 3, 215, -14, 99, 344, -69, 36, 39, -138, -161, 37, 57, -152, 112, 117, -2, -292, -21, -207, 136, 193, -54, 131, -177, -2, 119, 183, 139, -78, 35, 21, 111, -190, -137, 125, -17, -183, -121, 150, 39, 276, 22, 21, -71, 96, 337, 2, 26, 157, 117, 48, -30, -51, 183, 36, -173, 12, 3, 30, 5, 145, -79, -35, 157, -68, 77, -112, -200, 151, -90, -148, -145, 241, -36, -224, -172, -29, -24, -53, -13, 117, -5, -150, 38, -229, -116, 107, -9, 2, -150, -47, -157, 23, 129, 54, -128, -175, 99, -36, 30, 310, 38, 132, -11, 78, 330, 22, 19, 59, 41, 38, -9, 72, 201, -258, -11, 177, 32, 454, 175, 39, -80, -132, -53, 215, -250, -101, 162, 20, 146, -84, -125, 71, -98, -132, 63, -118, -4, -42, 77, 71, 229, -115, -210, -146, -43, -19, -139, -290, 122, -224, -3, 6, -18, 300, -185, -84, 58, -57, 71, -9, -51, 28, -67, -189, 29, -18, 200, 65, -170, 106, -159, 130, 183, 53, -169, 3, 213, 28, -23, -79]
4386g9K30j05K21k7m24J97M34o51N65m82L89j65m00N22k26J29m74J64L93k21r6
4407a06L39q9Lk31K03l07L33m4l46M93l62J38K78n00K39P03o75l2n2O7P2J8J84
4430C26J94m51Pp57L58J33K02o89M80p7R3l3K84l04J50K9Q6o87O18K51k12O46
4452F47m50j88N61q52L73j41k58J78m31K66R32k24q21K87N3M07m02K94o10M42
4472F3k35M14k6m79M38l74J25l0m3K47j71MK69k47j16K44l67O13k68k99N07l15
4494d6jN8k1K33k94J30j18j11L3J50Jj38R0k32K85j65j2L17k98RJ60k06M22k28
4518A8j19k5J19K6J61m69K81J6j68K82j21N9J42l13qK78l49J69l7p9L82k09r8
4541f2M7j74L37j03j98pJ44J03K11o32M64q9k36K36J0j6K21k96l7L61j98r6J97
$$ y = [-79, 151, 46, 267, 240, -184, 13, 447, -204, 361, -121, 268, 103, -297, 225, -1, 128, -346, -182, 211, -10, -106, 233, 144, 147, -84, 119, -188, 145, 101, -245, 248, -114, 24, 302, -198, 41, 744, 69, 37, -15, 52, 124, 142, 326, 520, 69, 76, -681, -323, -190, 12, -677, -197, -274, -181, -214, 70, -234, -84, -55, 31, -656, -38, 213, 1, 647, 197, 9, 570, -282, 91, -50, -308, -130, -561, -295, 637, 413, -408, -121, -68, 339, -63, 231, -379, 63, -172, 242, 216, -263, 175, -199, -74, -104, -147, 100, -71, -67, 202, -45, -161, 83, -284, 329, 61, -238, 269, -46, -47, 11, -10, 223, -71, 59, -59, -170, -137, 13, 14, -124, -34, -266, 19, -146, -158, 159, -139, -130, 30, -176, 246, 18, -101, -126, -7, 19, 180, -289, -8, 8, -160, 122, 1, 60, 202, -111, -119, 159, -190, -21, -58, -137, 245, 36, -62, -15, -189, 148, 45, -153, -160, -16, 87, 298, -334, 130, 41, -195, 41, 51, 35, 256, -40, -77, 284, 86, -10, 187]
4564A87m70M48Nl5j4j47p6K51j88K07k64p3M35l18l6K22l99L73k25rJ96j80j59
4587b69K08k07L18j5j96K51j99K61P2k03Q5K23m04K32q8k62L67j3k99K56j10K1
4609B9q8R1J2j18J1j36K4O6J09L1mK9r4J19P2j51Mk71L60p8j73Q5R9m0K89k98
4635b1K8m5J29j33j87J67J86k50K39J47m22J03Q2j86K02J75l10J01j33K0J42J
4657C5k75K93k90M06Jk90J60j72N9O1k45r8K51j58M63m89M5L82l15K22j08J34
4679G2j34l8K46l17J34j36K28m7N3J33N1j48r9%J09k00K01Ln6mj3j39L9K08r7
4704D9j46K43j1l9k48K72J81m25L45j71J34k24L6P2j15J16k78m6P1qL22k99J90
4727B1r4rm7L1L52k47o7N3J34j68P1m0oo1j44J84K07p8j99J4M8J9J56L8k40mJ53
$$ y = [187, -283, 165, 170, 135, 121, -26, -102, 149, -39, 168, -96, -169, 266, -52, -88, 134, -265, 108, -117, -126, 70, -110, -269, -61, -268, 50, 35, -161, 90, -109, 152, 224, 21, 106, 329, -75, 157, 69, -193, 174, 161, -138, 118, 8, 29, -59, 32, 44, -74, -63, -199, -175, -109, 0, 31, 27, 56, -38, 81, 153, 2, 6, -265, 95, 17, -156, -71, 28, -12, 277, -21, 7, -38, 91, -42, -229, -62, 124, -126, 113, 260, -162, -59, 23, -163, 39, 214, -96, 5, -128, -108, 34, 35, -240, 53, -237, 169, 170, -120, 40, -132, -73, -12, -257, -355, -104, -262, 201, -288, -243, 139, -176, 46, -62, 72, -62, -100, 146, -171, -37, -173, 55, 8, 61, 194, 245, 97, -2, -2, 107, -93, 108, 111, 55, 51, 38, -101, -62, 146, 49, -97, 146, 135, 96, -152, 120, 301, -124, 221, 50, 184, -40, -4, 68, -47, 69, -209, -255, -184, -192, 130, -169, 21, -73, -82, -129, -98, 254, 7, -60, -7, 127, -41, 30, -10, -16, -77, -221, -37, 170, 92, -107, -93, -45, -26, 130, 168, -72, -76, 77]
4754G7p1M2P5k2RJ39j41m39M31P4r0J58k15j28L11j40Oj62j43M51k73K10j39k99
4778b79M53k04jJ61j37kNk36R1O5L8P1rL4J24j73J0k22O4K85J96m75J67j00n0
4803a24j02Q2J59J08k47J83p0j02K36J05l93L78m18K30K4m7J98k55J44J3n2j1
4825C9J19j77R9J52m21M82l18k13M73m64J01J56n5J49j18o4L53l46m5L08k24J7
4847Cj84M0J18n2l2K28n1k81J60m5K95p1k10K14j31j41K48Kj99K73l37K44j32
4870d1J53j15l2J71k98J67P5O3q7k71k7O0N08l47L58k21l76L38j73R0J26l38P3
4893a44K62j15j23J92k38J74j58M7N18n06J12K69m32K2qj62N79n10J02L08l47
4914a58J38O7OR6j34j39L30n04J82M20m07K97L17p57P12l36k07O10n1m80N3l60
$$ y = [77, 6, 48, 123, 101, 110, 249, 108, -331, 100, 174, 84, 242, 27, -101, 210, 70, 76, -86, -229, 222, -51, 159, 20, -279, 174, -30, -31, 130, -7, -9, -4, -240, -149, -84, -46, 25, 16, 50, 174, 1, 11, -211, -147, 138, 334, -141, 26, -74, -124, -226, -144, 15, 123, -124, 59, -11, -113, 123, 228, -165, 213, -205, 25, 49, 2, 200, -55, 89, 102, 50, 39, 158, -19, 80, 232, -189, 293, -25, -238, 235, -229, -128, 28, -27, 122, 4, -60, 293, -53, -98, 210, -14, 3, -181, -141, -23, -75, -107, 121, 70, -211, -51, -96, 199, 128, -82, 132, 1, -140, 108, 110, -89, 184, -153, 91, -41, 112, -3, -35, 136, -162, 5, 80, 143, 56, -215, -242, -182, 326, -21, 337, 116, -260, 78, -95, -5, 121, -217, -144, 118, 3, -120, 72, -166, 8, -150, -103, 415, -91, 21, 290, -142, -120, -128, -290, 289, -221, -119, 189, -158, -20, 47, 53, 149, 15, -124, 206, -298, -116, 304, -103, 194, 511, -246, 466, 130, -77, 533, 482, 2, 55, -305]
4936c05N15l26k99N24l21J01J86l18L99kl44M15l32k06M67l50J70J35j87K23o4
4957H1k70L51m36O5K73p0k61L54k24P8m4j06L96m85L76j6k57J65J11l28M84l72
4979a35n6L13k79L52j57l58M65l57L95l26K09L04K43o84K25L52l90R6J65o75M98
5000B00qN6k27k68M22j29l64O93o3l43L13n29M16j55j95N51n11o9K20j78J78J64
5022A74m62N00l85J45K30m91K9K70j45K38K82q42O30l36P4J04k66J73K33k98J26
5043a7K52j73J31k68Q1J80l53K11J46l46K32p2j90M40n1k06j5l22M08N3l20M98
5065B99l78J61J22l38M3K73n37L14O3j75M11l20LL63m77M13k13k57R17r49K6N94
5087C58p40M74j21N0q0J78k78N08n29L7M56o40L15k2q9J07k39m7K93j7O4j22q7
$$ y = [-305, 210, -116, -415, 109, -212, -111, 75, -243, 156, 154, -190, 225, -107, -313, 154, -196, -26, 109, -78, 145, 81, -189, 162, -274, -209, 64, -6, -267, 87, -137, -59, -103, -209, 187, -298, 78, 62, -195, -30, 81, -247, 237, -135, -191, 122, -157, 195, 38, -320, 145, -212, 183, -143, 66, 370, 613, -71, 154, 506, 116, 212, 377, -298, 200, 192, 248, 21, -247, 175, 46, -318, 375, 312, -31, 282, -247, 169, 14, -181, 370, -141, -210, 10, -168, 10, 174, -288, 212, -173, -28, 202, -289, -260, 10, -135, 103, 385, -457, 173, -163, -89, 15, -251, -78, 155, -143, -17, 235, 62, 193, -75, 6, 186, -167, 44, 190, -156, 76, 4, -186, 254, 203, -3, -18, -340, 68, 121, -199, 299, -79, 82, 204, -134, -91, 182, -355, -41, 22, -153, 258, -62, -59, 304, -173, 240, 27, -230, 687, -262, -236, 358, -382, 92, -29, 21, -59, 119, -159, 349, -180, -143, 313, -327, -12, -34, -123, -16, -255, -302, -9, -26, 38, -84, -171]
5110a71L10j70o9K09j29R4Lj19K96l09j13J87j38n5J7J45J0K99l94K68j5Q8m2
5133B02k39j5K14j75j21J98k72J60r6N4L69l81p3K96k46J07k22K15M8j02J74Q0
5155A75l77P7K70k00K5r2j10K10m9j38K89k59Q8P1J41k5l58M53J3q3p8j31Q5M7
5179D4j21N9k0q6J01J91m1k1j19o0J66j52K5K46l20J9K54l7k6qj20j38J29J70
5203A35m7O3j46q5J19m6N7K7j62J99l1k2j74K10o7j72K10Pk75K65j52J30m8p7
5227h2M8K2mn9O2l1j49K05J45O6J54l73M2p0r5m6J15m23L35R4op6j74L62j40J75
5253I7N6o3j62J42J49k61k18K37K08l04Q1K00j99J55k63K55J78m46P9L79r8k31
5275b9llQ2O4j88K50J41j20j46o8P7K48m86J46J31j15k8K35k66K02j34j27O1k61
$$ y = [-171, 139, -31, -100, 109, -20, 74, 77, -42, 254, -55, -168, 19, -119, -174, -157, -12, -2, 297, -97, 171, 156, 244, 202, -37, -52, 162, -13, -134, 64, -208, -48, -144, -90, 279, -102, -175, 121, -125, -18, -240, -25, 23, -79, 95, 175, -202, -125, 145, -55, -30, -122, -232, -22, -71, -209, 80, -179, -91, -20, 121, 96, -262, 191, 204, 121, 43, -88, -3, 44, -77, -18, -38, -124, -23, 168, 127, 106, -13, -73, 93, -59, -34, 212, -108, -89, 165, 128, 102, 94, -26, -164, -35, 135, 88, 151, 5, -80, 39, -7, 50, 77, -85, 114, 83, 61, -113, 97, 30, -142, 68, 75, -200, 65, -87, 43, -5, -82, -34, -12, -16, -75, -13, -44, -193, 12, 157, 223, 377, 4, 46, -24, -119, -165, -50, -473, -138, -44, -50, -126, -300, 62, -78, 97, 153, 90, -72, 70, 219, -42, -260, -23, 185, -119, -38, 162, -37, 118, -145, 110, 288, -158, -79, 300, 202, -29, -32, -35, 47, 111, -77, 173, 314, 194, 48, -20, 57, 305, -181, -35, 96, -19, -47, 188, -78, 124, -10, -137, -76, -337]
5299c37K38L5k69K88J44N2j82j90L47K32l36M9K3j97R6k69J31M73m32K57M2l14
5321a19n4J42j83M17l37K68J99m86K27j98j00L41k18R0L10m42o7K52j08K03k73
5342a36N0K04j00m1L50m06J59j72m8L24k52n0J72j91K58J99k89L26m26K14j35
5363A0j4J56q7k90N7J59j36J14m5J60J23n08K00K9j42K80j60O8K01o52N84j6m20
5386c29M51k95O7J22q5j43L11k25J61O7m04L65J21m44L03j06LK37m54J46L60m41
5408b12O45n92m8L74m84L26N5r2J83k85j71M11k10L27N0k18K53j23q10P99k35
5429e7n0L62k54O7K94m89L32k44m9K35l56J61K89m03K63j06j15K86K3l39L04m59
5451c05J90L94n54L79j42k52N52j89j68K53m15K66J99n58N81j95j09J76l10K55
$$ y = [-337, -99, -64, -333, -45, 99, 151, -31, -221, 126, 358, 22, 71, 94, -103, -7, -276, -145, 328, -104, 153, 195, -119, -173, -31, -214, 203, -134, 134, 333, -153, 74, -124, -224, 117, -101, -11, 299, -143, -210, 42, -66, 137, -136, -86, 118, 18, -23, 327, -79, 80, -92, -140, 184, -68, -118, 54, -137, 121, 320, 31, 357, -69, 145, 10, -4, 152, 65, -225, -168, -9, -145, -31, -76, 84, 207, -301, -101, -72, -214, 66, -94, -26, 175, -477, 107, 91, -329, 122, -173, -106, 16, -69, -212, 99, -126, 35, 102, -302, 63, 184, -260, 43, -63, -60, 177, -277, -131, 229, -212, 433, -159, -207, 167, -317, 9, 64, -28, 155, -130, -301, 110, -100, 227, 277, 59, 312, 189, -621, 178, -57, -107, 255, 1, 68, 362, -127, 205, -39, -88, 147, -209, -48, 241, -162, 101, -5, -120, 166, 189, -150, 154, -305, -115, 279, -275, 104, -38, -290, 262, 73, -95, 158, -257, 9, 208, -350, 231, 36, -73, 103, -207, 48]
5471D8k2l02L44J7L0J97m16J44K04n57K05L51n47M43l7j77K77l09J04P3k50L60
5493A80k58j70M24k40J30O0j92J52J25k80K84l0l20N29n07LL36n78J87J77k28
5514b16L32k24K4M41m88J67J89l56J44j18P4K51k19j0K01m99L42m9l55N90j42
5535G9l70N09l94K31J12l40J54L0r2L00k61L4K58m77N46j64l18L07k72K9M50k52
5557I9j25K41k74J49J44k29O1l11L19O0j78O7j4k43L22r8j65L35l18r4N43m11
5579a20N5J17k59M00j00j85K91k03J18J14l47J07J51m04R2kJ7O45q41J74L79k22
5601b3K91m92J16K37l38K44M6j45Q2l3k16K38q8J29kj51K29k13J38j58L9JM20
5624C51m90O8L9j16K88j45r9J76o0R4k42P1o0K48k24J22k01J45R1j17R7L0k73
$$ y = [48, 26, -276, 68, 85, 115, 312, -104, 40, 244, -313, -108, 243, -304, 139, 102, -75, 202, -107, -3, 70, -180, 180, -78, -248, 176, -64, 66, 126, -66, 86, 211, -69, 215, 185, -135, 394, -113, -110, 226, -352, -165, 12, -216, 116, -108, -84, 357, -131, 36, 225, -131, 13, -105, -31, 220, 1, -9, 192, -307, 35, -14, -369, 221, 79, -291, 218, -176, 55, 167, -173, -19, 11, -81, 219, -42, -8, 250, -227, 319, 155, -163, 144, -128, -99, 351, 99, -26, 215, -59, 90, 234, 5, 66, -245, 74, 134, -44, 23, 9, -234, 88, -10, -175, 160, -158, -252, 291, -120, -65, 52, -207, 193, 93, -92, 199, -4, 114, 228, -119, -12, 139, -265, -173, -175, -158, 487, -354, -180, 199, -23, 268, -224, -108, 129, -209, 35, 81, -64, 18, -15, -231, 7, -81, 48, 46, -105, 124, -89, 49, -109, -70, -69, 351, -139, -71, -32, -148, 140, -5, -104, 72, 12, 106, -136, -65, -125, 123, -101, 21, -180, -35, 56, -61, 36, 66, -207]
5647b07J82n0p8Q4O0j5K34k01lJ08K2O9m12J11K53l14J81K48j61j4r2q0J18j78
5671a35n5M05k93J13J6j86k4L75l47J21j5j72N7L36l60J62m5J44k36K56q2j50
5693a15k1K97l38L55j33R7Pk72Rr4L23j22l0J77k81K20l59L05nl03L71n2J64l04
5717a04n2m5L38k17j69K14J18j78m6J07M1J07J08n3j48p6K34k26L83l30J30Oj56
5740a4r5J79L1j26K67l63M66l96J15K16k28j91K50Qk86L01l5j52nJ35q5P1O1k
5764A22j56m6J76m56K13K31l3J46o9k69N3n7O1Q7O5j12n8n2M71l74j39J74j49
5787a71P1J70k40J33q1M6J87j04k8J37k62K70j61q3K99j77k82L88j42n0M6J7J90
5810A73q0k82L65l7k35K47o6n5L1k22K43k77K98N6k89J28J07j83K76Pj39J53j89
$$ y = [-207, -25, -75, -153, -69, -9, -24, 210, 9, 6, 114, 136, 205, -207, -96, 157, -157, 24, 272, 111, 97, 5, -75, 43, -135, -190, 215, -78, 35, 51, -135, -159, 216, -131, -10, -25, -197, -140, 196, -164, -2, -47, 97, -139, 117, 35, -115, -136, 161, -177, 178, 45, 142, 149, -123, -114, -208, 115, -7, -37, 140, -141, 79, -280, 25, 20, -283, 88, 36, 200, -104, -156, -201, 137, -80, -249, -35, 83, -95, -141, -34, 7, 114, 222, 169, 21, -55, 179, -47, 336, 6, 136, 142, -14, -109, 70, 101, -25, 242, -121, 345, -51, 64, 280, 52, -139, 111, 119, -167, 134, 99, -53, -58, 77, -8, 63, 124, 122, -34, -80, 96, -360, -147, 84, 51, 197, 128, -141, -88, -145, -84, 3, 68, -44, -102, -154, 317, -57, -196, -22, -171, -100, 70, -170, -37, -118, -72, 115, 11, -17, 120, -142, 128, -33, -116, 183, 6, -276, 112, -30, -80, -34, -17, 173, 93, -189, 176, 139, -96, 151, 85, 30, 61, -161, 82, -195, 103, 159, -130, -2, 105, -78, 198, 205, 66, 219, 30]
5833C0l3P7o6Q2j90o0M30l71N8M09m90N3j2j86K41J66j40J59k40J21m0j92L16
5856A22j82L4L66l27k35J91k27J01K21k83K87j46j42J80J07r9Q3k3L2K65n19K54
5878F0k2j98K39k25o5L72l77M37l30Q2Nk5k1L39k56P3K90m41l2R0j70L80k22m
5902b1K11m58L97J10m11J52l4q2K04J41l70L54j13j50K59l79K56l68L02K66o15
5923c49L20J28l03K07M1rn4n7J30K06k34K48k17k33K55Rm17P80n93j64P18o99
5945b87L87j75k8K88j88mJ74m29M76o5k39L70j42q7J08j78J08k38j77N42k29J40
5967A27N0l50pL32m14K56K57m32M68l15j04M52m11J01ml2K24k82k54M60l33J55
5989e6K23j85P2j01nrP3l55O14r8j23J71k44J03k6m2J69k74P2L29m86J48Q0k22
$$ y = [30, -3, 74, 8, 90, -100, -160, 270, -101, -43, 366, -124, -71, -83, -269, -28, 138, -2, 157, -83, 38, -2, -194, 122, -60, -26, 340, 13, -222, -31, -258, -157, 64, -219, 68, -78, -220, -40, 67, -32, 51, 28, 60, 325, -194, 60, 38, -160, 79, -146, -211, 161, -216, 221, -109, -27, -22, -47, -68, 271, 15, 88, 378, -63, -95, -5, -175, 205, -17, -21, 190, -268, 129, 239, -172, -20, -54, -136, 68, 209, -161, 193, 80, -70, 189, -190, 66, -302, 0, 266, -349, -29, 99, -204, 3, 44, 35, -19, -76, 54, 260, 26, 274, 57, -176, 79, 88, -329, 451, -142, -306, 412, -287, 100, -75, -103, 185, -3, -7, 167, -262, 214, 149, -90, 280, 138, 51, 159, -19, 89, -149, -326, 216, -13, 127, 177, -173, -180, 152, -262, -6, 251, -181, 287, -28, -132, 320, -91, 10, 6, -26, 198, -84, -338, 122, -211, -56, 167, -18, 54, -47, -52, -61, 12, -343, 271, 173, 50, 221, -23, 80, 54, 12, 181, -93, -21, 308, -178, -30, 50, -172]
6013a72L55p3J32L8m22K50R7k12kK9n2K16m9l70K96j65n7L95k72KJ39l3K4L9k03
6038g0J38j09k6K67m47K77j35n5M91m93J28R0j47J12J13k75m0J66k11L34k57K52
6060A03j29j5L03k89J82j03k26K14lj91J02J7l2P6J87j62j51JK06k30P5K81k22
6083fl8J47j34j2K83l00J67O8j39N1j06j50Q06q03M58l37l7J89l21J9O06k75J70
6106C06j87M36p68K06j57J05m38M64Rj68m32O22O53q57L48L6l6n59J89L01m02
6127c29O00L36j610R60j112J559m90J10o26J204o18N32k62o45N85k03j28L6J64
6146F3k64M77kj96r2j60J73l25M17j29p1Q1j09J89k08K54m6N0J25l07m9R0j3l
6170e5k43K88Q9p8M9o2n8J06j60J68K41r6j36o4j18R0J96r1LJ8OK1k1J6k83r3
$$ y = [-172, 183, 110, 242, 280, -142, 108, 205, -7, -9, 20, -32, 184, 135, -235, 61, -104, -161, 234, -38, -36, 103, 70, 94, 133, -70, 68, -41, -67, 200, -247, 30, -105, -160, 331, -162, -34, 56, -91, 21, 134, -141, -181, -15, -226, 108, -149, 103, -26, -41, 262, -27, 155, 52, -174, 40, 37, -154, -52, -35, -67, 9, 196, 34, -117, -116, 90, -140, -65, 216, -6, -44, 103, -31, -43, 240, -60, 107, 175, 36, 87, -19, -169, 637, -166, 292, -45, -82, 107, -214, -195, 411, 136, 306, 119, 555, -213, -7, -164, -59, -497, -33, -24, -192, -624, -2, 651, -206, 142, 178, 142, -417, -228, 73, -329, 271, 607, -1003, -43, -1155, 404, -86, 24, -602, 602, -16, 516, 254, -391, 194, -9, -137, -101, 63, -201, 276, 274, 78, -14, -174, -1, -326, 91, -38, -109, -28, -137, 52, -156, 98, 52, 102, 227, -80, -129, -39, -52, -55, -298, -10, 79, 1, 50, -12, -70, 36, -124, 44, 285, 189, 53, -11, -129, -39, 157, 66, 69, 87, 93, 114, 93, 109, -174, -267]
6196b67J75J03J41k63J29o0j8Q2K91m34R7MJ03j02N3r0J74k80Q3K26k63k1q4K03
6220a8O8R1l24J44rJ45j24k4J1R0Q6p6L6k42qJ81j4k83L83j18J22pj99L18m15
6245a86L10j58P6j18N7J25k6o8j37K67k4k74J50m9M2n1k48L06K00j88k6K18k29
6268c1J4P3l13K40l56K46k33L16Q28j197N40l71O07k85j0j16J12P3R0m77L00k76
6290b26M12J8l56M35Q3J14j81q0p47Q96l90L86j119M93K66O52m86r7j8M7j03K57
6312B56n92O6N14l10J44L7j04M21l55N8J34o60K10J29n2K38k09q0K57j25J84j34
6334B7j90J68N7j13K06j63j72L67k09k5P8k9O4j35k22L98m4k19L30l21J06K60
6356B19n49K23M3l62N35L2p1P2m21K88Mk14K01r5l9O1O9k37M67k73K80Ol19J69
$$ y = [-267, -92, 11, 152, -111, 18, -42, -60, 22, 313, -121, -24, -20, 83, -19, 34, -56, 118, -162, -79, 147, -116, -137, -221, -18, 50, 141, -183, -39, -48, 97, -27, -51, -40, 50, 136, 60, 96, -146, -154, 27, 13, -270, 113, -5, 117, 110, -89, 229, -186, 124, -34, 42, -76, -19, 106, 80, 12, -125, 142, 118, -156, -6, -55, -13, -64, -312, -6, 194, 6, -20, 198, -31, -17, 56, -257, -17, -373, -127, -360, -44, 784, -413, 127, -244, 363, 78, 68, -48, 64, 137, 227, -250, 50, -226, 186, 204, -152, 283, 366, 480, 299, 219, -528, 368, -22, 364, -755, -262, 4, 656, 170, 73, 55, 102, -1, 256, -336, -270, 244, -66, 78, 115, 11, 432, 77, 135, 269, -391, -181, -52, -104, 134, -75, -155, 102, -23, 161, 27, -163, 5, 62, -51, 155, -8, -180, 187, -22, -47, 31, 2, 66, -69, -291, 107, 63, -156, 174, -147, -41, 219, -330, -107, -64, -426, 109, 141, 70, 142, -279, 9, 13, -201, 0, -95, -134, -73, -4, -241, 226, -47, 233, 239, -80, 89]
6380H9l04J60J83n2K75m47Q5K47j82j50L52k93q0J78k10J66R2k3O9k68l15P24
6402B96k39o1J85k70R2J05k29K50j80q8J04j68L01j34r8M19k76p5RR3j86K89k48
6425a09O3J35j77M56m90Q7M48n55J51J7o3L01n58L40K23j51j17K35l11N2J12k17
6447a28L10l98K10K49l39Q0j07l5K77j20j92K88l47J14J92r5j15K86j33P2J27
6468A96m84L46m9j76J55k36M55j98r3J23l09L69j83q1R5K84l93K70m1p9K78m16
6490a67J85J09m74M11J91n26M03l64K54J11k52J28K52m89J13K57j23k2R3r5P8
6511G3j55R3k4j58M44k92k14N29l61m1R4l38L52M3j14K23k32Q0K21l33L56k03
6533D3o6J01j48j23L78l04j13M27l0j6j07j7P8k21k4L44j44m4J7j16K24o3j85
$$ y = [89, -215, -55, 128, 76, 351, -96, -11, 236, 54, -96, 256, -37, -117, 61, -149, 17, 109, 86, 155, -113, -428, 296, 57, -4, 181, -89, 3, 108, -121, 129, -51, -139, -35, -203, 98, -36, -134, 285, 9, -66, -57, 36, -150, 139, -109, -46, 89, -88, 368, -122, -35, 413, -142, 9, 26, -37, 264, -294, 46, 269, 118, 1, 236, -75, -23, 89, -128, 182, -216, -6, 243, -96, -16, -123, -158, 119, -1, -193, 95, -252, -138, 54, -41, -156, 130, -3, 69, 196, -288, 58, 9, -167, -12, -248, 207, 9, -84, 39, -270, 99, -84, -165, -70, 214, -179, 91, 50, -29, 249, -167, 18, 127, -347, 64, 255, -271, 132, -232, 22, 133, -119, 9, 261, -228, -115, 142, 19, -3, 90, -5, 73, -82, 11, -13, -171, 273, -19, -233, 296, -65, -106, -12, -350, 2, 45, -69, 154, -78, 2, 223, -110, 246, 43, -23, 78, -70, -193, 185, -119, -232, 195, 165, 149, 42, 25, 103, -118, -142, 202, 58, 14, 31, -85, 139, 76, -109]
6556a09K30k9j98J37k01K22n7k8J27K7k69K75l37J03K16l06J93o9M8Q9j45j45
6578b26K03k66K22J46l15J77L7J47j8j97P7O7l12J37Q2jK2j94K69k34J43M6lk10
6602b01L83k75j08K49l01K22K98m12R0J40k07J7m3L80M7m95L40J1j07o0J95l60
6624a97K26l8J00l3o1J76j33k02J10p6K98n9l84K57N0l1nj07P8Q3j84NJ51j18
6648i4K02p5j05J41j67K3K8n7j33J50J8K29l8l57J00K4J36l9m0j60L02k56K93
6671A25L1k16l13Q5M73l13O73m82M77j31m10J1L13L64j002L08L37n42L26l34r1
6692c11N06l74m31P34L88m56M20o21k45Q00m49K79j52J65n04L39l00j50j29Q63
6712C72o06M68j84q3K03l79J95o25M45o05O95L09M85q43k30O7N83l47L97r8j11
$$ y = [-109, 121, 92, -106, 31, -170, 52, -5, -33, 94, 121, -148, 127, -210, -107, 109, -197, -4, -73, -25, 64, -81, -226, -23, -289, -67, 79, -236, -59, -22, 125, 107, -90, -13, 54, -258, -121, -39, -40, -18, -212, 57, -177, -34, 12, 9, -201, 182, -93, -201, 48, -253, -31, 267, -145, -55, 85, -122, -105, -148, 232, 279, -216, 124, 135, 28, -32, 163, -197, 29, -9, 91, 58, -3, 173, 40, -162, -52, -128, 170, 111, -273, -16, 34, 3, -2, -109, -31, 52, -132, -127, 24, -94, 108, 33, -72, 69, -98, -75, -47, -104, -237, -87, -69, 160, 122, -235, -135, -111, 25, -14, -54, -214, 88, -168, 125, 156, -60, -373, -288, 185, -128, 545, 63, 540, 409, -1, 10, 323, 687, -315, -7, 330, -212, 114, -220, -311, 195, -179, -610, 124, 512, 56, 476, -145, -390, 410, -39, 240, 88, 253, -251, 88, -212, -362, -491, 372, -234, 234, 50, -33, 170, -209, -14, -639, -194, -799, -104, 205, 690, -153, -383, -316, 267, -80, 317, 219, 108]
6733A08o6m23J08J20N68o15J51N5q8Q8k65L49J90K4j28l25j0Q2l8J69N74k57j22
6756B49m54J09N49m6p74R7J37K39K32l04P34j314N71p7M81j97l4o67p75J255m59
6777d48M37k10J47N34p83l7Q42n95J54j25l41M19l19j54M28k52J18K81n0J68l39
6798a25j53RR5n0n43P11K28K07q46O96k38O3L07o60L77n4j96K18J26j57j13j76
6820b74M10k06j08p3N89n63N76R9j023Q04L16l29j37J1l01O75k37l79J59k4K77
6841B62k17j34L09m75L74l70K59j5K69k71K43k07n46K78P8pK11l14M65l16j48
6862b72J25n0J46K10l03R9J14k35L68k22R6j04j43L13j22J09j27Q0j30J74k75
6883a49J16R1l60K11J97N3M4j92j56K32l35J29J22k15R6K52j25J95k64m2J49k16
$$ y = [108, 42, -381, -273, -153, 415, -200, -49, 6, -82, 6, -259, 90, 280, 304, 176, -149, -159, -77, -115, 54, 628, 371, 249, -205, -96, 453, 407, -367, -270, -133, 106, 338, 34, 768, -546, 25, -52, 429, 232, 198, -469, -1244, 11, -448, -11, -221, -74, 460, -323, -360, 482, -113, 41, -84, -425, -6, -325, -479, -51, -303, -185, 96, 46, 214, -125, -278, -269, -174, -224, -767, -56, 172, 379, -467, 229, -9, 54, 361, -299, 78, 24, -172, 46, 172, 15, -98, -274, 136, -70, -178, -251, 338, -225, 351, 450, -573, 231, 547, 218, 81, 92, -209, 466, 229, -150, 9, -15, 262, 45, -89, 220, -255, 119, -251, 8, -7, 262, -9, 234, 27, -519, -241, -163, -170, 41, -273, 192, -124, -272, -147, -197, -51, 159, -144, -45, 69, -166, 202, -20, 76, -28, -171, 142, 20, 129, 2, 82, -48, 126, -149, -33, 58, -302, -91, 106, 159, 203, 11, -145, 87, -248, -119, 3, -212, -116, 136, 11, 206, -58, -100, 49, -167]
6905a67O4N8k85M81k05k2L05l90J70J97j64m3J0j99L56j88j09L85n38K69R9j79
6927i5J48P3m96L71j65n0L99k36R3O4j68J12j50K34j33n8J26J49q4Jj94j46K04
6950aj59L5K03M2m5l3j60L40l49j07M72j44RJ84k91K13j51k74K30j31J93k6j83
6973a33P9K78l00K48r3J2K02l76J69k04J67N1K1l08M8N7J04jo9J24n1k08J65k42
6997b60M73q8k05K17p2k48M14j60j58K44l53K38K19q48L67J08k2J95L14l35K15
7018B55n01J78j72M49J32p66k2QO88NP0R8k3N0l08Ol42j72J12j12J54P29p59l83
7042f26L77m1K41%j58PJ54N0k57P63q62k54P17j5j4J37p40Q74k55k11R3K70j32
7065A18p33O71k48M06j55L16o86j91j46R59k57l99k30L50K18l35J79J85k89J82
$$ y = [-167, -103, -45, -330, 151, -54, -76, 229, -161, 9, 206, 42, -1, 9, -190, 166, -22, -131, 254, -284, -15, 84, -95, 53, 126, -370, 1, -164, -214, 185, -51, 42, 106, -62, 50, -100, 134, 1, -57, 69, 218, 134, 135, -59, -205, -1, -160, -125, 78, 120, 75, 42, -118, 222, -127, -234, 238, 94, 103, 287, -4, 209, 58, -216, 14, -117, 76, 50, -133, -54, 224, -76, 172, 79, 91, 293, -83, 86, -118, 49, 100, 121, -187, -139, -82, 22, 21, -48, 76, 25, -183, -18, -260, 213, 125, -80, 137, 65, -183, 231, 71, -87, 157, -196, 42, 261, -587, -220, -112, -134, 61, 375, 40, 255, -246, -68, -240, 209, 341, -425, -447, -439, 249, 254, 324, 422, 399, 449, 141, 147, -195, -367, -255, -367, -213, 516, -243, -626, -249, -290, -49, -49, -207, -200, -46, 4, -253, 510, -352, -606, 111, 96, 82, 219, -521, 353, 98, -113, -20, 250, 118, -615, 56, -192, 214, 59, 375, -311, -502, -648, 311, 54, -345, -575, -225, -7, -342, -163, 22, -267, -85]
7085h5J83K17k05l88L51N68n77K85k38l87M14r8J87n23K83J38j06p8J39r3K3j02
7107i2J28J31o08q1O72J21o63L64l94M75j65l90R97r35M16k85P89j1o16J049j40
7128G62p41o06L22n11l17N25M21K29Q94j381O97n96o74J307K06l54k23N16o4J12
7148E24l98j9L03j158j79N61P58j55k19k78L95l87k93O00P43o20n23m1N10k98
7168a74J7J91N1o94Q78k80O08r98j31O22m30Q13O46p81n42M53o04N48m57K60m94
7189d98K81j23J83j73J79K16n8r5j52L80k73J6J33L61k47p4j41J36j48J71k80
7210b06L75l60N51n91J79K12o70O68K65j49m08M09r07O74j04J71J80q31J043J73
7230F74r98M02l5J04l35k63J77J14Q1K01p6K31k22l50L78l01m9K33j31M8J58q4
$$ y = [-85, 98, 315, 110, -278, 73, 641, 64, 349, 111, -276, 138, 40, 227, -296, -13, 125, 19, -59, 80, -13, 10, -92, 36, 167, -441, -522, 150, 271, -392, -28, -422, 53, -112, -502, 495, -440, -24, -309, 480, 469, -147, 902, 762, 21, -585, -263, -774, -1091, -566, -145, 84, 978, -403, 294, -302, -976, 331, 537, 183, -40, 476, 412, 524, 126, 107, 410, -748, -927, -366, 392, 237, 18, -260, 135, -252, -545, 55, 798, 178, -345, -386, 124, -174, -157, 34, 85, -609, 269, -11, 597, -401, -532, 90, -340, 473, 1119, 338, -204, 249, -355, 193, -264, -4, -498, -217, -340, -157, -330, -151, 65, 7, -88, -240, 140, -133, -117, 16, 377, 130, 56, -85, 51, -97, 74, -206, 169, -191, 360, -231, -52, 160, -510, 158, 423, 274, -134, 275, -632, 42, -62, 109, 289, -542, 501, 674, -324, 78, 43, 147, -188, -451, -274, -160, -79, 122, 46, 277, 55, -295, 83, -218, -267, -34, -165, -117, 41, -43]
7252d3j68K36j78J26J42J21l58p7M79j82k77J43J24j34k34M23n7j02j60J4K7P7
7274e8K02M8j85J64j69l38M21J27o7L4l43K25p7p0K11Pr4M1o2J10j2j06J13n1
7298G1q3n6J82j32K5j77K16J70l26J28k44J66N1j22J19j59L30j5m48K94M2p9j17
7321a64L34l22J67q2J0L77k96l4LN9k16J71j07R9l70L29J87m05L02k0j68R2P3
7344A9m9O8R3l65J88j48L80k63J29P7l98K20J64j1M0j47j61J40j02Q2N7R1j53
7367d9k3Q8Q3R9j00J2Pl5J68q5l75M68m71J95P1j37K58j37J91l55rL7QJ47o1o1
7393f6k54M41j4rk41J71k9p0Q1J80k05J40k96J22L0N1j97N41n41J84j53J37k59
7416b56K07J5K09n7k03L52n79J80K02r3k01L9K00J35k94J26J66j80k25K14K8N5
$$ y = [-43, -211, 25, -153, -27, 115, 236, -122, -199, 280, 98, -179, -36, 88, -46, -280, 143, 86, -16, -176, -162, -135, -58, 144, 192, 7, 171, 2, -336, 85, 212, 145, 179, -164, 61, -16, -86, 125, 132, 38, 79, 17, 127, 115, 9, 122, 71, -12, -68, 114, -18, 7, -170, 46, 216, -110, 18, -226, -60, -9, -131, -12, -171, 159, 144, -304, -10, 32, -47, -164, 170, -152, 15, -67, -57, 320, 24, -10, -7, 52, -164, 7, -100, -1, -371, -42, 145, -260, 42, 22, -146, -54, 19, -30, 38, 131, -234, -46, -194, 186, -77, 52, 129, -269, -49, 115, 104, 144, -3, -164, -24, -126, -44, 13, 104, -49, -72, 16, 99, 198, 98, 110, 117, 82, 250, 165, -210, 258, -213, -18, 53, -84, 174, 37, 228, -127, -136, -99, -91, 56, -5, -66, -320, 121, 107, 98, -143, 28, -1, -71, 10, 190, -15, 125, -171, -49, -19, 32, -165, 376, -165, 19, -134, 3, -256, -49, -34, 175, 118, -85, 267, -312, -132, 70, -23, -224, -185, 15, 150, -144, -18, 148, -32, -257, -43, -15, 40]
7438D0k6r6J30nj71l6J18j48L26o8K6p3p5N8j29J24jj36j65O64m11N7j01j3L51
7463B40l71O5J13l5N5j20j45K28j47L3K23l71K54n4j50L02k14l1O6L1K22k05K31
7486B20j62nj85J37m0P7J03j88J86l0j24J89k78j89K13j9M9J42k93J71j9K35k35
7509d5%J40L14k98nn7n21N65p70P52J76m72K93j52j77M73m68m9N09J21m41j53
7531b65p1M87J73J29m15J07J97L57n28o2L80m78K25n50R58q19l02M02L97n59l13
7552e50L4R59l93j03J54j00k05j12L29l29k23Q43p96K74j55j31N56K24j95j48
7572f7K77m70j13M75j3o28L55m12J200J96m95p07q4O29k33m07l03M44L90l8o07
7593f11N41L69j17Q1n56l6K58l1k7m7j8N37J48m03O3l44K26k93L28k5l10M27j27
$$ y = [40, 14, -82, 48, 43, -128, -164, -46, -194, 132, 64, 90, 17, -58, 0, -129, -5, -6, -142, -307, 357, -54, 3, -98, -111, 240, -131, -66, 47, 12, 67, -53, -198, 30, -117, -84, 139, -232, 22, -32, -182, 120, -94, -125, -59, -28, 194, -11, 220, 58, 53, -132, 5, -35, 42, 145, -43, 143, 113, -11, 178, -100, -289, -76, -95, -46, 96, -197, -26, -45, 190, -45, -45, 95, 409, 111, 106, 49, -472, 93, -677, 75, 251, -221, 72, -80, -257, 216, -252, -301, 208, 329, -112, -265, -336, 151, 324, 453, 38, 145, 342, 699, 171, 109, 489, 11, 236, -314, 644, -175, -477, -75, 322, -237, -550, -516, 443, 50, -53, 101, 1, -204, -316, 13, -316, -539, 304, -492, -218, -373, -504, 52, 276, 81, -67, 210, -260, -373, 102, 89, -539, -184, -596, 604, 800, 305, -402, -486, 143, -90, -497, -800, -356, 34, -4, -611, -70, 299, 182, 263, -293, -329, -71, -102, -129, -176, -194, 343, 491, 88, 151, -193, 33, -260, 68, 43, -267, 160, 33]
7616C3L7L6J07j43P9j87j29M57l12L33k47j7L9k57nl1M9L02j65j04J56J00o5k16
7640a50KP8pJ70m26J36j44M91M08p32k67P67K5J13o10K90m20L68J8j97J23Q8k16
7663i2J17J09k43L15j36K7k77L11N2n27J48M8J46P7j1l7q5J28j5l6j2j81P0J12
7687Hk30J33K80j54Q3k04P3J09j46J02j03k5J1NO9r9o5P7M10k90kk18P7M04k35
7712G0j77m7L0J23j2J58k58k6L25l3k11K99j79l4j95l2J58j3j66K01k01J33j33
7735b20L36r8m8K42j59j50m3J43M9n01M05J18k43qK02L9j95K54j27J53r2M5l21
7758b19L14m24m2J07K56N4k16L37k51Q8J62m22J50P8k4n2q9L33j81L15l04J12
7780H2L25o61J79j54O27n63k4Q8O6m02L22L90l19L34n34J16l87K43Q9K2K44k73
$$ y = [33, 70, 106, 213, 70, 149, -38, -167, 290, -22, 311, 64, 47, 86, -171, -176, -207, -158, 144, -21, -125, 31, 131, 66, -150, -148, -70, -77, 93, -333, -197, -341, 150, 558, -174, -441, 326, 351, 464, -146, 144, -276, 92, 110, -87, 36, 124, -92, 25, 134, -109, 206, 70, 97, -180, 131, 183, -344, -196, -148, -2, 75, 64, 27, -58, 70, 55, 19, 7, -174, -104, 8, -222, -89, 191, 37, 120, -84, -11, 98, -48, 54, -49, -74, -63, -58, 11, -88, -153, -76, 334, 44, 42, -176, -99, 305, 70, -107, -154, -124, -1, -13, 145, -113, -139, 186, 153, -58, 241, 62, 28, -167, -199, -41, -54, -220, -19, -220, -87, -220, 116, 18, -30, 212, 53, -97, -140, 3, 52, -449, -44, 74, -169, -177, 25, 64, -131, 123, -4, 149, 57, 102, -219, 95, -329, -371, -264, -8, 46, -170, 167, -84, 4, 166, -256, -106, -28, -52, -104, -193, 140, -41, 274, -30, 82, 407, -254, -75, -229, 398, -165, -189, -101, -35, -437, -115, 275, -44, 290, -244, -128, -515, -272, -183, -161, 83, -190]
7802a90J52M89j96m23J91j90K78j19J24k16K78k90j48J71K2L16l73N0J50K39m28
7823a13n7K91p3q8j19r1L49j8M5j06K00k64n3J11J37j47OJ1k8j85P2J34k12J69
7847b9K21o0k68J13K26k43R8o1l92L99oJ9J32k38J9M2J13j34L9J2M3p7j13n1J69
7872b7K8n4L5q4J18J42j74M0r7J13q6p5r5q4L80r0N1k83K33n3K34j44j68K35q7
7897HM3r2J10j91L6J02j18L5P2J13J4l89L09L8j96J43N5j35l3k2j82L22k68L46
7921A20l16J23k8J42l64M32J38l59J58r8q7M09l38kK09j84j34K50m5q4j20j45
7943c23J82J47J56N0m5Ql25Q5J51k06J17K26l60J08l2MJ26p2j57pK64O7n1k73
7967a60J0K3K27J25j77k55N1O2M4J70o9J27j75K90l33m9Ml4J53j44L40j49R7K3
$$ y = [-190, -38, 451, 255, -168, 23, -167, 111, -8, 116, -100, 178, -112, -260, -89, -67, 249, -124, -74, 76, 315, -113, -170, 121, 48, -40, -159, -250, 99, 81, 126, 20, 220, -44, -97, 14, 151, 4, 10, 21, -7, -192, -120, 14, -198, -29, 192, 132, -136, -23, 203, -40, 58, -3, -395, 4, -2, 17, 149, -89, -70, -28, 85, -49, -10, 2, 45, -32, -145, -196, -27, 1, -53, -18, -102, 16, 158, -16, 24, -73, 40, -46, -121, -216, -300, 80, -10, 41, -242, -9, -62, 172, 28, -140, 95, 8, 51, -41, 69, -122, -86, 16, -102, -67, 5, 118, 132, -257, 52, 90, -106, 37, 92, -43, -76, -98, -280, 42, -226, 120, -196, -73, -101, 41, -323, 109, 247, -112, 46, -52, -139, 270, -68, -70, 139, -45, -179, 71, 26, -58, -178, -323, -141, 6, 162, 212, 167, 175, -150, -65, 86, -120, -3, 223, -137, -29, -61, -57, 69, -3, -160, -167, 97, 164, 113, -160, -150, -127, 100, 225, 48, -207, -156, -94, -50, 120, 51, 178, 3, 293, -40, -89, -85, -119, 34, -110, 230, 81, 178, 201]
7991B01k38r4j15J66R8n0O4P4l63J20j13L70p5n5k45K32L1P9k10K36k98P5PJ83
8015H0r1qR5L4k91J79n5J45n7j05l8q0J67n7J75n4J65k99o2K86n6op9J29j06K6
8041C7Qj0j8R2k35m8K06o5J30k3m3l10K90Q0q9L9p7J31k41k60N37j29J96j19k30
8066a51L28j35j50K81j42k03J14q8K34o2J37l50J00K79k06m3P3J42j63J28R2k85
8088g0J58j66J65L1j81M5l2l0L01j80j10J44j58O1Q3j89O6J06j40J30J68l31L46
8111B17l55k8n0J17J85m13L11j64JPJ86L3q0K20k46J45p2N2k04K36j33k7K53j78
8135A3J82j65P3J30l96J95j93J37q6Jj25J76N8k43K30k2P3K8k19r9L11j0J33l13
8159a31nJ23nJ39k13J26Jl18L25l55K95m2K54j76N2p5n2L36k89j83L40j6k27J09
$$ y = [201, -37, -131, -246, -80, 18, -32, 32, 106, -257, -137, -250, 120, 45, -10, -255, -23, 8, 87, -123, 113, -185, -110, -103, 80, -11, -19, 76, 110, -181, -2, -57, 88, 31, -74, -112, -192, -25, -82, 93, 39, 204, -95, -157, 129, 73, 67, -12, 117, 11, 37, 45, 35, 17, 109, -126, -174, 32, -33, 97, 74, 31, -279, 11, 91, 2, 41, -36, 95, -146, -406, 131, 2, 198, 79, -151, 177, 42, -108, 173, 31, -172, -58, -146, 88, 26, 163, -187, -87, 192, -14, -57, 16, 158, -5, 123, 215, -70, 88, -78, 87, 118, -63, -18, -50, -80, 221, 41, -69, 75, -83, -22, 61, -128, -62, 44, -96, 34, 202, -129, 217, -138, -166, -216, -99, 86, -327, -16, -180, -179, -172, 14, 47, -33, 187, -59, 86, 14, 66, -138, 98, -35, -62, 191, 13, 195, 30, 103, 233, -163, 32, -161, -24, -110, -109, -234, -58, 0, -243, -13, -35, 38, 66, -153, -252, 59, 49, 182, -131, -136, -13, -18, 121, -92, 34, 35, -283, 42, -313, -18, -60, 194, 18, 70, -5, -57, 279, -10, -193, 147, 131, -96, 13]
8183A3j82J27J33j49p2M7K44j91
$$ y = [13, -169, -42, 91, -58, -130, -83, 161, -30]
8191c0
$$ Imaginary data points
##PAGE= N=2
##DATA TABLE= (X++(I..I)), XYDATA
0@%%%%%%%%%%qJ6j6J6k4L2m0M8n6P2q8J04j20J44j74K04k38K75l16L64m19M80
32B56n47O22p03P92q94J005j125J260j407J565j740J930k137K364k611K883l181
49a668L504l859M249m679N160n693O287o959P722q597R611j0804J2235j3986J6189
64H712j9059K2975k8706L8068n7128J70401j76901J36519J43041j90917K08213
75B55218l22405l1797K97054k40378j5531P1189k26457L31793m8488k37732J72203
86D669n9947J16196J9087l36185J89433J06107j93615P9517j59270L8935K54932
97E9859k76094O9083P9127j20549K80572j27403k04337K74769o1092k5138N9669
108H466k68477K44332J09270k91101J64336k7762P089K03154k15033J1982J84461
$$ y = [0, 0, 0, 0, 0, 0, 0, 0, 0, 0, 0, -8, 8, -8, 8, -16, 16, -24, 24, -32, 40, -48, 56, -64, 80, -94, 110, -128, 147, -169, 195, -224, 256, -291, 331, -372, 420, -474, 531, -594, 666, -741, 824, -916, 1014, -1123, 1241, -1370, 1513, -1668, 1836, -2023, 2226, -2453, 2707, -2986, 3301, -3658, 4064, -4533, 5078, -5726, 6509, -7477, 8712, -10347, 12628, -16078, 21990, -35138, 135263, -41638, 94881, 237922, 47005, 255218, -67187, -98984, 198070, -42308, -57839, 13350, -213107, 118686, 70198, -167534, 4669, -55278, 60918, 80005, -256180, -66747, 39360, -154255, -74738, -234008, -195073, 59859, -216235, -147152, -68025, -188574, 91998, -35405, -239742, 35027, -26065, -51203, 8466, -260011, -15679, 93591, -197510, -33174, -60936, -53847, 149307, -65726, -53744, 130717]
119A30717j14558J09555o8682j63074K71774p6548j05329O7452j07012J78263
129A22558R882k12697J51468K6863m4742J13335j92085M6483J59310j74461O7936
140G3850o3111p6129K15529j30883j09336J38576o7186O8845J2541j94909J81676
151D9463J6525j16866R0467j24854M9367J16314j63611J9381M1462n2633J26696
162E1711j07222p4915J74562p5747J6185j61r8593J53672j7764j06760Q1726m6476
174d9782L2476Q4472j60780O5818O8539p4602Q8586r6758j0591J42781r4243j7836
186b1920M6275o2179J01729j7744j13415J19501l2719j505M7349j15889P1429
197B0912M9374q4662L4418k6283j2364R8244r5227j4796P3877n7816O4933l8545
$$ y = [130717, 16159, 125714, 57032, -106042, 165732, 89184, -16145, 51307, -55705, 122558, 132440, -80257, 71211, 98074, 53332, 166667, -25418, 21065, 180375, 5914, 73850, 10739, -65390, 150139, 19256, -90080, 48496, -18690, 50155, 62696, -132213, 49463, 65988, -50878, 39589, -85265, -35898, 80416, -83195, -63814, -22352, -74985, 51711, -55511, -130426, 44136, -31611, -15426, -15587, -114180, 39492, 21728, -85032, -3306, -49782, -17306, 67166, -93614, -27796, 40743, -33859, 54727, -42031, -52622, 90159, -4084, -21920, 24355, -37824, 63905, 46161, -67254, 52247, 19528, 18023, 65372, -50517, 20912, 70286, -14376, 20042, -6241, -18605, 79639, -15588, -30384, 43493, -14323, 50610, 12065]
209A2065n9970R7506l3033k9978L0068o3837M9636L6188j02485N7662l467j5292
221b4937O7835q4850J7659O3110n2702K0146o742m5131P5519l3971m8762N7942
233E116m7687L9805J4702o4581N7981P429j9991L2957l5533M229N1292o1652J3583
246b350P973l6186N4955l8955j3709M3848k1504J2839J7430l5022L7735J0231
258C7285m1061L6663l1975P74K5315m8286J7061P206j9242K2623n227j3851L9786
271B7071j9629o46K3711l5088K5699j1131k1775J7394j7354o618J2725j3998M526
284a5113J7382k2000K6383K59j1076K0080j8724P482J219j6355k795M788j0112
297a8582N875m082q369K6899p950N690J130P98J3940m489q957o016R834o661j731
$$ y = [12065, -47905, 49601, 16568, -13410, 16658, -47179, 2457, 38645, -63840, -6178, -9645, -24937, 42898, -41952, -24293, 38817, -13885, 6261, -481, -45612, 29907, -4064, -52826, 5116, -42571, -2766, 11936, -52645, 5336, 12765, -7226, 25731, -9802, -5573, 45719, -15933, -2350, 5623, -30563, 24392, -14563, -28272, 15576, -5928, 6911, 24341, -10681, 27054, 37285, -3776, 32887, 912, 1686, 27001, -21285, -4224, 2982, -16260, 6363, 1136, -12715, 27071, 7442, 6796, 30507, -4581, 21118, 9987, -11788, 5606, -11748, -18366, -5641, -19639, -15113, 2269, -19731, 6652, 6911, -4165, 15915, -2809, 4673, 5892, -10463, -13258, -8470, -18582, -12707, -16789, -25158, 1741, -6209, -519, 611, 1409, 15349, 10860, 1903, -4113, 5721, -940, -2671]
312b671j3765K476J5646l114j707n269J8293N062L016j3391j022J7626r105o632
326E443j4758M986J1597l776j8645O368J4305L617O586k7406J8898J5424j2680
339I959l576j6447P977J6104j7568j9283J7171j708J6626r809k6253L7910M91
352A1594n261l922j8395K2491J5132l4553l065R916j478K6933l8974l367L7568
365A4619j1267R172j7445j1624M0606l266l5504J4243j0926K0889J2736n7416
377c5183K9211J6250o923J3804l7375J1128M5075l0154j2470O905j7412M8152
389C1008k8860m0592M4116j1966J4033j61m4835M2065K4002l8735J3679k0956
401a7202R455M8757o5304K110K4777j4822L3265l6848k3183O0017j0114j6030
$$ y = [-2671, -16436, -13960, 1686, -1428, -3135, -8404, 9889, 14951, 17967, 4576, 3554, 21180, 12075, 5443, -9315, -4329, 7268, 3492, -15153, -8785, 5520, 9137, 15723, -11683, 7215, 22639, 9959, 6383, -10064, -2087, 14017, -3551, -22834, -5663, -7371, 9255, -554, -26807, 11103, 11594, 6333, 2411, -15984, 6507, 21639, -12914, -15979, -6063, -7541, 19392, -19582, -22949, 14619, 3352, 12524, -4921, -16545, 24061, 20795, -14709, -466, -11392, 9497, 22233, -35183, -5972, 10278, 3355, 17159, -20216, -9088, 35987, 5833, -6637, 268, -17144, 31008, 2148, -38444, 5672, -6294, 7739, 7578, -37257, 4808, 28810, -9925, 3754, -17202, -7747, 41010, -24294, -22184, 2593, -12229, 21036, -15812, -38995, 21022, 10908, -5122]
413e122J2822l7497N2925J2030o5282L3398r130J0689K6438o5482J6436M8771
425C0996l1690J3948j7058j8401P6150m0722k7147L1662l0224M5733j0853o4346
437d1952M9632J0143k0841K3583n4965L0404N5793o9617K0362l774j1716N7849
449D4901n6929k4906N1300k6341J5630l206o1188P6516R46m6784L4511l7998L8563
462E015L1388p7989K4679K5232k6917L9205m9181j7509P8565m6834O343N956l8019
475d0066P7650j6597n6539M7941j0852J0378K3370p8552M6960L5017n4426L9869
487B4153l7907J633O9135n8028m502K8850k9867N3758k5059o3424P8645k0423
499A6964j4597K0890o0840N7429J8590o6158L8374j1504j0348N7617o7962m197
$$ y = [-5122, 7700, -29797, 23128, 35158, -30124, 3274, -5856, 4833, 31271, -34211, -17775, 30996, -694, 13254, -3804, -22205, 53945, 13223, -13924, 17738, -12486, 33247, 22394, -41952, 7680, 17823, -3018, 20565, -34400, -3996, 51797, -17820, 2542, -1232, -12948, 44901, -12028, -36934, 14366, -11975, 3655, 449, -60739, 15777, 16723, -30061, 4450, -33548, 5015, 36403, -41586, -16907, 8325, -18592, 20613, -28568, -46077, 32488, -14346, -8003, -2047, -40066, 37584, 20987, -35552, 12389, 1537, 11915, 35285, -43267, 3693, 38710, -15716, 24153, -13754, -12121, 57014, -1014, -5516, 23334, -6533, 47225, 22166, -41258, 37387, 16964, 2367, 23257, -37583, 19846, 38436, -27722, 10652, -852, -11200, 46417, -21545, -25742]
511b5742N2413m5036L6039l0388l9034Q3878l3341l3354L4598l3056L7825J3717
523A8519p3602N5213j084k4856M9551o6280J3190N6939n0723J5514m675k3318
535c5612P4832m3000l9841O8861l6941K2497P479o0192O4654l435l4561M2482
547B7223m3328J2009O0578p0712J6250K1893k9489N8104n4544k0612P2746m4712
559E406o42J8433m6852N3600j360n2961N3140l4598Q821M4699p7613K6770L0049
572B6892l8866K7837l2361j4351O8069n5125r025M0069m6605M7392r322m7093
584d2489N4496k2566m015L0758o0279K8347L8565o0800L1187r656j1814N7567
596B9301n9018N589M5293m1612K9301rm2449N5545j6705k3551L9377m9974L4479
$$ y = [-25742, 26671, -18365, 17674, -12714, -51748, 32130, -1211, -34565, 33, -33023, 4802, 18519, -55083, 130, -954, -25810, 23741, -42539, -29349, 27590, -23133, -7619, -12294, -35612, 39220, -3780, -43621, 25240, -11701, 10796, 18275, -41917, 22737, 19302, -15259, 27223, -16105, -4096, 56482, -14230, 2020, 23913, -5576, 52528, -2016, -22628, 50118, 5406, 4764, 23197, -23655, 29945, 28585, -24376, 28764, -5834, 2987, 47686, -29927, -3157, 26892, -11974, 15863, -16498, -30849, 37220, -17905, -26930, 13139, -33466, 13926, 4604, -42489, 12007, -10559, -14574, 16184, -44095, -15748, 22817, -37983, -6796, -16452, -28266, 29301, -29717, -24128, 21165, -20447, 8854, 8845, -33604, 21941, 5236, -18315, 21062, -28912, 5567]
609E567K6093o2365M0004M242j7554L7846m0884K845M8812n1020J9343Q900m1982
622b0153N4457k5577k3917L8791l1937J9037J7118n2160L8894J1859l8466L6664
634B4610l1847K118L7643n3483J8798J0663l2279L6611j7219k5485M5681k7128
646a1317K482K2137m4914M1352q0l7899L5613j9963l118K7826m0299J4339K2944
659I103l6624L3470j1149j9613M6360l1222J516K1396k9681K5873N09l3498L5856
672A2296j0380j5169L1715l4152J7869J8507l4215K8331n654j4203L0245k2867
684B323o280K8116k9914J4213N251k9374L5719j6130j2167K5761k2012Q939J2918
697A7363k8319J9736L677k3937K7068k1613k413K3603l0510J2960M930j7936K0744
$$ y = [5567, 31660, -30705, 9299, 13541, -4013, 33833, -7051, -4206, 44606, -6414, 12929, 21829, -20153, 34304, 8727, -15190, 23601, -8336, 10701, 27819, -24341, 14553, 26412, -12054, 24610, -7237, -5119, 32524, -20959, -2161, 8502, -23777, 12834, -4385, -29870, 15811, -11317, -8835, 13302, -31612, 9740, 9660, -28239, 7374, -12589, -15707, 12119, -28180, -13841, 9103, -27521, 5949, -5200, -24813, 21547, -9675, -8159, 13237, -16444, 9429, 9938, -23560, 12296, 1916, -13253, 18462, -15690, 2179, 20686, -13529, 14802, 9148, -5055, 25190, 2323, -3957, 24159, -5755, 8458, 13709, -15665, 20054, 3924, -8243, 17518, -4494, 4445, 17363, -10956, 8780, 12457, -11480, 15588, -6025, -8438, 15165, -15345, -2385, 2545, -15391, 5353]
710E353q990j3958K6721j7134j114J6046k6293K2282j889j9807K1185j1346j627
723a0571J4802j9874P097J5217k1247J6429m337r276K4702j8801J219J1826j2282
736e096J0477p9j5225J8162k168j0083J5151j6080J0900R019j8771J2085p91k818
750D683R840j1156l843J6185j2125J900J468j1641J8206q757p630Q273m918N110
764E595J363j2851O035P668j0828N928r585J634J1307j3799L01N89N19N035n319
779f408p570J0087J255l915J682q693J1602J072q009K58O3N617N23n727l001J0165
795i99J62m41l845m7J0778k012k902l898O078L928j590n216j358R786q59k818
811D747m491M594N830J76o654k120R966k173rq254R27R371m371n498j922L179
$$ y = [5353, -3637, -17595, 9126, -8008, -9122, 6924, -19369, 2913, 1024, -18783, 2402, -8944, -10571, 4231, -15643, -8546, 6671, -14576, 1853, -2484, -11760, 12942, -5859, -4640, 7186, -5096, 5381, 5302, -9923, 8239, 6071, -4012, 11139, -4941, 5959, 14978, -3793, 8292, 7501, 4683, 14523, 3367, -476, 15709, 3584, 5484, 6952, -4689, 13517, 4760, -2870, 5403, 485, 5595, 6958, -5893, 142, 7810, -3018, 2910, -6675, -5041, 6266, -7533, -7232, -6643, -6124, -1089, -6408, -13978, -3891, -2636, -6551, -4869, -13562, -1960, -888, -8897, -8639, -8576, -2959, -2436, -8163, -11164, -999, -837, -1278, -5123, -5170, 5608, 3596, 694, -3204, 2874, 6802, 5212, -4, -1362, 8424, 7565, 4747, 256, 4850, 10680, 10856, 4202, 2082, 12048, 9875, 9866, 1612, 2539, 11910, 7539, 2041, 119, 3298]
827C298M040j93j3058O767M810k889J250j2285P454O705q158l202p55P73Q266
842B823p720j0314J3141m015M124l239j1044J5359L22p086J411l517M868R568
856D681j6749K741Q804n887J1277j4198p38J6797p398o14Q80o162J4729K77j7620
871i180J4525m083K855P995k1304J2907P836j0184N825o732j822J9418j5225n218
885b387J2832j2356J5656p583j5854K0688o197l863N879j5182J0951J0907k2733
898i242J1076j914m998J9327k3569K045J5029j3055P493m164j3302K3437p539
911F24j3644J6775j6002J3087O767k5629J8739L95p735J3633j7482J444K2229
924A3201k2453O242M735j5297K6909j6074j0433K2221j3818P159N684k2314K0346
$$ y = [3298, 7338, 7145, -5913, 854, 5664, 2775, 4025, -8260, -806, 5899, -2259, -5461, -6216, -5443, 2823, -4897, -15211, -2070, -6085, -1961, -5200, -16244, -885, -563, -7649, -6238, -9755, -4887, 4681, -12068, -9327, -523, -6410, 4867, -9331, -10069, 6728, -670, -1284, -404, -6566, 8163, 8440, -9180, 5345, 1262, 4117, 12112, -9192, 3715, 11551, 1367, 7192, 460, -1362, 18056, 2831, -2387, 10445, -1911, 13745, 6162, -9692, 10996, 4799, 936, 6815, -8367, 2584, 13491, -9242, 1834, -80, -5078, 14249, -9320, -7275, 7754, -5301, 2192, -1972, -15274, 8163, 624, -13020, 3755, -12247, 840, 7607, -18022, 717, 1112, -6623, 7010, -10472, -9028, 13201, -9252, -3010, 1725, -13572, 13337, -2737, -13170, 9051, -4767, 2392, 8076, -14238, 6108]
937F108M374j9898J9208j6016L426K1512l0159J0783Q007j3756J8065j2516j0473
950a1335K7279j6764j644J3521k4608K3577p10k2704K1933j1440N37J6132k6921
963a3147J0070J6952k3958J7382p996j0792K9714k4532L57J5402k0597J7855p68
976E942k3213K5209o409r552K0660k7735J6061J4682l0348J9619l661r405K2347
989A4197k1414k220K3155k4615J3812L569k4945L1498j1284j1402K0277k0685
1001a0057J2643J0470k9630J9847M384j9813K3758j9367n30K4020k7844J4002
1013A883M329k0394K6298r420j6719K5184j6417L558J3154l0587K6238J324k2958
1026a4527K4495j4561r12K0290k4924R014J1987k3628K4945j0095j7901L2012
$$ y = [6108, 10482, -9416, 9792, -6224, -2798, 18714, -11445, -662, 7345, -6411, 11654, -862, -11335, 15944, -820, -2464, 11057, -13551, 10026, 9316, -13388, 8545, -2895, -2358, 13774, -13147, -3077, 13875, -10083, 7299, -697, -11489, 18225, -6307, -5950, 9452, -11145, 6710, 5942, -17271, 7938, 1529, -8023, 12637, -15098, 963, 15645, -14703, 4916, 1255, -8150, 14197, -7217, -9437, 13718, -10897, 2915, 6484, -18461, 13037, 1753, -9649, 10628, -10057, 2586, 13056, -16574, 3273, 7657, -12156, 11602, -7765, -8295, 15725, -12119, 1883, 6212, -14182, 12116, 2696, -14023, 11161, -5256, -1698, 11456, -19131, 7107, 8431, -14527, 9968, -4593, -5505, 14785, -10139, -1125, 10862, -12766, 12179, 2084, -15817, 16195]
1038A6195k0347R56J2130k1848K1501K03k3922K5826q686r740K3693k6876J1085
1051A70J2294k5158K2069q998j2574K7478j8055n847K0126k0782J4938J956k4563
1064a6946K9519j1994j0548K1783k2058Q023J2783k3553J6000l72j5859K7606
1076A4384k0769m410K4642k3527J1406K181j7961K3987r736j3547K3959j8333
1088g724L311J6357k6948J9440N23j5058K2407j7832j645K1816k2352N226J0504
1101H025j9014K1191q748j3577K6622j9024L247J2972k1539J5604L229j7727J7987
1114I248r697n508K1810k4904P522J2537j9706J6901o692r603K0925j4732l017
1127d916J5618j9929J2345M691k1343K0975r174m736J5942j9609P732J1563j9228
$$ y = [16195, -4152, -3196, 8934, -12914, 8587, 8790, -15132, 10694, 2008, -7732, 15961, -10915, 170, 12464, -12694, 9375, 377, -12197, 15281, -2774, -8621, 11505, -9277, 5661, 7617, -16946, 12573, 579, -9969, 11814, -10244, -2221, 10562, -12991, 3009, 2637, -13222, 14384, -6385, -10795, 13847, -9680, 1726, 3907, -14054, 9933, 197, -13350, 10609, -7724, -4413, 11944, -15004, 4436, 4959, -10099, 12308, -5524, -7169, 14647, -7705, -2479, 8025, -10989, 10202, 1454, -12123, 14499, -4525, -1278, 11694, -9845, 5759, 8988, -8739, 9248, -449, -5957, 15853, -9051, -1529, 11008, -8698, 8203, 1511, -8092, 12833, -1899, -4916, 10702, -9227, 3118, 7809, -13534, 7441, -1733, -6469, 9473, -10136, -2404, 9159, -10069]
1140a0069J1752K42j2811K0522j5220k758J6319j8961J1715J829j5612J7569m188
1153C29q965J5391j3747M091J2850k1414J3868N90j1270J6259j2450j006J4339
1166H865j3623M591O635j4438J6330l936j0969J6686j2298L631P875j5686J0493
1179D156L011j1585J1312o165m031J5537j5354M571O435j2633J2837n952p518
1192e379J2771q087k100Q452j2700Q269L929j3758J2824o219j908R859j2584L521
1206c110O083r731N992m91q690J3326p925k750R520j0036P876L31q404Q584q95
1221c20m566P350p565J718P910j1005O942r6m558R359o299q53O954m801J796K850
1237D816p378P828q69o089P499n951L174K727o737M509J269l550L604k323k179
$$ y = [-10069, 1683, 1925, -10886, 9636, -5584, -8342, 7977, -10984, 731, 2560, -13052, 4517, 329, -8636, 6755, -6992, -2901, 9949, -11465, 2403, 2993, -8277, 7982, -4468, -5474, 8865, -4758, -167, 6468, -7970, 8360, 4424, -6545, 10141, -2157, 1474, 9349, -6337, 4156, 7167, -4418, 6894, 729, -3302, 12235, -3119, 1452, 7887, -4746, 8091, 2139, -5379, 7392, -695, -2795, 5657, -7043, 1226, 5155, -8603, 4221, -1998, -3906, 5953, -6631, -3110, 2973, -6758, -766, -1257, -9947, 3379, -4546, -7296, 2224, -7812, 64, 395, -8009, 575, -320, -4886, 2464, -5101, -3383, 4527, -6478, 464, 368, -4190, 5169, -1130, -1983, 4971, 170, 1966, 4816, -2562, 5266, 4397, -1692, 5807, -144, 3030, 5757, -980, 3529, 4798, 1248, 4852, 2529, 350]
1252C50P108o845J036J521m661N443k984k980L489j049j290K918n206K738K456
1267B044n811L966l304J229J548m720R70J906l78l75L00k972M905j646o66J393
1283a611k129K749j096j080K03K295j218K01M50r79L699j800M23j005J991P59
1299A852r65M64p29K540j982k73J082q91K220q39j228Q22J706j670J905k828R1
1316A277L265m159K135j890N82J957k289j259K175j359p47K177n245N268j169
1331G19l657L198l287J719J526l890Q76L071m100M213k136k710P070n890J205
1346b073J892l852M318q27m386N334j281k047N892p262M390L199o527N644k901
1361d87r70N740n248q02N691o138M430N75p161R990m785j613N723o847M234K447
$$ y = [350, 7458, 613, 1649, 3170, -1491, 3952, 968, -2012, 1477, 428, -862, 2056, -3150, -412, 2044, -3767, 199, -3105, -1876, -328, -5048, -4078, -2172, -2550, -2925, -2625, -5597, -692, -2338, -3004, -1611, -3740, -991, -2087, -3167, -2964, -669, -1887, -1686, -1236, -2215, 1484, -316, 107, -898, 1093, 1852, 887, 1351, 622, 3162, 1180, 907, 1989, 1098, 3318, 2479, 1251, 2073, 3779, 2109, 4014, 1186, 1277, 4542, 383, 2518, 628, 1210, 3167, 878, -381, 1794, 435, -312, 1865, -3380, 1888, 719, -2938, 260, -3027, -1308, 218, -3672, -2796, 275, -3825, 388, -1748, -4458, 2612, -3278, -2073, -181, -4033, 285, -542, -4928, 406, -875, -2922, 2970, -4292, 98, 3297, -3230, 2414, -487, -1457, 4283, -965, -1767, 3924, -2214, 2216, 2791, -4370, 5620, 835, -778, 4945, -1902, 2332, 4779]
1377D779p793N137K96n514Q311p574pQ233r778N739k27n736Q775l907m968Q410
1393D176o802J467N208j1486R115l85p104R073o905Q60Q002r641L582M060q886
1408e666R538l929o541J2443r356K321M399r671R329q8q434R788m252k532J0448
1423G797j2442N118N038j0371R706n076m355J1530q767p02Q316j0343Q011J167
1437D627j1495J3368o243k955R367j1725N055N870j1695Q181j203p165J3192j0330
1451c151j112J0952j2345P545P28r943J2350m908o028J0955j0333L412P922j4389
1465h345J0236l25p560J2327j0352k9J1177j1993M736M083j1498J2922m770p680
1479g071J4006j1333L621P032j3314R535J807r295J0880p338k344J3072j4294
$$ y = [4779, -3014, 2123, 2419, -3095, 5216, -2358, -2365, 5868, -3910, 1829, 1602, -4134, 4641, 734, -4234, 4176, -2626, -1159, 4049, -7437, 1678, 1293, -5811, 3262, -3643, -2783, 5219, -4422, -840, 3220, -5666, 3872, -57, -6598, 5845, -3511, -1190, 3209, -6462, 2867, 2779, -5655, 4133, -119, -2651, 7797, -4645, 473, 5511, -4860, 4846, -230, -4585, 6945, -1822, -2524, 5792, -4551, 3460, 4627, -6868, 6500, 257, -2698, 6669, -5056, -1, 5869, -5826, 2355, 1152, -6013, 7179, -3151, -4263, 6689, -5656, 1889, 2617, -7326, 5024, 116, -5912, 5043, -5290, -1878, 6044, -8345, 1891, 1566, -5994, 6333, -4019, -4048, 7129, -4864, -128, 3955, -7543, 5379, 609, -7071, 6935, -4398, -777, 6255, -7059, 2476, 4283, -5012, 5868, -1470, -3814, 9258, -5036]
1492e036M857N659j1858J1909m707o228J2550r053K11Q898j3520Q960L190j3018
1506g186J2554o585j818J0889j3673N188O597j1849R332j656q690J4145r786j086
1520c624R735j3486R986J257j2041J2187m048m550J0552j1529L589Q720j4820
1533h072J0771j151q516J3444r303r29R338j1060O655L244j2693J2922k858p442
1547e650J1999j0838M188O665j3202R177O00q762J1633o678l566J1908j1697N244
1561A021L803j1870J2739m062p102J1285q008P17P461j2387Q249K502j1082J2838
1575F104p535k421J0724j0869L660M131r656R675k387q374J2655q063m95Q114
1589E263j1790Q441J344r180J0010m538l794J0227r719J556P173j1151R218k061
$$ y = [-5036, -179, 5480, -6378, 5531, 824, -5404, 7146, -1907, -1696, 7202, -6318, 2642, 5832, -7186, 5368, -1217, -3035, 7854, -5819, -631, 5966, -5883, 3449, 1793, -6897, 7248, -2538, -3624, 6111, -7375, 2611, 3868, -8173, 4014, -34, -4584, 5968, -5561, -1972, 6748, -8072, 2699, 1548, -6968, 6476, -2827, -3756, 5582, -5478, 1177, 4421, -8272, 4650, 1792, -5650, 6349, -4489, -301, 6364, -6838, 2339, 2939, -5823, 5810, -868, -4434, 7474, -4223, 1021, 4824, -7046, 5693, 1631, -5471, 5814, -2194, -1477, 5984, -6403, 1846, 4348, -6734, 6104, -1431, -3852, 6872, -3997, -337, 3794, -5862, 3813, 1426, -6948, 5707, -2356, -2851, 5263, -6527, 1914, 3258, -5922, 4088, -450, -4244, 5983, -3736, -2180, 4993, -6158, 3060, 999]
1603I99o961J1987p788q32P605r212N206L160r709R400l044n049J0630j0191K705
1618a094O115r238O671n76o404R651n276l219R107r552M471L206r501Q993l169
1633A85m014Q154p114N14O624q771N400J277p540R555n805j910P815q058L104
1648e84L140p421O600n56n499Q314o083K63N983q455N364J056n443O818l578k727
1664b808O919o206J800M042p947O962j266m592P250n105L28M657o257K980K045
1679B802o001O036k214l365O884o264K020K805n719M539j52m438N142k835j623
1694b383N698o209K271K354n083M715k068k274M737l904N75K855m112K848J182
1709A202m954N413k988m96M137m735K219J117k671K607o9k750M042l072N00K736
$$ y = [999, -5962, 6025, -1763, -2595, 5010, -4202, 1004, 4164, -5545, 3855, 811, -4238, 6392, -3799, -1094, 5021, -4217, 2454, 1878, -4526, 5125, -151, -3370, 5737, -3815, 656, 3862, -5639, 3354, 185, -3829, 4325, -2789, -2275, 4349, -4422, 978, 2255, -5285, 4270, -1535, -3445, 4370, -3688, -584, 2556, -4865, 1735, 1179, -4320, 3994, -2089, -1826, 4157, -4298, 1066, 2122, -3321, 3497, -81, -2808, 4111, -2095, -295, 3747, -4200, 2762, 1496, -3096, 4154, -951, -623, 4034, -2223, 757, 2802, -3199, 2837, 623, -2742, 4142, -2122, -102, 2703, -3016, 1523, 1371, -3067, 2075, -760, -2383, 3315, -2894, -623, 1731, -3352, 1363, -705, -2979, 1758, -2146, -1571, 1284, -2828, 20, 1202, -3752, 1661, -1327, -1823, 2314, -2421, -202, 915, -1756, 851, 782, -1968, 2074, -998, -498, 2238]
1725B238m137L573l04k577L170j086r82K147j744M88J846l441J993n59r77L530
1741C178l416L60J526k501O47J128k455K864q89k256L417l243J242J219k763J265
1757f77Q07j116N37m3j483J851j203L05j22p04J795p68m16J99M27o55J151j487
1775a602K37J932j513R27m92Q57M33j167N54l05J095j344J093r26M90P32L6p8
1793I59r1Q96j461J132o30l28Q08j34m7j293J187R4l21p84M60j71o57J307j862
1812i36K358j307m23O37j079R38J31j086N82k30j084K322j532q15K028k542K881
1829H43j952n84J704q41n89J094j510P48J803l004K224m47o98K356k613P77J719
1846A030k328J279J176k583L094r09j981L560k888J078J125k842K310M71j896
$$ y = [2238, -1899, 1674, 1370, -1207, 1963, 877, -105, 2042, 298, 786, 2632, -809, 1184, 625, -352, 3178, -238, 122, 1648, -853, -206, 922, -1533, 1331, 442, -1814, 1603, -1640, -398, 821, -1942, -677, 130, -986, -449, -492, -1975, -124, -1327, -1022, -1144, -1848, -53, -821, -1237, -1038, -611, -1266, -115, -1602, -1365, 567, -946, -19, -511, 346, 779, -388, 166, -139, 956, -388, 705, -221, 269, 1001, 1037, 959, 868, 1764, 303, 1435, 805, 477, 1285, 1151, 1104, -189, 998, 1092, 771, -13, 447, 276, -381, 926, -936, 1422, 115, -308, 329, -750, 188, 319, -767, -185, -415, -1499, 823, -709, -1524, 504, -2038, 843, -1109, -1693, 11, -830, -1419, -325, -1835, -1087, 716, -2288, -64, -511, -1209, 1147, -1466, -689, 1030, -1298, -19, 1157, -1426, 1668, 759, -1222, 2338, -550, 528, 1653, -1189, 1121, 1592, -304]
1861c04K308j981q80L415l754J918O49k618L971k720j034L327k643N57J672l448
1877a565K724K94l670M327l358N45K733m132K217J070k825K548r50k583M808l779
1893a596J64L118m892L908l50l374M380k457o00L554m105J668K723n204M432j384
1909a5k468M994m048N63K750l805K627P30m212N210k061k103M922n278K778J908
1925B492m766M133q48k913M572k963r15M628n577L078J112m493N537k812j704
1940a439M222m153J224K732n522M101j8m102N666m059o9M347n480K868R57m014
1956b739M410j895k742N700m807J102L225n896M633k56l968N196k698j075M650
1971B840n169K003K557n558N269j759l162N813m715P28L592m873L127Q60m401
$$ y = [-304, 2004, 23, -857, 2558, -1196, 722, 1371, -1247, 2724, 4, -1030, 2297, -346, 211, 1883, -1565, 1159, 1453, -2217, 2110, -1248, -703, 2030, -2102, 115, 1185, -1640, 908, -42, -2625, 2183, -1596, -1432, 1686, -3206, 702, 352, -3022, 1358, -1099, -1699, 1855, -2250, -582, 2141, -3063, 1369, -15, -2483, 2511, -1537, -974, 1776, -2029, 598, 1328, -2884, 2326, 265, -1838, 3084, -2194, 584, 2492, -2274, 1859, 1011, -1902, 2670, -293, -1208, 3420, -2157, 921, 2033, -2460, 3077, 265, -1439, 2783, -1370, -146, 2586, -2936, 1165, 1147, -2955, 2711, -1348, -1417, 2930, -2550, 318, 1275, -2739, 1671, -224, -2966, 2734, -2073, -971, 2254, -3642, 991, 735, -3233, 1963, -735, -1810, 2840, -2329, -326, 2231, -3327, 1942, 183, -2979, 2834, -1881, -1153, 2439, -2434, 693, 1553, -2848]
1986b848N425k640k013N767n876K442K457n467M381n81l471N327l811m92M690
2001C290n697L252J264m832N756l082j347M670m923J131K998n571M265n9m268
2016c153O202m432Q5M157n620L128J379m320M415j598k802N209m817R08L636o039
2032c662M802n04l487N115l311m83M250m753J938K514n973N525j984k556N437
2047B868m453N71L265m068K560M60l512M513k126j799M991n409K939J442n204
2062b962M857j541k443M452l552O0M040n227L383N88m240N371l001j278M195m155
2078a453J433J966m418L490k63l544N307l724L39L451m607K695P59l277L638j425
2094C67k483M465l821Q35K444m608L877l50k844L816k399n00L519m126J753J795
$$ y = [-2848, 2577, -63, -2076, 3691, -2185, 257, 2714, -2753, 1628, 1047, -2424, 2903, -908, -1400, 3290, -2407, 845, 2109, -2723, 3033, -49, -1396, 3274, -1649, -518, 2480, -3091, 1174, 1115, -3153, 3049, -1383, -1298, 2859, -2761, 367, 1746, -2574, 1841, 243, -2559, 2650, -2167, -1259, 2377, -3662, 1140, 636, -2851, 2264, -1047, -1530, 2720, -2033, -95, 2419, -3554, 1971, -13, -2569, 2868, -1585, -1014, 2251, -1817, 743, 1203, -2309, 2204, 78, -1721, 3270, -2139, 800, 2242, -2962, 1895, 354, -2089, 2363, -1189, -1129, 2911, -2316, 1067, 1655, -2585, 2786, -215, -1493, 2702, -1453, -20, 1946, -2472, 1018, 755, -2789, 2518, -1206, -867, 2584, -2023, 672, 1431, -1846, 1792, 367, -2116, 2349, -1472, -637, 1807, -2801, 1076, 726, -2118, 1698, -701, -1201, 2318, -1808, -55, 1740]
2110A740m093L975j904j608M017l785R26K164k997K209N23l362L978k015r27L865
2126B706m566K140J193l554L090j096j628L354k574k54L301l682K449P4k771L838
2142B020k501l89K492k487Q47J456l250K368J37k297L471k749N18K363l297K173
2158H75L8k107K741j059j954K935k243O70J408l086K744o25j193K121j940K28
2174d47J945k486Q95R66k654L083j513r04K396k395R48N99j575J470N67k256K271
2191I10j022m24J945k854J404N33j501J207o98m58J459r02j81J290j690J744j14
2208F48j594J936r42k57O24j082N95P56j553R80K58j203J997j297Q7Q70j157R02
2226E68j42p24J072m3j467J360j060N64P33j622J057l71K29J02k49l1O26n23k46
$$ y = [1740, -2353, 1622, -282, -1890, 2127, -1658, -732, 1432, -1565, 644, 1167, -2195, 1783, -232, -1159, 2706, -1860, 280, 1473, -2081, 1009, -87, -1715, 1639, -935, -1189, 2112, -1570, 879, 953, -1818, 2020, -481, -870, 1622, -865, -18, 1438, -1812, 556, 693, -1604, 1867, -882, -364, 1999, -1298, 875, 913, -1194, 1547, 488, -1466, 1469, -774, -104, 1304, -1782, 962, 337, -856, 1265, -675, -447, 1498, -988, -93, 873, -1781, 1302, -211, -1115, 1281, -1114, -166, 433, -1142, 328, 895, -1361, 910, -112, -536, 1409, -1445, -41, 492, -1009, 198, -500, -958, 501, -401, -582, 708, -982, 762, 648, -946, 990, 48, -209, 415, -667, -72, 684, -869, 111, 369, -834, 1163, -134, -47, 823, -334, 568, 426, -298, 774, 731, -736, 624, -436, 128, 861, -761, 296, -75, 154, 256, 7, -24, 602, 79, -167]
2245a67M97j030R42k71n94O02n61L61J01l05L70L63n81M59j21m78Q20o62J91k71
2265c35K05J2j82j29M59R2k58M64l17K60O9l22R7j64L59l94L00j72j75K79m42
2286b94L87j29L99k58K63l59M74N1m45M43o64L07l34j41L45J04r8L0j47l7N19
2307D16q28P82k54l51P24p84M10j55j68M29r6p33O21j02m15Q87r99O01M97j143
2327f61Q94j74q04R00n61k02J197j172L53P43j462J546p35j28Q27o51J6P00j029
2346d03P23L62j606J610j118J35J323j438Q12J06r14R86j8j045J309q69o6J021
2364I10j579J196q6j036J183p84j51J341j326J85J243k188J833n27j047J801j449
2381d81L8R44j451P24P58j687J666n26j008K007j844Q98O50j654J352m18o72J377
$$ y = [-167, 330, -700, 242, -29, -623, -21, -582, -221, -120, -425, -55, 308, -273, 186, 65, -413, 407, -255, -64, -335, -130, -118, -300, -429, 30, 122, -136, 328, 11, 271, 340, 18, 115, -49, 310, -84, 216, 44, -131, 148, -294, 93, -36, 363, 105, 368, 9, 483, 534, 89, 532, -132, 175, -159, -300, 45, 149, 51, 81, -66, -103, 416, -412, 370, 116, -235, 489, -295, 115, -40, -208, 221, 125, -608, 13, -89, -504, 383, -616, -15, 482, -661, 233, 59, -745, 155, -406, -608, 589, -583, -230, 513, -949, 597, -138, -266, 561, -90, -74, 626, -403, 320, 682, -924, 686, -432, -297, 1026, -412, 400, 506, -408, 578, 560, -485, 824, -45, -111, 910, -669, 527, 441, -595, 588, -196, -347, 994, -332, -147, 1096, -1092, 741, 214, -833, 968, -481, -443, 501, -950, -226, 532, -1155, 511, -15, -1023, 984, -860, 38, 688, -966, 386, -32, -704, 673]
2399F73j153n02J802j731J163M72k416K511p83o20J453j144k42J898k356J312
2415C37J49j181J522o80j081J827j671J087N14j534J550n01j145J936j403J99
2431g5J779k845J894j19j476J873j311k08J726j990Q68P70k121K060n88j588K584
2448A233j953M07J150j978J468L57k058K210r66q67K165k309R55J138k149J919
2464G22p21j007K020j310m77J872k127J373O24k450K337j198l01J660j632K56
2480c59J529k206J210L83k073L353k131l45J983k425J409K53j662J982o34j079
2496h12K202k560O64J662k762K579j25j549J347j099J98J406j745M28J331k689
2512a524K325m99j424K378j939L52J406k394J622L55j922J935p01q63K311k200
$$ y = [673, -480, -982, 820, -911, 252, 724, -1692, 819, 36, -584, 869, -275, -517, 1381, -975, 337, 486, -695, 827, 147, -934, 893, -778, 309, 823, -711, 839, 338, -807, 1129, -274, -75, 1704, -1141, 753, 634, -842, 1031, -280, -488, 1238, -752, 116, 886, -1235, 825, 237, -1351, 1233, -720, -313, 837, -1141, 327, 684, -1374, 836, -130, -997, 1168, -1141, -186, 952, -1197, 722, 1, -1006, 1014, -296, -773, 1099, -1028, 345, 969, -1481, 856, -342, -643, 1017, -615, -359, 1170, -1036, 174, 557, -1516, 1837, -294, -639, 1344, -1081, 328, 581, -1081, 901, 267, -812, 1390, -1170, -506, 1156, -1606, 973, 848, -701, 646, -453, -255, 1151, -594, -166, 1165, -1524, 801, 302, -1122, 1256, -683, -331, 1075, -1319, 303, 658, -1264, 671, -30, -893, 1418, -782]
2528g82Q67R25k408K386q21j290K169j347l01J702k178J294P07k372K521j340
2544b68j37J687j888P47Q91j918J350r4j451K170j651n2J696k249J596L1j669
2561a209K067r30p34J839j608K17J255k122J818n78j047J740j099j50J320j569
2577g90P44N96j816J991n93j039J991j963P83R68j813J191J94j403J840r41o48
2594g08J789j790R89L21j521J726p48p67J631j210k5J095j525J079K85j614J809
2611H16r62l22J343j140J51P45j169P68N7j206J960j349M60O12j519R91q2o76
2629e22Q01n04o42J971j562L44J002j928J356l65o59J285r46qR81j199K66Q89
2647E60j708J610m72p30J467j273P28J11o28M66J26o23Q74n14m69J356j557R61
$$ y = [-782, 85, 1010, -1398, 988, 167, -1123, 1046, -301, -602, 1100, -1078, 216, 923, -1449, 1072, -268, -405, 1282, -606, 141, 1032, -886, 464, 370, -1081, 1089, -562, -614, 1082, -1167, 429, 460, -1209, 858, -72, -806, 1033, -575, -358, 897, -1225, 593, 15, -1032, 708, -391, -541, 779, -790, -46, 550, -1266, 725, 132, -907, 1084, -879, -96, 872, -941, 250, 444, -959, 881, -60, -708, 1081, -709, 280, 601, -920, 806, 58, -709, 922, -288, -313, 782, -743, 336, 621, -993, 816, -146, -468, 875, -265, -114, 631, -538, 230, 287, -919, 1041, -308, 152, 764, -755, 236, 154, -522, 279, -225, -867, 1104, -458, -114, 888, -1040, 316, -49, -708, 577, -369, -377, 604, -595, -329, 560, -1148, 462, -10, -740, 727, -546, 182, 293, -335, 131, 257, -366, 508, -6, -475, 881, -676, 285]
2665B85K0p41J039m72n24O74l14j97N29q09P85J45q62R16m51j64P05p57J80O76
2685F63j082Q12j16o71R64p52k6P25j093J007l65k15L45l37k82O53m73J08M21
2704B86r56R09m77q6N86l26M5m3j43M3N83j117J182m69l96O42o65M67P4m28L16
2725B7p5k83N02j46j79N95q73O65j67k97L54j4j1J07m9j12K89m15J54JJ1J93n21
2748b44K52L7NJ06J74l99kK13k04M50k77M3rm24N77m55K28k36%OK24l0k28K39
2772D6k51J49r7Q2n1l9K80n10L59n1J77j66jmMln5R3j00M24l07J28j4o9ml13M4
2799b49J55j29N48j24n77O11j31k31L79o74j3Q01j068Q22J10J89l4n67N25R01
2819A244j262n04P99j63J77l66o4L74k21j70N34o14M5Q76j084Q37n67j9M34l34
$$ y = [285, 305, -436, 603, 131, -393, 281, -33, -230, 299, -510, 275, 420, -442, 474, 23, -141, 564, -193, -13, 663, -419, 393, 277, -394, 570, -182, -208, 517, -576, 431, 66, -149, 196, -141, -423, 230, -243, -135, 286, -670, 239, -238, -324, 262, -64, -19, -62, -205, -162, 421, -696, 486, 17, -379, 263, -402, 65, 139, -289, 27, -48, -331, 171, 25, -154, 441, -432, 233, 66, -231, 123, 109, 98, 205, 156, 44, 333, -82, 72, 73, 84, 277, -244, 8, 45, 50, 156, 330, -69, -71, 142, -62, 388, 111, 154, 145, -279, 298, -157, 71, -165, -165, -159, 65, 35, -193, 46, -205, -56, -153, -71, -122, -161, 119, -391, -32, -83, 94, -72, -73, -77, -73, -76, -131, -38, -138, 286, -21, 107, 93, 24, 20, -293, -249, -94, -223, 325, 201, -376, 235, 104, -127, 252, -422, -435, 366, -702, 120, 230, 419, 385, -182, 343, 1244, -18, -522, 277, 114, 291, -75, -139, 235, 14, -156, 378, -236, -191, 685, -399, 438, -129, -148, 286, -48]
2839d8p7L03m63K59K92o93P98J8q79J003p92K62M23q20K97K66k79L07j86m06R97
2860E82j007L72K06q37J032n16m5M68n00jP05r82K98N62j019J386p80p0O66p15
2880a95P2K22m28M38K49p06Q76n84j98Q82j323Q93m5m93P94l97l85Q69q52L19
2900HO89j174P96j47p24J240r24L17K38n91N01J55j128J090N0q42J116j202M27
2919a05L40n85N87K1p02Q82n50l68J201j443O40M69j142J286o14m66Q49n74P2
2938b02P72j146R00O9j453J623r00J41R37j073M67K26p74Q34p5j113J354q14p2
2957b99J106j444J154j34q52J266j070j32J116j060J64J525k059J216p6j404J783
2974H00j635P57J311k288J067L72j558J632q75J40P47j324Q95R04j557R64l51
$$ y = [-48, -125, 178, -285, -26, 266, -427, 371, 389, -490, 513, -279, -17, 406, -414, -117, 149, -130, 177, -9, -415, 582, -425, -53, 153, -684, 348, -168, -213, 255, -245, -246, 459, -523, -225, 337, -682, 704, -76, -146, 520, -195, -123, 99, -329, 109, 358, -348, 528, -56, -254, 628, -695, 198, 153, -340, 454, 57, -328, 541, -311, 8, 697, -477, 319, 172, -552, 688, -236, 81, 319, -272, 229, 384, -744, 346, 396, -446, 670, -532, -105, 235, -350, 237, 258, -444, 438, -112, -480, 721, -722, -82, 387, -755, 531, -83, -549, 300, -274, -202, 570, -576, 324, 393, -1060, 563, -337, -196, 741, -332, 135, 361, -413, 421, 346, -767, 587, -227, -299, 807, -637, 517, 383, -469, 797, -273, -405, 711, -349, -185, 1340, -719, 497, 421, -983, 800, -835, -78, 1233, -1055, 12, 384, -1174, 458, -417, -277, 470, -854, 41, 945, -612, 352, 1]
2991Ao19J266n98o88J657j819J078K14j046J146m02n62R52q64j19J037j520J025
3009A39L91j430J509q31m08J083r41N37L63p66O09k88o44J297j061J61R26j405
3027g59J178k97n99J008m38o77J218r12K29O51j214Q24j41m43J118q94j35R57
3045F74j049M56L63j077J070k15o98J387j354O47L11j121J020j37l75N02l07j71
3063g4R74j582P56K62j169J253m09n13J048q67K67N93p38N50l6r87Q89l22j57
3082b62N96q75N30L40o41N33j93n73R29q52N07N17j245Q47oo10Q72o02k56R63
3102E19p34J99N02q11Q52o39l35J165r72K88K71n14L49L1o49Q02m66k17R98q21
3122a82K41J48p50P90m18m8M82p7l94P57p94N22j64p04R65o52J23N01m53J35K94
$$ y = [1, -618, 648, 50, -638, 1019, -800, 278, 492, -554, 592, 190, -372, 580, -284, -403, 634, -886, 139, 530, -900, 609, -222, -630, 453, -488, 49, 412, -354, 255, -33, -677, 620, -441, -280, 646, -759, 419, 122, -477, 531, 93, -584, 634, -278, -49, 602, -612, 212, 71, -372, 746, -148, -283, 674, -375, 81, 444, -633, 437, 222, -476, 911, -443, 204, 515, -606, 414, 277, -98, 404, 97, -74, 900, -682, 74, 336, -833, 420, 11, -502, 546, -321, -54, 539, -199, 351, 315, -672, 217, -105, -262, 334, -541, -11, 329, -312, 221, 28, -545, 384, -468, 39, 556, -689, 158, 152, -458, 414, -188, -444, 519, -215, -16, 486, -325, 527, -112, -447, 718, -254, 34, 305, -209, 140, 171, -478, 324, -142, -359, 639, -182, 59, 207, -543, 247, -171, -219, 263, 186, -208, 549, -245, 277, 113, -591, 374, -278, -155, 346, -107, 28, 322]
3143C22n57M43m2n53R03q55K88K82n44K17K02n20M99K3n95Q63o91L48K85o87P41
3164C72m41j59M56l88M7M03o50L21M02n49M50l22J60J97o42N83J8l51M47l08m44
3185c98O94k43JL32p09N41r7m05N32l20k1L26k13N1J17k67R0k8k43L44k00K12
3207I6Pl42M14L3l06L31j61k39L9L38p1q1j1K39m46M6K16j00k46L35m33K35J97
3230I0k75L26k49J71L6k34q5L09m5k67L97l57K38o1n9L33l48P1o2M43k49l9%P8
3254A62k7m1N1R7l00m4J47j61R2Q7k98J12RK06l46L90j31o0J68k28K73m37K53
3277b6N5J85j10k98J51j64K84j82J03l69N14k39o3K51pK0m11P3R2P1r1Oj6J50
3301b1K72n59J77J79m53M66m50L58kj50Q4N7k08l8M11k96M25m41K86L05p00M11
$$ y = [322, -235, 208, 166, -387, 516, -339, -51, 231, -313, -96, 106, -414, 85, 108, -487, 376, -315, 33, 318, -369, 372, -69, -228, 228, -160, -113, 290, -360, -39, 363, -186, 264, -58, 102, 299, -343, 240, 258, -93, 354, 46, -398, 296, 53, 54, 386, -323, 218, 121, -284, 248, -72, -93, 233, 20, 71, 188, -79, 11, -17, -260, 84, -116, 96, 103, -239, 175, 208, -98, 233, 72, -167, -128, 210, 139, 58, 47, 286, -160, -114, 102, 2, -244, 91, -342, -107, 90, -185, 141, -108, 63, 99, -135, -220, 89, 44, -223, 174, -183, 55, -6, -65, 268, -80, -9, -71, 372, 123, 84, 84, 162, 135, 94, 145, 242, -58, -102, 45, -116, -24, 63, -235, -123, -114, 92, -254, 136, 5, -55, 113, -115, 158, -279, -26, 29, 214, 104, -194, -43, -207, 77, -105, -2, -371, 143, -96, -159, 92, 85, 105, -306, -233, -141, -70, -161, -155, -171, -21, 251, -308, -131, 48, -405, 61, -389, -31, -33, -183, -99, -42, -250, -288, 123, -173, 252, -189, 97, 402, -298, 113]
3323A13j71k9L71k91K0M23m44L3L17o00M51j42k42N83m87m5M22n44L41K03m45
3344a63M79o79L06J37k65M8K37l2J14J0n42J353r02m08M9N39P7k46k73M74q66
3365e53K37N79o49n3Q92q15O16k14l99Q05q79L04L85R1m70N70j097J442j205K35
3385a78N94o36k70O28M3L98o0p83J87L62n96N21j81R8J44p37L19k10J47N23p8
3406B35n67J291j529J93N89r74J388R4j061R77r73J37P19M89m51l94l17Q2M1k94
3426c25Q85j180O10L00n19R00p58l25P23o97J39N61r19J044n52l14R45q03n0M62
3446A27p34O47N4m51O63m69m80J801j826M82L83p90R65r04L25M58k90l34Q21q20
3466c72M09K54j018J131m09k24M80n15L26L36o43M95J71q18Q69m69j08M68m07
$$ y = [113, -58, -87, 284, -7, 13, 436, -8, 25, 342, -258, 193, 51, -191, 392, -95, -140, 282, -262, 79, 282, -163, 316, -363, -57, 80, -185, -137, 100, 68, 182, 192, -350, 1003, 101, -307, -258, 281, 358, 112, -161, 313, -553, -316, 263, -386, -439, 453, -362, 254, 40, -359, 446, -433, -129, 256, 347, -123, 447, -650, 792, -413, -178, 416, -220, -490, 138, 181, 579, 519, -264, -77, 285, -311, 210, 29, 127, 271, -466, -147, -357, -210, 313, 235, -332, 959, -570, -377, 212, -762, 626, 720, -341, 636, -337, -200, 519, 1008, 557, 163, -154, -72, -31, -325, 560, -620, -10, 290, -229, 671, -87, -412, 311, -386, -247, 314, -605, 439, -113, -427, 518, -285, -335, 127, -607, 40, 94, -357, 306, -163, -643, 1158, -668, -186, 197, -593, 372, -532, -207, 251, -39, -373, 448, -372, 37, 291, -727, 404, -5, -229, 251, -264, 62, 398, -245, 250, 421, -397, 472, 3, -105, 363, -44]
3485d4L21L26o83O41n50o4O09m01j46L84q80Q68p6p28P33k71j80O22o74Q0M33
3506C20p22P87n0o34Q66r88K57O38r27R27l64p91L41L25l73R36j065L50P54j307
3526g20R81k18l89N79l37k64O89p26L07K78q06J053k87m39N82p84N68M16p53J45
3546a25O49j188J025r5m02O10q66O13J88j22l32L4n42J067p55M05N39l44L38J3
3566G10j83q9n49o1J27j53M20Kp01M14N12q76J043j011P01l00n94M24K62n65O36
3587A69K25k24M90j079j25N02m67M46K97m74L96m59j1M85m08J83K60o30M56k50
3607b18J57M44m25Q2J27l94K18K14l03L57m54K67Q2n30N62J76n39K96J07k90K29
3628A65r2j49O70r44N54k25l0L40j18l8oj83M4L74n18M58J25m77M21k69j02Kl
$$ y = [-44, 277, 603, -80, 561, 11, -53, 556, 155, 9, 393, -487, 381, 305, -423, 310, 39, -141, 481, -193, -113, 320, -402, 385, 335, -299, 567, -421, -164, 474, -453, 474, 110, -681, -340, -15, -388, 548, -517, -167, 587, -720, 261, 43, -346, 233, -104, -368, 321, -405, -98, 180, -626, 427, 140, -299, 283, -501, 67, 483, -270, -125, 524, -664, 361, 266, -136, 474, -392, 221, 409, 287, -45, -11, -553, 514, -241, 164, 703, 359, 697, 710, 527, 438, -111, -172, -45, -198, 222, 224, -477, -63, 449, -427, 616, -395, 306, 6, -588, -164, 98, -467, 169, 394, 170, 660, -419, -544, -42, -509, -63, 234, -240, 156, -303, -314, 171, -237, -54, 206, -424, 32, -218, -61, 383, -42, 40, 167, -227, -9, 205, -98, 259, -195, 72, 154, -376, 186, 362, -177, 119, 226, -64, 165, 73, -76, 594, -350, 204, -21, -51, 289, 171, 133, 127, -56, -12, 362, -156, 302, 427, -50, 371, 102, 0, 2, -1]
3651aJ11K23o47L89P6m93P10n84l7O7J91j47L41m47K15j09r8R5P2J07P1j91J92
3674A06o3k58J32J47l2q6Kj09L50l00K11K8l39L50j58J16j97J69j8o8k89M35l29
3697b00J21K52l56M70j56k99J95j24j13M76j38q4j61K49Q6k80M3L29l53J89Jp8
3719F9j14N5O2j39P4o2K73k48j10K76m01L38p6L11k25qj70M2j70L06l5j49K68
3742A67l65J66J24j89r7L34j05j60R7o6L51l20N7K47k12p3Q9j71N8r8J31q2K75
3765A58l06M12m6k67Q1Nj7j05J83l13N79m51J12K73l64J67j21m9m7O2j24N31k44
3788A09j28J33k27o8K16j20J03r1k36L51J9o5ok64N38j42j66J12j40K15M1o06
3810d22j67M37JM72q63j41O22Q1m27M12n3J54l14J20pJ9q8M06j50j03R5k95K09
$$ y = [-1, 110, 333, -314, 75, 151, -342, 368, -216, -253, -186, 5, -142, 199, -248, -33, -142, -240, -145, -73, 34, 105, -86, 106, 43, -215, -83, 64, 32, -54, -52, -161, 189, -111, 100, 128, -211, 139, -19, 97, -100, 69, 51, -17, -306, 129, -200, -79, 173, -183, 287, 131, -168, 27, -97, -210, 266, 128, 44, -117, 132, 218, -62, -19, 310, -43, 146, 147, 69, -45, 10, 72, -67, 7, -55, 218, -30, -140, 136, -265, 73, -3, 308, 83, 75, -95, -53, -223, 83, 48, -101, 167, -198, -32, 92, -97, -194, 140, 35, -125, -28, -94, 257, -63, -6, 241, 29, -44, 45, -126, -68, -166, -35, -117, 158, -148, 264, 218, -49, 32, 37, 20, -85, 98, -215, 364, -87, 25, 298, -66, 101, -20, -69, -116, -54, -178, 353, 109, -19, 114, -113, -181, 35, -85, 18, -73, -309, 42, 61, -4, -10, -274, 264, 122, -44, 68, -72, 143, 184, -422, -589, -152, -151, 321, -542, -683, -61, 20, -407, 5, -48, 106, -208, -88, -95, -76, -164, 242, 92, -11, 84, -211, -2]
3833bp0j60J22J71k19K76k37J5J66k36L56j77n3K18m48L56j86n1L46k36j01M8
3855a02K83m75O76n13L10l14J81K1k95K48J40j24p5L03l58M88n07J9J27j60Q6
3876d1P9l4j11K73j29K49j10l45L40m71M95m3n00K97J32LL09n09j22N03n59L42
3898D8Q8k52L60l42O5M6j12J42n7j49L67j21l58P10o17J31L08l35J97Q0k92n3
3920a46L94k38K39m60R7L62m27K81J61m49L90%j50L29m50P2J11k58L21l20LM11
3942B73m19J82M65p81L08O1l73N43l69l20Q06n44K76Om46M45j62k78N13j98l23
3963c35M80m17K13J08k52M63m27P8K13m03Q8L84m64L58q7k34M31l77J42N10o29
3984a57L04m7j02J92P6k89J84j68j03L19m26N33l29j58M68j09k14K61l41o0J62
$$ y = [-2, -72, -232, -110, 61, -158, 118, -119, -104, 62, -174, 182, 5, -48, 170, -278, 78, -108, -159, 187, -49, -150, -102, 181, -294, 382, -131, 179, -135, 46, 67, -228, 20, 160, 36, -39, 264, -94, 394, -113, -94, 33, -127, -41, 38, 4, -107, 166, 37, 286, 176, -169, 171, -300, 195, 152, -348, -51, 81, 84, 393, -116, -238, 265, -294, 48, 136, -116, 244, -98, -33, 13, -99, 43, -14, -163, 204, 83, -275, 435, -182, -51, 257, -78, 119, 199, -93, -146, 248, 10, 249, -211, -114, 248, -179, 102, 263, -186, 204, 204, 54, 383, -67, 5, 116, -142, 179, -141, -138, 273, -146, 36, 501, -280, 28, 89, -284, 259, -110, -430, 376, -168, 108, 114, -332, 113, -49, -327, 186, -12, -335, 145, -272, -59, 49, -203, 260, -167, -89, 124, -279, -191, 193, -271, 87, 0, -234, 197, -180, -38, 472, -157, 147, 100, -2, 190, 266, -23, 161, -7, -110, 209, -217, 316, -13, -171, 297, 188, -26, 235, -106, -166, -4]
4005dk21L37qK39m9o00J51J17m3J34k94R6K56Q0m21K15n6K02j13l85N46k37J79
4028A21J61m91o0L43l56L44j05j74M85m50J88J55k29J80r8J26k10N3m85N80k94
4049b16K88R6k91K54j46nJ59K0k42L29n21M57K23m51J88k14J29J94l36J25n8L0
4071A2R1J11k73L21k77j46K48k55M68l00q1L75m48J40L61p02N02J12m58q1L76
4092I6j21J05l3m98L59M0l57M01r53Q12P7j71M79m41q0L83j22J16j46k0j09J1
4114a72j22M87k68J55k5j03M7O2j71L01o1k57L23j68j85L52k08J62j12J35J51
4135C23m96Q2J12q6J47k9j60J76j50p6M18l13J52j18j22O8J67R9p0qJ11N9n23
4158b37L86j58k45J97Q6p0J71k12M03j60l77J11J10k42L20j03k4k43J52M6j19
$$ y = [-4, -225, 112, 104, 343, 294, -306, -155, -38, -81, 53, -241, -145, 111, 191, -230, -15, -71, 131, 18, -367, 179, -58, 121, 282, -209, -269, 74, -282, 62, -43, -217, 268, -182, 6, 161, -68, 112, 14, 140, -70, -17, -502, 78, -216, 72, 168, -123, 131, -15, -20, 139, 159, -83, 246, -275, 182, 405, -46, 142, -72, 57, 251, -85, 40, -18, 12, 103, 214, -59, 262, -15, -161, 87, -168, 300, 0, -81, 294, -154, -14, 347, -355, 147, 259, -199, -280, 96, -25, 80, 47, -451, -92, -52, -409, -8, -961, -149, -72, -243, 236, -205, -285, 98, -24, 92, -54, -74, -183, -172, -294, 193, -75, 80, 55, -48, -1, 61, -110, 191, 130, -127, 196, 28, -157, 195, -13, 149, 37, 172, 323, -173, -91, 21, -65, 82, 53, -107, 69, -81, -157, 261, -52, 100, -18, -140, -72, 95, 194, 124, 116, 227, 286, -237, 149, -9, -254, -57, 29, -41, 130, -82, 321, 161, -216, -105, 5, -237, 83, -20, -44, -287, -135, -89, -208]
4179b08K54k87L67n08N58l34P6J92j62K56n79N92l01J67l12L63k55J39L3J33k14
4200c0Jj13O2q6J26Q3j39M4j47L27l8j58J27j99j02O5K27Q7k90J24M5J16K0k43
4224i1L43l11K79k61K75j17l02K74p8k1N4N5l7j33K76l89K6J17N9Qj23K57l61
4247b01L22n1j74J64j74K07K14m08J75p3m10M72j18j47M30k77J03K7j98N7m6J00
4269fm6K44k56k1N1K59l30N6j01Q5J33j93J22l5o4R6J68j78J07J03r9N5j84q9
4293a23K6p4J34R9l81L18j8k60P5J36K78j2j43m6p1J6K7N3R0j29K3j65K01l03
4317b49L23K37j97k49Q5N7j19N8K5L15l35J25N0j91O8j34k52O58o03J62lK83l
4340A11k04J16L07l46R3N0m15N65m28K97J70m46J23k1PJ76j56j23L96j94K2m6
$$ y = [-208, 46, -241, 126, -382, 176, -158, -82, 110, -52, 204, -375, 217, -84, 83, -229, 134, -121, 18, 51, 184, -30, -29, -142, -80, -166, -40, 43, -96, -52, -199, 128, 90, -68, 59, -140, -242, -177, 50, 137, -153, -29, 16, 132, 152, -91, 252, -59, 220, -41, 234, 117, -185, 89, 11, -10, 44, 99, 62, -71, 205, -184, -158, -41, 18, 26, -97, 160, -201, 121, 70, -104, 60, -114, 93, 307, -101, 74, 1, -409, 63, -55, -202, 228, -49, 54, 81, -117, -60, -106, -6, -52, 192, -64, -85, -34, 225, -105, -49, -150, -65, 68, -125, -3, -38, -102, -6, 162, -16, 91, 194, 95, 150, -34, -123, -97, -171, -37, 62, -319, -1, -19, -279, -204, -68, 210, 198, 55, 9, -62, -46, -19, 34, 124, -5, 18, -147, 54, -249, 74, 311, 114, -135, -50, 7, -112, -54, -29, 286, -49, 76, 126, -65, 3, -131, -383, 275, -328, -166, -169, 114, 111, -93, 23, 330, -16, 77, 127, -288, 277, -151, 146, 316, -130, -7, -28, -21, 155, -1, -124, 272, 78, 100, 54]
4362E4j61J65k6m9Q6q0r3J00j0k24M32m58N00k62mN1K17k49k96K81r8L66o69N57
4386A30k77r0M61m23Q5L07J05m67L06n08O06n99O05J37j134Q82l14j24N9j44M18
4407B1j35L15J86p75L31N5N4M00n25O58k96L98o70k35J67O9Q84p60M45Q6j130
4428d57N09J92n51J439j143N10q74N41k52L43M7n41M07k43O8l47J193q00j01J71
4448A11J75k22mm72N77J00p5o3j50q96R39km57L21m4M9M7L5P8L64q24M95r6mQ8
4473G0l42J28K28j82lP6m3L24m37P4K72l68L41J10o26M11J85l72J69k48K26l0
4495c7Q0M0j73KJ94k40J76L0r0j15K92j71qK40l76L84l97L24J52Pj39k66P6q6
4519a01J90m6K9p9q6O4k87N86j93k48K42K0j51J97l49L09p5j58J72k20j96L54
$$ y = [54, -107, 58, 32, -17, 69, -11, -104, -4, -14, -238, 194, -264, 236, -26, -30, 21, 238, -11, -307, -26, -124, 242, -427, 130, -147, -237, 224, -199, -114, 193, 298, -169, 137, -371, 235, -364, 241, 378, -756, 126, -188, -312, -253, -397, 21, -114, 201, 387, -388, -57, -2, 52, 452, -73, 585, 289, 687, 17, -218, -51, 18, 902, 142, 587, 673, -457, 52, 244, -307, 1132, -11, 499, -375, 166, -86, 257, 304, -237, 170, -73, -5, -352, 841, 41, -60, 111, 286, 64, 60, -412, 165, 265, 190, 127, -23, -919, 20, 18, -439, -118, -162, -113, -66, -31, 47, 411, -413, 82, -14, -18, 70, -272, -144, 84, -98, -101, -25, -68, 256, -181, -107, 165, -203, 138, 248, -378, 33, 218, -154, 15, -233, -7, -37, 43, 83, -90, -88, 106, -134, 42, 72, -18, -133, 159, -12, -20, 220, -156, 228, -169, 155, 307, 314, 175, -91, -15, -101, 89, 43, 72, -7, -93, -29, -316, 270, 77, -171, 71, 91, -60, 137, -212, 97, 22, -136, 36, -184, -380, -26]
4541b6Rn0K66o31N43L1m89N37j99k11K67j82p2L02m51K43J63k4L69m04l57M62
4563I6j04K78j45j45J2k22K90J53l35l6J97k81L82k58j96O92l79ok84K62J3J64
4585A48n9j15O1j82J17j4k8J83k77P6J60q4l9J79j88o7J57l6j52j18K11J60k13
4608a20K19k78R2K45l86J16J62j97Q8J02%o8Q2lj18j68L94j11P7n9j5j85L47o6
4632A50K9j84l13M41k07R8M0j35K6J14Rj23K5m7L71j19k93J55o4j8n5r1J47R2
4656D8Jk10o5M29r9m9M2j07j36J98K7p3q5k3M13j38m21J28J85k07K58j96K89k04
4680EJ55n5j64OK05r0m8k2pQ2j31ML02l22J06j07o7J72o8p4O8J31k64N21k86j63
4706a11K48k7j66Q8L7r9P3p8J34l50J42L0J51Kk8J4k07J73q5J49j55J98j03k03
$$ y = [-26, -17, -67, 199, -432, 111, 142, -347, 190, -9, -220, 47, -135, -207, 95, -356, -113, 50, 26, 395, -9, -366, 96, -8, 270, 125, -20, -8, -230, 60, 213, -122, -158, 39, -242, 140, -118, -314, 378, -1, -7, -291, -29, -16, 148, 89, -26, 35, -147, -30, -44, -72, 111, -166, -90, 70, -14, -53, 126, -62, -129, 28, -8, -160, -278, -67, 93, -120, 99, -179, -87, 158, -228, -112, 50, -147, -59, 43, 43, -25, 57, 54, -64, -232, 162, 51, 128, 69, 54, -131, 216, 150, 179, -5, -318, 123, -84, 14, 54, -81, -55, 59, 68, -55, -30, -77, 294, 175, -118, 37, -27, -45, -100, -191, -44, 48, 49, -161, -226, 203, 104, 55, 97, -10, -146, 52, 79, 6, -79, -102, 311, 173, -248, -120, 65, -142, 116, -80, 209, 5, 160, 105, -59, -53, 152, 62, 14, -8, -15, 67, -64, -60, 242, -80, 26, -81, -148, 24, -44, -118, -50, 81, -183, 338, 52, -111, 137, 110, -56, 32, 69, -30, 43, -35, 99, -251, -109, -79, 72, 74, 46, 60, -147, 26, -59, 90, -65, 133, 30, -173]
4730a73K54q1j5o6K65j63l3j18q9J62KJ20j21L9K10r4k96K3L33l83J56J90k12
4753i0J4Q4oN1m6j03J54k2k00J85k7J70l31L34M3l10l5N0j02L30q2o6R5k42k26
4778c78N06j00n3K92m47K64r0r5L40l96J56Q7m9l0j92K24Q1n4j7j11K54l20M84
4801C56n53K24P9j62j3J84Qr5K9k17J37J83k7j58J92k0j16j81L07k38J5J57l13
4824b22K86J30j96R2k64J67j0n2N4Mk0K42m19O9K16O0j8M4l04L91j45j53K31m81
4848b98J68Q3j00J83J95n60K71O3o5J59j54J89k92LL33k91JJ05J8L4K09k47MJ72
4872A83l00J98j61K49j11l9L3O9m50O30l23k82P68n03N6J59k69O9M1M3J82k86
4894d4k36M67m17R2K05k21J69j55O3J53k17K8M54m73j03L01k27K60k54K3K06l6
$$ y = [-173, 81, 0, -15, -81, 184, 21, -12, -130, -219, -57, -55, 65, -56, -17, 193, 99, -197, -174, 159, -224, -68, 122, -90, -76, 8, 2, 53, 7, -96, 58, 36, -164, 21, -6, 164, -167, 167, 210, -100, -135, -85, -187, 143, 61, -5, 90, -152, -378, 128, 28, -25, 267, -180, 84, -6, -101, 239, -157, -1, 86, 37, 7, -185, 39, 120, 66, 49, -62, 192, -128, 356, -197, 27, 106, -56, -69, 115, 123, 28, 57, -160, -23, 160, 133, -25, 167, 147, 31, -150, 157, -81, -66, 91, -222, 64, 194, -2, 90, -174, -7, -17, -69, -15, -11, -31, 211, -208, -139, 77, 137, 119, 163, -141, 250, 105, -48, 183, -298, -130, -47, -147, 36, 231, -329, -58, 5, -60, 99, -55, 134, -158, -155, 178, -113, -112, -7, 11, 45, 254, 7, 11, 183, -117, 81, -80, 169, 58, 19, 52, 121, -329, 301, -22, -304, 464, -39, 17, 176, -93, -24, 17, 60, 242, -44, -280, 187, -230, -138, 67, -154, 15, -140, -77, 76, -141, -113, 341, -132, -235, 66, -161, 99, -155, -132, 74, 38]
4916C8l3J00j55L37j84l07N0J65j24K9m5N68o28Q18l5r15p5N96km41M14m65L57
4939F3R5l59L54L7l48L73m08K32K23m73L02r6k8J78k96J33K40k68J50k8j10K28
4961A94k21p9K91m45K18M38n62K82j19j09M34l26J98j42k56M23m4m97P05m88j43
4982b48L65k06P1K32n39J122o47p95J401o93k51J46n70M65N40p90N41j21j5K42
5002B50j51j44L69n84J75j21O8M41n62N4L59k75J89o2q3L65k93j52L23k89N5J35
5024F7l20L46l1j52O6l9J0K73k76R9O2l40N92l14l2K75l80N7j12j32K29J94k25
5047h3K69M8m16L30j47j08L6k85P74k28m77L13j74P9K02n81M36L9j80K45j63K7
$$ y = [38, 5, 105, -50, 287, 103, -204, -154, 11, -113, -84, -129, 439, -189, 629, 594, -321, -396, 200, 198, -243, 171, -294, 63, 158, -201, 153, 190, -158, 215, -193, 39, 262, -211, 91, -5, -33, 145, -151, -18, 222, -46, 104, 76, -34, 194, -27, -106, 185, -260, -42, 396, -166, 116, -3, -112, 322, -4, 194, 52, -204, 219, 175, -322, 383, -105, -248, 117, -89, -18, 214, -325, 797, 150, -645, 756, 63, -188, -42, -612, -147, 393, -397, 144, 23, 8, 250, 99, -45, 324, -260, -85, -206, -138, 303, -259, -205, 154, -121, 68, 6, -77, 288, -5, -157, 166, -123, -68, 67, -253, 93, 62, -90, -24, -63, -53, 220, -56, 43, 105, -235, 357, 43, 11, 286, -94, -37, -149, -281, -52, 142, -83, 186, 234, -182, 148, 1, -107, -71, -356, 418, 190, -287, 26, -148, -69, 133, -448, -12, 27, -153, 92, -71, -44]
$$ [...]
8191i5
##END NTUPLES=NMR FID
##END=
