##TITLE=1H_Pr 2113
 CDCl3
 8 sc, 
 28.10.2024
##JCAMPDX= 6.0         $$ Bruker NMR JCAMP-DX V2.0
##DATA TYPE= NMR FID
##DATA CLASS= NTUPLES
##ORIGIN= UXNMR, Bruker Analytische Messtechnik GmbH
##OWNER= root
$$ XWIN-NMR		Version 3.5
$$ Mon Oct 28 13:59:52 2024 Russian Standard Time (UT+4h)  she@DPX200
##.OBSERVE FREQUENCY= 200.1318
##.OBSERVE NUCLEUS= ^1H
##.DELAY= (6, 6)
##.ACQUISITION MODE= SIMULTANEOUS
##.ACQUISITION SCHEME= undefined
##.AVERAGES= 8
##.DIGITISER RES= 18
##SPECTROMETER/DATA SYSTEM= spect
##.PULSE SEQUENCE= zg30
##.SOLVENT NAME= CDCl3
##.SHIFT REFERENCE= (INTERNAL, CDCl3, 0, 15.7039)
##AUDIT TRAIL= $$ (NUMBER, WHEN, WHO, WHERE, WHAT)
$$ ##TITLE= Audit trail, XWIN-NMR		Version 3.5
$$ ##JCAMPDX= 5.01
$$ ##ORIGIN= Bruker BioSpin GmbH
$$ ##OWNER= she
$$ F:/spectra/data/she/nmr/H-F/1/audita.txt
$$ ##AUDIT TRAIL=  $$ (NUMBER, WHEN, WHO, WHERE, WHAT)
(   1,<2024-10-28 13:58:31.46 +0400>,<she>,<DPX200>,
      <created by zg, POWCHK disabled, PULCHK disabled
       configuration hash MD5:
       00 E9 B6 7A A2 85 ED C7 34 08 36 98 17 FE 4E 26
       data hash MD5: 16K
       F0 D2 16 9A FD D5 D4 5B 30 92 E2 1C 8A 0A DD C2>)
$$ ##END=
$$ 
$$ hash MD5
$$ C2 F8 9D EA C1 01 3F 43 5B B7 43 23 6A BF C0 8D
##$RELAX= 
##$RELAX= 
##$RELAX= 
##$RELAX= 
##$RELAX= 
##$RELAX= 
$$ Bruker specific parameters
$$ --------------------------
##$DU= <F:/spectra>
##$EXPNO= 1
##$NAME= <H-F>
##$PROCNO= 1
##$TYPE= <nmr>
##$USER= <she>
##$AMP= (0..31)
100 100 100 100 100 100 100 100 100 100 100 100 100 100 100 100 100 100 
100 100 100 100 100 100 100 100 100 100 100 100 100 100 
##$AQSEQ= 0
##$AQ_mod= 1
##$AUNM= <au_zg>
##$AUTOPOS= <>
##$BF1= 200.13
##$BF2= 200.13
##$BF3= 200.13
##$BF4= 200.13
##$BF5= 200.13
##$BF6= 200.13
##$BF7= 200.13
##$BF8= 200.13
##$BYTORDA= 1
##$CFDGTYP= 0
##$CFRGTYP= 5
##$CHEMSTR= <none>
##$CNST= (0..31)
1 1 145 1 1 1 1 1 1 1 1 1 1 1 1 1 1 1 1 1 1 1 1 1 1 1 1 1 1 1 1 1 
##$CPDPRG= <>
##$CPDPRG1= <>
##$CPDPRG2= <>
##$CPDPRG3= <>
##$CPDPRG4= <mlev>
##$CPDPRG5= <mlev>
##$CPDPRG6= <mlev>
##$CPDPRG7= <mlev>
##$CPDPRG8= <mlev>
##$CPDPRGB= <>
##$CPDPRGT= <>
##$D= (0..31)
0 1.2 0 0 0 0 0 0 0 0.06 0 0.03 0 0 0 0 0.0002 0 0 0 0 0 0 0 0 0 0 0 0 
0 0 0 
##$DATE= 1730109510
##$DBL= (0..7)
120 120 120 120 120 120 120 120 
##$DBP= (0..7)
150 150 150 150 150 150 150 150 
##$DBP07= 0
##$DBPNAM0= <>
##$DBPNAM1= <>
##$DBPNAM2= <>
##$DBPNAM3= <>
##$DBPNAM4= <>
##$DBPNAM5= <>
##$DBPNAM6= <>
##$DBPNAM7= <>
##$DBPOAL= (0..7)
0.5 0.5 0.5 0.5 0.5 0.5 0.5 0.5 
##$DBPOFFS= (0..7)
0 0 0 0 0 0 0 0 
##$DE= 6
##$DECBNUC= <off>
##$DECIM= 24
##$DECNUC= <off>
##$DECSTAT= 4
##$DIGMOD= 1
##$DIGTYP= 9
##$DL= (0..7)
0 120 120 120 120 120 120 120 
##$DP= (0..7)
150 150 150 150 150 150 150 150 
##$DP07= 0
##$DPNAME0= <>
##$DPNAME1= <>
##$DPNAME2= <>
##$DPNAME3= <>
##$DPNAME4= <>
##$DPNAME5= <>
##$DPNAME6= <>
##$DPNAME7= <>
##$DPOAL= (0..7)
0.5 0.5 0.5 0.5 0.5 0.5 0.5 0.5 
##$DPOFFS= (0..7)
0 0 0 0 0 0 0 0 
##$DQDMODE= 0
##$DR= 18
##$DS= 0
##$DSLIST= <SSSSSSSSSSSSSSS>
$$ [...]
##$SUBNAM2= <"">
##$SUBNAM3= <"">
##$SUBNAM4= <"">
##$SUBNAM5= <"">
##$SUBNAM6= <"">
##$SUBNAM7= <"">
##$SUBNAM8= <"">
##$SUBNAM9= <"">
##$SW= 24.0689170037331
##$SWIBOX= (0..15)
0 0 2 0 0 0 0 0 0 0 0 0 0 0 0 0 
##$SW_h= 4816.95568400771
##$TD= 16384
##$TD0= 1
##$TE= 0
##$TE2= 300
##$TE3= 300
##$TEG= 300
##$TL= (0..7)
0 120 120 120 120 120 120 120 
##$TP= (0..7)
150 150 150 150 150 150 150 150 
##$TP07= 0
##$TPNAME0= <>
##$TPNAME1= <>
##$TPNAME2= <>
##$TPNAME3= <>
##$TPNAME4= <>
##$TPNAME5= <>
##$TPNAME6= <>
##$TPNAME7= <>
##$TPOAL= (0..7)
0.5 0.5 0.5 0.5 0.5 0.5 0.5 0.5 
##$TPOFFS= (0..7)
0 0 0 0 0 0 0 0 
##$TUNHIN= 0
##$TUNHOUT= 0
##$TUNXOUT= 0
##$USERA1= <user>
##$USERA2= <user>
##$USERA3= <user>
##$USERA4= <user>
##$USERA5= <user>
##$V9= 5
##$VALIST= <valist>
##$VCLIST= <CCCCCCCCCCCCCCC>
##$VD= 0
##$VDLIST= <DDDDDDDDDDDDDDD>
##$VPLIST= <PPPPPPPPPPPPPPP>
##$VTLIST= <TTTTTTTTTTTTTTT>
##$WBST= 1024
##$WBSW= 4
##$XGAIN= (0..3)
0 0 0 0 
##$XL= 0
##$YL= 0
##$YMAX_a= 275541
##$YMIN_a= -321335
##$ZGOPTNS= <>
##$ZL1= 120
##$ZL2= 120
##$ZL3= 120
##$ZL4= 120
##$ABSF1= 10
##$ABSF2= 0
##$ABSG= 5
##$ABSL= 3
##$ALPHA= 0
##$AQORDER= 0
##$ASSFAC= 0
##$ASSFACI= 0
##$ASSFACX= 0
##$ASSWID= 0
##$AUNMP= <proc_1d>
##$AZFE= 0.1
##$AZFW= 0.1
##$BCFW= 1
##$BC_mod= 2
##$BYTORDP= 1
##$COROFFS= 0
##$CY= 11.3945322036743
##$DATMOD= 1
##$DC= 2
##$DFILT= <>
##$DTYPP= 0
##$F1P= 15.6554695791079
##$F2P= 12.8336369535428
##$FCOR= 0.5
##$FTSIZE= 0
##$FT_mod= 4
##$GAMMA= 1
##$GB= 0.15
##$INTBC= 1
##$INTSCL= 1
##$ISEN= 128
##$LB= 0.24
##$LEV0= 0
##$LPBIN= 0
##$MAXI= 10000
##$MC2= 0
##$MEAN= 0
##$ME_mod= 0
##$MI= 1.114404
##$NCOEF= 0
##$NC_proc= 0
##$NLEV= 6
##$NOISF1= 3.799351
##$NOISF2= 2.8
##$NSP= 1
##$NTH_PI= 0
##$NZP= 0
##$OFFSET= 15.70392
##$PC= 1
##$PHC0= -26347.94
##$PHC1= 14.38743
##$PH_mod= 1
##$PKNL= yes
##$PPARMOD= 0
##$PSCAL= 0
##$PSIGN= 0
##$REVERSE= no
##$SF= 200.130013532006
##$SI= 16384
##$SIGF1= 3
##$SIGF2= 2
##$SINO= 400
##$SIOLD= 16384
##$SREGLST= <1H.CDCl3>
##$SSB= 0
##$STSI= 0
##$STSR= 0
##$SW_p= 3612.71676300578
##$SYMM= 0
##$S_DEV= 0
##$TDeff= 0
##$TDoff= 0
##$TI= <>
##$TILT= no
##$TM1= 0
##$TM2= 0
##$TOPLEV= 0
##$USERP1= <user>
##$USERP2= <user>
##$USERP3= <user>
##$USERP4= <user>
##$USERP5= <user>
##$WDW= 1
##$XDIM= 8192
##$YMAX_p= 0
##$YMIN_p= 0
$$ End of Bruker specific parameters
$$ ---------------------------------
##NTUPLES= NMR FID
##VAR_NAME=  TIME,          FID/REAL,        FID/IMAG
##SYMBOL=    X,             R,               I
##VAR_TYPE=  INDEPENDENT,   DEPENDENT,       DEPENDENT
##VAR_FORM=  AFFN,          ASDF,            ASDF
##VAR_DIM=   8192,          8192,            8192
##UNITS=     SECONDS,       ARBITRARY UNITS, ARBITRARY UNITS
##FACTOR=    0.0002076,     1,               1
##FIRST=     0,             0,               0
##LAST=      1.7004516,     0,               0
##MIN=       0,             -321335,         0
##MAX=       1.7004516,     275541,          0
$$ Real data points
##PAGE= N=1
##DATA TABLE= (X++(R..R)), XYDATA
$$ [...]
2775D92n591R003k585o291Q030p81p066P254L77p390O055J454p012M734J938o089
$$ 492 -5099 3904 1319 -4972 3058 2277 -4789 2465 2842 -4548 1507 2961 -4051 683 2621 -3468
2791c468L699K336n258L044K206m843K497J701l994K309J322l912L004Q05l871
$$ -3468 231 2567 -2691 353 2559 -2284 213 1914 -2080 229 1551 -2361 643 1448 -2423
2806b423L090O94l867L710N14n042M747Q25n780M245K211o707M093L500q115L998
$$ -2423 667 1361 -2506 1204 1718 -3324 1423 2248 -3532 713 2924 -3783 310 3810 -4305 -307
2822c07M906q405K708O420q512J103P386p868q62Q524o438k624Q706n157m030
$$ -307 4599 -3806 -1098 5322 -3190 -2087 5299 -2569 -3431 5093 -1345 -3969 4737 -420 -4450
2837d450Q713l569n138P897j817n953P027j023n450N312K27m965M340N82m139
$$ -4450 4263 694 -4444 3453 1636 -4317 2710 1687 -3763 1549 1776 -3189 1151 1733 -2406
2852b406L123O95l272K506J90k695K945p47k187L472j653k414M564j851l051N410
$$ -2406 717 1412 -1860 646 836 -1859 1086 339 -1848 1624 -29 -2443 2121 270 -2781 2629
2868B629k258m193O488j431n679O953l93o952O965J183q200N963K895q839M889
$$ 2629 371 -3822 2666 1235 -4444 2509 2116 -4836 2129 3312 -4888 1075 3970 -4869 20
2883B0M978r316L090O258q353J140P158p460r56Q200n743k343P512m417l153O591
$$ 20 4998 -4318 -1228 5030 -3323 -2183 4975 -2485 -3441 4759 -984 -3327 4185 -232 -3385 3206
2899C206k779l524N185j275l603M259n63k872L134o47j587K406j359j076K603
$$ 3206 427 -3097 2088 813 -2790 1469 906 -1966 1168 521 -1066 1340 -19 -1095 1508
2914A508k176m89L203l152k53M280m390m32N373m535j392O095l990l297P289l482
$$ 1508 -668 -1157 2046 -1106 -1359 2921 -1469 -1901 3472 -1063 -2455 3640 -350 -3647 3642 160
2930A60m264P525k154o035P726m53p379O956J053p805N992K746q354M296M114
$$ 160 -4104 3421 1267 -4768 2958 2505 -4874 2082 3135 -4670 1322 4068 -4286 10 4124
2945D124p913K803N013o577Q37N526n513j57N135m458r32M684l321j441M418k765
$$ 4124 -3789 -986 4027 -2550 -1713 3813 -1700 -1857 3278 -1180 -2112 2572 -749 -2190 2228 -537
2961e37j072L403k035j128L173k329k36K429k378K4K538l186M33K972l656P55
$$ -537 -1609 1794 -241 -1369 1804 -525 -761 1668 -710 -686 1852 -1334 -901 2071 -1585 -830
2977h30L606m261N2M676m661n13N577m786j439N995m286k554P016l533l747O863
$$ -830 2776 -1485 -1433 3243 -1418 -1931 3646 -1140 -2579 3416 -870 -3424 3592 59 -3688 3175
2993C175j975n077O682r01n956O173J02o104N109J522o460M481J970o194L520
$$ 3175 1200 -3877 2805 1904 -4052 2121 2223 -3881 1228 2750 -3710 771 2741 -3453 67
3008F7K963n407K178L196n251J503L290m502J049L188l291k1L020k796j0K688
$$ 67 3030 -2377 -199 2997 -2254 -751 2539 -1963 -914 2274 -1017 -1038 1982 -814 -824 1864
3024A864k737L44K030k972J250J792l189J311K137l707J646K481m396J804K894
$$ 1864 -873 -529 1501 -1471 -221 1571 -1618 -307 1830 -1877 -231 2250 -2146 -342 2552
3039B552m245Q58L987n292N63M844n188l89N923m443j712O590m597k912O871l114
$$ 2552 -1693 -835 3152 -2140 -1577 3267 -1921 -2310 3613 -830 -2542 4048 -549 -3461 3410 296
3055B96l838O768k172n045O313m93n808N683N24n992M715J918o054L763K098n261
$$ 296 -3542 3226 1054 -3991 2322 1829 -3979 1704 2228 -3764 951 2869 -3185 578 2676 -2585
3071b585K292K834m501J453K672l874J347K063k909R19J560k495J259P94k020
$$ -2585 -293 2541 -1960 -507 2165 -1709 -362 1701 -1208 -289 1271 -1224 35 829 -1191
3086a191J548N04k395K346M20l468L220N68m126L512J371n145L366K513o330K839
$$ -1191 357 861 -1534 812 1232 -2236 984 1552 -2574 938 2309 -2836 530 3043 -3287 -448
3102d48L777o151J346N382o263L11O320n677j354O767m900k520O976l306m241
$$ -448 3329 -2822 -1476 3906 -2357 -2046 4274 -1403 -2757 4010 -890 -3410 3566 260 -3981
3117c981P258k250n251O643p85n131N105O31n461M206R88m398K487J850l647J923
$$ -3981 3277 1027 -4224 2419 1634 -3497 1608 2239 -3222 984 1972 -2426 61 1911 -1736 187
3133A87R85k135J040P90j819J312P4j649K039p84j432K559r86k278L882j131l044
$$ 187 1172 -963 77 867 -952 360 434 -1215 824 40 -1392 1167 181 -2097 1785 654 -2390
3150b390M136l81m596M938J92n284M586J429o379L975L022o773L160M181p018
$$ -2390 1746 1365 -3231 1707 1899 -3385 1201 2630 -3749 226 3248 -3525 -365 3816 -3202
3165c202K441M823o414M24O045n695j155O322m542k005O072k954k984N477k255
$$ -3202 -761 4062 -2352 -1928 4117 -1578 -2733 3589 -953 -2958 3114 160 -2824 2653 398
3180C98k929M563j124l384M041r19k694L417o50k476K931o80j677K303j048j342
$$ 398 -2531 2032 908 -2476 1565 646 -2048 1369 719 -1757 1174 494 -1183 1120 72 -1270
3196a270K721j492j436L237k049j467L423k001j674L994j876k753N014j513l883
$$ -1270 1451 -41 -1477 1760 -289 -1756 1667 -334 -2008 1986 110 -2643 2371 858 -3025
3211c025N149o70m619M879R5n410M562J158n426M216K039n997L159L087n870J883
$$ -3025 2124 1454 -3165 1714 1809 -3601 961 2119 -3307 909 2948 -3049 110 3197 -2673 -790
3227g90M120n644J017M335m912K56M607m092o45M777l663j439M511k904j359L750
$$ -790 3330 -2314 -1297 3038 -1874 -1618 2989 -1103 -1748 3029 -634 -2073 2438 -466 -1825 1925
3243A925k136j420L511k074j163K963j782r54K758j821r37K890k344o19K953k358
$$ 1925 -211 -1631 1880 -194 -1357 1606 -176 -1130 1628 -193 -1130 1760 -584 -1203 1750 -608
3259f08q52L431k817m93L681k963r81L939k656k163N104k511l027N451j987l710
$$ -608 -1460 1971 -846 -1339 2342 -621 -1602 2337 -319 -2482 2622 111 -2916 2535 548 -3162
3275c162N438q52m982N577k6n223M486Q40n374L863K042n749L216K763n673K026
$$ -3162 2276 1424 -3558 2019 1993 -3230 1256 2096 -3278 585 2627 -3122 94 2857 -2816 -790
3291g90L831n092J194L541l985r9L640l424j25L328k786n49L080k354l98K609
$$ -790 3041 -2051 -857 2684 -1301 -1400 2240 -1184 -1309 2019 -767 -1316 1764 -590 -988 1621
3307A621k062j52J808j837M50J427k440J209J539k839J189K144l572J197L032
$$ 1621 -441 -593 1215 -622 -172 1255 -1185 24 1563 -1276 -87 2057 -1515 -318 2714
3322B714m096M37L920m641r9M742m331r82N486m083k022O043l306l035O131j903
$$ 2714 -1382 -945 2975 -1666 -1765 2977 -1354 -2336 3150 -933 -2955 3088 -218 -3253 2878 975
3338I75m461N635n84m880M873M63n494M124J711n189L025K301m544J835K509m097
$$ 975 -3486 2149 1565 -3315 1558 2021 -3473 651 2362 -2827 198 2499 -2045 -210 2299 -1798
3354a798J356K299l259P15K102k384O73J378j975R05R34j770J071Q94k217J567
$$ -1798 -442 1857 -1402 -687 1415 -969 -296 1082 -893 12 946 -824 247 1141 -1076 491
3370D91O02k914K270O61l242K640J212m098K840J954m711K044K995n166J513M009
$$ 491 1093 -1821 449 1110 -2132 508 1720 -2378 462 2416 -2295 -251 2744 -2422 -909 3100
3386C100m873J70M810m232j235N362l840k048O006l096l133N398j823l438M543
$$ 3100 -1773 -1603 3207 -1025 -2260 3102 -738 -2786 3220 124 -3009 2389 566 -2872 1671
3401A671p35l812M196J55l957L209Q68l536K300R50k926J745R60k498J605L76
$$ 1671 936 -2876 1320 1475 -2482 727 1595 -1941 359 1309 -1617 128 1088 -1410 195 571
3417E71j921J644M51k156K140j94j691K212o56j797K503n46k519L223l59l194
$$ 571 -1350 294 745 -1411 729 535 -1156 1056 400 -1397 1106 560 -1959 1264 905 -2289
3433b289L319M63l686K873J209m499K757K163n031K346K910m804J485L642m351
$$ -2289 1030 1493 -2193 680 1889 -2610 147 2310 -2721 -375 2535 -2269 -784 2858 -1493
3448a493K90M094l687r14M267l322j243M390k573k002M254k109k276L968j359
$$ -1493 -1203 2891 -796 -1710 2557 -765 -2008 2382 -191 -2193 2061 -48 -2324 1644 285
3463B85k616L733p41k463K864l55k174K435n41j829K079l22j498J932l38j572
$$ 285 -2331 1402 661 -1802 1062 707 -1467 968 427 -1402 677 355 -1143 789 451 -1121
3479a121K116m97j443J981r10j327K305q37j823L127j119k410L267o24k347K925
$$ -1121 995 498 -945 1036 126 -1201 1104 267 -1556 1571 452 -1958 1309 685 -1662 1263
3495A263j4l700L495Q26m433L038J708m651K580K261m568K233K749m838J344L376
$$ 1263 1249 -2451 1044 1870 -2563 475 2183 -2468 112 2373 -2195 38 2787 -2051 -707 2669
3511B669m430N35L819l794l14L818l003j011L733k056j659L822j897j784L169
$$ 2669 -1761 -1226 2593 -1201 -1515 2303 -700 -1711 2022 -34 -1693 2129 232 -1552 1617
3526A617j277j711K535j055j353J893k70j210J677q22o78J611j006o37J904j637
$$ 1617 340 -1371 1164 109 -1244 649 379 -831 846 24 -654 957 -49 -686 1218 -419
3542d19m53K230j419r04K776k029j128L280j898j794L585j313k781L912j239k989
$$ -419 -872 1358 -61 -965 1811 -218 -1346 1934 36 -1758 1827 514 -2267 1645 406 -2583
3558b583L956k12l757L742Q19m318L152J432m713K553K649m701J412K910l953
$$ -2583 1373 1161 -2596 1146 1965 -2353 799 2231 -2482 71 2720 -1981 -569 2341 -1612
3573a612P86L324l692J06L114k608k82K494j857p93K133j237o64J807j302o82
$$ -1612 -826 2498 -1194 -1088 2026 -582 -864 1630 -227 -1020 1113 -124 -788 1019 -283 -965
3589i65J806j148o8J130j123N4J466k253Q42J332k397P69K005k574K19K903l049
$$ -965 841 -307 -375 755 -368 -314 1152 -1101 -259 1073 -1324 -555 1450 -1124 -905 1998 -1051
3606a051k33L625l082r22M021k719j851M381k100k688M438r99l270L922K10m188
$$ -1051 -1284 2341 -741 -1663 2358 -361 -2212 2169 69 -2619 1819 820 -2450 1472 1682 -2506
3622b506L350Q68m299K999J299l775J995K107l854J317K380l153O08K395k689
$$ -2506 844 1712 -2587 412 1711 -2064 -69 2038 -1816 -499 1881 -1272 -664 1731 -958
3637i58M38J740k101J96J562j780M91J247j642P17J098k030J139Q91k220J580
$$ -958 -520 1220 -881 -685 877 -903 -412 835 -807 -90 1008 -1022 117 1008 -1212 368
3653C68M28k117J403J215k878J218K109l378J232K668l397L23L134l487o7L743
$$ 368 796 -1321 82 1297 -1581 -363 1746 -1632 -400 2268 -1129 -806 2328 -1159 -1226 2517
3669B517l482p73L952k711j296L993k117k438M099j031l068L968j007k726L154
$$ 2517 -965 -1738 2214 -497 -1793 2200 83 -2355 1744 713 -2355 1613 606 -2120 1034
3684A034P5l354K965N69l222K407P33k887K063R49k600J490P03k359J542R71k268
$$ 1034 1109 -2245 720 1289 -1933 474 1207 -1680 383 1332 -1268 222 925 -1434 108 1079 -1189
3701a189J633L12j734R90P73j948J493L15j887J909L42k528J768R32k842J970
$$ -1189 444 756 -978 12 785 -1163 330 645 -1242 667 1009 -1519 249 1181 -1661 309
3717C09J188l230J882J647l317J254K254l587R63K649l237J82L589l705j31L761
$$ 309 1497 -1733 149 1796 -1521 -267 1987 -1600 -637 2012 -1225 -1043 2546 -1159 -1290 2471
3733B471l374p49L927k870r84L768k150k047L703j283k306L198o88k100K524m78
$$ 2471 -903 -1652 2275 -595 -1579 2189 39 -2008 1695 412 -1894 1304 616 -1484 1040 562
3749E62j942K008K07k399K053R0j928J934l5j600J611j29j435J673j27j565J763
$$ 562 -1380 628 835 -1564 489 579 -1349 585 550 -1050 561 432 -1003 670 543 -1022 741
3766G41k42j827K123m08j756K194m82j892K538j12k804K573M63k992K321J053
$$ 741 499 -1328 795 387 -1369 825 343 -1549 989 877 -1927 646 1109 -1883 438 1491
3782A491l458K255J530l860J697K465l628J047K712l370P9L255l082o98L842k802
$$ 1491 -1967 288 1818 -2042 -345 2120 -1508 -461 2251 -1119 -1040 2215 -867 -1565 2277 -525
3798e25o80K983j988j301L083j378j556K554r65j560K203n44j666J780k90j353
$$ -525 -1205 1778 -210 -1511 1572 194 -1362 1192 227 -1333 870 326 -1340 440 150 -1203
3814a203J848n95o29J416r02o73J535j041o00J980j422p49K260j398j052K803
$$ -1203 645 50 -579 837 -65 -738 797 -244 -844 1136 -286 -1035 1225 -173 -1225 1578
3830A578j601j744L239j094k038L255o85k908L390j41l244K731M42l328K437J701
$$ 1578 -23 -1767 1472 378 -1660 1595 910 -1998 1392 1251 -1993 738 1180 -2148 289 1990
3846A990m000K151J925l590Q95K562l329O68K713l044P8K630k384j6K197j787
$$ 1990 -2010 141 2066 -1524 -629 1933 -1396 -728 1985 -1059 -981 1649 -735 -751 1446 -341
3862c41m76K001j361p67J873j055o29J626j249q3J381j441J55J301j353N3J544
$$ -341 -817 1184 -177 -944 929 -126 -755 871 -378 -461 920 -521 -366 935 -418 -365 1179
3879A179j754K25J561j974p4K297k125k24K392j914q10K833j828j226L004j431
$$ 1179 -575 -350 1211 -763 -837 1460 -665 -889 1503 -411 -1221 1612 -216 -1442 1562 131
3895A31k031L111p76k356L167m31k698K680N9k457K332L90k794J606J239k625
$$ 131 -1900 1211 435 -1921 1246 815 -1883 797 856 -1601 731 1121 -1673 -67 1172 -1453
3911a453J329J546k725P83J729k044L78J613j954O55J361j862K96J261j569M27
$$ -1453 -124 1422 -1303 -520 1209 -835 -457 1156 -798 -143 1218 -644 -348 913 -656 -229
3927b29J070j308J57J250j753O26J249k036Q44J261j797K58J667k209M52J564
$$ -229 841 -467 -310 940 -813 -187 1062 -974 -130 1131 -666 -408 1259 -950 -498 1066
3943A066j963M16J876k115j1K421k004p37K774j972j018K490j422j385K663o42
$$ 1066 -897 -481 1395 -720 -731 1690 -314 -1051 1723 -249 -1267 1223 -199 -1584 1079 437
3959D37j934K717p03k007K216J39k492K328L68k762J828Q65k444J152J332k197
$$ 437 -1497 1220 517 -1490 726 865 -1627 701 1069 -1693 135 1000 -1444 -292 1040 -1157
3975a157J421P31j761P27P31j392N42J104j573L09R74j373P65N67j446J007M19
$$ -1157 264 995 -766 -39 692 -700 -158 946 -627 -318 656 -717 48 615 -831 176 595
3992E95j616J410M48j821J248O79k129J123J265k418R88J437k308Q02J904k744
$$ 595 -1021 389 837 -984 264 943 -1186 -63 1202 -1216 -228 1209 -1099 -297 1607 -1137
4008a137L17K604k652m57K905j927o94K405j523j446L174j208j939K672l94k574
$$ -1137 -820 1784 -868 -1325 1580 -347 -1041 1364 -159 -1605 1569 361 -1578 1094 700 -1874
4024a874K715l17k328K277L56k378J890O04j769J185J66j285P84M87j172O89K22
$$ -1874 841 524 -1804 473 829 -1549 341 945 -824 361 527 -758 26 513 -659 30 252
4041B52r55Q00K45o19N87k3r23R49K03j220J220J34j833J934k4k104J730N88k421
$$ 252 -703 97 342 -277 310 287 -636 313 516 -704 516 650 -1183 751 727 -1377 353 941 -1480
4060a480J961P76k695J810Q60k484Q37K174k887O51K246k573m19K744j990o46
$$ -1480 481 1257 -1438 372 1232 -1252 -415 1759 -1128 -477 1769 -804 -1223 1521 -469 -1115
4076a115K691j919r91K700j261j406K287q30j493K254n74j390J866n62j140J358
$$ -1115 1576 -343 -1334 1366 105 -1301 986 156 -1337 917 343 -1047 819 257 -883 475
4092D75L2j291R77j9q02Q65j09p30R87m05n29J495p91q47J305n64j174K151q92
$$ 475 507 -784 193 174 -628 237 128 -602 385 -20 -549 946 155 -692 613 49 -1125 1026 134
4111A34j383K079o13j554J907K92k434K134L58k755K288N95k553J598J279k642
$$ 134 -1249 830 217 -1337 570 862 -1572 562 920 -1835 453 1048 -1505 93 1372 -1270
4127a270R05J812k902J110K087k452J2K233k192p7K095j791n77K275j533n89J630
$$ -1270 -365 1447 -1455 -345 1742 -710 -698 1535 -657 -734 1361 -430 -1007 1268 -265 -854 776
4144G76p19q61J412l55q00J146n97m39J100n94o59J190r03j05J091p61m39J266
$$ 776 57 -804 608 253 -547 599 2 -437 663 69 -590 600 -303 -408 683 -78 -517 749
4162G49q45m62J532j021r20K015r22j486K328j039j059K046n50j946K354j25k033
$$ 749 -96 -558 974 -47 -967 1048 126 -1360 968 -71 -1130 916 366 -1580 774 649 -1384
4179a384K023J46k250J805O08k206J592J083k491J175J244k487Q92J495k138K09
$$ -1384 639 785 -1465 340 948 -1258 334 1417 -1074 101 1345 -1142 -250 1245 -893 -684
4195f84K227k150P9J634j515R7J342j602m1J453j116m32J463j182JR46p37l58
$$ -684 1543 -607 -528 1106 -409 -312 1030 -572 -613 840 -276 -708 755 -427 -426 520 -217 -575
4213e75J266j034k47J275j292N41J126j309k73J632j619p0J642j491n24K254j565
$$ -575 691 -343 -590 685 -607 -66 1060 -249 -522 1110 -509 -579 1063 -428 -952 1302 -263
4230b63o65K165j463q36K268j371j150K380q23j602K370m22k170K360l7k199K056
$$ -263 -928 1237 -226 -1062 1206 -165 -1315 1065 242 -1360 1010 588 -1582 778 741 -1458 598
4247E98J89k239J753P31k127J145J233k409J077J021j744O24R57j382L89P74r17
$$ 598 787 -1452 301 1032 -1095 50 1283 -1126 -49 972 -772 -148 809 -573 -184 590 -327
4264c27O4Q20p41NO76q71R5Q00r71O47M70j117O29O05j402N00R53j643M47J308
$$ -327 -263 557 -184 -179 497 -374 -279 521 -450 197 667 -450 179 784 -618 -118 835 -808 -361 947
4284I47j721N32J574j919R0J851j726n11K303j574r63K458j687q76K370r32j376
$$ 947 -774 -242 1332 -587 -497 1354 -372 -883 1420 -154 -1117 1341 -346 -1222 1148 216 -1160
4301a160J911m09j622K009j71j929J687M20j975J515N73j584Q15O99j493P76N10
$$ -1160 751 342 -1280 729 558 -1371 316 736 -1239 276 849 -735 80 779 -714 62 572
4318E72j045N27N86r28M12K52j073P31M12j084J076K8j030R10K25j454J014N27
$$ 572 -473 54 640 -288 124 376 -697 34 446 -638 438 466 -564 346 571 -883 131 658
4336F58j757J581M39j965R86J223k215Q24J425k223O78J763k117j26K020j651
$$ 658 -1099 482 921 -1044 -58 1165 -1050 -226 1199 -1024 -346 1417 -700 -826 1194 -457
4352d57l61K262j928o12K058j045q05J996q01j150J814o32j312J612k91j248J242
$$ -457 -818 1444 -484 -1096 962 -83 -888 1108 307 -843 971 339 -973 639 348 -900 342
4369C42K02j454J056J35p76J073k40q68N51K80q23P74L3r72J075j2q59Q78j14
$$ 342 544 -910 146 281 -495 578 338 -530 21 301 -522 252 285 -687 388 376 -483 395 281
4388B81j112J423l26j093J526k52j413J359j02j365J001R45j765R04J058j990
$$ 281 -831 592 266 -827 699 447 -966 393 291 -1074 -73 872 -893 11 1069 -921
4404i21J002Q30j954Q75J293j766M2J804j853o4J755j237p87K078j394m41J686
$$ -921 81 911 -1043 -168 1125 -641 -599 1205 -648 -712 1043 -194 -981 1097 -297 -738 948
4421I48j050o03J578q28p71J424m70j014J075Q0q21Q62l68m13R08m89o33R90n01
$$ 948 -102 -705 873 45 -726 698 228 -786 289 369 -452 410 42 -371 537 48 -585 405 -96
4440i6j52N08k40o19J215n23o41J164n18p90J481o79j015J189j11j151J525K8
$$ -96 -248 260 20 -599 616 93 -548 616 98 -692 789 110 -905 284 173 -978 547 575
4458E75j561J429M02j852J507L89j868J062P99j706P14Q86j859R13J237j665L77
$$ 575 -986 443 845 -1007 500 889 -979 83 882 -824 -110 776 -1083 -170 1067 -598 -221
4475b21J206j375k94J653j319j86J321p11q38J361n86o00J191l88o89R60o41l67
$$ -221 985 -390 -684 969 -350 -536 785 74 -764 597 11 -589 602 214 -475 485 -156 -523
4493e23P65j91n31J011n99o47J190p42j41J052p25k97J178r18l85J374p66q37
$$ -523 242 51 -480 531 -68 -715 475 -267 -408 644 -81 -378 800 -118 -503 871 105 -732
4511g32J607q84j006J837o69q92J416k51j521J821J7j820J406O59k069J092J077
$$ -732 875 -9 -1015 822 153 -739 677 426 -1095 726 743 -1077 329 988 -1081 11 1088
4528A088k001R88P43j546M09J285j595M34J027j213PJ048j043j36J026o53l95
$$ 1088 -913 75 818 -728 -319 966 -629 -195 832 -381 -374 674 -369 -505 521 -132 -527
4545e27J081o34k96J069q87o0L38m74K32N03o36L17K93o41K76O81j109N8J282
$$ -527 554 -80 -376 693 -194 -254 84 -390 -158 345 -291 26 319 -322 -46 635 -474 -416 866
4564H66j322o4J493j156m69J766j410p01J775j042q23J882n84j131J958p30j499
$$ 866 -456 -520 973 -183 -652 1114 -296 -997 778 -264 -1087 795 211 -920 1038 308 -1191
4581a191J862j22j755J579M47j987J368M80j246P22N71j311N14Q41j519N51O12
$$ -1191 671 549 -1206 373 820 -1167 201 681 -565 157 728 -583 -69 772 -747 -196 416
4598D16r77L98Q35j238O12N91j163M47M74r37L61M39q99Q05L3o37M17O58j466
$$ 416 -561 -163 672 -566 46 637 -526 -79 395 -542 -181 258 -641 164 197 -440 -23 635 -831
4617h31J065L79j104M30R35j375K81J179j490J20J445j328J02J320j126p95J600
$$ -831 234 613 -491 -61 874 -501 -220 959 -531 -411 1034 -294 -192 1128 2 -793 807
4634H07j025m30J758j416o46J693l28j311J662m36j056R69l3r80R44K40j345J344
$$ 807 -218 -648 1110 -306 -952 741 413 -898 764 328 -728 241 208 -772 172 412 -933 411
4652D11k03r83O62Q71j268P58L18r48O76K06q99O19po88O36j31p11R44O0q81R77
$$ 411 208 -775 -113 758 -510 248 566 -382 294 500 -399 220 213 -475 161 30 -681 263 323 -558 419
4673D19j76p33O39L64j178Q17nj040Q39P03j394M70J113j575O56R18j263N6J483
$$ 419 243 -490 149 513 -665 152 147 -893 -54 649 -745 -275 838 -737 -81 837 -426 -370 1113
4692A113j381l89J666j315m73J749r59o93J356q53n97J366k68j009J207j93j027
$$ 1113 -268 -657 1009 -306 -779 970 11 -682 674 -179 -776 590 322 -687 520 327 -700
4709g00J263k96q23P52N0m18O43m32k17O11k17p15O24Q9o97P00j21k18N10j18
$$ -700 563 267 -556 196 246 -172 471 39 -178 433 216 -499 125 214 -483 217 96 -122 388 270
4729B70q27J081m28m59P72j37n82N51p9q34J002k5j074J182J59j084O54P93j616
$$ 270 -557 524 96 -363 409 272 -310 241 162 -672 330 305 -769 413 572 -512 142 935 -681
4748f81M59J050j573L25J208j340K59J216j048k26J120p64n58J247q94o42J428
$$ -681 -222 828 -745 -420 788 -552 -293 923 -125 -351 769 5 -553 694 -200 -842 586
4765E86l97q43J373o47n12R69k40n50O51o43N6M60n68k65J015n61j89Q16m74j16
$$ 586 189 -654 719 72 -440 529 289 -261 390 -253 -197 263 -305 -570 445 -116 -305 511 37 -79
4785g9N33o40l92J053o50l04J197o22p99J221j69j042J146m43p76J051L80j413
$$ -79 454 -186 -578 475 -175 -479 718 96 -703 518 349 -693 453 10 -766 285 665 -748
4803g48R21M37j405J018K41j274R02P18j602N27Q72r12J71P19j052J30J002p73
$$ -748 173 610 -795 223 464 -810 92 810 -792 -265 607 -305 -134 585 -467 -337 665 -108
4821a08l67Q66p10J6R98q73j72Q41n48J8K52k39n5O50p65R7N86n64k23N96o03
$$ -108 -475 391 -319 -303 695 -178 -350 491 -57 -39 213 -26 -81 569 -196 -99 487 -77 -300 296 -307
4842c07j8J075p65j27R49q68l26J265r99l67J339p69n70R45l24o55P74J6r10J028
$$ -307 -325 750 -15 -142 807 -61 -387 878 -121 -488 851 82 -488 457 133 -522 252 268 -642 386
4862C86J66j298R59L67j276N54N87j331O86J074j309L68M12n87j62P32m60p0P22
$$ 386 552 -746 213 580 -696 -142 445 -886 -200 874 -435 -67 345 -242 -404 328 -132 -202 520
4881E20q81K66O44q89L33K61o16L41K79n08K06J83r9j96K17m84J31P53q68L30
$$ 520 -361 -95 549 -340 -7 254 -362 -21 258 -250 -44 139 40 -156 61 -423 -292 461 -407 -77
4901g7O56p37j27J044j057J62Q16o60k56P22q42k19J094n36n54J150p86l94J251
$$ -77 579 -158 -285 759 -298 -136 680 20 -236 486 -356 -575 519 -17 -571 579 -207 -601 650
4920F50l72r19R39n1q95Q63K78j094Q43J57r61N13M16p19L29M24q89K66K68o27
$$ 650 278 -641 298 247 -648 215 493 -601 242 399 -562 -49 367 -352 -23 401 -488 -222 46 -581
4940e81M37N39n13P9K94n76K03L25n15L42K33n95K24M54r13P17L51p78M37J41
$$ -581 -144 395 -118 -39 255 -321 -118 207 -308 34 267 -328 -104 350 -563 154 505 -273 164 305
4960C05o47K05R03j411N47Q62j090nJ011j035J55J000j092j07J256j336j01J183
$$ 305 -342 -137 766 -645 -98 764 -326 -331 680 -355 -200 800 -292 -399 857 -479 -580 603
4978F03o20n27R60m44o58J025j52o68Q86j42j015Q35K49q94N47L02q32P38k05
$$ 603 -17 -544 416 -28 -686 339 187 -481 405 263 -752 83 332 -562 -15 287 -545 193 -12
4997a2q6K82k3j80J64J13l32J84L7l04K83o8m94N04J22q18R66K9j063Q02J04q59
$$ -12 -98 184 161 -19 145 258 -74 110 147 -157 126 58 -436 68 190 -628 338 367 -696 106 210 -649
5019f49O66L87r91O88M79j155P58M24j136K05J136j060l8J006j106l56J302r15
$$ -649 17 404 -587 101 580 -575 183 607 -529 -324 812 -248 -286 720 -386 -742 560 -355
5037c55n18J418n59m88J112n98n15J150p30m19J039n65r8L97j47o47Q46r2n22
$$ -355 -873 545 -14 -502 610 12 -503 647 -83 -502 537 -28 -126 271 124 -523 323 231 -291
5056b91O51l14k17N17j19n06P49l55l37N65l57m71P64k28o48Q92j83l65P67j89
$$ -291 360 46 -171 346 227 -279 470 115 -222 343 -14 -485 279 51 -597 295 112 -253 514 325
5076C25q56J078m42q23J004K25j279Q88L95j016L79P50j216L88O91j163L66P42
$$ 325 -531 547 105 -718 286 511 -768 120 515 -501 -122 628 -588 -200 491 -672 -306 436
5094D36n16j29Q21q21J48Q86r54j50Q98p08k24O32j71l97N44n35j12P31m48j70
$$ 436 -80 -209 612 -209 -61 825 -129 -279 619 -89 -313 319 148 -249 295 -240 -352 379 -69 -239
5114b39M92j81m19N43q2l12K99K6l50O85m20m76Q26n27l33Q14k36n49Q74j29p43
$$ -239 253 72 -347 196 114 -198 101 127 -223 462 42 -434 392 -135 -468 346 110 -439 435 306 -437
5135d37J027k73r35O96K08j152J008L81j466J296K73j202P27M68j217N99O07q98
$$ -437 590 317 -618 78 286 -866 142 523 -943 353 626 -576 151 619 -598 1 608 -290
5153b90J07O13p60J3R01p38O9K49l52m2M74l52l34P75j76j99N36l16l57M38n02
$$ -290 -183 430 -330 -317 584 -154 -85 164 -188 -230 244 -108 -442 333 157 -42 494 178 -179 259 -243
5174b43Q3N87o33O1M94o13q7P07m98k31Q77o06k51P27n49j63R45p40l93Q63j96
$$ -243 -160 427 -206 -145 349 -264 -351 356 -142 -373 504 -102 -353 374 -175 -338 607 -133 -526 337 141
5195A41m04N94l01n50P81n1o84Q59j85q33O21J00p37O38N75j269Q18L67j109N56
$$ 141 -263 331 30 -520 261 210 -474 385 200 -633 -12 88 -649 -11 564 -705 113 480 -629 -73
5215g3L78n29K21K69n53R8L53k96L1L32l69j93L86l59L62R7p2k35K76k98pK47
$$ -73 305 -224 -3 266 -287 -189 164 -132 -101 231 -138 -331 55 -304 58 155 83 -152 124 -174 -181 66
5237F6k21J93L09n86M7Q71q17j2N35n34kP31q18j89R75q71j85P63l58m38J072
$$ 66 -155 38 347 -239 -192 679 -138 -150 385 -149 -151 580 -238 -427 548 -323 -508 255 -103 -541 531
5258E31n54l28Q24n79n93R37P5r25O78K47q83P59P9n63K12K79o10N24K24p43L71
$$ 531 -23 -351 473 -106 -699 238 313 -612 66 313 -570 189 268 -295 -83 196 -414 110 334 -409 -38
5279c8L41n17K46J19l35kM47o63N10J37k64J17K00m55j5N68p45K87J33p30N26
$$ -38 303 -214 32 151 -184 -186 261 -402 108 245 -19 98 298 -157 -172 396 -349 -62 71 -659 -133
5300a33O47q95J78O29m84l32R11r56K43M71l37j51P17o95j37J027o58m04Q12m51
$$ -133 514 -381 -203 426 -58 -390 521 -435 -192 279 -58 -209 508 -187 -324 703 45 -359 453 2
5320Bo10Q44j61p07J018m21l27L86L05o23L33O00r53K58K85p06M05K91k57p9P5
$$ 2 -608 236 75 -632 386 -35 -362 24 329 -294 39 639 -314 -56 229 -477 -72 219 -38 -117 -42
5341d2r2K51K13o85N54k38l06N10K04p43O30o5p38O31qm78L20O17p52J50M96o86
$$ -42 -134 117 330 -355 199 -39 -345 165 369 -374 256 191 -547 84 76 -402 -82 535 -217 -67 429 -257
5363b57J96O33j100K25P45q03L71N26o90j89R23o15k71Q56m77n00R44n07m66Q83
$$ -257 -61 572 -528 -303 442 -361 10 536 -154 -343 580 -35 -306 550 73 -427 517 10 -456 427
5383D27l23l64M54Kn39P76m27k71M38j51j85M19p1k97J43r1l36O36k73k87P12
$$ 427 104 -260 194 196 -343 433 6 -265 173 22 -163 256 185 -112 31 -60 -396 240 -33 -320 392
5404C92k96m91P95l44m08N20j61l96O47q9m53L97j55l36L92K80n65J97N59r03
$$ 392 96 -395 400 56 -352 168 7 -389 258 169 -284 113 -42 -378 14 294 -271 -74 485 -418
5424d18K73P40j017L32O34r61J66P38n63k33O95p57j20R52m65l74O30k90m53R31
$$ -418 -145 595 -422 -90 544 -417 -251 487 -76 -309 386 -371 -491 461 -4 -378 252 -38 -491 440
5444D40n26l0L91q1m00M43l22k09M92j04k13O22n02k88M97k60k53M77k78j95O67
$$ 440 -86 -116 275 194 -206 237 -85 -294 198 94 -119 503 1 -287 210 -50 -303 174 -104 -299 368
5465C68n61k66P26j68n29N02O1n77Q30m11n37O96J59n82K92K24q27O65M03p91
$$ 368 -193 -459 267 99 -430 72 133 -444 386 -25 -562 134 293 -289 3 227 -600 65 468 -323
5485c23N25J91p81L12P47q95j37O39m03mM90n69j52Q16n22l61P72k89l62M68k98
$$ -323 202 393 -388 -76 671 -224 -361 278 -125 -129 361 -208 -360 456 -66 -427 345 56 -306 162 -136
5506a36J18M92m21l05O14l26p8M17l43k25M29l21k28O39m00k10P26o66j07P12
$$ -136 -18 474 53 -252 362 36 -42 375 32 -193 236 -85 -313 326 -74 -284 442 -224 -331 381
5526C81n70r9O65k70m11M49K26q13J037n61o69P61J13p37R15l81k41N29j08m60
$$ 381 -189 -288 377 107 -304 145 371 -442 595 34 -635 126 239 -498 417 36 -205 324 216 -244
5546b44L07N79r82L62J86n47K48M5k89K21M98n52J65M22q06L54J99k95j93O17
$$ -244 63 642 -340 22 208 -339 -91 -46 -335 -114 384 -168 -3 419 -387 -33 166 -129 -322 295
5566B95n14K12o7k60K72M90o43L43N3l56P4L40k26m0K98n18J63N78r05M03M97
$$ 295 -219 -7 -74 -334 -62 428 -215 128 181 -175 -101 239 13 -27 271 -247 -84 494 -411 -8 489
5587D89m05k20L10m58m9P44m24m53P49k9p84Q12k29m01P74l6q08N80K54p53M11
$$ 489 84 -136 174 -284 -333 411 -13 -466 283 254 -530 282 53 -348 426 390 -418 162 416 -337 74
5608G4L57r32O24L23r73P32j10n96O79j49l46J57K17l90N04J41l52J74K45m45
$$ 74 431 -501 123 446 -527 205 95 -501 178 29 -317 -160 57 -333 171 312 -40 134 379 -66
5628f6N9J95k79J70L04p99L94M10o25N35p8m24K32N06p18L92L11o19j10P32n64
$$ -66 -7 188 -91 79 383 -416 -22 388 -237 298 220 -204 28 534 -184 208 519 -100 -210 522 -42
5649d2k57N23l84k06P66l48n02N52k48l32R20m61l85O40J11q13O77P2p71O31J06
$$ -42 -299 224 -160 -366 400 52 -450 102 -146 -478 442 -19 -404 236 347 -466 211 283 -488 143 249
5670B49n20K63L43n31K73K21o13L85J54m91K50k04j21N59M0n58N32K0n22N02k96
$$ 249 -271 -8 335 -196 77 298 -315 70 224 -267 -17 -221 -342 217 257 -301 231 251 -271 231 -65
5691f5k01M04K67q45N63J02n18L77N02p98O7M18o99K31N38p02L15N37p15L25k0
$$ -65 -266 138 405 -440 123 225 -293 84 586 -212 -145 273 -426 -195 343 -359 -44 493 -222 103 83
5712H3k98L0M74m60j41O43l14n10Q23l12k30M82m01n2M72j32m23L36k09j10L02
$$ 83 -215 -185 289 -171 -312 331 17 -493 330 18 -212 270 -131 -183 289 157 -266 70 -139 -249 53
5733E3Q2j62L15j32l02J87jk35N09l93l9L52l2p45P32Jo36Q23m16l75P95k71n09
$$ 53 135 -27 288 156 -146 41 40 -195 314 -79 -118 234 202 -543 189 190 -446 377 -39 -414 381 110 -399
5756c99N04P9o23M58K01m66K63M76p96M84J02m37R5M57o04KO28m65j75O87n80
$$ -399 105 184 -439 19 220 -246 17 493 -303 181 283 -154 -59 398 -206 -204 424 -41 -216 471 -109
5777a09q9M02j89p5PL5j56N66k24j97K39j9l49M69l30j94M71k37l37O00j25k17
$$ -109 -198 204 15 -60 -53 -18 -174 392 168 -29 210 191 -158 311 -19 -213 258 21 -316 284 159 -58
5799e8K15k89l04P66m05k14O04N4p38N00j59l86Q57o70j65O39P4p70P38j53n93
$$ -58 157 -132 -436 330 -75 -289 315 369 -369 131 -28 -414 443 -227 -392 247 321 -449 289 136 -457
5820d57O63J62o60L58K15n74M49J90m97J18L48l18J22J96o80K80N07l91j39M72
$$ -457 206 368 -292 66 281 -293 156 346 -151 -33 315 -3 119 315 -365 -85 422 31 -108 364
5840C64k97r5L96n25o1O31o84J06M78j68l57M10m91L48K17m88O7M55l46k97O45
$$ 364 67 -28 368 -157 -218 413 -271 -165 313 145 -212 198 -293 55 272 -216 -149 306 -40 -337 308
5861C08m75K4O09n56k62O89l49k98N28k17k32O70j37r00O40J67m54M53J56p05
$$ 308 -167 -143 466 -90 -352 337 -12 -310 218 1 -231 439 302 -598 42 209 -245 208 364 -341
5881c41N47k66k62M91R3o11K78K83n68N01K00n36J07J77k21r1L38l31K3K96k13
$$ -341 206 -60 -322 169 262 -349 -71 212 -356 145 345 -191 -84 93 -128 -219 119 -212 -189 107 -106
5902a06M4J55n61K31M65l85j68O99l73j83N11o22K98L16m63N2N28o74O6O56n06
$$ -106 -62 93 -468 -237 228 -157 -325 374 1 -182 329 -293 5 321 -142 -90 438 -236 -170 486 -20
5923b0k08R69q43j70O17n33j72O82l65k54N78j32m64P30k35l90M60p7l50M63J6
$$ -20 -228 741 -102 -272 345 -188 -360 322 -43 -297 281 149 -315 415 180 -210 250 173 -177 286 302
5944C02q63O23J29k27m0J32k30Q0J96l91M59j36r5o0M42m86K17K34o82L93K41
$$ 302 -561 62 191 -36 -76 56 -174 -94 102 -289 170 34 -61 -121 321 -165 52 286 -396 -3 238
5965B38k82j68M43n42L22L06o20M32J9n27L37K40n12M24J78n81K80L40m10j46
$$ 238 -44 -212 231 -311 11 317 -303 129 148 -379 -42 198 -314 110 288 -293 -13 327 -83 -229
5985b29Q14q97J41P30p17j20N92n09k36P74n02k80P41k48m36P02j76k36M59l64
$$ -229 585 -312 -171 559 -158 -278 314 -195 -431 343 -159 -439 302 54 -382 320 144 -92 367 3
6005Ck28M02j08k48L30J41o48M33K10n51K57j52O2L47l95j49M90j40r3J96o8k87
$$ 3 -225 177 69 -179 151 292 -356 77 287 -264 -7 -159 -97 250 -145 -294 196 56 -37 159 91 -196
6027a96M04j46l76M22k8o54N31M38p74M45O0n98M44K49m95K62M01o91K66L86m95
$$ -196 208 62 -314 108 80 -574 -43 395 -379 66 126 -472 -28 221 -274 -12 389 -302 -36 350 -145
6048a45K4J71k86J71M12m59j01M25q3l69M11j17oJ22j2j98K50m5l60M48j14k22
$$ -145 -121 50 -236 -65 347 -112 -213 212 129 -240 171 54 48 170 158 -40 210 165 -195 253 139 -83
6070h3L77k67j82M81k24k38L4J44l22M12J11q49R08k08k35N01j92k34N25l61l43
$$ -83 294 27 -155 326 102 -136 -102 42 -280 132 243 -606 302 94 -141 360 168 -66 459 98 -245
6091b45N73l69j19L01K87r17N86K23n13N04pp01M36K51l23O9L00n01JO62o25p8
$$ -245 328 -41 -160 141 428 -489 97 320 -193 311 304 -397 39 290 -33 36 336 -165 -164 498 -127 -205
6113b05O28p60J87L57k98k22N90l63l8M04l11N8K27p2n38O12l64q0M53j67o35
$$ -205 423 -337 -150 207 -91 -313 277 -86 -124 280 -31 27 254 182 -356 256 -108 -188 265 98 -537
6134e37M80P0k42L02L3n6L24l79k61N01l67R0K17O0n20N71j49o41P62k08l18L60
$$ -537 -57 13 -229 73 106 50 374 -5 -266 235 -132 -42 175 235 -285 286 137 -504 258 50 -268 92
6156I2j40n7K34K37o80M19K39p73L78N46l95j77N46p56j7N85l15J59p3k67J18
$$ 92 -48 -105 129 366 -314 105 344 -429 -51 495 100 -77 469 -287 -304 281 -34 125 52 -215 -97
6177i7K53k63N8L26j41k18Q0j25L5K95j51l63L20L3k18M26m76K31M6n8j53N37
$$ -97 156 -107 -49 277 136 -82 -2 -127 -92 203 52 -311 9 42 -176 250 -226 5 51 -7 -160 377
6199C77n13j45N95n29J93M07l41l02N74l54p4O28n63m7K90k14j53L75j25k06L17
$$ 377 -136 -281 314 -215 -22 385 44 -258 316 -38 -112 516 -47 -94 196 -18 -171 204 79 -127 190
6220A90jn90L84K61m26N17N7m50M8K06k49k07M11k14J15L11m84K6M26m93L09N3
$$ 190 189 -401 -17 244 -182 335 392 -58 -10 196 -53 -260 151 -63 52 363 -121 -95 331 -162 147 200
6242B00k91J57Qm64J93L21k75K66K31j36j03lm25M01J75m66K59L63o17K21K67
$$ 200 -91 66 74 -390 -197 124 -151 115 346 210 107 104 -321 80 255 -211 48 411 -206 15 282
6263B82n38K31L27n80K3O74l92k30M61l55k48N37jo56P12m5p28O90j56j53K87
$$ 282 -256 -25 302 -278 -255 419 27 -203 258 -97 -345 192 191 -465 247 202 -526 164 8 -145 142
6284A42j6n56M33R7n62M02J48k34J93K56o22L39J12l48K01J63l74K71K96n69K10
$$ 142 126 -430 3 100 -462 -60 88 -146 47 303 -319 20 132 -216 -15 148 -226 45 341 -228 -18
6305a8M4l87M54R5l83M02l2l05J10K34r6l07M83l67N5K78o25N82L0n96J86L78
$$ -18 26 -361 93 188 -195 207 175 -130 -20 214 118 -189 294 -73 -18 260 -365 217 247 -349 -163 215
6327B15l13j55O64m88n4O12p48J9N86j78l29L52k31l07O14k73l71P42l38k06L54
$$ 215 -98 -253 411 -77 -131 481 -267 -248 338 160 -169 183 -48 -355 259 -14 -385 357 19 -187 167
6348A67j34k72R5N1Q0P5q8k84L67j85j76M10J82o77L32O4k59M58k6j74P0oRJ26
$$ 167 33 -239 -144 -93 -13 62 -26 -310 57 -128 -304 106 288 -389 -57 7 -252 206 180 6 76 70 79 205
6372B05Oo30M76J91l10R1M61q38M04J11m74K09M27p19J34P58q46J4O47n20lN46
$$ 205 211 -419 57 248 -62 29 490 -348 56 167 -307 -98 329 -390 -256 502 -344 -330 317 -203 -206 340
6394C40k74l25L35l0m73P34k47j09L04m29J32K0l06K64L9P0l38K83K67k91L8J15
$$ 340 66 -259 76 46 -427 307 60 -49 255 -174 -42 -22 -328 -64 -25 45 -293 -10 257 -34 4 119
6416A19m72M79r3k3O4j63r3N07l21k66N11k26N1j8J04m04N04k04o72P92J87m99
$$ 119 -353 126 33 10 74 -89 -182 325 4 -262 249 23 74 56 160 -244 260 56 -616 176 363 -136
6438a36K51J8n20L50J50n96L68L32k20r9M01m51M3L60o39J40O58m48l29Q67o19
$$ -136 115 133 -387 -37 113 -483 -115 217 -3 -102 299 -152 -109 251 -388 -248 410 -38 -367 500 -119
6459a19r9M04m56l9N68l58L35n6k55k29L74j30j38N87l86j29N95l64l13K95j01
$$ -119 -218 186 -270 -309 259 -99 236 180 -75 -304 70 -60 -198 389 3 -126 469 105 -208 87 -14
6480a4k31L07Ml73N19j76k4K60l87J1M69k92n49R94l51k57K64O5n75O79j76n24
$$ -14 -245 62 66 -307 212 36 12 272 -115 -104 365 73 -476 518 167 -90 174 239 -336 343 167 -357
6502c57P09k36j39J70k3l33K29J07l42L42L06o67J63J98k94lL79l72j24O50k14
$$ -357 352 116 -23 147 124 -209 20 127 -215 127 433 -234 -71 127 -167 -170 209 -163 -287 363 149
6523A49l4K25k26k87K56m44K11L46k18n7R4j27k86M34N2o2J69m31J47M66l76j26
$$ 149 115 340 114 -173 83 -361 -150 196 -22 -79 15 -112 -398 36 88 26 195 -236 -89 377 1 -125
6545a25M09l98j18K00p9l14N14j78k74M84jn50O87r9m83M61N0p28Q44p7m50K99
$$ -125 284 -114 -232 -32 -111 -425 89 -89 -363 121 120 -430 257 158 -325 136 186 -542 302 225 -225 74
6567G4L8n99O42J41k92J10R0j89Pnm16K30K65l33L87R4l22J02K98m85N8J61j74
$$ 74 112 -487 155 296 4 114 204 15 22 17 -399 -169 96 -237 150 244 -78 24 322 -163 -105 56 -118
6590a18M9N25o27J86K70n49Q4N56o12R3M37o49M15J86m13LM32k45j1J98k67p6
$$ -118 -69 456 -171 15 285 -264 -180 376 -236 -143 294 -355 60 246 -167 -164 268 23 12 210 -57 -133
6612a33K14j79j65L93J80n30L39k01j33J83P6k99O05l12l66N43J78o59M69k28
$$ -133 81 -98 -263 130 310 -220 119 -82 -215 -32 44 -255 350 38 -328 215 393 -266 203 -25
6632b5l13M49m6R5l2J19m24J63K06k57K05L35p10K15J23k46J12L97m99J1K21o15
$$ -25 -338 111 65 160 128 247 -177 -14 192 -65 140 475 -235 -20 103 -143 -31 366 -133 -122 99 -516
6654e16M45K15r7j14K30m67M34J79m99j14O69l00k48M58l84K9L01l68l40O67j91
$$ -516 -71 144 47 -67 163 -304 130 309 -190 -304 365 65 -183 275 -109 -80 221 -147 -487 180 -11
6675a1k03M23q9k68L30j80j21L07Jm47K63o5r0K83j99k86K37K37l32K71k09J5
$$ -11 -214 209 120 -148 182 2 -119 188 189 -258 5 -60 -150 133 -66 -352 -115 122 -210 61 -148 -133
6697a33M98l65l09M81j18j37L38k44l75N20l2m99L76O1m30N92k12k46L54J81p98
$$ -133 365 0 -309 172 54 -83 255 11 -364 156 124 -375 1 62 -368 224 12 -234 120 301 -497
6718d97N15L98m53l2M64n48m3M19m76J43L97m61J25L53k88k15M21m66J57K53j12
$$ -497 18 416 -37 -69 395 -153 -196 223 -253 -110 287 -174 -49 304 16 -199 222 -244 -87 166 54
6739E4k55N04j22n64N65l55J12o0J42k21L53j06j53K78Q3n92O01n5l13J76k03
$$ 54 -201 303 181 -383 182 -173 -61 -121 21 -200 153 47 -106 172 255 -337 264 209 -104 72 -131
6760a31j29M23j99k35N45n83K74K05j09l10L25j01m70O26K02n54M73j09n73O72
$$ -131 -260 163 -36 -271 274 -309 -35 170 61 -249 76 -25 -495 131 333 -221 252 143 -430 242
6780B42k59j88J26K65l28M9K07k36J44K29n99L55K55j11j42K86m50j13J49K68
$$ 242 -17 -205 -79 186 -142 -93 114 -122 22 251 -348 7 262 151 9 295 -155 -268 -119 149
6800A49m57M50j80l53N27k95J80k42N30n77M32l14MM57l83R3k6K17m49L67l88
$$ 149 -308 142 -38 -391 136 -159 21 -221 309 -268 164 -150 -146 311 -72 21 -5 212 -237 130 -258
6821b58j01N07j94J47O7j1l02N51l04m05L48k29o4L73O0o53O33j17p7J7K52m77
$$ -258 -359 148 -46 101 168 157 -145 406 102 -303 45 -184 -248 125 185 -468 165 48 -29 -12 240 -237
6843b37N4L65m47K84J95l23J07K49m06R4P4m0K6k4l4mK79l15m9L15o1k53L24k10
$$ -237 -183 182 -265 19 214 -109 -2 247 -159 -65 9 -31 -5 -29 -63 -67 212 -103 -152 163 102 -151 173 -37
6867c7r6M32n90J73L46l80kM34n06K44K44m00j23N27o70L39K20k47m1N47l60l32
$$ -37 -133 299 -291 -118 228 -152 -154 280 -226 18 262 -138 -261 266 -404 -65 155 -92 -133 414 54 -278
6889b78K87J7m21P47l71l84J99L15m79N85k5m40L25R3m90M93O7n39L38M5l16J94
$$ -278 9 26 -395 352 -19 -403 -204 111 -368 217 192 -248 77 170 -320 173 240 -299 39 84 -232 -38
6911c8K59n29K60K66m37R8K99l66K99r9n5l14O95k36j04L03o37L43n5k88N45j10
$$ -38 221 -308 -48 218 -219 -121 178 -188 111 12 -43 -357 338 102 -2 301 -336 7 -48 -336 209 99
6933I9k67M2J53j54n6J45l02N15k92j92J70M92m63j38O38n25J3oJ28l54N91j22
$$ 99 -168 -126 27 -127 -183 -38 -340 175 -117 -309 -139 353 -110 -248 390 -135 -122 -128 0 -354 237 115
6955A15k86L36J2m95M05J2k19J50O7l41L23P8l43J67k3r6J44J07j81PK17m21J24
$$ 115 -171 165 177 -318 87 99 -120 30 97 -244 79 157 -186 -19 -42 -138 6 113 -68 -61 156 -265 -141
6978a41L68m05J00K44j84N6M67q84N29l41QL31j05k9P4J83n28k7L23k63J6L55
$$ -141 227 -178 -78 166 -18 38 505 -379 150 -191 -183 148 43 14 88 271 -257 -284 39 -224 -208 147
7000A47l16K06R4l19lL12k89J10M22n22q3O82m80j04L82k10k14M84k9l95K63Q7
$$ 147 -169 37 131 -188 -191 121 -168 -58 364 -158 -241 441 -39 -143 239 29 -185 299 270 -125 138 225
7022B25j76J53q5l44K24L0k18M77k62l12M87j85k38K13J31k25K41K32m33J09K43
$$ 225 49 202 117 -227 -3 27 -191 286 24 -288 199 14 -224 -11 120 -105 136 368 -65 44 287
7043B87l91K69J4n69L56Q9j88K08K01p69M40J21m62N91j15l46L63K42o06L44K50
$$ 287 -104 165 179 -390 -34 55 -133 75 276 -493 -53 68 -394 197 82 -264 99 341 -265 79 329
7064C29n87J63K35k33LN37o74NO67n26K4J49N9l96K99J71m26M05j89j4k4L5j91
$$ 329 -258 -95 140 -93 -90 447 -227 -222 445 -81 -57 92 151 -245 54 225 -201 204 15 1 -23 12 -179
7087a79K63j56J05Q0k71J51K81j35j81J99k20r4K91k12r7L16j39j86K10j7j65
$$ -179 84 -72 33 113 -158 -7 274 139 -42 157 -63 -157 134 -78 -175 141 2 -184 26 9 -156
7108a56M04k15j77K46k18R1R3K70m18m8M23m13M0K73l46K82Q0o01J89M21o70M47
$$ -156 248 33 -144 102 -116 -25 68 338 -80 -128 295 -118 -78 195 -151 131 211 -390 -201 220 -450 -3
7130cL89o00r2O03m62P9L01l65K8K64l4l02L66j21j37K63j60k15K77l10R6L48
$$ -3 386 -214 -306 297 -165 -86 215 -150 -122 142 108 -194 172 51 -86 177 17 -198 79 -231 -135 213
7152B13k92j95M98l05mK11Pn68O29j75k97L54j67q9J91q1j79L89j37k56L25j31
$$ 213 -79 -274 224 -81 -85 126 133 -435 194 19 -278 76 -91 -180 11 -70 -249 140 3 -253 72 -59
7174e9o7M75k48l66J90L23l25P9J84n99J85L46k31J73R3n31L19L59p40M62O4k18
$$ -59 -126 349 101 -265 -75 248 -77 2 186 -413 -228 118 -113 60 153 -378 -59 300 -440 22 86 -132
7196a32j81M26j48m9J15M6k3J62l6j87j21q5J32N33p47K29K6l22L53J52j33l76
$$ -132 -313 113 -35 -84 31 77 54 216 180 -7 -128 -213 -81 452 -295 -66 -40 -362 -9 143 10 -366
7218c66N43k36L4j17K75l02M75j97m42P00n55k98O82j74k86L86K64n38L93k72
$$ -366 177 -59 -25 -142 133 -169 306 109 -333 367 -188 -486 196 22 -264 122 386 -152 241 -31
7238c1k30K01J02j21j1J94m03L28Q7l43L10j01r8L2L87l75j6M28n40K33k0l13
$$ -31 -261 -60 42 -79 -90 104 -299 29 116 -227 83 -18 -116 -84 303 -72 -88 340 -200 33 13 -300
7260c00M2M11l16K29M4k29K37M7m28J37L99l07j36K32k96K20O1j39k65O45l15
$$ -300 -258 153 -163 66 110 -119 118 165 -263 -126 273 -34 -170 62 -234 -14 47 -92 -357 288 -27
7281b7J26J88o84L12P4p3P2L12n21kL78k62j76O19l44j43L75r8o28O67j50j88
$$ -27 99 287 -397 -85 -11 -84 -12 300 -221 -223 155 -107 -283 336 -8 -151 224 126 -502 165 15 -173
7303a73L87j97P7PK8k99O4J05k84N48j50k52M03l90J3L22p0l21J44O7k7K9l75
$$ -173 214 17 94 101 129 -170 -106 -1 -285 263 113 -139 264 -126 -113 209 139 -182 -38 29 2 31 -344
7326c44J58L50r5l01J76K10n12K92Q4l98J97K92j24q0K95l64L47J47n25L51j24
$$ -344 -186 164 69 -232 -56 154 -358 -66 18 -380 -183 109 -15 -95 200 -164 183 330 -195 156 32
7347C2j45k9K40l00k30O76l5n12N95l10k28N09k32k84M85j20k9L40l10k41J84
$$ 32 -113 -142 98 -202 -432 244 209 -303 292 -18 -246 263 31 -253 232 112 83 423 113 -128 56
7368E6k0l21M01n99K96K43l9k36K60M7j48K44p8k59j0J6q1L48j2k60m5J67o0k6
$$ 56 36 -285 116 -483 -187 56 17 -219 41 88 -60 184 106 -153 -163 -147 -228 120 108 -152 -197 -30 -90 -116
7392a16L39n40N71K7m07J85K42m89L07O7l93L13J71m45K54J30l24Q1lj91L13K53
$$ -116 223 -317 254 281 -126 59 301 -188 119 186 -207 106 277 -168 86 216 -108 -27 -30 -221 92 345
7414C45n14K60J97r4k67O4j65q3J70K18k84lJ13N0J16j58J05J89j55k16L14m47
$$ 345 -169 91 288 194 -73 -9 -174 -257 -87 131 -153 -156 -43 7 123 -35 70 259 104 -112 202 -245
7436b45K61J24j33j25L98l77j87L72K04n35L10Kk75K03j4j96L64m5k21L02k69
$$ -245 16 140 7 -118 280 -97 -284 88 292 -243 67 69 -206 -3 -17 -213 151 106 -115 187 -82
7457h2k88M51k03m68O89L41n08Q0J21j79J65J18k64j21K55k34N4L46n92L38J78
$$ -82 -370 81 -122 -590 99 440 -68 12 133 -46 119 237 -27 -148 107 -127 -73 273 -319 19 197
7478A97l03M2J91k50J04K26j10J60k31l2r7K61k62J05K21m85M06J52l31M5J85
$$ 197 -106 -64 127 -123 -19 207 97 257 26 -6 -103 158 -104 1 222 -263 143 295 -36 9 194
7499A94lj59J37k54l12N14j69k2K73q9m57P48k48l69J57J61l24N56m25n6K03m0
$$ 194 191 32 169 -85 -397 117 -52 -74 199 110 -347 401 153 -216 -59 102 -222 334 -91 -147 56 16
7521A6l28N92r0n29M87j27j85O3K56m43M73J3l74K13J29l04J50L06l68r2O0k03
$$ 16 -312 280 190 -339 148 21 -164 -101 155 -288 185 198 -176 37 166 -138 12 318 -50 -142 -82 -285
7543b85L45K53m52QK49k56r0K27l17N26j34k70J93j42N8m1N17l89l5M20o83K57
$$ -285 60 313 -139 -131 118 -138 -228 -1 -318 208 74 -196 -3 -145 -87 -128 389 0 -35 385 -298 -41
7565d1L68n90J6M25j53j92M4L13n38O98m57M3R3J13m15M02L0l54K54L22n80K54
$$ -41 327 -263 -247 178 25 -167 -123 190 -348 350 -107 -64 29 142 -273 129 159 -195 59 381 -199 55
7587E5O2m40K79K41m18R4K15l96R3K03j86K44N8j11J96kl91Q7L85k48L14j63k89
$$ 55 117 -323 -44 197 -221 -127 88 -308 -215 -12 -198 46 104 -7 189 187 -204 -117 268 20 334 171 -118
7610a18K49J57n57J97P3k02K01J9l15M19K85n66K52O3m95R2L54k10j01N34m12
$$ -118 131 288 -269 -72 1 -201 0 19 -296 123 408 -158 94 157 -338 -246 108 -102 -203 331 -81
7631h1j4O65n97k6K68j81J39l5l19J95K2k6j82M09k14m8Q0L8l64J33L02j87JK49
$$ -81 -95 570 -27 -53 215 34 173 138 -181 14 36 10 -172 237 23 -25 55 93 -271 -138 164 -23 -22 227
7655B27p12N73%k43L03l43K57j09O6n2J20J56m91M27j29k68L26K0l44L46r5j99
$$ 227 -485 88 88 -155 148 -195 62 -47 19 -33 87 243 -248 179 50 -218 108 128 -216 130 35 -164
7677a64j15N56l89K61J96n89M16J0m05L42J28j99r7K23k96J59N4l6J7L29k32m94
$$ -164 -279 277 -112 149 345 -244 172 182 -223 119 247 48 -49 174 -122 37 91 55 72 401 169 -325
7699c25O43k04l83K99j33k91O36r9j87K97l62k05M45j24j79L31k33M5O7P4k25
$$ -325 318 114 -269 30 -103 -394 242 143 -44 253 -109 -314 131 7 -172 159 -74 -29 38 112 -113
7720a13M47k18k22L51l08j24K08J83m60L55l1k35L30n1l24K80J84l62J53J17l49
$$ -113 334 116 -106 245 -63 -187 21 204 -256 99 68 -167 163 112 -212 68 252 -110 43 160 -189
7741a89J72J39k55L54N8n26J88M38n19j23L27k74K68J30P1m64N7k9K2K86l66N7
$$ -189 -17 122 -133 221 279 -247 -59 379 -140 -263 64 -210 58 188 259 -205 -148 -177 -155 131 -235 -178
7763a78K17k2M0J19k48j17L85k96o3K59n0k26L26o4M1m5p9k00M25m38K07L92m40
$$ -178 39 17 57 176 -72 -189 196 -100 -163 96 46 -180 146 82 123 78 -1 -201 224 -214 -7 385 -55
7786e5j63N00r2m78N12j53k07K67pl90K61J92l68J85l7j48K24J57m19L04j01l29
$$ -55 -218 282 190 -288 224 71 -136 131 124 -266 -5 187 -181 4 -33 -181 43 200 -219 85 -16 -345
7808c45M09J86n01J05J69R7kM7l15M4K64j38L9J60k78J50n1j6P7k18k4M1J47k42
$$ -345 64 250 -251 -146 23 120 118 165 -150 -106 158 20 59 219 -59 91 40 24 101 -117 -141 -100 47 -195
7832a95K47J40k73k1J93l23K56Q0n6j47L58l19l06O97k18l02M16j65m21P53k64
$$ -195 52 192 -81 -102 91 -232 24 104 48 -99 259 -60 -366 331 113 -189 227 62 -359 394 130
7853A30n19O36l11k02P85n68Q9K36l36j21M07j61k85J77J99k42L22k04l35K85
$$ 130 -389 247 -64 -266 519 -49 40 276 -60 -181 226 65 -220 -43 156 -86 236 32 -303 -18
7873a8q9P0J29J66l15J28J30k6j64J18l0j11j3l08L75J08M9j86K59k31NK05k44
$$ -18 -107 -37 92 258 -57 71 201 175 11 129 99 -12 -25 -333 42 150 199 13 272 41 46 251 7
7896GP0k9k37Q2J07j85K4M02l92q3L14k74Q0K54k31o1J40q0j90K78K12l46K58
$$ 7 77 48 -189 -107 0 -185 -161 241 -151 -234 80 -194 -114 140 -91 -152 -12 -92 -282 -4 208 -138 120
7919A20J83m88J47L1j46N9J32j77M89k74l08K42l1j40K87l3k79L18J75n87J95
$$ 120 303 -185 -38 -7 -153 -94 38 -139 350 76 -232 10 -21 -161 126 93 -186 132 307 -280 -85
7940h5J91k85K01J14l89J62L15l71M40q4m16J74N6p3J07j43qK16k6k17l2L57j89
$$ -85 106 -179 22 136 -253 -91 224 -147 293 209 -207 -33 23 -50 57 -86 -94 122 96 -121 -153 204 15
7963A5j43P1l06K96J51l75J82L01j8n14O14k76j83M00l4l32L16q5q5j7J81n39
$$ 15 -128 -57 -363 -67 84 -291 -109 192 174 -340 274 -2 -185 215 181 -151 165 80 -5 -22 159 -380
7985c80M53j86j83M58O8k02j28J22j92L46k01M8j55J49j35L36m37J79K2L5j9L35
$$ -380 73 -113 -296 162 230 28 -100 22 -170 176 -25 23 -132 17 -118 218 -219 -40 -18 17 -2 333
8007C33l65k23P02k90n71N18l71K67K05j06j84J08K06k81L0J35k61J65J58k49
$$ 333 -32 -255 447 157 -414 104 -267 0 205 99 -85 23 229 -52 -22 113 -148 17 175 -74
8027g4J34j4l00K80L5k96J77L73o64N27J83l43m4J48J3l75K93j08J56J27j46j24
$$ -74 60 46 -254 26 61 -235 -58 315 -349 178 361 18 -26 122 135 -240 53 -55 101 228 82 -42
8049d2J27l55L62P7N9k57K73l18j56jJ44J8J68k84J7O4N2J70N1j07n6O6k17oK63
$$ -42 85 -270 92 169 228 -29 244 -74 -230 -231 -87 -69 99 -185 -168 -104 -52 118 169 62 6 72 -145 -151 112
8074A12k88J14M06k50k98K62p2j94N39j78l59O8J12J0k25M97l66K05J0l38j93
$$ 112 -176 -62 344 94 -204 58 -14 -208 331 153 -206 -138 -26 -16 -241 256 -110 95 105 -233 -426
8095d26N71l36o2O85o69L89q0l10J2M22k71q3K15j22QK55j16k28J77N4m4m6nK11
$$ -426 145 -191 -253 432 -237 152 72 -238 -226 196 -75 -158 57 -65 -57 198 82 -146 31 85 41 -5 -10 201
8119B01J18m80R8J99l42K04J31p7j13M11l47j21J44Q3j60M9L77o11L35k07j17
$$ 201 319 -161 -63 136 -206 -2 129 52 -61 350 3 -118 26 109 -51 -2 375 -236 99 -108 -225
8140b25L91o4j38J34M8l40L35o5j54J80P5l86L90q6l52J98K29l82M08o1k50P4
$$ -225 166 102 -36 98 146 -194 141 76 -78 102 177 -209 181 95 -257 -59 170 -212 196 135 -115 -41
8162d1J32k88K75P5k06j37M80k71M9J10l34m8K74k12R3P8m4L1K45l45J61K89m56
$$ -41 91 -197 78 153 -53 -190 290 19 68 178 -156 -204 70 -142 -49 29 -15 16 261 -84 77 366 -90
8185i0m2M00l21j70M09j33
$$ -90 -132 268 -53 -223 186 53
8191E3
$$ Imaginary data points
##PAGE= N=2
##DATA TABLE= (X++(I..I)), XYDATA
0@%%%%Qj6J6j6J6k4M0m8N6o7Q3j04J20j39J64j94K31k71L14l62M13m72N42o19
$$ 0 0 0 0 0 8 -8 8 -8 8 -16 24 -24 32 -35 48 -56 64 -75 89 -105 126 -145 169 -193 220 -252 290 -329
28c29P01p91Q89r99J120j252J399j560J735j926K137k370K625k905L214l557L941
$$ -329 372 -419 470 -529 591 -661 738 -822 913 -1013 1124 -1246 1379 -1526 1688 -1869 2072
45B072m371M855n405O034o765P628q661R923j1500J3540j6301K0251k6383L7201
$$ 2072 -2299 2556 -2849 3185 -3580 4048 -4613 5310 -6190 7350 -8951 11300 -15083 22118
59B2118o1510J98273m7706m32510N12017m8029m30934L83631J02936m64877K96193
$$ 22118 -39392 158881 111175 -321335 190682 142653 -288281 95350 198286 -266591 29602
70B9602J80181m09273J63260K45800l44165P0032K37625k47231o426K08093j64780
$$ 29602 209783 -199490 -36230 209570 -134595 -64563 173062 -74169 -80595 127498 -37282
81c7282l1008J39525q8498j9030P0560n3930K8406M441n1366Q6380l6695q8748
$$ -37282 -68290 71235 -17263 -36293 34267 -19663 8743 13184 -38182 48198 11503 -77245
93g7245J50394m5486j48361J97228j4410k17969K22104M3706k84909K12407J22755
$$ -77245 73149 27663 -120698 76530 62120 -155849 66255 109961 -174948 37459 160214
104A60214l34473J67009K02141l53948J00003K72283l43407K0230L27148l01002
$$ 160214 -174259 -7250 194891 -159057 -59054 213229 -130178 -109948 217200 -83802
114h3802o3860L52946k36122j38079L48845j63772j94898L19690q9800k25935
$$ -83802 -147662 205284 -30838 -168917 179928 16156 -178742 140948 51148 -174787
124a74787K72671k6471k28909K20165J9654k12508J68476M4789j82282J22082
$$ -174787 97884 71413 -157496 62669 82323 -130185 38291 83080 -99202 22880
134B2880M7634j47670R2542L5699j16270Q1104J7468r1233Q5422m069q1972J02892
$$ 22880 70514 -77156 15386 51085 -65185 15919 33387 -57846 27576 23507 -58465 44427
146D4427k2803q9115J23731l2653j07935J46707l1708j35461J66266j2710j67477
$$ 44427 21624 -67491 56240 23587 -84348 62359 30651 -104810 61456 48746 -118731
157a18731J74278J7170j97058J68089N2463k23162J48120R4193k39485J17104
$$ -118731 55547 72717 -124341 43748 96211 -126951 21169 115362 -124123 -7019
167g019J34958k42057Q0776J72782k33948L7588K02007k14172p407K17216j85391
$$ -7019 127939 -114118 -33342 139440 -94508 -56920 145087 -69085 -76492 140724 -44667
178d4667m8654K20597j49432q3817K14211j08077j07440J96465o9338j20193J72164
$$ -44667 -93321 127276 -22156 -105973 108238 161 -107279 89186 19848 -100345 71819
189G1819l7411j24680J43279j4247j17684J15258k031j01834R4349J208q1991
$$ 71819 34408 -90272 53007 38760 -78924 36334 34303 -67531 26818 28026 -53965
200e3965P9304n013o2047P3275k1445m9064P8684l9463m5469R4360n5293n1131
$$ -53965 25339 20326 -41721 31554 10109 -38955 39729 266 -45203 49157 -6136 -57267
212e7267J18992o3712p0896J45663o0251j02154J66695m5536j39847J78600j6424
$$ -57267 61725 -1987 -72883 72780 12529 -89625 77070 31534 -108313 70287 53863
223E3863j78431J76806K6400k08301J58516P5313k26744J24198J24152k31361
$$ 53863 -124568 52238 78638 -129663 28853 104166 -122578 1620 125772 -105589
233a05589P5873J64569k17066K1559J91580j85865k9360K02380j41308p1743J93249
$$ -105589 -29716 134853 -82213 -60654 130926 -54939 -84299 118081 -23227 -94970 98279
244I8279r1333r9243J65314m5522j09293J26605r463j00828Q5644J1975p5758
$$ 98279 6946 -92297 73017 27495 -81798 44807 35344 -65484 20160 32135 -43623
255d3623N0364J4384m2426K7370j323r512J9850l0775J5463L1929o7359K7028
$$ -43623 6741 21125 -21301 6069 4746 -4766 15084 -15691 -228 31701 -35658 -8630
267h630O1042r8698K1067J00850j19184m764J43078j22868m7126J77203j06453
$$ -8630 52412 -46286 -25219 75631 -43553 -48317 94761 -28107 -75233 101970 -4483
278d483r7953J97431p0752j47591K00712k0806j88015J82944L5936k11928J45812
$$ -4483 -102436 94995 24243 -123348 77364 56558 -131457 51487 87423 -124505 21307
289B1307Q7199k16158R5883J28135j99891M1412J52516j65263o960J57892j20879
$$ 21307 108506 -107652 -11769 116366 -83525 -42113 110403 -54860 -61820 96072 -24807
300b4807m2737J44081p6241o2902J15331l9161o3449P9443j6093m6889M7115q091
$$ -24807 -67544 76537 296 -62606 52725 13564 -49885 29558 13465 -33424 13691 5600
312E600j9581K2519j6612J0996J2321l9217L4817J7565o9133M7768L7211r7831
$$ 5600 -13981 8538 -8074 2922 15243 -23974 10843 28408 -40725 7043 44254 -53577
324e3577M7759O9432j19606L1614J06896j30013J889J40448j26139l7868J65696
$$ -53577 -5818 63614 -55992 -24378 82518 -47495 -45606 94842 -31297 -69165 96531
335I6531j06452q0633J77487p2912j17495J73992l1167j44478J54948J2042j59658
$$ 96531 -9921 -90554 86933 14021 -103474 70518 39351 -105127 49821 61863 -97795
346i7795J23707M9001j59015Q6292P5793j46348N1176R0561j22049K1171R1006
$$ -97795 25912 74913 -84102 2190 77983 -68365 -17189 73372 -48677 -27506 63500
357F3500r3522J510P9623o7377p525O0428m7964m869L9737l7174P224K3178l7347
$$ 63500 -30022 -28512 51111 -16266 -23791 36637 -11327 -16196 23541 -13633 -6409 16769 -20578
370b0578K4763J4280m7341M1137J3893o5501N2588K3401q6549N6979M0928j04643
$$ -20578 4185 18465 -28876 12261 26154 -39347 13241 36642 -49907 7072 48000 -56643
382e6643N3130O4334j16740M0174Q8857j21244J8093J10535j17998q694J27385
$$ -56643 -3513 60821 -55919 -15745 73112 -48132 -30039 80496 -37502 -46196 81189
393H1189j06110l6692J38234q5960o2383J41182o1830q3254J35537l6818r8635
$$ 81189 -24921 -61613 76621 -9339 -71722 69460 7630 -75624 59913 23095 -75540
404g5540J22959j3236j07444J05263Q086j08094Q6646K5421j02913O7421L7559
$$ -75540 47419 34183 -73261 32002 40088 -68006 18640 44061 -58852 8569 46128
415D6128r3935N0245M2074q3244L6202M1792p1738K7368L6847o0331K4949K9613
$$ 46128 -47807 2438 44512 -38732 -2530 39262 -32476 -5108 31739 -28592 -3643 25970
427B5970n1446K7079K1805m8543L2610J3904n0243M0157R763n7601M9479J1803
$$ 25970 -25476 1603 23408 -25135 7475 21379 -28864 11293 21056 -36545 12934 24737
439B4737o8985N7716K0014q3287O1144L4069r9591N9095N2569j13736M8349P5090
$$ 24737 -44248 13468 33482 -49805 11339 45408 -54183 4912 57481 -56255 -7906 67184
451F7184j21836L1253R8492j21308P488J18976j11453k1064J31920r3739m9709
$$ 67184 -54652 -23399 75093 -46215 -38727 80249 -31204 -52268 79652 -14087 -63796
462f3796J35983o9623p4929J30657m0308r2377J17148j1831r8997R5990J1774
$$ -63796 72187 2564 -72365 58292 17984 -74393 42755 30924 -68073 27917 39691
473C9691r6595P0944K7274q4841M5867L2957o7124K7734K9404m6467J8461J8072
$$ 39691 -56904 14040 41314 -43527 2340 35297 -31827 -4093 25311 -21156 -2695 15377
485A5377k9171J9060Q52j9171K9464j7042j9511M6719k9914k9501O8204l3814
$$ 15377 -13794 5266 6118 -13053 16411 -631 -20142 26577 -3337 -32838 35366 1552
497A552m8276Q7277k6223p3126R8764q888r9566R9214J7411j22279Q8317M9348
$$ 1552 -46724 40553 14330 -58796 39968 31080 -68486 30728 48139 -74140 14177 63525
509F3525j35937O6741Q1457j37525L7279J07083j27646L420J22938j06835k8985
$$ 63525 -72412 -5671 75786 -61739 -24460 82623 -45023 -41603 81335 -25500 -54485
520e4485J25555p8758n3688J16975m7568o7659R8811j9055p0658P4758P29o2491
$$ -54485 71070 -7688 -61376 55599 8031 -59628 39183 20128 -50530 24228 24957 -37534
532c7534M9918R382m6936K9948P410k6937J9365m285p753J9322k1875N141K8429
$$ -37534 12384 21766 -25170 4778 12188 -14749 4616 331 -7422 11900 -9975 -4834 23595
545B3595m1147P482M5934n6936r88O7710o4349j8591Q9236o0734m2406J05727
$$ 23595 -17552 -10070 35864 -21072 -22060 45650 -18699 -37290 51946 -8788 -51194 54533
557E4533m7598o9850J13133k5723r5494J09246K149j14719R5963L1740j23391
$$ 54533 6935 -62915 50218 24495 -70999 38247 40396 -74323 21640 53380 -70011
568g0011P4019N9257j21698M6453P9311j10518J7802Q9776r2047p737Q9943o8579
$$ -70011 4008 63265 -58433 -11980 67331 -43187 -25385 64391 -27656 -35393 54550 -14029
580a4029k5172Q1789m5914l2647O7186k7419l1690M9929j7134k3207L3095j4233
$$ -14029 -39201 42588 -3326 -35973 31213 3794 -27896 22033 4899 -18308 14787 554
592E54j1368K2528j9196K231J9165k8960J2995K3219m1848J8014L3384n5794J5924
$$ 554 -10814 11714 -7482 -5251 13914 -15046 -2051 21168 -20680 -2666 30718 -25076 -9152
605i152M8024o4899O534O4736o8541p074Q0091o4740k4365R0551n4855m3383R4980
$$ -9152 38872 -26027 -19493 45243 -23298 -30372 49719 -15021 -39386 51165 -3690 -47073 47907
618D7907m0121o1145R3380k2193p4587Q6997l306q2885P6585J4730q6400O2456
$$ 47907 7786 -53359 40021 17828 -56759 30238 26932 -55953 20632 35362 -51038 11418
630A1418K9291q4905M6598L9229p9167L1232M5785p0290J9390M7635n9198R500
$$ 11418 40709 -44196 2402 41631 -37536 -6304 39481 -30809 -11419 36216 -22982 -13482
642a3482M6402m9395L097M2459m1325l42L6601l5578M66L0704l1961M524K6202
$$ -13482 32920 -16475 -13378 29081 -12244 -12586 24015 -11563 -11097 19607 -12354 -7830 18372
655A8372l1752R131K3635l4716J3375K3878m0960J6155K7760m8087J7118L5525
$$ 18372 -13380 -4249 19386 -15330 -1955 21923 -19037 -2882 24878 -23209 -6091 29434
667B9434n4443J4518M6641n9636P265N8209o1825m458O9904o0302j8853P9004
$$ 29434 -25009 -10491 36150 -23486 -16221 41988 -19837 -24295 45609 -14693 -33546 45458
679D5458n2707l4594Q4443l9944m9750Q4976k3479o3375P9286n625p3063O7874
$$ 45458 -7249 -41843 42600 2656 -47094 37882 14403 -48972 30314 24689 -48374 19500
691A9500J1559p6243N2892K6676p2855L6851L6678o3809K1023M0391n1910Q688
$$ 19500 31059 -45184 7708 34384 -38471 -1620 35058 -28751 -7728 32663 -19247 -10559
703a0559L7420l8579Q01K9725k7017k62J9932j8411M514J0085j6538J3708K384
$$ -10559 26861 -11718 -10917 18808 -8209 -8471 11461 -6950 -2436 7649 -8889 4819 7203
716G203k0942K3953j084l1024L3889K083m4407M0788J2198n8125M1450K7582p0534
$$ 7203 -13739 10214 9130 -21894 11995 14078 -30329 10459 22657 -35468 5982 33564 -36970
729c6970L4838M5625p7297J9873O3432p7667Q38P8866o9932k0253Q8196n4346
$$ -36970 -2132 43493 -33804 -13931 49501 -28166 -27328 51538 -18394 -38647 49549 -4797
741d797m1325R0248l4759n8081Q2905j3889o8819O9528O549p0894N1650K2054
$$ -4797 -46122 44126 9367 -48714 34191 20302 -48517 21011 27560 -43334 8316 30370
753C0370o4547L2876L0962n2150J5831L1687l7385M226K4792k2955L79J3047j1516
$$ 30370 -34177 -1301 29661 -22489 -6658 25029 -12356 -8130 16662 -6293 -5914 7133 -4383
766d383M545j6n881J4647j1621p537K7522j9319j6453M1390k0713l0814N2333
$$ -4383 162 146 -5735 8912 -2709 -10246 17276 -2043 -18496 22894 2181 -28633 23700
779B3700j3555m7532N8147O47o3835N6505J9351p6513M7022L9278q2928L0629
$$ 23700 10145 -37387 20760 21407 -42428 14077 33428 -43085 3937 43215 -39713 -9084
791i084N7505q1157J0754P1503p1741r530P8545n6181k7735P8031l8044m1938
$$ -9084 48421 -32736 -21982 49521 -22220 -31750 46795 -9386 -37121 40910 2866 -39072
803c9072P0236j9666m9054N7918m213m9017M3909O650m2663L0067J1100l2887
$$ -39072 31164 11498 -37556 20362 16149 -32868 11041 17691 -24972 5095 16195 -16692
815a6692J9577Q440k1999J3925J412j2732J4074p312p288J9639j5292o836K8413
$$ -16692 2885 11325 -10674 3251 4663 -8069 6005 -1307 -8595 11044 -4248 -11084 17329
828A7329k1233j2147L8518k3528k1830M7085k1137l3327N3254j3352m4742N4954
$$ 17329 -3904 -16051 22467 -1061 -22891 24194 3057 -30270 22984 9632 -35110 19844
840A9844j888n5144N2277J0907o2881M4547K3950o6195L3575L6003o5475K1440
$$ 19844 17956 -37188 15089 25996 -36885 7662 31612 -34583 -1008 34995 -30480 -9040
852i040M5064o0222R034N1112n2524k485N2594m3181j1722N0451l4109j7499M6390
$$ -9040 36024 -24198 -15164 35948 -16576 -19061 33533 -9648 -21370 29081 -5028 -22527 23863
865B3863k5278k0321M1325j8052k0676L5342j3122j8894K9893j1577j6196K5946
$$ 23863 -1415 -21736 19589 1537 -19139 16203 3081 -15813 14080 2503 -13693 12253
877A2253j2325j2458K4742j4670r327K6124j7990p948K9145k1681r052L3236k4027
$$ 12253 -72 -12530 12212 -2458 -11785 14339 -3651 -11599 17546 -4135 -13187 20049 -3978
890c978j3140L8704k4687j8710M4794k2937k6073M9628j8071l4820N1944j1079
$$ -3978 -17118 21586 -3101 -21811 22983 46 -26027 23601 5530 -29290 22654 11575
902A1575m4325N1944j887n2721M9052Q617n7801M2762K0158o0098L3943L0635
$$ 11575 -32750 19194 17307 -35414 13638 22255 -35546 7216 27374 -32724 1219 31854
914C1854n9734K2794L8281n5337J0530M3377m8489J87M5000l9033p990M2888k9209
$$ 31854 -27880 -5086 33195 -22142 -11612 31765 -16724 -16537 28463 -10570 -18560 24328 -4881
927d881j2672L8067k1350j4442L0407j5021j2274K2673j1753p253J6876j2096
$$ -4881 -17553 20514 -836 -15278 15129 108 -12166 10507 -1246 -8499 8377 -3719
939c719j036J4184j6593N043J5279k3703Q066J9819l2044Q945K8086l8887N215
$$ -3719 -4755 9429 -7164 -2121 13158 -10545 -2479 17340 -14704 -5759 22327 -16560 -11345
952a1345L9215m2326l211M9920m1635j5278N8437l6464k9377O3879k6495m3189
$$ -11345 27870 -14456 -17667 32253 -9382 -24660 33777 -2687 -32064 31815 5320 -37869
964c7869O4326j2123n4619N9420L724o1682M9521J8869o3792L5982L0451n9529
$$ -37869 26457 14334 -40285 19135 22859 -38823 10698 29567 -34225 1757 32208 -27321
976b7321K0454L7596n0758P379L9357l8970k162L6342k6794p947K8431j6882p789
$$ -27321 -6867 30729 -20029 -12650 26707 -12263 -14425 21917 -4877 -12824 15607 -1275 -9064
989i064J8649j1437k629R128r496N887K811j3399J5382R66k1554K3082L706l2489
$$ -9064 9585 -1852 -4481 4647 -4849 1038 3849 -9550 5832 6798 -14756 8326 12032 -20457
1003b0457K7257J1284m2688K6357K2779n0147K0007L6976n3956R165M9290n2388
$$ -20457 6800 18084 -24604 1753 24532 -25615 -5608 31368 -22588 -13423 35867 -16521
1015a6521m885N8226m5714k0054O2836l4368l3886O2607k0195m3111N6563n864
$$ -16521 -21406 36820 -8894 -28948 33888 -480 -34366 28241 8046 -35065 21498 15634
1027A5634m8508M6441P142m9168L4237J5783m4209K1955K0154l6243J2968J9647
$$ 15634 -32874 13567 20709 -28459 5778 21561 -22648 -693 19461 -16782 -3814 15833
1039A5833k6849P682J4894j8569O010Q096j3055Q421P11j1325J4070m293j3567
$$ 15833 -11016 -3334 11560 -7009 -999 7097 -5958 2463 3174 -8151 5919 1626 -11941
1052a1941K1729o549j9095K8133m777k7858L2637M14l7074L3577Q750m4811L0831
$$ -11941 9788 3239 -15856 12277 7500 -20358 12279 12693 -24381 9196 17946 -26865 3966
1065C966J9530m9631K4386L0002n1375J5522L8635m9401M488M5211m3999p205
$$ 3966 23496 -26135 -1749 28253 -23122 -7600 31035 -18366 -13878 31333 -12666 -19871
1077a9871M8748l5665j6484M8412k5758k3354M5316j6596k7650L9616q671k9306
$$ -19871 28877 -6788 -23272 25140 -618 -23972 21344 4748 -22902 16714 8043 -21263
1089b1263L2932k451k7935K6186J143k3806K0842K283j9481J6152J347j5125J4774
$$ -21263 11669 9218 -18717 7469 8612 -15194 5648 7931 -11550 4602 5949 -9176 5598
1102E598j520j3074J5502m659j2107J8290o973j2611K1938q770j5382K6555q916
$$ 5598 4078 -8996 6506 1847 -10260 8030 1057 -11554 10384 1614 -13768 12787 3871
1115C871k0233K9888p494k5891L2141l102l1993L2683L767l7396L0905J1386m1940
$$ 3871 -16362 13526 6032 -19859 12282 9180 -22813 9870 13637 -23759 7146 18532 -23408
1128b3408K6370J9644m4863K0343K6836m5257J2615L3448m2329M747L7882l7734
$$ -23408 2962 22606 -22257 -1914 24922 -20335 -7720 25728 -16601 -11854 26028 -11706
1140a1706l841M0640l1315j1262L9789k3953j7351L7139j6542k0795L2935r232
$$ -11706 -15547 25093 -6222 -17484 22305 -1648 -18999 18140 1598 -19197 13738 4506
1152D506k1695K7444m036k0011K1418j228j6969J6273j390j2570J2608k976p845
$$ 4506 -17189 10255 6219 -13792 7626 6398 -10571 5702 4312 -8258 4350 1374 -6471
1165f471J1921o623m223J3765j1026l601J8002j5313n806K4003j7812j0703L0491
$$ -6471 5450 -1173 -5396 8369 -2657 -6258 11744 -3569 -9375 14628 -3184 -13887 16604
1178A6604j8008j7036L6189j4436k5787L9354p420l4619L9233J432m2687L5748
$$ 16604 -1404 -18440 17749 3313 -22474 16880 9460 -25159 14074 15506 -27181 8567
1190H567J1349m6435K7964K2504m7314J8610L1562m4776P616L7174l8464l025
$$ 8567 19916 -26519 1445 23949 -23365 -4755 26807 -17969 -10353 26821 -11643 -14668
1202a4668L8841l0153j1437L6240j9780j6455L1328j1064j7416K3886m570j4858
$$ -14668 24173 -5980 -17417 18823 -957 -17412 13916 2852 -14564 9322 4752 -10106
1214a0106J5743j875j0039R758k864l676O806p640K726P338j3468O454J1713k0646
$$ -10106 5637 3762 -6277 3481 617 -3059 3747 -3893 -1167 6171 -7297 -843 10870 -9776
1228i776P297J8311k6531L636K6233k9174l425L5051k7750j2588M1302k2799k3087
$$ -9776 -2479 15832 -10699 -7063 19170 -10004 -13429 21622 -6128 -18716 22586 -213 -23300
1241b3300M4442j4222l3341M3384l937m0920L8358P383m4284L0453J7532m4106
$$ -23300 21142 6920 -26421 16963 13026 -27894 10464 17847 -26437 4016 21548 -22558
1253b2558K0375K5445l9869R944K8546l2935O84K9086k4990n444K5693j6547p578
$$ -22558 -2183 23262 -16607 -6663 21883 -11052 -10368 18718 -6272 -11716 13977 -2570 -10148
1266a0148J9764j0128o556J3849p200k580P731p541K831M166j0850Q542L772j5678
$$ -10148 9616 -512 -7068 6781 -419 -2999 4732 -2809 22 4188 -6662 1880 5652 -10026
1280a0026J2454O681k1643J3914J2593k7965J2276J9901l2414P528K7879l3689
$$ -10026 2428 9109 -12534 1380 13973 -13992 -1716 18185 -14229 -6701 21178 -12511
1292a2511M48L5060l1712p847L9862k6690j7064M2309j9521k5190M1051j1066
$$ -12511 -12063 22997 -8715 -16562 23300 -3390 -20454 21855 2334 -22856 18195 7129
1304G129l1181L7368k363l4189L1495N912l4547K4718J1702l2723J7381J4902
$$ 7129 -24052 13316 10953 -23236 8259 14171 -20376 4342 16044 -16679 702 15604
1316A5604k8865J1457J5310k3837P192J4202j9112N044J2305j5460M710Q874j2978
$$ 15604 -13261 -1804 13506 -10331 -3139 11063 -8049 -3005 9300 -6160 -1450 7424 -5554
1329e554N797O116j3381Q611M063j5082J2056M139j7848J4606N927k2155J5583
$$ -5554 243 6359 -7022 1589 5652 -9430 2626 6765 -11083 3523 9450 -12705 2878
1342B878R027k5710J4614J3740k9327J2851J8539l0965R050K4316l1516M243K9005
$$ 2878 11905 -13805 809 14549 -14778 -1927 16612 -14353 -5303 19013 -12503 -8260 20745
1355B0745l0423j857L2851k7842q376L5109k3742j3824L5530j8138j9104L5078
$$ 20745 -9678 -11535 21316 -6526 -14902 20207 -3535 -17359 18171 33 -19071 16007
1367A6007j2068k2650L2254o504k5109K7879j092k5757K3302L191k4647J8996
$$ 16007 3939 -18711 13543 7039 -18070 9809 8717 -17040 6262 9453 -15194 3802
1379C802N728k2258J5223O854j9469J2072N926j6513J0749L784j3969J0575J793
$$ 3802 9530 -12728 2495 9349 -10120 1952 7878 -8635 2114 5898 -8071 2504 4297
1392D297j2489J2244k87j2708J4940j787j5348J8384j279j9285K0749O04k4332
$$ 4297 -8192 4052 3765 -8943 5997 4210 -11138 7246 5967 -13318 7431 8035 -16297
1405a6297K2363N377k9734K2127J1420l3790J9289J8664l6524J3737K4966l6469
$$ -16297 6066 11443 -18291 3836 15256 -18534 755 19419 -17105 -3368 21598 -14871
1417a4871O077L1137l3974j908L5312k8468r688L6642k1747j6084L4868j4284
$$ -14871 -8794 22343 -11631 -13539 21773 -6695 -16383 20259 -1488 -17572 17296 3012
1429C012k0539L0412p232k2203K4744j264k0380J7966K289j6661J2973K220j1871
$$ 3012 -17527 12885 5653 -16550 8194 6930 -13450 4516 6805 -9856 3117 5337 -6534
1442f534R264K75p854Q698m153m361J0467q522l212J5366j3059m106K0355j5170
$$ -6534 2730 3005 -4849 3849 -304 -4665 5802 -2720 -5932 9434 -3625 -7731 12624 -2546
1456b546q724K5930j4943j5628L0705j1645k2920L3009m956l0543L2692L419l6217
$$ -2546 -11270 14660 -283 -15911 14794 3149 -19771 13238 8282 -22261 10431 13850 -22367
1469b2367K8479J2351l9876K1938K0705l9769J3348K7375l6768M648L1442l0520
$$ -22367 6112 18463 -21413 525 21230 -18539 -5191 22184 -14584 -9936 21506 -9014
1481i014l632L1734k2847r819K9330j5620j3749K4653q763j4091J8678m071j1409
$$ -9014 -12646 19088 -3759 -13578 15752 132 -13617 11036 2273 -11818 6860 2789 -8620
1494h620J3420k627p201Q907l516k668O603p171J789P005j2089M407J0421j6492
$$ -8620 4800 2173 -5028 3879 363 -2305 4298 -2873 -1084 5921 -6168 -1761 8660 -7832
1508g832M442J5559k0172J913K1926k2742l257K7672k1985j0155L1764j7703j7803
$$ -7832 -3390 12169 -8003 -6090 15836 -6906 -10163 17509 -4476 -14631 17133 -570 -18373
1521a8373L4631j2193k4426L4050m897k9583L0636K824l2538K5107R546l2957
$$ -18373 16258 4065 -20361 13689 8792 -20791 9845 12669 -19869 5238 14784 -18173
1533a8173J8764J5313l0840J2200J8694k6815N925J9947k2724J655J8762j7718
$$ -18173 591 15904 -14936 -2736 15958 -10857 -4932 15015 -7709 -6054 12708 -5010
1545e010j339J5962j3526j445J2806j0733m92J0190r476J397P646j0264L559P219
$$ -5010 -6349 9613 -3913 -5358 7448 -3285 -3777 6413 -3063 -1666 5980 -4284 -725 6494
1559F494j2890N552Q268j5235O454J0507j7721O329J4244k0155M120J7771k1551
$$ 6494 -6396 -844 7424 -7811 -1357 9150 -8571 -2242 12002 -8153 -4033 13738 -7813
1572g813J222K1165k0987l456K4861j9355q031K7264j5868j3133K8305j2078j7604
$$ -7813 -6591 14574 -6413 -9869 14992 -4363 -12394 14870 -998 -14131 14174 2096 -15508
1585a5508K7871p419k0749K5335k723k2913K3105J539k3416J9373N908k3474J5228
$$ -15508 12363 4944 -15805 9530 6807 -16106 6999 8538 -14878 4495 10403 -13071 2157
1598B157Q711k1765J1121R828j9386P836J0703j6810N311J0646j4563M661Q740
$$ 2157 10868 -10897 224 10052 -9334 -1498 9205 -7605 -2294 8352 -6211 -1550 7190
1611G190j2084M166O788j0922M867N407j1756P270L874j2082Q701M805j4752J0455
$$ 7190 -4894 -728 6060 -4862 5 5412 -6344 926 4800 -7282 1419 6224 -8528 1927
1625A927O222j7516J0601R110k0747R494J3047k2839O895J8301k4533L523K2808
$$ 1927 8149 -9367 1234 10344 -10403 -909 12138 -10701 -3806 14495 -10038 -6515 16293
1638A6293k4035j777K6528k1769p833K8891j7456j3896K9167j1784j8757K7689
$$ 16293 -7742 -9519 17009 -4760 -12593 16298 -1158 -15054 14113 2329 -16428 11261
1650A1261n497k1926K4361P40k3359J9182N513k2555J3792Q354j9612Q999R526
$$ 11261 5764 -16162 8199 8939 -14420 4762 10275 -12280 1512 9866 -9746 -747 8779
1663H779j5828N330Q651j1442L347N917p632L088K267n782N488j114n870Q808
$$ 8779 -7049 -1719 6932 -4510 -1163 4754 -2878 210 2477 -3305 2183 1069 -4801 4007
1677D007l142q036J3090l662j1464J6460k226j6981J8867N64k1582J8305O792
$$ 4007 865 -7171 5919 2257 -9207 7253 5027 -11954 6913 7477 -14105 4200 10992
1690A0992k6173J6133J3584k9083J1322K0507k9030M791K5368k6758k634K8765
$$ 10992 -15181 952 14536 -14547 -3225 17282 -11748 -6957 18411 -8347 -10981 17784
1702A7784k2081j0162L0063j5969j5092K8156q881j8522K3950k677j9693J8373
$$ 17784 -4297 -14459 15604 -365 -15457 12699 3818 -14704 9246 6569 -13124 5249
1714E249K337j8387J3026M508j4624Q167N171j0755N553L533p039M714K77m303
$$ 5249 7586 -10801 2225 6733 -7891 276 5447 -5308 245 3778 -3261 1453 1730 -2573
1728b573N739l998l036R087o926m084J3482q709p351J7646q282j1789K0301n573
$$ -2573 3166 -832 -3868 5219 -1707 -5791 7691 -1018 -8369 9277 995 -10794 9507 3934
1742C934j7272K1681j245k2351K1151M558k6154J7989J1135k7850J3589J6187
$$ 3934 -13338 8343 7098 -15253 5898 10456 -15698 2291 13426 -14424 -835 15352
1754A5352k7430P962K0094k5339J902K2573k1152l851K3245j6369p402K1720j1347
$$ 15352 -12078 -4116 15978 -9361 -7459 15114 -6038 -9889 13356 -3013 -10415 11305 -42
1767d2r748J8815p474j0383J5571m880r485J2905l932p493J0115l538m592Q610
$$ -42 -9790 9025 1551 -8832 6739 1859 -7626 5279 1347 -6146 3969 431 -4161 4449
1781D449m936k938Q799p159k237J0324q845k562J2899j0375m199J5592j0685o234
$$ 4449 -487 -3425 5374 -1785 -4022 6302 -2543 -5105 7794 -2581 -6780 8812 -1873 -8107
1795h107J8336j0206j0277K0494q250j4162K1137m953j7510K0942p88k0545J9162
$$ -8107 10229 23 -10254 10240 1990 -12172 8965 4012 -13498 7444 6656 -13889 5273
1808E273L808k2525J6759P645k3315J3200J0794k2733R194J4060k1569N383J5747
$$ 5273 9081 -13444 3315 10960 -12355 845 11639 -11094 -1900 12160 -9409 -4026 11721
1821A1721j9024K422J6318j6350n50J5891j3825k483J4788j1532l475J3429r412
$$ 11721 -7303 -4881 11437 -4913 -5463 10428 -3397 -5880 8908 -2624 -6099 7330 -2082
1834b082l106J1321p880k405J0099p420k050R403q266p58R189r747Q1J0404j1356
$$ -2082 -5188 6133 -1747 -4152 5947 -1473 -3523 5880 -2386 -3144 6045 -3702 -3621 6783 -4573
1849d573J135J1739j2520j17J3785j3133k657J7049j3698n648J9700j2884q952
$$ -4573 -3438 8301 -4219 -4336 9449 -3684 -6341 10708 -2990 -8638 11062 -1822 -10774
1862a0774K1737j0153j3366K3272p213j7328K2662k474k0282K0630J844k2654
$$ -10774 10963 810 -12556 10716 3503 -13825 8837 6363 -13919 6711 8555 -14099
1874a4099J7778O641k2953J3634J0348k1974R216J2878j9637M737J4163j6737
$$ -14099 3679 10320 -12633 1001 11349 -10625 -1409 11469 -8168 -3431 10732 -6005
1886f005J675J3526j3344o12J1709r570r94R098p512j76O483o453J467M613p374
$$ -6005 -4330 9196 -4148 -4760 6949 -2621 -3615 5483 -2029 -2205 4278 -2175 -708 3905 -3469
1901c469L514L921r340N883M526j1937P649O757j5436P755J0144j8593O262J4357
$$ -3469 45 3966 -5374 509 5035 -6902 747 7504 -7932 -177 9967 -8626 -2364 11993
1915A1993k0239L080J8284j9983j660K2524j7948p019K4725j4279j2397K5109
$$ 11993 -8246 -5166 13118 -6865 -8525 13999 -3949 -10968 13757 -522 -12919 12190
1927A2190r450j7135K3812l871j9817K0742J009k0434J6438N652j9619J1345Q272
$$ 12190 2740 -14395 9417 5546 -14271 6471 7480 -12954 3484 9136 -10483 862 9134
1940I134j6743O420Q835j3499L875P886r975K173N992o766K446K635n236M270
$$ 9134 -7609 -1189 7646 -5853 -1978 5908 -4067 -1894 4098 -2668 -222 2413 -2823 1447
1954A447N47o163P182j394p496R966j638j0833J2802J9j4291J4026L406j8623
$$ 1447 1994 -4169 3013 1619 -5877 4089 2451 -8382 4420 4439 -9852 4174 7580 -11043
1968a1043J3554P574k1277J0517J3119k3038O736J7406k2062K082K0418j9564
$$ -11043 2511 10085 -11192 -675 12444 -10594 -3858 13548 -8514 -6432 13986 -5578
1980e578l245K2306j5850p869K2070j1332j1816K0587o788j3665J7784k428j4109
$$ -5578 -8823 13483 -2367 -10236 11834 502 -11314 9273 2485 -11180 6604 4176 -9933
1993i933J4501M46j2779J0670J775j0819P687K133q631O276Q16o009O021j194
$$ -9933 4568 5014 -7765 2905 4680 -6139 1548 3681 -4950 1326 2142 -3867 2154 960
2007I60m590O653k590m186Q603m635n192J0099m832p196J3054m675r829J4699
$$ 960 -3630 3023 433 -3753 4850 215 -4977 5122 290 -6906 6148 1473 -8356 6343
2021F343l000j3239J5799m55j5740J4634L004j8295J3178O645j9402J0275J0532
$$ 6343 3343 -9896 5903 5448 -10292 4342 7346 -10949 2229 8874 -10528 -253 10279
2034A0279j9554P228J3315j8907L809J5082j6747k42J6382j4559l280J6763j1529
$$ 10279 -9275 -2047 11268 -7639 -3830 11252 -5495 -5737 10645 -3914 -7194 9569 -1960
2047a960n413J5634q718o757J4429o150p554J1894l984p236J0250l254o435Q629
$$ -1960 -7373 8261 -457 -7214 7215 1065 -6489 5405 1421 -5815 4435 1181 -5254 3375
2061C375k446n390P916k701m662P737l658l721Q154m934l783Q987n639m282J0696
$$ 3375 929 -4461 3455 754 -3908 3829 171 -3550 4604 -330 -4113 4874 -765 -5047 5649
2076E649o039n556J2426o177p175J3554n016r751J4474l543j2713J5129m54j5041
$$ 5649 -390 -5946 6480 303 -6872 6682 1666 -8085 6389 2846 -9867 5262 4808 -10233
2090a0233J4323K340j6601J2458O129j7971J0169R030j8084O832J1418j7023L199
$$ -10233 4090 6430 -10171 2287 8416 -9555 614 9644 -8440 -1608 9810 -7213 -4014
2103d014J3915j5241L02J4087j2213k663J3872r153m751J2808p133n340J0706
$$ -4014 9901 -5340 -5038 9049 -3164 -5827 8045 -1108 -5859 6949 -184 -5524 5182
2116E182n003n189Q728l198m024O870l420k350N415l922j040N558n882N64O250
$$ 5182 179 -5010 3718 520 -3504 3366 -54 -2404 3011 -911 -1951 3607 -2275 -1711 4539
2131D539p689P55Q244r057n08J1308j0542k120J3654j0372n443J5803q729r294
$$ 4539 -3150 -2395 5849 -3208 -3716 7592 -2950 -5070 8584 -1788 -7231 8572 -157 -9451
2145i451J7663o338j2526J7684k706j5765J6906J650j7978J3787N546j8358R829
$$ -9451 8212 1874 -10652 7032 4326 -11439 5467 7117 -10861 2926 8472 -9886 -57
2158e7R474j7638N703J1634j5128K084J2589j2170q87J1530q728k816R569n809
$$ -57 9417 -8221 -2518 9116 -6012 -3928 8661 -3509 -4396 7134 -1594 -4410 5159 -650
2172f50l425P428l735k119M918l084j87L104m163K455K169o047M178K792q721
$$ -650 -4075 3353 -382 -2501 2417 -667 -854 2250 -1913 542 2711 -3336 842 3634 -5087
2187e087N425M882j1329N633P701j3449L982J1193j4359J185J4358j4264k856
$$ -5087 338 5220 -6109 -476 7225 -6224 -2242 8951 -5408 -4223 10135 -4129 -6985
2200f985J7051j2009p283J8843r042j0832J8542n171j3639J7321j293j5867J4339
$$ -6985 10066 -1943 -9226 9617 575 -10257 8285 3114 -10525 6796 5503 -10364 3975
2213C975K733j6127J1030N554j4947P557P270j3163M933P799j0473K045P248q174
$$ 3975 6708 -9419 1611 7165 -7782 -225 7045 -6118 -1185 6614 -3859 -1814 5434 -2740
2227b740J077N375o022J294L621m943K490J946m836M187Q63n910N373Q93p672
$$ -2740 -1663 3712 -2310 -1016 2605 -2338 152 2098 -2738 1449 2312 -3598 1775 2668 -5004
2242e004O980J679r785P338L943j1768P109O238j3572N948R052j4216L162J1988
$$ -5004 1976 3655 -6130 1208 5151 -6617 492 6730 -6842 -894 8158 -6058 -2896 9092
2256I092j4103L02J4060j3128k666J5415j0766n929J6165q592p585J5121n451
$$ 9092 -5011 -4709 9351 -3777 -6443 8972 -1794 -7723 8442 -150 -7735 7386 1935
2269A935j0219J4147l006j0919J2444r27j0787J0296J156j0350Q283K366r656
$$ 1935 -8284 5863 2857 -8062 4382 3455 -7332 2964 4120 -6230 2053 4419 -5237
2282e237O700K084q038N525J861p210N621R86o588N970O52o332O275J09o913O967
$$ -5237 1463 3547 -4491 1034 2895 -4315 1306 2292 -4296 1674 2326 -4006 2269 2378 -4535 2432
2298B432j8p553P509M23q890Q288J513j0354Q706K972j1478P863M644j2927O994
$$ 2432 2414 -5139 2370 2793 -6097 2191 3704 -6650 2056 5028 -6450 1413 6057 -6870 124
2313A24O884j3646N380R091j3872L316J1332j3531R44J2699j2366j407J3407j0648
$$ 124 7008 -6638 -1258 7833 -6039 -2723 8609 -4922 -3978 8721 -3645 -5052 8355 -2293
2327b293l903J3915q328o443J3430n857p423J2237l353q288J0482j636q208Q656
$$ -2293 -6196 7719 -609 -7052 6378 521 -6902 5335 1982 -6306 4176 2540 -5668 2988
2341B988o22p584P134L3o091N968n88m678N438r97l870N738k534l350O291l170
$$ 2988 2366 -5218 1916 1949 -4142 1826 1238 -3440 1998 1001 -2869 2869 335 -3015 3276 106
2357A06m096Q127m098n294R949l737p187J1372k755r652J2308j187j2248J2267
$$ 106 -3990 4137 39 -5255 4694 957 -6230 5142 2387 -7265 5043 3856 -8392 3875
2371C875J473j4149J0838M870j5305Q862P823j5737N938J0697j4697K058J2349
$$ 3875 5348 -8801 2037 6907 -8398 464 8287 -7450 -1512 9185 -5512 -3454 8895
2384H895j3121q52J3191j0401l791J2882p286n276J1295m736n914R317l134n286
$$ 8895 -4226 -5078 8113 -2288 -6079 6803 -483 -5759 5536 800 -5114 4203 1069 -4217
2398d217O667j225m607N216j460k394L879k516q09L975l743K79M970o444K55O685
$$ -4217 2450 1225 -3382 1834 374 -2020 1859 -657 -1466 2509 -1234 -955 4015 -2429 -2174 4511
2414D511p549L6Q790q267k021J1138p959m445J3040p111p461J3766m498j0611
$$ 4511 -3038 -3002 5788 -2479 -4500 6638 -1321 -5766 7274 163 -7298 6468 1970 -8641
2428h641J4071j393j3195J2745K042j4377J0505N166j4694Q010P271j3808M883
$$ -8641 5430 4037 -9158 3587 5629 -8748 1757 6923 -7771 239 7510 -6298 -1415
2441a415Q677j1942J865R163r619l56R341p363j573P661n357j646N829l816j607
$$ -1415 7262 -4680 -2815 6348 -3271 -3627 5714 -1649 -3222 4439 -918 -2564 3265 -551 -2158
2456b158M604l664ML012l774J354L204n178K635L469o762K993M385q056K936O317
$$ -2158 2446 -1218 -1214 1798 -1976 -622 2582 -2596 39 3508 -3254 -261 4124 -3932 -996 5321
2472E321r357J678Q800r858m14J0808r044k975J2175q454m699J2515o154p337
$$ 5321 -4036 -2358 6442 -3416 -3830 6978 -2066 -5041 7134 -1320 -6019 6496 342 -6995
2486f995J2539l580r335J1835j248j0337J0183J100j0537Q204L108j0687O241
$$ -6995 5544 1964 -7371 4464 3216 -7121 3062 4162 -6375 1829 4937 -5750 491
2499D91L900r120M490M557q107L369M503o865K062M182n723J737L305n107K110
$$ 491 4391 -4729 -239 4318 -3789 -420 4083 -2782 -720 3462 -2261 -524 2781 -2326 -216
2514b16K330m972K679K273m755L010K324n905M113K198o871L967L533p839M149
$$ -216 2114 -2858 -179 2094 -2661 349 2673 -3232 881 3079 -3792 175 3708 -4131 18
2529A8M330q726L661O002r440K485P567r104P79Q621r121q27J0072q392k563J0768
$$ 18 4348 -4378 -717 5285 -4155 -1670 5897 -3207 -2428 6193 -2928 -3755 6317 -2075 -4638 6130
2545F130o977m789J1496n545o235J1037l279p925J0293j591q911Q930K48q618
$$ 6130 -847 -5636 5860 315 -5920 5117 1838 -6087 4206 2615 -6296 2634 2882 -5736
2559e736P154K062q403N680K996p602M186L277o497K753K880n522K456K276l994
$$ -5736 1418 3480 -4923 757 3753 -3849 337 3614 -2883 -130 2750 -2772 -316 1960 -2034
2574b034K475J169l793L192O01l901M008k60m830N113r9n589N381J022p262O275
$$ -2034 441 1610 -2183 1009 1610 -2291 1717 1457 -3373 1740 1641 -3948 1433 2455 -4807 1468
2590A468K181q566N986L889j0138N329N497j0813L575Q041j0769J245J0029j0270
$$ 1468 3649 -4917 1069 4958 -5180 149 5646 -5167 -1592 6449 -4320 -3075 6954 -3316
2604c316p94J0964q348l731J1511o293n606J0911m221p363R969j584p876Q133
$$ -3316 -4110 6854 -1494 -5225 6286 -7 -5613 5298 1077 -6286 3683 2099 -5777 2356
2618B356N40p630O190J413o662M538J826n137K769J541m017K523Q49k854K961
$$ 2356 2896 -4734 1456 2869 -3793 745 2571 -2566 203 1744 -2273 250 1099 -1755 1206
2633A206p70k236L663j970k247M819k499l264O646l213m472P649k204o191Q352
$$ 1206 436 -1800 1863 -107 -2354 2465 -34 -3298 3348 135 -4337 3312 1108 -5083 3269
2648C269p45q243Q407J534j0293P336L760j1054N903O344j1483L392Q462j0534
$$ 3269 2524 -5719 2688 4222 -6071 1265 5025 -6029 -126 6218 -5265 -1873 6589 -3945
2662c945Q84R710r149j422R783o917l593R524n037m710Q361k542m906O710j562
$$ -3945 -3061 6649 -2500 -3922 5861 -1056 -4649 4875 -162 -4872 3489 947 -3959 2751 1189
2677A189m802N458n71l957M000o28k363K928j311j235L088k437o40L798l708k99
$$ 1189 -3613 1845 1274 -2683 1317 689 -1674 1254 -57 -1292 1796 -641 -1281 2517 -1191 -1490
2693a490N129m728j401O468n123k385P623m612m113Q990l681n842R141k141p657
$$ -1490 3639 -1089 -2490 3978 -1145 -3530 4093 -519 -4632 4358 677 -5165 3976 1835 -5822
2708e822R376l27r074P809K184r818O525M148j0434N055N873r651K757O804q792
$$ -5822 3554 3227 -5847 1962 4146 -5672 853 5001 -5433 -378 5495 -4156 -1399 5405 -3387
2723c387J309P093p244n26P040o056j125O603m694j660N864l621j622M699l091
$$ -3387 -2078 5015 -2229 -2755 4285 -1771 -2896 3707 -987 -2647 3217 -404 -2026 2673 -418
2738d18j146L680k664p23L231l010N2L431l998L73M067m659M59M793n212m2N575
$$ -418 -1564 2116 -548 -1271 1960 -1050 -998 2433 -1565 -1192 2875 -1784 -1325 3468 -1744 -1786 3789
2755C789n593o63O680n661j881P847n247l206Q112m116m652R023l251o414Q849
$$ 3789 -1804 -2467 4213 -1448 -3329 4518 -729 -3935 4177 61 -4591 4432 1181 -5233 3616
2770C616j795p262P971L78q352P306J864q736O162L231r044M957L871q157L185
$$ 3616 1821 -5441 2530 2908 -5444 1862 3726 -5010 1152 4383 -4661 296 4167 -3990 -805
2785h05M624p107J870N150o148R39M755m769J61M263m375J96L745m071M59K931
$$ -805 3819 -3288 -1418 3732 -2416 -1477 3278 -1491 -1330 2933 -1442 -1246 2499 -1572 -1113 1818
2801A818l303O59K918l528J105K657m246J878K679n205K005L626n974J927M762
$$ 1818 -1485 -826 2092 -1436 -331 2326 -1920 -42 2637 -2568 -563 3063 -2911 -984 3778
2816C778o406R53O233o800J0P138o848j246Q322o009l180Q655m703m876R589l666
$$ 3778 -2628 -1675 4558 -2242 -2232 4906 -1942 -3188 5134 -875 -4055 4600 -103 -4979 4610 944
2832I44o255Q972j521p160P664L93p858O365J755p614M734K900o842L290L481
$$ 944 -5311 3661 2140 -5020 2644 3037 -4821 1544 3299 -4315 419 3319 -3523 -233 3248
2847C248n723K079L211m785J433K602l527J086K099l266J471J064k484K294M14
$$ 3248 -2475 -396 2815 -1970 -537 2065 -1462 -376 1723 -1543 -72 992 -1492 802 1216
2862A216l013L124P5m112M257M27n442M526J579o789M596L038p514L882M892q665
$$ 1216 -1797 1327 1402 -2710 1547 1974 -3468 1058 2637 -4152 444 3482 -4032 -150 4742 -3923
2878c923K918O467q651Q63P861p803j164Q511o101l404R349m847m283Q310l189
$$ -3923 -1005 5462 -3189 -2326 5535 -2268 -3432 5079 -1022 -4426 4923 76 -4207 4103 914
2893I14n341P555j466o041O407j32n445M646J137n091L318J282l679K364J002
$$ 914 -4427 3128 1662 -4379 2028 1896 -3549 1097 2234 -2857 461 1743 -1936 428 1430
2908A430k871J779K69k055K369o86j779K805j287k045M072j843k685N090k082
$$ 1430 -1441 338 607 -1448 921 235 -1544 1261 -26 -2071 2001 158 -2527 2563 481
2923D81l688N647j183n407O033J72o238N843J493p721N232L344p997M087M441
$$ 481 -3207 2440 1257 -4150 1883 2055 -4183 1660 3153 -4568 664 4008 -3989 98 4539
2938D539q064K169O055p535O41O831o647p01P039n322k029O834m069k844N969
$$ 4539 -3525 -1356 4699 -2836 -2195 4636 -2011 -2712 4327 -995 -3024 3810 -259 -3103 2866
2953B866k726l362N664j814l575M836j243k828L859j356k214L380j085k021L105
$$ 2866 140 -3222 2442 628 -2947 1889 646 -2182 1677 321 -1893 1487 402 -1619 1486
2968A486j737j315L091j735j402L630k371j348L879k215k247M759k306l088N605
$$ 1486 -251 -1566 1525 -210 -1612 2018 -353 -1701 2178 -37 -2284 2475 169 -2919 2686
2983B686k152m042N755j215m909O086k69n925N786R75o719M988K267p216M105
$$ 2686 534 -3508 2247 1032 -3877 2209 1940 -3985 1801 2776 -3943 1045 3312 -3904 201
2998B01L181o773K937L983o406J609N134o160O94N427n398l46N059m182j035M718
$$ 201 3382 -3391 -454 3529 -2877 -1268 3866 -2294 -1600 3827 -1571 -1917 3142 -1040 -2075 2643
3014B643l351j554M600k511j742M126k412j479L279j790j354L014j862j183L266
$$ 2643 -708 -2262 2338 -173 -1915 2211 -201 -1680 1599 -191 -1545 1469 -393 -1576 1690
3029A690k296m81K962k774j28L212k888p12L953l481j010M752l661j813N620k941
$$ 1690 -606 -1087 1875 -899 -1027 2185 -703 -1415 2538 -943 -1953 2799 -862 -2675 2945 4
3045Dk944N925k197m399O490j739n008O117m44o002N825O71o396N056K277o712
$$ 4 -2940 2985 788 -3611 2879 1140 -3868 2249 1805 -4197 1628 2299 -4097 959 3236 -3476
3061c476L379L669o323K261L907n706P83M583m878K23M570m303j96M002l043j076
$$ -3476 -97 3572 -2751 -490 3417 -2289 -1506 3077 -1801 -1578 2992 -1311 -1507 2495 -548 -1624
3077a624L507k285o82K647k110k09J697j732M84J502k554R38J739k993J429K407
$$ -1624 1883 -402 -1084 1563 -547 -756 941 -791 -307 1195 -1359 -421 1318 -1675 -246 2161
3093B161m049J495L057m676O34M595n046j72N633n156q49O068m461k461O921l260
$$ 2161 -1888 -393 2664 -2012 -1378 3217 -1829 -2001 3632 -1524 -2373 3695 -766 -3227 3694 434
3109D34m382P215k216n348O694l97o278N846J190o485M696J979o089L145K937
$$ 434 -3948 3267 1051 -4297 2397 2000 -4278 1568 2758 -3727 969 2948 -3141 4 2941
3124B941n646K099L267m563P19L583l799M58L023k585J14J882k187L25J112j819
$$ 2941 -2705 -606 2661 -1902 -1183 2400 -1399 -941 2082 -503 -389 1493 -694 -369 743 -1076
3140a076J290Q26k496J714Q08k932K548Q44l841L040J284m662K982K419n400K219
$$ -1076 214 1040 -1456 258 1066 -1866 682 1526 -2315 725 2009 -2653 329 2748 -2652 -433
3156d33L674n640J178M908n786L25N750n218j508O640m431k773O587l090l657
$$ -433 3241 -2399 -1221 3687 -2099 -1774 3976 -1242 -2750 3890 -541 -3314 3273 183 -3474
3171c474O708k441m285N801m34n092M747M58m889L661R75m200K985J219l909K384
$$ -3474 3234 793 -3492 2309 1875 -3217 1530 1988 -2901 760 1735 -2465 520 1739 -2170 214
3187B14J237k941K039O59k633J794L78k084K090j25k511K856l59k615K915k0k909
$$ 214 1451 -1490 549 1208 -1425 369 747 -1337 753 628 -1883 973 614 -2001 914 894 -2015
3204b015L455K00m076L418R20m767L689J446n521L424K628n656K699L377n784
$$ -2015 1440 1640 -2436 982 1902 -2865 824 2270 -3251 173 2801 -2855 -156 3221 -2563
3219b563J611M474n392K06N164n013n73N190m264j268N698l780k227N335k401
$$ -2563 -952 3522 -1870 -1664 3500 -1513 -2086 3104 -1160 -2428 3270 -510 -2737 2598 197
3234A97k895N178k168k803M511j576l014M139r88k460L111n04k479K701l02k432
$$ 197 -2698 2480 312 -2491 2020 444 -2570 1569 581 -1879 1232 728 -1751 950 648 -1784
3250a784L035p58j995K561r32j805K923j053k165L357r63k358L823j205l011L989
$$ -1784 1251 493 -1502 1059 127 -1678 1245 192 -1973 1384 421 -1937 1886 681 -2330 1659
3266A659r84l467M284n07m175M469O01m793L884J645n564L569K423n977K624L335
$$ 1659 675 -2792 1492 985 -3190 1279 1880 -2913 971 2616 -2948 621 3044 -2933 -309 3026
3282C026n731J617M322n573P14M911m866l69N004l764j468N044l258k007M449
$$ 3026 -2705 -1088 3234 -2339 -1625 3286 -1580 -1949 3055 -709 -2177 2867 -391 -2398 2051
3297B051k203k107L929j333k144L638j490j797K560r27j341K093j146q64K142
$$ 2051 -152 -2259 1670 337 -1807 1831 341 -1456 1104 177 -1164 929 -217 -1081 1061
3312A061j306p46K403k170r2K685k468p44L542k565j367M416k941k456N247k062
$$ 1061 -245 -991 1412 -758 -850 1835 -633 -1377 2165 -400 -1767 2649 -292 -2748 2499 437
3328D37l491N387j801l789N268j35n234M956Q64n910M069J917n745L136L031n724
$$ 437 -3054 2333 532 -3257 2011 1876 -3358 1598 2462 -3448 621 2538 -3207 -71 2960 -2764
3344b764K217L786n182O82M388m424r6L785l290q09L702k447r28L081k226n85
$$ -2764 -547 3239 -1943 -1261 3127 -1297 -1393 2392 -898 -1707 1995 -452 -1380 1701 -525 -1110
3360a110K609j930k79J685j486o6J660j835L24J718k326Q01J974l118J002K456
$$ -1110 1499 -431 -710 975 -511 -577 1083 -752 -428 1290 -1036 -235 1739 -1379 -377 2079
3376B079l518K61L948m071k42M595m097j179M996k961k523N590k673l020N330
$$ 2079 -1439 -1178 2770 -1301 -1543 3052 -1045 -2224 2772 -189 -2712 2878 205 -2815 2515
3391B515j598m045M695K6m657M286N48m660L601J508m950K758K194m157J875K300
$$ 2515 917 -3128 1567 1593 -3064 1222 1770 -2890 711 2219 -2731 27 2221 -1936 -61 2239
3407B239l924J308K366l247P08K111k480P37J486j984M17J217k007J285Q77k416
$$ 2239 -1685 -377 1989 -1258 -550 1561 -919 -182 1304 -680 -263 954 -1053 232 1109 -1307
3423a307J744N10k537J791R83k916J959J520l676J972K090m006J234K900l971
$$ -1307 437 947 -1590 201 1184 -1732 227 1747 -1929 43 2133 -1873 -639 2261 -1710
3438a710O45L911m425L33M292m085j145N094l384j707M735k327k622M613j796
$$ -1710 -1065 2846 -1579 -1246 3046 -1039 -2184 2910 -474 -2181 2554 227 -2395 2218 422
3453D22l360M911j049l537L842j01l384L365K31l227K533Q18l328K010J043k895
$$ 422 -2938 1973 924 -2613 1229 1128 -2256 1109 1340 -1887 646 1464 -1864 146 1189 -1706
3469a706J694J257k397J463O46k232J418O60j924J416M00j990J701L73k062J950
$$ -1706 -12 1245 -1152 311 957 -1275 143 803 -1121 295 695 -1295 406 779 -1283 667
3485F67J78k454K445L02k732K181J122l706K206J569l934K133J941m084J816K977
$$ 667 845 -1609 836 1138 -1594 587 1709 -1997 209 1778 -2156 -23 1918 -2166 -350 2627
3501B627m404Q97L647l923l18M323l842j074M594l264j362M329k316k291M425
$$ 2627 -1777 -880 2767 -1156 -1474 2849 -993 -2067 2527 -737 -2099 2230 -86 -2377 2048
3516B048j546k766M031j097k576L022o5k783K392J62k703K348O30k519J814O44
$$ 2048 502 -2264 1767 670 -1906 1116 1051 -1732 660 822 -1881 467 1097 -1422 392 1036
3532A036k073J611j4j321J259o9j550J730m16j456K394q19j720K680p34k003K694
$$ 1036 -1037 574 560 -761 498 429 -1121 609 193 -1263 1131 312 -1408 1272 538 -1465 1229
3549A229m00k857L217r0l545L071J045l832K493K051m714K520K425m756J279L650
$$ 1229 829 -2028 1189 1099 -2446 625 1670 -2162 331 2382 -2332 188 2613 -2143 -864 2786
3565B786m497L08M043l675n71M093l010j277L994k097j955L578j628j897L237
$$ 2786 -1711 -1403 2640 -1035 -1606 2487 -523 -1800 2194 97 -1858 1720 92 -1805 1432
3580A432r30j978K296m69j568K191o52j226J641n91q25J538p67r18J832j341n12
$$ 1432 502 -1476 820 351 -1217 974 322 -904 737 146 -679 859 92 -826 1006 -335 -847
3597h47K121j878k97K552j804j269L661k224j975M003j723k628M048r18l537L888
$$ -847 1274 -604 -901 1651 -153 -1422 2239 15 -1960 2043 320 -2308 1740 822 -2715 1173
3613A173K24m004L582J180m865L064J756m100J853K521m584J346L195l987N30
$$ 1173 1397 -2607 975 2155 -2710 354 2110 -1990 -137 2384 -2200 -854 2341 -1646 -1116
3628a116L304l251j4L098k911l09K893j972r62K460j094q98J903j215o68J759
$$ -1116 2188 -1063 -1077 2021 -890 -1199 1694 -278 -1240 1220 126 -772 1131 -84 -752 1007
3644A007j180l98J468j184l59J832j812r5K153k502K30K429k406j49K942k657
$$ 1007 -173 -571 897 -287 -646 1186 -626 -721 1432 -1070 -840 1589 -817 -966 1976 -681
3660f81n51L245k780j062M020k477j714L838j783k294L951p37l172L760m59l717
$$ -681 -1232 2013 -767 -1829 2191 -286 -2000 1838 55 -2239 1712 975 -2197 1563 1104 -2613
3676b613L726M76l955K995J229m011K046J917l911J911K153l192P28J987k725
$$ -2613 1113 1589 -2366 629 1858 -2153 -107 1810 -2101 -190 1963 -1229 -501 1486 -1239
3691a239N61K146k440L57K130k275L33J693k093N08J415j856N20J379j836M72
$$ -1239 -678 1468 -972 -615 1515 -760 -427 1266 -827 -319 1096 -760 -240 1139 -697 -225
3707b25J265k197R54J404k221P42J818k608O46K177k576L86K442k990k9L013k733
$$ -225 1040 -1157 -203 1201 -1020 -278 1540 -1068 -422 1755 -821 -435 2007 -983 -1012 2001 -732
3724g32m60L046k586r20L662k110j621L730j723k351L768j222k818L527l06l150
$$ -732 -1192 1854 -732 -1652 2010 -100 -1721 2009 286 -2065 1703 481 -2337 1190 884 -2266
3740b266L468K21l546K554J003l238J962J264k883J444J356k202P63J219k212
$$ -2266 1202 1423 -2123 431 1434 -1804 158 1422 -1461 -17 1339 -863 -100 1119 -1093
3755a093R39J210j754N45J140j824R80Q21j715Q14P28j801R47O25j770J455J050
$$ -1093 -154 1056 -698 -153 987 -837 143 964 -751 63 791 -1010 -63 562 -1208 247 1297
3772A297k534J333J587l040J583J587l309R88K659l604P78K719l463L94L126k772
$$ 1297 -1237 96 1683 -1357 226 1813 -1496 -508 2151 -1453 -675 2044 -1419 -1025 2101 -671
3788f71q29L589k429j530L580j694k019L686j308k529L364l54k689K776L3k618
$$ -671 -1500 2089 -340 -1870 1710 16 -2003 1683 375 -2154 1210 856 -1833 943 976 -1642
3804a642K343J60k008J595K60j747J176O71j697J111K83j519J679J06j415J282
$$ -1642 701 861 -1147 448 708 -1039 137 808 -889 222 505 -1014 665 771 -644 638
3820F38m47j173J841n98j106J693l96j855K390j82k293K063N12k868K243R77l353
$$ 638 191 -982 859 261 -845 848 452 -1403 987 805 -1488 575 1087 -1781 462 1439 -1914
3837a914J861J738l497J227K571l633P77L075l410L01L064k909o68L446k569j169
$$ -1914 -53 1685 -1812 -585 1986 -1647 -870 2205 -1205 -904 2160 -749 -1417 2029 -540 -1709
3853a709L570k241j296K878r77j520K157m03j761J980m02j298J489k01j192J600
$$ -1709 1861 -380 -1676 1202 225 -1295 862 459 -1302 678 276 -1022 467 266 -926 674
3869F74m80p83J382n46p15R78m40r11J634n77j084J830j131r33K218j102j254
$$ 674 194 -589 793 247 -468 510 70 -841 793 216 -868 962 -169 -1102 1116 14 -1240
3886a240K341r14j930K860l17k468K522q2k599K639O00l265K373R77l330K048
$$ -1240 1101 187 -1743 1117 800 -1668 854 772 -1827 812 1412 -1853 520 1497 -1833 215
3902B15J588l335J486K055l080L81K100k180j45K419k303m13K505j584m80K053
$$ 215 1803 -1532 -46 2009 -1071 -690 1410 -770 -915 1504 -799 -1212 1293 -291 -771 1282
3918A282j504p59J962j272q44K102j222m87J703j209l36J273j035OJ402j606J25
$$ 1282 -222 -981 981 -291 -1135 967 -255 -742 961 -248 -584 689 -346 -340 1062 -544 -419
3935d19J479j651J05J618j561l34K031j184j337K843j503j451K429r12j629K542
$$ -419 1060 -591 -486 1132 -429 -763 1268 84 -1253 1590 87 -1364 1065 153 -1476 1066
3951A066n15k333K894l42k381K415J96k621K224Q79l049J767J369l024J116J682
$$ 1066 551 -1782 1112 770 -1611 804 1000 -1621 603 1482 -1567 200 1569 -1455 -339 1343
3967A343k627Q17J770k114M71J890k036l2J578j594j79J665j386q9J357j107l14
$$ 1343 -1284 -467 1303 -811 -340 1550 -486 -518 1060 -534 -713 952 -434 -523 834 -273 -587
3984e87J375j133J90Q87j295M01J015j698N14J034j222K7J598j746K88J872k221
$$ -587 788 -345 -155 732 -563 -162 853 -845 -331 703 -519 -492 1106 -640 -352 1520 -701
4001g01p8K116j458r69K787k042r65K754j400j647K889j204j742K738n74k143
$$ -701 -779 1337 -121 -1090 1697 -345 -1310 1444 44 -1603 1286 82 -1660 1078 504 -1639
4017a639K659n7k824K583N55k968J801R86k691J690J364k662J141J304k264N90
$$ -1639 1020 963 -1861 722 1277 -1691 110 1096 -1595 95 1459 -1203 -62 1242 -1022 -432
4033d32J468j672M82J242j363k07J328j439J81J164j317O21O69j536R14O08j543
$$ -432 1036 -636 -154 1088 -275 -482 846 -593 -412 752 -565 56 725 -811 103 711 -832
4050h32P19R45j588N62J260k073O94J495k084L41K205k618L00K060k273K6K487
$$ -832 -113 832 -756 -194 1066 -1007 -313 1182 -902 -561 1644 -974 -674 1386 -887 -861 1626
4067A626k157p01K838j878j226L038j325k004K960o69k314K809l92k345K333M01
$$ 1626 -531 -1232 1606 -272 -1498 1540 215 -1789 1171 502 -1812 997 605 -1740 593 994
4083I94k349J900L60k010J397P73j780P43Q14j390J84J215j520P36L22j092J081
$$ 994 -1355 545 905 -1105 292 1065 -715 28 842 -548 -364 851 -669 67 389 -703 378
4100C78j8r99Q51J06j148J154L99j687J562K18k026J440M95j619J037J112k370
$$ 378 360 -639 212 318 -830 324 723 -964 598 816 -1210 230 725 -894 143 1255 -1115
4117a115J121J386k739R60J987k824M33K341k222l13K751k154r14K568j441j112
$$ -1115 6 1392 -1347 -387 1600 -1224 -791 1550 -672 -985 1766 -388 -1302 1266 -175 -1287
4133a287K779j473j234K071p26j349K271m88j615J804m6j517J193J37j386J262
$$ -1287 1492 19 -1215 856 130 -1219 1052 564 -1051 753 707 -810 383 520 -866 396
4149C96j88j119J364k09j088J284kr48R38k64p27J309p72p97J638m61j392J602
$$ 396 208 -911 453 244 -844 440 438 -510 428 164 -563 746 -26 -823 815 354 -1038 564
4167E64j89j319J606p7j971J792P17k407J846L79k259J315J236k413J088J446
$$ 564 375 -944 662 585 -1386 406 1123 -1284 562 941 -1318 -3 1233 -1180 -92 1354
4183A354k347Q03J636k465N65J620k056N7K356j997l45J896j330n82J938r44r57
$$ 1354 -993 -190 1446 -1019 -454 1166 -890 -833 1523 -474 -819 1077 -253 -835 1103 159 -798
4200g98J865j033j226K002n50q48J196l08j289J351l09p60J294k77r27J443p68
$$ -798 1067 34 -1192 810 260 -588 608 300 -989 362 53 -707 587 310 -617 826 58
4217E8o18J173p53n85J409m72j097J685o79j136J882o51j295J971k26j545J442
$$ 58 -560 613 -140 -725 684 212 -885 800 121 -1015 867 216 -1079 892 666 -879 563
4234E63K9j898J797L25k378J812O45k063J165J588k887J152J308j941M81J684
$$ 563 592 -1306 491 816 -1562 250 895 -1168 -3 1585 -1302 -150 1158 -783 -302 1382
$$ [...]
8191a95
##END NTUPLES=NMR FID
##END=
