##TITLE=1H_Pr 2066
 CDCl3, 8 sc, 
 5.2.2019
##JCAMPDX= 6.0         $$ Bruker NMR JCAMP-DX V2.0
##DATA TYPE= NMR FID
##DATA CLASS= NTUPLES
##ORIGIN= UXNMR, Bruker Analytische Messtechnik GmbH
##OWNER= root
$$ XWIN-NMR		Version 3.5
$$ Tue Feb  5 15:40:48 2019 Russian Standard Time (UT+4h)  she@DPX200
##.OBSERVE FREQUENCY= 200.1313
##.OBSERVE NUCLEUS= ^1H
##.DELAY= (6, 6)
##.ACQUISITION MODE= SIMULTANEOUS
##.ACQUISITION SCHEME= undefined
##.AVERAGES= 8
##.DIGITISER RES= 18
##SPECTROMETER/DATA SYSTEM= spect
##.PULSE SEQUENCE= zg30
##.SOLVENT NAME= CDCl3
##.SHIFT REFERENCE= (INTERNAL, CDCl3, 0, 15.7039)
##AUDIT TRAIL= $$ (NUMBER, WHEN, WHO, WHERE, WHAT)
$$ ##TITLE= Audit trail, XWIN-NMR		Version 3.5
$$ ##JCAMPDX= 5.01
$$ ##ORIGIN= Bruker BioSpin GmbH
$$ ##OWNER= she
$$ F:/spectra/data/she/nmr/H-F/1/audita.txt
$$ ##AUDIT TRAIL=  $$ (NUMBER, WHEN, WHO, WHERE, WHAT)
(   1,<2019-02-05 15:39:07.15 +0400>,<she>,<DPX200>,
      <created by zg, POWCHK disabled, PULCHK disabled
       configuration hash MD5:
       00 E9 B6 7A A2 85 ED C7 34 08 36 98 17 FE 4E 26
       data hash MD5: 16K
       37 55 08 C3 0E A3 BE 7E 69 EC 76 23 A6 59 66 D8>)
$$ ##END=
$$ 
$$ hash MD5
$$ D7 57 84 55 7E 98 A7 56 DD 6E B3 9D 77 3B 31 A7
##$RELAX= 
##$RELAX= 
##$RELAX= 
##$RELAX= 
##$RELAX= 
##$RELAX= 
$$ Bruker specific parameters
$$ --------------------------
##$DU= <F:/spectra>
##$EXPNO= 1
##$NAME= <H-F>
##$PROCNO= 1
##$TYPE= <nmr>
##$USER= <she>
##$AMP= (0..31)
100 100 100 100 100 100 100 100 100 100 100 100 100 100 100 100 100 100 
100 100 100 100 100 100 100 100 100 100 100 100 100 100 
##$AQSEQ= 0
##$AQ_mod= 1
##$AUNM= <au_zg>
##$AUTOPOS= <>
##$BF1= 200.13
##$BF2= 200.13
##$BF3= 200.13
##$BF4= 200.13
##$BF5= 200.13
##$BF6= 200.13
##$BF7= 200.13
##$BF8= 200.13
##$BYTORDA= 1
##$CFDGTYP= 0
##$CFRGTYP= 5
##$CHEMSTR= <none>
##$CNST= (0..31)
1 1 145 1 1 1 1 1 1 1 1 1 1 1 1 1 1 1 1 1 1 1 1 1 1 1 1 1 1 1 1 1 
##$CPDPRG= <>
##$CPDPRG1= <>
##$CPDPRG2= <>
##$CPDPRG3= <>
##$CPDPRG4= <mlev>
##$CPDPRG5= <mlev>
##$CPDPRG6= <mlev>
##$CPDPRG7= <mlev>
##$CPDPRG8= <mlev>
##$CPDPRGB= <>
##$CPDPRGT= <>
##$D= (0..31)
0 1.2 0 0 0 0 0 0 0 0 0 0.03 0 0 0 0 0 0 0 0 0 0 0 0 0 0 0 0 0 0 0 0 
##$DATE= 1549366746
##$DBL= (0..7)
120 120 120 120 120 120 120 120 
##$DBP= (0..7)
150 150 150 150 150 150 150 150 
##$DBP07= 0
##$DBPNAM0= <>
##$DBPNAM1= <>
##$DBPNAM2= <>
##$DBPNAM3= <>
##$DBPNAM4= <>
##$DBPNAM5= <>
##$DBPNAM6= <>
##$DBPNAM7= <>
##$DBPOAL= (0..7)
0.5 0.5 0.5 0.5 0.5 0.5 0.5 0.5 
##$DBPOFFS= (0..7)
0 0 0 0 0 0 0 0 
##$DE= 6
##$DECBNUC= <off>
##$DECIM= 32
##$DECNUC= <off>
##$DECSTAT= 4
##$DIGMOD= 1
##$DIGTYP= 9
##$DL= (0..7)
0 120 120 120 120 120 120 120 
##$DP= (0..7)
150 150 150 150 150 150 150 150 
##$DP07= 0
##$DPNAME0= <>
##$DPNAME1= <>
##$DPNAME2= <>
##$DPNAME3= <>
##$DPNAME4= <>
##$DPNAME5= <>
##$DPNAME6= <>
##$DPNAME7= <>
##$DPOAL= (0..7)
0.5 0.5 0.5 0.5 0.5 0.5 0.5 0.5 
##$DPOFFS= (0..7)
0 0 0 0 0 0 0 0 
##$DQDMODE= 0
##$DR= 18
##$DS= 0
##$DSLIST= <SSSSSSSSSSSSSSS>
##$DSPFIRM= 0
$$ [...]
##$SUBNAM2= <"">
##$SUBNAM3= <"">
##$SUBNAM4= <"">
##$SUBNAM5= <"">
##$SUBNAM6= <"">
##$SUBNAM7= <"">
##$SUBNAM8= <"">
##$SUBNAM9= <"">
##$SW= 20.0189088683792
##$SWIBOX= (0..15)
0 0 2 0 0 0 0 0 0 0 0 0 0 0 0 0 
##$SW_h= 4006.41025641026
##$TD= 16384
##$TD0= 1
##$TE= 0
##$TE2= 300
##$TE3= 300
##$TEG= 300
##$TL= (0..7)
0 120 120 120 120 120 120 120 
##$TP= (0..7)
150 150 150 150 150 150 150 150 
##$TP07= 0
##$TPNAME0= <>
##$TPNAME1= <>
##$TPNAME2= <>
##$TPNAME3= <>
##$TPNAME4= <>
##$TPNAME5= <>
##$TPNAME6= <>
##$TPNAME7= <>
##$TPOAL= (0..7)
0.5 0.5 0.5 0.5 0.5 0.5 0.5 0.5 
##$TPOFFS= (0..7)
0 0 0 0 0 0 0 0 
##$TUNHIN= 0
##$TUNHOUT= 0
##$TUNXOUT= 0
##$USERA1= <user>
##$USERA2= <user>
##$USERA3= <user>
##$USERA4= <user>
##$USERA5= <user>
##$V9= 5
##$VALIST= <valist>
##$VCLIST= <CCCCCCCCCCCCCCC>
##$VD= 0
##$VDLIST= <DDDDDDDDDDDDDDD>
##$VPLIST= <PPPPPPPPPPPPPPP>
##$VTLIST= <TTTTTTTTTTTTTTT>
##$WBST= 1024
##$WBSW= 4
##$XGAIN= (0..3)
0 0 0 0 
##$XL= 0
##$YL= 0
##$YMAX_a= 215705
##$YMIN_a= -228998
##$ZGOPTNS= <>
##$ZL1= 120
##$ZL2= 120
##$ZL3= 120
##$ZL4= 120
##$ABSF1= 10
##$ABSF2= 0
##$ABSG= 5
##$ABSL= 3
##$ALPHA= 0
##$AQORDER= 0
##$ASSFAC= 0
##$ASSFACI= 0
##$ASSFACX= 0
##$ASSWID= 0
##$AUNMP= <proc_1d>
##$AZFE= 0.1
##$AZFW= 0.1
##$BCFW= 1
##$BC_mod= 2
##$BYTORDP= 1
##$COROFFS= 0
##$CY= 11.3945322036743
##$DATMOD= 1
##$DC= 2
##$DFILT= <>
##$DTYPP= 0
##$F1P= 18.9103706918063
##$F2P= -1.10871071338519
##$FCOR= 0.5
##$FTSIZE= 0
##$FT_mod= 4
##$GAMMA= 1
##$GB= 0.15
##$INTBC= 1
##$INTSCL= 1
##$ISEN= 128
##$LB= 0.24
##$LEV0= 0
##$LPBIN= 0
##$MAXI= 10000
##$MC2= 0
##$MEAN= 0
##$ME_mod= 0
##$MI= 1.114404
##$NCOEF= 0
##$NC_proc= 0
##$NLEV= 6
##$NOISF1= 3.799351
##$NOISF2= 2.8
##$NSP= 1
##$NTH_PI= 0
##$NZP= 0
##$OFFSET= 15.70392
##$PC= 1
##$PHC0= -9037.76
##$PHC1= 10.00004
##$PH_mod= 1
##$PKNL= yes
##$PPARMOD= 0
##$PSCAL= 0
##$PSIGN= 0
##$REVERSE= no
##$SF= 200.130013532006
##$SI= 16384
##$SIGF1= 3
##$SIGF2= 2
##$SINO= 400
##$SIOLD= 16384
##$SREGLST= <1H.CDCl3>
##$SSB= 0
##$STSI= 0
##$STSR= 0
##$SW_p= 3612.71676300578
##$SYMM= 0
##$S_DEV= 0
##$TDeff= 0
##$TDoff= 0
##$TI= <>
##$TILT= no
##$TM1= 0
##$TM2= 0
##$TOPLEV= 0
##$USERP1= <user>
##$USERP2= <user>
##$USERP3= <user>
##$USERP4= <user>
##$USERP5= <user>
##$WDW= 1
##$XDIM= 8192
##$YMAX_p= 0
##$YMIN_p= 0
$$ End of Bruker specific parameters
$$ ---------------------------------
##NTUPLES= NMR FID
##VAR_NAME=  TIME,          FID/REAL,        FID/IMAG
##SYMBOL=    X,             R,               I
##VAR_TYPE=  INDEPENDENT,   DEPENDENT,       DEPENDENT
##VAR_FORM=  AFFN,          ASDF,            ASDF
##VAR_DIM=   8192,          8192,            8192
##UNITS=     SECONDS,       ARBITRARY UNITS, ARBITRARY UNITS
##FACTOR=    0.0002496,     1,               1
##FIRST=     0,             0,               0
##LAST=      2.0444736,     0,               0
##MIN=       0,             -228998,         0
##MAX=       2.0444736,     215705,          0
$$ Real data points
##PAGE= N=1
##DATA TABLE= (X++(R..R)), XYDATA
0@%%%%%%%%%%%Oj4J6j6K4l2L3m1N2o0P2q8J04j21J44j68J94k26K59k96L37l82
33b03M33m90N55o27P03p85Q76r77J089j210J340j484J642j811J997k203K429k676
51a402K945l246L582l953M369m841N379n999O725p586Q624r909J1548j3722J6756
66I270k1330K9109m5872J49383r2934n4993K07519j93414L9476J20156k02791
77e6421J0830K28213k57784j53836K07617n3017n6333K03046j38005j18270K64514
88H0554m0408k09500K06528O8682j18405J62257l0875k43274J82582J15334k35637
99f2162O5130J19167j81751N9737Q2680k51439N4025K43307j66357o2550J59711
110E9498j32253k1551J97229j54322q0819K69672n7704j77363J43136m1424j02590
$$ y = [0, 0, 0, 0, 0, 0, 0, 0, 0, 0, 0, 0, 6, -8, 8, -8, 16, -16, 17, -24, 28, -32, 40, -48, 56, -65, 79, -89, 105, -121, 138, -158, 179, -203, 230, -260, 295, -332, 371, -414, 462, -515, 574, -636, 704, -780, 862, -949, 1048, -1155, 1274, -1402, 1543, -1703, 1879, -2074, 2295, -2546, 2833, -3166, 3559, -4027, 4597, -5312, 6236, -7486, 9270, -12060, 17049, -28823, 120560, 27626, -27367, 180152, -13262, 26214, 146370, -56421, -45591, 182622, -75162, -228998, -21381, -74398, -130731, 72315, -65690, -183960, 80554, 40146, -169354, 37174, 105856, -12549, 149708, 118833, -124441, 58141, 173475, -62162, 2968, 122135, -59616, 121, 82801, -168638, -114613, 128694, -37663, -100213, 59498, -72755, -94306, 102923, -51399, -132218, 137454, 79750, -97613, 45523, 4099, -98491]
121i8491K16512l2192k07386J86672O2972k21975Q5384P1578j45404J48162Q3412
132A49244k61383M9512J69180j83270k372J50465j42260K2940J65831k08598p6121
143a66832K38276o5274q3614J75339p8952r0690J97394p8555j69776K11237M6713
154A35266j66209J02786j3432j79217J46298N3278k18720R9484J33211j79683
164h6938J8030Q5575j60883Q5849J86904j74012k5293J91540j09351n8361J46393
175I9453j03778k7625K13349j14217j72734J57745k0465j26961J36566l0557j34561
186a23785J75255N180k25208J07495J11497j20264R6306O1744j79629R3215J32700
197A34506j97928P308J77043j02464r552J01100j79092k8756K03304j09800j03324
$$ y = [-98491, 118021, 85829, -121557, 65115, 128087, -93888, -8504, 63074, -82330, 65832, 149244, -112139, -62627, 106553, -76717, -79089, 71376, -70884, -47944, 117887, -90711, -166832, 71444, 6170, -77444, 97895, 18943, -71747, 125647, 47092, -122684, 88553, 135266, -30943, 71843, 58411, -120806, 25492, 78770, -139950, -40466, 92745, -86938, -68908, 16667, -144216, -58367, 128537, -45475, -70768, 120772, 11421, -46940, 99453, -4325, -31950, 181399, 67182, -105552, 52193, 31728, -95233, 41333, 10776, -123785, 51470, 56650, -168558, -61063, 50434, -69830, 26476, 88220, -91409, 1806, 134506, -63422, -56114, 120929, 18465, 8913, 110013, -69079, -97835, 105469, -4331, -107655]
208a07655J70166m6332r2883J27486q7240j11046K17119K1689j71433J05543L0710
219E6124j32392J11026K5199j65050J33661J17354j91566Q1R2351j19983N7961
230a5234J18199j65149N322J73079j32004q3798J33168n9938j3209J59244j14672
241E008j17924J72710k2628j31788J22327Q876q7521J37360k8532j90435J21925
252a0622R5540j36662N9944O2467j32316P0890P2050j87824L4668J74708j03523
263f80k9706R3850j21622n714J53227j16862o5304J84809l8835j08125R5092n8933
275a8803p1973J74153j9786j51838J22669L6850j41460O6500K4756j10426J26651
286C7293P2528j84177K6642J08795j12564K0676R4347j12021L4225J33029j48016
$$ y = [-107655, 62511, 16179, -76704, 50782, -36458, -147504, 69615, 91304, -80129, 25414, 56124, -76268, 34758, 59957, -105093, 28568, 145922, -45644, -45563, 46788, -73195, -15234, 102965, -62184, -56862, 116217, -15787, -99585, 33583, -26355, -39564, 119680, 5008, -112916, 59794, 37166, -94622, 27705, 36581, -50940, 86420, 57888, -132547, -10622, 84918, -51744, 8200, 70667, -61649, 9241, 81291, -106533, -71865, 102843, -680, -30386, 63464, -58158, -63872, 89355, -27507, -92811, 91998, 53163, -54962, 40130, -18803, -90776, 83377, 63591, -88247, 34422, 71272, -70188, -3688, 21068, -89358, 37293, 109821, -74356, -47714, 61081, -51483, -30807, 63540, -48481, -14256, 118773, -29243]
297b9243o7657J45606m3645l5714J13678q5655o7817J48497n7174j32111J28821
308A7586L1974q4302Q7644l0362j34452J23722N7479j46186O2968Q8505j02749
319b8173L7051M0080j44653O0517J46395j18571l3305J06057q3233k0853R8750
330F0062j05317k9081J72563n6283j15820R1369k5376o0474J24116l1421j09038
341h4700J35009K7138j48369N3542M5001p9317R5966M0121j54097M9579R8596
352G8469j23212j897R2009p5976K8912R1263j38575l9981J42973n1123n2930J02198
364E2130m8858m4574J12310o9351j03400J35185K8527r3644O7596r273r7285R6889
376B6252K2342j30792P6654Q6959j05502J1934L9235j03885N4265J01882j15766
$$ y = [-29243, -96900, 48706, 5061, -30653, 83025, -2630, -70447, 78050, 20876, -111235, 17586, 49560, -34742, 52902, 22540, -111912, 11810, 69289, -76897, -13929, 74576, -28173, 8878, 48958, -95695, -35178, 111217, -7354, -40659, 65398, -17835, -38688, 60062, -45255, -74336, 98227, 41944, -73876, 17493, -7883, -68357, 55759, 24338, -84700, 50309, 77447, -70922, -17380, 27621, -51696, 44270, 84391, -69706, -20127, 78469, -44743, -46640, 45369, -30607, -1695, 89568, -49007, -88988, 53985, 2862, -50068, 52130, 3272, -41302, 71008, 1657, -101743, 33442, 61969, -31675, 35921, 26648, -70637, 26252, 48594, -82198, -5544, 81415, -24087, -12153, 27082, -76803, -22538, 79344, -36422]
387c6422q249J14485p7954l8511Q1735o9332o249J35970o9329r0474J05059j9311
399B1418p5034Q9972j7258p2576J12217n847j38278O6144N0823q3894O1242L5971
411D4900j07210N7474O7032j25287J3866J07069o3511O739P0106j01987j0801
422d1610J14313p4403n1158J11112l1611n7113P1807o0870o7263J23270j441r9362
434f4329P5469J7691q4155O1293R587q9615R3229O7615j14795J3592O0357p7047
446c1108K8870O3235r4889J8918J01354r5377n3300Q2008m1083j1628R0830o9557
458a1727n5144J10967k9419q7700Q1917J1738m7075Q3886k1961j08399Q3757M5414
470E6254r6555M1397M5945p5002M2845L1367j19037L0561J04124p2121j4023O4236
$$ y = [-36422, -44671, 69814, -8140, -46651, 35084, -34248, -40497, 95473, 26144, -64330, 40729, 21418, -53616, 36356, 19098, -53478, 58739, 52892, -85386, -19242, 31581, -52313, 8929, 44900, -62310, -4836, 62196, -63091, -49225, 57844, -5667, 1072, 71178, -30809, -41610, 72703, -1700, -52858, 58254, 26643, -30470, 41337, -19533, -86796, 36474, 35033, -64329, 11140, 28831, -55324, 5969, 15556, -74059, 19170, 86785, -28010, -14418, 45939, -31108, -2238, 60997, -33892, -14974, 86380, -8997, -62297, 19711, -21372, -33000, 57830, -11727, -66871, 44096, 14677, -73023, 8894, 20632, -26443, 57443, 35482, -72917, 10840, 56254, -40301, 1096, 47041, -27961, 14884, 46251, -72786, -42225, 61899, -10222, -24245, 39991]
482C9991o8824n77Q2107q1501l0657J20552k6936o5676N7109l7346m1075J00656
494D7823k2581q6591Q7194K2968q9604L7092J0785o2464Q4336L9425j12121K5440
506a8298O6606p4770P742N1546o7663L0345P9166r8758l9965Q9046l2485k2512
518c0000P1331m9988l0746R5658m3148q0419Q5429J8086n0572N9150j9479q1768
530e6466P5808K2294r8059M3925N3177o7808K4494K2183r1788M0121Q5930p5379
542b1568o440P5759n1654j1003O1704o5331j1981J06749m1110o6991O1050k4498
554D686m7936O8892k4454o3464Q5604Q136r4424L9299K7967n1336O1686K9183
566D3839q3821M3451N8637q3188L459O2855m7715J6173N3148q7232k0558Q1527
$$ y = [39991, -28833, -29410, 52697, -28804, -59461, 61091, 34155, -31521, 25588, -11758, -52833, 47823, 25242, -61349, 25845, 48813, -40791, -3699, 7086, -55378, 28958, 68383, -43738, -18298, 48308, -26462, -18720, 32826, -34837, -4492, 74674, -24084, -64049, 24997, -7488, -30000, 41331, -8657, -39403, 56255, 13107, -67312, 18117, 36203, -14369, 44781, 25302, -56466, 19342, 41636, -56423, -12498, 40679, -27129, -2635, 19548, -72240, -32119, 53811, -21568, -28008, 47751, -3903, -14906, 46798, -18533, -30514, 76235, 35125, -31866, 29184, 4686, -43250, 25642, 1188, -62276, 23328, 31464, -62960, -23661, 4306, -47030, 14656, 43839, -39982, 3469, 62106, -21082, -17623, 45232, -2483, 13690, 66838, -20394, -40952, 40575]
578D0575m8532l8224O9134k8065k8708O5495m7881n8954R1453J1076o0446N3805
590B0728M053n8340N8024N865q0637N9342N3955p4635R734K8789o6902L0448N4577
603D5001p7265O015P9013n7618k9411N2169m3865k488Q3554m9911n1098P5494
615B9590j7322n5639N4991r314l8057P6696q017q7595N0308L3956n7522L8335
627A0410K5358o1265M2582L6217q9991Q135O8133m4629M00M0725o5553m490O8579
640C4611n7183l3199P8532j4607l2074M8491l7367l7511Q3957l013o1821N6828
652B5644J5196n5941L5836r34o3104N9111L8806p9998J0123L7678n7242J4373
664b0452L9587o1589J8792P1694o0841k8919N8838k7672o859O3940m1103l1364
$$ y = [40575, -7957, -46181, 22953, -5112, -33820, 31675, -16206, -75160, 16293, 27369, -33077, 20728, 24781, -33559, 24465, 30330, -50307, 9035, 62990, -11645, -1911, 26878, -40024, -9576, 45001, -32264, -26249, 52764, -4854, -34265, 17904, -25961, -28449, 55105, 5194, -45904, 29590, 12268, -43371, 11620, 2306, -35751, 40945, 32928, -54667, -4359, 29597, -27925, 10410, 35768, -25497, 17085, 53302, -36689, -28554, 39579, -5050, -4650, 36075, -29478, -33968, 34611, -22572, -55771, 22761, 8154, -23920, 24571, -12796, -50307, 33650, 30637, -31184, 25644, 40840, -15101, 20735, 19801, -43303, 15808, 54614, -25384, -15261, 22417, -34825, -20452, 19135, -42454, -23662, 48032, -12809, -41728, 17110, -10562, -17421, 46519, 5416, -25948]
676b5948P4182k5407o1455N3145K458l6459N4976j4915p1455N3005K2736o7462
688d2599L1448L4807m7791L0484K3412p5589K0993O6291m9769m937M9415m4735
700h570n131N0088n5555j9308P9026k0814m3334M3824k2703l2562O0912j5068
712A0805n2534O3613J3800o2959K5708R556m5003N0124K4422p0417K4045M3947
724C5107n7988K122L9256m2138K0587N2757o3529k0317O3006k8995k2099N1466
736B9235k7637j9439O0452l5616n6619N9203R345m1167M0302o298n0933N0397
748A1225J0594o8150L6340M3674m5169J6187J8505n8876K5647N2172n6997l705
760a8553N6218l5973j4688L6015m5558p843P1199k9342m3243M8236j1648l4373
$$ y = [-25948, 48234, 22827, -38628, 14517, 16975, -19484, 35492, 20577, -50878, 2127, 24863, -42599, -11151, 23656, -24135, 6349, 29761, -45828, -24835, 41456, -8313, -13250, 36165, -8570, -13701, 36387, -19168, -38476, 40550, 19736, -23598, 20226, -2477, -35039, 25873, 10805, -41729, 21884, 35684, -27275, -1567, 7989, -37014, 13110, 37532, -32885, -8840, 35107, -22881, -20759, 18497, -23641, -3054, 49703, -13826, -34143, 28863, -132, -22231, 29235, 1598, -17841, 42611, 6995, -49624, 9579, 18924, -22243, 18059, 11761, -39172, 11225, 21819, -46331, -9991, 33683, -11486, 4701, 23206, -35670, -10023, 42149, -14848, -18553, 37665, 1692, -12996, 23019, -22539, -30382, 40817, 11475, -31768, 16468, 4820, -29553]
772b9553M4542j4449l7735O3154P162o4787K7219J8651l9760L5738J8184n6284
784b7918L0369L7919o2170j082M3003l2905J1283L9419n5523j0075N8049l5347
796d978k6681N1467j6368j8433M7088l3367m2835N9961L473m4656L9512M030m2028
809b3815L7886K218n7798M0942L7118n0581J1177K3807m7713J8591L7193n2353
821b3328O695N5894l9833j9499L7494l2842n940N6023l1907l0833N3108j4119
833A0913m1231L8910n459k8228N1254l261n6233L4918J8571m5645K5595K1094
845B1198m1428K7977K4503n9913P557M5691l5117J321L6249m0071l563M4877m1443
858a2162k0512N6271j3423k5448L6737k3723k9298N1603q331m3247M5224J0997
$$ y = [-29553, 14989, 540, -37195, 25959, 33121, -31666, -4447, 14204, -25556, 10182, 28366, -27918, 2451, 40370, -21800, -22882, 20121, -12784, -1501, 37918, -17605, -27680, 30369, -4978, -31659, 19808, 3440, -14993, 32095, -1272, -44107, 15854, 19327, -25329, 14183, 18213, -23815, 14071, 16289, -41509, -567, 36551, -14030, -2853, 20954, -26759, -8168, 29025, -23328, -16633, 39261, -572, -20071, 17423, -15419, -21359, 34664, 2757, -28076, 25032, 10913, -30318, 8592, 3133, -25095, 26159, 22898, -33335, 1583, 20154, -25491, 104, 21198, -20230, 7747, 32250, -27663, -20106, 25585, -9532, -8211, 28038, -12033, -15596, 29281, -12162, -32674, 23597, 10174, -15274, 21463, -2260, -31558, 20045, 11714, -31533, 13691, 24688]
870B4688m3304K4926K181m2550M0713K6038n3704J5516L1585m2466O541K7878
882A8042m0533J4523M7775m5750j8915M2957k4467j2008M2088k7020j8213N2428
894C0907k1100m3748L9802L121k6470L8390o338m4064L8783J2990n0836K2460
906f103K6464l2865K0056J5466n2524J4742M2253l9076k830L7864k8845l724L3131
919B4009l9935j2106N5855j6336k9064L4430j4722k4607M0508j3204l6033M7005
931A5800R293m4823K0309O689l3946L3776J6984m7983K1275L1537m3551J830K7320
944A4510l1858J4266L7611m4153j1856M3439k5228j6640L7185j9178j2917M3590
956B8771k4004l7673M1572K725k9553L1842j527l4630L4054N367m7692K6128K7354
$$ y = [24688, -18616, 6310, 8491, -34059, 6654, 32692, -21012, -5496, 26089, -16377, -9836, 18042, -22491, -7968, 39807, -5943, -24858, 18099, -6368, -18376, 23712, -3308, -21521, 30907, 9807, -33941, 5861, 8982, -17488, 20902, 14564, -29500, 9283, 22273, -28563, -6103, 20361, -12504, 7552, 23018, -29506, -14764, 27489, -11587, -14417, 23447, -5398, -9122, 24009, -15926, -28032, 27823, 11487, -17577, 16853, 2131, -22476, 18032, 4828, -31205, 15800, 25093, -19730, 579, 7268, -26678, 7098, 24082, -23901, -2626, 28911, -14640, -12810, 14510, -17348, -3082, 34529, -9624, -21480, 21959, -3269, -19909, 17276, -1902, -14819, 28771, 4767, -32906, 8666, 11391, -18162, 13680, 12153, -22477, 11577, 16944, -30748, -4620, 22734]
969B2734l4342J3950J5284m1146J4990L2546l9574R41M0474k6617r229K8254l0910
982a2645p318M7088k1076k5365L7664j0819k7524L0642r907k6467M2367K377m3251
995b4234K3286J1451l3130K4234J4649l6496K3983K4820m4197K897L0629k6867
1007h975P195K9483l6665m255L7988l0374j8183L7784j2814j4645L3516k2336
1019b281k7500M1499k953l1967L2097N124k9352K6657O34l9286K9414K3629l7077
1032a1362J1115J9230l4165J0651K2582l7194O901L9084k9449j2291K7936k3333
1044a0295n843L7160k2179j8134L9879j1170k9755K7187m603j9903L5232k881
1056A4695l7761K6950J1237l4939J7916J5191k8247K1528J7042m2375P088L0953
$$ y = [22734, -11608, 2342, 17626, -23520, -8530, 24016, -15558, -14617, 25857, -760, -9989, 18265, -12645, -19963, 27125, 6049, -19316, 18348, 7529, -19995, 10647, 740, -25727, 16640, 19017, -24234, -948, 10503, -22627, 1607, 16256, -20240, 3743, 28563, -15634, -12737, 17892, -8975, -1780, 27703, -8962, -13217, 24771, -5603, -23786, 13998, 1184, -13461, 20055, -2281, -29781, 11718, 8765, -23202, 8895, 14019, -15333, 11324, 11958, -27328, 2086, 25715, -11362, -247, 18983, -15182, -4531, 18051, -19143, -12242, 26842, -2607, -14898, 13038, -10295, -16138, 21022, -1157, -19291, 20588, 9418, -20337, 6850, 2247, -17656, 17576, 14695, -23066, 3884, 15121, -19818, -1902, 13289, -14958, 6570, 23612, -18763, -11675, 19278]
1068A9278k7337J683K6546k7818r56L0491l1593j4178L9070j1911j6660K8629
1080A5244j6368k0939L5731p530k9183L3603O763k9460K0594J063l1521K7324
1092E321J5856l6175J3291K1061l2050N099J9377k9887R371L2662l0319q952L0126
1105A4781k0232q895L0741j7835j1663L5834j4789k7916K7940j824k0869K7470
1117A2743k586k9614K6184O073l4873J7522J6791k4270J5121J3432l4418J0696
1129g199K6049k8825P20K8520k1695l178K3835k7684q311L5997j5097j7618K7264
1142A2778j0677j8769K6945r898k3050L3626M214l0362J8596N314k5716K1511
1154D512J0545l0765J7221K0454l2202K082J9415k3388P604K5222k8942m571K9562
$$ y = [19278, -8059, -6376, 20170, -7648, -8604, 21887, -9706, -23884, 15186, 3275, -13385, 15244, -1124, -22063, 13668, 6138, -23045, 10558, 17321, -12139, 8455, 9518, -22003, 5321, 21177, -14998, -1707, 19354, -12696, -7597, 11780, -18107, -8736, 23926, -6393, -15345, 14781, -5451, -14346, 16395, -1440, -13103, 22731, 7942, -19974, 7966, 6142, -14727, 12743, 10157, -19457, 6727, 12800, -22073, -4551, 12240, -12030, 3091, 16523, -17895, -7199, 18850, -9975, -9255, 19265, -2430, -5608, 18227, -9457, -17768, 18229, 3132, -14486, 12778, 2101, -16668, 10277, 379, -22671, 10955, 15169, -15193, 3403, 8717, -16999, 4512, 15057, -15708, 1513, 21967, -10235, -8153, 11262, -12126, -4522, 20700, -8242, -12813, 16749]
1167A6749k0795j2127K7193j3060q346K9518j6464k3451K9663j855k1566K3154
1179H613K75k2435K3329J380l2504J9766J6827k4723J0527J2545k7555J0233J9511
1192A5789k8811K532K8567j9729n281J9837k2403m353L0672j6457j5189K8270
1204A3444q568j8235K1910q116j7903K9850P86k8097J8576O437k4268J6565Q078
1217A0459k5169J7593J6036l0718K947J9618k0793N103K0861k4036r23K5874k1451
1230d599j1223K6630j0607q336K4557j4596j7898K6796m753k1271K2263K333k0294
1243a0998J8520J24k6846J9359J3067k4627J0144J3671k3464P712J4978k4589
1255a2949N540K5254j9925n267J9985j7435n112K3842j5025j0498K6615r602j9239
$$ y = [16749, -4046, -16173, 11020, -2040, -10386, 19132, 2668, -20783, 8880, 7025, -14541, 8613, 8888, -13547, 9782, 11162, -21342, -1576, 15251, -9472, 1055, 13600, -13955, -3722, 15789, -13022, -10490, 18077, -1652, -6933, 12904, -9499, -13852, 16820, 363, -14826, 13444, 4876, -13359, 8551, 435, -17468, 12382, 13168, -14929, 3647, 10084, -14184, 2381, 10459, -14710, 2883, 18919, -11799, -8852, 10766, -10027, -4924, 15937, -8099, -9022, 16852, -4599, -15822, 10808, 201, -8135, 16422, 1826, -16072, 10724, 5971, -15300, 6963, 9296, -10998, 7522, 7646, -19200, 159, 13226, -11401, -1257, 12414, -11050, -3338, 11640, -12949, -7409, 17845, -2080, -7347, 12638, -4797, -9909, 13933, -1092, -11590, 15025, 5423, -13816]
1268a3816K0274n282j5496K3714j301k3063J9326M898k3949J3242J0160j9797
1280a1090J4424J2046k6771O467J8556k1230K434J9564j8780l58J9841k1010q085
1293a3992K5073j0332j0805K0934j0332j4052K2309o784j8684K3261K886j8915
1305i433J4785J204k0313J6889R049k3470J1824J3759k1382L700J2346j9923O159
1318d806K0104k0285l921K0164j4740o805J9403j1753o846K3759j0446j7123J9308
1331F013k509j4110J8428j516j7762J8072K949k3510J2142J0311j7089J0516R285
1344A1220k2549P621J5406k0195J208J8748j4469j105J6169j8267m744K2626j0763
1357I06j0377J9339p342j2123J7964p235j4860K1060J395j8534J3363K923j7977
$$ y = [-13816, 6458, 1176, -14320, 9394, 8093, -14970, 4356, 9254, -14695, -1453, 8707, -11090, 3334, 15380, -11391, -4924, 13632, -7598, -5164, 14400, -4380, -4738, 15103, -5907, -13992, 11081, 749, -10056, 10878, 546, -13506, 8803, 2019, -16665, 6596, 9482, -9433, 5352, 6556, -13757, 3132, 12181, -11289, 535, 14294, -7088, -3388, 8958, -10965, -4806, 15298, -4987, -8908, 11256, -3484, -10289, 9114, -2639, -9485, 14274, 3828, -13295, 6013, 3504, -10606, 7822, 6306, -11456, 6616, 9565, -13945, -1803, 8508, -8581, 1935, 11220, -11329, -3708, 11698, -8497, -7289, 11459, -3010, -4115, 12054, -6213, -10957, 11669, 906, -9471, 9868, 2526, -9597, 8367, 1132, -13728, 7332, 8727, -9807, 3556, 6479, -11498]
1370a1498J3240O483j9736J1922J2301j9957L151J1757j6310N076J6117j7365
1382d819j688J8666j4323o935J7232r505n831J9162r786j3487J7893l266j4278
1395a0965J5849m6j4349J5310Q72j9652J2229Q996j6438R064Q789j7452O709J1253
1409A0169j8282K910J7054j3693k194J4176j4498l677J7600j0802q156J8212o521
1422B298j1897J4813n393j1471J8055p5j5851J3236L535j6363J0614N492j5463
1435h470J0909R249j8650L650J1442j4350K682J2805j4145O3J5014j4006o009
1448i816J6050p772n424J5403p616j0012J5991l977j2846J4982J175j2291J1920
1461E767J96j5876J1475O203j5402P532Q329j4564M576Q416j5344L415J4598j2904
$$ y = [-11498, 1742, 8225, -11511, 411, 12712, -7245, -4094, 7663, -8647, -3571, 12546, -4819, -6507, 12159, -2164, -9099, 8133, -1372, -7203, 11959, 2173, -11314, 6579, 3313, -10965, 4884, 4838, -9511, 5799, 6671, -12981, -752, 8244, -8194, 870, 9659, -7793, -1084, 10169, -8113, -5203, 11851, -1842, -4036, 10140, -4358, -8035, 9565, -1237, -9393, 8819, 2298, -9599, 5214, -179, -11650, 6405, 6330, -9521, 3715, 7250, -9113, 1501, 6993, -8470, 2439, 11688, -6962, -3312, 8130, -6220, -3538, 9267, -4878, -4815, 10199, -3807, -9816, 6234, -1538, -6962, 8441, 825, -9187, 6804, 2827, -10019, 4963, 6138, -6153, 5767, 5963, -9913, 1562, 7765, -7637, -105, 8224, -6340, -1764, 6652, -8692, -5277, 9321, -3583]
1475c583j538J3021j1411k863J4248r497n275J6533o071j0473J2608m184r325
1488g810J4050j446j3276J2211K213j5111R085M687j2735Q996O759j5491M855
1501c013R868j2562K097J1540j1218N71J2523j2393m335J4454p487n405J2992
1514G632o610q038J3019m736j0684J2893Q69j1144R813P46j2646R908M598j3281
1528g661P701P512j2348L741P536j2281L132J1431j1121j001J1159r429l727J1493
1542F137p724l994J3269o079q710J1175l073q681J1444p70j0298J0803J143j2832
1556h190Q345M456j0434P305N719j2544M838P918j1987J828J0072r511m9R631
1570G397j0328l230J1872p176m866J1602n255o416J0629m110q461J1935M11r695
$$ y = [-3583, -5121, 7900, -3511, -6374, 7874, -1623, -6898, 9635, 3564, -6909, 5699, 1515, -7810, 6240, 4794, -8482, 3729, 5942, -9169, -84, 4603, -8132, 864, 7623, -7868, -3013, 6855, -5707, -3610, 7930, -3288, -2717, 9806, -2587, -6922, 7532, 45, -5360, 7632, 1022, -7016, 6003, 1267, -9417, 3476, 4345, -6799, 3014, 3760, -8886, 1022, 5620, -7661, 40, 7552, -4796, -1055, 6481, -5800, -2668, 8763, -2358, -3359, 7800, -1629, -5356, 6137, -1587, -5581, 7688, 1609, -7101, 4074, 1001, -7680, 3764, 2994, -7304, 3499, 4642, -8190, 155, 4611, -5823, 1482, 7201, -5343, -505, 7413, -4574, -2746, 7326, -2185, -2234, 7397, -2931, -6161, 5711, -1465, -6331, 5271, 16, -6400, 4229, 119, -8342, 3593, 4004, -5691]
1584e691R056J325j0695Q296K913j0853O957O125j1053K606O453j0848K941Q723
1598F255j0009j87R856q489l284R922n855k984J1074n023o947J0525k906p617
1612e669R776q67p934Q957J59j0820P157L022r117N670M798r927L655O605j0884
1627e419K109Q795p719j87Q095p821k065R874o456l789J0043m045n740Q613l447
1642H41o747R160o1q762Q032Q32q961O290K597q842O088N114r736K826O103q977
1658d203K422P084p888K86Q331p517k691Q216n007k891R089m525n311Q478k694
1673A179o489P674j10o983P968j51q620N812L161q218N071M367q365L547M770
1688D613q736J943P166p103M33P129p334j371P480n432l161R078l980m672P188
$$ y = [-5691, 3365, 4690, -6005, 2291, 5204, -5649, 1308, 7433, -3620, -1014, 5439, -5409, -2468, 6255, -3754, -3941, 5915, -2574, -5858, 4064, -1791, -4775, 6299, 1276, -5671, 4854, 1948, -5669, 4107, 3240, -4694, 4263, 4422, -6398, 759, 3781, -5336, 334, 5132, -4795, -1140, 5465, -5419, -3310, 5485, -2234, -2421, 5674, -2147, -4212, 5662, -794, -4583, 5460, 1415, -4325, 4288, 841, -5906, 3254, 3193, -5569, 2463, 3295, -5666, 624, 3221, -5621, 467, 5581, -4155, -1329, 4774, -4203, -1781, 5303, -2585, -2299, 6032, -1485, -4176, 4040, -967, -3858, 5231, 706, -4605, 3873, 1179, -5310, 2364, 2254, -4729, 3239, 3088, -5532, 280, 3441, -4777, 294, 4661, -3704, -157, 4613, -4123, -2180, 4986, -2117, -1684, 5445, -1889, -3260, 4220, -1212, -4373, 4705, 725, -3947, 3241]
1703C241k763n816Q380j165o717P207R34p880N514K308p700N142M152q322L094
1718c91M622p247J523N762o440L35O785o562j995P057m577k281P534l864m087
1733c826P230k533n363P098n43n801O320K94p111N410J886o912M050L694o940
1748c047K543M244p420J604O048o214J91N999n305j324O220m542k381P542l037
1763A121m286O215k207m601O160m17o034N953P70o759M442J822o532M636L081
1778C364o338K176M276o028J033N121n517P82N593n481j547N836l516k536N997
1793C215l089l496N966k253m763N740M0m745N280J54n722M649J636n815L173L595
1809C565n661K274L090o060J585M858n356j27N281m698j174N208m133j671O265
$$ y = [3241, 478, -5338, 3042, 1877, -4840, 2367, 3301, -4579, 935, 3243, -4457, 685, 4837, -3485, -391, 4231, -3016, -1493, 4269, -2171, -1836, 4949, -1613, -3608, 3449, -1128, -3409, 4125, 261, -3826, 3404, 871, -4492, 2606, 2063, -3738, 2582, 2876, -4235, 1175, 3061, -3851, 199, 3893, -3047, -504, 3740, -3680, -2076, 3972, -2242, -2051, 3948, -1357, -2681, 3539, -1003, -3384, 4158, 1121, -3165, 3050, 843, -3758, 2402, 1985, -4049, 1904, 2674, -4085, 357, 2179, -4353, 283, 3364, -2974, -798, 3478, -2550, -1517, 3604, -1913, -1131, 4462, -1019, -2566, 3270, -246, -2782, 3215, 126, -3370, 2596, 343, -4420, 1320, 1360, -3385, 1895, 2049, -3673, 976, 2612, -3203, -30, 3565, -2096, 178, 3268, -2792, -1207, 3651, -1705, -1832, 3449, -1249, -2423, 2785, -1348, -3019, 3246]
1824C246l000l123N182k124l299N077n46m538N055O03n632L575J547n147L490
1839C66K769n994K510L475n064Q96L789m369M55M721m815j119N196l439j820N094
1855B651k933k288M995k285l565N071k14m266M372M10m599L588J187n137L203
1870A90K634m576J349K971n048J251L919m369l61N001l848j264M408l351j289
1885b383N138k495k751M703j366k973L972q36l562M363M4m617L085J328m118K639
1901A71J891m639K221L033m801P87L743l767N08L756l887p00M577l398j858M714
1917B351j962k397M165j678l505M554k06l962L532N07l704L232M69m305K919K324
1933B334m087J606K207l657R08K996m087K66M090l112j054L446k643r19M005k279
$$ y = [3246, 246, -2877, 2305, 181, -3118, 1959, 1413, -3125, 1930, 2533, -3099, 476, 2023, -3124, 366, 3135, -2859, -349, 3126, -1938, -1042, 2747, -1622, -1167, 3554, -1261, -2380, 2816, -623, -2443, 2651, -282, -2570, 2425, 140, -3425, 1646, 1432, -2834, 1538, 1948, -2651, 937, 2124, -3013, 190, 2824, -1752, -403, 2568, -2480, -1229, 2690, -1679, -2040, 2961, -887, -2151, 2257, -1094, -2383, 2755, 260, -2491, 2212, 846, -2127, 1845, 1009, -2553, 1810, 1854, -2763, 322, 1650, -2468, 171, 2062, -2577, -356, 2677, -2124, -1337, 2406, -1361, -853, 2903, -984, -1684, 2893, -505, -2363, 2351, 389, -2008, 2157, 479, -3026, 1528, 1322, -2640, 892, 1399, -2305, 927, 1396, -2909, 10, 2334, -1753, -147, 2060, -1597, -689, 2307, -1780, -1514, 2576, -536, -1590, 1856, -787, -1706, 2299, 20]
1949B0k472M326j128k984L561n93k901L728N7l923K466J709l944J894K016l790
1965a958K043K182m026N92L358k928j21L017k814m40L594k940j586L718j559j605
1981a473L230j355k505L854r91l457L442R99l453K204O05l538K548K018l597J269
1997b00K170k851K24K367k938K00L382l097r38L345k110j092L214j880j603L492
2013A685q09l031L111j88k544L079n63k833K617J097l427J363K090k912J636J337
2029A708l211P94K931l250k62K912k051k90K657k558j226L501j198k095K787r19
2045B30j804K869p45k862L038Q10k931J474J144k837J918J324l132J218K256l121
2061a151L27K134k452P96K309k791m33K972j621j262K232j086j454L345j394k391
$$ y = [20, -2452, 1874, 746, -2238, 1323, 730, -2171, 1557, 1614, -2309, 157, 1866, -2078, -184, 1832, -1958, 85, 2267, -1759, -1167, 2191, -737, -858, 2159, -655, -1095, 2499, -441, -2027, 1691, 132, -1473, 1757, 402, -2103, 1751, 760, -2697, 745, 1744, -1709, 495, 1100, -2438, 110, 2128, -1469, -200, 1970, -881, -657, 1710, -1228, -1028, 2354, -743, -1681, 1664, -446, -1538, 1676, -204, -1807, 1685, 876, -2155, 956, 768, -1776, 1303, 740, -2093, 524, 1621, -1806, -443, 1647, -1265, 371, 1708, -1503, -709, 2222, -1028, -1290, 1622, -429, -719, 1938, -620, -1846, 1655, 457, -1638, 1149, 230, -1574, 1295, 550, -2312, 726, 1536, -1395, 79, 1223, -1614, 304, 1628, -1504, -286, 1970, -1151, -824, 1310, -1142, -346, 1963, -828, -1261, 1711, 90, -1172, 1060, -26, -1480, 1865, 471, -1920]
2077a920K614J16k282K268L5k321K394M20l512J859J891k492P97J618k809R28
2093c96K174k498l51K465j703p07K326j815q59K891j345j824K685k96k048K077
2109G76n27j946K875J47k660J604N70k184J411R36k613J662J633k594J74K154
2125A418j841M3J836k209l57K520j510j279K178r93o82K044q46j897K617l91k126
2142a475J664P56k065J633M64k627J618J093k118Q61J306j831M13J547k204k34
2158a199K620j477q25J862j163p56K057j108j464K424m83j555J607j55j543K053
2174H95J47k466J732R27k344J098P55j529O94J770k615J03K049j964jJ326j327
2191g50J04J957j510p75J859o16j210J833o51j271K137l21k212J723N68j663J258
$$ y = [-1920, 694, 810, -1472, 796, 831, -1490, 904, 1324, -2188, -329, 1562, -930, -133, 1485, -1324, -396, 1778, -720, -1071, 1394, -309, -1016, 1310, -505, -1364, 1527, 182, -1642, 1043, 747, -1301, 776, 249, -1697, 1178, 1325, -1335, 269, 839, -1345, 66, 1002, -1611, 51, 1684, -910, -736, 1418, -423, -380, 1456, -753, -1110, 1410, -100, -1379, 799, -194, -876, 1168, 322, -1575, 1042, 651, -1475, 189, 945, -1120, 513, 977, -1650, -32, 1061, -1057, -196, 1110, -721, -308, 1239, -965, -1199, 1421, -56, -881, 981, -182, -938, 1119, 11, -1453, 971, 488, -1067, 540, 385, -1158, 895, 1042, -1424, 308, 1235, -1109, -11, 744, -785, -91, 1679, -936, -833, 1216, -748, -749, 577, -750, -646, 1311, -199, -974, 885, 269, -941, 892, 241, -1030, 1107, 786, -1426, 297, 865, -798, 460]
2208D60M82k535J760J064k309L95J756j566K82J350j921L04J963j421j041J858
2224H81r41r78J920j206q14K190m84j722J424J44j181J332k78j753J598Q23j973
2241a018P44J179j769P90J172j712K79J508j595q8J193r63j10J738j586r73K419
2258A208q92j466J920n02j341J617j63j690J475L55j375Q63P02j255L32Q90j841
2275a163R91J395j623K17J005j257j3J386j389k11J906j378o41J309p41n95J788
2292I86o99j478J660L80j571P07O64j384J487L12j862R20P25j165m2J349j445
2309d56K95J162j629k41J623p63n35J049o40o50J772r14r81J653j29r57R80l46
2327B93j425J596M38j737Q75P49j657P40P71j700R10J285j795J05J438r94m15
$$ y = [460, 942, -1593, 167, 1231, -1078, -683, 1073, -493, -211, 1139, -782, -478, 1485, 64, -977, 881, -60, -1038, 882, -324, -1138, 1052, 568, -1154, 270, 414, -767, 565, 287, -1466, 132, 955, -1018, -274, 905, -864, -74, 1098, -614, -335, 1173, -422, -510, 683, -280, -390, 1348, -238, -1211, 1208, 316, -1150, 770, 268, -1073, 544, 381, -1309, 166, 521, -854, 9, 711, -544, -212, 678, -1163, -172, 1223, -400, -183, 822, -435, -448, 938, -451, -662, 1244, -134, -775, 534, -207, -802, 986, 287, -1191, 469, 849, -722, -15, 649, -735, 752, 1064, -798, 122, 847, -318, -360, 989, -456, -161, 1001, -628, -869, 754, -9, -544, 505, -135, -785, 987, 73, -908, 745, 616, -341, 639, 293, -1132, 464, 902, -835, 40, 789, -868, -128, 643, -1057, -147, 1138, -657, -552, 886, -108, -523]
2344e23J324j154k08J535o92j058J348l61r05J339m34q73J208J08j415P64M39
2361D42j018Q07N76j324M30P15j035q1J111q77K48Q16j228k95J421r18l24J174
2379F40n51n30J179p21q21J561l91r37P14K31j023P63K30j300Q94O75j002k07
2397e96Q84p18L47P73r79l15J718j290m36J195r03n0J301p42j000J279k83j071
2415h86Q41K35r08J125m1j080N37R15j142P15M33r48J94Q71j286M4J005o92k83
2434c51O92q26J34R71p56m88J238l63p96R02o93m01J278k89j035R61K75j010K00
2453c57Q49r90O10P50j245rQ98q52M71K63q47L22R31r92j91P35k90n14J033o42
2473f7n60J135n94p83J154k5m50L76n8o42M75Q32j213N02M90q05K42L42q42K28
$$ y = [-523, 801, -353, -561, 974, 282, -776, 572, 211, -694, 645, 211, -662, 546, 654, -761, 3, 442, -576, 231, 807, -517, -87, 628, -407, -488, 623, -254, -6, 810, -418, -713, 708, -210, -534, 640, 89, -441, 738, 17, -804, 757, 366, -571, 143, 374, -649, 114, 344, -956, -62, 613, -389, -596, 288, -430, -83, 690, -289, -604, 1114, -176, -612, 583, -320, -370, 931, 189, -811, 468, 185, -886, -45, 190, -718, 407, 366, -714, -177, 738, -404, 311, 744, -204, -10, 861, -425, -381, 624, -68, -351, 341, -485, -351, 620, -136, -624, 614, 251, -545, 357, -336, -737, 541, 252, -783, 178, 453, -557, -357, 492, -498, 112, 862, -383, -392, 506, -346, 125, 388, -459, -137, 794, -198, -389, 346, 56, -458, 575, -67, -627, 508, -86, -869, 285, 260, -190, 186, 128, -514, -39, 793, -420, 82, 572, -233, 9, 351, -491, -263]
2493b63Q33k78m70L12l79J37M71l72p83J305o4q16O27k76l65Q17l22p50Q46J54
2513C64o14K60M68j027N65L24q71K61J103q14n86J018p40J95Q32q59m20Q31j62
2532A28r87J336j79o94M81j8o12M88M44p77M42N36q28K08N78q00J85Q50o17k17
2552e3K77n30L1Q63n46m99O57k75l86L85M3m26Q79k00p66M92K70m75M25K25p11
2573c20K63N88j072L45M31l95J7O99p83j03P86n90k68R23m27l57O02m84l57Q57
2593C55m60l96O67K31p71N02l03o20Q35J68p26M94L69q49K40N64n10NJ054p16
2613A33n63P72l46k88R37n24o48J166p29n38N06J48n08O35L33r02M36K56p38L52
2633a10O81p93K91O48j193j4J094q41J5M97m87j63P30o17p1N69J52o77Q32l60
$$ y = [-263, 570, 292, -178, 134, -245, -108, 363, -9, -792, 513, 449, -367, 260, -16, -381, 436, 114, -636, 210, 364, -250, 10, 478, -549, 16, 340, -531, -270, 833, 19, -567, 451, -289, -94, 738, -121, -541, 290, 128, -859, 477, 298, -396, 85, 67, -545, -57, 387, -390, 52, 588, -240, -32, 546, -254, -69, 781, 164, -53, 224, -306, -275, 588, 42, -457, 200, -75, -461, -76, -33, -459, 420, 220, -546, -54, 216, -259, 166, 391, -320, -57, 531, -541, -196, 235, -160, -143, 556, -227, -330, 456, -134, -402, 521, 94, -263, 339, -145, -502, 355, -105, -501, 166, 397, -374, 128, -175, -795, 40, 208, -518, -24, 345, -504, -264, 300, -210, -205, 849, 133, -430, 342, -4, -292, 645, 121, -527, 639, -90, -628, -122, 26, -482, 153, 486, -416, 20, 276, -462, -110, 571, -222, 69, 717, -476, -490, 604, -237, -222, 275, -212, -375, 355, -262, -333, 236, 388, -289, 543, 183]
2653A83o57O53J01p81P72J94r63O52J79p95M88K17l72L3P22r34kQ31p82J74Q78
2674G91j061j92O72m59j22P66l10l53O10o5r06M45K05n62P33J20r62P64M05j071
2694e52L68O59q43K25M48r22N82O63p45r8P79p15k82P73m87j33P85l42n47Q12
2714D28J81j011O45O4o82P04L54j087J52P44r72L29O55j073M08P88j006j1Q14
2733D24o12l37J123m35l70P43m09o04P31K19j146J145k13r45N01N41j039O44N69
2752E30p50m6P54r92J55O73n38K84N67q59n9P88p03j22R17n16o27Q79k95n56Q47
2773C31k75n12R32j86r15P05K78j012Q78K46q65L28M14q55L22O91p32J48N80o94
2793a93l33Q12l66r9P48n44n11J071p23k78P79j16o38P66j93p98Q17N98j384P92
$$ y = [183, -474, 179, 280, -501, 271, 465, -498, 154, 333, -462, 26, 243, -129, -96, 626, -308, -310, 521, -261, -87, 791, -270, -462, 210, -249, -371, 395, 85, -268, 342, 277, -629, -184, 21, -541, 192, 312, -650, 114, 519, -552, -184, 475, -368, -143, 305, -617, -35, 628, -117, -215, 564, -151, -433, 340, -147, -280, 505, 163, -384, 428, 609, -402, 243, 307, -375, 329, 683, -404, -252, 492, -480, -151, 504, -569, -161, 627, -379, -390, 424, -188, -525, 598, 163, -207, 536, 127, -477, 254, 473, -673, 472, 259, -686, -185, 356, -683, -39, 530, -220, -266, 488, -504, -349, 324, -214, 70, 637, -222, -281, 507, -196, -318, 599, 83, -544, 335, 40, -516, 331, 56, -456, 476, 290, -625, 80, 358, -654, 224, 470, -395, -67, 347, -508, -186, 505, -227, -79, 501, -193, -526, 286, -80, -179, 569, 25, -486, 585, -138, -416, 363, 247, -391, 375, 182, -616, 201, 799, -585, 207]
2813B07K92j100O95M56r85K3J025j025L40Q18p85j63P60o14n0M91k86n72P72k76
2833B3q18R50l0m14P01O5j167O36J96o77O56L29r40M14O74r97M9J253j278k6R71
2854E70p20m28J191p03o29J234k16q92R80k70q30J355l98o95N51L50r54O83Q3
2873B62j017P48N99r72M00O04j096J5J122j022R5Q36j085J08R47n94m32J001m56
2892F3m88R45k47q84R25k58o84P95J23r78J061J25r30M58O36j170M33P39j085
2911d21M48N68q94J22Q93j047k19J000l58k10O94n80o01J277j62j147J028q9q81
2930e79Q53o4j005P12N78j338J033N93j197M19O99j372N21R08j171K98O22r23
2948d13p2J057q46l49J375r24l07Q35p9r58R78Q6r21R33n3j376J277M04j336Q23
$$ y = [207, 499, -601, 94, 550, -435, -412, 613, -412, -72, 746, -39, -202, 558, -56, -106, 385, 99, -473, 299, 23, -795, 155, 125, -289, 412, 477, -690, -54, 142, -535, 121, 450, -490, -76, 598, -399, -350, 903, -375, -401, 570, -150, -578, 613, -90, -719, 515, 299, -593, 387, 117, -713, 642, 244, -451, 100, 450, -504, 179, 262, -755, -7, 592, -380, 20, 624, -472, -457, 665, -357, -262, 574, -511, -403, 544, -50, -482, 519, 63, -425, 520, 273, -611, 314, 56, -628, 167, 290, -688, 373, 498, -432, 26, 662, -508, -75, 664, -421, 27, 595, -299, -177, 716, -331, -550, 450, 92, -118, 576, -4, -605, 672, 510, -637, 391, 302, -579, 274, 210, -795, -83, 495, -843, 190, 783, -414, 5, 704, -668, -147, 761, -410, -112, 510, -413, -485, 572, -274, -623, 752, -172, -479, 356, 277, -681, 297, 383, -538, 395, 342, -1034, 243, 647, -689, 134]
2968A34N93j286M18R32j462M95R11j250J83J113j007j49Q16p77l34J110m66o90
2986g16J189k45r01J042J0r61J225k8j337O89O17j015N23M44q93L34P81j372L64
3005b50Q28r20K43N57o79j32R90p43m87J503p76n68Q90k22j130J459n28m37Q65
3024D63j06j021N78N02j056Q91K15p96l0J019j066L1J202j226M71P03j227K53
3042b00R22j136l24J276o10k94J036n85j028J276M4q81R35M1j213R38K07j153
3060g49Q77N67j475P40M47q50N9J232j096OJ031q70l52J264r42o01J435n46r21
3079g44J384o04r26J398n10o43J186k46j025J026O5j075N95Q33j225N26O31j486
3097h40O48Q25j255M7J297r93k78J303j054l28J137l54m48R45l48q70J123k20
$$ y = [134, 727, -559, -141, 791, -671, -176, 735, -515, -332, 781, -226, -375, 441, -336, -670, 440, -26, -716, 473, 228, -673, 369, 379, -582, 643, 615, -722, -33, 584, -431, 92, 536, -357, -23, 758, -614, -250, 578, -342, -99, 458, -221, -353, 637, -106, -593, 910, 134, -434, 456, 234, -896, 563, 35, -402, 463, 357, -664, -86, 416, -640, 251, 466, -330, -360, 659, -407, -376, 826, -400, 71, 774, -453, -200, 722, -414, -738, 538, -72, -366, 670, 85, -943, 333, 377, -504, 431, 472, -741, 197, 404, -749, 128, 695, -780, -40, 407, -443, -384, 848, -248, -242, 789, -81, -433, 831, -111, -712, 723, 177, -744, 640, 36, -890, 508, -2, -645, 541, 295, -730, 296, 361, -714, -119, 714, -511, 15, 646, -840, -192, 633, -622, -575, 722, -271, -549, 754, -300, -628, 509, 155, -293, 652, 304, -566, 557, 337]
3115C37j057J164J27j218J031Oj300R67M83j402R06P82j411L00R19j310L51J030
3133G05r87k57J410j052l26J397r09o76J381m94j084J440m50q96J256k17j109
3150h68J149L92j552J075K23j091O36N89j128K54J183j537J68J383j004l11J192
3167G53q05o87J759r29p36J485p24q63J333l50r76J318j44j320J003L09j117P93
3185A02M34j326Q06Q27j311L82P72r42K06J072j151m00J412j025m81J213p15m08
3203e33J230n57j103J462k06j175J278j62r57J209O7j644J469N68j447P67M62
3220G28j373L20R98j028J27J010j393J82J142j151k70J564j044o25J334n65j133
3237a177J678o1j395J376K94j472J011M24j290N76N20r38M45P57j632P07R16j283
$$ y = [337, -720, 444, 571, -647, 384, 390, -910, 57, 540, -862, 44, 826, -585, -285, 634, -676, -325, 705, -282, -539, 871, -181, -507, 890, -19, -695, 686, 192, -892, 548, 98, -798, 458, 241, -868, 281, 673, -879, 196, 419, -672, -36, 553, -575, -321, 862, -675, -507, 876, -128, -439, 753, -52, -739, 1020, 91, -645, 840, 116, -747, 586, 236, -740, 578, 434, -886, 117, 426, -691, 102, 536, -790, 16, 843, -468, -86, 686, -256, -50, 1022, -129, -529, 883, -142, -623, 590, -125, -533, 697, 140, -963, 499, 293, -882, 396, 234, -723, 486, 553, -1091, 378, 946, -501, 266, 728, -645, -325, 673, -355, -228, 782, -611, -429, 713, -438, -708, 856, -188, -813, 521, -44, -1177, 501, 440, -955, 421, 715, -757, 254, 678, -612, -36, 484, -454, -9, 748, -884, -177, 739, -544]
3255e44J2J428j337Q5R87q66l39J417r15p47J741q20o89R90j87j054J281j43j120
3274h20J411m46j229J150N12j345O20P66j441O10R86j059M1J017j196o5J494j104
3292i8p24J500n09p11J186m60j041J609n67j154J380K9j367J126K72j354J008
3309A25L12j211Q53P20j473L03J153j199O1J069r25L9J402j354p12J803q74p04
3327f12J617r81o91J350o28r12J545k41j236J259m7j448J258K90j153M21J140
3344I31j699O68J170j487K28J316j633r4J408j160j21R87o18n47J482q66o73J460
3362G52n08j110J316p3j186J074N86j842J422K31j321O98P02j530O53P68j248
3379f16J87J272j323j18J207p37l57J175q46n66J506n80j099J722p95p13J338
$$ y = [-544, -532, 896, -441, -356, 631, -235, -574, 843, -72, -819, 922, 102, -587, 403, 216, -838, 443, 300, -820, 591, 145, -1084, 66, 578, -767, -147, 619, -822, -212, 774, -285, -244, 773, -423, -488, 1006, -98, -822, 678, 169, -542, 644, 184, -857, 752, 185, -969, 411, 440, -927, 199, 471, -883, 125, 437, -774, 79, 799, -674, -371, 782, -417, -356, 713, -212, -173, 1229, -125, -837, 966, 92, -612, 1005, 24, -667, 683, 55, -857, 688, 447, -789, 470, 423, -1025, 233, 523, -630, -209, 931, -768, -100, 1070, -417, -189, 1127, -506, -600, 808, -352, -473, 514, -104, -651, 831, -35, -708, 752, 244, -866, 450, 377, -809, 265, 851, -991, 431, 662, -659, 39, 741, -789, -136, 632, -616, -429, 843, -480, -598, 609, -128, -485, 690, -156, -722, 784, 204, -895, 827, 32, -681, 657]
3396F57k73j289J228L18j505J166J78j351P90O19j291N02Q33j065L65J299j914
3413g33L62J319j331o7J413j030o07J541o61r59J267m04r51J270J35j221J140
3430D83J56j560J333L76j697R29Q64j392M58Q13j156O2J351j749P0J442j108l12
3448f37J661j138o70J703r32o50J206l74r39J356k04j516J712K41j646J072L58
3465F03j635J129Q11j389L37Q96j411L64J142j476L66J092j259k90J288o49n98
3482f79J495p74o97J335p3j488J623m26q88P97L16j573J172M03j530J175O03j635
3500h44L87J346j576L79J319j359m57J736j358k2J055n94q45J786q68j026J754
3517H13q53q13J523k05j297J195Q2j269R11K49j125J136O16j726M73J339j671
$$ y = [657, 384, -905, 323, 641, -864, 302, 480, -871, -81, 538, -753, -251, 582, -483, -118, 1181, -733, -371, 948, -383, -450, 963, -67, -674, 867, 206, -753, 514, 110, -841, 429, 564, -657, 483, 639, -921, 412, 788, -909, 20, 884, -508, -50, 763, -393, -331, 1020, -729, -659, 783, -325, -637, 1024, -114, -784, 919, -13, -663, 543, 169, -770, 586, 382, -1134, 578, 819, -827, 245, 603, -1032, 97, 908, -481, -144, 752, -659, -295, 847, -629, -263, 829, -430, -720, 568, -81, -679, 816, 42, -655, 680, 607, -881, 742, 316, -572, 225, 541, -1032, 140, 543, -987, 188, 791, -844, -457, 889, -687, -308, 1011, -348, -805, 931, -427, -449, 606, 12, -833, 953, 85, -941, 813, -40, -853, 670, 465, -832, 363, 445, -824, 87, 336, -789, 347, 963, -763, -290, 1049, -622]
3534f22O20O81j203L10J121j350l7J342j016m04J445q05q06J455m47j350J406
3551C40m2j164J193J7j166J125M00j655J247N59j644O73Q33j363P98N65j202L5
3569d51J438j263j0J373j349k49J128o34o93J547o67r49J155M8j470J525j36j363
3587a020J088Q93j803J186K18j337O66Q92j280L12J158j765M49R64j071n8J234
3604G26j299k46J653r64q26J533k07j528J901m31j320J132K57j228J142L22j529
3621i12J314L10j364Q21N70j491M18Q32j126J85J414j302l37J502j117n38J672
3638H51j020m35J279m20r47J265o4j213J343k59j141R29M56j450J032K99j472
3655i67Q28Q51j329L54J168j561R5J255j199J47J377j101m11J199p35p46J355
$$ y = [-622, -2, 679, -524, -214, 907, -443, -480, 862, -154, -558, 887, 82, -724, 731, 284, -1066, 340, 298, -866, 327, 344, -822, 303, 703, -952, 295, 854, -790, -117, 716, -647, 151, 716, -486, -451, 987, -276, -286, 1087, -262, -511, 617, -17, -710, 837, 170, -779, 376, 424, -1046, 479, 343, -1020, 68, 961, -842, 344, 562, -775, -109, 783, -497, -185, 973, -792, -343, 621, -450, -508, 726, -573, -819, 834, -130, -956, 577, 370, -1158, 743, 312, -1008, 124, 381, -847, 295, 617, -912, 402, 712, -652, 169, 739, -752, -334, 498, -628, -443, 971, -331, -668, 834, -283, -821, 851, -169, -604, 675, 255, -692, 573, 509, -704, 639, 380, -761, 168, 624, -826, 206, 505, -967, -139, 712, -617, -263, 905, -656, -561, 694, -505, -358, 1019, -82, -493, 706, -29, -775, 580]
3672E80m00o99J199l73j035J046J83j437J335P5j365J208K48j423R76P16j572
3689g38O17Q53j353L13J162j139m9J323j110l32J287q23o97J172o40q06J435l19
3707A56j044J278j17j311J261K22j239Q56Q18j546R05N45j365O97P34j397L63
3724a84R64j183K6J301r67l77J331j142l86J113l20j150J408k41j303J755J67
3741H12j637J328J74j542J347j6j274P68R31j450M43P11j109o4J452j464k3J519
3759I06j116k97J412j123o77J501o59p58J393l36j353J741j94j410J421L52j526
3776g23Q11L66j376J214L87j596J025O94j359N30P23j162n7J331j076o4J138q70
3794f4n04J322q51m65J543p60j068J391Jj465J479j96j150J125K80j349P56N15
$$ y = [580, 180, -519, 680, 307, -728, 318, 501, -936, 399, 474, -891, 317, 565, -858, 118, 834, -738, -121, 732, -621, -308, 854, -285, -334, 989, -121, -453, 834, 11, -686, 486, -154, -960, 475, 156, -888, 390, 273, -1038, 223, 445, -794, 62, 880, -666, 239, 784, -581, 116, 850, -547, -184, 780, -403, -377, 924, -43, -420, 911, -231, -617, 496, 176, -974, 434, 193, -1110, 645, 812, -825, 503, 677, -865, 482, 466, -808, -40, 891, -559, -116, 595, -514, -578, 874, -590, -613, 906, -210, -507, 905, -218, -895, 606, -53, -811, 582, 246, -1107, 634, 440, -970, 451, 803, -723, 88, 454, -922, 292, 679, -917, 108, 802, -557, -27, 696, -466, -523, 808, -268, -332, 806, -64, -568, 754, -97, -562, 981, 221, -847, 544, 545, -920, 559, 363, -787, 338, 618, -731, 25, 540]
3812E40j387R14N88j238N65J063j448k68J566j110j45J442j377l66J349p56p05
3829g73J651o68r54J190j42q95Q37K75j293J150J01j096O62Q04j665P14P15j007
3847c94j3J256j232O4J498j672N6J089r27l34J478j102n49J350l54q85J138l03
3865A64j057J411m61p93J169J79j428Q23O18j165M53R37j616N95Q33j263L61Q50
3883F10j085M1J314r30n52J168n77o67J448q88n04J125k93j072J350J4j546J350
3901C06m2j023J209P0j067P86O90j731Q32R39j608O21P28j064o7J184j120j86
3919e43J203r26j26Q90n97n05R95m60p14J137j63j169J271L89j290Q87N04j516
3937g33P23Q07j379K87J010j216L21Q91j231J15J179j037j73J268r93l69J249
$$ y = [540, -847, 67, 655, -583, -18, 1045, -403, -671, 895, -215, -360, 1082, -295, -661, 688, -68, -773, 878, 210, -744, 446, 304, -591, 246, 521, -772, 378, 479, -617, 45, 849, -816, -102, 613, -394, -407, 849, -383, -319, 1179, -493, -437, 652, -275, -609, 869, -233, -782, 568, 214, -671, 467, 164, -893, 518, 57, -736, 433, 612, -816, 7, 625, -540, -87, 850, -766, -171, 662, -601, -240, 610, -475, -434, 880, -50, -602, 566, -11, -678, 770, -118, -622, 503, 210, -862, 488, 502, -1044, 306, 264, -759, 450, 520, -547, 239, 929, -802, 30, 969, -639, -18, 710, -354, -421, 763, -357, -543, 660, -266, -392, 498, -99, -604, 391, -69, -783, 354, 191, -978, 293, 682, -608, 279, 783, -733, -10, 797, -582, -295, 715, -501, -180, 711, -520, -405, 774, -263, -436, 832, -161, -530, 719]
3954G19o98o21J211m75p90J201j71j064J051K25j263O87N75j346J169K73j370
3971f87L34J039j251L43R71j107n2J093j152k6J162n66p97J014k16q60J319p15
3989a54m20J257l30j055J051J20j151J011l1r80P92N38j573P59R05j232K74P27
4007E08j132O15R92j435J41Q91p63j29O93n38l83J144j69j124J012J25j095J119
4025D72k39j045J044J23r86N88N48r60O23K73r14J95Q58j266M26J093j022l22
4043e11J304j135k37J190l59p85R44k54p99J107j31r31Q62K02j108R50J89j206
4061g08R31K62r80O01N81j305M81R03j175J94Q08r56L9J183j055j70R58o86n90
4080f84J190n88p03J317m16p07J299m36p05Q68L1j277Q00P01j185N60L49j104
$$ y = [719, 21, -600, 611, 136, -654, 547, 376, -688, 363, 588, -675, 12, 587, -759, 410, 683, -687, -353, 686, -565, -222, 749, -358, -410, 683, -469, -495, 667, 101, -696, 318, 102, -758, 561, -154, -574, 683, 353, -702, 349, 469, -682, 329, 298, -682, 110, 648, -925, -166, 739, -493, -219, 508, -624, -9, 983, -452, -311, 580, -183, -312, 381, -157, -540, 604, 435, -689, 323, 448, -647, 472, 233, -812, 232, 355, -631, -43, 505, -455, 168, 441, -473, -278, 580, -686, -260, 833, -189, -511, 793, -342, -579, 611, 252, -533, 411, 157, -642, 465, 334, -597, 265, 467, -641, 309, 498, -708, 223, 485, -495, 106, 687, -618, -137, 766, -409, -215, 593, -363, -324, 859, -196, -366, 592, -94, -684, 506, -82, -785, 532, 116, -591, 708, 272, -433, 435, 466, -811, -11, 690, -495, 65, 414, -690]
4098f90M41R27j056R8J244j377l0J080r60k10R01l34p06J286m14q40J193k34r21
4117f02Q23Qo02Q12M4q61M85L84q15M49J55p33J88R68j106j29J179j178K28J046
4137G43r61k53R99q36J47P07n45p38R85j36p36J084l32q12R74J2p44M51M13j166
4157g44Q53J35o80J66P45j156M11R14j059K70R34q34m57R75n64l28Q58p1o11O86
4177D43l05l31N33J41j258R13J94o78M68M78j231P63M75j116Q01L03j065M14N41
4196D83p03L83Q12q26o14R39o52m84J263o99o51J303l34q31J057j14p31P60K0
4215C81r74Q15J24r94P77M88j065O27M87j106J92J239j409K99Q04j062L21N62
4233E06n02o15J407j146K7P72k14p54P87k36m64P10k95n20P11K81j005P88J48
$$ y = [-690, -249, 678, -378, -280, 964, -413, -443, 637, -323, -533, 368, 34, -672, 614, 200, -640, 553, 319, -602, 221, 229, -373, 439, 483, -378, 107, 491, -324, 125, 280, -453, -265, 703, -403, -532, 647, -531, -303, 743, -218, -471, 528, -308, -161, 546, 1, -737, 248, 112, -624, 460, 128, -684, 290, 302, -442, 9, 422, -744, 109, 244, -436, -270, 475, -681, -270, 644, -415, -145, 789, -45, -502, 473, -91, -419, 439, 368, -243, 443, 138, -193, 340, 481, -777, 136, 330, -348, 120, 598, -633, 130, 605, -511, 290, 593, -472, -58, 483, -220, 163, 975, 149, -465, 474, -178, -662, 601, -98, -749, 554, 220, -611, 446, 332, -399, 361, 381, -593, 222, 346, -648, 129, 617, -448, 179, 666, -440, -248, 991, -418, -119, 685, -377, -56, 506, 4, -611, 796, -350, -323, 449, 235, -519, 268, 32, -432, 278, -17, -537, 174, 455, -550, 238, 386]
4252C86r63O32M55j337P71N21o65J02N63o52KR25j074l62J183l92o65J164n04
4271I0q33J139m81o71J318m52n62P31N2r25P68L56j037N26M96r57O22L51j043
4290e12K51O02p29K23O43r38l9J241q39k20R44q87m3O68m2q49J011j96r58R80
4310C11O4j098R48O6q65K96O82r13M75N07j027L65Q70r36j33J044j112M14P08
4329F66p25m24J157o93n19J039l68n09Q37l23p28R16j20p19P82k6r36N82M77o21
4349b55K43N23r62L55K47m07J15O51o90J6Q16r17l09J124o44l90J070q20k89Q97
4369C74k38o84Q66p0o10O30M6j140J011K24r41P20K34p01J16P04q12K27M49q11
4389d06L21O02o66l94J132o74l25P25l12n04J030m73k67P82l98o77Q04N1q35M88
$$ y = [386, -577, 55, 510, -827, -56, 465, -200, -98, 465, -187, -185, 740, -334, -696, 487, 95, -570, 594, 90, -743, 396, -85, -756, 562, 110, -452, 279, 331, -594, 174, 530, -507, 19, 515, -442, 180, 531, -512, -261, 341, -388, -165, 478, -460, -499, 742, -97, -317, 627, -260, -303, 365, 323, -526, 485, 289, -669, 311, 375, -723, 225, 291, -574, -278, 404, -509, -34, 473, -554, -189, 681, -255, -388, 656, -456, -42, 666, -59, -483, 674, -19, -538, 501, 133, -376, 461, 138, -590, 326, 206, -513, 269, 243, -693, -111, 366, -255, -12, 511, -451, -96, 151, -256, -141, 510, -180, -164, 652, -265, -574, 550, -94, -484, 586, -234, -523, 374, 136, -548, 318, 248, -362, 268, 314, -826, 185, 409, -532, 188, 422, -279, -163, 541, -271, -44, 405, -406, -85, 517, -149, -543, 589, -85, -410, 315, 3, -501, 529, 56, -211, 571, 173, -504, 300, 351, -484, 4]
4409DK79n62J57M58o53M36M29p62K52N93j116K77P80n97n48R91m57m76J055n54
4429a4o86J357m14o70R85n90l69P56M4p85M48M95j180Q19L48r60L22P66j111K60
4449a79Q43j075L11N93m80l64R91p63l30J429r46m59Q65k28p39J069m03n57P10
4468B88r7o78P10Q1p67N56k5n97M88M19p70J81Q12q30O3J050j191K93P45q80k12
4489c61N54j32l93R70n70n40R25k47q36R85j96n33L60L96j121Q83L41q80L38K01
4509A44p00N29N78r54M49Q02j157oO80n55K8L92m90l84J262m68p54R61j96o99
4529e38O37K21q60P52L58j122P11M47j033L81N16p56K37L43q12J41P16p86J91
4548b56O14o20KP19n99k91Q98m07m09Q13k20p43P79j85o32O73q0n73O43O4p51
$$ y = [4, 283, -279, -122, 336, -317, 119, 548, -214, 38, 631, -485, -208, 572, -25, -573, 418, -39, -515, 540, -14, -700, 657, 243, -427, 558, -32, -401, 355, 399, -386, 62, 557, -623, 196, 544, -416, -94, 672, -439, -179, 664, -411, -100, 493, 13, -351, 640, -123, -453, 976, 30, -429, 436, 208, -531, 538, 135, -422, 288, 191, -487, 223, 304, -463, 93, 68, -529, -41, 378, -392, -211, 601, -229, -166, 884, -307, -14, 731, -149, -361, 193, 61, -332, 638, 68, -472, 453, 206, -630, 355, 159, -374, -14, 382, -739, 144, 485, -395, -57, 144, -556, -27, 551, -403, 46, 848, -309, -315, 365, -190, -162, 230, -260, -644, 618, 150, -604, 357, 161, -538, 99, 320, -540, 212, 570, -552, 159, 606, -427, -46, 470, -286, -49, 294, -518, -377, 339, -447, -256, 358, -262, -260, 459, -140, -431, 467, 60, -349, 464, 244, -499, 280, 95, -537, 136, 56, -517, 126, 190, -561]
4569e61O06P21j298P04K81q77K80Q80q98m50J167n58k37R73r36q6Q12m47l64N78
4589B90m72l04P47Lq69O62J46r58R05L41j044M26Q30j234N33M26p77J6J056j349
4609f26K39R64q07k38J036p27n33J257p01m18R84q0r35Q09k7m98O34J9p23N85
4629B14J39p94K46O58p53Q7P60j000N86N73r74M36K94o92O4O18p65k36J046n06
4649Aj79P47j33q30N27K02q95Q58n5p89M97L72n13K15N18j059L29N66j003J40
4669d84J207j057J19P60r53K39O36o92m8O37l65o57J215n36n87J147k95p58N45
4688G3J71q85R70l8j190J065J35p22M42K53m67K35N61j122L03Q58j124M52L85
4707C55p38j8R14q96K26M53l83k51O83q2j087J241k34p62J058l23n97K79K60l38
$$ y = [-561, 45, 766, -532, 172, 453, -424, -144, 736, -162, -612, 555, -3, -240, 733, -203, -289, 523, 76, -288, 290, -182, -486, 261, 264, -605, 57, 203, -755, 150, 491, -553, -127, 703, -531, 2, 428, -349, -333, 723, -626, -387, 577, -230, -468, 568, -159, -692, 565, -136, -554, 430, 350, -585, 224, 197, -301, 333, 352, -371, 214, 353, -441, -195, 463, -290, -203, 557, -443, 143, 716, -258, 178, 472, -220, -156, 462, -303, -539, 507, 1, -178, 569, 436, -394, 133, 335, -560, 298, 243, -546, -49, 323, -190, 25, 543, -516, -187, 379, -624, -484, 723, -334, -215, 545, -408, -169, 467, -225, -273, 364, -1, -658, 557, 21, -566, 581, 286, -472, 73, 244, -641, 329, 291, -899, 166, 301, -421, 21, 274, -193, 42, 603, -519, -216, 642, -482, -30, 355, -383, -401, 513, -383, -157, 296, -87, -338, 345, 263, -824, 417, 183, -579, 479, 156, -441, -162, 98, -240]
4727b40L09O97j116N10M12q10K50N15q11o0R87o73l29P70m59k56N74k39n13J098
4747F16o51n31J012k56m93M14L15j029O35L35r83N07M97q46M11O61j187N75N57
4766E59r37K05M17k89m71R91m38n37P82l33l29R03n19n89Q19p3n42N70K41n10
4786h0K17P3p69P49J40j064P09M49r38J56P14o12R4N81n08l73R09p80o0P31m34
4807i6l44R64k85m71N76l17m94Q65j24q81P33L8p53N16K29p17L40P12p38Q9P30
4828E72p82J16R05j089J30M71n98q8P55o48j75R05o99j92O11no10R71l07r25J140
4849D58j05p86N01K23q30N15O48j079K22Q25r66L75N71r46L02L94n37o9O03n05
4869a86r9O85o61JP76m09p25J097k6q78R68k38r89M82O55r94M63K65n35L92L62
$$ y = [-240, 69, 766, -350, 160, 572, -238, 12, 527, -284, -344, 643, -30, -359, 411, -48, -304, 270, 31, -482, 616, -35, -566, 446, 190, -303, 111, 426, -603, 32, 367, -616, -109, 388, -458, -47, 614, -573, 2, 559, -378, -173, 244, -45, -516, 475, 37, -500, 282, -51, -380, 523, 4, -585, 234, 161, -381, 189, 430, -80, 137, 210, -559, 190, 330, -734, -25, 424, -514, -358, 356, -256, -162, 419, -89, -462, 447, -333, -393, 338, -96, -440, 524, 239, -232, 344, 27, -467, 398, 274, -607, 126, 164, -589, -73, 156, -561, -221, 491, -247, -158, 572, -210, -94, 811, -278, -148, 323, -275, -363, 392, -256, -431, 474, -225, -417, 194, 189, -421, 550, 243, -682, 458, 353, -433, 68, 291, -539, -24, 624, -455, -233, 592, -374, 1, 572, -374, -72, 322, -215, -284, 319, -186, -285, 400, -261, -260, 516, 107, -618, 479, 453, -425, 543, 305, -684, -202, 453, -541, -78, 187, -348, 44, 406]
4890D06q30M87K65o79N6Q29p12j24O12n00k33P61m32k55Q41k07o28Q00l92m83
4910d18R11p7r12L76N73q44K34M28n29N29N79j250L39K58k97k8N53m53m29R00
4930D43o17o1N55Mr13R97m39n97J077j70n16O40q9r84Q61J94j082Q10M2o69M45
4951f9M03o62M51L48o97LO08n62j43O14k62n12R95n98m65J093o27j75O43l86l38
4972c38O87Q4j071J005p9q76P06p7m59J60O93p07J08P03q67M05K16o15m5P72n37
4993a32l90J005o48l95J073n79k38N11k60m15O16r3m11O18o8m37K62M17q05O05
5013B36Q3q79K62P49n32j41Q35j017OR04p45N6N15o62l2P14j90o08R94l94l94
5034b40L65J56q06N34K70n42O24m5j003O01M41n05O2M10o67J99P74o66j71L96
$$ y = [406, -424, 63, 328, -351, -295, 534, -178, -302, 310, -190, -423, 338, -94, -349, 492, 285, -343, 457, 65, -418, 493, 416, -496, -120, 453, -391, -157, 271, -258, 271, 850, -400, -61, 197, -100, -128, 425, -28, -457, 443, -174, -235, 320, 324, -589, 408, -31, -628, 449, 279, -237, 403, 314, -670, 191, 385, -697, 113, 155, -514, -69, 334, -328, 123, 471, -226, -223, 385, -177, -320, 294, 32, -480, 515, -83, -548, 545, -82, -257, 386, 0, -338, 349, 433, -638, 367, 288, -588, 118, 41, -418, -258, 435, -272, -164, 539, -328, 77, 293, -322, -367, 405, -132, -522, 483, -165, -560, 513, -66, -304, 207, -53, -468, 148, 55, -356, 262, 194, -243, 19, 436, -369, 236, 319, -560, -298, 451, -81, -222, 613, -404, -398, 506, -239, -183, 332, -330, -362, 352, 162, -446, 548, 154, -240, 125, 281, -525, 9, 279, -263, 361, 316, -687, -86, 355, -150, -88, 322, -345, -146, 628, -38, -209, 187]
5054A87l60j10N96m68j57Q36n17m27P17l59k50O33q7p67O02K9m51K80M39o21L98
5075A43K91r68N18L49p96M30L31n67M29j31q6j66Q72o59k48Q51o57k01N62l09
5095a2l77O15L3m63L41j08k03K87k60j83L02K39p01M86K71p13M51L73p37L43M34
5116D18o17R8M53m87j74N96j82m00O19k75k45M78j24p62R07p0o90L12L62n81P30
5137C66J20o21o0K59j09J58J79n97L46J39j54l20O82p75R7P52p38j32P90k81m86
5158c85O36j41n66J019l98n32N65rm11M45L3q78O92J86m53J09N11o63R9L67n01
5179b75Q5O09l84l36M38l40j39P40j05m20O32k07m12K17j02n83Q98R9q68O08J40
5200B95o76O91Q7q58N22K76p08M15L30q32N2M87k53l62J042q57JO91k75m32N56
$$ y = [187, -173, -283, 313, -155, -312, 524, 7, -420, 297, -62, -312, 321, 234, -533, 69, 98, -353, -73, 366, -255, 143, 434, -534, -16, 333, -463, -33, 298, -269, 160, 29, -57, -223, 649, -10, -258, 593, -64, -265, 297, -12, -389, 226, 259, -204, 137, 29, -174, 113, -147, -330, -28, 211, -490, -4, 267, -446, 5, 378, -359, -16, 418, -199, -101, 352, -135, -309, 287, 105, -295, 324, 49, -196, 282, 158, -604, 303, 233, -457, -145, 217, -364, 366, 486, -135, -195, 64, -45, 113, 292, -305, 41, 180, 26, -294, 388, -387, -290, 462, -276, -408, 382, 101, -385, 251, 110, -456, 563, 165, -367, 198, 189, -222, 223, 256, -622, 70, 256, -197, -88, 423, -240, -141, 226, -275, -190, 419, 35, -301, 137, -203, -342, 398, 293, -127, 505, 298, -114, 103, 1, -582, 316, 415, -453, 155, 295, -381, 310, 397, -461, 61, 337, -371, 44, 374, -458, -406, 81, -172, -534, 508, -349, -348, 343, 68, -364, 192]
5221A92J9n98N89n9n52M63R8o31L74L60j63J1K30p22L24J97l38j10R68q62L03
5242I3J36k40k19O51q18K78M62k89m63P35m83j97P85j70o77L67J67l89N19n7m95
5263c04O05l5p54L68N41p99R1L90m54K53L27o53J77O05o30K3N80m39J14L81m46
5284e9j45M91k81l99N93k17m03O10k4m75N95j02m95J12N18m03j22L80rQ7J80n30
5306i8k13Q99p75k25P86l24l50N12p5k57J98Ol91O27j1p45N82k00k94P49j48l50
5328i7J70K18o50L21K80m40K8L51k82pO37o71q2Q85o30l01Q99n34k44M93k15m84
5350c55P30j25p72P46Qp58M68J79l54L91J44m08j77Q62r47O99j00k60k78N93j81
5371A05l38N07j45k77M75l80k12Q97o18l31L76j2j22L35l34k45J38K64m81O64
$$ y = [192, 211, -387, 202, 143, -409, 54, 152, -479, -105, 255, 92, 103, 333, -389, -65, 132, -206, -316, 652, -210, 93, 229, -11, -230, 421, -397, -119, 343, 54, -409, 326, -157, -354, 431, 261, -416, -49, 118, -271, 248, 191, -304, 301, 266, -488, -120, 421, -378, -287, 103, -351, -98, 229, -424, -247, 358, -272, -249, 331, -108, 6, 387, -59, -204, 287, 6, -393, 200, -17, -420, 190, 166, -309, 286, 184, -311, -199, 319, -84, -206, 174, 165, 252, 432, -98, -311, 588, -187, -412, 374, 50, -300, 212, 137, -120, 78, 84, -307, 320, 309, -436, 146, -54, -348, 401, 253, -97, 73, 291, -359, -38, 242, -198, -170, 181, -101, -108, 529, -142, -224, 661, 31, -270, 629, 95, -149, 344, 129, -355, 375, 250, -522, 224, 232, -526, -58, 121, -233, 158, 302, -106, -283, 579, -368, 331, 231, -29, -307, 286, 105, -233, 274, 129, -148, 327, -53, -265, 632, 14, -317, 59, 47, -75, 260, -74, -319, -181, 83, -398, 266]
5391B66n7o35N00N6m26M44J24m10M6M73o40K61K57l09j97O25l64m51Q38m37j88
5412b24M96l54m16P32J15r62Q48r0p19P66P6n21L49K36m43n9M71o27J63N85m16
5433Fj72M60n26K6O53p36j37O82j38l05L56k07p7N94j79o10Q56j7o31K83K2n27
5455c24L62J56m53L3O25o04k5M90l11l01N63m38p1O95m31k99Q26l25n62O81o1
5476B26n43K67Ll01N22K47n38Q3J50l34K02K68l55L52J14l80j26M75m82k2O65
5497D93p06o7L73j27n44R07k60k95L43on89N08k86j68O41j2p83N65L11o36L24
5518a4L19m91K8P08p09l7O77p80j13Q47m94j17O33o42J26K92l74k54R80l61n98
5539c74O12l2n96N72j69j99K48L0l87L15M75p38j04N97m02m0K92r7k8L65m15k16
$$ y = [266, 209, -426, 74, 130, -296, 148, 272, -138, -92, 381, -259, 2, 259, -50, -247, 378, 14, -437, 401, -36, -224, 272, -82, -498, 234, 349, -613, 235, 145, -574, 192, 268, -253, 96, 332, -111, -170, 301, -326, -163, 422, 6, -166, 294, -232, -206, 447, -289, -426, 256, 118, -187, 169, -38, -115, 479, 300, -310, 546, 529, -102, 181, 203, -324, 38, 194, -259, -226, 399, -205, -230, 260, -51, -352, 211, -227, -298, 397, -34, -333, 493, 168, -394, 287, 226, -317, -50, -47, -348, 174, 421, -117, -34, 116, -218, -16, 252, -103, 249, 363, -17, -143, 332, -150, -172, 493, -213, -280, 93, -34, -578, 329, 69, -226, 117, 111, -478, 30, -256, -424, 217, 205, -578, -13, 298, -338, -14, 305, -186, -158, 550, -159, -196, 481, -299, -412, 435, -59, -176, 457, -185, -59, 233, -141, -395, 585, 224, -374, 238, 206, -390, 182, 13, -186, 62, 92, -295, 20, 495, -243, -347, 250, -152, -192, 100, 3, -25, 340, -75, -291]
5561b91N87m47k2O80n74O6M26l25l26J89L06m49N98p4q07M60j0m30O05n8l49M95
5583B50l3l72O1J95m68K79L33l47j70N53k39l84N34j41m58P18j17n85P06p1n36
5604b92M69j16l00N49o8n89M03L43q16O02L61q03K31M76q30K18K88k85p2P08p05
5625b28o3N32m46j59N82no54O86j58l34K92j08l77N60K69o89L80M2m19J30N51
5646C84n77J87M01q13J15O53m73m8N03l51j9l2K4o0M65l86m28O48l47j01O60k54
5668A51m58L79o1j79J68M72o17K52R5n28K49M00n52K45K93m75l91R26o69O6M42
5689B08j03j14K04No98O11k08j62N62m5p73O15J61m39J70K12o91L68M66m53PL64
5711B67m51J07L07m52J49N07o55j00N80m43j8O49l48m75R03n29o93Q70Q6p04N76
$$ y = [-291, 296, -151, -173, 507, -67, -1, 425, 100, -226, -37, 269, -180, 418, 344, -463, -3, -13, -443, 162, 104, -245, 250, 217, -155, -94, 101, -367, -88, 245, -102, -272, 281, 42, -342, 192, 51, -407, 311, 194, -391, 315, 244, -292, 177, 61, -239, 310, 242, -347, 56, 399, -417, 185, 546, -257, -26, 450, -380, -162, 126, -159, -231, 477, -228, -291, 241, -205, -364, 218, 213, -441, 245, 87, -247, 45, -63, -440, 120, 389, -300, 80, 122, -297, -167, 384, -193, -6, 395, -418, -303, 350, -123, -171, 332, -19, -38, -70, -46, -106, 359, -27, -455, 193, -154, -255, 405, 151, -307, 72, 11, -168, 0, 472, -145, 107, 202, -326, -77, 323, -229, 16, 309, -166, -557, 369, -300, -234, 208, 105, -9, 195, 200, -498, 113, -95, -257, 305, 260, -513, 102, 263, -176, -6, 206, -485, -117, 349, -104, -97, 267, -184, -77, 230, -222, -73, 434, -221, -321, 259, -184, -202, 447, 99, -376, 527, -2, -695, 175, 261, -443, 133]
5732A33p2k81L75K48n98K77Q9n18L97L53o42J94N19o82j03M99k99k32Q50n15j55
5753a63L67o2l16L29R7l60N69n05l51L14J21m38L82Q7p5q5N01m52p6L28p97N51
5775c4O23r03K82O00m93l41O57n16rL86m0m99P86l60o65N31M0n72O04K0n32N95
5797A60N5l75L37J76q59L57M15o44J46O33p86L1R09q91L71L38n50p9N35j96n10
5818d27R23m58o15R45l35l07L67p0j21K75n1n12L87M63n76j2L29l34J92L38o68
5839b67O1M50n79O0R48q38k74P03l84r8M61p2l03M11j26l64M93m7m86K45L37o28
5861b97K83L25m22j72R14q85K56M27r59O12L43o41L60K10o62QO20l76k40L34O1
5882I9l94N15p8m33N39l8m27L72j19j77M35j55l52K23M53p63K21L96m27qK80k65
$$ y = [133, 61, -220, 155, 403, -195, 82, 171, -347, 50, 403, -239, -45, 474, -208, -311, 188, -111, -343, 507, -8, -163, 204, 142, -174, 155, 252, -108, 461, -44, -395, -81, 40, -398, -16, 71, -4, -89, 412, -40, -116, 212, -585, -34, 589, -314, -32, 568, 75, -266, 391, -125, -134, 252, 212, -287, 499, 139, -526, 5, 45, -527, 77, 97, -435, 160, 215, -160, 177, 353, -506, -149, 266, -378, -232, 401, -385, -354, 555, -336, 35, 373, -177, -256, 279, 83, -427, 496, 38, -577, 368, 33, -274, 93, 23, -98, 177, 126, -386, 1, 464, -112, -124, 205, -129, 63, 401, -267, -206, 244, -335, -275, 673, -165, -439, 264, -120, -218, 243, 171, -132, 279, 153, -211, 282, 235, -251, -6, 331, -297, -14, 311, -111, -283, 631, -254, 2, 429, -530, 82, 425, -216, 144, 354, -308, -300, 320, -56, -296, 38, 99, -295, 220, 142, -291, 248, 210, -217, 155, 36, -141, 294, 139, -213, 10, 463, -300, -79, 317, -110, -118, 162, -103]
5904a03p6O21o25K45K87p76J14O88l83k73N93j71l07Q1J69m01N77k54l48P6M30
5925A64j91k1L75n73K28N20o79N0M51p68J37Q13q56J52N80p41R6N66k46l90O99
5946C66m11o20Q68k87o3K90M1n00M50M8n56L49N47p82J79K83o55O92o0l61N3L59
5968B30m02n8L89l92N7N62m00k27N66l78j5L93k63n63Q97j18n80M20N06j205P24
5989A43J25o19K36M04o40M00K92n31k25N58l68k01R27n61j99L92k85m3M29m83
6009b49k7O68k45o41O24J50n34M63J11q32Q61j64n05M04L10q92M58J49k5n59P02
6030B27m20R1L66m19QK98k19k71O53l78k68N57j94n62Q14l9m08O08m20o9K33K61
6052D49o50J71K64m77J22L24l11M9O05p50K07O46n68l16P57m38m19L27J01l11
$$ y = [-103, -179, 442, -183, 62, 349, -427, -313, 375, -8, -281, 312, 141, -166, -85, 84, -317, 260, 6, -342, -266, 164, -27, -48, 327, -246, -18, 502, -177, -127, 324, -444, -307, 506, -350, -198, 382, -359, -263, 303, 57, -333, 366, -45, -665, 203, -84, -147, 143, 184, -316, 134, 182, -374, -25, 522, -260, -81, 202, -453, 239, 179, -182, -129, 230, -172, -230, 159, -233, -176, 386, -14, -241, 325, -53, -68, 325, 62, -501, 396, 278, -302, 118, 624, -581, 143, 268, -351, -115, 289, -351, 49, 341, -190, -415, 143, -225, -426, 501, -60, -259, 133, -152, -195, 234, -249, -276, 392, 147, -494, 130, 280, -254, 209, 320, -512, 349, 185, -320, 84, 394, -498, -40, 109, 84, -475, 227, -193, -102, 264, -155, -147, 151, -68, -339, 314, -64, -332, 225, 31, -531, 283, 244, -164, 444, 24, -45, 188, 449, -201, -30, 234, -243, -121, 203, -108, -59, 546, -204, 3, 649, 81, -235, 522, 84, -335, -8, 93, -218]
6072b18N39l22n40O92N7p07Q07K3p51P27l4o46N41J98o62O2N60p31N43Q2l17j82
6094b79N88m12k49P99m10l33N68j62l05L37k64m38P23q8m37L34K65m98K62K55
6114B56n11L97J85o63J7P01o69K28M70n62K82L29o40N3M26l92j37P22k15n49N11
6135B39l55l56M29J47l59K45K65n91M98m8m21K41K70l53N7N59o66L6K73k92o9
6156b51L84k04l6L52m18k13N45j90k66M79l7n21P33j96l93K94L49p40N16l0m12
6177b55M32K17o35K94K37l70L6M32n63l5M40l88j17O84m34k82O71l96k44L54k59
6198a81k27M89j36m39O94M4o19M18K35p00N37K11o41M20M50p84P0M18m41J03M56
6219C77n86p5P36n49J04L28l63l35M83l13m84J160l08n70P67j59n67M20J25k64
$$ y = [-218, 321, -1, -541, 151, 208, -499, 308, 331, -420, 307, 273, -373, 168, 366, -296, -234, 326, -405, 138, 220, -97, -279, 309, -103, -352, 447, 37, -296, 272, 110, -195, 142, -122, -560, 163, 75, -362, -28, 237, -261, 1, 256, -255, 142, 327, -336, -319, 382, -287, -59, 411, -151, 131, 460, -180, -127, 299, -93, -230, 492, 277, -272, 239, -116, -472, -43, 104, -255, -10, 255, -336, 162, 114, -307, -66, 204, -149, -92, 467, -199, -163, 110, -182, -251, 133, -71, -107, 245, -173, -386, 159, -31, -297, 182, 145, -376, 357, 161, -232, 62, 411, -329, 187, 157, -255, 177, 394, -241, 53, 290, -80, -44, 388, -175, -210, 230, -158, -275, 409, -25, -307, 364, -32, -276, 78, -181, -408, 81, -55, -494, 200, 244, -375, 43, 278, -422, 115, 326, -315, 105, 555, -229, -159, 259, -182, -79, 377, -209, -284, 452, -97, 7, 335, -28, -363, 120, -193, -677, 483, 175, -395, 372, 213, -354, 66, 191, -73]
6239g3N4L58n74J35J68m84R5P65o58j02N17l17M7K56k74o0M67l49q8L64j14p05
6261e72O30J88p46O41J73n95M44J97p80N87Q0o15L64N6k56J2L61k47l49O63j41
6282I5m35Q00l07j59K55m10N2L85k32n05N95J79p37L88K71o11M87K51o07L45m8
6303E2l92L57K58m40J81J88k80r7N49m06j46N51j64l17L93l63q7M97o28K22M47
6324C75j45m99lK35k39L01J25n57L86j25j4m5O24r50N55L65q25L49N61l30n27
6345c83P52o15j02O74l28j20L54j46o01Q77k71k63N08k88k71M61k9o23K70M06
6365B62p39L21M23l75k2M99m28o4L29l03O4N91o90m03P74J62p21N02l46M3N16
6386C95k45o09N43J11m12Q1K60m52L72K50m11K39p5j86K55J57m24J8N12n68j79
$$ y = [-73, -19, 339, -235, -100, 68, -416, -321, 444, -214, -316, 201, -116, -69, 187, -87, -147, 320, -29, -117, 247, 133, -572, 58, 246, -500, 141, 314, -281, 163, 360, -420, 167, 247, -368, -4, 52, -204, -192, 169, -78, -427, 236, 95, -340, 460, 153, -6, 249, -161, -109, 276, 44, -461, 134, 313, -424, -36, 235, -376, 111, 362, -245, 100, 52, -340, 17, 275, -165, 16, 204, -76, -173, 376, -30, -176, 375, 211, -106, 287, -76, -163, 334, -294, -72, 375, 230, -269, -272, -37, -276, 25, 150, -407, -21, -146, -160, -205, 419, -531, 24, 389, -436, -87, 474, 144, -383, 369, -246, -348, 326, -2, -122, 232, 86, -515, 362, 91, -172, 336, 48, -223, 238, 209, -414, -144, 262, -477, -156, 267, -108, -130, 369, -59, -123, 206, -97, -33, 558, -132, -535, 239, 401, -320, 182, -164, -121, 395, 150, -459, 84, 195, -217, -136, 124, -328, 44, 294, -117, 122, 47, -139, 116, 273, -151, -133, 379, -189, -368]
6407c68P92n41kM96k91l12M43j69k45N55p4m69M34o9n06K44J42k67J69Q1j2k47
6429b16M07m32N03J28l25K1K34l41k5K25k18l9J63n8l18O48l27l07L58J34l40
6450a25L46k26l13N24l25n9K18L53n39J50L94o98K93K69m23J8L43m58n5O73n82
6471b22j14P58l89n00L73o6j86P05M8p42M50L4m19K87l7q8J95L27m46J49N4k96
6493a25o9N77n11j4O65m72k41J48K7N4L07k30m54N89j30m21M33r2l55K74k4l88
6515d52N75Pn71N39J55o60L15K50n77N02N1l35J93M75p64J61N08l53k70O19l2
6536C36m71L32l16r5O37m41m26O00j79r7J42j1k10L62o5k97J12K84j67o6M61l87
6558C8j04L67m23jJ89l75L15K47J02n55N26N0m54K39j6k93l1K02l64O74p6m47
$$ y = [-368, 424, -117, -119, 377, 86, -226, 217, 48, -197, 358, 284, -185, 249, 180, -326, -82, 60, -207, -38, 43, 31, -216, 191, -241, 262, 390, 65, 86, 320, -21, -46, 179, -39, -78, 85, 27, -291, 357, 30, -277, 81, 215, -125, 221, -5, -318, 206, -119, -178, 40, 393, -146, 4, 398, -300, -7, 262, -161, -143, 200, -258, -313, 360, -222, -336, 422, 33, -467, -94, -160, -346, 359, 407, -335, 115, 149, -270, 17, -20, -108, 87, 414, -32, 117, 171, -125, -194, 383, -128, -142, 523, 51, -190, -42, -15, 39, 346, 116, -338, 251, 121, -300, 133, 41, -314, -40, -64, -452, 123, 130, -441, 98, 253, -407, -92, 158, -419, 83, 134, -201, -8, 467, -297, -136, 372, 19, -251, 368, 336, -135, 197, -119, -214, 423, -18, -444, 156, -23, -120, 22, 11, -199, 163, 98, -199, -87, 197, 30, -36, 425, 38, -66, 301, -122, -123, 66, -309, 6, 253, 355, -200, 326, 376, -78, 161, 145, -148, -179, 23, -341, 333, 257, -190]
6580a90K8O17p31Q1N82m80Q1M31m72j92O88n40m4M70o27J14K84r8k19L66k13M1
6602b3J91k11k41M73k82o0L49J31o24O07j28n00J85L61l48J0N92j011N29J62k01
6623c9j87M30m05o0O35k05k06K55j48m28N09j65m31O40j88l47L55Qk85J0N00l15
6645f7k5M04l85j05N66m95J43L21n17L4M84o20J03O99p23L4N31k64j35J99km27
6667b47L69J6l54L41p1o10N93K85o12M44K33p17K40L58j39j97M36n72P5J46J2
6688B9k8J91l34K9K69l73M0M37l91O0Q7J82m24M11J02n56K49K96m02J72J26m45
6710b73O2N9M5j14L99o9k18K58j90r9O30k46m92J80L02m12L39l57j32O26j10n03
6732c15M01J06l18J12L50l14k28N01m26K07M8j49P8K40m66J24K32l43q9L42M4
$$ y = [-190, -162, 455, -276, -195, 387, -93, -12, 419, -53, -245, 443, -97, -141, 329, -298, -184, 100, 2, -217, 149, -64, -23, 168, -43, -284, 189, -93, -153, 196, 327, -297, 310, 182, -318, -133, 228, -120, -110, 482, -529, 0, 162, -39, -226, 204, -201, -261, 374, 169, -37, 218, 70, -358, 151, -14, -445, 195, 7, -340, 15, 23, -262, -252, 248, -67, -92, 312, -73, -178, 388, -107, 36, 357, -160, -126, 358, -262, -159, 540, -183, -149, 382, 118, -17, 182, 180, -247, 122, 138, -216, 125, 54, -556, 37, 322, -290, 154, 387, -330, -90, 268, 129, -68, 368, -204, -129, 17, 29, 1, 192, -142, -113, 156, -217, -177, 260, -131, -71, 16, 198, -226, 185, 287, -269, -20, 276, -126, 46, 172, -273, -211, -152, -107, -221, 178, 109, -109, 149, -41, -140, 490, 244, -248, -68, 234, -178, 161, -196, -328, 298, 188, -315, 86, 192, -126, -14, 336, 22, -206, 295, -131, 76, 124, -25, 53, 293, -173, -49, 183, -160, -249, 93, 137]
6753A37l93N61j73n01M40J39m49N04k15l00K76N1k85K64J11k22JM83q34L96J77
6774A68j67j74M61l30k6M22m32j83N12l81k5L75p4k84J59r3r2K91M25o63L28q0
6796A37m15N59J41p38K53K18l78J71M50m92K68K57q54L1P09l76l33N02k33p3N95
6817C99o66j1M13qn38Q50l4o74M37Jn22M56J37l59P0J92m88K66K87j72k88N98
6839C46m68k20N34k03q6L47j46k02M74k46k36J77j34j60L20J26n97L07k0k49P8
6860b58M17j57n2J52m50K35M18m19J00L45n26J37M59n49K97K54p19j3K84J25n57
6881d77R16l46j63K96K6k61K1J94l49oL17l31L73j8o16M31L02l11r9N64m58k20
6903b15M55k83j95P12o89P0L71l46j49L33l1k45L2K13l71M76J47m66J99J99l86
$$ y = [137, -256, 305, 132, -369, 71, 210, -239, 265, 50, -250, 26, 77, -208, 56, 167, -55, -54, 429, -405, -9, 168, 1, -173, 288, -42, -68, 354, -78, -261, 251, -130, -155, 220, 146, -138, 21, -72, -164, 127, 552, -111, 217, 137, -278, 281, 422, -316, -63, 155, -223, -52, 398, -94, 174, 431, -423, -392, 317, -59, -392, 110, -123, -196, 399, -267, -278, 135, 127, -411, 439, 405, -269, 168, 169, -353, 103, 240, -119, -49, 143, -345, -79, 208, 36, -252, 346, -122, -342, 192, -11, -97, 250, 104, -98, 376, 130, -106, 71, -63, -223, 97, 223, -374, -67, -87, -336, -258, 159, 2, -50, 102, -348, -113, 305, -114, -14, 331, -195, -58, 401, -148, 149, 403, -316, -329, -45, 80, -477, 439, 93, -70, 226, 252, -9, 12, 206, -143, -149, 168, -163, 210, 192, -424, 7, 309, -2, -101, 463, 5, -215, 240, -43, -238, 474, -215, -145, 226, -120, -269, 64, 33, -212, -180, 33, -338, 138, 285, -181, 18, 217, -169]
6924a69l9J87k88K91K12k52l1K54l82lN12j84j55J38J66l09M60k30p01P97r2l58
6946a76M00o6n23N53L8m96L32L10o67L44n0j90K96J07m95M69K39n09J12J10m10
6967b72j36N20k44k38K30K23k66j3J94l22M16J3l85K55p9p9Q9J30q5L7M59o40
6989a93L65nm16J38K41j68j92N64l96j96M10m26j2N45k06m04N52j68k24K97K13
7010C19m79L02j2l49P4L36m99L62O9k97Q7Q7l89K40M38l76J59R2m49J31O07m41
7032A2m85N18j07J61l45K98j24J97j6m87L06K08k73O6L49j86j96ol23K54M34k44
7054A1K63O0o16K33K50l39j89P75k48m79N00m7m90N48j54n37N57J34m08M07j60
7075G1o12O78j0n18L15K51k17J93K0l43P3K21p5j74M06K2m03L53j38j14J09j30
$$ y = [-169, -208, -21, -309, -18, 194, -58, -89, 165, -217, -220, 292, 108, -47, 91, 257, -52, 408, 178, -523, 274, 182, -176, 224, 158, -365, 188, 226, -270, 62, 372, -295, 49, -1, -191, 105, 212, -283, 186, 425, -84, 28, 138, -272, -408, 112, -132, -370, -140, 83, -183, -196, -2, -324, 92, 105, -280, -25, -104, -183, -94, 36, -49, -12, 447, -193, 172, 167, -249, -111, 130, -38, -230, 334, -62, -258, 152, -274, -286, 259, 53, -351, 201, 33, -191, 106, 319, -160, 142, 130, -219, -145, 191, -308, 54, 123, -174, -87, 0, -389, -149, 289, -87, 72, 164, -285, -154, 453, 12, -473, 45, -62, 99, -246, 52, -72, 125, 109, -378, -72, 136, -137, -71, 278, 92, -104, -110, -433, -179, 255, 11, 274, 334, -282, -49, 201, -138, -327, 448, 200, -279, 221, 174, -316, 232, 78, -459, 98, 232, -176, 231, 71, -541, 137, 127, -391, -76, 175, -42, 151, 171, -172, -99, 122, 47, -127, 279, 301, -102, 251, 113, -1, 108, -22]
7097b2l00M93n4p2p7p5j6J17J66m88K34K09l66J64K36J16k65m7j32P8M70m43k29
7120c03O84n55J62J28l10p6K81J40m43O48k48l46K76j28k33J17N36n13k42O27
7140B02o11L65J57k91m1M01l80L1K32n51L40L77m86K97K91r3o00N76j41l09M94
7161B60k02j58K32J1m20N23j57l50L15L58m73j35N01l50J9K60l21L0J90n2K7J94
7183C02n41KN18l83n7M53m11J6J33N6k29M94l58k29J86K58m66O10k56l88M27O9
7205B06m04o4M86m49J69J04k04O9L63n11M9N61k66k90K55j40r6J48j98L05J36
7226B29l10m39P08k11j55J96J46k89m5J32j07m5K54j92pM68k26j96J86k73j06
7247b82L34l31kM47j50r6K88j18l67K59P8j89K80j9m57K83R0m6l7O13p19L35O
$$ y = [-22, -322, 171, 117, 45, -32, -107, -123, -6, 160, -328, -94, 115, -251, -87, 149, 265, 0, -47, -179, -101, 369, -74, -303, 381, -174, -12, 116, -194, -270, 11, 151, -292, 356, 108, -238, 38, -90, -323, -206, 330, -183, -425, 202, -409, -44, 113, -178, -219, 182, -198, -167, 65, -486, -146, 231, -255, 42, 333, 240, -360, 216, 75, -234, 260, 58, -100, 132, 143, -277, 246, 89, -261, 54, 412, -61, -196, 305, -45, -26, 234, -87, -57, 133, 81, 108, 302, -239, -237, 281, -102, -159, 294, -117, -101, 32, 88, -141, 353, -5, -234, -48, 210, -256, 354, 98, -290, 137, 206, -198, -262, 224, -225, -56, 48, -156, -87, 276, -235, -186, 375, 109, -181, 74, -66, -162, -14, -212, 93, 229, -81, -520, 188, -23, -178, 18, 164, -125, -170, -38, -145, -190, 64, -128, -135, 333, 107, -89, 97, -176, -282, 52, -279, -281, 166, 16, -80, 208, 90, -277, -18, 60, -129, 151, 132, -325, -42, 48, 2, -35, 578, -141, 194, 200]
7270B00m16K93J94k28m46K85j9j14N37j89O7j40J51l76J62J08l70O47l51j28R8
7291c5L38n61M31r4j24j26O13k89o3J98m61J60K46j95k44L28L9m78N30l98KK53
7313G0p6k98K65K29k39J63k04j46K58K73l97K25J69p85N98K38n11J67l8p8l4M64
7335C13m55J06M6o1l2R3J60m93N51j83k71L02j69m0J54M6l19K21J37j31K3J77
7357A75l69K3R6l83L49M26m80QK72k26j14J84j6Q4J7L8j85K38p1l03L28j37l27
7380c73M20P3l78M95n6k81J81L15p58M22J80l59P1K50m36K6M80l72R2L81l22m63
7402d12L42K05k11L17j67O6n2J3n06L98N6j27J27J65p9j30K55m75L22J70l50J4
7424e9J13j43J04L48l12j2K40l64j16L59k89J12K34P9m79L27k60K05J78l55r8
$$ y = [200, -216, 77, 271, 43, -403, -118, -137, -251, 286, 97, 164, 24, 175, -201, -39, 69, -301, 346, -5, -133, -35, 303, -258, 173, 79, -45, -171, 442, 153, 90, 288, -173, -13, 233, 38, -206, 122, 161, -317, 213, -185, -183, 70, -6, -304, -39, 190, -49, 114, -90, -236, 22, 295, -102, 123, 292, -493, 105, 343, -168, -1, -39, -117, -151, 313, -142, -36, 10, -51, -83, 10, 170, -323, 228, 45, -226, 76, -93, -133, 21, 67, -252, -31, 106, -25, -2, 175, -194, -171, -75, -458, -109, 317, -163, -155, 117, -109, -223, -39, -55, 29, 46, 84, -101, 137, 66, -237, 91, -46, -373, 47, 120, -258, 237, 181, -100, 81, 396, -362, 60, 240, -119, -48, 202, -234, -208, 272, -100, -8, 373, 51, -412, -70, 135, -76, 241, 74, 140, 88, 101, -405, -7, 49, -78, 49, 214, 135, 5, 260, -215, 107, 277, -73, -59, 54, -89, 15, 363, 51, 39, 279, -85, -201, 158, -131, -19, 215, 294, -185, 142, -118, 87, 265, -90, -188]
7445a88N4P2n5J0K54l33J56J43m43N76j17n54L15K32k98J41L77l14m6J65k42J9
7467g6N16n11J72N2k20j86L57n8j90M69l77J4K06m3j54P2l4k1j84L07k58J65j01
7490h3o7L7M19k09j81Q7j7j16L04r6m27J91M9k47O38O2m00L4L39m34J87J42l13
7513a01J80k17r0N51r5m97L02r3Q7J50m0l44K35%o5K29j93pL5J51P1o79P61j22
7537B09k21J65m8n46M24J64j86J10J09j67j67L95k27J6J28q9j64L06k21p4J1M2
7559c1j87M23k06k79K57P2k27K64P3n23L81J31k08K01Q6l76K30K92k34q5R0m24
7581b80K00J89l32K26J19l05j98N02j91j90K32Pm1K28l6j98P5N3j46q0K68j19
7603a7k4J87K1k23K37l91Q3M13n27K56L73p13L59k01K26m34N40N0l41J94j22K27
$$ y = [-188, -134, -62, -117, -107, 147, -186, -30, 113, -330, 246, 129, -425, -110, 122, -176, -35, 342, 28, -18, 147, -95, -76, 440, -71, 101, 153, -67, -253, 104, 46, -144, 325, -52, -38, 168, 125, -29, 43, 9, -12, -196, 111, -147, 18, -83, -150, -113, 306, 97, -84, 3, -14, -130, 174, 78, -349, -158, -109, -356, 282, 344, -56, -22, 317, -117, 70, 212, -101, 79, -138, -228, 323, 228, -269, 33, -60, 27, 177, 137, -207, 28, 28, -37, 192, -1, -8, 27, 178, 249, -430, 331, 209, -12, 153, 105, -441, -17, 147, -39, 71, 180, 13, -154, 241, 14, 30, 158, 69, -95, 211, -10, -84, -73, -31, -218, 205, -1, -280, -23, 49, -178, 86, 159, -364, 17, 148, -60, 141, 227, -149, 81, 373, 139, 54, 144, -280, -80, 109, -223, 3, 122, -183, -381, 121, -70, -260, -28, -21, -62, 166, 130, -68, 7, 60, -86, -166, 102, -17, -41, 146, 167, -56, 181, -210, -127, 286, -241, 15, 388, -325, 34, -167, 59, -375, 165, 215, -126, 68, -54, 173]
7625A73j07k3k27K07j57j64K69J39l97L92q6k51L98N0m02L43j80n5p6L72l52r8
7647b32K66J96m17K79j68q0L11l61O0K38R1l52L67m24o9J89M22n30M00j09k15
7668a38K11k19J90j86L83m08J71J83k24q5L41l20m6K93J04m49L49k49p2J34KJ20
7690H5P6j42j02K51N1j99j3J13k27j25K51n9L56j09k55M2j30L1N3L79k53j93K88
7713A69j70k41M19N0k93K0L4j54M3KJ9jJ98m65K25Oj12K59Q1k77m4M33j73j01
7737g3M5L0p9J73j37m00O43p8pj61J7k02J05L33n07M04M2m60M81l7m40M51P8k14
7761GK5J02m3j60q8L2J07%O1k36L41k16P5m0J29j90J84r4j47nJ36K4K41j31o7
7786D7j92J19l21L68j11Q6o4J89l6j69K38m0j19N9K95n16L46n9l01M72n50Q9L77
$$ y = [173, 66, 43, -184, 23, -134, -298, -29, 110, -287, 105, 19, -232, 166, 216, -186, 157, -23, -78, -154, 218, -134, -232, 34, 230, -187, 92, -76, -156, 155, -206, -146, 92, 183, -169, 198, -226, -295, -106, 316, -214, 186, 77, -138, 73, -146, 44, -142, 241, -167, 4, 187, -37, -122, 219, -101, -147, 146, 250, -199, 150, -99, -171, -37, -35, 85, 161, 19, -83, 168, 219, 20, 7, 120, -107, -232, 19, -40, 316, 207, -48, -6, -136, -105, -52, 327, 74, -119, 169, -1, -242, 177, 227, -66, -46, -12, -166, -123, -121, -102, -103, 95, -370, -145, -139, -251, 8, 89, -188, -232, 201, 28, -73, -28, 2, -77, 96, -41, -441, 202, 124, 117, -44, -27, -229, -124, 209, -298, 106, 148, -312, 169, 132, -308, 143, 221, 7, 32, 134, 91, -69, -157, -125, -18, -18, 43, -193, 148, -68, 7, -33, 96, -94, 90, -4, -151, -156, -20, 4, 245, 114, 47, -145, -26, -347, 21, -90, -4, -68, 121, 85, -84, 154, 114, -5, 54, 349, -167, 179, 120, -181, 291, -259, -170, 207]
7809B07j51l30J25L31l75J79M4J20Pk2l85R4L09k83P2L38n54NL03o2P1%l92L31
7833a8J82m85N1J11J41k35K03J11j66L24j11k77L04j14k35K38N6k84J53r0R7L2
7855a2n8o9O1L51j79J70j75l33J24J87r5j76J78K7l00K53L95l23P7j87j0J13K57
7878B76o07K07J19m3J64k56r6K91O2j98r6M73n44P4L08k13p1N01l21L7J37j04
7900A00j53J85r7n2J18P7k81J48K19l91j49L48p8j32L72r7k37J3R0j61J07J10
7922E9j19L19o1j61J85k03J3r6J04j45m1J06j21K08j05j70K95n7k7J43j64k67
7944c05K64L27j60k17p1J19J7L43l29j20L01m9j37nJ83l35M7J08M7P5j5k20J81
7967D9k5N5P1lN8l25J58n5q8L08k21j72K06k13P9L84m10J71R7k83k17N45j74p
$$ y = [207, 56, -274, -149, 182, -193, -14, 30, 150, 157, 135, -250, -156, 153, -130, -58, 280, -274, -269, 34, -28, 43, 43, -349, -18, 164, -321, -270, -159, -18, -253, -50, 61, -105, 219, 108, -169, 135, 21, -214, 24, 80, -204, -51, -141, -44, -12, -70, -139, -78, 273, 94, 264, 89, -244, -120, 67, -28, -204, -26, 1, -299, -46, 349, 26, 103, -84, -94, 19, 276, -331, -124, -5, -48, 116, -140, -236, 55, 117, -81, -177, 296, -248, -174, 134, -79, -150, 351, 30, 67, 204, 100, -53, 132, 35, -17, 101, 178, -103, 45, 264, -127, -276, 72, -6, -138, 234, 137, -100, -87, 3, -158, -51, 59, -60, 259, 198, 37, 222, 19, 32, -64, 40, -105, -146, -40, -161, 47, -58, -228, 67, 10, -17, 126, -38, -305, -41, 286, 126, -91, -162, -43, -26, 317, -12, -132, 169, 120, -17, -22, 161, -174, -127, -19, 28, 103, 88, -132, 49, 24, 79, 150, 147, 205, -120, 38, -17, -105, 203, -18, -190, 16, -197, -118, 266, -144, 27, 124, -159, -376, 169, -5, -12]
7991a2N3k79p2L04K23m50J47K26q1J24j13k36J64P9k25J91R7p6j00O9k08k1N64
8014C68k23j47J33O3j87O4n2k03K25M9j35K30p2n8K3R8j50k18J30M7J93n5q4j69
8038a30L82l72P4J44n0j69N47l09j42r5J90k1m6K6q2N0k2p2K50O8j59j15K58p4
8062A31J54j42j98m7J40l22K79J83j81m51O43k67NJ74o0l53K51K14k56L97j29
8083A65n26L81J2l17N4M33m44K51L48o02J33K08O9k03J92l88K22L61n16J83M9
8104F5k1O4j46L0p2N1j02K11k6m5j60L57q1j61K95k71k4K64m06L5K41J63j2l4
8128B15j22j76j32J67l74M41K0k41L19j44P8N2k36J64O4r3J86m20K53k10J33M3
8150a3m44L02J86J45l66K24J25k97Q7J46K5k28J06Q1m0j42K93m62M49k87k93N44
$$ y = [-12, 41, -238, -310, -6, 217, -233, -86, 140, 59, 183, 70, -166, -2, 77, -148, 43, 140, 64, -36, 33, -175, -196, 368, 145, -2, 131, 194, 7, 71, 19, -184, 41, 90, -45, 185, 113, 55, 78, 176, 26, -192, -62, -15, 178, 123, 39, -130, 252, -120, -46, 98, 48, -121, 426, 117, -25, -120, 70, 49, 3, 29, -53, -3, -25, -97, 153, 221, 62, -53, 205, 131, 285, 143, -55, -102, 38, -284, -5, 178, -3, -454, 189, -78, -73, 101, 41, -312, -61, 153, -103, 294, 165, -361, 20, 32, -285, -231, 202, -242, 9, 357, -245, -112, 96, 165, -38, 154, -234, -12, 349, -167, 16, 65, 44, 108, -38, -8, -80, -29, -131, 80, 54, 9, -151, 206, 125, -36, 259, -12, -36, 228, -178, -143, 98, 261, 249, 215, 93, -83, -215, -48, -422, 19, 39, -202, 117, -27, 51, 103, -133, 31, 95, 2, 188, -232, 21, -189, -56, -13, -457, -155, 31, 176, -190, 34, 159, -138, -51, 95, 120, -108, -2, 79, 39, -103, 190, -272, 177, -110, -403, 141]
8172A41o9r1K31m2j19j30N1P4j85j1j35J31J13j3j01L36j53j3j6
$$ y = [141, 72, -19, 212, 170, 51, -79, -28, 46, -139, -150, -285, -154, -41, -54, -155, 181, 28, 15, -1]
8191a
$$ Imaginary data points
##PAGE= N=2
##DATA TABLE= (X++(I..I)), XYDATA
0@%%%%%%%%%%%%Nj3J6j6J6k1K9l2L8m6N6o4P2q8J02j16J34j53J74j99K25k54K88
35A53l24L63m07M55n06N63o26O94p68Q48r36J035j142J257j385J525j680J854
53I73k046K260k503K781l101L470l907M435n086N908o980Q450j0593J3998k0227
68a2168L5103j31939r5791L28777p7639n5464J73354j24997p3503K49972j40359
79G5346j94388K48345K6002j95233J04467p7656j96456K14354M9798k55620J41040
90f0001J41552j92956N5081P5142j91644J52560K23907k15373k4020J89762j50709
101C301l6101J56775j60302j6329K59956j47353j92421J63915m9889j01940J93873
112G3485o1751j52069K25865r92k52737J19700Q8563j25477J52546M4266k39591
$$ y = [0, 0, 0, 0, 0, 0, 0, 0, 0, 0, 0, 0, 0, 5, -8, 8, -8, 8, -13, 16, -16, 22, -24, 32, -32, 40, -48, 54, -62, 72, -81, 93, -106, 119, -135, 153, -171, 192, -215, 240, -266, 297, -329, 365, -403, 445, -491, 544, -598, 659, -726, 799, -881, 973, -1073, 1187, -1316, 1465, -1636, 1834, -2073, 2362, -2724, 3184, -3796, 4654, -5939, 8059, -12168, 22935, -109004, -204795, 123982, 46343, -9121, 164233, 39236, -34267, 215705, 75346, -119042, 129303, 155305, -39928, 64539, -13117, -209573, 4781, 54579, -201041, -60001, 81551, -111405, -56324, 18818, -172826, -20266, 203641, -11732, -35752, 154010, 3301, -32800, 123975, -36327, -52656, 207300, 59947, -132474, 31441, -18448, -120388, 73485, 11734, -140335, 85530, 84538, -168199, -48499, 40064, -85413, 67133, 111399, -128192]
123a28192J11379J40795k26605K6105J78534j21647M2881J24691k31034k0339
133a03432K40793j23306q5273J90590q4918q7269J54486j40340j39442K45601
143F7490K851j82894J28772n993j55648J54987J8988j85269J80062J33649k01604
154d4609L8082R0474j51902R6830J37876j99098K0056J79393j76379q2828J33481
165D1376j08727n994J88364j50349j25890J96491m8455j29577J61227n121q0184
176f6839J88232l9970k10214J54103Q9086j51210R3791N2276j62494R7197O1095
187A05053k35974M7223J81868j28971r023R7787j61064J2768J76924j50195n4787
198a18391K20737n1981r6675J17123r4694p3056K16153l8275j66969J51025K0884
$$ y = [-128192, -16813, 123982, -102623, -76518, 102016, -19631, 23250, 147941, -83093, -103432, 137361, 14055, -71218, 119372, 34454, -52815, 101671, -38669, -178111, 67490, 70341, -112553, 16219, 10226, -145422, 9565, 28553, -156716, 23346, 156995, -44609, -6527, 83947, -67955, 28875, 166751, -32347, -12291, 167102, -9277, -92105, 41376, -67351, -73345, 115019, -35330, -161220, 35271, -13184, -142761, 18466, 13345, -66839, 121393, 81423, -128791, 25312, 114398, -36812, 56979, 109255, -53239, 43958, 105053, -130921, -83698, 98170, -30801, -39824, 57963, -103101, -90333, 86591, -63604, -118391, 102346, 50365, -46310, 70813, -23881, -96937, 119216, 80941, -86028, 64997, 85881]
209H5881j57757Q8916k655j37455J68328P5348k15579M3907J05847j34859N0315
220b9763R6440j45648O4597J59794j78999o5126J55798o8546j5442J39200j22733
231a0428o8035J80500q0699j42882J46934J1984q0305J25301n6205j59398J53747
242B0514N1886j63945Q6525P9199j19053P1220L3587j83512Q1391J59287j38281
253b1182j3715J11022j12610Q45J15951j41005k0602K00834p5948j11318J08052
264D0324n7945n9585J54077n6953j20188J64590J1121j63156P6075K6664r4735
275g9711J32745L5493j77873P6934J00550j47114K1569R5943r9623N4696J02358
286A15967j72402k9190J56904q0070m4605J19039p6339l8742J34399r9796j09267
$$ y = [85881, -71876, 17040, 14385, -123070, 45258, 120606, -94973, -51066, 54781, -80078, -29763, 66677, -78971, -14374, 145420, -33579, -98705, 57093, -11453, -26895, 112305, -10428, -78463, 102037, 21338, -121544, 25390, 37374, -42931, 82370, 26165, -133233, 20514, 72400, -91545, -5020, 74179, -44874, 26346, 59933, -123579, -42188, 117099, -21182, -34897, 76125, -36485, -35640, 80311, -60694, -81296, 119538, 43590, -67728, 40324, -17621, -77206, 76871, 19918, -100270, 64320, 75441, -87715, -11640, 15024, -79711, 53034, 88527, -89346, -12412, 88138, -58976, -37407, 58536, -41087, 13609, 115967, -56435, -85625, 71279, -8791, -53396, 65643, -10696, -49438, 84961, -14835, -124102]
297a24102J63186J3831r6986R3351k6948j05840J27214Q585j50560J05250Q7941
308I4922j21529L1298K9521j28499Q1269J07874j45207N323J26699r7220k9045
319d4594Q3701r9133J1352J62736r5536r6471J23414l2600p1675J06241m2549
330D886p1592J50389j7689j60186Q1352M6523q7412Q5578K0274j30797Q7114P1673
342H0113j56061J9575J09200p3882K9701O9999j37366K968J38003r3984m9888
353f1622J23457m4276l9801R1449r3094p3972J53255q000j06887Q7010j961q7693
365f2135Q7721j0301j15808J15237P2958j25852K4803M7327r3379N9502P1518
376G1591j21199L1725J17808j05686m2103Q1265o6246O626J14771r4312o3271
$$ y = [-124102, 39084, 52915, -44071, 49280, 22332, -83508, 43706, 52291, -98269, 6981, 94922, -26607, 4691, 34212, -94287, -13018, 94856, -50351, -45028, 81671, -15549, -44594, 39107, -60026, -48674, 114062, 18526, -77945, 45469, 12869, -58806, 47435, 4886, -66706, 83683, 65994, -94192, -12840, 33683, -53729, 31849, 52123, -78674, 8440, 80113, -75948, -56373, 52827, -21055, 8646, 78645, -58721, -55753, 82250, -11734, -61622, 61835, 17559, -22242, 69207, -23887, -97859, 55396, 47396, -59491, 27519, 25558, -62135, 25586, 15285, -100523, 14714, 87672, -38180, -13377, 33950, -59429, 73, 71591, -49608, -17883, 99925, -5761, -47864, 33401, -32845, -26219, 88552, -5760, -69031]
387f9031J22391m4367q5414R2146j4869m8670J14187l3987j25048R7351L9167
398D3856r6670O7225L6687r0052O9855L4900j38633M0566J04748q4895O102O5311
410E9000r8759N527R2954j01616k7353J29574m4565n6074P4690n9878m4090J22984
422E2394k9904q5339J06527J0450r4705N8374j121p6344J01565L5466j25375L9529
434h483N8673r5425K1968N2785q3548M5564Q5975j15666k9322R8763m8097j2226
446b9039Q4992o3930k3189J08231o4143q4913R9461O359n3766P1932l5519q7039
458g0563R4140J0859j10402O3628N5698p2646M0298J5553j05892O1037Q8735r4591
470b4146K838Q0562o6970l395N8856r0624o07J22579n8319o6821P2738l5143l9042
$$ y = [-69031, 53360, 8993, -76421, 15725, 856, -47814, 66373, 32386, -92662, 4689, 43856, -52814, 14411, 51098, -38954, 30901, 65801, -72832, -32266, 72482, -12413, -6311, 59000, -39759, -34232, 58722, -42894, -70247, 59327, 14762, -41312, 33378, -26500, -70590, 52394, 22490, -62849, 43678, 54128, -40577, 17797, 16676, -59668, 41897, 77363, -48012, -8483, 50190, -45235, -23267, 29518, -54030, -8466, 77509, -38157, -67479, 31284, -16813, -29039, 55953, -7977, -31166, 77065, 12922, -71991, 27470, 33829, -19937, 51995, 16476, -70563, 23577, 34436, -75966, -12338, 43360, -29286, 11012, 26565, -79327, -18290, 70445, -24146, -21308, 59254, -7716, -11111, 47745, -42879, -43486, 79093, 20774, -46047, 26691, -8452, -47494]
483d7494Q5066m2180o0416J12991J742j03722M8187J6016n4668P9791J3703j03825
495e4809N8741N6974j00481R254N6133n5795M0795N7809j08793q928R7831n5130
507f399k8697P4255m0936j3392P9808p2701o7635J02258K650o1920N8147j7813
519G625o1445P7768n886r5213P4169N7166p2712K6408K0022p8006N4390O1266
531F5552r2364J3347Q1590o6306j9995M6654o9686N117R6134o5594n3038Q0801
543B2212k8617m7729O7833k5162l6045J00565j1068r2016O0109K4946n8961N5489
555C1556J4902p6423N6066L3462j05669J2694O2539n5194J6842M4159q3283M700
567d3649P9125o6246k4080Q6955k3887k1181O0890n4142l9771R4836j3679o4490
$$ y = [-47494, 37572, -4608, -65024, 47967, 49709, -54013, -5826, 10190, -44478, 35313, 49016, -54809, 3932, 60906, -39575, -30321, 25812, -29983, 10812, 68621, -40172, -49100, 48731, -6399, -35096, 39159, -1777, -15169, 64639, -8062, -75697, 26561, 29211, -32709, 25438, 7625, -53820, 23948, 18062, -77151, -2982, 54184, -18528, 7880, 27902, -50104, 4286, 65552, -26812, -13465, 68125, 1819, -18176, 28478, -41208, -36091, 60043, -5551, -58589, 22212, -6405, -54134, 13699, -11463, -47508, 53057, 41989, -50027, 10082, 35028, -23933, 31556, 46458, -29965, 26101, 59563, -46106, -33412, 29127, -26067, -9225, 34934, -48349, -43649, 35476, -30770, -54850, 32105, 8218, -12963, 47927, -6215, -45986, 48850, 35171, -29319]
579b9319O4636M35o0788M7386j3872p2937P3692L6994q4396K3517L4139o3728
591d4241L1524M0516p2394L3228P6531p2816k2435N8053m3843P42O9649n8500
603c986k8967Q2687l8660o0518O1216q279l0917P2250k5187p4738O7957J7008
615B9866p1578M3074K6774n3528M5413J5284r2222L0275O5233n9081N175M7843
627C2528n6099Q541N5733o9936j1957R0712k7211l5100M8785l8337k8389P2738
639D2008k9783n7144P2592M763o6125L2297m899n0095O6573K1579p8049L5735
651a0548M3676o1482J6388L6600n0980L6251N8564p5773j5994O2801m0757j4975
663a6229N3543m4959j6364O8609m8104n8233O5100m96l5741N4545j6240n2263
$$ y = [-29319, 35317, 35752, -25036, 22350, 8478, -64459, 9233, 46227, -38169, -14652, 19487, -44241, -12717, 27799, -44595, -11367, 65164, -7652, -30087, 27966, -15877, -15135, 54514, -3986, -32953, 49734, 11074, -49444, 11772, 3493, -27424, 44826, 19639, -55099, 12858, 29866, -41712, 1362, 28136, -25392, 20021, 35305, -56917, -26642, 38591, -20490, -15315, 32528, -23571, -15030, 40703, -29233, -41190, 49522, 22311, -12789, 35996, -2341, -30730, 42008, 12225, -44919, 27673, 32436, -33689, -1392, -6291, -56386, 10187, 31766, -46283, -10548, 33128, -28354, -11966, 24634, -26346, 9905, 68469, -7304, -23298, 39503, -1254, -16229, 37314, -7645, -24009, 44600, -3504, -61737, 3363, 2867, -32874, 21671, 5431, -46832]
675d6832O4606N713p0733M8283L8318m8681K9945J2599p1775L4880N0420o7115
687b0372N210N4877m8377n454L8001n9486j156P9056l8180l7401N5750k3197l0826
700c1555N4013k5052l6250P5031j104o8066L5449J0422m3702M7203J1532o2238
712c4317M2792L4599p1403P037M1517l9557K2991L9498o6284k134O1527m7065
724a0799k2482N5991k4953j1825N2092m6985m1310P0066m502m4871M7353k318
736A5457m0425M8754p959o3716N3404L6835n5331J7635J8283n3576K9145L3708
748C2214o5247J4714O0909m7241j6062L5244m2291L883O3344m2856k9015O2884
760C0480j8847l9477M1726j5584k4051O5422j1690o3978M1430J5434m7281L1691
$$ y = [-46832, 17774, 23487, -47246, 1037, 39355, -9326, 20619, 33218, -38557, -3677, 46743, -20372, -15162, 39715, -8662, -14116, 23885, -35601, -36757, 42299, 4119, -33282, 22468, -729, -31555, 22458, -2594, -38844, 36187, 35083, -32983, 2466, 12888, -30814, 16389, 27921, -34317, 8475, 43074, -28329, -21292, 20225, -19332, 3659, 43157, -23127, -25261, 36266, -10799, -33281, 22710, -2243, -14068, 38024, -8961, -50271, 19795, 15293, -29578, 17775, 15457, -24968, 23786, 15827, -47889, 5515, 42350, -12981, 4654, 22937, -30639, -1494, 32214, -33033, -18319, 42590, -4651, -20713, 14531, -27760, -23877, 39467, -3389, -32404, 30480, 11633, -27844, 13882, -1702, -25753, 39669, 27979, -35999, 5431, 20865, -26416, 5275]
772E275J1958m6422M1940K3579p2073J1075M6645l6978J1210L3662n0438N728
784a4839N1885n0950k0178N9380j7396j7237M0787l8265k9024O1778j3682m5612
796c3353M8765N064m0513L4709q694n0051N2029K6148n6559K0676K6034m7007
808b2752J8561K5761n2011K2287N2613n1194j4066M0322l4094k883M8495l7970
820f931j6734N9020k7097m1489M2951p510k3969N0274j3416m8732M5551Q101n2050
833c2031L0700K0199l7550L1628J3968o0547K0333M1122m3800N800L7561l7658
845a0275K674L5928m8791q866N9031k3044k3508L9623k4114k3505M6658k0217
857A594l4944N4442L375m5832K7412K24l7724M2064J3218n1652K9492K8829m9831
$$ y = [5275, 17233, -29189, 12751, 36330, -35743, -24668, 21977, -15001, -3791, 29871, -20567, -14839, 37046, -13904, -34082, 25298, 7902, -9335, 31452, -6813, -35837, 25941, 12259, -33353, 15412, 20476, -20037, 14672, 5978, -44073, 7956, 34104, -22455, -1779, 24255, -22752, -4191, 21570, -30441, -8154, 44459, -6735, -20801, 19521, -14573, -17456, 31039, -6931, -23665, 35355, 8258, -33231, 9720, 2210, -21759, 28515, 15099, -33633, 11918, 20019, -32031, -1331, 18868, -18682, 12946, 26914, -33633, -13300, 27822, -15978, -10178, 27383, -10275, -7601, 28327, -20464, -29330, 29701, 6657, -16851, 22772, -1342, -24847, 21811, 1594, -33350, 21092, 24467, -21365, 6047, 6271, -31453, 10611, 23829, -27823, 1669, 30498, -19333]
870a9333P991K5727l7090K2177L8620n1677o025M5849l3180j3341M0954k6349
882e677p524M8651l3977l7617M8496l777k9985L8910q215l4325M2377j812n2666
895c7141L4709K5658l6520K1211J1171m6958K3982L1467m8116O867M2760l1458
907b368m222K7188m1114q70N2596k9217k4006M2124j5891k4516L4631j8887k5262
920b9814N3213j705m6384K8161O527l3236L1984P407m1172L3105K4255n1647O122
933a3184K8269l0341J5367K9168m5197J228M2624l6507j5742M0133j8467p232
945i881L8660l2094k7884M7877p654l2376L5939r63k9165L4155o341m5009L6523
958A787K2301l8954J7585J5177l8199J9466K2558m4522J2027M1830l3483p983
$$ y = [-19333, -11342, 14385, -22705, -528, 38092, -13585, -19610, 26239, -6941, -20282, 20672, -5677, -13201, 35450, 1473, -36144, 12352, 8575, -21410, 17500, 9285, -25040, 17337, 15525, -37141, -2432, 23226, -13294, 7917, 19088, -27870, -3888, 27579, -20537, -13670, 29090, -2368, -6590, 20598, -20516, -21386, 31210, 1993, -22013, 20111, 4220, -20296, 14335, -4552, -29814, 23399, 21694, -24690, 3471, 9998, -23238, 8746, 16153, -25019, 8086, 32341, -19306, -13184, 15085, -15256, 111, 29279, -15918, -14690, 27934, -8573, -24315, 15818, -2649, -9881, 28779, -3315, -31199, 16678, 9024, -23352, 12587, 11624, -17541, 16614, 10273, -34736, 1787, 24088, -14866, 2719, 17896, -20303, -837, 21721, -22801, -10774, 31056, -2427, -10410]
970a0410K7311l1514j168M0889k9411j7273M4353j6982k8099L0757j1778j9398
982b2723M4494o711l9697L2762P551l6325K4331J0789l1551K8979J5260m8736
994b1577J0501K9651l2507P138K6930l3907M163L3350l8020j1609M3082j5849
1006A346j2438L2749k3136j9539M1179j3973l0223L8656K492l0091K5014n543
1018F493l5198L4704J3565m0454J9744K0030l4957J1676J6945l5621J7172L5662
1030B9761l6242o085L0698k5523m572L2012k5807q988M1664k0992k8990L1225
1042H161o782j8827L4158q833l0534L3576L440l8502K2461J4591k6290K2936J0158
1055A9713m1312J5782K6389l4303M426K8325k6436K925K4927l5433n671M0885
$$ y = [-10410, 16901, -14613, -15781, 25108, -4303, -21576, 22777, 5795, -22304, 8453, -3325, -22723, 21771, 15060, -24637, 8125, 15676, -20649, 3682, 14471, -17080, 11899, 27159, -21577, -11076, 18575, -13932, -6794, 20136, -13771, -9608, 23742, -14278, -25887, 17195, 1346, -11092, 21657, -1479, -21018, 20161, 6188, -24035, 14621, 17113, -12978, 12036, 6493, -28705, 5999, 19564, -20890, -1146, 18884, -16073, -4397, 12548, -23073, -5901, 29761, -6481, -12566, 18132, -7391, -11963, 20049, -5758, -14746, 26918, 5926, -23064, 8161, 1379, -17448, 16710, 7877, -22657, 10919, 14359, -24143, -1682, 12909, -13381, 9555, 19713, -21599, -5817, 20572, -13731, -9305, 19020, -7416, -4491, 20436, -14997, -20668, 20217]
1067B0217j8426j5122L0690j6582j6060L2542j6541k4568L9245J153l1877K2078
1079F749j096k8362K8652P643l5312K2934J9799l5458Q207J7619k8385J5200K7703
1092B5893l4475j015L0893k5681q604K8211j9712n939L4049k2572k4074L1997
1104H971o544k1491K8988m359k3469K9889j308l4919K4461J5526k6445J7234J0566
1117A7100l2572J5228J9194l4078O414K8879k4677j660K0571k8200k542L4117
1129A7774k1376j2950L2464j2806j7325K5788j3164j7126L5864l203k9889K3494
1141G545K956k6714K0841N142k7904K3634J4658l6235Q100J9114k4731R959K1218
1154A7583k8675M167K7955k7511r461K8965j4481o276K7352k0669j6776L1329
$$ y = [20217, 1791, -13331, 17359, 777, -15283, 17259, 718, -23850, 15395, 16548, -15329, 6749, 5653, -22709, 5943, 13586, -21726, 1208, 21007, -14451, -6244, 11375, -17010, -1810, 25893, -8582, -9597, 21296, -4385, -12989, 15222, -4490, -10429, 23620, 1048, -23026, 8971, 2427, -19064, 9924, 5565, -17904, 11985, 10677, -24242, 219, 15745, -10700, 6534, 17100, -15472, -244, 18950, -15128, -8714, 20165, -4512, -6172, 14399, -13801, -16343, 17774, -3602, -16552, 15912, 3106, -14219, 11569, -1595, -18721, 17143, 13940, -15949, 7545, 10501, -16213, 4628, 9770, -18134, 5500, 20158, -16077, -7977, 11137, -13594, -3635, 17583, -11092, -6925, 21030, -6481, -15942, 13023, -1458, -7734, 19618, -1051, -17827, 13502]
1166A3502r485k2796K7095k23k0398K3345m465k9536K5280J2309k7668J4402J2694
1179A4056k6201J2349J3516l0870J0222K7482k4261l207K0342k2063j728K6756
1191A6393k1509q712L1672j2917j8783K2218r714j4203K9481n406k5625K4245
1203G140L345k6326J7201O177k2432K1414J0716l2629R893J8601k3775O615J8813
1216A4753k3088N021K2456k7053p395K8468j3728p626K3583j6790j2801K6974
1228A2774j1577k0186K6747M81j9393J9369l199k3445K2600Q147k5991J5611J2838
1241A4776k3990Q757J1513k5057J0341K2350k4193j725K0520j9315m042K1928
1253A1863j7955n237K7647j4021j7311K2171o866j3637K3797m437j9271K2956
$$ y = [13502, 4017, -18779, 8316, 8093, -12305, 11040, 6575, -22961, 2319, 14628, -13040, 1362, 14056, -12145, 204, 13720, -17150, -6928, 20554, -3707, -6914, 13428, -8635, -10363, 16393, -5116, -13828, 17844, 4927, -13856, 8362, -1352, -15555, 13926, 8520, -17105, 7140, 10485, -15841, 1360, 7537, -14895, 6519, 17235, -15394, -5501, 13100, -10675, -4060, 14753, -8335, -3314, 19142, -7911, -15306, 13162, -566, -8192, 15391, -1399, -14200, 12774, 1197, -18989, 7758, 8239, -11154, 8215, 5016, -18429, 4171, 12318, -13673, 1938, 14776, -9214, -457, 11056, -14001, -3660, 18690, -5503, -7228, 13292, -6023, -10065, 11863, -6092, -11329, 16318, 2297, -15014, 7157, 291, -13346, 10451, 6014, -13257, 9699]
1265I699N98k5548J6803P873j9679J5895P586k6024J1090J4712k4265M793J9027
1278A2560j8930K432J7220k2877k827K5339j5089q104K3116j1605j0991K1303
1290A1547j1431j5276K5687j110j9920J7594q20j9994J7749L835k2292J6653J1552
1303A3774k3911O756J1264j9783R058J7367k2086J857K0548j8470n390J8784j3139
1316c371l278K1968j4442j3623K1558o432j4937J9253k863j4672J9912k427k2972
1329a6326J6654Q505j8685J2502P444k0193J0447J1590k3061N630J8552j6127
1341c068m7J4507j8884j063K0746j5020p686K1717r344j0905J7201r644j1896
1354a3386K2726k429j8257J6887J148j7665J3983L200j8294J5730R524k2364O472
$$ y = [9699, 10297, -15251, 1552, 9425, -10254, 5641, 13227, -12797, -1707, 13005, -11260, -6467, 12560, -6370, -3938, 13282, -9595, -12422, 12917, -2172, -10276, 12840, 1235, -9756, 11547, 116, -15160, 10527, 9417, -10503, 7091, 6271, -13723, 4026, 7861, -14431, 2222, 13774, -10137, -3381, 7883, -11900, -2842, 14525, -7561, -5704, 14844, -3626, -9016, 9768, -3371, -6649, 15319, 877, -12746, 8812, 2380, -12557, 6696, 3833, -10839, 9073, 6646, -16326, 328, 8833, -9852, 2650, 10094, -10099, 348, 11938, -11123, -5493, 13059, -3068, -3115, 11392, -7492, -8555, 12191, -2829, -10515, 11202, 1858, -9047, 8154, -1490, -13386, 9340, 6911, -11346, 5541, 6689, -10976, 3007, 6207, -12087, 3643, 13167, -9197, -2725]
1367b725J1584j7920O662J3735j8223K577J7741j8001n062J7643j0928l616J8390
1380A1857j2337j0148J9532p440j3898J7994j250j2604J6140k427j8416J5312
1392B315O056j7586J0937P651j7088Q026Q709j9598O158J5986j6287N1J4135j5148
1406e683j751J6757j3393m713J9871r070j0481J5621o829j0111J8393l829j4080
1419i298J5897L32j6927J1352L913j5297J3108O381j8927P284J0106j6402M603
1432c875J2338j4209L475J3776j6213l256J6892j0115m413J5543r262q082J6204
1445H803q003j1890J6585q78j2230J2646j823j4182J3247L177j5815J0667Q130
1458H434j4969O494O877j5301O466J2704j4587J137J3026j2847k518J3104j1509
$$ y = [-2725, 8859, -9061, -2399, 11336, -6887, -4310, 13431, -4570, -9632, 8011, -2917, -6533, 11857, -480, -10628, 8904, 1464, -12434, 5560, 4310, -8294, 7846, 5419, -12997, 2315, 8371, -9215, 1722, 9373, -7715, 311, 9020, -10578, -4420, 11566, -4721, -4670, 9465, -5683, -7434, 9323, -4070, -8783, 11088, 2018, -8463, 7158, 329, -9782, 8611, 4782, -9298, 6599, 6931, -9996, 1356, 5269, -10028, 3080, 9461, -9466, -2182, 7924, -8478, -3875, 8463, -5746, -2271, 11505, -4708, -7964, 8928, -1187, -5600, 9943, 681, -7401, 8803, 800, -11090, 5495, 4617, -7613, 5033, 3210, -10972, 2275, 5452, -10363, 304, 8434, -6535, -41, 6836, -8465, -1999, 10705, -3882, -2745, 10281, -2566, -5084, 8020, -3489]
1471c489k956J6852r443r511J3998n801q912J4255l165j0910J4693k47j4977J0937
1485A324L747j2192J0207N356j5340P509Q333j5346L926J0718j1976K329J0532
1498I127j4030j817J3729r791m061J3663p214o437J3147o918q969J4984j076j0895
1512f558J1312l15j1876J0509J888j2687R679O469j3629M714O247j2754N064R591
$$ y = [-3489, -6445, 10407, 964, -8547, 5451, -350, -9262, 4993, 1828, -9082, 5611, 5364, -9613, 1324, 5071, -7121, 3086, 8442, -6898, 611, 8944, -6402, -2476, 8242, -3734, -1405, 9127, -4903, -6720, 7009, -2782, -6843, 6820, -394, -6831, 6316, -602, -9571, 5413, 4337, -6558, 4754, 4439, -7437, 3072, 4960, -7727, 1952, 8421, -5208, -494, 5753, -7001, -1937, 7654]
$$ [...]
8191a06
##END NTUPLES=NMR FID
##END=
