##TITLE=1H_Pr 2066-3
 CDCl3, 8 sc, 
 11.2.2019
##JCAMPDX= 6.0         $$ Bruker NMR JCAMP-DX V2.0
##DATA TYPE= NMR FID
##DATA CLASS= NTUPLES
##ORIGIN= UXNMR, Bruker Analytische Messtechnik GmbH
##OWNER= root
$$ XWIN-NMR		Version 3.5
$$ Mon Feb 11 14:53:34 2019 Russian Standard Time (UT+4h)  she@DPX200
##.OBSERVE FREQUENCY= 200.1313
##.OBSERVE NUCLEUS= ^1H
##.DELAY= (6, 6)
##.ACQUISITION MODE= SIMULTANEOUS
##.ACQUISITION SCHEME= undefined
##.AVERAGES= 8
##.DIGITISER RES= 18
##SPECTROMETER/DATA SYSTEM= spect
##.PULSE SEQUENCE= zg30
##.SOLVENT NAME= CDCl3
##.SHIFT REFERENCE= (INTERNAL, CDCl3, 0, 15.7039)
##AUDIT TRAIL= $$ (NUMBER, WHEN, WHO, WHERE, WHAT)
$$ ##TITLE= Audit trail, XWIN-NMR		Version 3.5
$$ ##JCAMPDX= 5.01
$$ ##ORIGIN= Bruker BioSpin GmbH
$$ ##OWNER= she
$$ F:/spectra/data/she/nmr/H-F/1/audita.txt
$$ ##AUDIT TRAIL=  $$ (NUMBER, WHEN, WHO, WHERE, WHAT)
(   1,<2019-02-11 14:52:25.21 +0400>,<she>,<DPX200>,
      <created by zg, POWCHK disabled, PULCHK disabled
       configuration hash MD5:
       00 E9 B6 7A A2 85 ED C7 34 08 36 98 17 FE 4E 26
       data hash MD5: 16K
       AA 4E 81 3A 67 3E 51 5C EC A1 27 0D 0E 1F 31 7F>)
$$ ##END=
$$ 
$$ hash MD5
$$ AB D6 C3 BF DF 45 61 6F BB CA 99 EF 6E C7 78 02
##$RELAX= 
##$RELAX= 
##$RELAX= 
##$RELAX= 
##$RELAX= 
##$RELAX= 
$$ Bruker specific parameters
$$ --------------------------
##$DU= <F:/spectra>
##$EXPNO= 1
##$NAME= <H-F>
##$PROCNO= 1
##$TYPE= <nmr>
##$USER= <she>
##$AMP= (0..31)
100 100 100 100 100 100 100 100 100 100 100 100 100 100 100 100 100 100 
100 100 100 100 100 100 100 100 100 100 100 100 100 100 
##$AQSEQ= 0
##$AQ_mod= 1
##$AUNM= <au_zg>
##$AUTOPOS= <>
##$BF1= 200.13
##$BF2= 200.13
##$BF3= 200.13
##$BF4= 200.13
##$BF5= 200.13
##$BF6= 200.13
##$BF7= 200.13
##$BF8= 200.13
##$BYTORDA= 1
##$CFDGTYP= 0
##$CFRGTYP= 5
##$CHEMSTR= <none>
##$CNST= (0..31)
1 1 145 1 1 1 1 1 1 1 1 1 1 1 1 1 1 1 1 1 1 1 1 1 1 1 1 1 1 1 1 1 
##$CPDPRG= <>
##$CPDPRG1= <>
##$CPDPRG2= <>
##$CPDPRG3= <>
##$CPDPRG4= <mlev>
##$CPDPRG5= <mlev>
##$CPDPRG6= <mlev>
##$CPDPRG7= <mlev>
##$CPDPRG8= <mlev>
##$CPDPRGB= <>
##$CPDPRGT= <>
##$D= (0..31)
0 1.2 0 0 0 0 0 0 0 0 0 0.03 0 0 0 0 0 0 0 0 0 0 0 0 0 0 0 0 0 0 0 0 
##$DATE= 1549882344
##$DBL= (0..7)
120 120 120 120 120 120 120 120 
##$DBP= (0..7)
150 150 150 150 150 150 150 150 
##$DBP07= 0
##$DBPNAM0= <>
##$DBPNAM1= <>
##$DBPNAM2= <>
##$DBPNAM3= <>
##$DBPNAM4= <>
##$DBPNAM5= <>
##$DBPNAM6= <>
##$DBPNAM7= <>
##$DBPOAL= (0..7)
0.5 0.5 0.5 0.5 0.5 0.5 0.5 0.5 
##$DBPOFFS= (0..7)
0 0 0 0 0 0 0 0 
##$DE= 6
##$DECBNUC= <off>
##$DECIM= 32
##$DECNUC= <off>
##$DECSTAT= 4
##$DIGMOD= 1
##$DIGTYP= 9
##$DL= (0..7)
0 120 120 120 120 120 120 120 
##$DP= (0..7)
150 150 150 150 150 150 150 150 
##$DP07= 0
##$DPNAME0= <>
##$DPNAME1= <>
##$DPNAME2= <>
##$DPNAME3= <>
##$DPNAME4= <>
##$DPNAME5= <>
##$DPNAME6= <>
##$DPNAME7= <>
##$DPOAL= (0..7)
0.5 0.5 0.5 0.5 0.5 0.5 0.5 0.5 
##$DPOFFS= (0..7)
0 0 0 0 0 0 0 0 
##$DQDMODE= 0
##$DR= 18
##$DS= 0
##$DSLIST= <SSSSSSSSSSSSSSS>
##$DSPFIRM= 0
$$ [...]
##$SUBNAM2= <"">
##$SUBNAM3= <"">
##$SUBNAM4= <"">
##$SUBNAM5= <"">
##$SUBNAM6= <"">
##$SUBNAM7= <"">
##$SUBNAM8= <"">
##$SUBNAM9= <"">
##$SW= 20.0189088683792
##$SWIBOX= (0..15)
0 0 2 0 0 0 0 0 0 0 0 0 0 0 0 0 
##$SW_h= 4006.41025641026
##$TD= 16384
##$TD0= 1
##$TE= 0
##$TE2= 300
##$TE3= 300
##$TEG= 300
##$TL= (0..7)
0 120 120 120 120 120 120 120 
##$TP= (0..7)
150 150 150 150 150 150 150 150 
##$TP07= 0
##$TPNAME0= <>
##$TPNAME1= <>
##$TPNAME2= <>
##$TPNAME3= <>
##$TPNAME4= <>
##$TPNAME5= <>
##$TPNAME6= <>
##$TPNAME7= <>
##$TPOAL= (0..7)
0.5 0.5 0.5 0.5 0.5 0.5 0.5 0.5 
##$TPOFFS= (0..7)
0 0 0 0 0 0 0 0 
##$TUNHIN= 0
##$TUNHOUT= 0
##$TUNXOUT= 0
##$USERA1= <user>
##$USERA2= <user>
##$USERA3= <user>
##$USERA4= <user>
##$USERA5= <user>
##$V9= 5
##$VALIST= <valist>
##$VCLIST= <CCCCCCCCCCCCCCC>
##$VD= 0
##$VDLIST= <DDDDDDDDDDDDDDD>
##$VPLIST= <PPPPPPPPPPPPPPP>
##$VTLIST= <TTTTTTTTTTTTTTT>
##$WBST= 1024
##$WBSW= 4
##$XGAIN= (0..3)
0 0 0 0 
##$XL= 0
##$YL= 0
##$YMAX_a= 225987
##$YMIN_a= -247402
##$ZGOPTNS= <>
##$ZL1= 120
##$ZL2= 120
##$ZL3= 120
##$ZL4= 120
##$ABSF1= 10
##$ABSF2= 0
##$ABSG= 5
##$ABSL= 3
##$ALPHA= 0
##$AQORDER= 0
##$ASSFAC= 0
##$ASSFACI= 0
##$ASSFACX= 0
##$ASSWID= 0
##$AUNMP= <proc_1d>
##$AZFE= 0.1
##$AZFW= 0.1
##$BCFW= 1
##$BC_mod= 2
##$BYTORDP= 1
##$COROFFS= 0
##$CY= 11.3945322036743
##$DATMOD= 1
##$DC= 2
##$DFILT= <>
##$DTYPP= 0
##$F1P= 18.9103706918063
##$F2P= -1.10871071338519
##$FCOR= 0.5
##$FTSIZE= 0
##$FT_mod= 4
##$GAMMA= 1
##$GB= 0.15
##$INTBC= 1
##$INTSCL= 1
##$ISEN= 128
##$LB= 0.24
##$LEV0= 0
##$LPBIN= 0
##$MAXI= 10000
##$MC2= 0
##$MEAN= 0
##$ME_mod= 0
##$MI= 1.114404
##$NCOEF= 0
##$NC_proc= 0
##$NLEV= 6
##$NOISF1= 3.799351
##$NOISF2= 2.8
##$NSP= 1
##$NTH_PI= 0
##$NZP= 0
##$OFFSET= 15.70392
##$PC= 1
##$PHC0= -8677.403
##$PHC1= 9.60018
##$PH_mod= 1
##$PKNL= yes
##$PPARMOD= 0
##$PSCAL= 0
##$PSIGN= 0
##$REVERSE= no
##$SF= 200.130013532006
##$SI= 16384
##$SIGF1= 3
##$SIGF2= 2
##$SINO= 400
##$SIOLD= 16384
##$SREGLST= <1H.CDCl3>
##$SSB= 0
##$STSI= 0
##$STSR= 0
##$SW_p= 3612.71676300578
##$SYMM= 0
##$S_DEV= 0
##$TDeff= 0
##$TDoff= 0
##$TI= <>
##$TILT= no
##$TM1= 0
##$TM2= 0
##$TOPLEV= 0
##$USERP1= <user>
##$USERP2= <user>
##$USERP3= <user>
##$USERP4= <user>
##$USERP5= <user>
##$WDW= 1
##$XDIM= 8192
##$YMAX_p= 0
##$YMIN_p= 0
$$ End of Bruker specific parameters
$$ ---------------------------------
##NTUPLES= NMR FID
##VAR_NAME=  TIME,          FID/REAL,        FID/IMAG
##SYMBOL=    X,             R,               I
##VAR_TYPE=  INDEPENDENT,   DEPENDENT,       DEPENDENT
##VAR_FORM=  AFFN,          ASDF,            ASDF
##VAR_DIM=   8192,          8192,            8192
##UNITS=     SECONDS,       ARBITRARY UNITS, ARBITRARY UNITS
##FACTOR=    0.0002496,     1,               1
##FIRST=     0,             0,               0
##LAST=      2.0444736,     0,               0
##MIN=       0,             -247402,         0
##MAX=       2.0444736,     225987,          0
$$ Real data points
##PAGE= N=1
##DATA TABLE= (X++(R..R)), XYDATA
$$ plain form
0 0 0 0 0 0 0 0 0 0 0 0 0 8 -8 8 -8 16 -16 18 -24 32 -33 41 -49 57 -70 81 -94 106 -126 144 -165 187 -214
33 -214 241 -273 308 -346 387 -434 483 -539 599 -666 737 -814 899 -994 1095 -1207 1328
50 1328 -1465 1613 -1779 1963 -2167 2398 -2663 2960 -3311 3721 -4212 4811 -5560 6530 -7846
65 -7846 9729 -12684 18000 -30658 129876 53506 -23556 175789 791 38912 148098 -38708
77 -38708 -28387 179045 -83787 -247402 -51858 -83174 -123397 65771 -73640 -188032 64414
88 64414 24094 -180513 27088 123105 27887 165428 112664 -124021 58893 174827 -51484
99 -51484 9243 134396 -33213 1467 49033 -195337 -122629 131552 -26162 -99887 48624
110 48624 -67367 -92339 75184 -72084 -120706 160980 101320 -92460 26240 -5235 -90954
$$ packed form
0@%%%%%%%%%%%Qj6J6j6K4l2L4m2N6o5P4r0J06j27J51j75K00k32K70l09L52m01
33b14M55n14N81o54P33q21R17j022J138j265J403j551J713j893K089k302K535
50A328k793L078l392L742m130M565n061N623o271P032p933R023j0371J2090j4376
65g846J7575k2413L0684m8658J60534p6370p7062J99345j74998L8121J09186j86806
77c8708J0321K07432k62832j63615J95544l1316m0223J89168j39411j14392K52446
88F4414m0320k04607K07601R6017r5218J37541n2764k36685J82914J15934k26311
99e1484O0727J25153j67609L4680M7566k44370P2708K54181j57714p3725J48511
110D8624j15991k4972J67523j47268m8622K81686n9660j93780J18700l1475q5719
$$ plain form
121 -90954 112263 75772 -111829 80450 138882 -93362 -34008 40344 -68597 85884 151314
132 151314 -109991 -58618 108156 -73344 -91912 50540 -60849 -21872 120973 -104136
142 -104136 -183211 57868 11447 -70843 83077 14771 -50322 135388 34734 -136787 83958
153 83958 153213 -2745 73056 45337 -112131 36839 72577 -148631 -45265 98617 -67464
164 -67464 -69860 -13937 -160211 -51722 129907 -48849 -74774 117582 22791 -39119 81313
175 81313 -15313 -14125 200233 77315 -100764 44920 31124 -83573 37543 -1395 -117575
186 -117575 61577 55197 -176416 -80576 34143 -62432 32232 77209 -92640 8853 131892
197 131892 -65399 -58933 115319 32223 31298 111798 -72738 -93750 105702 -2445 -103871
$$ packed form
121i0954K03217l6491j87601J92279N8432k32244N9354P4352j08941J54481O5430
132A51314k61305N1373J66774j81500j8568J42452j11389L8977J42845k25109
142a04136p9075K41079m6421q2290J53920o8306o5093J85710j00654j71521K20745
153H3958O9255j55958P5801k7719j57468J48970L5738k21208J03366J43882j66081
164f7464k396N5923j46274J08489J81629j78756k5925J92356r4791o1910J20432
175H1313r6626J188K14358j22918j78079J45684j3796j14697J21116l8938j16180
186a17575J79152o380k31613R5840J14719r6575R4664M4977j69849J01493J23039
197A31892j97291O466J74252q3096r25Q0500j84536k1012J99452j08147j01426
$$ plain form
208 -103871 56164 17101 -64212 44049 -57221 -154672 67562 88726 -76883 21284 49125
219 49125 -68309 37051 47903 -103861 41368 155057 -35766 -43078 37526 -68840 -4333
230 -4333 95858 -68079 -48408 119825 -18464 -106278 17561 -30052 -26052 119874 -3999
241 -3999 -109260 63950 36021 -94102 20711 33514 -33390 96491 46082 -139768 -8675
252 -8675 85347 -48463 5512 63033 -52335 21576 71186 -118199 -69113 108332 7913
263 7913 -24984 53836 -61350 -52990 86785 -40768 -93682 96617 57981 -50844 27405
274 27405 -33227 -82894 92111 57274 -88773 39845 73425 -65082 -6843 7923 -84412
285 -84412 54461 110231 -80119 -49274 56803 -50084 -27461 52482 -52025 1726 121917
$$ packed form
208a03871J60035l9063q1313J08261j01270r7451K22234K1164j65609R8167K7841
219D9125j17434J05360J0852j51764J45229J13689j90823p312Q0604j06366O4507
230d333J00191j63937J9671J68233j38289q7814J23839m7613M000J45926j23873
241c999j05261J73210k7929j30123J14813J2803o6904J29881n0409j85850J31093
252h675R4022j33810N3975N7521j15368P3911M9610j89385M9086J77445j00419
263G913l2897P8820j15186Q360J39775j27553n2914J90299l8636j08825P8249
274B7405o0632m9667J75005l4837j46047J28618L3580j38507N8239J4766r2335
285h4412J38873N5770j90350L0845J06077j06887K2623P9943j04507N3751J20191
$$ plain form
296 121917 -40872 -101964 45638 7278 -19347 81636 -11779 -61561 84586 9423 -117116
307 -117116 18420 51775 -23167 56088 7087 -114518 21428 64548 -82182 -8286 77762
318 77762 -21076 14059 34209 -104995 -22130 116833 -12161 -38190 64802 -19704 -33622
329 -33622 50208 -59518 -61767 112691 36455 -78975 14370 -12364 -60711 57857 11291
340 11291 -79058 68200 72902 -82668 -21712 24014 -41724 57591 73703 -77395 -6061 81391
352 81391 -56683 -49959 45248 -21544 15885 82526 -70513 -85404 63001 -3483 -54403 49721
364 49721 2670 -28082 69652 -24240 -107681 51728 68986 -31556 34847 20445 -61426 38475
376 38475 33850 -93085 12682 95789 -25234 -18237 11376 -80626 -4963 77781 -53923 -39850
$$ packed form
296A21917j62789o1092J47602l8360k6625J00983r3415m9782J46147p5163j26539
307a17116J35536L3355p4942P9255m9001j21605J35946M3120j46730P3896Q6048
318G7762r8838L5135K0150j39204Q2865J38963j28994k6029J02992q4506j3918
329c3622Q3830j09726k249J74458p6236j15430R3345k6734m8347J18568m6566
340A1291r0349J47258M702j55570O0956M5726o5738R9315J6112j51098P1334Q7452
352H1391j38074O724R5207o6792L7429O6641j53039j4891J48405o6484n0920J04124
364D9721m7051l0752R7734r3892q3441J59409J7258j00542O6403j4402q1871R9901
376C8475m625j26935J05767Q3107j21023O997K9613r2002P5663Q2744j31704J4073
$$ plain form
388 -39850 80584 -10916 -52510 20837 -43981 -20882 111331 11621 -71735 48100 22226
399 22226 -51553 34956 8607 -40251 83782 45774 -102504 -17545 35675 -45535 16406 32850
411 32850 -68520 11699 58765 -86941 -55834 61068 -456 10964 61070 -50472 -32789
422 -32789 84801 -12233 -54093 69796 35769 -16087 42652 -39729 -84955 57911 34690
433 34690 -71387 13072 23718 -57312 4973 -6798 -86674 35997 92101 -39839 -17566
444 -17566 41924 -31944 11038 61155 -39692 5708 104428 -16544 -65748 19865 -24089 -21086
456 -21086 62866 -29207 -70171 50312 -1115 -88559 6231 15300 -19373 69234 22240 -81886
468 -81886 25932 60716 -41679 14085 55014 -20114 31497 39533 -90446 -33684 70716
$$ packed form
388c9850J20434r1500m1594P3347o4818K3099J32213r9710q3356J19835k5874
399B2226p3779Q6509k6349m8858J24033l8008j48278Q4959N3220q1210O1941J6444
411C2850j01370Q0219M7066j45706L1107J16902o1524J1420N0106j11542J7683
422c2789J17590r7034m1860J23889l4027n1856N8739q2381m5226J42866k3221
433C4690j06077Q4459J0646q1030O2285j1771p9876J22671N6104j31940K2273
444a7566N9490p3868M2982N0117j00847M5400R8720j20972m9204Q5613m3954L003
456b1086Q3952r2073m0964J20483n1427q7444R4790R069l4673Q8607m6994j04126
468h1886J07818L4784j02395N5764M0929p5128N1611Q036j29979N6762J04400
$$ plain form
479 70716 -18270 -25891 34107 -41872 -27876 46383 -52750 -58609 78849 33784 -33452 27122
491 27122 -18484 -43231 64937 18878 -60420 48205 53713 -48418 -6657 -3892 -54516 46468
503 46468 61670 -62964 -13311 50540 -38889 -22613 27205 -35933 17180 81292 -45200 -66589
515 -66589 36436 -8780 -27303 42741 -16654 -27973 67581 -9076 -82796 29769 42502 -10122
527 -10122 49172 13596 -54466 39982 36768 -69646 2251 55276 -23278 465 2878 -89079
539 -89079 -18886 55476 -45268 -34292 50242 -13017 -18838 34261 -37755 -14177 103192 31754
551 31754 -31959 45910 13482 -28912 40348 -5150 -52151 52423 27797 -85640 -32470 -7814
563 -7814 -55732 13837 19345 -64788 9809 57152 -46911 -23485 50588 7157 40538 77563
$$ packed form
479G0716q8986p621N9998p5979J3996P4259r9133n859J37458m5065o7236O0574
491B7122m5606k4747J08168m6059p9298J08625N508j02131M1761K765n0624J00984
503D6468J5202j24634M9653O3851q9429J6276M9818o3138N3113O4112j26492k1389
515f6589J03025m5216j8523P0044n9395j1319R5554p6657p3720J12565J2733n2624
527a0122N9294l5576o8062R4448l214j06414P1897N3025p8554K3743K413r1957
539h9079P0193P4362j00744J0976Q4534o3259n821N3099p2016K3578J17369p1438
551C1754o3713P7869l2428m2394O9260m5498m7001J04574k4626j13437N3170K4656
563g814m7918O9569N508q4133P4597M7343j04063K3426P4073m3431L3381L7025
$$ plain form
575 77563 -28330 -21109 69116 -4970 -39064 36909 -922 -21430 33336 -48451 -92400 24105
587 24105 16069 -51491 13441 8786 -40328 30150 12309 -64481 32231 80516 -10418 7582
599 7582 28244 -38436 14056 51571 -45503 -12600 69889 -14183 -43185 8353 -40297 -17884
611 -17884 64071 -15514 -52074 42123 5250 -51420 12799 -4916 -25478 62929 19956 -73229
623 -73229 4625 30658 -35479 14123 29375 -27830 36042 48099 -60207 -20627 56256 -1146
635 -1146 8010 40154 -36418 -17268 45386 -42378 -57707 38802 5821 -28737 15305 -39887
647 -39887 -56267 43322 11897 -47366 36952 41545 -19187 25394 10175 -40460 50007 68634
659 68634 -30789 -385 34272 -35052 -10736 14378 -55137 -6303 55604 -41260 -58483 11453
$$ packed form
575G7563j05893P221R0225p4086l4094P5973l7831k0508N4766q1787m3949J16505
587B4105q036o7560O4932m655m9114P0478j7841p6790R6712M8285r0934J8000
599G582K0662o6680N2492L7515r7074L2903Q2489q4072k9002N1538m8650K2413
611a7884Q1955p9585l6560R4197l6873n6670O4219j7715k0562Q8407m2973r3185
623g3229P7854K6033o6137M9602J5252n7205O3872J2057j08306L9580P6883n7402
635a146R156L2144p6572J9150O2654q7764j5329R6509l2981l4558M4042n5192
647c9887j6380R9589l1425n9263Q4318M593o0732M4581j5219n0635R0467J8627
659F8634r9423L0404L4657o9324K4316K5114o9515M8834O1907r6864j7223O9936
$$ plain form
671 11453 -26279 -18668 44586 -15794 -22529 66155 9899 -49238 27104 25357 -1617 57573 12089
684 12089 -53865 27130 26817 -56568 -4530 26417 -25174 14677 10848 -75578 -17583 48319 -24415
697 -24415 -14419 38008 -15030 -2795 36943 -41269 -28645 68722 19548 -25599 25100 -10709
709 -10709 -28864 37812 -6587 -46820 44532 35075 -42322 -3202 -2569 -38757 33195 32823 -48527
722 -48527 6289 43023 -36784 -20860 17065 -26918 18057 55159 -38084 -34262 39647 -12153
734 -12153 -23400 34689 -6702 -6795 55697 -15251 -59388 28919 21722 -21297 28793 2904 -39187
747 -39187 28889 7882 -65868 5909 41742 -19436 7310 10823 -52053 4850 44308 -34982
759 -34982 -9667 53480 -4264 -10966 20503 -36883 -12975 63469 -2161 -35689 31356 -729
$$ packed form
671A1453l7732P611O3254o0380o735Q8684n6256n9137P6342j747k6974N9190m5484
684A2089o5954Q0995l13q3385N2038L0947n1591L9851l829q6426N7995O5902p2734
697b4415R996N2427n3038J2235L9738p8212J2624R7367m9174m5147N0699l5809
709a0709j8155O6676m4399m0233R1352r457p7397L9120O33l6188P1952l72q1350
722d8527N4816L6734p9807J5924L7925m3983M4975L7102r3243L822P3909n1800
734a2153j1247N8089m1391r3O2492p0948m4137Q8307p197m3019N0090k5889m2091
747c9187O8076k1007p3750P1777L5833o1178K6746L513o2876N6903L9458p9290
759c4982K5315O3147n7744o702L1469n7386K3908P6444o5630l3528O7045l2085
$$ plain form
771 -729 -33602 17625 -15450 -33680 50569 21943 -53477 411 12166 -29913 21383 19829 -35609
784 -35609 26616 43755 -46218 -20883 29854 -11894 13313 37693 -36546 -16246 43546 -25317
796 -25317 -37813 31583 2611 -6417 35248 -28042 -48951 38381 13139 -36356 25310 18053
808 18053 -22850 23720 -2831 -55172 25893 47209 -26758 1440 19460 -33717 5346 24654
820 24654 -44028 -249 58242 -14929 -27282 15148 -25854 -8250 45704 -16980 -27146 46240
832 46240 1783 -41396 12474 -3338 -16777 48141 9293 -50112 16071 20265 -37279 6438
844 6438 18116 -21869 28225 26597 -54817 -13136 37679 -16255 -1102 30752 -23707 -3346
856 -3346 36028 -36325 -33649 43146 8176 -14158 24685 -20962 -31030 37358 -3016 -41415
$$ packed form
771g29l2873N1227l3075j8230Q4249k8626p5420N3888J1755m2079N1296j554n5438
784c5609O2225J7139q9973K5335N0737m1748K5207K4380p4239K0300N9792o8863
796b5317j2496O9396k8972r028M1665o3290k0909Q7332k5242m9495O1666p257
808A8053m0903M6570k6551n2341Q1065K1316p3967K8198J8020n3177L9063J9308
820B4654o8682M3779N8491p3171j2353M2430m1002J7604N3954o2684j0166P3386
832D6240m4457m3179N3870j5812j3439O4918l8848n9405O6183M194n7544M3717
844F438J1678l9985N0094j628q1414M1681N0815n3934J5153L1854n4459K0361
856c346L9374p2353K676P6795l4970k2334L8843m5647j0068O8388m0374l8399
$$ plain form
868 -41415 33269 26449 -25759 10005 -5903 -40990 31315 34097 -37527 5798 32087 -27787
880 -27787 -4958 13707 -34615 13271 53423 -27479 -28028 26620 -16304 -15129 29549 -17614 -12590
893 -12590 49613 -9717 -48972 17133 7220 -15194 34199 1832 -35890 29647 15804 -47481
905 -47481 5825 28695 -13156 20206 14228 -48401 728 36010 -29949 -10349 34108 -13093
917 -13093 -4619 20808 -40629 -21490 49333 607 -22968 26553 -5899 -21103 27796 -11840
929 -11840 -31728 45061 25349 -34250 6154 2021 -30657 23974 16731 -39207 16155 34113
941 34113 -36284 -15310 13842 -23037 15420 39271 -32631 -15325 37443 -16960 -22551 26817
953 26817 -6579 -1831 43047 -18745 -43182 27736 8040 -24628 23556 4442 -24169 27889
$$ packed form
868d1415P4684o820n2208L5764j5908l5087P2305K782p1624M3325K6289n9874
880b7787K2829J8665m8322M7886M0152q0902n49N4648m2924J175M4678m7163N024
893a2590O2203n9330l9255O6105r913k2414M9393l2367l7722O5537j3843o3285
905d7481N3306K2870m1851L3362n978o2629M9129L5282o5959J9600M4457m7201
917a3093Q474K5427o1437J9139P0823m8726k3575M9521l2452j5204M8899l9636
929a1840j9888P6789j9712n9599M0404m133l2678N4631p243n5938N5362J7958
941C4113p0397K0974K9152l6879L8457K3851p1902J7306N2768n4403n591M9368
953B6817l3396M748M4878o1792k4437P0918j9696l2668M8184j9114k8611N2058
$$ plain form
965 27889 1124 -51316 14041 33238 -18581 9954 12648 -35297 7979 25792 -37599 -4441
977 -4441 43430 -10295 -11385 14689 -31140 -9256 43949 -11949 -22751 36418 1257 -25253
989 -25253 16275 -11349 -20024 44905 11628 -40464 11475 9978 -31414 10245 8343 -29424 24689
1002 24689 27205 -44250 -12386 24590 -15896 8846 30000 -24475 643 39227 -25602 -25821
1014 -25821 32545 1394 -5045 28846 -23039 -32685 30408 -4079 -37092 21563 11480 -20775
1026 -20775 18215 -6811 -42494 25394 31709 -24791 10671 23675 -21659 8294 16515 -35435
1038 -35435 7363 45234 -18589 -19025 15143 -24380 -10878 27965 -21987 -17728 40819 -4027
1050 -4027 -33986 13962 -2959 -11554 39126 4411 -31773 25984 14974 -34468 6937 13867
$$ packed form
965B7889k6765n2440O5357J9197n1819K8535K694m7945M3276J7813o3391L3158
977d441M7871n3725j090K6074m5829K1884N3205n5898j0802N9169l5161k6510
989b5253M1528k7624q675O4929l3277n2092N1939j497m1392M1659j902l7767N4113
1002B4689K516p1455L1864L6976m0486K4742K1154n4475K5118L8584o4829k19
1014b5821N8366l1151o439L3891n1885r646O3093l4487l3013N8655j0083l2255
1026b0775L8990k5026l5683O7888O315n6500L5462J3004m5334K9953Q221n1950
1038c5435M2798L7871o3823m36L4168l9523J3502L8843m9952M259N8547m4846
1050d027k9959M7948j6921q595N0680l4715l6184N7757j1010m9442M1405O930
$$ plain form
1062 13867 -17761 23800 15127 -46171 -3892 26619 -24266 -3786 24593 -17474 3758 27566
1074 27566 -34272 -20108 39842 922 -11435 25323 -12727 -18876 29234 -12359 -33594 31854
1086 31854 16257 -24641 10547 -5097 -31684 24905 17346 -32868 14641 28395 -24715 -2320
1098 -2320 10654 -27733 14042 37177 -26972 -14255 26000 -18264 -14920 21143 -16076 -4865
1110 -4865 41091 -12006 -34069 20853 2894 -15183 27304 1036 -22891 28693 5050 -42628
1122 -42628 7594 19264 -17009 14361 8587 -38004 5736 23376 -31431 -4087 32105 -8807
1134 -8807 2499 20332 -30111 -8231 41601 -6856 -16180 28639 -4781 -18067 18091 -18480
1146 -18480 -27783 34483 8579 -32914 8830 480 -26840 17868 8148 -28594 24753 30426 -28163
$$ packed form
1062A3867l1628M1561q673o1298M2279L0511n0885K0480K8379m2067K1232K3808
1074B7566o1838J4164N9950l8920j2357L6758l8050o149M8110m1593k1235O5448
1086C1854j5597m0898L5188j5644k6587N6589p559n0214M7509J3754n3110K2395
1098b320J2974l8387M1775K3135o4149J2717M0255m4264L344L6063l7219J1211
1110d865M5956n3097k2063N4922j7959j8077M2487k6268k3927N1584k3643m7678
1122d2628N0222J1670l6273L1370n774m6591M3740J7640n4807K7344L6192m0912
1134h807J1306J7833n0443K1880M9832m8457r324M4819l3420j3286L6158l6571
1146a8480r303O2266k5904m1493M1744q350k7320M4708r720l6742N3347N673n8589
$$ plain form
1159 -28163 -2460 18035 -16877 14808 29366 -25664 -3399 30917 -22797 -21748 18550 -11545
1171 -11545 -5013 28502 -21843 -31125 24949 -1979 -24706 21277 6214 -13530 26771 -554
1183 -554 -36529 19957 24809 -17932 12745 14265 -24796 9673 14761 -35456 511 33686 -15153
1196 -15153 -9359 12719 -26640 -7100 28849 -18539 -15309 34078 -2797 -21353 15340 -10270
1208 -10270 -14495 36913 5348 -27978 20225 9625 -25921 11119 6537 -20861 25075 18950
1220 18950 -37040 -3095 18482 -21513 2608 19419 -22229 2907 26787 -28597 -19742 26125
1232 26125 -4308 -4145 25424 -15455 -16837 29579 -6726 -26221 25507 11709 -14061 17571
1244 17571 -5790 -31253 21233 15204 -27586 9722 17288 -21686 3206 6497 -31638 8684
$$ packed form
1159b8163K5703K0495l4912L1685J4558n5030K2265L4316n3714J049M0298l0095
1171a1545O532L3515n0345r282N6074k6928k2727M5983j5063j9744M0301k7325
1183e54l5975N6486M852m2741L0677J520l9061L4469N088n0217L5967L3175m8839
1196a5153N794K2078l9359J9540L5949m7388L230M9387l6875j8556L6693k5610
1208a0270m225N1408l1565l3326M8203j0600l5546L7040m582k7398M5936o125
1220A8950n5990L3945K1577l9995K4121J6811m1648K5136K3880n5384Q855M5867
1232B6125l0433J63K9569m0879j382M6416l6305j9495N1728j3798k5770L1632
1244A7571k3361k5463N2486o029m2790L7308P566l8974K4892L291l8135M0322
$$ plain form
1256 8684 33052 -19451 -9216 20009 -16461 -5676 22183 -17103 -5442 38041 -6342 -24542
1268 -24542 16028 -5010 -12677 27052 -2577 -24107 24140 5536 -33370 6143 8953 -16302
1280 -16302 19675 10160 -33338 5971 20696 -24346 211 22773 -12613 7086 21609 -28299
1292 -28299 -11160 31222 -6774 -9978 22384 -10118 -13255 20981 -16068 -25591 27890 8320
1304 8320 -21019 12134 -2866 -23536 19617 8315 -26199 17732 23196 -20358 1207 8838
1316 8838 -21608 12624 25765 -23389 -4697 23856 -18180 -13730 14411 -15125 -2455 30157
1328 30157 -14848 -24439 20136 -2070 -15540 20633 -34 -12805 27714 1877 -32080 12827
1340 12827 15168 -15141 13707 7962 -26025 9298 13240 -31321 -2000 23377 -12731 86
$$ packed form
1256H684K4368n2503J0235K9225l6470J0785K7859l9286J1661M3483m4383j8200
1268b4542M0570k1038p667L9729k9629k1530M8247j8604l8906L9513K810k5255
1280a6302L5977r515m3498L9309J4725m5042K4557K2562l5386J9699J4523m9908
1292b8299J7139M2382l7996l204L2362l2502l137L4236l7049r523N3481j9570
1304H320k9339L3153j5000k0670M3153j1302l4514M3931N464m3554K1565P631
1316H838l0446L4232J3141m9154J8692K8553m2036M450K8141k9536J2670L2612
1328C0157m5005r591M4575k2206j3470L6173k0667j2771M0519k5837l3957M4907
1340A2827K341l0309K8848n745l3987L5323L942m4561K9321K5377l6108J2817
$$ plain form
1352 86 13914 -25372 -4696 28540 -12668 -10609 27485 -2347 -10594 17256 -13333 -15720 30862
1365 30862 4115 -22910 14471 1909 -22170 11479 566 -23974 19664 17424 -27043 -1471
1377 -1471 11416 -17683 8399 18637 -19611 4615 26418 -18811 -12466 19271 -7523 -274
1389 -274 24424 -14930 -16861 22578 -6516 -21442 16540 1575 -11834 19201 -6143 -29629
1401 -29629 15714 11943 -20112 11009 11817 -17689 10613 9502 -27459 6742 27454 -12479 -1211
1414 -1211 15203 -18215 -2063 20680 -18201 -8392 28387 -6185 -17385 11287 -11930 -12868 24179
1427 24179 -3645 -21352 19431 4230 -22534 9018 3796 -14084 22597 13328 -25608 6377
1439 6377 16565 -17395 3778 15210 -14630 7157 19178 -25340 -12158 19395 -9701 -6929
$$ packed form
1352H6J3828l9286K0676L3236m1208K059L8094k9832q247K7850l0589k387M6582
1365C0862k6747k7025L7381j2562k4079L3649j0913k4540M3638k240m4467K5572
1377a471J2887k9099K6082J0238l8248K4226K1803m5229O345L1737k6794P249
1389b74K4698l9354j931L9439k9094j4926L7982j4965j3409L1035k5344k3486
1401b9629M5343l771l2055L1121Q08k9506K8302j111l6961L4201K0712l9933J1268
1414a211J6414l3418J6152K2743l8881R809L6779l4572j1200K8672k3217r38L7047
1427B4179k7824j7707M0783j5201k6764L1552n222j7880L6681r269l8936L1985
1439F377J0188l3960K1173J1432k9840K1787J2021m4518J3182L1553k9096K772
$$ plain form
1451 -6929 17098 -13657 -11044 20290 -12443 -21019 20925 6269 -10666 16524 -3144 -18894
1463 -18894 20170 8687 -20198 14240 16377 -15042 5872 4939 -24271 8097 20131 -20182
1475 -20182 -4549 14560 -17346 -6809 12139 -18057 -2962 27807 -8887 -15647 16709 -4154
1487 -4154 -8304 22158 -1718 -11607 24884 3787 -23384 9411 5808 -13309 15282 4632 -25748
1500 -25748 6810 10059 -25569 -1859 13824 -12708 4619 13405 -22956 -4103 23492 -8699
1512 -8699 -4921 21688 -4128 -3911 18626 -12460 -14774 24408 3505 -16068 11768 -2989 -18512
1525 -18512 11911 -1819 -23021 14395 12926 -19658 1882 5825 -17378 10264 16828 -17235
1537 -17235 4263 21949 -13363 -5991 13694 -10565 1675 22765 -13073 -13983 17229 -7239
$$ packed form
1451f929K4027l0755K613L1334l2733q576M1944j4656j6935K7190j9668j5750
1463a8894L9064j1483k8885L4438K137l1419K0914r33k9210L2368J2034m0313
1475b0182J5633J9109l1906J0537J8948l0196J5095L0769l6694o760L2356k0863
1487d154m150L0462k3876r889L6491k1097k7171L2795l603j9117K8591j0650l0380
1500b5748L2558L249l5628K3710J5683k6532J7327Q786l6361J8853K7595l2191
1512h699L778K6609k5816K17K2537l1086k314L9182k0903j9573K7836j4757j5523
1525a8512L0423j3730k1202L7416j469l2584K1540L943k3203K7642O564l4063
1537a7235K1498J7686l5312P372J9685k4259J2240K1090l5838r10L1212k4468
$$ plain form
1549 -7239 -15174 13920 -4050 -10182 19758 -4108 -24672 11670 7091 -14367 11934 6249 -16301
1562 -16301 11877 8789 -23572 4105 19064 -10527 3351 11644 -18344 -370 18494 -15064
1574 -15064 -6679 21219 -5142 -8349 11848 -13235 -11345 21604 -2666 -16862 14369 834
1586 834 -15989 9678 -1239 -15567 18552 11379 -19348 4912 9806 -13952 7337 12181 -15322
1599 -15322 7216 18344 -18446 -8566 13170 -10267 -1867 15805 -14289 -9400 17609 -9869
1611 -9869 -16340 15187 527 -6837 17340 -4338 -17388 16726 6821 -15656 11851 9647 -12678
1624 -12678 9186 3301 -22808 6251 15816 -15560 -617 10639 -15669 -1404 11907 -16644
1636 -16644 -2558 22998 -6102 -9055 12918 -7112 -6510 19100 -4205 -12105 19155 1412 -17509
$$ packed form
1549g239p935K9094j7970o132K9940k3866k0564L6342m579k1458K6301n685k2550
1562a6301K8178l088l2361K7677J4959k9591J3878Q293k9988J7974J8864l3558
1574a5064Q385K7898k6361l207K0197k5083J890L2949k4270j4196L1231j3535
1586H34j6823K5667j0917j4328L4119p173l0727K4260M894k3758K1289M844k7503
1599a5322K2538J1128l6790R880K1736k3437Q400J7672l0094M889K7009k7478
1611i869o471L1527j4660p364K4177k1678j3050L4114r905k2477K7507k204k2325
1624a2678K1864n885k6109K9059R565l1376J4943J1256k6308J4265J3311k8551
1636a6644J4086K5556k9100k953K1973k0030O02K5610k3305p900L1260j7743j8921
$$ plain form
1649 -17509 7361 -350 -12892 14873 4705 -20576 6476 8969 -17198 2605 10105 -11308
1661 -11308 8470 14299 -18182 -3692 17234 -8191 -2260 15183 -9121 -4125 15676 -12282
1673 -12282 -14659 16357 9 -9746 11968 -4981 -14609 13839 487 -17552 12615 10657 -12168
1686 -12168 6628 3596 -16392 9518 14117 -15439 2443 14701 -12231 -2775 8946 -14252
1698 -14252 8 19651 -10534 -10654 13006 -7009 -9078 13307 -5406 -8190 19080 -691 -17321
1711 -17321 9403 3669 -10214 12886 4228 -15253 10402 7725 -18654 2032 11083 -9952 5159
1724 5159 9311 -17772 -1436 14838 -11993 -4990 15392 -5753 -3494 12317 -12022 -9968 18217
1737 18217 -982 -11008 12666 -960 -11595 11019 -2196 -15086 14619 8918 -14486 4630
$$ packed form
1649a7509K4870p711j2542K7765j0168k5281K7052K493k6167J9803P500k1413
1661a1308J9778N829l2481J4490K0926k5425N931J7443k4304M996J9801k7958
1673a2282k377L1016j6348r755K1714j6949r628K8448j3352j8039L0167j958k2825
1686a2168J8796l032j9988K5910M599k9556J7882J2258k6932R456J1721k3198
1698a4252J4260J9643l0185j20K3660k0015k069K2385j8713k784K7270j9771j6630
1711a7321K6724n734j3883K3100q658j9481K5655k677k6379K0686R051k1035J5111
1724E159M152k7083J6336J6274k6831P003K0382k1145K259J5811k4339K054K8185
1737A8217j9199j0026K3674j3626j0635K2614j3215j2890K9705n701k3404J9116
$$ plain form
1749 4630 4566 -13959 7564 8792 -15367 5268 14958 -13470 -4282 9122 -11057 940 15581
1762 15581 -11797 -7415 14754 -7346 -10270 11616 -3018 -5042 17224 -3527 -14838 12472
1774 12472 4148 -11428 9971 4142 -11295 10070 3434 -19508 3495 11200 -11214 2048 7890
1787 7890 -14563 1124 11920 -13755 -2531 17836 -4132 -3967 11306 -8829 -5494 16847 -3775
1800 -3775 -10372 13980 -209 -12684 6994 -3418 -12999 13349 4318 -16417 5243 6001 -13093
1813 -13093 4879 7489 -11217 8636 13796 -13582 -2207 12090 -8405 213 12814 -10166
1825 -10166 -4156 13973 -10269 -12256 11686 -2559 -6601 12151 -5237 -12169 13007 1189 -12806
1838 -12806 10886 6600 -8921 8713 2743 -15996 7216 10643 -12923 2175 9209 -11698 -46
$$ packed form
1749D630o4j8525K1523J228k4159K0635R690k8428R188J3404k0179J1997J4641
1762A5581k7378M382K2169k2100k924K1886j4634k024K2266k0751j1311K7310
1774A2472q324j5576K1399n829j5437K1365o636k2942K3003P705k2414J3262N842
1787G890k2453J5687J0796k5675J1224K0367k1968J65J5273k0135L335K2341k0622
1800c775o597K4352j4189j2475J9678j0412r581K6348r031k0735K1660P58j9094
1813a3093J7972K610j8706J9853N160k7378J1375J4297k0495Q618J2601k2980
1825a0166O010J8129k4242j987K3942j4245m042J8752j7388o932K5176j1818j3995
1838a2806K3692m286j5521J7634n970j8739K3212L427k3566J5098P034k0907J1652
$$ plain form
1851 -46 7871 -14103 -563 16374 -7259 -5726 11055 -6569 -4755 13826 -5251 -7385 16194
1864 16194 -507 -13068 7083 -1205 -9974 11584 1493 -14706 7919 6009 -14734 3030
1876 3030 7134 -8882 7812 10061 -13838 328 12542 -8955 -1683 11707 -7496 -1777 11649
1889 11649 -11598 -9918 12988 -3277 -8163 10336 -3714 -9188 11319 -1818 -12738 12251
1901 12251 7115 -9689 7281 2927 -12617 7794 7813 -13545 3434 10538 -11053 -1600 6188
1914 6188 -12070 698 13885 -9512 -5018 12291 -5908 -6282 10781 -4671 -4657 15553 -2292
1927 -2292 -12375 8860 554 -9660 8993 1236 -11632 8832 3519 -15784 3459 8036 -8334
1940 -8334 5324 7980 -12128 2263 11405 -10671 -1939 12820 -5460 -1729 9556 -10680 -6893
$$ packed form
1851d6P917k1974J3540J6937k3633J533J6781j7624J814J8581j9077k134K3579
1864A6194j6701j2561K0151q288q769K1558j0091j6199K2625j910k0743J7764
1876C030M104j6016J6694K249k3899J4166J2214k1497P272J3390j9203N719J3426
1889A1649k3247J680K2906j6265m886J8499j4050n474K0507j3137j0920K4989
1901A2251n136j6804J6970m354j5544K0411J9k1358J6979P104k1591R453P788
1914F188j8258J2768J3187k3397M494J7309j8199l74J7063j5452J4K0210j7845
1927b292j0083K1235q306j0214J8653p757j2868K0464n313j9303J9243M577j6370
1940h334J3658K656k0108J4391R142k2076Q732J4759j8280L731J1285k0236L787
$$ plain form
1953 -6893 13471 -4727 -8770 11145 -1760 -8963 9071 -3165 -10885 12576 5030 -11078 6747
1966 6747 3941 -10729 6756 5513 -11819 6381 10866 -11839 -1741 7528 -9541 880 10825
1979 10825 -10208 -2861 12360 -8000 -7586 9882 -4152 -3925 13222 -4410 -10759 10966 629
1992 629 -10078 8684 2750 -8387 9169 2279 -14333 5789 8051 -9863 3663 7161 -10493
2005 -10493 2366 7723 -12546 -818 12739 -6583 -3390 8812 -8616 -4094 12034 -5763
2017 -5763 -6974 12954 -731 -8644 8409 -2416 -8500 12314 2546 -11392 7897 4598 -11257
2030 -11257 4551 3603 -10549 6992 8221 -13029 -456 8462 -9430 -383 9250 -8421 -737
2043 -737 11507 -8804 -6698 11249 -2371 -3897 11257 -3857 -7609 11337 -1122 -11104 9089
$$ packed form
1953f893K0364j8198m043J9915j2905p203J8034j2236p720K3461p546j6108J7825
1966F747k806j4670J7485j243j7332J8200M485k2705J0098R269j7069J0421R945
1979A0825k1033P347J5221k0360M14J7468j4034K27J7147j7632o349K1725j0337
1992F29j0707J8762n934j1137J7556o890j6612K0122K262j7914J3526L498j7654
2005a0493J2859N357k0269J1728J3557j9322L193J2202j7428M522J6128j7797
2017e763j211J9928j3685p913J7053j0825o084K0814r768j3938J9289l299j5855
2030a1257J5808r48j4152J7541J229k1250J2573Q918j7892R047R633j7671P684
2043g37J2244k0311K106J7947j3620j526J5154j5114l752J8946j2459r982K0193
$$ plain form
2056 9089 3732 -8084 7026 459 -12575 6480 5503 -11721 3192 7688 -9770 1410 5917
2069 5917 -11480 1111 12836 -7228 -2840 10499 -5896 -3361 10408 -5668 -4288 13725 -2083
2082 -2083 -9280 7777 -1988 -8450 9395 -290 -11036 7839 2911 -12941 3192 4200 -8923
2095 -8923 6389 6975 -11237 2632 9681 -8928 346 10209 -5753 821 10485 -9096 -5346 11104
2109 11104 -4220 -6055 9191 -4108 -7322 8568 -4380 -11197 9850 2866 -9174 6516 1920
2122 1920 -9626 7052 5385 -10358 6022 9260 -8479 1384 6349 -9586 1984 10495 -9187
2135 -9187 -2806 9975 -7354 -5881 7754 -6025 -4430 11605 -4048 -9334 8686 -964 -7897
2148 -7897 8763 1293 -7769 9907 2846 -11654 5605 5781 -8429 5345 5596 -10055 3319
$$ packed form
2056I089n357j1816J5110o567j3034J9055r77j7224J4913M496j7458J1180M507
2069E917j7397J2591J1725k0064M388J3339j6395K535J3769j6076J380J8013j5808
2082b083p197J7057r765o462J7845r685j0746J8875m928j5852J6133J008j3123
2095h923J5312N86j8212J3869P049j8609R274R863j5962O574R664j9581L750J6450
2109A1104j5324j835J5246j3299l214J5890j2948o817K1047o984j2040J5690m596
2122A920j1546J6678j667j5743J6380L238j7739R863M965j5935J1570Q511j9682
2135i187O381J2781j7329J473J3635j3779J595J6035j5653n286J8020r650o933
2148g897J6660p470r062J7676p061j4500J7259J76j4210J3774K51j5651J3374
$$ plain form
2161 3319 7380 -11160 -717 9183 -6947 -1047 7914 -9303 -3887 10787 -5619 -5973 10685
2174 10685 -2188 -6065 8658 -3353 -8021 11333 2091 -8915 7583 2544 -9191 5844 2797
2187 2797 -10428 6093 7361 -10536 497 6020 -8956 1030 7980 -9158 -808 10453 -7410
2200 -7410 -4989 8925 -4082 -2683 10981 -3920 -6951 10313 -1354 -8475 8240 921 -7273
2213 -7273 8273 209 -11615 5687 4468 -9813 3479 5126 -9209 3135 5828 -10833 549
2226 549 10234 -6337 -765 8600 -6859 -1829 10063 -5964 -4659 11319 -2632 -7031 7043
2239 7043 -3580 -7803 9362 -483 -9536 7529 2414 -9704 4652 2863 -8552 7045 6934
2252 6934 -9826 2378 7867 -7753 1165 8137 -7372 552 9093 -8824 -5321 8815 -5082
$$ packed form
2161C319M061j8540J0443R900j6130N900Q961j7217N416J4674j6406l54J6658
2174A0685j2873l877J4723j2011m668J9354r242j1006J6498n039j1735J5035l047
2187B797j3225J6521J268j7897J1033N523j4976R986O950j7138Q350J1261j7863
2200g410K421J3914j3007J399J3664j4901l031J7264j1667p121J6715p319q194
2213g273J5546q064j1824J7302j219j4281J3292J647j4335J2344K693j6661J1382
2226E49R685j6571N572R365j5459N030J1892j6027J305J5978j3951m399J4074
2239G043j0623m223J7165r845r053J7065n115j2118J4356j789j1415J5597j11
2252F934j6760J2204N489j5620Q918O972j5509P924Q541j7917L503J4136j3897
$$ plain form
2265 -5082 -4745 8399 -5034 -6359 9351 -2928 -8705 8635 2208 -6167 8072 1700 -8901
2278 -8901 7853 4736 -9144 4929 6629 -8267 2131 4482 -10952 834 8210 -8696 -2388
2291 -2388 7629 -7133 -3252 7707 -6288 -3207 11611 -2310 -5936 9373 -986 -5391 9429
2304 9429 212 -7323 8960 2073 -10229 4144 2529 -8905 4570 3794 -11012 2116 6182
2317 6182 -9938 -318 7483 -6584 1052 8706 -7521 -2752 10275 -4045 -3844 9617 -2306
2330 -2306 -4402 9142 -3465 -7950 8801 1086 -7775 5957 406 -9094 5448 1708 -10478
2343 -10478 4341 5823 -8839 1685 4857 -8856 2000 8338 -7551 54 9838 -5409 -2337
2356 -2337 8488 -4859 -2063 10708 -3150 -6132 8314 -2528 -7513 6772 -1569 -7700 6850
$$ packed form
2265e082L37J3144j3433j325J5710j2279n777J7340o427q375J4239o372j0601
2278h901J6754l117j3880J4073J700j4896J0398K351j5434J1786P376j6906O308
2291b388J0017j4762L881J0959j3995L081J4818j3921l626J5309j0359m405J4820
2304I429r217p535J6283o887j2302J4373j615j1434J3475p76j4806J3128M066
2317F182j6120R620P801j4067P636P654j6227M769J3027j4320K01J3461j1923
2330b306k096J3544j2607m485J6751p715q861J3732n551r500J4542l740j2186
2343a0478J4819J482j4662J0524L172j3713J0856O338j5889P605R784j5247L072
2356b337J0825j3347K796J2771j3858k982J4446j0842m985J4285q341o131J4550
$$ plain form
2369 6850 -330 -10798 4474 2767 -8235 4646 4544 -7794 4597 7026 -8266 2014 9238
2382 9238 -4854 1218 8274 -6924 -1878 8570 -6471 -5071 8311 -4183 -6167 6320 -4815
2395 -4815 -8221 7881 -291 -7946 7187 1776 -7132 6660 2886 -7326 7084 7003 -7474 2818
2409 2818 5827 -7576 1461 6487 -8117 -487 7692 -8040 -4295 6390 -6092 -3228 8532
2422 8532 -4773 -5193 8904 -1901 -6623 8010 657 -5052 8531 1023 -8164 6471 3628 -7982
2436 -7982 4442 4228 -7948 3079 4097 -9861 614 7136 -7094 -584 6717 -7022 -1735
2449 -1735 7725 -5961 -3254 9590 -2376 -4310 7713 -2575 -5263 8626 -489 -7010 7710
2462 7710 1691 -7619 4769 1708 -7771 5410 3873 -9047 2195 5225 -8121 601 5711 -7058
$$ packed form
2369F850p180j0468J5272j707j1002J2881j02j2338J2391K429j5292J0280P224
2382I238j4092O072P056j5198N046J0448j5041J400J3382j2494j984J2487j1135
2395d815l406J6102q172p655J5133n411q908J3792l774j0212J4410q1j4477J0292
2409B818L009j3403R037N026j4604P630Q179j5732L745J0685j2482K864J1760
2422H532j3305m20J4097j0805m722J4633p353n709J3583p508r187J4635k843j1610
2436g982J2424k14j2176J1027J018j3958J0475O522j4230O510P301j3739N287
2449a735R460j3686K707J2844j1966j934J2023j0288k688J3889r115o521J4720
2462G710o019r310J2388l061r479J3181j537j2920J1242L030j3346Q722N110j2769
$$ plain form
2476 -7058 1087 7951 -6614 -2378 8114 -4340 -2244 8345 -3345 -3520 8856 -2825 -6534
2489 -6534 7408 106 -6395 6120 -255 -8406 5308 1632 -8767 3869 4408 -7101 3431
2502 3431 4280 -8112 2592 7448 -6488 738 7788 -5074 -1200 6811 -5831 -2512 8478 -3939
2516 -3939 -5434 6540 -3149 -5814 6573 -1692 -6758 7338 1107 -7727 4795 2542 -6243 5354
2530 5354 4345 -7106 4249 5652 -7587 977 5683 -6025 723 6553 -7089 -2443 7146 -5266
2544 -5266 -3494 7181 -3358 -3399 7254 -3309 -5915 7910 366 -5753 6570 770 -6215 5812
2558 5812 1306 -7671 4740 4448 -7169 2375 3589 -7463 2141 5360 -7339 342 6947 -6002
2572 -6002 -1867 6047 -5163 -1535 8044 -3652 -4105 7839 -2184 -4755 6627 -1142 -5077 7310
$$ packed form
2476g058Q145O864j4565M236J0492j2454K096J0589j1690j75J2376j1681l709
2489f534J3942p302o501J2515o375q151J3714l676j0399J2636N39j1509J0532
2502C431Q49j2392J0704M856j3936P226P050j2862L874Q011j2642L319J0990j2417
2516c939j495J1974r689k665J2387q265n066J4096o231q834J2522k253q785J1597
2530E354j009j1451J1355J403j3239Q564M706j1708O748N830j3642M646R589j2412
2544e266J772J0675j0539m1J0653j0563k606J3825p544o119J2323n800o985J2027
2558E812m506q977J2411k92j1617R544J214j1052R604L219j2699P681O605j2949
2572f002M135P914j1210L628R579j1696m53J1944j0023k571J1382p769l935J2387
$$ plain form
2586 7310 313 -7508 5155 2144 -6956 3819 2922 -7048 3538 4079 -8099 1158 5519 -5610
2600 -5610 796 5373 -6116 -709 7265 -5053 -2438 7699 -2462 -3099 6654 -3303 -5060 7130
2614 7130 -1064 -6206 5684 125 -6619 4589 672 -7177 4737 3872 -7044 2806 4325 -6082
2628 -6082 2474 5143 -6117 1609 7038 -5489 -1266 6070 -4830 -1802 6710 -4556 -4101 6524
2642 6524 -3034 -5950 5385 -1326 -4533 6272 63 -6400 5747 2321 -6103 4590 3852 -5456
2656 -5456 3882 3955 -7133 1757 5504 -5947 83 5040 -5851 -916 5254 -6285 -2916 7084
2670 7084 -3411 -3533 6172 -2729 -3791 7072 -932 -5033 6889 1365 -5289 4798 786 -6007
2684 -6007 4762 2668 -7367 2404 3954 -6626 1079 3483 -6218 683 5657 -5998 -1414 5974
$$ packed form
2586G310o997p821J2663l011r100J0775q97r970J0586N41j2178R257M361j1129
2600e610O406M577j1489N407P974j2318K615J0137j0161o37R753r957j757J2190
2614G130q194n142J1890n559o744J1208l917p849J1914q65j0916R850J519j0407
2628f082Q556K669j1260P726N429j2527M223P336j0900L028Q512j1266M55J0625
2642F524r558k916J1335o711l207J0805o209o463J2147l426q424J0693p38r308
2656e456R338P3j1088Q890L747j1451O030M957j0891M935O170j1539L369J0000
2670G084j0495j22R705q901j062J0863q004m101J1922n524o654J0087m012o793
2684f007J0769k094j0035R771J550j0580P705K404r701O901M974j1655M584P388
$$ plain form
2698 5974 -4361 -1793 6270 -3367 -1974 7352 -2620 -4520 6381 -137 -4336 5821 -353 -5528
2712 -5528 5512 1036 -6843 3374 2451 -6275 2432 2716 -7081 1911 4821 -6012 553 5604 -4612
2727 -4612 -248 5639 -4639 -993 7076 -2694 -2995 6062 -2025 -3837 5744 -1908 -4876 5708 -200
2742 -200 -6138 3647 661 -5776 4209 1715 -6285 3314 4018 -6171 1733 4667 -4454 1938 5740
2757 5740 -4941 -207 6214 -4023 -1896 5382 -3344 -2351 5720 -3664 -4822 5498 -1540 -5035
2771 -5035 4887 -399 -5027 4941 962 -5927 4453 3343 -4802 3067 3324 -5372 2509 4327 -5763
2786 -5763 991 5199 -4875 -1202 4184 -4926 -1714 5471 -3962 -3201 5803 -2062 -3907 5104 -1288
2801 -1288 -3606 6194 403 -5227 5039 1764 -4930 3900 2052 -5227 3141 2943 -6882 903 3656
$$ packed form
2698E974j0335K568Q063r637J393R326r972j900J0901o518m199J0157o174n175
2712e528J1040m476p879J0217r23q726Q707K84r797Q992K910j0833O565N051j0216
2727d612M364N887j0278L646Q069r770l01R057q087j812R581p652k968J0584n908
2742b00n938R785k986o437R985k494q000R599P04j0189P904K934r121O392L802
2757E740j0681M734O421j0237K127P278q726R93Q071r384j158J0320p038l495
2771e035R922n286m628R968l979o889J0380j110q145P869K57q696P881J818j0090
2786e763O754M208j0074L673N386r110L212P185r433P61R004p865j845R011o392
2801a288k318R800n791n630J0266l275o694Q830j848p279Q368j98r825P785K753
$$ plain form
2816 3656 -5309 179 3741 -5517 -722 5223 -4607 -2022 5727 -2582 -1552 5747 -2405 -2990 6331
2831 6331 -683 -4360 5337 641 -4570 4243 279 -5850 3607 1884 -6001 1851 2386 -5650 1555
2846 1555 2992 -5610 1045 4996 -4635 -532 5035 -3314 -812 5783 -2959 -1764 6366 -1852 -3762
2861 -3762 4821 -948 -3717 4731 -561 -5356 4307 653 -5965 2913 1548 -5151 2854 2560 -5733
2876 -5733 1753 4204 -4413 654 4673 -3819 674 5251 -3820 -1182 6067 -2519 -2356 4755 -2343
2891 -2343 -3299 4581 -1963 -4782 4549 -235 -4875 3344 122 -5047 3828 2041 -5303 2910 3550
2906 3550 -4705 1762 3636 -4272 1632 4827 -4567 -631 5064 -3475 -1464 4532 -3656 -2146 5079
2921 5079 -2787 -4181 4277 -911 -3628 4158 -655 -4065 4841 1118 -4849 3552 2314 -4119 3091
$$ packed form
2816C656q965N488L562r258M795N945r830K585P749q309J030P299q152n85R321
2831F331p014l677R697m696n211Q813l964o129R457j723p885P852N35q036P205
2846A555J437q602O655L951r631M103N567q349K502O595q742J195Q130q218j910
2861c762Q583n769k769Q448n292m795R663l654o618Q878j365o699Q005k94q293
2876e733P486K451q617N067M019q492M493M577r071K638P249q586J63P111p098
2891b343r56P880o544k819R331m784m640Q219l222n169Q875j787p344Q213O40
2906C550q255O467J874p908N904L195r394L936N695q539K011N996q188J510P225
2921E079p866j394Q458n188k717P786m813l410Q906l723n967Q401j238o433P210
$$ plain form
2936 3091 2309 -4596 1882 3594 -5296 359 4261 -3981 -554 3710 -4530 -1425 4972 -2974 -2508
2951 -2508 4618 -1782 -2759 4543 -1671 -3465 5341 594 -4241 3652 906 -4167 3315 1318 -4990
2966 -4990 2679 2969 -5280 1221 2834 -4397 886 3886 -4481 -284 4910 -3547 -1581 4461 -2453
2981 -2453 -1183 5114 -2337 -3115 4879 -1026 -3522 3865 -353 -3648 3923 141 -5112 3089 1639
2996 1639 -4575 2186 2243 -4205 1634 2946 -4748 812 4260 -3612 -463 3622 -3503 -783 4938
3011 4938 -2979 -2253 4759 -1671 -3058 3810 -1508 -3162 4522 -471 -4512 3786 1050 -4173 2762
3026 2762 1322 -3991 3169 2433 -4908 1616 3312 -3965 403 3238 -3978 229 3957 -4056 -1355
3041 -1355 4319 -2349 -1751 4066 -2538 -2571 4482 -1232 -3510 4338 497 -3078 3705 520 -4058 3726
$$ packed form
2936C091p82o905O478J712q890N655L902q242L427M264q240L105O397p946M66
2951b508P126o400r77P302o214j794Q806m747m835P893k746n073P482j997o308
2966d990P669K90q249O501J613p231N283L000q367M197N194q457J966O042o914
2981b453J270O297p451p78P994n905k496P387m218l295P571l782n253Q201j450
2996A639o214O761N7o448N839J312p694N560L448p872L149M085p125K720N721
3011D938p917P26P012o430j387O868n318j654P684m993m041Q298k736n223O935
3026B762j440n313P160p36p341O524J696p277M368K835p216M207L728q013K701
3041a355N674o668N98N817o604l3P053n714k278P848l841l575O783l185m578P784
$$ plain form
3057 3726 1895 -4231 2281 2508 -4046 1508 2515 -4485 968 3599 -3897 -516 3756 -3190 -827
3072 -827 4160 -3122 -1619 4961 -1761 -2797 3883 -756 -2901 4063 -391 -3998 4041 1006 -4453
3087 -4453 2554 1320 -3766 2549 1643 -4656 1560 2938 -4299 193 3070 -3259 135 3642 -3703
3102 -3703 -1120 4582 -2302 -1841 3818 -1831 -1726 4355 -1728 -3328 4240 135 -3405 2734 192
3117 192 -3848 3185 1012 -4745 2526 2419 -4366 1299 2448 -3701 1458 3860 -3809 -70 4064
3132 4064 -2397 -745 3636 -2626 -1260 4215 -2487 -3056 3732 -1097 -3348 3089 -695 -3357 3442
3147 3442 137 -4397 3060 1584 -3430 2643 2002 -3869 2203 2958 -3985 603 3169 -3217 -31
3162 -31 3014 -3637 -914 4094 -3095 -2257 3833 -1781 -2239 3522 -1500 -2779 4339 10 -3262 3427
$$ packed form
3057C726j831o126O512K27o554N554J007p000N453K631p496L381M272o946K363
3072h27M987p282J503O580o722j036O680m639k145O964m454l607Q039l035n459
3087d453P007j234n086O315r06o299O216J378p237M492K877o329L394L507p345
3102c703K583N702o884M61N659n649J05O081o083j600P568m105l540O139k542
3117A92m040P033k173n757P271j07o785N665J149o149N159K402p669L739M134
3132D064o461J652M381o262J366N475o702n69O788m829k251O437l784k662O799
3147C442l305m534P457j476n014O073o41n871O072P55o943M588K566o386L186
3162c1L045o651K723N008p189Q38O090n614m58N761n022j279P118m329l272O689
$$ plain form
3178 3427 833 -3145 2854 1014 -3624 2951 2377 -4160 1108 1969 -3616 673 2686 -4117 137
3193 137 3857 -3213 -1353 3464 -2374 -986 3551 -2263 -2292 4300 -888 -2772 3776 61 -2390 3338
3209 3338 11 -3950 3325 1644 -3873 1977 1687 -3727 1527 1773 -4617 781 3256 -3322 -518
3224 -518 2934 -3352 -343 3722 -2804 -1351 4338 -805 -1917 3727 -1226 -1826 4038 -481 -3271
3239 -3271 3422 395 -3800 2273 495 -4070 2255 1304 -4698 933 2373 -3426 712 2755 -3071
3254 -3071 700 3701 -2933 -448 4183 -1641 -934 4106 -1854 -1693 4135 -1613 -3104 3381 -426
3269 -426 -3207 2614 -455 -3946 2780 1007 -4176 1890 2117 -3105 1589 2164 -3569 1274 3422 -3340
3285 -3340 -102 3644 -2615 -357 3507 -2737 -1118 4163 -1924 -2370 3107 -1119 -2476 3195 -1239
$$ packed form
3178C427k594l978N999j840m638O575n74o537N268Q61n585M289K013o803M254
3193A37L720p070J860M817n838J388M537n814k9O592n188j884O548l715k451N728
3209C338l327l961P275j681n517N850k90n414N254K46o390N398K475o578K804
3224e18L452o286L009M065o526J453N689n143j112N644m953o00N864m519k790
3239c271O693l027m195O073j778m565O325r51o002N631J440n799M138K043n826
3254c071L771L001o634K485M631n824P07N040n960J61N828n748j491O485l807
3269d26k781N821l069l491O726j773n183O066K27n222M694N75n733M843K148o762
3285c340L238L746o259K258L864o244J619N281o087m46N477m226j357N671m434
$$ plain form
3300 -1239 -3429 3476 483 -3809 2487 1121 -3221 2423 1736 -3710 1884 2581 -3571 538 3155
3315 3155 -2656 545 2946 -3269 -651 3681 -2707 -1702 3427 -1988 -1902 3399 -1666 -2865 3554
3330 3554 -71 -3298 3028 233 -2961 2927 886 -3683 2372 2319 -3338 1357 2084 -3342 1141 2787
3346 2787 -3733 75 3399 -3053 -932 2966 -2630 -1161 3587 -2305 -2265 3764 -819 -2454 3327
3361 3327 -437 -2272 3902 -2 -3720 2772 1314 -3427 1994 1110 -3751 1412 2087 -4072 730
3376 730 2934 -2774 -26 2686 -3039 -202 3569 -2428 -1358 3975 -1387 -1684 3416 -1178 -2280
3391 -2280 3771 -511 -3230 2759 364 -3238 2265 599 -3550 2341 1548 -4180 1091 2127 -3098
3406 -3098 800 2203 -3236 565 3553 -2879 -985 3391 -1963 -868 3605 -2043 -1874 3791 -1086
$$ packed form
3300a239k190O905k993m292O296j366m342N644o87n446N594O97o152M109K617
3315C155n811L201K401o215K618M332o388J005N129n415Q6N301n065j199O419
3330C554l625l227O326k795l194N888k041m569O055n3n657M695P27n426M483J646
3346B787o520L808L324o452K121L898n596J469M748n892M0O029m583j635N781
3361C327l764j835O174l904l718O492j458m741N421q84m861N163O75o159M802
3376G30K204n708K748K712n725K837L771n997J070N333n362k97N100m594j102
3391b280O051m282k719N989k395l602N503j666m149N891p93n728N271J036n225
3406c098L898J403n439L801K988o432J894M376n354J095M473n648J69N665m877
$$ plain form
3421 -1086 -2942 3162 -138 -2605 3264 -14 -3391 2719 1043 -3673 1958 1418 -3071 1557 1872
3436 1872 -3708 921 3307 -3074 -217 2967 -2594 -324 3129 -2615 -1067 3894 -1549 -2081 3252
3451 3252 -895 -2099 3389 -858 -2957 3352 403 -3377 2376 637 -3176 2565 1614 -3473 1515
3466 1515 2651 -3399 929 2566 -2802 466 3250 -3173 -889 3712 -2079 -1258 3253 -1885 -1623
3481 -1623 3373 -1574 -2949 3415 -251 -2932 2515 92 -3250 2808 703 -3665 2139 2075 -3301
3496 -3301 1182 2030 -3290 1209 2952 -3263 -305 3199 -2896 -560 3063 -2512 -811 3665 -1974
3511 -1974 -2003 3162 -1030 -2421 3036 -679 -2883 3046 270 -3517 2318 1143 -3157 1985 1435 -3312
3527 -3312 1823 2519 -3710 452 2679 -2554 60 2944 -3175 -585 3572 -2446 -1627 3315 -1608
$$ packed form
3421a086j856O104l300k467N869l278l377O110j676m716N631n40m489M628L15
3436A872n580M629K386o381K857L184n561K270L453n744J548M961n443n32N333
3451C252m147j204N488m247k099O309k949l780N753j739l813N741r51n087M988
3466A515J136o050M328J637n368L268K784o423K284M601n791Q21M511n138K62
3481a623M996m947j375O364l666k681N447k423l342O058k105m368N804o4n376
3496c301M483Q48n320M499J743o215K958L504o095K336L623n575J701M476n639
3511a974k9N165m192j391N457l715k204N929k776l787N835j175m300N142n50m747
3527c312N135O96o229M162K227n233K614K884o119K590M157o018Q19M942m923
$$ plain form
3542 -1608 -1586 2911 -1574 -2489 3359 -170 -2861 2819 326 -3047 2573 750 -3592 2408 1908 -3330
3558 -3330 1203 2280 -2972 1012 2371 -3385 115 3105 -2613 -799 2840 -2212 -1125 3275 -1995
3573 -1995 -1956 3485 -806 -2479 2674 -495 -2468 3169 20 -3179 2504 1554 -2904 2184 1752 -2954
3589 -2954 1806 1950 -3499 1015 2812 -2938 -89 2670 -2777 -519 2884 -2671 -1481 3478 -1468
3604 -1468 -1469 3078 -1211 -2058 3330 -241 -2856 3327 575 -2819 2494 608 -2989 2260 1496 -3698
3620 -3698 1023 2049 -3349 309 2019 -3210 109 2953 -2981 -714 3238 -1855 -945 3257 -1952
3635 -1952 -1388 3605 -903 -2476 3063 -77 -2212 2611 11 -3099 2771 693 -3506 1538 1365
3650 1365 -3027 1089 1616 -3551 849 2530 -3411 -119 2841 -2394 -238 3122 -2428 -964 3692
$$ packed form
3542a608K2M497m485r15N848l529k691N680k493l373N620j823m342O000n00n238
3558c330M533J077n252L984J359n756L500K990n718J814L639n052J087M400n270
3573a995L9N441m291j673N153l169j973N637l149l199N683r50m458N088m32m706
3589b954M760J44n449M514J797n750K849K759n447K258L403n555J190M959m946
3604a468jM547m289q47N388l571k615O183k752l394N313j886l597N249p64n194
3620c698M721J026n398L658J710n229L319K844n934K267L952n093R10M202n209
3635a952N64M993m508j573N539l140k135M823k600l110N870k078m199N044j73
3650A365m392M116N27n167M400J681n941L292K960n235K156L360n550J464M656
$$ plain form
3665 3692 -1382 -1555 3270 -901 -1864 2981 -447 -2847 3323 281 -3266 1871 737 -3141 1732
3680 1732 907 -3527 1340 2269 -3284 598 2383 -2582 585 2968 -2498 -345 3478 -1719 -1186 3338
3696 3338 -1546 -1482 3243 -1602 -2540 2910 -653 -2634 2444 -95 -2918 2457 556 -3398 2243 2006
3712 2006 -2941 1385 2237 -2802 1284 2732 -2914 119 3145 -2185 -805 2741 -2617 -1136 3336
3727 3336 -2249 -2022 2924 -943 -2266 2645 -576 -2438 3226 187 -2755 2615 1174 -2693 1929
3742 1929 1352 -2853 1606 2034 -3366 677 2427 -2830 -52 2239 -2751 -525 2863 -2436 -1427
3757 -1427 3128 -1590 -1564 2891 -1348 -1923 3110 -385 -2748 2897 412 -2480 2397 714 -3043 2234
3773 2234 1400 -3416 1227 1849 -3082 740 1909 -2997 290 2823 -2753 -631 2777 -1837 -802
$$ packed form
3665C692n074j73M825m171r63M845l428k400O170l042l547N137j134l878M873
3680A732q25m434M867R29n553L882J785m965L167K383n466K153L823n197N33M524
3696C338m884O4M725m845r38N450l563j981N078k539k823N375j901l954N641k37
3712B006m947M326Q52n039M086J448n646L033L026n330J380L546n358J481M472
3727C336n585K27M946l867j323M911l221j862N664l039k942N370j441l867M622
3742A929n77m205M459M28n400M043J750n257K778K291m990K226L388n299J009
3757a427M555m718K6M455m239n75N033l495k363N645k485k892M877j683l757N277
3773B234q34m816M643O22m931L822J169m906L287K533n576K122L408m614J035
$$ plain form
3788 -802 3191 -1558 -1611 3488 -793 -2241 2961 -200 -2045 2978 -140 -3115 2555 717 -3063 1290
3804 1290 935 -3235 1228 1741 -3546 720 2378 -2559 -383 2470 -1978 -76 2954 -1895 -576
3819 -576 3685 -952 -1566 2909 -964 -1976 2433 -755 -2816 2263 171 -3251 1716 222 -2832
3834 -2832 1851 1308 -3193 1399 1887 -2775 981 2359 -2367 777 2820 -2504 -365 3051 -1876
3849 -1876 -1238 2773 -1696 -1334 2739 -1536 -2581 2822 -381 -2402 2287 -238 -2823 2380 677
3864 677 -2993 1768 1156 -2619 1517 1530 -2916 1175 2212 -2636 180 2507 -2236 -595 2328 -2177
3880 -2177 -1033 2827 -1459 -1847 2646 -1082 -1745 2362 -590 -2250 2885 471 -2818 2105 608
3895 608 -2519 1802 1322 -2730 1291 1931 -2980 510 2038 -2602 151 2233 -2661 -411 2772 -1952
$$ packed form
3788h02L993m749n3N099m281j448N202l161j845N023l118k975N670j838l780M353
3804A290l55m170M463N13n287M266J658m937K176K853m448J902L030m849J319
3819e76M261m637o14M475l873j012M409l188k061N079k092l422M967j494l054
3834b832M683n43m501M592M88m662L756J378m726L144K043n324K139L416m927
3849a876O38M011m469L62M073m275j045N403l203k021M689k525k585N203j703
3864F77l670M761o12l775M136J3m446M091J037m848K816K327m743J641K923m505
3880b177J144L860m286l88M493l728o63M107k952j660N135k414l289M923j497
3895F08l127M321m80m052M021O40m911L490J528m640K753K082m894K250L183m724
$$ plain form
3911 -1952 -987 2587 -1471 -1382 2809 -1131 -1897 2985 -287 -2065 2204 -71 -2139 2153 418 -2892
3927 -2892 1601 1248 -3041 1150 1598 -2655 916 1858 -2866 97 2696 -2263 -613 2441 -2146 -603
3943 -603 2932 -1682 -1233 2864 -1024 -2191 2304 -764 -2166 2437 -164 -2828 1919 614 -2971
3958 -2971 1712 1056 -2536 1489 1499 -2801 859 2319 -2443 272 2353 -2151 -212 2719 -2022 -1158
3974 -1158 2567 -1484 -1457 2731 -866 -1460 2796 -734 -2272 2289 399 -2265 2084 606 -2437 1858
3990 1858 1164 -2517 1034 1609 -2387 550 1741 -2689 378 2206 -2367 -602 2691 -1610 -990 2454
4006 2454 -1754 -1374 2738 -1070 -2137 2486 -339 -2072 2169 4 -2485 2397 646 -2678 1630
4021 1630 1220 -2417 1193 1523 -2465 725 2168 -2427 -67 2236 -2064 -199 2147 -2218 -810
$$ packed form
3911a952R65L574m058Q9M191l940p66M882l272j778M269k275k068M292j735l310
3927b892M493l53m289M191M48m253L571R42m724K963K599m959J650L054m587J543
3943f03L535m614M49M097l888j167M495l068j402M603k601k664M747j305l585
3958b971M683o56l592M025J0m300L660J460m762K715K081m504J939K931m741Q64
3974a158L725m051K7M188l597n94M256l530j538M561j890k664M349j478l043M295
3990A858o94l681L551N75l996K937J191m430L067J828m573J765L293m301O20L444
4006B454m208L80M112l808j067M623k825j733M241k165k489M882j751l324M308
4021A630m10l637L610L30l988L190J443m595K360K303m300J865K346m365J408
$$ plain form
4036 -810 2893 -1707 -1438 2383 -823 -1329 2691 -660 -2289 2404 235 -2295 1819 536 -2419 1944
4052 1944 824 -3022 1319 1763 -2602 476 1547 -2159 344 2103 -2097 -275 2753 -1753 -783
4067 -783 2338 -1410 -1057 2546 -1217 -2035 2194 -363 -2279 2093 -29 -2016 2138 381 -2653 1661
4083 1661 1392 -2318 1353 1625 -2547 965 2055 -2190 271 2272 -1841 -275 2227 -2033 -950
4098 -950 2325 -1663 -1513 2204 -721 -1763 2122 -711 -1889 2360 263 -2391 2256 560 -2095
4113 -2095 1726 1340 -2177 1571 1549 -2615 432 1882 -2276 -37 1802 -2358 -219 2525 -1992 -808
4129 -808 2401 -1519 -1305 2137 -1174 -1804 2584 -292 -1966 2113 358 -1883 1726 405 -2618 1643
4145 1643 1109 -2648 1135 1283 -2500 664 1724 -2517 169 2021 -2341 -897 2060 -1708 -688
$$ packed form
4036h10L703m600K69L821l206n06M020l351j629M693k169k530M114j283k955M363
4052A944j120l846M341M44m365L078J071l706K503J759m200J822L028m506R70
4067g83L121l748L53L603l763q18M229k557j916M372k122j987M154j757l034M314
4083A661k69l710L671K72m172L512J090m245K461K001m113J566K502m260J083
4098i50L275l988J50L717k925j042L885k833j178M249k097k654M647j696k655
4113b095L821l86l517L748k2m164L047J450m158K239J839m160K139K744m517J184
4129h08L209l920K14L442l311o30M388k876j674M079j755k241L609j321l023M261
4145A643n34l757L783J48l783L164J060m241K686J852m362J444K957l768J020
$$ plain form
4160 -688 2290 -1299 -1084 2593 -580 -1375 2378 -223 -1549 2471 -6 -2554 1830 633 -2328 1157
4176 1157 612 -2750 1118 1102 -2891 383 1689 -2256 106 1959 -1768 308 2448 -1710 -619 2583
4192 2583 -902 -991 2434 -820 -1033 2403 -720 -2345 1936 -292 -2500 1251 223 -2331 1374 1146
4208 1146 -2774 1021 1487 -2039 831 1804 -1878 627 2167 -1937 -202 2334 -1296 -552 2341 -1603
4224 -1603 -1004 2288 -1081 -1826 1875 -539 -1933 2051 -153 -1854 2064 708 -2274 1596 972 -1947
4240 -1947 1299 1079 -2014 804 1825 -2262 62 2157 -2075 -110 1845 -1784 -828 1975 -1424
4255 -1424 -1337 1999 -1047 -1273 2046 -711 -1743 2283 88 -1946 1614 519 -2087 1559 797 -2445
4271 -2445 1542 1497 -1945 655 1490 -2067 441 1759 -2080 -223 2023 -1538 -792 1768 -1413 -806
$$ packed form
4160f88K978l589K15L677l173p95L753k601j326M020k477k548M384j197k961L485
4176A157n45l362L868j6l993L274J306l945K362J853l727K076K140m158J091L202
4192B583l485q9L425l254k13L436l123j625M281k228k208L751j028k554L705k28
4208A146l920L795M66l526K870R73l682K505J540m104J735K536l630P44K893l944
4224a603N99L292l369p45L701k414j394L984k204j701L918j356k982L870o24k919
4240a947L246k20l093K818J021m087K324K095m232J965J955l629R56K803l399
4255a424Q7L336l046k26L319k757j032M026k195k034L560j095k606L646p62l242
4271b445L987m5l442K600Q35l557K508J318l839J857K246l561P46K560l181O07
$$ plain form
4287 -806 2366 -968 -1266 2711 -506 -1724 2051 -100 -1665 2128 226 -2208 1551 991 -2249 620
4303 620 873 -1986 615 1316 -2486 141 1911 -2126 -314 1912 -1561 -324 2300 -1275 -1026 2244
4319 2244 -832 -1308 2085 -243 -1479 2044 -158 -2314 1741 490 -2413 1352 645 -2247 1173
4334 1173 1255 -2420 884 1804 -1873 282 1802 -1778 42 2301 -1741 -718 2220 -1120 -850 2064
4350 2064 -1235 -1268 2204 -377 -1800 2000 60 -1719 1696 87 -2141 1745 896 -2377 1040 1127
4366 1127 -1893 871 1357 -2165 541 1790 -2037 -177 2054 -1547 -536 1799 -1445 -1433 2540 -988
4382 -988 -1341 2003 -526 -1380 2069 -75 -1907 2108 66 -2045 1530 830 -2167 1294 851 -1845
4398 -1845 671 1721 -1953 74 1883 -1657 -51 2159 -1782 -551 2164 -1437 -1119 2019 -839
$$ packed form
4287h06L172l334k98L977l217j218L775k151j565L793j902k434L759n60l240K869
4303F20K53k859K601P01l802K627J770m037J812K226l473J237K624l575K49L270
4319B244l076m76L393k328j236L523k202k156M055j251k903L765p07k892L420
4334A173Q2l675L304R20l677K155J520l580J820K259m042J023K938l340K70K914
4350B064l299l3L472k581j423L800j940j779L415j609k228L886q49l273L417Q7
4366A127l020K764M86l522K706J249l827J860K231l601J011K335l244J2L973l528
4382i88l53L344k529q54L449k144j832M015k042k111L575p00k997L461m43k696
4398a845K516J050l674K027J809l540J606K210l941J231K715l601L18L138k858
$$ plain form
4413 -839 -1550 2200 -718 -1600 1950 155 -1936 1565 306 -1845 1505 820 -2085 1270 1145 -1981
4429 -1981 566 1200 -2075 491 1727 -2158 -252 1919 -1608 -660 1992 -1333 -916 2213 -1018 -1363
4445 -1363 2081 -756 -1666 1855 -218 -1696 1736 207 -2218 1427 669 -2054 1232 975 -2143 1040
4461 1040 1666 -2045 435 1870 -1760 -35 1763 -1350 -243 2134 -1416 -1376 2038 -1166 -1443 1947
4477 1947 -628 -1769 1816 -165 -1879 1534 572 -1991 1505 966 -1985 1348 1262 -2132 907 1511
4493 1511 -1939 448 1264 -2186 -76 1896 -1992 -654 1784 -1520 -824 2243 -1082 -1133 2138 -571
4509 -571 -1490 1857 -218 -1505 2057 296 -1825 1783 653 -2323 841 788 -2131 880 1205 -2133
4525 -2133 431 1728 -1739 -422 1742 -1662 -193 1931 -1651 -882 2057 -896 -1302 1767 -628
$$ packed form
4413h39p11L750k918q82L550j795k091L501j259k151L350o85k905L355j25l126
4429a981K547O34l275K566J236l885J906K171l527R48K652l325M17L129l231l45
4445a363L444k837r10L521k073j478L432j529k425L645p58k723L286k57l118L183
4461A040O26l711K480J435l630J725J798l113J107K377l550M0L414l204k77L390
4477A947k575j141L585j981j714L413r62k563L496n39k951L333q6l394L039O04
4493A511l450K387Q16l450K110J972l888J338K438l304O96L067l325n1L271k709
4509e71r19L347k075j287L562j761k121L608j130k976L164n3k919L011L25l338
4525b133K564J297l467J317K164l404J469K124l582P69K939k953m06L069k395
$$ plain form
4540 -628 -1537 1979 -527 -1597 2000 493 -1836 1404 612 -1872 1329 954 -2141 961 1260 -2115
4556 -2115 268 1786 -1867 240 1713 -1696 -456 2101 -1146 -790 2137 -1108 -935 2203 -448
4571 -448 -1728 2353 -114 -1738 1759 -15 -1874 1464 547 -2528 1264 717 -1936 560 1375 -1965
4587 -1965 741 1834 -2196 180 2271 -1135 -264 1980 -1294 -691 2143 -1038 -1397 1809 -814 -1714
4603 -1714 1879 -469 -1835 1871 408 -1705 1586 816 -1686 1402 928 -2032 957 1630 -2072 439
4619 439 1312 -1651 -106 1885 -1827 -652 1780 -1467 -892 1710 -1200 -1270 2021 -723 -1381 2091
4635 2091 -134 -1989 1813 199 -1722 1518 390 -1981 1181 850 -2156 862 1153 -2112 554
4650 554 1750 -1783 -26 2142 -1650 -211 1986 -1129 -654 2288 -807 -1239 2191 -413 -1479 1704
$$ packed form
4540f28r09L516k506j070L597j507k329L240p92k484L201l75l095L102K99l375
4556b115K383J518l653K107J473l409J240K557l247L56K927l245J73L138k651
4571d48j280M081k467j624L497j774j859L338r17l075L792n47k653K496Q15l340
4587a965K706J093m030K376K091l406Q71K244l274O03K834l181l59L206k623r00
4603a714L593k348j366L706j463k113L291p70k502L088m74k960K989O73l702K511
4619D39Q73k963J545J991l712J175K432l247N75K602k910p0L291k744o58L472
4635B091k225j855L802j614j921L240j128k371L162l31l006L018K91l265K666
4650E54J196l533J757K168l792J439K197l115M75K942l095m32L430k604j066L183
$$ plain form
4666 1704 -394 -1803 1845 -45 -2048 1240 296 -2185 1418 1060 -1967 821 1074 -2022 420 1744
4682 1744 -1741 -119 1629 -1670 -75 2230 -1387 -682 2133 -990 -1106 2011 -715 -1321 2140 -620
4698 -620 -1712 1711 170 -1803 1512 384 -2190 1495 814 -1976 759 1197 -1903 502 1609 -1915
4714 -1915 246 1842 -1536 -59 1691 -1317 -689 1949 -1169 -1024 1784 -1010 -1449 1870 -440 -1930
4730 -1930 1658 -3 -1957 1491 275 -2046 1226 718 -1530 952 1222 -2001 533 1627 -1939
4745 -1939 -98 1605 -1776 -59 1950 -1435 -767 1784 -1255 -1385 1905 -664 -1491 2044 -456 -1488
4761 -1488 1727 -147 -1868 1815 693 -1860 1440 724 -2141 879 1504 -2082 217 1368 -1996
4776 -1996 56 1438 -1531 -382 1684 -1346 -725 2060 -922 -920 2040 -892 -1288 2041 -220 -1538
$$ packed form
4666A704k098j409L648j890k003L288r44k481L603l58l027K788K53l096K442J324
4682A744l485J622J748l299J595K305l617P05K815l123j16L117k726o06L461k760
4698f20j092L423j541j973L315j128k574L685o81k790K735M38l100K405J107l524
4714a915K161J596l378J477J750l008O28K638l118J45K808k794m39L319k310j490
4730a930L588j661j954L448j216k321L272n08k248K482K70l223K534J094l566
4745a939J841J703l381J717K009l385O68K551l039j30L290k569q27L535k500j032
4761a488L215j874j721L683j122k553L300p16k865L020O25l586K299J151l364
4776a996K052J382k969J149K066l030O21K785k982KK960k932l96L329k261j318
$$ plain form
4792 -1538 1579 -3 -1614 1840 212 -1841 1289 740 -1883 965 1124 -2262 612 1538 -1963 153
4808 153 1802 -1560 -107 1834 -1560 -405 2090 -1271 -1229 2133 -892 -1221 1958 -347 -1402 1985
4824 1985 363 -1872 1502 234 -1792 1290 536 -1786 941 1255 -2240 464 1426 -1734 427 1520
4840 1520 -1800 -243 1969 -1518 -713 1901 -1006 -792 2055 -783 -1186 2083 -404 -1571 1738 -196
4856 -196 -1680 1403 555 -1944 1204 913 -2046 864 1133 -1842 955 1487 -1875 132 1600 -1639
4872 -1639 -22 1825 -1306 -467 2006 -1116 -778 2151 -705 -1171 2053 -285 -1535 1831 -35 -1731
4888 -1731 1630 505 -1865 946 507 -1978 811 1057 -1918 612 1568 -1755 314 1664 -1808 -154
4904 -154 1902 -1465 -381 1828 -1104 -921 1813 -1169 -1264 2044 -730 -1606 1666 -114 -1642 1538
$$ packed form
4792a538L117j582j611L454j628k053L130n49k623K848J59l386K874R26l501K116
4808A53J649l362J453J941l394J155K495l361M2L362l025l29L179k305j055L387
4824A985j622k235L374j268k026L082p54k322K727L14l495K704R62l160K161J093
4840A520l320J557K212l487Q05K614k907K14K847k838m03L269k487j167L309j934
4856a96j484L083q48k499L148k91k959K910K69k975K797N32l362K007J468l239
4872a639J617J847l131Q39K473l122L38K929k856m66L224k338j250L366j866j696
4888a731L361j125k370K811m39k485K789K46k975K530R56l323K069J350l472J654
4904a54K056l367J084K209k932J83K734k982r5L308k774q76L272j780j528L180
$$ plain form
4920 1538 311 -1969 1436 489 -1845 1064 1078 -1673 669 1462 -1857 376 1794 -1660 -63 1912
4936 1912 -1420 -326 1910 -1330 -752 1956 -873 -1261 1675 -441 -1627 1753 -306 -1824 1424
4951 1424 227 -1838 1348 505 -1720 1100 1077 -1579 1109 1445 -1972 80 1523 -1764 -101 1569
4967 1569 -1375 -343 1900 -1150 -779 1842 -1002 -989 1699 -646 -1546 1675 -1 -1502 1355 240
4983 240 -1592 1375 758 -1878 1189 1286 -1846 838 1159 -1381 407 1341 -1684 -131 1677 -1507
4999 -1507 -781 1957 -1144 -780 1858 -518 -954 1841 -178 -1200 1841 12 -1212 1774 -62 -1862
5015 -1862 1380 415 -1713 1068 724 -2050 483 1180 -2072 240 1464 -1693 -163 1562 -1506 -376
5031 -376 1808 -1341 -519 2035 -830 -867 1684 -598 -1236 1622 -257 -1520 1522 228 -1868 1319
$$ packed form
4920A538j227k280L405r47k334K909J4k751K342P93l319K233J418l454J597J975
4936A912l332J094K236l240N78K708k829l88K936k116j186L380k059j518L248
4951A424j197k065L186q43k225K820k3k656K688L36l417K052J443l287J663J670
4967A569k944J032K243l050L71K621k844J3K688k345r00L221j676j501K857j115
4983B40j832K967o17k636L067R7l132K684L21k540J788R34l025J553J808l184
4999a507P26K738l101L64K638k376m36K795k019j022L041j829j224K986j836j800
5015a862L242r65k128K781l44k774K533O97l252K312J224l157J530J725l068J130
5031c76K184l149Q22K554k865l7K551k282o38K858j879j263L042j294k096L187
$$ plain form
5047 1319 602 -1893 1149 924 -1910 805 1107 -1619 250 1350 -1765 285 1548 -1580 -260 1919
5063 1919 -1327 -952 1768 -809 -1107 1787 -624 -1445 1844 -367 -1396 1779 196 -1533 1325 611
5079 611 -1550 747 765 -1517 1009 1205 -1680 311 1387 -1539 131 1671 -1501 -234 1617 -1196
5095 -1196 -500 1935 -1053 -1147 1635 -728 -1249 1876 -245 -1386 1670 288 -1564 1426 140 -1450
5111 -1450 1099 640 -1931 648 1170 -1604 333 1009 -1449 215 1629 -1373 -486 1552 -1186 -625
5127 -625 1723 -866 -556 1831 -467 -1066 1885 12 -1301 1394 60 -1599 1674 445 -1770 984
5143 984 753 -1741 921 963 -1754 385 1210 -1751 -119 1285 -1385 60 1596 -1265 -437 1852
5159 1852 -807 -546 1937 -427 -1204 1549 -430 -1290 1324 -123 -1434 1197 69 -1686 1106 572
$$ packed form
5047A319p17k495L042k25k834K715L02k726J869J100l115K050J263l128J320K179
5063A919l246L75K720k577k98K894k411q21L289k211j029L175j583j729K858p14
5079F11k161K297J8k282K526J96k885J991J076k926J670J540l172J267J851k813
5095a196O96K435k988r4K782k363n21L125k121j141L056j382j852K990j286j590
5111a450K549m59k571K579N22k774J937O76k458J664J414l002Q87K038k738N61
5127f25K348k589L10K387k298n99K951j873j313K695j334j659L273j229k215K754
5143I84k31k494K662M2k717K139Q25k961J632J404k670J445J536k861Q28K289
5159A852k659K61K483k364p77K753j979q60K614j447j311K631j128j755K792n34
$$ plain form
5175 572 -1890 831 1079 -2006 466 1261 -1365 24 1630 -1367 43 1648 -1102 -496 1787 -900
5191 -900 -739 1808 -504 -1176 1624 -340 -1298 1242 -203 -1276 1153 354 -1873 1146 600 -1743
5207 -1743 908 1030 -1826 768 1081 -1253 177 1470 -1340 -333 1734 -1208 -378 1316 -1378 -529
5223 -529 1689 -569 -1209 1546 -251 -1284 1474 -23 -1455 1517 501 -1568 1214 773 -1690 1156
5239 1156 1191 -1667 436 854 -1627 218 1311 -1317 -154 1352 -1336 -432 1548 -1164 -608 1306
5255 1306 -503 -1118 1678 -349 -1445 1307 -227 -1247 1230 109 -1207 1047 508 -1790 938
5270 938 664 -1740 544 1113 -1310 285 1203 -1463 -307 1431 -1128 -188 1452 -1011 -891 1667
5286 1667 -651 -1268 1459 -457 -1010 1214 -40 -1106 1345 286 -1327 1132 479 -1478 755 858
$$ packed form
5175E72k462K721K48l085K472P95k626J389J606k997J410J605k750O06K283k687
5191i00J61K547k312o72K800j964r58K540j445j073K429p99k227L019n46k343
5207a743K651J22k856K594L13k334J430J293k810J007K067k942Q30J694k694Q49
5223e29K218k258o40K755j797j033K758j497j432K972j016k069K782m41k463K846
5239A156L5k858K103M18k481J845J093k628J163J506k688R04J980k712N56J914
5255A306j809o15K796k027j096K752j534j020K477j121j316K254n39k298K728
5270I38k74k404K284N69k423J595R18k666J156J738k559R40J640k463J20K558
5286A667k318o17K727j916n53K224j254j066K451j059j613K459o53j957K233J03
$$ plain form
5302 858 -1497 640 1116 -1340 266 1131 -1104 22 1267 -1089 -386 1550 -787 -787 1422 -734 -924
5319 -924 1222 -371 -1389 1216 -79 -1499 1020 58 -1627 916 437 -1404 880 629 -1504 610
5335 610 1114 -1257 91 1217 -1518 79 1486 -1304 -539 1612 -1099 -450 1397 -729 -956 1459
5351 1459 -375 -1172 1364 -42 -1331 1214 387 -1407 1003 648 -1536 1018 1004 -1422 635 638 -1535
5368 -1535 107 1308 -1149 18 1114 -1299 -330 1760 -920 -606 1438 -496 -632 1521 -224 -990
5384 -990 1493 127 -1172 1440 115 -1468 1093 467 -1381 861 742 -1561 664 902 -1388 424
5400 424 1268 -1153 -23 1159 -1635 -294 1514 -833 -626 1186 -515 -588 1336 -387 -1082 788
5416 788 -246 -1332 967 87 -1139 656 205 -1424 666 720 -1271 752 794 -1592 433 1055 -1354
$$ packed form
5302H58k355K137M76k456J606Q65k235J126J245k356P03J936k337%K209k156j90
5319i24K146j593j018K605j295j420K519r62j685K543m79j841K284k51k133K114
5335F10N04k371J348J126k735J597J407k790P65K151k711O49J847k126k27K415
5351A459j834p97K536j406j289K545q27j794K410l55k184K554j4k426K057Lk173
5368a535J642J201k457J167J096k413R69K090k680L14K044j934j36K153j745p66
5384i90K483j366j299K612j325j583K561o26j848K242j19k303K225K38k290J812
5400D24Q44k421J130J182k794J341J808k347K07J812j701p3J924j723o95J870
5416G88j034j086K299q80j226J795m51j629K090N4j991K023M2k386K025O22k409
$$ plain form
5433 -1354 154 1329 -1023 -326 1287 -927 -632 1433 -821 -1054 1402 -519 -938 1166 -159 -887
5449 -887 1479 143 -1332 1128 380 -1148 1014 787 -1420 539 869 -1353 249 989 -1193 139
5465 139 1169 -1132 -347 1235 -943 -687 1317 -500 -833 1126 -451 -876 1641 93 -995 1149
5481 1149 235 -1095 1101 430 -1295 644 597 -1332 315 850 -1489 91 1032 -1307 -118 955
5497 955 -923 -442 945 -907 -331 1532 -757 -450 1263 -430 -905 1189 22 -903 1467 14
5513 14 -1056 920 375 -1273 685 562 -1429 495 977 -1133 319 1088 -997 -126 1205 -792 -257
5530 -257 1357 -1257 -454 1377 -655 -602 1097 -273 -682 1351 -79 -1023 1158 249 -1399 855 219
5547 219 -1470 935 754 -1547 410 934 -1342 211 853 -1443 38 971 -1030 -186 1175 -766
$$ packed form
5433a354J508J175k352O97J613k214K95K065k254k33K456j921m19K104j325p28
5449h87K366j336j475K460p48j528K162k27k207J959L30k222J602P40k182J332
5465A39J030k301P85J582k178K56K004j817l33J959j577m25K517j548j088K144
5481A149r14j330K196o71j725J939m7j929J647N35k339J580R41k339J189J073
5497I55j878M81J387j852N76J863k289L07J713j693m75K094j167r25K370j453
5513A4j070J976n45j648J958j23j991J924M82k110J452P69k085Q71J331j997N35
5530b57J614k614Q03J831k032N3J699j370m09K033j430r44K181r09j648K254o36
5547B19j689K405j81k301J957N24k276J553O42k296J481R33k001Q44J361j941
$$ plain form
5563 -766 -475 1440 -700 -892 1098 -633 -1017 960 -363 -958 1032 -184 -1210 953 301 -1321
5579 -1321 614 613 -1202 403 675 -1037 198 1013 -1099 22 1006 -1048 -223 1202 -733 -431 1090
5596 1090 -756 -754 1088 -443 -791 1240 -343 -1203 1277 -67 -1139 1158 326 -1145 917 219 -1150
5613 -1150 397 618 -1275 188 787 -910 -27 975 -1037 -397 1461 -1058 -489 1248 -692 -821
5629 -821 1309 -588 -641 1438 -297 -1065 1276 148 -963 1081 13 -1122 845 779 -1281 658
5645 658 691 -1405 317 869 -1211 -67 1013 -993 2 1263 -1095 -461 1462 -873 -571 1413 -428
5662 -428 -846 1157 -372 -1154 1184 77 -1071 990 468 -903 875 519 -1177 700 950 -1254
5678 -1254 342 966 -757 190 774 -1318 -182 1455 -1027 -386 1087 -585 -504 1182 -712 -696 1150
$$ packed form
5563g66K91J915k140j92J990j731l84J977j323n95J990j216j026K163o52j622
5579a321J935jj815J605K72j712J235Q15k112J121R84k054Q25J425j935L02J521
5596A090j846KJ842j531l48K031j583q60K480j344j072K297q32j471K062o98j369
5613a150J547K21j893J463N99j697Q83J002k012O40J858k519N69J737j940j29
5629h21K130j897n3K079j735p68K341j128j111K044j068j135J967o6k060J939
5645F58L3k096J722N52k080J144J080k006R95J261k358O34J923k335L02J984j841
5662d28m18K003j529p82K338j107j148K061n22j371J778l56j696J877K50k204
5678a254J596O24j723R47N84k092J136J637k482O41J473j672Q1J686j894J6J846
$$ plain form
5695 1150 -370 -1186 1027 66 -848 1034 207 -1201 908 665 -1339 828 769 -1205 490 1157 -970
5712 -970 340 950 -936 -486 1142 -1088 -354 1056 -994 -873 1150 -515 -983 1014 2 -720 1242
5729 1242 -201 -1088 1037 148 -1045 835 668 -1294 411 488 -1545 8 795 -1006 70 1180
5745 1180 -1060 -155 1227 -948 -188 1307 -725 -479 1469 -584 -480 1114 -211 -952 916 -47
5761 -47 -1297 877 77 -1214 772 687 -1230 281 674 -1157 656 536 -879 393 849 -953 -288
5778 -288 962 -832 -598 1369 -683 -848 1264 -705 -870 833 -147 -1202 861 -194 -769 851
5794 851 233 -1114 863 766 -1260 619 798 -1256 302 876 -1105 5 1178 -1038 -31 1004
5810 1004 -1063 -713 1122 -661 -488 1241 -363 -600 1011 -276 -1232 1071 29 -913 781 348
$$ packed form
5695A150j520q16K213r61r14J882q27j408K109k43k004K167n9j974J695O67k127
5712i70J310O10j886M50J628k230P34J410k050J21K023j665m68J997j012p22J962
5729A242j443q87K125q89j193J880j67j962J705P7k033J553P87j801J076J110
5745A180k240R05J382k175P60J495k032K46J948k053J04J594j325p41J868r63
5761d7j250K174q00j291J986q5j917J511L93j831J813j20j415J272M56j802O65
5778b88J250j794K34J967k052j65K112j969j65J703r80j055K063j055n75J620
5794H51o18j347J977r7k026J879J79k054J558N74j981J110J173k216J007J035
5810A004k067L50J835j783J73J729j604k37J611j287r56K303j042r42J694m33
$$ plain form
5826 348 -1094 730 284 -1185 479 606 -1194 465 728 -970 -43 866 -1075 -176 1113 -1095 -624
5843 -624 921 -750 -551 1409 -421 -899 1141 -357 -769 1067 112 -1020 1130 308 -908 968
5859 968 479 -947 591 425 -1058 335 673 -1137 90 793 -962 100 902 -788 -359 1449 -505
5876 -505 -747 1296 -354 -879 1376 -534 -788 1300 -136 -1224 1041 98 -1185 770 453 -1372
5892 -1372 573 614 -1076 289 865 -981 211 952 -1048 -52 1264 -1056 -321 1412 -737 -373 1064
5909 1064 -612 -590 1001 -144 -781 1293 -83 -921 1161 376 -1252 789 447 -1294 619 615 -1025
5926 -1025 464 805 -1157 400 747 -816 69 1290 -929 -439 995 -559 -541 1441 -535 -743 1148
5943 1148 -337 -977 1265 -66 -1102 965 75 -956 862 466 -1271 966 781 -1280 353 733
$$ packed form
5826C48j442J824m46j469J664J27j800J659K63j698R27R09j941Q99J289k208M71
5843f24J545j671J99J960j830m78K040j498m12J836r55j132K150q22j216J876
5859I68m89j426J538j66j483J393L38j810J227P03j755J062Q02j690M29J808j954
5876e05k42K043j650n25K255j910k54K088j436j088K265r43j283J955l17j825
5892a372J945M1j690J365N76j846J192P41k000R96J316k320P35J733k149L64J437
5909A064j676K2J591j145o37K074j376q38K082p85j628K041l42j741J913mj640
5926a025J489L41j962J557L47j563Q85J221k219M90J434j554J8J982j976k08J891
5943A148j485o40K242j331j036K067q90j031J818l96j737K237j85k061J633L80
$$ plain form
5959 733 -1054 349 985 -961 29 1163 -755 -256 1078 -707 -609 1258 -398 -420 1214 -307 -719
5976 -719 1007 -164 -1076 1163 278 -1091 787 419 -924 890 500 -1069 427 526 -1284 252 1274
5993 1274 -840 7 1472 -666 -227 1203 -766 -442 1414 -459 -669 1370 -153 -895 1021 29
6009 29 -756 1033 205 -988 835 215 -987 908 567 -957 598 774 -1217 309 1111 -1054 -52
6026 -52 1110 -882 -378 1261 -681 -704 1186 -444 -706 1127 -427 -1029 1192 120 -837 503 -274
6043 -274 -1250 849 516 -1124 778 614 -918 427 759 -907 125 908 -918 12 1256 -889 -355
6060 -355 874 -753 -431 1313 -361 -760 1043 -383 -982 1123 -129 -1132 1117 50 -1200 617
6076 617 702 -1064 459 532 -1010 467 735 -1090 -81 738 -1280 -419 1031 -956 -178 1186 -775
$$ packed form
5959G33j787J403O36j946R90J134j918M99J334j785R8J867j656k2J634j521m12
5976g19J726j171r12K239q85j369J878l68j343J814l90j569J496R9j810J536J022
5993A274k114Q47J465k138M39J430j969L24J856j873k10K039j523p42J916r92
6009B9p85J789q28j193J823o20j202J895l41j524J555J76j991J526Q02k165J002
6026e2J162j992N04J639j942k3J890j630k62J833j554o02K221j072r57J340p77
6043b74r76K099l33j640J902j64j532J345L32j666J032P83j826R30J244k145N34
6060c55J229j627L22J744j674l99J803j426n99K105j252j003K249j067j250J817
6076F17Q5j766J523P3j542J477K68j825J009Q19k018Q61J450j987P78J364j961
$$ plain form
6093 -775 -681 1312 -506 -664 1148 31 -709 1315 -279 -1020 1104 -26 -1012 913 351 -954 436
6110 436 355 -1017 505 546 -1056 75 601 -980 -44 1181 -1081 -42 1163 -750 -446 1317 -218
6127 -218 -779 1202 -373 -643 979 -161 -1101 887 -57 -1045 583 210 -1187 666 555 -1152 520
6144 520 820 -1006 233 1034 -1074 24 910 -922 -131 1245 -864 -291 1146 -326 -779 1101 -419
6161 -419 -625 1179 -82 -974 987 131 -1059 733 315 -1186 690 459 -913 388 1050 -897 299
6178 299 865 -829 -141 884 -964 -68 951 -909 -526 801 -569 -794 1173 -263 -654 1063 -90
6195 -90 -858 821 19 -979 920 261 -1138 832 229 -1140 228 830 -1054 227 949 -1114 128
6212 128 1047 -1004 -88 858 -842 -507 998 -644 -621 1024 -155 -685 1198 123 -1010 845 136
$$ packed form
6093g75R4J993j818j58J812j117p40K024j594p41K124j130r86J925n62j305J390
6110D36q1j372J522M1j602J131N26j581R36J225k262J039J205j913L04J763j535
6127b18n61J981j575k70J622j140r40J988r44r88J628l73j397J853j11j707J672
6144E20L00j826J239Q01k108J098Q86j832P91J376k109N73J437j472m53J880j520
6161d19k06J804j261q92J961q56j190J792m18j501J876k31j372J301O62j947J196
6178B99N66j694O88J025j848Q96J019j860L83J327j370k25J967j436l91J717j153
6195i0p68J679q02r98J899o59j399J970o03j369J368O02j884J281P22k063J242
6212A28R19k051R16R46j700L35J505j642K3J645j179n30J883j075j133J855p09
$$ plain form
6229 136 -1269 809 491 -1030 965 359 -990 445 495 -1067 34 827 -1056 250 1035 -800 174
6246 174 1124 -747 -340 1018 -545 -638 1033 -319 -897 777 139 -949 768 284 -949 731 294
6263 294 -957 511 519 -970 144 726 -1005 12 828 -906 179 1203 -777 -63 978 -880 -418
6280 -418 1189 -758 -447 1318 -429 -1101 1171 -214 -948 913 -245 -1156 594 468 -1124 455
6296 455 761 -768 322 838 -1326 173 573 -1018 -128 718 -701 -253 1043 -586 -541 696 -687
6313 -687 -615 1016 -198 -513 1193 -71 -740 739 91 -1164 897 300 -1008 612 481 -1331 305
6330 305 598 -1099 155 775 -696 154 716 -696 -253 990 -658 -274 1009 -478 -594 1012 -335
6347 -335 -756 977 -97 -684 657 -53 -1096 826 634 -1004 582 516 -834 437 221 -1014 314
$$ packed form
6229A36j405K078l18j521J995o06j349J435N0j562J101P93j883J306P85j835R74
6246A74R50j871M07J358j563r3J671j352n78J674o38j088J717m84j233J680m37
6263B94j251J468Qj489J114N82j731J017Q16j734J085J024j980P14J041j858M62
6280d18J607j947L11J765j747o72K272j385p34J861j158r11J750j26j592J579
6296D55L06j529J090N16k164J499M00j591Q90Q46j419M48J296j629M5J237j383
6313f87P2J631j214l15J706j264o69J479o48j255K061n97j308J620j31j812J636
6330C05K93j697J254O20j471Q50N62j412M43J243j648L84J283j487j16J606j347
6347c35m21J733j074n87J341p10j043J922j92j638J586o6j350J271k16j235J328
$$ plain form
6364 314 770 -1106 85 843 -726 56 1064 -928 -391 1083 -773 -565 964 -467 -685 996 -238
6381 -238 -806 887 37 -970 799 317 -846 261 177 -1249 451 642 -865 181 812 -899 185
6398 185 897 -727 87 1145 -801 -407 998 -737 -322 1040 -344 -811 1132 -197 -799 802 4
6415 4 -941 635 50 -818 561 487 -1038 584 808 -803 223 796 -1032 -243 827 -950 -2 636
6433 636 -827 -399 937 -759 -317 725 -250 -663 1059 -109 -789 1096 57 -597 936 64 -918
6450 -918 568 414 -960 167 534 -1003 188 650 -923 222 665 -818 -283 1057 -675 -319 816
6467 816 -480 -395 1084 -71 -467 1204 99 -768 811 49 -958 866 60 -1122 532 179 -1128
6484 -1128 291 561 -562 72 534 -793 -157 822 -889 -54 474 -581 -32 961 -357 -327 1086 -225
$$ packed form
6364C14M56j876J191P58j569P82J008j992N37J474j856K08J529j431k18J681j234
6381b38n68J693q50j007J769m82j163J107q4j426J700J91j507J046O31j711J084
6398A85P12j624Q14J058j946L94J405j735M15J362j384m67J943j329o02J601p98
6415Dr45J576n85q68J379p4j525J622K24j611J026N73j828P89J070j777R48O38
6433F36j463M28J336j696M42J042r75m13J722j168o80J885j039o54J533q72r82
6450i18J486j54j374J127L67j537J191M62j573J145M43j483N35J340j732L56J135
6467H16j296Q5J479j155l96J671j105q67J579p62j007J824q06j182J654l53j307
6484a128J419K70j123O34M62j327O36R79j711Q35N28j055N49R93j318L0J413j311
$$ plain form
6502 -225 -423 933 55 -698 798 -134 -1006 655 1 -990 376 410 -933 464 534 -857 283 773
6520 773 -605 187 1190 -510 -84 981 -466 -328 722 -618 -586 622 -463 -530 856 -257 -665
6537 -665 693 185 -877 797 355 -646 704 154 -1042 634 593 -1048 -29 663 -754 29 981
6554 981 -649 -102 790 -725 -327 871 -536 -408 828 -419 -568 600 -203 -452 639 -41 -765
6571 -765 827 264 -869 756 509 -860 482 416 -1057 -63 764 -719 97 683 -747 -175 638 -565
6589 -565 25 943 -434 -541 861 -288 -612 907 -232 -497 945 16 -999 837 386 -816 519
6606 519 365 -1034 224 609 -1266 402 839 -1010 35 545 -805 -165 1006 -513 -343 939 -418
6623 -418 -56 645 -301 -328 747 8 -870 742 29 -844 674 111 -972 708 -7 -1049 131 210
$$ packed form
6502b25j98J356q78p53J496r32q72J661o54r91J366L4j343J397P0j391J140M90
6520G73j378P92J003j700M26J065j447J38J050j340L2J208j085o7J386j113m08
6537f65J358n08j062J674m42j001J350n50j196J676m1j641J019O92j417P83R52
6554I81j630N47Q92j515L98J198j407J28J236j247j49J168q03k49J091o80p24
6571g65J592n63j133J625k47j369J342o6j473R94Q27j483Q16N86j430N72Q13j203
6589e65N90R18j377j07J402j149l24J519j139k65J442r29j015J836m51j202J335
6606E19j54j399J258L85j875J668M37j849J045N10j350O40J171j519J70J282j357
6623d18L62P01r46k7J075p39q78J612p13q73J518n63j083J680p15j042J180P9
$$ plain form
6641 210 -963 166 511 -806 228 672 -718 -276 920 -508 -22 903 -612 -474 1064 -500 -450
6658 -450 946 -33 -483 939 94 -960 630 228 -822 653 235 -910 624 507 -755 148 779
6675 779 -715 -76 788 -687 -132 827 -381 -258 982 -508 -427 813 -240 -748 898 -183 -793
6692 -793 706 89 -974 560 145 -926 746 160 -974 505 439 -634 56 798 -1002 116 763
6709 763 -998 -58 902 -474 -217 925 -558 -356 1027 -353 -516 1032 -91 -655 621 25 -633
6726 -633 905 350 -626 529 481 -808 604 434 -852 438 547 -952 176 944 -806 -344 660
6743 660 -712 -385 785 -282 -665 682 -383 -701 900 -196 -562 754 -125 -772 572 395 -462
6760 -462 588 283 -854 235 516 -845 23 578 -493 402 576 -833 73 719 -518 -438 856 -393
$$ packed form
6641B10j173J129L45j317J034M44j390M42J196j428M86R25j515J38J538j564N0
6658d50J396r79m50J422q45j054J590m02j050J475m18j145J534j17j262R03O31
6675G79j494O39Q64j475N55R59j208J23J240j490Q1J240j053n08J646j081o10
6692g93J499o17j063J534m15j071J672n86j134J479o6j073O90P42j800J118O47
6709G63j761R40R60j376K57J142j483K02J383j380j63J548j123n64J276n96o58
6726f33J538n55r76J155m8j289J412j70j286J290J09j499J128P68j750M62J004
6743F60j372L27J170j067l83J347j065l18J601j096l66J316q79o47J344j77q57
6760d62J050l05j137J089K81j361Q68N55j071Q95J74j409R06O46j237Q0J294j249
$$ plain form
6778 -393 -382 834 -671 -410 858 -335 -755 811 -209 -719 339 -200 -675 292 270 -1062 420 440
6796 440 -722 257 474 -808 233 755 -592 -10 575 -590 -183 849 -634 -336 869 -384 -613
6813 -613 811 -197 -538 663 -53 -637 759 20 -674 545 343 -867 583 282 -825 269 614
6830 614 -1029 174 417 -667 -189 435 -762 -153 821 -416 -315 485 -440 -703 955 -326 -812 679
6848 679 -153 -499 558 36 -1012 761 254 -863 494 352 -933 279 303 -809 345 682 -828
6865 -828 -129 892 -667 -53 827 -389 -346 773 -188 -536 499 -478 -669 777 -125 -792 494 -76
6883 -76 -806 448 183 -867 619 531 -980 229 553 -721 -5 603 -693 32 982 -577 -327 777
6901 777 -628 -276 707 -423 -255 1159 -319 -910 727 -23 -780 821 -95 -584 648 327 -897
$$ packed form
6778c93J1J216j505K61J268j193m20J566j020n10J058n39m75R67k2j332J482K0
6796D40j162R79K17j282J041N22j347N82N85j165M07J032j483K98J205j253k29
6813f13J424j008l41J201p16n84J396p39o94J219k02j210J450l01j107J094L45
6830F14j643J203K43j084M78O24j197O09R74j237J01Q00r25k63J658j281m86J491
6848F79q32l46J057n22j048J773n07j117J357j42j285J212K4j112J154L37j510
6865h28O99J021j559O14Q80j216M3J119r61l48J035r77j91J446r02o67J286n70
6883g6p30J254k65j050J486q8j511J209L24j274P16O08j296P25R50j559K50J104
6901G77j405L52R83j130J68J414j478n91J637p50p57J601r16m89J232l21j224
$$ plain form
6918 -897 513 497 -779 356 647 -652 134 825 -692 -314 889 -514 -301 825 -535 -181 1227
6935 1227 -580 -282 841 -143 -431 948 339 -785 768 -155 -849 845 329 -822 548 408 -743
6952 -743 252 667 -832 -21 951 -727 -42 599 -655 -98 781 -466 -408 783 -121 -464 1030 -189
6970 -189 -589 692 -163 -641 864 -54 -614 515 243 -929 576 325 -976 321 498 -819 255
6987 255 602 -731 7 766 -775 -284 622 -486 -185 767 -482 -398 721 -249 -634 671 145 -696
7005 -696 534 -29 -635 534 117 -795 330 218 -864 520 509 -776 36 800 -566 110 575 -674
7023 -674 -66 769 -329 -347 790 -269 -79 582 10 -551 864 -277 -760 374 307 -831 570 -12
7041 -12 -1104 450 357 -824 261 624 -642 491 480 -811 -7 604 -709 -257 769 -495 -273 888
$$ packed form
6918h97J410j6j276J135K91j299P86O91j517L78J203j403K13J126j360L54J408
6935A227j807K98J123r84k88J379o09j124J553r23o94J694n16j151J370j40j151
6952g43R95M15j499Q11R72j678O85O41j254N57Q79j247N8J191r04l43J494j219
6970a89m00J281q55m78J505r18n60J129k72j172J505k51j301J297J77j317J074
6987B55L47j333P38P59j541M91R06j108L01R52j249Q4J119r70l85J305n26q41
7005f96J230n63o06J169m17r12J125j12j082J384j1j285Q12P64j366O76M65j249
7023f74O08Q35j098j8J137j059J90O61n72n61J415j141m83J134o7j138J401n82
7041a2j092J554r3j181J085L63j266J133j1j291Q04O11j313M52J026j264K22J161
$$ plain form
7059 888 -408 -259 1037 -293 -589 829 -52 -874 754 -49 -741 572 306 -1019 537 469 -1185
7076 -1185 387 602 -931 187 712 -668 46 668 -599 131 799 -528 -393 656 -260 -271 637 -141
7094 -141 -520 766 65 -907 626 -103 -846 416 344 -773 357 405 -662 432 403 -786 168 689
7112 689 -727 100 676 -617 -219 860 -455 -291 701 -366 -258 713 -317 -708 633 -70 -697 699
7130 699 90 -590 623 114 -810 354 303 -674 553 208 -925 302 347 -914 -152 694 -607 -57
7148 -57 772 -666 -344 760 -491 -437 649 -378 -364 566 20 -932 844 288 -730 609 125 -504
7166 -504 310 347 -759 410 569 -922 58 696 -688 52 545 -519 -369 889 -484 -565 774 -272
7184 -272 -456 874 -146 -497 727 -61 -645 443 65 -871 660 30 -464 498 187 -941 533 322
$$ packed form
7059H88j296J49J296j330k96J418q81q22J628q03o92J313k66j325J556o8j654
7076a185J572K15j533J118N25j380P14O22j267P30O68j327J35J049r16j1R08p78
7094a41l79J286p01r72J533p29p43J262p2j117J130M8j067J094k9j189R54N21
7112F89j416Q27N76j293L98J079j315J64R92j067J08R71j030l91J341p03o27J396
7130F99o09o80J213n09r24J164n1r77J227l45j133J227M5j261P62Q46j301N50
7148e7Q29j438L22J104j251N4J086j027J4R30n46r52J776n56j018J339m84o29
7166e04Q14L7j106J169J59j491R80O38j384P40M93j064J50J258j373q1J339j046
7184b72j84J330j020l51J224p88n84J088l78r36J531o30m94R62l11j128J474k11
$$ plain form
7202 322 -859 264 486 -746 116 744 -703 -307 939 -328 -36 608 -317 -291 796 -169 -668 818
7220 818 -175 -485 558 -10 -858 454 93 -758 571 23 -805 326 412 -718 295 832 -690 225
7238 225 871 -406 132 868 -710 -395 549 -507 -391 743 -237 -713 671 -271 -759 658 232 -744
7256 -744 726 108 -574 612 154 -898 471 418 -521 72 534 -857 -71 609 -480 -146 797 -591
7274 -591 -520 369 -319 -583 718 -330 -789 662 -34 -625 727 -18 -479 770 302 -791 513 506 -976
7293 -976 201 724 -728 156 624 -633 91 548 -900 216 804 -581 -87 783 -429 -751 528
7310 528 -364 -717 573 -215 -458 898 80 -784 758 -2 -800 494 175 -867 478 519 -941 201
7328 201 649 -462 -40 718 -694 -51 561 -540 -290 960 -362 -314 755 -154 -462 668 -5 -540
$$ packed form
7202C22j181J123K22j232Q62O28j447L96J246j267K92O44r25K6J087r65m99J486
7220H18r93l10J043n68q48J312l61q51J329n48q28J131Q6j130J013N37j522R15
7238B25O46j277N38P36j578L15R44j056J16J134r80m76J384r42m88J417m26r76
7256g44J470o18o82J186m58j052J369n3r39N93M62j391P86O80j089L34R43j388
7274e91P1Q89o88k64J301j048m59J451o96n91J352p45m61J249m68j093J304pj482
7293i76J177N23j452Q84M68j257P24M57j448J116N88j385M94Q70j212l22J279
7310E28q92l53J290p88k43J356q18q64J542p60p98J294l19j042J345M1j460J142
7328B01M48j111M22P58j412O43O12j101K50J250j322M8J069r09l08J130o73n35
$$ plain form
7346 -540 672 -98 -732 793 -83 -1035 529 227 -860 215 378 -959 158 496 -538 193 710
7363 710 -672 -38 845 -581 -288 711 -635 -592 885 -307 -410 541 -251 -788 483 -93 -708 423
7381 423 159 -630 600 561 -952 371 407 -432 238 560 -542 238 537 -774 11 666 -318 -300 948
7400 948 -524 -348 940 -569 -632 707 -205 -406 761 -112 -955 635 74 -651 552 130 -643 154
7418 154 401 -525 120 550 -830 125 722 -830 -57 642 -437 -349 851 -689 -420 862 -317 -539
7436 -539 596 -127 -685 718 -18 -720 743 280 -546 527 242 -602 578 184 -703 150 535 -758
7454 -758 136 822 -852 47 790 -702 -200 893 -592 -463 546 -291 -305 642 -300 -609 770 -206
7472 -206 -714 455 170 -774 693 37 -717 425 525 -807 143 615 -903 202 563 -765 112 594
$$ packed form
7346e40J212p70o34J525q76r52J564l02j087J075J63j337J117L38j034P31N17
7363G10j382O34Q83j426K93R99j346M3J477j192j03R51p92n37J271n76o15J131
7381D23k64p89J230l9j513J323L6q39O70L22j102P80K99j311P85O55r84J8J248
7400I48j472J76J288j509o3J339r12k01J167q73q43J590n61p25J203m22p73P97
7418A54K47r26O45M30j380R55N97j552P73O99j079Q8J200j540K69J282j179k22
7436e39J135p23n58J403p36p02J463m63q26J073k85q44J180l94q87Q53L85j293
7454g58Q94O86j674Q99P43j492N02J093j485J29J009q37j4R47r42l09J379r76
7472b06n08J169k85r44J467o56p54J142J00j332R50M72j518J105L61j328Q77M82
$$ plain form
7490 594 -494 -55 853 -409 -338 574 -199 -287 928 -323 -683 515 70 -505 593 -130 -776 394
7508 394 279 -748 271 468 -773 433 517 -922 288 502 -741 -142 773 -525 -140 677 -502
7525 -502 -290 592 2 -374 605 -169 -649 652 -106 -559 532 126 -547 549 289 -634 550 178 -627
7544 -627 -2 445 -781 160 389 -888 -60 664 -694 -180 677 -451 -260 526 -749 -318 770 -266
7562 -266 -508 646 -81 -585 828 165 -602 577 334 -972 245 513 -963 321 309 -610 142 483
7580 483 -700 134 633 -614 -107 855 -607 -249 893 -440 -395 747 -174 -502 907 -306 -565 842
7598 842 177 -834 270 302 -606 369 69 -895 302 317 -832 130 466 -579 163 604 -614 -271 896
7617 896 -164 -416 612 -419 -465 697 -157 -487 713 -258 -615 684 295 -871 449 39 -677 501
$$ packed form
7490E94j088M39R08j262P1R12p73q8J215j251l60J198m45n75J098p23o46J170
7508C94j15j027J019J97j241J206Q4j439J210K14j243N99R15j298L85Q17j179
7525e02K12Q82n90l76R79p74m80J301p58m53J091m06o73J096k60r23J184l72q05
7544f27O25M47j226R41K29j277Q28P24j358N14Q57j128J91P86j275M31J088j036
7562b66k42J154p27n04J413o63p67J179k43j306J217K68j476J284j2r19P52L41
7580D83j183Q34M99j247N07R62j462L58J142j333M5J142r21l28J409j213k59J407
7598H42o65j011J104L2r08R75l00r64J197J5j149R62L36j045P42M41j218L43J167
7617H96j060k52J028j031m6J162q54l30J200r71l57J299l89j166J320m10p16J178
$$ plain form
7635 501 398 -581 138 352 -668 277 741 -698 -84 563 -418 63 721 -392 -230 755 -309 -302 727
7654 727 37 -281 753 -224 -406 550 169 -519 504 395 -587 411 156 -756 101 633 -653 45 570
7673 570 -491 59 860 -602 -24 836 -178 -306 497 -243 -445 616 -534 -387 682 -30 -368 415
7691 415 -186 -484 482 208 -765 434 612 -699 139 363 -676 223 539 -682 112 756 -442 -156
7709 -156 555 -443 -337 730 -142 -154 778 -110 -361 702 23 -653 499 -30 -724 624 273 -791 450
7728 450 336 -535 47 383 -639 167 676 -344 107 306 -502 -23 712 -625 -156 759 -218 -372 665
7747 665 -86 -678 390 84 -537 344 5 -522 357 115 -719 565 487 -524 264 613 -554 208 702
7766 702 -411 98 455 -216 108 759 -84 -440 652 -217 -349 755 -383 -356 698 -199 -329 548 -80
$$ packed form
7635E01j03r79P19K14j020R45M64j439O14O47r81M81O58j113J62R85j064PJ029
7654G27o90l18J034r77j82R56l81o88J023j09r82R98k55r12Q57N32j286O98N25
7673E70j061N50Q01j462N78Q60j014j28Q03p40k02J061j150J47J069p12l38P83
7691D15o01k98R66k74r73J199J78j311Q38K24j039Q99L16j221P94O44j198K86
7709a56P11r98J06J067q72j2R32q88k51J063o79o76J152n29o94J348l51j064J241
7728D50j14q71N82L36j022Q06N09j020M51J99q08M79P35j337M69R15r77j54J037
7747F65p51n92J068l06o21Q81l39n27Q79k42q34J284p8j011P88L49j167P62M94
7766G02j113N09L57o71L24O51q43l56J092q69j32J104j138K7J054q97j30Q77o28
$$ plain form
7785 -80 -611 279 24 -708 513 346 -465 128 188 -474 42 391 -636 276 425 -542 111 448 -291 -245
7805 -245 579 -433 -276 660 -234 -253 588 -399 -683 410 -95 -664 536 -10 -646 533 -17 -541 416
7824 416 488 -647 117 306 -596 209 416 -668 -150 428 -597 -71 702 -345 -299 695 -84 -408 582
7843 582 -105 -538 479 77 -325 306 86 -524 298 190 -667 302 551 -694 347 381 -599 134 371
7862 371 -441 17 757 -714 56 690 -344 -570 361 -251 -525 490 47 -452 645 -27 -463 573
7880 573 50 -423 380 260 -507 340 447 -585 320 395 -630 396 255 -461 -60 523 -708 -296 413
7899 413 -446 -277 560 -515 -324 686 161 -336 688 53 -477 722 159 -569 444 282 -406 225
7917 225 488 -515 234 247 -653 -136 826 -698 -10 465 -513 -325 613 -643 -164 661 -173 -489 680
$$ packed form
7785h0n31Q90k55p32J221j67q11N93O0o62N16L49j027R12J49r67O53L37p39M6
7805b45Q24j012J57R36q94j9Q41r87k84J093n05n69J200n46o36J179n50n24R57
7824D16P2j135P64J89r02Q05K07j084N18N78j025N26P73j047M6R94p79l24R90
7843E82o87m33J017m02m02O31k20o10Q22j08q57R69K49j245J041L4r80P33K37
7862C71q12M58P40j471P70O34j034k26R31o12k74J015m43m99J097o72m36J036
7880E73n23m73Q03j20p67Q47J07j032R05P5j025J026j41p16M01N83j231M12P09
7899D13q59J69Q37j075J91J010n25m97J024o35n30J199n63p28J013j62o88O31
7917B25K63j003P49J3r00N17R62j524O88M75r78J88R38j256M79Q25q34l16J169
$$ plain form
7936 680 -386 -606 488 -181 -284 377 95 -346 413 86 -697 310 428 -559 300 569 -491 155 373
7955 373 -350 123 431 -521 -227 864 -141 -537 608 -376 -360 454 -275 -360 507 255 -704 538 85
7974 85 -750 550 332 -516 392 184 -668 246 318 -496 169 360 -413 -283 608 -512 -200 359 -291 -265
7994 -265 812 -443 -517 571 -387 -393 654 -130 -554 509 -177 -541 442 94 -776 437 260 -291 302
8013 302 507 -458 -85 370 -445 -83 353 -345 -63 562 -446 -346 592 -193 -318 599 -148 -670 605
8032 605 -43 -452 540 108 -555 147 157 -398 234 693 -763 53 493 -553 17 253 -393 -171 424 -398
8052 -398 -175 635 -472 -52 552 -398 -401 477 -163 -573 575 -183 -426 899 49 -560 536 168 -473
8071 -473 242 261 -678 515 449 -554 34 407 -587 69 440 -459 58 485 -75 23 329 -198 -231 487 -97
$$ packed form
7936F80j066k20J094o69j03O61k82m41P59l27p83J007J18r87Q59K69j060O46K18
7955C73p23M73L08r52K94J091j005l96J145r84J6Q14p29q5Q67k52r59J242m53
7974H5q35J300k18q48R08k08q52R14P2q14O65J91p73J30Q91j120L12N59o50K6
7994b65J077j255p4J088r58oJ047p84m24J063o86l64R83l48q70J213j77n51N93
8013C02K05r65L73M55q15L62M36o98K82O25j008J00R38p85j25R17p47n22J275
8032F05o48m09R92m32o63P02J0n55O32M59j456Q16M40j046N70K36o46K22N95q22
8052c98K23Q10j107M20O04r50lQ78o40m10J148p58k43J325q50o09J096l68o41
8071d73P15J9r39J193o6j003N88L73r94O56L71q99N17M27n60R8L06n27l3P18n84
$$ plain form
8092 -97 -318 653 -63 -620 401 -16 -403 479 246 -464 449 107 -512 339 265 -792 250 246 -430 77
8112 77 713 -572 -309 578 -135 -206 485 -399 -381 623 -120 -262 317 -122 -455 303 -54 -395 756 196
8132 196 -614 275 180 -482 320 165 -411 -90 530 -563 84 529 -330 -80 583 -376 -455 671 -488 -246
8152 -246 882 -153 -394 501 106 -605 244 116 -273 356 169 -823 320 373 -752 298 464 -578
8170 -578 108 443 -656 287 691 -420 -3 417 -244 -365 473 -423 -160 276 -244 -373 260 -58 -618
8189 -618 752 -127
$$ packed form
8092i7k21R71p16n57J021m17l87Q82k33p10R13l42o19Q51p4j057J042mo76N07
8112G7O36j285K63Q87p13p1O91q84J8J004p43j42N79m39l33P58l57l41J151n60
8132A96q10Q89r5o62Q02j55n76L21O20j093O47M45q59K50O63r59p9J126j159K42
8152b46J128j035k41Q95l95p11Q49j28l89O29j87r92J143N3j125J050J66j042
8170e78O86L35j099R43M04j111M17M20o61j21Q38q96K63M36n20j29O33l18n60
8189f18J370q79
8191a27
$$ Imaginary data points
##PAGE= N=2
##DATA TABLE= (X++(I..I)), XYDATA
$$ plain form
0 0 0 0 0 0 0 0 0 0 0 0 0 0 8 -8 8 -8 8 -16 16 -16 24 -24 32 -34 41 -48 56 -64 73 -84 97 -110 123 -140 158
35 158 -180 199 -224 250 -277 307 -346 379 -420 465 -513 566 -624 686 -757 833 -919 1015
53 1015 -1120 1238 -1372 1527 -1703 1913 -2161 2461 -2833 3313 -3947 4833 -6160 8350 -12590
68 -12590 23711 -113088 -218867 112574 62191 13411 168110 51231 -12658 225987 88440
79 88440 -103002 129595 162955 -23524 59775 -27424 -210281 77 45895 -210045 -81807
90 -81807 65609 -107937 -66323 -3241 -172002 -8621 206241 -10412 -40403 150632 23017
101 23017 -14375 121306 -29423 -32148 216204 59345 -140599 19087 -8312 -101177 64777
112 64777 -3470 -136954 84830 73255 -180506 -62288 42290 -64653 67790 92152 -134608
$$ packed form
0@%%%%%%%%%%%%Qj6J6j6J6k4L2l2M0m8N6o6P5q9J04j20J37j57J81k07K33k63K98
35A58l38L79m23M74n27N84o53P25p99Q85r78J079j190J310j443J590j752J934
53A015k135K358k610K899l230L616m074M622n294O146p260Q780j0993J4510k0940
68a2590L6301j36799j05779L31441n0383m8780J54699j16879o3889K38645j37547
79H8440j91442K32597L3360j86479Q3299q7199j82857K10358M5818k55940J28238
90h1807J47416j73546M1614O3082j68761J63381K14862k16653k9991J91035j27615
101B3017l7392J35681j50729k725K48352j56859j99944J59686k7399r2865J65954
112F4777o8247j33484K21784j1575k53761J18218J04578j06943J32443K4362k26760
$$ plain form
123 -134608 -15994 122672 -98672 -79090 99546 861 37681 132367 -96972 -100466 146316
134 146316 28262 -65798 110874 40203 -37455 93522 -54907 -178994 75012 84428 -104399
145 -104399 -2794 -8643 -138482 11068 11926 -165798 25632 164665 -37671 -22642 59638
156 59638 -60640 49922 170261 -31291 -4571 176301 5498 -88482 26637 -64090 -47342
167 -47342 124333 -45163 -171891 23343 -15667 -142731 -278 -1040 -56194 125599 67584
178 67584 -139512 18791 117814 -16912 66653 105709 -42087 58286 104252 -133027 -83101
189 -83101 100338 -15784 -32227 40653 -115649 -89908 78630 -70895 -118485 99038 53954
200 53954 -38961 59464 -36937 -90328 128187 86711 -76901 65649 84250 -63983 12680
$$ packed form
123a34608J18614J38666k21344J9582J78636r8685L6820R4686k29339l494K46782
134A46316j18054r4060J76672p0671p7658J30977j48429j24087K54006R416j88827
145a04399J01605n849j29839J49550Q58j77724J91430J39033k02336J5029Q2280
156E9638j20278J10562J20339k01552K6720J80872j70803r3980J15119r0727J6748
167d7342J71675j69496j26728J95234l9010j27064J42453p62n5154J81793n8015
178F7584k07096J58303R9023j34726Q3565L9056j47796J00373M5966k37279M9926
189h3101J83439j16122j6443P2880j56302K5741J68538j49525m7590K17523m5084
200E3954r2915R8425r6401n3391K18515m1476j63612J42550J8601j48233P6663
$$ plain form
211 12680 77 -117888 57979 120911 -96935 -57824 43198 -79011 -27445 57162 -76784
222 -76784 -402 146579 -39331 -103985 48438 -5803 -10309 110420 -15974 -68568 105016
233 105016 12475 -127497 20908 42405 -26030 81783 9443 -135561 23855 67174 -93450
244 -93450 -5905 74471 -31357 31267 40697 -133908 -32571 124819 -16521 -33012 71563
255 71563 -30665 -26293 68107 -72956 -70476 132143 47694 -69328 27071 -25117 -68321 76472
267 76472 7478 -97437 74609 76765 -91354 -23965 3643 -66920 68146 83059 -92968
278 -92968 -6001 88505 -60212 -41121 49726 -34018 33290 114208 -70792 -88460 70632
289 70632 -7459 -48627 60006 -12990 -34417 86844 -32672 -131188 43215 57287 -35322
$$ packed form
211A2680j2603j17965J75867O2932k17846L9111J01022j22209N1566Q4607j33946
222g6784P6382J46981j85910o4654J52423n4241m506J20729j26394n2594J73584
233A05016r2541j39972J48405K1497o8435J07813p2340j45004J59416M3319j60624
244i3450Q7545Q0376j05828O2624R430j74605J01337J57390j41340j6491J04575
255G1563j02228M372R4400j41063K480K02619q4449j17022R6399n2188m3204J44793
267G6472o8994j04915J72046K156j68119O7389K7608p0563J35066J4913j76027
278i2968Q6967R4506j48717J9091R0847q3744O7308Q0918j85000j7668J59092
289G0632p8091m1168J08633p2996k1427J21261j19516r8516J74403J4072r2609
$$ plain form
300 -35322 47341 9457 -80293 50259 40110 -105205 15199 101973 -17977 6508 18806
311 18806 -97535 2207 95737 -56128 -37794 87030 -15622 -45438 23972 -70442 -34425
322 -34425 122566 8734 -80727 45402 7988 -56736 43389 -4534 -52860 101943 58357
333 58357 -103709 -12119 33087 -46630 38663 42537 -76565 24956 73671 -93257 -58392
344 -58392 55741 -13652 19087 68707 -71454 -44391 86601 -25485 -63502 68790 24930
355 24930 -10680 62060 -45343 -93677 71188 43295 -64234 30889 27093 -55070 24492 -6914
367 -6914 -104631 37192 95035 -47071 -17571 28717 -56346 9444 59107 -61269 558 113786
379 113786 -15203 -57509 25112 -32784 -7957 91616 -22422 -64683 68099 3743 -85506
$$ packed form
300c5322Q2663l7884q9750J30552j0149j45315J20404Q6774j19950K4485J2298
311A8806j16341R9742R3530j51865J8334J24824j02652k9816O9410r4414L6017
322c4425J56991j13832q9461J26129l7414o4724J00125m7923m8326J54803m3586
333E8357j62066R1590M5206p9717Q5293L874j19102J01521M8715j66928L4865
344e8392J14133o9393L2739M9620j40161K7063J30992j12086l8017J32292m3860
355B4930l5610P2740j07403m8334J64865k7893j07529R5123l796q2163P9562l1406
367f914r7717J41823N7843j42106K9500M6288q5063O5790M9663j20376O1827J13228
379A13786j28989m2306Q2621n7896K4827R9573j14038m2261J32782o4356q9249
$$ plain form
390 -85506 9967 -1792 -30740 79489 13070 -106994 12888 45108 -56730 13823 44478
401 44478 -31941 49557 55650 -94429 -25699 85427 -6517 422 52895 -45237 -17810 61172
413 61172 -63438 -71183 72926 18396 -40066 22236 -47653 -66442 64777 9372 -71155 54535
425 54535 57754 -39386 15369 1604 -55769 69593 82845 -55897 -1286 54500 -45407 -18567
437 -18567 20371 -60628 9895 82924 -59532 -78202 27374 -24125 -25822 53008 -20686 -22512
449 -22512 88776 -1477 -79713 37804 40725 -5453 65771 9260 -68823 40436 29843 -85813
461 -85813 -4721 45570 -30512 12708 6461 -100029 -12623 69099 -39365 -19479 62926 -10837
473 -10837 -4224 44820 -53535 -26010 103071 21605 -42789 34465 -11666 -42621 40916 -20105
$$ packed form
390h5506R5473j1759k8948J10229o6419j20064J19882L2220j01838P0553L0655
401D4478p6419Q1498O093j50079O8730J11126r1944O939N2473r8132K7427P8982
413F1172j24610p745J44109n4530n8462O2302o9889j8789J31219n5405q0527J25690
425E4535L219r7140N4755j3765n7373J25362J3252j38742N4611N5786r9907K6840
437a8567L8938q0999P0523P3029j42456j8670J05576n1499j697P8830p3694j826
449b2512J11288r0253p8236J17517K921m6178P1224n6511p8083J09259j0593j15656
461h5813Q1092N0291p6082M3220o247j06490Q7406Q1722j08464J9886Q2405p3763
473a0837O613M9044r8355K7525J29081q1466o4394P7254m6131l0955Q3537o1021
$$ plain form
485 -20105 -64601 64257 39996 -73109 -12535 -411 -45652 45413 39696 -61704 21955 65384
497 65384 -51284 -28717 30844 -21540 31850 68838 -58209 -42764 58079 -19060 -40784
508 -40784 40823 -3511 -4356 65644 -33654 -81329 44608 31191 -34015 31433 4404 -47243
520 -47243 34917 -611 -92114 14725 63130 -26907 3009 13935 -57094 17857 59885 -44631
532 -44631 917 88086 947 -17131 25692 -43338 -10957 78839 -18995 -59728 35688 -13111
544 -13111 -65534 2158 -30688 -44159 65041 18551 -75531 12188 33600 -26247 39835 44227
556 44227 -20315 59309 67070 -58039 -19987 49670 -13816 6066 30316 -63689 -34161 34577
568 34577 -63385 -71980 31652 -1288 -17949 34805 -36444 -47964 67216 29863 -31512 55100
$$ packed form
485b0105m4496J28858k4261j13105O0574J2124m5241R1065n717j01400Q3659M3429
497F5384j16668K2567N9561n2384N3390L6988j27047J5445J00843p7139k1724
508d0784Q1607m4334q45P0000r9298m7675J25937j3417o5206O5448k7029n1647
520d7243Q2160l5528r1503J06839M8405r0037K9916J0926p1029P4951M2028j04516
532d4631M5548Q7169q7139j8078M2823o9030L2381Q9796r7834m0733R5416m8799
544a3111n2423O7692l2846j3471J09200m6490r4082Q7719K1412n9847O6082M392
556D4227o4542P9624P761j25109L8052O9657o3486J9882K4250r4005K9528O8738
568C4577r7962q595J03632l2940j6661N2754p1249j1520J15180l7353o1375Q6612
$$ plain form
580 55100 49546 -9605 38546 438 -60141 43798 58195 -48379 -12773 14890 -54593 -13106
592 -13106 8030 -69112 -2603 70155 -30961 -43223 22303 -22421 -849 63200 -15971 -19728
$$ packed form
580E5100n554n9151M8151l8108o0579J03939J4397j06574L5606K7663o9483M1487
592a3106K1136p7142O6509P2758j01116j2262O5526m4724K1572O4049p9171l757
$$ [...]
8191g66
##END NTUPLES=NMR FID
##END=
