##TITLE=1H_Pr 2066-2
 CDCl3, 8 sc, 
 8.2.2019
##JCAMPDX= 6.0         $$ Bruker NMR JCAMP-DX V2.0
##DATA TYPE= NMR FID
##DATA CLASS= NTUPLES
##ORIGIN= UXNMR, Bruker Analytische Messtechnik GmbH
##OWNER= root
$$ XWIN-NMR		Version 3.5
$$ Fri Feb  8 16:07:55 2019 Russian Standard Time (UT+4h)  she@DPX200
##.OBSERVE FREQUENCY= 200.1313
##.OBSERVE NUCLEUS= ^1H
##.DELAY= (6, 6)
##.ACQUISITION MODE= SIMULTANEOUS
##.ACQUISITION SCHEME= undefined
##.AVERAGES= 8
##.DIGITISER RES= 18
##SPECTROMETER/DATA SYSTEM= spect
##.PULSE SEQUENCE= zg30
##.SOLVENT NAME= CDCl3
##.SHIFT REFERENCE= (INTERNAL, CDCl3, 0, 15.7039)
##AUDIT TRAIL= $$ (NUMBER, WHEN, WHO, WHERE, WHAT)
$$ ##TITLE= Audit trail, XWIN-NMR		Version 3.5
$$ ##JCAMPDX= 5.01
$$ ##ORIGIN= Bruker BioSpin GmbH
$$ ##OWNER= she
$$ F:/spectra/data/she/nmr/H-F/1/audita.txt
$$ ##AUDIT TRAIL=  $$ (NUMBER, WHEN, WHO, WHERE, WHAT)
(   1,<2019-02-08 16:06:49.18 +0400>,<she>,<DPX200>,
      <created by zg, POWCHK disabled, PULCHK disabled
       configuration hash MD5:
       00 E9 B6 7A A2 85 ED C7 34 08 36 98 17 FE 4E 26
       data hash MD5: 16K
       89 38 9F 01 EC 43 E7 4B 0D 9A AB 9A 37 AC 15 B1>)
$$ ##END=
$$ 
$$ hash MD5
$$ AC B9 5D 5F 3C AD 42 ED E0 6C 40 08 95 20 11 59
##$RELAX= 
##$RELAX= 
##$RELAX= 
##$RELAX= 
##$RELAX= 
##$RELAX= 
$$ Bruker specific parameters
$$ --------------------------
##$DU= <F:/spectra>
##$EXPNO= 1
##$NAME= <H-F>
##$PROCNO= 1
##$TYPE= <nmr>
##$USER= <she>
##$AMP= (0..31)
100 100 100 100 100 100 100 100 100 100 100 100 100 100 100 100 100 100 
100 100 100 100 100 100 100 100 100 100 100 100 100 100 
##$AQSEQ= 0
##$AQ_mod= 1
##$AUNM= <au_zg>
##$AUTOPOS= <>
##$BF1= 200.13
##$BF2= 200.13
##$BF3= 200.13
##$BF4= 200.13
##$BF5= 200.13
##$BF6= 200.13
##$BF7= 200.13
##$BF8= 200.13
##$BYTORDA= 1
##$CFDGTYP= 0
##$CFRGTYP= 5
##$CHEMSTR= <none>
##$CNST= (0..31)
1 1 145 1 1 1 1 1 1 1 1 1 1 1 1 1 1 1 1 1 1 1 1 1 1 1 1 1 1 1 1 1 
##$CPDPRG= <>
##$CPDPRG1= <>
##$CPDPRG2= <>
##$CPDPRG3= <>
##$CPDPRG4= <mlev>
##$CPDPRG5= <mlev>
##$CPDPRG6= <mlev>
##$CPDPRG7= <mlev>
##$CPDPRG8= <mlev>
##$CPDPRGB= <>
##$CPDPRGT= <>
##$D= (0..31)
0 1.2 0 0 0 0 0 0 0 0 0 0.03 0 0 0 0 0 0 0 0 0 0 0 0 0 0 0 0 0 0 0 0 
##$DATE= 1549627608
##$DBL= (0..7)
120 120 120 120 120 120 120 120 
##$DBP= (0..7)
150 150 150 150 150 150 150 150 
##$DBP07= 0
##$DBPNAM0= <>
##$DBPNAM1= <>
##$DBPNAM2= <>
##$DBPNAM3= <>
##$DBPNAM4= <>
##$DBPNAM5= <>
##$DBPNAM6= <>
##$DBPNAM7= <>
##$DBPOAL= (0..7)
0.5 0.5 0.5 0.5 0.5 0.5 0.5 0.5 
##$DBPOFFS= (0..7)
0 0 0 0 0 0 0 0 
##$DE= 6
##$DECBNUC= <off>
##$DECIM= 32
##$DECNUC= <off>
##$DECSTAT= 4
##$DIGMOD= 1
##$DIGTYP= 9
##$DL= (0..7)
0 120 120 120 120 120 120 120 
##$DP= (0..7)
150 150 150 150 150 150 150 150 
##$DP07= 0
##$DPNAME0= <>
##$DPNAME1= <>
##$DPNAME2= <>
##$DPNAME3= <>
##$DPNAME4= <>
##$DPNAME5= <>
##$DPNAME6= <>
##$DPNAME7= <>
##$DPOAL= (0..7)
0.5 0.5 0.5 0.5 0.5 0.5 0.5 0.5 
##$DPOFFS= (0..7)
0 0 0 0 0 0 0 0 
##$DQDMODE= 0
##$DR= 18
##$DS= 0
##$DSLIST= <SSSSSSSSSSSSSSS>
##$DSPFIRM= 0
$$ [...]
##$SUBNAM2= <"">
##$SUBNAM3= <"">
##$SUBNAM4= <"">
##$SUBNAM5= <"">
##$SUBNAM6= <"">
##$SUBNAM7= <"">
##$SUBNAM8= <"">
##$SUBNAM9= <"">
##$SW= 20.0189088683792
##$SWIBOX= (0..15)
0 0 2 0 0 0 0 0 0 0 0 0 0 0 0 0 
##$SW_h= 4006.41025641026
##$TD= 16384
##$TD0= 1
##$TE= 0
##$TE2= 300
##$TE3= 300
##$TEG= 300
##$TL= (0..7)
0 120 120 120 120 120 120 120 
##$TP= (0..7)
150 150 150 150 150 150 150 150 
##$TP07= 0
##$TPNAME0= <>
##$TPNAME1= <>
##$TPNAME2= <>
##$TPNAME3= <>
##$TPNAME4= <>
##$TPNAME5= <>
##$TPNAME6= <>
##$TPNAME7= <>
##$TPOAL= (0..7)
0.5 0.5 0.5 0.5 0.5 0.5 0.5 0.5 
##$TPOFFS= (0..7)
0 0 0 0 0 0 0 0 
##$TUNHIN= 0
##$TUNHOUT= 0
##$TUNXOUT= 0
##$USERA1= <user>
##$USERA2= <user>
##$USERA3= <user>
##$USERA4= <user>
##$USERA5= <user>
##$V9= 5
##$VALIST= <valist>
##$VCLIST= <CCCCCCCCCCCCCCC>
##$VD= 0
##$VDLIST= <DDDDDDDDDDDDDDD>
##$VPLIST= <PPPPPPPPPPPPPPP>
##$VTLIST= <TTTTTTTTTTTTTTT>
##$WBST= 1024
##$WBSW= 4
##$XGAIN= (0..3)
0 0 0 0 
##$XL= 0
##$YL= 0
##$YMAX_a= 161145
##$YMIN_a= -172732
##$ZGOPTNS= <>
##$ZL1= 120
##$ZL2= 120
##$ZL3= 120
##$ZL4= 120
##$ABSF1= 10
##$ABSF2= 0
##$ABSG= 5
##$ABSL= 3
##$ALPHA= 0
##$AQORDER= 0
##$ASSFAC= 0
##$ASSFACI= 0
##$ASSFACX= 0
##$ASSWID= 0
##$AUNMP= <proc_1d>
##$AZFE= 0.1
##$AZFW= 0.1
##$BCFW= 1
##$BC_mod= 2
##$BYTORDP= 1
##$COROFFS= 0
##$CY= 11.3945322036743
##$DATMOD= 1
##$DC= 2
##$DFILT= <>
##$DTYPP= 0
##$F1P= 18.9103706918063
##$F2P= -1.10871071338519
##$FCOR= 0.5
##$FTSIZE= 0
##$FT_mod= 4
##$GAMMA= 1
##$GB= 0.15
##$INTBC= 1
##$INTSCL= 1
##$ISEN= 128
##$LB= 0.24
##$LEV0= 0
##$LPBIN= 0
##$MAXI= 10000
##$MC2= 0
##$MEAN= 0
##$ME_mod= 0
##$MI= 1.114404
##$NCOEF= 0
##$NC_proc= 0
##$NLEV= 6
##$NOISF1= 3.799351
##$NOISF2= 2.8
##$NSP= 1
##$NTH_PI= 0
##$NZP= 0
##$OFFSET= 15.70392
##$PC= 1
##$PHC0= -8678.885
##$PHC1= 11.20019
##$PH_mod= 1
##$PKNL= yes
##$PPARMOD= 0
##$PSCAL= 0
##$PSIGN= 0
##$REVERSE= no
##$SF= 200.130013532006
##$SI= 16384
##$SIGF1= 3
##$SIGF2= 2
##$SINO= 400
##$SIOLD= 16384
##$SREGLST= <1H.CDCl3>
##$SSB= 0
##$STSI= 0
##$STSR= 0
##$SW_p= 3612.71676300578
##$SYMM= 0
##$S_DEV= 0
##$TDeff= 0
##$TDoff= 0
##$TI= <>
##$TILT= no
##$TM1= 0
##$TM2= 0
##$TOPLEV= 0
##$USERP1= <user>
##$USERP2= <user>
##$USERP3= <user>
##$USERP4= <user>
##$USERP5= <user>
##$WDW= 1
##$XDIM= 8192
##$YMAX_p= 0
##$YMIN_p= 0
$$ End of Bruker specific parameters
$$ ---------------------------------
##NTUPLES= NMR FID
##VAR_NAME=  TIME,          FID/REAL,        FID/IMAG
##SYMBOL=    X,             R,               I
##VAR_TYPE=  INDEPENDENT,   DEPENDENT,       DEPENDENT
##VAR_FORM=  AFFN,          ASDF,            ASDF
##VAR_DIM=   8192,          8192,            8192
##UNITS=     SECONDS,       ARBITRARY UNITS, ARBITRARY UNITS
##FACTOR=    0.0002496,     1,               1
##FIRST=     0,             0,               0
##LAST=      2.0444736,     0,               0
##MIN=       0,             -172732,         0
##MAX=       2.0444736,     161145,          0
$$ Real data points
##PAGE= N=1
##DATA TABLE= (X++(R..R)), XYDATA
$$ [...]
2371H76m07j356J781l51j867J753O12k233J593M22k136J197J168k277N48J869
2387A192j610k20J786j840k13K015j506o83K521j151j631J846m20j242K092l52
2403E84k202K199n3j832J704M23k058J811J030k895R54J626k023O97J540k325
2419h20M80J528j830o73K500j255j241K409j162j462K602n82k000K374n49j270
2435i51J822q9k214J817R09k313J141J363k302P08J349k464N45K148k137j98K049
2452A183j805j60J893j591o52K537r26j520J970m81j822K213l64j971K343J96
2468A043k376J284J129k481J797Q79k588J158J481k095Q0K023k205L73J967k340
2484h71k74K417j592q42K416j240j179K385q60j978K286L15k225K106j08k073
$$ plain form
2371 876 469 -887 894 543 -1324 429 1041 -1192 401 823 -1313 -116 1052 -1225 -677 1192
2387 1192 -418 -638 1148 -692 -905 1110 -396 -1079 1442 291 -1340 506 86 -1156 936 584
2403 584 -1618 581 528 -1304 400 823 -1235 576 1606 -1289 -335 1291 -732 -35 1505 -820
2419 -820 -340 1188 -642 -1315 1185 -70 -1311 1098 -64 -1526 1076 494 -1506 868 319 -951
2435 -951 871 782 -1432 385 1294 -1019 122 1485 -817 -109 1240 -1224 -679 1469 -668 -866 1183
2452 1183 -622 -782 1111 -480 -1132 1405 479 -1041 929 448 -1374 839 475 -1496 847 1043
2468 1043 -1333 -49 1080 -1401 396 1275 -1313 -155 1326 -769 -689 1334 -871 -498 1469 -871
2484 -871 -1145 1272 -320 -1162 1254 14 -1165 1220 360 -1618 668 983 -1242 864 756 -1317
2500a317J674O90k328J398R88j976R08J007k219P72J980k061j96J921j423l03
2516d85J816j446r76K447j038j526K430q26j492K029k52k218K228L31k478J515
2532E9P29j977J460J044k507J298J476k412L37J722j974J72K183k191o30K666
2548A455j434j041K208j064j316K475j075j901K785k22k016J548K25j805J414
2563B36R38k455J537J322k579P33J456k270P85K065k358j05J943j784k67J864
2579A061j500q08K779j306j472K016n18j599K278j50k262K313J82k416J309J220
2595A127k129J216J043k487J334J261k533P58J656j864j06J764j802l28K263j413
2611b40q96K322j189r62K074j069j562K483k31k172J773L74k033J845N96k427
$$ plain form
2500 -1317 357 1047 -1281 117 1105 -871 37 1044 -1175 -403 1577 -484 -680 1241 -182 -485
2516 -485 1331 -115 -1091 1356 318 -1208 1222 396 -1096 933 681 -1537 691 1022 -1456 59
2532 59 788 -1189 271 1315 -1192 106 1582 -830 -493 1229 -745 -573 1610 -581 -1211 1455
2548 1455 21 -1020 1188 124 -1192 1283 208 -1693 1092 870 -1146 402 627 -1178 236
2563 236 1174 -1281 256 1578 -1001 -268 1188 -1082 -297 1768 -590 -695 1248 -536 -803 1061
2579 1061 -439 -1247 1532 226 -1246 770 252 -1347 931 781 -1481 832 1014 -1402 -93 1127
2595 1127 -1002 214 1257 -1230 104 1365 -1168 -410 1246 -618 -724 1040 -762 -1090 1173 -240
2611 -240 -1136 1186 -3 -965 1109 40 -1522 961 730 -1442 331 705 -1328 517 1113 -1314
2627a314J433R09j964O22J407k386Q82J990k230j70K374j941m50K188j622q86
2643a158K362j072j554K431l10j810K053m50j871J987K56k597J747J174k447J446
2659A87J083k424J188J061j932j8K126k102L46J866j936l49K235j817n77K334
2675A271j229j249K175q42j672K587k71k217J804M82k157J810M77k107J462J217
2691A541k654Q89J428k036L97J770k304K07K288j872p31K054j339o79K421j396
2707a6j222K285n84j685J700J10j589J709K4k148J573J074k443J108J139k108
2723a073P69J774k428K07J982k064L3J952j793n20K630j718r66K412j152r98K053
2740A100q18j492K201l33j879K155k15j652J268K95j886J612Q78k480R03J533
$$ plain form
2627 -1314 119 1028 -936 -314 1093 -1293 -411 1579 -651 -821 1553 -388 -838 1350 -272 -1158
2643 -1158 1204 132 -1422 1009 699 -1111 942 492 -1379 608 864 -1733 14 1188 -1259 187
2659 187 1270 -1154 34 1095 -837 -855 1271 -831 -485 1381 -555 -904 1331 -486 -1063 1271
2675 1271 42 -1207 968 126 -1546 1041 770 -1447 357 839 -1318 492 969 -1138 324 1541
2691 1541 -1113 -224 1204 -832 -435 1335 -969 -762 1526 -346 -1077 977 -362 -1041 1380 -16
2707 -16 -1238 1047 463 -1222 478 588 -1001 708 732 -1416 157 1231 -1212 -104 1035 -1073
2723 -1073 -304 1470 -958 -751 1231 -833 -800 1152 -641 -1161 1469 -249 -1215 1197 45 -953 1100
2740 1100 282 -1210 991 658 -1221 934 719 -933 335 630 -1256 356 1234 -1246 -343 1190
2756A190j974K00J659j962O08J705j691o21J950j012r47K383j460j201K354q82
2772B99j481J896k81j707J695o4j909J895P09k321R94J298k166J290R16j864N33
2789b68J670j791r7J642j534j22J716j415q11J917r06j075J957o55j457J901l07
2806C65j705J670M54j850J477K47j690J337Q37k015P71J449k263K20J772j777
2822g01K24J757j792m76K270j437p83J982j409q82K259q44j660K424k65j821J853
2839F99k52j681J839N07k402J667P41k010R48J045k149N02K049k063j16J631j378
2856d23l46J912j472n53J961q87j292J977o76j219J618k43j753K208n4j788J160
2873A30J95j231J178O53k135J148J461k363N18J381j565m4J563j056p25K043j340
$$ plain form
2756 1190 -784 -584 1075 -887 -279 1426 -265 -886 1064 52 -895 1488 28 -1173 1181 299
2772 299 -1182 714 433 -1274 421 357 -1552 343 1052 -1269 -275 1023 -1143 147 1063 -801 -268
2789 -268 1402 -389 -486 1156 -378 -500 1216 -199 -1010 907 1 -1074 883 228 -1229 672 365
2806 365 -1340 330 784 -1066 411 658 -1032 305 1142 -873 -102 1347 -916 -696 1076 -701
2822 -701 -477 1280 -512 -988 1282 -155 -938 1044 -365 -1247 1012 168 -1492 932 667 -1154 699
2839 699 447 -1234 605 1112 -1290 377 1118 -892 56 1101 -1048 -546 1503 -560 -676 955 -423
2856 -423 -769 1143 -329 -882 1079 192 -1100 877 201 -1018 600 357 -1396 812 758 -1030 130
2873 130 325 -906 272 925 -1210 -62 1399 -964 -446 935 -630 -674 889 -167 -892 1151 -189
2890a89p20K009r32j031J963p33j466K013o41j385J676j38j620J585K37j913J399
2907A14Q70k027R85J018j839L18J662j728J11J961j594n00J847j569k65J836j084
2924A16j109J794o65r65J536o46j346J982N9j915J424N21j887J101Q68j770R49
2941D7Q41j590J61J503j315j49J500j322m07J989j191j117K004r57q28J589m25
2958C33j455J738q2j706J522M41j694J204K42j636J244R05j858N95J136j677P15
2975c3J149j820N1K006j715l58J528j313k90J932j300p55J899o99j132J265r8
2992C17j471J745L15k038J471N05j675Q47Q20j985J215J186k004K55J476j675
3008f96qJ850j559L9J505j237o21J740p02r60J651r71q10J639n21j395J630J51
$$ plain form
2890 -189 -909 1100 168 -863 1100 367 -1099 914 273 -1112 564 426 -1194 391 628 -1285 114
2907 114 984 -1043 -58 960 -879 -561 1101 -627 -516 1445 -149 -649 1198 -371 -636 1200 116
2924 116 -993 801 136 -829 707 61 -1285 697 756 -1159 265 786 -1101 0 868 -902 47
2941 47 888 -702 -541 962 -353 -502 998 -324 -731 1258 67 -1050 954 -3 -831 758 333
2958 333 -1122 616 534 -1172 350 791 -903 301 543 -1093 151 1056 -802 -207 929 -748 -33
2975 -33 1116 -704 -653 1353 -362 -720 808 -505 -795 1137 -163 -918 981 282 -850 415 317
2992 317 -1154 591 906 -1132 339 844 -831 16 836 -1149 66 1252 -752 -497 979 -696
3008 -696 -704 1146 -413 -374 1131 -106 -727 1013 311 -649 1002 31 -779 860 339 -1056 574 725
3026G25j662J510J40k070J362P96j827Q06J075j485M11J403j970K30J640j549
3042d65k20J543j169n77J466p50o76J719n58j282J471k21j239J382N0j678J637
3059D33M94j759O51Q74j405Q43Q05j822N27J412j308j27J339j062o06J652j291
3076c50n98J765p92q48J411m21j072J503k03j597J509L12j361J199J07j454J129
3093B39O11j584J96J378j594N29J067j403J82J577j226p82J747r55p66J739j037
3110h2j066J918m31j260J690l43j401J567j02j448J359L81j732Q80Q12j514Q81
3127A09O45j484N96J187j839M01J069j065l01J915j493l61J397p31j076J929m59
3144D39j289J573m08j205J085K25j445J181K77j135Q42N78k055J505Q23j636M10
$$ plain form
3026 725 -937 573 713 -1357 5 801 -1026 -220 855 -630 -219 1184 -786 -556 1084 -465
3042 -465 -685 858 -311 -888 578 -172 -848 871 313 -969 502 281 -958 424 474 -1204 433
3059 433 927 -832 -181 693 -712 131 936 -886 -359 1053 -255 -382 957 -105 -711 941 -350
3076 -350 -948 817 25 -823 588 167 -905 598 395 -1202 307 619 -742 457 564 -890 239
3093 239 850 -734 -538 840 -754 -225 842 -561 -379 1198 -28 -810 937 -18 -784 955 -82
3110 -82 -1148 770 339 -921 769 426 -975 592 490 -958 401 782 -950 -70 742 -772 109
3127 109 754 -730 -134 1053 -786 -385 684 -381 -682 1233 -260 -621 776 45 -1031 898 439
3144 439 -850 723 315 -890 195 420 -1025 156 433 -702 140 718 -1337 168 991 -645 -235
3161b35Q51q70k12J474j368j58J241p86o21J693j217n16J566p05j238J559j36
3178C22j259J348j73j262J351K03j292Q89M55j408J033Q40j943P68J025j342o8
3195e13J333j194j31J361j241l96J627j064o41J605m52r77J261l11j427J533K32
3212F05j404J068L11j185P20N50j198M25J167j442J52J224j364J42P77q72k06
3229e30J620j357n65J524q71n85J510o23q77J370l08j007J212J02j478J295J09
3246E41j320Q90N20j259P39O74j584M59J218j348L7J426j359l8R61p73l35J203
3264F52p99o41J418m90q76J259m64q74J368J77j602J073K70j324J074J73j193
3281g99Q14O90j369L39J261j601M22Q78j089J48J117j028m32J273o32o06R56P5
$$ plain form
3161 -235 616 -254 -466 1008 -360 -518 723 -63 -684 1009 -208 -724 842 137 -1101 458 322
3178 322 -937 411 238 -1024 327 530 -762 127 582 -826 207 1047 -896 -128 897 -445 -513
3195 -513 820 -374 -505 856 -385 -781 846 -218 -859 746 294 -683 578 267 -1160 373 605
3212 605 -799 269 580 -605 115 665 -533 -108 1059 -383 -231 993 -371 -229 548 -324 -530
3229 -530 1090 -267 -832 692 -179 -764 746 123 -754 616 308 -699 513 615 -863 432 541
3246 541 -779 111 631 -628 111 785 -799 -340 878 -470 -433 993 -366 -404 557 -216 -551 652
3264 652 -147 -788 630 140 -736 523 59 -815 553 730 -872 201 471 -853 221 394 -799
3281 -799 15 705 -664 -325 936 -665 -243 635 -454 -306 811 -217 -649 624 -8 -614 342 417
3299D17j423J803m58q28Q93j13j066R21M67j355R57M84j216L59Q65j370M35R78
3317G50j187J53J195r12m94J366j023n28J289o83k86Q30j03j070J225k96r42R20
3335B04J36q84Q23L09j353P47N02j100P99O76j602M92J149j377j70J333j185K17
3353b84J129p55q89J336o70n38J253o61o71J193J1j375J222r5q98P78L38j081
3371f57Q27N13j326M33O38j037O06P01j104l4J014r36j8J215j135j57Q96o54l42
3390e57J143l86q98J168l68q01J205k90r79R78L13j211Q44N57j491O89N28j054
3408f10J82J058r95j07J015j002J06J236j099l60J271o76k41Q09m87p08J006J12
3426E10j089R61rq53O09K45j073Q19O05j412P26M03r74M59N66p10M9R14j194K9
$$ plain form
3299 417 -1006 797 339 -489 404 291 -775 146 613 -742 215 699 -517 -158 707 -663 -228 750
3317 750 -437 -284 911 -1 -495 871 -152 -680 609 -74 -360 470 367 -703 522 226 -716 204
3335 204 340 -544 279 588 -765 -18 484 -616 183 859 -743 -251 898 -479 -649 684 -501 -284
3353 -284 845 90 -799 537 -133 -671 582 -79 -750 443 454 -921 301 206 -692 86 424 -657
3371 -657 170 683 -643 -210 428 -609 -3 698 -406 -440 574 -362 -380 835 -300 -457 439 -215 -557
3390 -557 586 200 -698 470 102 -699 506 216 -763 215 528 -683 161 718 -773 -84 444 -610
3408 -610 -428 630 -365 -472 543 -459 -353 883 -216 -576 695 19 -222 587 100 -608 398 510
3426 510 -579 382 373 -480 129 374 -699 120 725 -687 39 442 -532 -73 493 -217 -168 746 -448 -419
3446d19J052q19r0Q54p31l85J200l11r60R27j66n06P73M7j164J260N0j162M97
3465e3N20q38N74L90j042M46M25q11p5J203p36n62J205r75l21Q26j25l99Q36k87
3485B01p66J039m99o55J047o7j035R06J36p78O57L55q95J52O13r40N86L06n92
3504b29J46P14r57J20O80p41k10R92n99l51J044m10p27R79r4r68J007N4j145P52
3524E7L45j029N99L84q75J89Q96j020L95O75j312K64R64o66k03R54n95l45O95
3543C72k94n09O16k42l88R74j98p66R80j70r59O79L00p74M66L49q47N47K93p55
3563c26J75Q41r17N6P57q02k49Q53l57l17O33k01o24P44l45l31O93o1r14Q09K6
3584A43p12R25J38o01J48L06n44L43K66p74J43O98n81j94Q19p05J79M88n85N5
$$ plain form
3446 -419 633 -186 -276 578 -153 -538 662 351 -609 318 152 -354 419 466 -698 562 612 -550 -53
3465 -53 467 -371 203 593 -449 -3 422 -389 -464 739 3 -559 646 -329 -650 176 51 -348 488 201
3485 201 -565 474 -25 -680 367 300 -735 171 307 -471 186 541 -354 -202 411 -529 57 363 -229
3504 -229 -83 631 -326 -206 474 -267 -477 515 -84 -435 609 199 -528 451 357 -611 396 450 -695 57
3524 57 402 -627 -28 356 -519 -330 566 -454 -59 616 -696 -432 532 -134 -337 617 22 -323 372
3543 372 78 -431 185 -57 -445 529 331 -435 545 375 -584 95 395 -379 87 436 -411 136 429 -326
3563 -326 -151 690 -227 -171 586 -216 -465 388 31 -286 347 146 -478 266 -79 -410 283 222 -692 117 143
3584 143 -569 356 494 -107 41 347 -197 146 412 -362 -219 479 -102 -296 523 -182 -3 485 -100 -45
3604d5N40o63k23P94k28q16J041k33o15N24j5m12L63R3l49L56L40q71L90L62p84
3625d51L68M44n06l1P58n85j81O53m23l63P10j93m73P93k26p73O09M8q60J011
3645C29R5o35L22K93o52J45N23p36K71M48o59K07K96l47l25Q56o47j94P90l87
3665gm08O23l54k97Q40k19n36P09l66l34O04j19l08J84J90l43L4K95n68K29O41
3686D90m05J45j8m05J27L10k92j99N49l83l07N16k88j1J48J83l51O50m80l98K20
3707a99M60o21L14K81m76L29J03n11L88J89o08L30L10n87%O50n80oM73m08j24
3728b93N03k30k98M84J05n21K87O6m19L96J07m31L03M42q21J75K42k0l19N24n79
3749b97J13L76k49K3L48k92l82O97m89r8M06j43k43N51m48J27K51k19m11M58q7
$$ plain form
3604 -45 495 -168 -391 403 175 -641 400 167 -448 76 61 -351 12 105 -244 112 452 -419 -29 333 -451
3625 -451 -83 361 -145 -176 582 -3 -184 469 46 -317 393 200 -273 520 294 -479 130 178 -682 329
3645 329 424 -211 111 404 -248 -103 420 -316 -45 403 -256 -49 247 -100 -425 431 -216 -410 380 -7
3665 -7 -415 208 -146 -443 397 178 -358 351 -15 -349 255 136 -172 12 202 -141 -107 188 -380 -151 490
3686 490 85 230 212 -193 -66 244 -48 -247 302 -81 -388 128 -160 -171 -23 160 -191 459 -21 -419 -199
3707 -199 261 -360 -46 235 -241 88 191 -320 68 257 -351 -21 289 -298 -298 352 -228 -234 239 -169 -293
3728 -293 210 -20 -318 166 271 -250 37 103 -316 80 187 -244 59 501 -320 -145 97 77 -242 282 -297
3749 -297 -184 192 -57 -34 314 22 -360 337 -152 -250 156 13 -230 321 -127 0 251 32 -379 79 -8
3770hR3l33L37k85M9N11n31J48J44m94K29N95o10P5P4L9q4L25k14n3J72l83K18
3793A4J26O8o40M83m8l18M58r4k84K39J68m37L66J40k95q6N51m47j2K56q2l65
3815b39M93j85r9J59j98J06K38r6l47K50O8l65M12M9m91K06O1k21L19p2k88K64
3837B4J15m53K04J66j03P5L22m04K14j59k97J81k5J92l01N48l18k07M52q1J7j67
3859eoj98J79J20j52J56m7k95L12K14n34J47K90k67k6K65J79l25J28k02j76M40
3881A97k74J23p7K55l65M10j82j78K77j69j92M59n24L04r6L10l35L6J82n00K29
3902a10K72m94K19L09Qo5p7K6j73J60q1k4K36m4k58J65K87j31J8k61j64R8R3l93
3926c84N2M85k44k39M23o5k82J94O8j93K22L31m04L18j51k00L11k26Q4Q4j10j65
$$ plain form
3770 -8 85 -248 89 -196 -147 364 -167 -19 125 -369 -140 455 -155 -80 -6 33 -51 274 60 7 179 -204 14
3793 14 140 208 -432 51 3 -315 143 49 -235 4 172 -265 101 241 -54 -140 411 -36 -48 208 126 -239
3815 -239 254 69 -30 129 -69 37 275 179 -168 82 150 -215 197 246 -245 -39 22 -199 120 48 -240 24
3837 24 139 -314 -110 56 -47 28 350 -54 160 1 -296 -115 -140 52 -249 299 -19 -226 226 145 162 -5
3859 -5 -11 -209 -30 90 -62 94 47 -248 64 278 -256 -109 181 -86 -112 153 332 7 135 -67 -243 197
3881 197 -77 46 -31 224 -141 269 87 -91 186 17 -175 284 -240 64 -32 278 -57 -21 161 -339 -110
3902 -110 162 -332 -113 196 204 139 62 88 -85 75 -6 -30 206 162 -96 69 356 225 243 -18 -182 -84 9 -384
3926 -384 -332 153 -91 -330 93 28 -254 -60 8 -185 37 368 -36 282 131 -69 242 16 100 184 74 -91
3948i1J88k81J8L08j27q8R1K77k14Q2j05j26M6O2m9L3J91o4j78q5K41k07L85j33
3972A74l85L53P4k51J90j00k7j08K31l04l8J45J62N5o6k10J54N3qk81L12r3J9
3995E1N9j14m6J63p6Q2p8N0j1Q9k28K03k7j9k89K81j82j20N29j14m82qM97j70
4019D0j53J47l21K4J35L9J73j41J10k93K15N7J9J7j87J81OQj0j32J01l1j24J76
4043E6k7K9j52L2j11L48k24RK57m30J47K32k63Q7k2L40o50K88L46l24M01n57N8
4066a30j13j5K44J24Ll65K18R9l04M26l91Q8K29J14m14q8M33k78j9L03k03K74
4088B35r7j80J6K97j66j97j12J31O2lJ33k14J55j75J10j00J88j08J07j84K46j48
4110dJ31k88K01J08m06L4L04l2o5P8Rk01K18j44k01J45K85q6NK99m33M0J86l24
$$ plain form
3948 -91 97 -184 -166 142 15 -73 18 295 81 163 58 -68 -22 40 -9 24 215 151 -27 -112 129 -78 307 174
3972 174 -211 142 216 -35 155 55 28 -80 151 -153 -191 -46 116 171 105 -105 49 102 94 -187 125 32 51
3995 51 110 -4 -50 113 37 119 41 91 80 169 -59 144 117 98 -191 90 -92 -212 317 203 -279 -287 210 40
4019 40 -113 34 -287 -263 -128 -89 84 -57 53 -240 -25 32 51 68 -119 62 68 76 66 -66 35 4 -120 56
4043 56 29 58 -94 -62 -173 175 -49 -40 217 -213 -66 166 -97 -10 -32 308 -342 -54 292 -32 369 -188 -130
4066 -130 -243 -258 -14 110 113 -252 -34 65 -239 187 -204 -116 113 227 -187 -275 158 -120 -139 164 -39 235
4088 235 138 -42 -26 271 105 -92 -204 -73 -11 -14 119 -95 60 -115 -5 -105 83 -25 82 -102 144 -4
4110 -4 127 -161 40 148 -258 -224 80 48 -17 61 70 -131 87 -57 -258 -113 172 86 91 390 -43 -3 183 -141
4134a41L89k39K62j39J33k81k07M52k69k03J29P0l2K12K4p3j14r5p2K92R4k62
4156g0J07L5j41J73k70P1R7K93k60j67K82k57oJ26M8j13Q6M7J37l41J99k24J7
4179a31J87j9L67k24l11P4J50k70%K84Nk45L42l15L18m4m55n2L83jj42J63L5l23
4203b24K52k83P2J76n6N6J5J2j15J73J9k76P1J54k09J26J28o5M9K07l75o5K7P2
4227e9r0M06k62mO5l74J36K04k3m5RK13j76N0K14l15J06J2k42m8L18m54L60L2
4251C3P7k58J72j07k15K35j59J93L01p7j38J6J24j46K90k69j85J65k22N0J6O8
4273c6j79L0J3J3K00l6J4k59M44j5j90J69j14k82M16k77P3p2l5j74Q19m19m43
4296c40N90l34j42J08K34k49L76k55J26m7J4l52J19K65l21L6M02k90j25L42q2
$$ plain form
4134 -141 248 9 271 132 265 -16 -223 229 -40 -243 -114 -44 -76 136 160 87 -27 -122 -194 98 192 -70
4156 -70 37 72 -69 104 -166 -95 2 295 35 -132 150 -107 -113 13 61 -52 34 81 218 -123 76 -148 -131
4179 -131 56 37 404 180 -131 -57 93 -177 -177 107 112 -133 209 -106 212 168 -287 -339 44 43 -99 64 99 -224
4203 -224 28 -255 -183 -7 -63 -7 8 20 -95 78 97 -179 -108 46 -163 -37 91 26 75 282 -93 -158 -131 -59
4227 -59 -149 257 -5 -9 56 -318 -182 22 -1 -46 -37 176 0 50 264 -51 55 67 -175 -223 95 -359 1 33
4251 33 110 -148 24 -83 -298 -63 -222 -29 272 195 57 73 197 51 341 72 -113 52 -170 -120 -104 -36
4273 -36 -215 -185 -172 -159 41 5 19 -240 204 189 -1 168 54 -228 188 -89 -16 -88 -123 -297 522 103 -340
4296 -340 250 -84 -226 -118 116 -133 243 -12 114 67 81 -271 -152 113 -208 -172 230 -60 -185 157 75
4317G5m20M75m3k99M21j94j13N8L0j45L41k35P2o6L16m81O0P7n9J88Lk98K04K73
4341B40l77m7M72k15j74J29j38J79j27k01K82K27k02l33L75k08K84l4O04q35R2
4362gK86p44N77J3j69j72Q71q07P9K57k55J44M8Oj20J93l8m27M61p8j07J56m1
4385A26q7K19q9m46L58K26n84K40j40MK39K83m81J03M90o61L52L22n26r3P9L3
4407c3n8J94k77j1L06q4m25L82j39k2j9L52l11K26%j59j54M14k64K43ok1j82K31
4431A83o0j94O7Q3n12O42l67j5K84j65j12L32M6m39N02k15rK51l40LjJ47l19R1
4455a17K32l75L44k6l57K01J48n1J18R7k51N1J78k07N4J61j42p3K01n0r0m8K17
4478B15m90l6L56q8m1K85l83K04q4q7J41K52n30K65K61k14p0L63k59j82M74o1
$$ plain form
4317 75 -345 130 87 -212 209 15 -98 -40 -10 -155 186 -49 23 -43 273 -208 -148 -71 -130 58 61 -237 -33 240
4341 240 -137 -184 288 73 -101 28 -110 69 -58 -259 23 250 48 -285 90 -118 166 132 736 -99 -7
4362 -7 279 -465 112 125 -44 -216 655 -152 -73 184 -71 73 121 127 7 200 162 -265 196 118 11 167 126
4385 126 39 258 169 -277 81 307 -277 -37 -177 -173 66 349 -132 -29 461 -200 152 474 -52 -145 -66 -33
4407 -33 -91 103 -174 -185 121 37 -388 -6 -145 -167 -186 166 -145 81 81 -78 -232 182 -82 161 155 134 -48 183
4431 183 123 -71 -4 79 -433 209 -158 -173 111 -54 -166 166 212 -227 275 60 51 302 -38 -35 -36 111 -208 -117
4455 -117 115 -260 84 58 -299 -98 50 -1 117 214 -37 14 192 -15 39 200 58 -15 186 136 46 -2 215
4478 215 -275 -311 45 -43 -84 201 -182 22 -62 -149 -8 244 -286 -21 240 26 -44 319 60 -122 352 291
4500B91n73M54p4k0J01o0l72K26O5Kj91K81l36K79L03o93O63q2k61O1L97n10Q5
4523C6N73q41l11Q91j86n56Q52l89r0J97m26M6M78k83j12L41j41l10R1L08m11
4544b43L73j54J0K25j20l26K73J33k77J26Q2j0l53L03K6j54R6j62m5M09j74j88
4566a50K79k43l15P61n21JN01l03j19P3J76k80L04k6l71L59L9l18j07N75m15P9
4588b1K43k23j18N86n60j18M33n49Q4N50j06m83M32j0m35L42J3o7K70j39q1J62
4610B05k0m38M68j12l17P9K70k41m5N74k63k75N45n70K8q7J45J03K19q8l01PK73
4633A59m49N10j29k78L19j44j27L92Kk90o6L85l72Q0J02J1M8O9k56j27L54j30
4655F3k30O14l68m98P29l30l07K56J96k72J33R0j04J00k45n3K75L93o37O2O37
$$ plain form
4500 291 -282 172 98 78 179 119 -253 -27 38 40 -151 130 -206 73 376 -317 346 264 3 64 461 -49 36
4523 36 609 -232 -543 348 162 -394 458 69 -21 176 -250 -204 274 -9 -121 220 79 -231 -140 168 -243
4544 -243 130 -24 -14 211 91 -235 38 171 -106 20 102 92 -261 42 68 -86 10 -152 -197 212 38 -150
4566 -150 129 -114 -429 332 -189 -188 313 10 -109 -36 140 -140 164 138 -233 126 165 -153 -260 315 -100 -21
4588 -21 222 -1 -119 467 -93 -211 222 -327 -243 307 201 -282 150 140 -295 47 60 -7 263 124 43 205
4610 205 185 -253 215 103 -214 -135 135 -106 -151 423 160 -115 430 -140 -112 -199 -54 49 268 180 -121 -114 159
4633 159 -290 220 91 -187 132 -12 -139 253 255 -35 -101 284 -88 -8 94 105 153 222 -34 -161 193 63
4655 63 -167 447 79 -419 310 -20 -327 -71 125 -147 -14 76 -28 72 -173 -226 49 442 -195 -133 504
4676E04o79J52J26p3j28M94l68k99M28r7j08J82L9n48O50l7l03J84k24L4K15j60
4698a6k03M01K4o93L55K17k01M4L61k97n41O75j58l24M50n5n0K41l47k46O24j68
4720I3k87M69l69l40P82k38k96L4J64l30L24K44l82J78K5o52L58K42l10J92K19
4741A20j38k42M46M8m06K19R2m81N72m41L4K99Q2m74L31j9l10M23k40l34K97L49
4763B27o80N36J06n29K33R7k14J45L65k56k09O45m49l52N16k12k01N19m01LM41
4784C30l65k69K56J56l06R2L27n52K92k3l3K32Q1l22J18Q4j4j32L47o98K78K92
4806A71j60k42M70k66j99J95M8N4QP6n12O18k9n97O69l95j69L89Ml59J32K00k87
4829a81J9M38l27J3J59k36o8M05n22J71M48m8m64P9L96n47O34o26J16M11l51k16
$$ plain form
4676 504 -175 -23 103 30 -98 396 28 -271 157 60 -48 134 173 -375 275 238 -65 119 -105 -71 144 -16
4698 -16 -219 182 206 -487 -132 85 -116 -72 289 -8 -549 126 -32 -356 94 39 -11 230 -117 -363 261 93
4720 93 -194 275 -94 -434 348 110 -186 -152 12 -318 6 250 -132 46 71 -581 -223 19 -291 -99 120
4741 120 -18 -260 186 234 -172 47 139 -342 230 -211 -177 122 204 -270 61 42 -268 155 -85 -419 -122 227
4763 227 -453 83 189 -340 -107 -10 -224 -79 286 30 -179 466 17 -335 181 -31 -232 287 -114 -111 330
4784 330 -35 -304 -48 108 -198 -106 221 -331 -39 -62 -95 137 218 -104 14 98 84 -48 299 -399 -121 171
4806 171 11 -231 239 -27 -226 -31 17 71 79 155 -357 261 232 -365 304 -91 -260 129 133 -226 -94 106 -181
4829 -181 -162 276 -51 -38 121 -115 -183 222 -300 -129 319 271 -193 -114 282 -265 369 -257 -141 270 -81 -297
4851b97O76l21l90M04J00m79J84M03o80L30J81k30K39Q8k55oK16j69r7L10k35
4872b8k68N09l57N7N05n45o3M76j69m03J87L33m71N62p7n29L45J28k52o3K96l70
4894a97N0M95o32K34L05j59k66N69n51J93L50n05k85O70l58l8K52o5k12L30j48
4915C2n35N89J19o20P92k49m36M65j52j12lK77m80K61M33n79l26Q23m86MN49n17
4937a51K34J92l12j97M69l78m2J79K55o06N18Q6l97J47J41k50J22kl21L04L15
4958C06o35K90K65m56J99N71o43j0N55n12l2J37Kl00M42k86k18N97k81n7M22k0
4980C36p56N52j12j16K04J71m20J56J88l20nK97m17M7M90n66J30L93n5m00P38
5001E35n57j50N16o9o98N31k55J78RJ52p01M80R4j95P3M0k57M6N65n47K99L70
$$ plain form
4851 -297 379 58 -332 72 172 -307 -123 280 -400 -70 111 -119 120 208 -47 -53 163 -6 -103 207 -28
4872 -28 -296 213 -144 -87 418 -127 -190 286 117 -286 -99 234 -237 325 248 -281 64 192 -60 -123 173 -197
4894 -197 -147 348 -284 -50 255 96 -170 399 -152 41 391 -114 -399 271 -87 -125 127 62 -150 180 32
4915 32 -503 86 205 -415 377 128 -308 157 5 -107 -110 167 -313 -52 381 -198 -524 299 -187 -183 366 -151
4937 -151 83 275 -37 -234 235 -143 -185 -6 249 -357 161 247 -150 -3 138 -112 10 8 -313 -9 306
4958 306 -329 -39 226 -230 -31 540 -103 -113 442 -70 -102 35 37 -263 179 -107 -325 272 -9 -66 356 336
4980 336 -420 132 20 -96 108 279 -141 15 203 -117 -122 175 -242 -195 295 -271 -141 252 197 -203 535
5001 535 -22 -172 344 275 -423 108 -147 31 40 192 -509 -29 65 -130 -57 -17 -274 -228 337 -210 89 459
5023D59q57K11M39l18j5L34k80pJ56j92l73P85k94k94K61p1q3L87l9l54O2j3n2
5046a48J73J20m13M98J01m96J62j5j39j0K07k49J31K60n00M5N49l14n07R72m69
5067d2p3L12n0n50P08j32l21K34J41n75M55J54l73k2L32l79J57M36p34j81P69
5088B66o37K66L44k88p0N21m19l05L91n2n9Q4J18k82J32Q9j57K90p4l79L26J20
5110B25n44L83L21p76M85L4n31J71O33p32K71L67n25K14K06j90m66O10l6o54Q66
5131C32m38m49Q44k71m35M32K55p44O34J09m77K32K76l08R2O2k83J38L77o02J79
5152d5K08m45r9Q04m97q1L66l66k56O92r7n91Q36l72l62M78M7m49L33P9o09P06
5174B80k02k34L39J86l48J69K70n76J26L34k45k57N5R7J1L01l79k19L79k9k93
$$ plain form
5023 459 -398 -187 252 -66 -81 253 -27 -34 122 -70 -443 342 48 -246 15 -56 -139 248 209 -145 -83 -96 -148
5046 -148 25 145 -268 230 331 -165 -3 -18 -157 -167 40 -209 -78 182 -318 -273 276 -38 -545 427 -42
5067 -42 -115 197 147 -403 305 173 -148 86 227 -348 107 261 -112 -134 198 -181 -24 412 -322 -503 266
5088 266 -371 -105 239 -49 -119 402 -17 -322 69 17 -42 42 160 -122 10 99 -58 232 158 -221 105 225
5110 225 -319 64 385 -391 94 128 -403 -232 401 -331 -60 307 -218 -4 202 12 -454 156 120 -534 332
5131 332 -106 -555 289 18 -417 15 270 -474 160 269 -208 24 300 -8 84 146 -137 1 378 -224 -45
5152 -45 163 -282 -381 423 -74 -155 211 -155 -411 281 184 -407 429 57 -305 173 220 -229 104 183 -426 280
5174 280 78 -156 183 369 21 190 460 -116 10 344 99 -158 -103 -6 5 306 -73 -292 87 58 -235
5195b35M25j09m24M17R1n29J97K96m10K89J62m83K16M85n77J46M96n50q6O06q25
5216d02J95N18k87k23L63k38J98J77j45l11J47K57n19L50K56o04K16K50o00O82
5236B80L0m54r8K73l21L51J32k49j85O92m22m07Q21n09l70N91j7l87N81l41k87
5257b96P46m46k30M69J71q22O17n1l67K13K90n29K40Q5k37k00N91o24J94N96m87
5278g7j93N81o73L2O43l85m7M41k86j87L01j39n93P25o6l15N81k90l94N40j5n96
5300d12M17K34l58m5N39o73J28M82m83j14M36m39LO28l23r7N60m94k08M55L8o06
5322c32N29L19q52M40K96o05M1P05q59J50O69m52J20K03o72J26O02o62P9L21l07
5343a41q8M67j68k84N16k92l10O33k88k84L12J73o08M42M8m98M63J7o65M61L86
$$ plain form
5195 -235 190 81 -343 74 165 -364 -167 129 -281 8 170 -313 -97 388 -189 -43 453 -97 -183 423 -402
5216 -402 -207 311 24 -199 164 -74 124 301 156 -155 -8 249 -270 80 336 -268 -52 198 -402 280
5236 280 310 -144 -242 31 -290 61 193 -56 -241 451 29 -378 443 -66 -436 155 138 -249 332 -9 -296
5257 -296 450 4 -226 243 414 -408 209 158 -209 4 294 -235 5 90 -147 -347 244 -380 -186 410 -77
5278 -77 -270 311 -362 -330 313 -72 -119 322 36 -151 150 11 -582 143 77 -238 343 53 -341 199 184 -412
5300 -412 5 239 -119 -164 375 -298 -170 312 -171 -285 151 -288 -285 343 20 -77 483 -11 -219 236 274 -332
5322 -332 197 516 -336 104 400 -205 -164 541 -318 -168 501 49 169 372 -300 -174 428 -234 -155 166 -141
5343 -141 -229 238 70 -214 302 10 -300 333 45 -239 73 246 -362 80 128 -370 93 110 -555 -94 292
5364B92o42M80L68n90n6M39l77j38M78l93J51K1p3l2L00l52k50P71l50j6K36l7
5386B30n10K96K12o31L98K13m70L48K8o45M93L29o72K73L22o21L38L77o11R0O06
5407C93n11r9K14n5k47K95J81m26N33l09l0K59J31m05J50r4m23O44R7m21J37J60
5429A74m55RJ69m5J87N41p17K91M3k85p3K95j11k00N17k40l53N49N1n47N25j08
5451B17m52L16J73p23M42K65m90N87k91l16M84Q4n37K13Q4o4j76M56m61j50P41
5472D02m66j41N52l74m58P46J69m00J17l24o6M81n5m21L96On81N08J81n05K13
5493b0K14n39K31L38m91Q8M57m35J5M14k79j90P77o59J1M42m19j55N59o2p17M69
5515D9N3m77L63J80p44N72M12o11K35N80o43k32O25o14J38L18l81j5O18o07j71
$$ plain form
5364 292 -350 130 498 -92 -148 291 -86 -224 254 -139 12 33 -40 -72 228 -124 -374 397 47 31 267 230
5386 230 -280 16 228 -403 -5 208 -262 86 114 -531 -38 291 -381 -108 214 -407 -69 308 -303 -213 393
5407 393 -118 -217 -3 -58 -305 -10 171 -255 278 -31 -61 198 329 -76 74 -20 -443 201 298 -123 14 174
5429 174 -281 -272 -103 -148 39 580 -137 154 197 -88 -161 134 23 -177 340 100 -253 296 347 -200 325 217
5451 217 -235 81 254 -469 -27 238 -252 335 44 -272 212 296 -241 -28 56 -8 -184 272 -189 -339 402
5472 402 -64 -205 347 -27 -485 261 430 30 147 -177 -243 238 183 -238 158 164 -417 91 272 -233 -20
5493 -20 194 -345 -114 224 -267 -179 278 -157 -142 272 -7 -197 580 -79 -68 374 -45 -200 359 297 -420 49
5515 49 102 -375 -12 168 -576 -4 408 -203 32 612 -31 -263 362 -252 -114 204 -177 -192 426 -181 -352
5536c52N80k95r9L26J09o90N60q4k7J75o9k22K32m3l70M10K19o02N32O2o44J67
5558a25P13q40J52K95l38k42N35l01P4N00n82j06J95q2l82P79k64n22P25k41l74
5579d31L18J69k44J32L43o78M77O4j88J3M29o04K03K26p25M21M80n39j98O93m02
5600d1N9L24k27l99N71j28m99N11J2l79L12P0l99K52Rj98O2N00n13K35J45l52
5622g3q0N82p53j4P21l61j47K79j76j27M49l76m17N40J46l33L42op15O09L47p45
5644c08M26K89p79K84K45l96M00Om20n0P75o70j34N24l3j12K57m74m21P78k13
5665b6k01N45L4p49O59N8o75O34K58p15K68N7m43J94O00p10J63K42m03j64O87
5686C13o08oO45j72l02L08K7p23N71k6l78K05L80n99O88q8m85L83J15o63J49M62
$$ plain form
5536 -352 228 -67 -166 160 269 -421 139 55 28 203 134 -88 144 101 -269 141 360 -242 290 352 -292 -125
5558 -125 588 -252 -100 195 -143 -385 150 -151 -77 423 -159 -265 -70 -152 -534 245 -19 -541 184 -57 -431
5579 -431 -113 56 -188 -56 287 -391 86 150 -38 -25 404 -200 3 229 -496 -75 405 -134 -332 361 -41
5600 -41 18 342 115 -284 287 159 -340 171 183 -196 116 186 -213 39 48 -150 -88 412 -101 134 279 -73
5622 -73 -153 429 -324 -338 383 22 -125 154 -22 -149 300 -76 -493 47 193 -140 202 196 -519 90 437 -308
5644 -308 118 407 -372 -88 157 -239 161 167 -253 -303 472 -198 -332 192 159 47 304 -170 -591 187 -26
5665 -26 -227 318 352 -397 262 320 -355 279 537 -178 90 147 -296 -102 498 -212 -49 193 -210 -374 313
5686 313 -295 -301 344 172 -130 178 205 -518 53 27 -351 -146 234 -365 323 235 -250 133 248 -415 -266 196
5708A96l26K85R0o08M13L67o87K67M82p59J63L63k42rL89o05j88M70m11J53N25
5729C28j58n23M19K9k25J4J83m15N13p7n12L36M02m64J4M12n58L5O02m53j26N19
5751B95k41k71N40n19j57M52Qm62N98kn44P62k36l17K59M2n61M29K94q31M58J51
5773A47l95N46k07k79J77K73m30r2N44l69j61N32k96k49P11m84o05Q94l04m59
5793e06N96L8p72P13L23p89L07L57r17M83L08l08N9J25o02L24O30p06J44O36m12
5814C1NK60l57j54L52j87l01N16k4n94P92j85m72N24k08l11L74M45p00K98J34
5835B38n48J74N17m71M9L04m59J44M90o92P5N02l91j70K79N2o47J080m40l62N07
5856B31m2m53O31j54n29M23J09n81O00O5l61J92J91m93J07L54m05m8O70o52k02
$$ plain form
5708 196 -130 155 245 -363 50 417 -270 -3 479 -280 -117 246 4 -5 384 -221 -409 61 -350 -197 328
5729 328 170 -353 66 95 -130 -116 67 -348 165 88 -424 -88 314 -150 -136 276 -282 -247 355 -98 -224 295
5751 295 54 -217 323 -196 -353 99 107 -355 243 241 -303 459 223 -94 165 207 -354 75 369 -462 -4 147
5773 147 -248 298 91 -188 -11 262 -168 -260 284 -85 -246 286 -10 -259 452 -32 -637 257 -47 -506
5793 -506 90 128 -644 69 392 -397 -90 267 -650 -167 141 -167 -108 17 -585 -261 369 -337 -193 443 31
5814 31 36 296 -61 -215 137 -50 -351 165 141 -453 339 154 -318 206 -2 -313 61 506 -194 104 238
5835 238 -310 -136 381 -90 -41 263 -196 -52 438 -254 -179 323 -68 -238 41 93 -554 526 86 -276 231
5856 231 189 -264 367 213 -316 107 216 -365 235 300 -61 131 322 -171 -64 290 -115 -163 507 -145 -347
5877c47P71o13l25P41l63j59P41l03n69M43jm90N97K03o06O67q7o36L17N34p63
5898b48J78K94k94l8M55n59p9O34m44n6N57m20j36O27l92n69Q94j35n40O54k01
5919A82m55O71L0o06K74K14p33J90N63m61J8M40o00J59L51n26K43L47j74m79Q58
5940E06o24j40P23m29m41Q36l30m47O85k75n39P07l9k25K16n1j34j61N73n30J04
5961a5N41p51K76J64m48K34J02j15k13P34n12j75N94m88j45M78j35m00O19l83
5981c8m65P49j23l60M13J04p43N32K40m35J13M14o42L37J50o06L0O16o47J90M67
6002B96k58k13O25n39r9L85n12j17O79k70k36L13j02k22O14J98r87O25l8l01L03
6023A44K36q83M35M05m38j79P34p48r2N85m91J28M37l66j22N46n02O2O17m40n91
$$ plain form
5877 -347 424 -189 -514 227 -136 -295 446 143 -426 17 16 -474 123 326 -280 387 300 -336 -19 515 -248
5898 -248 -70 224 -70 -108 347 -212 -291 343 -101 -157 400 -20 -156 471 79 -490 404 269 -271 383 182
5919 182 -273 398 428 -178 96 310 -423 -233 330 -131 -113 327 -273 -114 237 -289 -46 301 127 -352 506
5940 506 -118 -258 465 36 -405 431 101 -346 339 64 -475 232 193 -32 184 133 -1 -162 411 -119 -15
5961 -15 526 -225 51 215 -233 1 103 -12 -225 509 -3 -178 416 -72 -217 261 126 -274 345 -38
5981 -38 -503 246 123 -237 176 280 -463 69 309 -126 -13 401 -241 96 246 -360 -330 286 -361 -171 296
6002 296 38 -175 450 -89 -188 197 -315 -432 247 -23 -259 54 -48 -270 344 542 -445 180 142 -159 144
6023 144 380 -503 -68 337 -101 -280 454 -294 -386 199 -292 -164 273 -93 -215 331 -171 -109 508 68 -523
6044e23O85K5n54M36N37j125M69J58m36O20r9q04M62N28m59K58M6l17m11Q85o00
6065b19kN85k05m26N68k36n63P24o0o73O27j67k26L96J47n00M80K61q66L36L52
6086C33o25L22K54o57Q6O25l72k83M47o03Q4J048m65l45N47l36j63M88l73m61
6106d49O43J25p99N64J17o14M37L74p47M30M11r50L01O99p90J59L49m68j00O87
6126C79n05k35N68j21j15J07pJ4O8m7n51N36j6j45J40Rn10O31N4p09M84j44j03
6149b18N4L97n33J02N24m28k24P34m80j81O49m21n1M61l07l05M64k17k85O00p6
6170B59m88M73r2m77K62M15o07M01m5m05K25K96m71Q8O62o10R7M49m46j72O69
6191D83k40m07O54n01k85Q32l60n07O84m9r67P70R9o57K86M26n52M39K88o80J49
$$ plain form
6044 -523 162 187 -367 69 606 -519 -50 108 -328 292 193 -611 -149 379 -80 178 224 -93 -504 381 -219
6065 -219 -221 364 159 -267 301 65 -498 226 166 -507 120 -47 -273 123 270 -230 250 511 -355 -19 333
6086 333 -292 30 284 -373 -287 338 -34 -317 130 -473 -389 659 194 -151 396 60 -103 385 12 -449
6106 -449 194 319 -480 84 201 -413 24 398 -349 81 492 -458 -157 542 -248 -89 260 -208 -308 379
6126 379 -126 -361 207 86 -29 78 71 85 153 106 -445 91 75 -70 70 79 -431 200 254 -455 29 -115 -218
6149 -218 -164 233 -300 -198 326 -102 -326 408 -72 -253 396 -25 -76 385 78 -227 237 20 -265 335 259
6170 259 -229 244 152 -325 -63 352 -255 146 101 -304 -79 217 -254 -166 496 -114 -17 432 -14 -186 483
6191 483 243 -164 490 -11 -296 536 176 -331 353 304 -663 107 206 -451 -165 261 -291 148 436 -244 -95
6212i5L39k18M1L27m67Q4L46o42P4N46m53j07N34j94l62O44j35p37O69m0m18M03
6234A39O7n61K28L90o92M54K20n24K95L71n84J09L74o07J78N51l72l16M76p2k19
6255i5K61K5l06K31j67l39M55Q2m20L24J83k63p0J30l04L09L20p33M81j45p6j7
6277a34M33o26K93L52n75J11L76m59l5L65M9m46M16N9l77M64Q2m45K10K47n60
6298b00M20K02o38J49L48p43L39O62q17N12O9l84n5N72m13j79L40k53l59P63j76
6319A59l58K11J99m89M41L4m34M64l65l74N63R9m59L44L44o49L00J47j77o6K14
6340A48l62L55L9l15j7L77j04l24N74j87l77K38Jm91P89m37m9R8J97m12M79j93
6362B7j23J0N52p20L08K66p60N71K81o67P5O10o18N7O17n73j01M81l91j00M24
$$ plain form
6212 -95 244 26 67 394 -73 11 357 -285 -211 335 -118 -225 309 115 -247 397 262 -475 194 154 -264 139
6234 139 206 -355 -127 263 -429 25 245 -279 16 387 -197 -88 286 -321 -143 408 36 -280 196 124 -95
6255 -95 166 191 -115 116 -51 -390 65 147 -273 51 234 -29 -99 31 -273 36 356 -377 104 -41 -117 -134
6277 -134 299 -327 -34 318 -257 -146 230 -229 -264 101 150 -296 120 179 -198 266 348 -97 113 360 -200
6298 -200 220 422 -216 -67 281 -462 -123 539 -278 234 303 -81 -136 436 23 -156 184 -69 -428 335 159
6319 159 -199 12 211 -278 163 197 -237 227 -138 -512 51 150 -309 35 379 -270 30 177 0 -66 148
6340 148 -214 141 180 -135 -152 225 121 -203 371 184 -193 45 46 -445 344 -93 -142 -44 153 -259 220 27
6362 27 -96 -86 466 -254 54 320 -440 131 412 -255 -180 430 -188 -131 486 -87 -188 293 -98 -198 226
6383B26Q4m45K11l39J40L22J90n11J16M93o40M20nl42J07K89l72p4J97j27l3N47
6405D54n10j15N84n62k09O60o17J19M63k81j43N80l78l97L90o0o1m4M23n83M93
6426B06o8n27L09K40l78J67J47k84M09j04%m10P25m82j69N34l90j41N85k80l93
6447c04M36j01m82P01j03m66L04K17o28K17J68m3K25jk70l6M16j66p7M94o56J45
6469a0K26l94k25M37J05l80L60k4k89L99j64l95L26P5m9L06n5k70O3J13k86L20
6491A89k1m09L1M60m81J45L26l50J11J86l54j26O16l77j56K48J67o14L84N6k53
6512b22M36j66l37L96J55o91L91J77k45J97M11o73J74M29n44l4M50o12J33M58
6532B83k54m06O74k82l33N66k24o9J26J30n38M79p2n63P63l1l96J69m5m0N9K39
$$ plain form
6383 226 310 -135 76 -263 -123 199 389 -122 -6 487 -153 267 262 -80 27 316 -56 -130 67 -60 -93 454
6405 454 -56 -171 413 -149 -358 302 -315 -196 267 -14 -157 423 45 -352 38 -22 -83 -127 296 -287 206
6426 206 138 -389 -80 160 -218 -51 96 -188 221 117 117 -293 432 -50 -219 315 -75 -216 369 89 -304
6447 -304 132 31 -451 250 147 -319 -15 202 -426 -209 -41 -84 141 140 -130 -166 250 84 7 501 -155 -10
6469 -10 216 -178 -403 34 139 -241 119 95 -194 205 41 -354 -28 47 -2 304 249 -21 42 155 -131 189
6491 189 168 -241 -210 250 -231 -86 240 -110 1 187 -167 -293 323 -54 -210 38 205 -409 -25 31 -222
6512 -222 214 48 -289 107 262 -429 -38 139 -106 91 502 -171 3 432 -112 -146 304 -308 -175 283
6532 283 29 -377 297 15 -318 248 24 -45 81 211 -327 152 80 -483 280 249 -147 22 -23 -63 -4 235
6554B35n21J62M32n44O6L26j61KK89l46o8O17l06l18L46l76k4K67j08k20L48J29
6576B27q12M93K74l46M31M4n94K07M61m97j0N70n77N7K13j40l28N17l74L2L66
6597B14J30l99J44n0l88N23k04k83K81J32o49O04P4j96K31k73LJ57L26o22J44
6618a01K89k32m5K49l40OL55m50J71N81j88n13N32m93J31J43qk48M50j58m02M17
6640A46J03n31L47n9k47K73L45m76J17L48m24J87M3j39m06O81n23j70N04k75m0
6661a96L29j05L4P1L1l98M37j42l18K41L95n35J06N3q8o8J75K09n95N61j31j03
6683c7L19o87L99K30j92k04K52N6k40M36l53l82O06l8k38N28n24n9K2K91l82M02
6705B05J20n79K86O0l54J55M83n24Q3M42p09J40N06l62J42L30l42k64N38k00l9
$$ plain form
6554 235 -286 -124 308 -236 -170 156 -5 -3 286 -60 -128 489 183 -135 211 -165 -189 78 -30 -250 98 227
6576 227 -585 -92 182 -164 267 311 -283 -76 385 -112 -122 448 -129 -72 141 1 -327 190 -184 -152 214
6597 214 344 -55 89 39 -349 174 -30 -313 -32 100 -549 55 129 -67 164 -109 -106 51 377 -245 -101
6618 -101 188 -44 -89 160 -180 -174 181 -269 -98 483 295 -218 314 -179 -48 95 87 -161 289 131 -271 146
6640 146 249 -282 65 6 -241 32 377 -99 18 366 -58 129 172 33 -373 308 -215 -385 119 -156 -196
6661 -196 133 28 62 133 164 -234 203 61 -257 -16 379 -156 -50 3 -85 -153 22 231 -364 197 66 -37
6683 -37 282 -405 -6 224 32 -172 80 136 -104 332 -21 -403 203 165 -73 455 -69 -128 -106 185 -197 205
6705 205 325 -254 32 92 -262 -107 376 -148 -65 377 -332 -192 314 -48 94 424 82 -182 356 156 117
6726A17K57n57K39J17Q2j94j96P0L0m7M16m61kN03p37L86K78n43K1L28k40K0K39
6749A26n3J3Nq8J3J80k16j36J35M5j80J85pn52O65K3j95K05J03m15J15J30k03
6772a02k00M04j32l1L9q2K45L8k45k35O75k60p8j06q0j35N89n1m39J44j51k33
6794d26N24j42j21Q1L49n95K05N20p04O2O25n74J61K62m81K73K66j73j76K06M
6815A46l00M74l09j76N52l54l55M11o0l04O11l96J3J23n4k58N31po63K36K22k70
6837a87K87J03j38k27L09k33j82M40n32J07L51j61k15K87J77o16K61J95j79N76
6857D23j92m21L15M9j97q1L48m06J29L73m31j64M24k40o2L40l21j70M05j98k33
6878c10M85K2l10L67m30j88P49k77k65N91n27j81M02M9j27o8J69k20k26M27m6
$$ plain form
6726 117 374 -183 56 173 255 61 -135 -65 -35 -82 334 -127 -129 374 -363 23 301 -242 -221 107 -133 -113 126
6749 126 73 86 91 3 16 196 -20 -156 -21 24 -156 29 22 -530 135 158 -37 168 271 -144 -29 101 -102
6772 -102 -302 102 -30 -61 -22 -104 141 179 -66 -301 374 114 36 -70 -150 -285 304 253 -186 -42 -193 -426
6794 -426 98 -44 -165 -84 265 -330 -125 395 -309 -247 378 -196 -35 227 -254 19 285 112 -64 142 146
6815 146 -154 320 11 -165 387 33 -322 89 29 -275 336 -60 -47 76 22 -236 295 288 -375 -139 83 -187
6837 -187 100 203 65 -162 147 -86 -268 172 -360 -253 98 -63 -278 9 186 -430 -169 26 -153 423
6857 423 231 -190 125 174 -23 -104 244 -162 -33 340 -91 -255 169 -71 -133 207 -114 -284 121 -77 -310
6878 -310 175 197 -113 254 -176 -364 385 108 -157 434 -93 -274 128 177 50 -18 151 -69 -295 132 86
6899H6j21J19j26j68N44p44J55L35k04n2K5R0K32l1Lk89K69k27J89k62L47m13
6921b43J93QL2Q4J6n59L97K99l40K84P5o21L97K43m71m3M55k42j60L99k91k0K7
6944h1K18k0J4J40m33L16j71m18N60R0k20K02q4l12J5O1j39K55K45l29j1J50m2
6967Fj46M07l88K02rM2l76K97Q0q8R4k85k70O86L5l23O8k6k17L50j7n24L48K34
6991A80j50j91N88l66J72k41k64J0N12l50K1L52l77qK76j77OK12j60l34L57L99
7013D67n96L45j93k54K11J18l83J40N54o64J28K67j75K74n5j22k39K64l20J6M83
7034B66k75K06q5k54n5L12j80QJ36m7l67M74m3k66K12j11l41L76L76n15J42R7
7056F6j22k7K36l41j6K01p6J13j00l8p2K64j12J9K13k04k89L99j04k94O33l06
$$ plain form
6899 86 -35 84 -42 -210 334 -410 -255 80 -124 -176 -151 -61 171 140 143 -146 123 -104 85 -177 170 -243
6921 -243 -50 -42 -10 74 90 -469 -72 227 -113 171 246 -375 22 265 -206 -249 206 -36 -196 203 -88 -108 -81
6944 -81 137 117 131 271 -162 154 -17 -435 125 215 -5 197 113 -199 -184 -123 -262 -7 238 -91 -102 48 6
6967 6 -140 267 -121 81 72 114 -262 35 115 27 121 -164 -434 252 287 -36 32 6 -211 139 122 -402 -54 180
6991 180 30 -161 427 61 233 -8 -272 -262 250 -100 -79 273 -104 -112 164 -13 -7 205 45 -289 68 467
7013 467 -129 216 23 -231 -20 98 -285 -145 409 -255 -127 140 -35 239 184 62 -177 87 -233 -217 266
7034 266 -9 197 112 -142 -197 115 -65 -57 79 32 -335 139 96 -170 42 -69 -410 -34 342 -173 -31 66
7056 66 -56 -83 153 -188 -204 -3 -79 34 -66 -104 -176 88 -24 -5 208 4 -285 114 10 -284 349 43
7078D3k71J24J30k04R8K88l66K77j59k8j10K49j80j40N23m70n5L50R6k29J26L8
7100A30k98L07l65K25M72m18k45M28l85j96M37j1j38J48N6j42N9r3k41l5M49j87
7122d3o5L34l24Q0J38q2j24K25k83k8K72L4m00L94J7k66J87J89l83J06Jl08M13
7145H4k83Q6N9K00l44J33K64J7l23N33n28j18N20m68J25L04j63l73P42l95k09
7166a37K49n8j93J63o0O0m4k2j95J12K88m90O96l58j76K39L09m11n2J92k14R9
7188cK39j3m23M51k61l1R1J87l91K15r8J83L23l18l32K10J34k83J54Mk54J94M30
7211D08n04R0L68l56j73L22pnK8m56J29M45l12l8L12k64L4P4j32k07K97K05l98
7234a40M11m53J19M05j42k73K61n4m72K01K0J50j76L67m48J44O00n38j21L28j71
$$ plain form
7078 43 -228 -104 26 -178 -80 208 -158 119 -40 -68 -178 71 -109 -249 274 -196 -251 99 195 -34 92 130
7100 130 -168 139 -226 -1 471 53 -192 236 -149 -345 92 81 -57 91 147 5 64 -29 -270 -305 144 -43
7122 -43 -108 226 -98 -18 120 38 -86 139 -144 -172 100 134 -266 128 145 -121 66 255 -128 -22 -21 -329 84
7145 84 -199 -113 -54 146 -198 -65 199 216 -107 426 -102 -220 300 -168 -43 261 98 -275 467 72 -137
7166 -137 112 54 -139 24 -36 24 -20 -42 -237 -125 163 -327 369 11 -165 74 383 -28 -80 112 -102 -3
7188 -3 236 223 -200 251 -10 -41 50 237 -154 61 -37 146 469 151 -181 29 163 -120 34 38 -216 -22 408
7211 408 -96 -6 362 6 -167 155 148 143 171 -285 -156 289 -23 -61 251 -13 21 95 -37 -244 53 258 -140
7234 -140 271 -182 -63 342 200 -73 188 134 -338 -137 -117 33 -143 224 -224 -80 520 -18 -139 189 18
7255A8K1P5j57o3O6J86k90O10n47j87R8K80j35K41j55j71L50l99J9K60J60n75
7277b95L45j44k56J73K43jk8l31J58K02K04j02m15M10o8p1M71l38m71L76J32o30
7299d36O37j85k42N3M31l40J87Lp0N0J40l10L3Q9j25N1M19m49P6K22m6k19L01
7322B70j74j98K94p1m84L11n9Q9j9J60m13K86K67n24Q2N34p10K24L21l36K33K57
7344C40l89j7K11k83L09k41J9J2L91k65J5K71l17k17J50J88l73J38J08k45L58
7365A63nk13j5J83l50K86K45n10L97K77k45l17J77j50J05J53k49L4J99l93J51
7386g7K55J0k85J11O8k73M09j46MJ02p4l99O09l76n9J10J39l3r9J77O2k13K12
7409B34l61JM07k28l49N32k42j20K64j92r9L64l53j23M64j52j22L51l12r7K82
$$ plain form
7255 18 39 114 -43 -106 -40 146 -144 466 -81 -268 -170 110 -25 216 61 -110 240 -159 -140 120 280 -295
7277 -295 50 -94 -350 -177 66 65 37 -294 -136 66 270 168 -247 163 95 24 495 157 -314 62 194 -436
7299 -436 201 16 -226 -173 258 -82 105 108 38 88 228 -82 -49 40 -85 -34 385 -64 12 234 188 -31 270
7322 270 96 -102 192 121 -363 -52 -111 -22 -41 119 -294 -8 259 -265 -183 351 -359 -135 186 -150 83 340
7344 340 -49 -66 145 -138 171 -70 -51 -39 352 87 102 373 56 -161 -11 177 -196 -58 50 -195 163
7365 163 158 -55 -70 113 -237 49 294 -216 181 458 213 -104 73 -77 28 181 -68 -34 165 -228 -77
7386 -77 178 188 -97 14 82 -191 218 72 76 178 104 -295 314 -62 -121 -11 128 95 -4 173 235 22 234
7409 234 -127 -126 281 53 -296 236 -6 -126 138 -54 -153 211 -142 -265 199 47 -75 276 -36 -133 149
7430A49P5n10K82L00o04K91O0j36J25O6l29J27L21m30N9L40N2l55K65k7p2J49
7452A98k78k39L45O0k95M47p3l20K91J23l41P7J21k92K7J74l13J33J66j54J09
7473c4K05q1j92K41r7j47R1K7j57K95J87m58J18j15l32O71j04k95Q3rK04j63R5
7496C3m8m2L38m86L95%l54L9L31m66L42o4k09J53J78r6o7J13Kk05J88K13n49M76
7520B15k41j14k29L62j3J01J22o1q1Q3q1j67K63j02j12J44J55q8M0n05K90r5K02
7543H8k26K94K6o38O36q1k57K83j94O4K2j02J72q3J36K8j04N3l92L57k11o0M86
7566B97k78O8k24L93O7k15K19k93j87L65l00j41L63l08K52l1j13LJ18P5j8k46
7588a34K25M8Ll2O2l64N58l14R1j71j36O4L06l90m9K44p0j27M01k26m16O48J04
$$ plain form
7430 149 224 -286 -4 296 -308 -17 43 -93 32 98 -231 -104 217 -213 -154 186 238 -117 148 121 49 198
7452 198 -80 -319 26 86 -209 238 165 -155 136 259 -82 -5 116 -176 -149 25 -288 -155 11 -143 -34
7473 -34 171 90 -102 139 42 -105 -14 13 -144 151 338 -120 -2 -117 -449 222 118 -177 -94 -103 101 -62 33
7496 33 -15 -57 281 -205 190 190 -164 -125 206 -260 82 18 -191 -38 140 44 -23 90 92 -113 75 288 -261 215
7520 215 -26 -140 -369 -7 -20 81 203 142 61 144 63 -104 159 57 -55 89 244 156 196 -309 -19 -114 88
7543 88 -138 156 182 -456 180 99 -158 125 -69 -5 17 -85 87 4 140 168 64 117 -275 82 -129 -189 297
7566 297 19 87 -137 256 323 108 327 34 -153 212 -88 -229 134 -174 78 47 -66 -63 55 130 112 -134
7588 -134 91 139 142 110 172 -192 366 52 143 -28 -164 -100 206 -184 -233 11 -59 -186 215 -11 -427 221 325
7611C25o81K27J33mQ7j71Q8k4J96p42N73l7M2j20J50m1n7M04l75l4K57r2j44P
7635c3L5k62M70m21J03L4L2k67M63n7j00J94k13K8r1J19p0J52J94l12J06Kj36
7658c0j34L94j72p5K9J5m8J64j59m3K27k83J2K96j75k37L49k44j10L58r4r1K91
7681B40j47j90Llr6k8M45k76j84L60k08j35L59j24k97M29l63K35k9j12Q2K5Nj68
7705a77R4L26k33k12L67l20J70J98j64k18K51j45j87M38j42L4p8m0Q1M8j30j30
7727a69K21Rk02K77j53K6J21l19p8K34Q2k52K80j84J28l7K13l90K19K82k49J21
7749A80q0j76Nj62J17J84j15l9P3J6j9K4O2o7m1K31m52K48j33J27r2J00Q4q2K17
7774B10p5m9j25J95l74L16p5j26J57K5L8j33n8o7L83k17n2j60K49j11j41K37J5
$$ plain form
7611 325 -356 -129 4 0 87 -84 4 -20 176 -566 7 -30 12 -108 42 1 -56 348 -27 -61 196 104 -40 -33
7635 -33 2 -260 210 -211 -108 -74 -42 -309 154 97 -3 191 -22 6 -85 34 -36 116 310 -2 104 106 -30
7658 -30 -164 230 58 -17 12 27 -21 143 -16 -59 168 -115 -103 193 18 -219 130 -114 -224 134 40 -51 240
7681 240 93 -97 -94 -97 -193 -221 224 -52 -236 124 -84 -219 140 16 -281 148 -215 20 -9 -121 -39 -14 -9 -177
7705 -177 -83 243 10 -202 165 -155 15 213 49 -169 82 -63 -250 188 46 80 2 -38 43 91 -39 -169
7727 -169 52 61 -141 136 -17 9 130 -189 -267 -33 49 -203 77 -107 21 -16 197 -193 26 308 59 180
7749 180 100 -76 -71 -233 -116 68 -47 -86 -13 3 -16 8 70 3 -38 193 -259 -11 -144 -17 -109 -9 75 -7 210
7774 210 135 86 -39 156 -218 98 23 -103 54 79 117 -16 -74 -141 242 25 -27 -187 62 -49 -190 47 62
7797F2k55L97l12L85k14j78K49j86k3l7K10N9l08J23J04k07L18J70m56j55M92
7818B38n71K35J73N1k26K0J77J05j82j11N0L9j3k15J53n4q2J95l2j72K40q5Nj71
7842b33M37l29J13Rl56L28J33j49m2K01k89J01J49Qq8j00K06k93K27j34JK42j7
7865A25j72M2Q6K83l48K35m36K51j69J08k01M51o14M00L7q9NK6k81M73J76l94
7887fj85K04K44l64J61Q1k82Q5J55r8K51l01J15Q9J27l55J9J52o4p1J27k69J44
7910d1K29n1l65L49k34mO33m01j88J92j09K4k0m2k21M61k86l9L05o0j80n5L35
7933B32k41M3K24k10J01Nj31r5J92l5k58K69j30j39K13J30k18K50j87qQ9j40k42
7956b86N08k94j03k3J82L6l48O56m51K0k5K28j64R6j13J22J82j34j69r5L46n8
$$ plain form
7797 62 -193 204 -108 277 63 -115 134 -52 -75 -112 98 157 -151 -28 76 -131 187 357 -99 -254 238
7818 238 -333 -98 75 126 -100 -80 97 202 20 -91 -41 -2 -15 -230 -77 -131 -213 -18 -50 -222 18 -67 -62 -233
7842 -233 204 -125 -12 -3 -359 -31 102 -47 -89 112 -177 -76 73 81 -7 -107 99 -194 33 -101 -100 142 125
7865 125 -47 -5 81 364 16 251 -185 66 -103 5 -196 255 -359 41 78 -11 -6 20 -261 212 388 -6
7887 -6 -191 13 257 -107 54 135 -147 -62 93 -5 246 -55 60 149 276 -79 -60 92 28 -43 84 -185 -41
7910 -41 188 137 -228 121 -113 -117 516 115 -73 119 10 34 14 -28 -249 212 -74 -113 192 132 -48 -103 232
7933 232 -9 34 258 48 149 154 23 -72 120 85 -173 96 -34 -173 40 170 -48 202 15 7 96 -44 -286
7956 -286 222 -72 -175 -198 -16 20 -328 328 -123 -103 -128 100 -64 32 -81 41 223 89 -80 -175 171 113
7978A13J22l29MN2O8r9%p0R3N9K47j72J12j26l71L83l84K78l07N02P0k56K15l61
8002a57J42jr9J52k68J56R2M9q0j40R4k45L13J68k34L6L39k64J96k09M9l66M20
8025A43j61j26R6m2M8J66o1m7j5o7j66j4N47m99lK85j69j45M47k73O9P9k62R7
8049g3j2K24j73K51j73j40K26l5k5m5N3m99N16R4j57J60l2j35k98N74j79j68J97
8072A51l0J1j3M6k31O2N7k19K52j44j59K68J9m70M10k2J82j83j5R2k5J98k73O6
8096C0J04n03L38J21j36K68j13N9l76J90p0j25N2R4m6K35j63LK25l6l35k1K58
8119E3o8j85N89k25k84L1l66J09J76J36o2R0k7Q5l32J06R0J88Q7j83j29q9J21
8142h9j3K47k81K26K0k49K98j47m6J50j84J72n9J58k59j70L51k75J82R0m43N66
$$ plain form
7978 113 235 -94 -90 -38 30 -69 -69 -139 -46 13 260 88 200 74 -297 86 -298 -20 -327 175 245 -11 204 -157
8002 -157 -15 -16 -115 37 -231 -75 17 66 -14 -154 -60 -305 8 176 -58 -22 317 53 249 40 89 -277 143
8025 143 -18 -144 -48 -90 -42 124 63 16 1 -66 -232 -246 301 -198 -201 84 -85 -230 217 -56 13 92 -170 -73
8049 -73 -85 139 -34 217 44 -96 130 95 70 25 78 -421 95 189 32 192 160 25 -273 301 122 -46 151
8072 151 121 132 119 165 -66 -4 53 -166 86 -58 -217 51 70 -400 10 -12 170 -13 -28 64 39 237 -36 30
8096 30 134 -369 -31 90 -46 222 109 168 -208 -18 -88 -213 -161 -67 -113 122 -41 -38 187 151 -184 -205 53
8119 53 -15 -200 389 164 -120 -89 -455 -346 -170 -34 -96 -6 -33 52 -280 -174 -84 104 191 8 -121 -210 -89
8142 -89 -102 145 -136 90 110 -139 159 12 -34 116 -68 104 45 203 -56 -226 125 -150 32 122 -321 245
8164B45j28l00J49j81Q8K44J3l02l8J52k7J04P6r0k72N93p4l47J01N9j32q3L54
8187B04l63l7n9J75
$$ plain form
8164 245 117 -183 -34 -215 -127 117 130 -172 -210 -58 -85 19 95 5 -267 326 252 -95 6 65 -67 -150 204
8187 204 -159 -196 -255 -80
8191h0
$$ Imaginary data points
##PAGE= N=2
##DATA TABLE= (X++(I..I)), XYDATA
0@%%%%%%%%%%%%%qJ6j6J6j6J8k6L2l3M1n0N8p0Q0r0J04j21J39j57J77k00K28k58
36a36K88l20L58m00M45m94N47o05O68p41Q21r02R92j093J202j326J465j617J786
55I38j977K195k448K744l091L508m025M678n535O710q422J1151j6152K8073j05153
70h6806o7610K72383j02612n2994J82314j17923q8675K23068j13233j65544K20476
81A02844N542j69850J36935n0329j97874J80732M8603k23906J35093J22533j83054
92i2731O8378Q2001k01402J02423J91918j88527k287J83219j47735l4175J56579
103A17661j57341m1208K33349j13074j45043J71525n7087j15627J78553n3441
113A8267j54735K00717J4200k10535J22753O3463j51954J34570O1320k17990R5088
$$ plain form
0 0 0 0 0 0 0 0 0 0 0 0 0 0 0 -8 8 -8 8 -8 10 -16 16 -17 24 -26 32 -38 42 -48 56 -65 74 -83 94 -106 122 -136
36 -136 152 -168 190 -210 235 -259 288 -317 351 -390 431 -471 521 -572 630 -696 769 -848 938
55 938 -1039 1156 -1292 1452 -1639 1869 -2156 2522 -3013 3697 -4725 6426 -9726 18347 -86806
70 -86806 -154416 117967 15355 -37639 144675 26752 -61923 161145 47912 -117632 102844
81 102844 108386 -61464 75471 25142 -172732 8000 56603 -167303 -32210 90323 -92731
92 -92731 -24353 57648 -143754 -41331 150587 -37940 -40227 142992 -4743 -38918 117661
103 117661 -39680 -80888 152461 39387 -105656 65869 8782 -106845 71708 18267
113 18267 -136468 64249 78449 -132086 -9333 54130 -97824 36746 98066 -119924 -24836
124b4836J36809j94924L0282J51995j40345L5623J43834j99045l2592K12529j12198
135G132p2901J76534r3718q5382J70213j11195j46881K06621L357j52947J34401
146C5234j0306j56824J52578K9298j89937J40649J19851j68912N6919Q0924j66304
157g6830P9576J40185j83816O216J66913j42867m8054J29989j30395k6521J90831
168A05227j18556j17314J72372m5221j06736J54226l2859j07677J82514n848j86337
179a06209J24576O2614j36000J08467M7053j75893R2551R2015j98612K8376J39830
190G8768j24840K2447J12704j68899j0656J75913j20944o0237J74614o5121o5393
201e1644J43796r7537j07401J90288j3441j40380J30513K840j34571J19157M693
$$ plain form
124 -24836 111973 -82951 -52669 99326 -41019 -5396 138438 -60607 -93199 119330 7132
135 7132 -65769 110765 17047 -68335 101878 -9317 -156198 50423 53780 -99167 35234
146 35234 24928 -131896 20682 49980 -139957 692 120543 -48369 8550 89474 -76830
157 -76830 2746 142931 -40885 -34669 132244 -10623 -58677 71312 -59083 -85604 105227
168 105227 -13329 -130643 41729 -3492 -110228 43998 11139 -96538 85976 80128 -106209
179 -106209 18367 80981 -55019 53448 100501 -75392 17159 109174 -89438 -61062 78768
190 78768 -46072 -23625 89079 -79820 -90476 85437 -35507 -95744 78870 13749 -51644
201 -51644 92152 -5385 -112786 77502 64061 -76319 54194 57034 -77537 41620 46313
212D6313j65199J31503Q9501j67754M7903P7182j41987O3630J07765j59427K6612
223d3958J54729j32491m2619J23904r7254j4090J59867j07153q8041J61088n0415
234B3567j10185J28538k3159q8297J49727k1913j64926J14582N0076j32098Q6126
245A2038N0800j33161Q6118P0067j76337L5802J32172j09111J2413J02461j29502
256d6240k264J40278j20860n4223J60169n3674o8180J15053p9257q5568J59401
267F4635k6187j26789J24714J6568j20940R1819N529j30504J20133P2392j53333
278f1963M6894Q1154j22476M1074Q6369j30484L3170J34615j26371m4611J15735
289E3106p9388k1941J28845q8636o4120J44712n2585j08109J12569q356p4417
$$ plain form
212 46313 -118886 12617 102118 -65636 -17733 59449 -82538 -18908 88857 -70570 -43958
223 -43958 110771 -21720 -64339 59565 -37689 -51779 108088 935 -87106 73982 23567
234 23567 -86618 41920 18761 -69536 80191 58278 -106648 7934 58010 -74088 12038
245 12038 62838 -70323 15795 85862 -90475 -54673 77499 -31612 -19199 83262 -46240
256 -46240 -48504 91774 -29086 -83309 76860 23186 -44994 70059 -9198 -94766 64635
267 64635 38448 -88341 36373 52941 -67999 23820 29349 -101155 18978 91370 -61963
278 -61963 -15069 66085 -56391 -15317 71052 -59432 -26262 108353 -18018 -62629 53106
289 53106 -26282 -48223 80622 -8014 -72134 72578 19993 -88116 24453 16097 -58320
300e8320J22410j9454j33523J07846L9460j28295P0745N5792j04556P0246N1293
311G3644j51612L7400J14108j04125K354R4309j00660m03J08398j11450l9857
322g7894J46450m9109o5417R9559n8390o6193J30656l3911j05587J21501J5805
333E7470j10882P2159N114j05054J04392M9660j35636N1375P4760j12335K6109
344b2868P0036j04600M0283J10608j17774l0852J08975p0170k5588J05766p1806
355g990m0494J26202n9630r6488J04098o139o9125R7394j8756j03529R8749K1120
367D5412j20317O5611N6255q7349N5873L9801j22971M2633R4253r9776K930R1248
379F3603p8429m905Q3297r7209k6756J27029n0127o2814Q9397m2576n8776R9510
$$ plain form
300 -58320 64090 44636 -88887 18959 58419 -69876 869 56661 -47895 22351 73644
311 73644 -77968 -40568 73540 -30585 -28231 66078 -34582 -34985 73413 -38037 -77894
322 -77894 68556 19447 -45970 53589 -4801 -70994 59662 25751 -79836 41665 57470
333 57470 -53412 18747 23861 -81193 23199 72859 -62777 -11402 63358 -48977 -22868
344 -22868 47168 -57432 -17149 93459 -24315 -55167 53808 -16362 -41950 63816 -7990
355 -7990 -48484 77718 18088 -78400 25698 19559 -49566 47828 29072 -74457 24292 45412
367 45412 -74905 -9294 46961 -40388 15485 55286 -67685 -25052 69201 -30575 -27645 63603
379 63603 -14826 -19731 63566 -33643 -60399 66630 16503 -46311 43086 510 -58266 41244
391D1244l4584q4341J12581J4541j03040O0870J3845q5464Q3396L8566j12103
402e4489N4752P0787j03705J2832O3461q3737L1588Q9479j04029k3561R8854o5580
414a3348l5910Q8403n3099l0471J06371n5100q3779R8061r63o6824Q1069o513
426B7897p9365Q5459J2125j09647O0618N5805p9967L9816L4611j00641L7374P2988
438E7073r6235L505Q7985o5039j0961O6894p9652j5354J09446n0755n3203Q7805
450D1509l0022n3863P7948l1827o4039J02214M787r3497N6881J5407p5457O3582
462A3623K4820r0802N8056N7084r8704J1471N9044o9858K6222O9523q8981o549
474c5051Q8824o7492l4668Q0946m0720k2405Q6726n4237o3383R2273q980o5763
$$ plain form
391 41244 6660 -77681 34900 49441 -53599 7271 21116 -64348 19048 57614 -54489
402 -54489 263 71050 -32655 -19823 43638 -40099 -8511 80968 -23061 -46622 52232 -13348
414 -13348 -49258 39145 -13954 -44425 61946 6846 -76933 21128 20165 -46659 34410 27897
426 27897 -51468 33991 46116 -63531 -2913 52892 -27075 12741 47352 -53289 -15915 57073
438 57073 -39162 -35657 52328 -12711 -23672 43222 -36430 -51784 57662 6907 -46296 41509
450 41509 11487 -42376 35572 3745 -60294 41920 46707 -46790 10091 25498 -49959 13623
462 13623 38443 -52359 5697 62781 -35923 -24452 34592 -35266 -9044 60479 -28502 -35051
474 -35051 53773 -13719 -48387 32559 -8161 -30566 56160 1923 -61460 30813 21833 -43930
486d3930P1708o46o3717P1633j336r5455O1565M7500p7284L1999L3340q0490L3993
499a1120N3348q8852J1701Q5103n8058j3868N8623o2811q729Q9858n1127m3330
511c9262Q5433k3722n5052O0162k6662n1258Q7059k464q4949N4781K0775p0960
523d6119M6040K2661p1119N5924M9483r0039J0758N9689n8390J4417N7828p0973
535a9840q99P7202o5576l7464P3480k9890k4977P0314m5354n1786Q2098j1342
547A5966o5360O4896R610n3869N8049j258q1345N7440M1627p3101K6778L7422
559C6855o6450K3808M1610p9320J3810P6977n4433j6788N4743m9918j0133P2393
571D3154m7764l3385Q1291k0819n3801N1715j8713m2510P2441n753p1480N4868
$$ plain form
486 -43930 27778 27132 -36585 35048 33712 -61743 -178 47322 -29962 2037 35377 -45113 -11120
499 -11120 42228 -46624 -34923 50180 -7878 -21746 36877 -25934 -34663 55195 4068 -39262
511 -39262 46171 22449 -32603 27559 897 -50361 36698 34234 -50715 4066 24841 -46119
523 -46119 -79 22582 -48537 7387 56870 -33169 -22411 37278 -21112 -6695 51133 -19840
535 -19840 -20739 56463 -9113 -46577 26903 -2987 -27964 42350 -3004 -54790 27308 15966
547 15966 -49394 15502 25112 -28757 29292 28034 -53311 4129 45756 -27345 -567 36855
559 36855 -29595 -5787 35823 -43497 -29687 47290 -7143 -23931 30812 -19106 -29239 43154
571 43154 -4610 -37995 43296 22477 -31324 20391 1678 -40832 31609 25856 -45624 9244
583I244J8991o7219L5778K1173n6995M9472L8798q1209J4533N4972n5454O891
595a1025N0353n6448L800O4127o3670l1199O9788k6827k6026N9669l5947l8997
607d2402P1926j8373n9800O2831J2495m9186M7501k130o6417N3177L0045p0676
619c1009K7997L9564n8614J6665L1642o7881J7407O6772n5073j3627N4902m0849
631a2104j2292N7712m2473k2584P5886k2745n1159M9027j2287l8681N8370q314
643A8356n8522N4635J4584o6296K9189K2540m7908M0860K9626p0058J9016M9934
655C5956n4361J806M8177m3526M893N3254n8126k4345O5151k5669k8486N2301
667B7025k5649l2242N9480k1767n4333N9275J2698m8085L8713K217n4847M5631
$$ plain form
583 9244 28235 -38984 -3206 17967 -39028 10444 49242 -31967 -17434 37538 -17916 -11025
595 -11025 39328 -17120 -13320 50807 -12863 -44062 25726 -1101 -27127 32542 -3405 -42402
607 -42402 29524 11151 -48649 14182 26677 -22509 24992 22862 -43555 9622 39667 -31009
619 -31009 -3012 36552 -22062 -5397 26245 -41636 -24229 42543 -12530 -26157 28745 -12104
631 -12104 -24396 33316 -9157 -31741 44145 21400 -29759 19268 6981 -31700 26670 18356
643 18356 -40166 14469 29053 -37243 -8054 14486 -33422 7438 37064 -32994 -13978 35956
655 35956 -18405 -16599 31578 -11948 -7055 46199 -11927 -36272 28879 3210 -25276 27025
667 27025 1376 -30866 28614 6847 -47486 11789 24487 -23598 15115 17332 -37515 8116
679H116K1989o4493K9144M1680n2169J0681K8508n6116J6922N6468n2481j1323
691b3074N5303l5431j8179M7083l6098j7224O6953k3751m7596M7682p305l8488
703c0125M6680n497m6845N1913J1809o3079K6699K6083m2751L0648K5863n7707
715b6309J9867M3544n3778j859M6656l5010R69M4032n0100j8979N8648k7158k9622
728b9099M8894j6654k8307M8425k1856m5561N6116J0033m6654L5724P250m5631
740b7320L7307J5432n7268L0509L9298m9393O524K7808m7477J3395M4978m9692
752a5899o567N3956l4366k1508M1376k8897j3632N7845k4034l9965M8598m928
764A1979l8492L9105j992l6958M7524P130n8836K7037K5294m1989K2355K2600
$$ plain form
679 8116 30105 -34388 -5244 36436 -15733 -5052 23456 -32660 -15738 40730 -11751 -23074
691 -23074 32229 -3202 -21381 25702 -10396 -27620 39333 15582 -32014 15668 8363 -30125
703 -30125 16555 11058 -35787 16126 27935 -35144 -8445 17638 -25113 5535 31398 -26309
715 -26309 -6442 37102 -16676 -18535 28121 -6889 -5920 38112 -11988 -30967 27681 523 -29099
728 -29099 19795 3141 -25166 23259 1403 -44158 11958 21991 -24663 11061 18311 -27320
740 -27320 9987 25419 -31849 -1340 37958 -11435 -4911 22897 -24580 -11185 33793 -15899
752 -15899 -22466 31490 -2876 -24384 16992 -11905 -25537 32308 8274 -31691 16907 11979
764 11979 -26513 12592 10600 -26358 21166 28296 -30540 -3503 21791 -20198 2157 24757
776B4757m7428J9505L5082n2944k047M5588l0308k279L8132m0589j2306N2080
788B7243k8187k8259M8471r723k6516L9029j8095l8543N0256N357m5348L2472
800H157J1787m1732K7930J1029m9262K9071L5661m7403M791L0182l9360Q447L6882
813B6180m2444j853N1042l2034k3012L8546k1984j4330M8040k1716l3800M6390
825A9025n103l9995L2924J674l1552L9816N258n1814K6816K3903m1281J6407K4050
838B0128l7893J7215K9727m8845m08M3627k7627o484L4881l1743j0311M3576k8143
851b300k6576M6590p105k7167L2816j3699l2387M2905K402m2093L1933J5301l7877
864a7257K0736J0246m1553K8206L0199m4799N453L1509l4667K420L0535l6250
$$ plain form
776 24757 -22671 -3166 31916 -21028 -23075 22513 -7795 -10074 28058 -12531 -24837 27243
788 27243 -944 -29203 19268 9545 -16971 22058 3963 -34580 15676 21033 -24315 8157
800 8157 19944 -21788 6142 17171 -32091 -3020 32641 -14762 -9971 20211 -19149 -10702 26180
813 26180 -16264 -18117 32925 891 -22121 16425 -5559 -19889 28151 6435 -27365 19025
825 19025 13922 -26073 6851 8525 -23027 16789 22047 -29767 -2951 20952 -20329 -3922 20128
838 20128 -17765 -550 29177 -19668 -20076 23551 -4076 -10560 24321 -7422 -17733 25843 -2300
851 -2300 -28876 17714 10609 -16558 16258 2559 -29828 13077 15479 -26614 5319 20620 -17257
864 -17257 3479 13725 -27828 378 30577 -14222 -8769 22740 -11927 -9507 21028 -15222
876a5222J265M4927l1811k1680L6868j7718j5854L9718j8937k5828M3978o629
888A3077l9340L0924M936k7832L3385L434m3631K7094J9943m1033J3659K4318
900A8934l2439J4388K3477m3951K027L9618k8277q065L3798k4979q966L6416k7034
913e053k1393M3981o661k6734L0519r161k7755L5841p63l7331L1286J5157l6405
926a4472J5935J0164l5345K2731K4535m0111P094L0949l1847j351K7423k8989
938a3284J572L9919k8921j8759L6094j4912j7969L3159j3891k1291L8695q376
950A2036l6981K8094O806k7748K5969N014l5960K4675J6951m0031J2486K6209
962A7520k7634R884K1723l6256K839L5392k8314q907L3198j8856j0935K9098k3754
$$ plain form
876 -15222 -13957 30970 -841 -22521 14347 -3371 -19225 20493 1556 -24272 19706 13077
888 13077 -26263 4661 9597 -18235 15150 18584 -25047 2047 21990 -19043 -5384 18934
900 18934 -13505 883 24360 -19591 -17564 22054 -6223 -14288 19510 -5469 -14435 21981 -5053
913 -5053 -26446 17535 10874 -15860 14659 5498 -22257 13584 12821 -24510 6776 21933 -14472
926 -14472 1463 11627 -23718 -987 23548 -16563 -9469 21480 -10367 -11718 15705 -13284
938 -13284 -11712 28207 -714 -19473 16621 1709 -16260 16899 3008 -18283 20412 12036
950 12036 -24945 3149 9955 -17793 8176 13190 -22770 1905 18856 -21175 -8689 17520
962 17520 -10114 -230 21493 -14763 -11924 23468 -4846 -13753 19445 589 -10346 18752 -5002
975e002j8994L9980p965k6595K7919l696k5318K8445j616l1483L0219J4714l4602
988a3994J3812J2986k9476J7657J9501l4995R149K9360l0794m684K5189k4102
1000a0391P93L2639k6690j5180L4561j4817j9459K9209r848j6764L3872r183l2255
1013b3513K8122O649k6976K2073O171k8770K2492J2548l7575J2327K4373k5595
1025g674O771J8960l1160L765K9135k8425p832L2482j6218j1167K5265k0450j4028
1038b0576L5470r116k3755K8324j440k2947K2991j368k6971K8249J1357l2563
1050a2345J2628J3042k6636J2289J5606l0327R958K6150k9379n091K4136j9708
1062i677m48K7598k1944j0667L2465j3876j9085K6086o041j4985K7983p828k8022
$$ plain form
975 -5002 -23996 15984 8019 -18576 9343 5647 -19671 8774 7158 -24325 5894 20608 -13994
988 -13994 -182 12804 -16672 985 20486 -14509 -5360 24000 -6794 -11478 13711 -10391
1000 -10391 -9598 23041 -3649 -18829 15732 915 -18544 10665 817 -15947 17925 8742 -23513
1013 -23513 4609 11258 -15718 6355 12526 -16244 6248 18796 -18779 -6452 17921 -7674
1025 -7674 -903 18057 -13103 -9338 19797 -8628 -16460 16022 -196 -11363 13902 -6548 -20576
1038 -20576 14894 5778 -17977 10347 8907 -14040 8951 7583 -19388 8861 20218 -12345
1050 -12345 283 13325 -13311 -1022 14584 -15743 -5785 20365 -9014 -14105 10031 -9677
1062 -9677 -10125 17473 -4471 -15138 17327 3451 -15634 10452 4411 -10574 17409 9581 -18441
1075a8441K5216N055k7603J8299P694k4750J7953R837l3603J2264K3263k4705
1087i521M572J9527k4508L439K4565k5713n760L1211j4524j1833K2632j6229j2661
1100a4803K9017r888k1575K6838l98k2877J8325m63k2962K4401Q959k9372J3345
1113a453J4492k4391Q830J3804k3898J0078K2996k6824m320K3129j7123l040K2695
1126A4975j8297p710K7997j4801j8797K4045m145j4076K2811p101k2672K4268
1138F497K629k5895J7088R478k0669J5163P337k7976J2547J9398k3761L873J8687
1151A4396k0147J800J9024k3365l564K8032j4675j2044K0971j2539j1158K4166
1163A0897r781j7866K5828M1k1597J6197M67j8772K0564O583k5538J4108J3210
$$ plain form
1075 -18441 6775 11830 -15773 2526 10220 -14530 3423 13260 -20343 -8079 15184 -9521
1087 -9521 -4949 14578 -9930 -6491 18074 -7639 -13399 17812 3288 -8545 14087 -2142 -14803
1100 -14803 14214 4326 -17249 9589 9191 -13686 4639 4176 -18786 5615 14574 -14798 -1453
1113 -1453 13039 -11352 -2522 11282 -12616 -2538 20458 -6366 -10686 12443 -4680 -7720 14975
1126 14975 -3322 -11032 16965 2164 -16633 7412 3267 -10809 12002 4901 -17771 6497
1138 6497 9126 -16769 319 9797 -10872 4291 11628 -16348 -3801 15597 -8164 -4291 14396
1151 14396 -5751 -3951 15073 -8292 -11856 16176 1501 -10543 10428 -2111 -13269 10897
1163 10897 1116 -16750 9078 9119 -12478 3719 4186 -14586 5978 12561 -12977 1131 14341
1176A4341k3417O282J2660k0040Q719J8323k4057k705K1313j5430n617K0206j4598
1189d020n659K4367j3755j6732K2998l028j4095J9606m217j8284K0372J618k3912
1202a4741J5272J0119j8752J0942O958k3198J0481J5966k2133K687J8792j6718
1214d325k91J5850j9036k568K4566j3294j0916K0257r230j1136J9775q918j4597
1227a3863K3490o90k0335J4185K506j7219J5975M540k0759J3729J1459k2171N028
1240d125J2645j6579O886J5211k0757m50J9774j5615n954J7948j0979m642J9386
1253A2749j3058j3633K1090l579j3817J6613k047j4516J7244l67k0340J5077Q649
1266A0065j7387R507O498j8685R200J2290k0489L902J7245j5347j554J3589j5816
$$ plain form
1176 14341 -9076 -2794 9866 -10174 -1455 16868 -7189 -9894 11419 -4011 -9628 10578 -4020
1189 -4020 -9679 14688 933 -15799 7199 4171 -9924 9682 5465 -12819 7553 9171 -14741
1202 -14741 531 10650 -8102 2840 9798 -13400 -2919 13047 -9086 -6399 12393 -4325
1214 -4325 -4616 11234 -7802 -10370 14196 902 -10014 10243 1013 -10123 9652 734 -13863
1227 -13863 9627 8937 -11398 2787 5293 -11926 4049 8589 -12170 1559 13018 -9153 -4125
1240 -4125 8520 -8059 -1173 14038 -6719 -7169 12605 -3010 -8964 8984 -1995 -6637 12749
1253 12749 -309 -13942 7148 3569 -10248 6365 4318 -10198 7046 6679 -13661 1416 10065
1266 10065 -7322 2185 8683 -10002 -802 11488 -9001 -5099 12146 -3201 -4755 8834 -6982
1279f982j294K0029j3107q767J9401p667j0424J6070p439j0966K0228j696j7985
1292a0599J4044K507j5617J2640L711j7005J2839R194k0253M459J2065j4620M686
1305a949J2733j7448J288J6760j4855n783J6599q274m492J5935j1078j0500J8558
1318G494l962j3367J4664l99j1844J3598j302j6697J3199P809j6231P268P357
1331G587j5224O874R387j7425L849J5750j3453k259J2399j2383j488J6219j1459
1344a626o964J7765o633j0039J3310n160r452J6619k120j5417J3169K669j4523
1357h402R417L725j3826J1268P189j7730M786J1016j2733K963J0695j3469J791
1370c310J4058j3635m865J4802o909m761J3074q802q099J5730m825j2491J3648
$$ plain form
1279 -6982 -8276 11753 -1354 -10121 9280 1613 -8811 7259 -180 -11146 9082 7386 -10599
1292 -10599 3445 5952 -9665 2975 6686 -10319 2520 11714 -8539 -4080 7985 -6635 -1949
1305 -1949 10784 -6664 -5376 11384 -3471 -9254 7345 -929 -5421 10514 -564 -11064 7494
1318 7494 3532 -9835 4829 4430 -7414 6184 4882 -11815 1384 9193 -7038 230 7587
1331 7587 -7637 -763 8624 -8801 -4952 10798 -2655 -4914 7485 -4898 -6386 9833 -1626
1344 -1626 -8590 9175 2542 -7497 5813 653 -8799 7820 5700 -9717 3452 6121 -8402
1357 -8402 1015 4740 -9086 2182 9371 -8359 -3573 7443 -5290 -2327 8368 -5101 -3310
1370 -3310 10748 -2887 -7752 7050 141 -4620 8454 -348 -8447 7283 2458 -10033 3615
1383C615M37j0443J0847j121j3758J2072N737j4509O709P605j2555N354P022j4575
1397g563M506J3199j2352k250J1439j0279j579J2567j0271m419J5148o073r365
1410g292J1445l747p825J3382k556j1927J2336J958j3380Q157L844j1151R434
1423B678N197j4825M668R702j2238J903R489j0687J982J0912j2232l574J3324
1436F299o286m757J0954o382n956J2621n101j0290J2390R30r878Q639k50j0651
1450g718R833L728j2985O756P347j1003L845N356j1624M267J0698j1085j771J0780
1464F424q179k403R506q019k812J2764n656q450J0161k444o818R998j844r128
1478f900J0891J378j1932O478M124q941O834M140j2020M734P846j0848J003Q534
$$ plain form
1383 3615 4052 -6391 4456 3335 -10423 1649 7386 -7123 -414 7191 -5364 -10 7012 -7563
1397 -7563 -3057 10142 -2210 -4460 6979 -3300 -4879 7688 -2583 -7002 8146 2073 -7292
1410 -7292 4153 406 -7419 5963 3407 -8520 3816 5774 -7606 551 4395 -6756 2678
1423 2678 7875 -6950 -2282 7420 -4818 -2915 6574 -4113 -2131 8781 -3451 -7025 6299
1436 6299 13 -4744 6210 -172 -6128 6493 1392 -8898 3492 4422 -5456 3183 2933 -7718
1450 -7718 2115 5843 -7142 -386 6961 -4042 -197 5159 -6465 -2198 8500 -2585 -4356 6424
1464 6424 -1755 -4158 5348 -2671 -5483 7281 1625 -6825 3336 892 -5926 4072 2228 -6900
1478 -6900 3991 5369 -6563 -85 4039 -4902 1932 6072 -5948 -1214 6632 -4216 -3213 5321
1492E321p939Q84Q284j0070k096J1485o430m537R906m634m715J0039m582q161
1506g245J0742N45q736P116P07q770P544K415j0661O139O324r318K243M988q881
1521d848K957Q241r341l79R239o818k626P716o191k518J0893n228o881R097j904
1536A409o048P552j403o696Q870O27r924N777L446p580M964L503r244M612N660
1551E525r670J067P396o559P03O747q243r20R010n609l981Q409k840m464P909
1566D480m033n978R225k35p980O249J066p095N611J548q524N614N008q124J874
1581a294M564o812K161O233p650L39P854n815k753O667m794j623P914m585n029
1596d623P758j779n758N971q40m525O340L03p937N184L268o718L516L022o331
$$ plain form
1492 5321 -2618 -1734 6550 -3520 -5616 5869 -561 -5098 4808 174 -4541 5498 916 -7245
1506 -7245 3497 4042 -4694 2422 3129 -5641 1903 4318 -6343 -204 6120 -3198 -955 4033 -4848
1521 -4848 -1891 6350 -2991 -3370 5869 -949 -3575 4141 -2050 -4568 6325 1097 -5784 3313 1409
1536 1409 -4639 2913 1510 -5186 3684 4311 -5613 164 3610 -3970 994 4497 -4747 -135 5525
1551 5525 -4145 -3078 4318 -2241 -1538 5209 -3034 -3954 5056 -553 -4534 3875 1035 -3429 4480
1566 4480 447 -5531 3694 3459 -4521 1728 2794 -4301 1310 2858 -5666 -52 4956 -3168 -1294
1581 -1294 3270 -3542 -1381 4852 -2798 -2459 5395 -420 -3173 3494 -1300 -2923 4991 406 -4623
1596 -4623 3135 1356 -4402 1569 729 -3796 2544 2847 -5090 94 3362 -3356 160 3182 -3149
1611c149L716M140p886Q63O476n064m63N264n708j157P140n091l511P212k117
1626F65l472N822l185m269P373o82o231N375J355n843M444P87o231M700L820o945
1642b517J668L741n015J085M353n895Q37O181n194k168N275l043j865N907l574
1657b24l007O094j604m513M637l07l998N150N5o058M429K288n662K628K525m654
1673b221K493K845n795P90N145m437n77M468l808o43M869l948k403N999j888l022
1689b133M465k099l292N121m57m771M591Q77m687K969P53m467L543K314n144J732
1705f85L355m592R35L515m201M43M614m158j464M315k435j416M231k375k277M777
1721B582j572l792L664J96l046L390k43m380L653J545m513K181K233l622K027
$$ plain form
1611 -3149 567 4707 -3179 -2316 4160 -904 -1367 3897 -1811 -2968 4172 -919 -4430 2782 665
1626 665 -2807 3015 -170 -4439 2934 2252 -3979 1396 2751 -3092 1352 2139 -4092 608 4428 -2517
1642 -2517 -849 2892 -2123 -1038 3315 -2580 -1743 4438 -756 -2924 2351 -692 -2557 3350 -224
1657 -224 -3231 2863 1259 -3254 1383 1076 -2922 2228 2283 -3775 654 2942 -2720 -92 2433 -2221
1673 -2221 272 3117 -2678 -1888 3257 -1180 -1757 2711 -1097 -1740 3129 -819 -3222 2777 889 -2133
1689 -2133 2332 233 -3059 2062 1605 -3166 1425 2302 -2385 584 1337 -3130 413 2727 -2417 -685
1705 -685 2670 -1922 -987 2528 -1673 -1230 3384 -774 -2238 2077 -358 -1774 2457 82 -2195 2582
1721 2582 1010 -2782 882 1078 -1968 1422 1179 -3201 452 1997 -2516 -335 1898 -1724 303
1736C03K073m603J536L562l680m71L635k900m20L624l421j609M909k149k559L358
1752A188j152k333L913j098l386M071O50l649J989J139l257K534J706m181J422
1767d44K860l441K98K358k948M07L446l501q23L750k427j284L336j863j317L872
1783B279j633k933L264M7k629L032j12k884K670L26l319J440K154k949J300J370
1799A423k836O35K774l297J77K877j952p00K428k047r34L512j537k142K611l56
1815F36j987K551j140j890K965L29k922J468J033k509J790J108l000J254K315
1830B001k868m8K115j980K43K343k530l69K760j599j597K704j139q70K265j087
1846C44j712K128O6k176J923Qj831J761J40k171J331J321k379R68J366k146O45
$$ plain form
1736 303 2376 -2227 -691 2871 -809 -1280 2355 -545 -965 2659 -762 -2371 2538 389 -2170 1188
1752 1188 36 -2297 1616 518 -2868 1203 1853 -1796 193 1332 -1925 609 2315 -1866 -444
1767 -444 2416 -1025 -727 1631 -1317 -910 2536 -965 -1788 1962 -465 -1749 1587 -276 -1593 2279
1783 2279 646 -2287 977 1024 -1605 1427 1315 -1569 1101 1427 -1892 -452 1702 -1247 53 1423
1799 1423 -1413 -778 1996 -1301 -1124 1753 -199 -899 1529 -518 -1452 2060 523 -1619 992 636
1815 636 -1351 1200 60 -1830 1135 1464 -1458 10 1043 -1466 324 1432 -1568 -314 2001
1830 2001 -867 -915 1200 -780 -537 1806 -724 -1093 1667 68 -1529 1175 36 -834 1431 344
1846 344 -1368 760 826 -1350 573 581 -1250 511 651 -1520 -189 1132 -1247 -279 1087 -1059 -414
1863d14J623j962O0K101j445m98J670j301p94K118j037j404K118m76j403J544
1879E00m18j642K104K73j801J013P00j453J087L93j620R91J122j722Q3J432j643
1896f01K08J345j292n58J771j034q09J547m97q14J653q92j079J795k86j396J240
1913C01L03j475J398K01j242N12P25j387P01M40j242M64Q86r30m11J674q83n80
1931e45J089n09n33R25l11j028J230j03p23Q93j91q35J005J22r36L00O53p40Q7
1950a50M66q68L77Q72j110k7J140j078P8R01q21k1J015m24p66O62j98l16R20m96
1970A56o94Q42K09j112M84K83m59M03N10j304N41L75m55P4M90n07N0M08n91J17
1990a80N10l64l71O42j73n45P17k67k13K10J37k78J04L70m49K30J11l72R9L94
$$ plain form
1863 -414 1209 -753 -693 1408 -37 -535 1135 -166 -960 1158 121 -1283 835 359 -1044 500
1879 500 82 -1560 544 817 -984 29 729 -724 363 756 -864 127 1249 -473 -390 1042 -601
1896 -601 -393 952 -340 -898 873 -161 -970 577 80 -734 919 27 -1052 743 457 -939 301
1913 301 604 -871 527 728 -514 -2 723 -664 37 477 -765 -301 585 -345 -756 918 35 -545
1931 -545 544 35 -498 427 116 -912 318 215 -508 385 194 -641 364 486 -450 -150 503 -237 -150
1950 -150 316 -552 -175 697 -413 -440 700 -378 -300 601 -220 -241 774 350 -416 246 48 -268 652 156
1970 156 -538 304 513 -599 -115 168 -291 112 622 -682 -141 234 -221 -147 343 -164 -114 294 -297 -180
1990 -180 330 -34 -405 237 64 -481 236 -31 -244 -34 103 -175 -71 299 -150 80 191 -181 -82 312
2010C12om85P43q50K13L14o62L29M38r6k01L6J74n05L56K75p85K63J02J49N1K
2032A67l98K50J53k38J1J60Q0j92K43k46m8L88j91l44J83J50j47j54K83k30j1
2053a31M99n34O1M49m43lJ70o4l47M60M2n51K78M06o48K57L32m80J70J28m95N47
2075A03L20o60j51L93l1k81O45k74l83N39k02l16Q35o25k47M67N9m83N64j39m41
2096c08L41K36o86L22M64o73J11N37o01K69M55m51k74N16k52l45O03k62k60P47
2116D89l70m68L61Q0m25Q99k95p00N84L44q48N37L12p83K18P00j105R7R59o92
2136a06j07P61o71k38J268j097l33J042o99n47J257m52n96J167l76j193J046L14
2154D40j134P99M40j308J045L44j121L92Q24r25K1Q89j046k8J228j379j95J173
$$ plain form
2010 312 306 -179 564 -286 -73 241 -421 -92 346 250 49 85 259 -246 110 385 -400 -137 -35 114 165 167
2032 167 -231 19 172 -66 -55 105 185 -7 236 -10 -58 330 139 -205 -22 128 -19 -173 110 -120 -131
2053 -131 368 -166 -105 344 -99 -102 68 4 -343 117 159 -392 -114 292 -356 -99 233 -247 -77 51 -444 103
2075 103 423 -237 -388 5 -26 -307 338 64 -319 220 18 -298 537 -88 -335 132 191 -292 272 133 -308
2096 -308 33 269 -417 -95 369 -304 -193 344 -257 12 467 16 -258 258 6 -339 264 2 -258 489
2116 489 119 -349 12 92 -333 566 271 -429 155 499 -349 188 500 -283 -65 635 -470 -373 586 -106
2136 -106 -213 548 -123 -361 907 -190 -523 519 -180 -727 530 78 -518 649 273 -920 126 440
2154 440 -694 105 545 -763 282 626 -495 -103 721 -204 -183 706 -340 -368 860 -519 -714 459
2172D59l58l84L81n7p15J153k86j003J117j8p18P66L1j058O83M95j209Q95P04
2191H78j335M38Q13j262J5J315j230j56J338r05n44J543j300m86J512k96j139
2208h01J133j18j024J314j76j022J406j01j469P59Q34j421N91R38j614N54R81
2225G64j195nJ090q23l70J381j424p07K383o19j543J795q59o82J363l94j172J565
2243E48O7j439J126R4j385J118N94j755Q58J279j468p1J232j391J28J491j217
2260a91n36J637j010n98J501r20q36K035p29j505J928l31j340J278J42j434J337
2277D28N51k309R50J288j611N76J197k086M92J749j793l97K005j450k8J458j169
2294a49p93J834p35j302J787j74j518J708m09j493J744L54k004J501M26j707R47
$$ plain form
2172 459 101 -283 98 41 -674 479 193 -810 307 289 -429 337 368 -690 -7 488 -721 174 878
2191 878 -457 -19 794 -468 -453 862 -368 -524 814 -91 -635 908 -392 -878 634 338 -801
2208 -801 332 214 -810 504 328 -694 712 611 -858 -99 735 -686 -95 843 -771 -217 764
2225 764 -431 -436 654 -169 -539 842 -582 -1289 1094 475 -1068 727 -132 -814 549 155 -1017 548
2243 548 615 -824 302 396 -989 129 723 -1032 -174 1105 -363 -434 798 -593 -465 1026 -191
2260 -191 -727 910 -100 -698 803 -117 -953 1082 353 -1152 776 445 -895 383 525 -909 428
2277 428 979 -1330 -380 908 -703 -127 1070 -1016 -524 1225 -568 -965 1040 -410 -438 1020 -149
2294 -149 -942 892 157 -1145 642 468 -1050 658 249 -1244 500 854 -1150 351 777 -930 17
2311A7R81k265J008J500j905J66J728j844L72J561j822m05K270j358r59J739p13
2328G1j223K586j043j684K075j61j688J393L28j686J389P16k241J085J075j988
2344i96R31Q33j685M50J709j847o26K325j361n49J916j382q10K333j185j277K179
2361I58m76j555J810l00j662J586L20k013J442Q99k056J110R86k240Q19J827k158
2378g03K78J436j583K7J607j534n46K412j232j169K015r77j065K114q36j690K389
2395I43l56j985J631N29j996J912N14k607J175J308j688L09J185j827O50J552
2411A249j934o13K444j458m64K046j492j042K480j204j394K150l56j475J677M0
2427F54k206J931O55k399J488R46k199J150J031k373R66J838k393K98J812j693
$$ plain form
2311 17 998 -1267 -259 1241 -664 -498 1230 -614 -242 1319 -503 -908 1362 4 -955 784 71
2328 71 -1152 1434 391 -1293 782 621 -1067 326 654 -1032 357 1073 -1168 -83 992 -996
2344 -996 -65 768 -917 -467 1242 -605 -1231 1094 -267 -816 1100 -282 -1092 1241 56 -1221 958
2361 958 482 -1073 737 437 -1225 361 681 -1332 110 1009 -1047 63 1049 -1191 -372 1455 -703
2378 -703 -425 1011 -572 -545 1062 -472 -1018 1394 162 -1007 1008 31 -1034 1080 244 -1446 943
2395 943 587 -1398 233 762 -1234 678 1192 -1415 -240 1068 -620 -311 874 -953 -303 1249
2411 1249 -685 -1298 1146 -312 -776 1270 -222 -1264 1216 12 -1382 768 412 -1063 614 654
2427 654 -1552 379 1034 -1365 123 1069 -1130 20 1051 -1322 -356 1482 -911 -613 1199 -494
2443d94P6J640j754l46K339j654j246K380p50j498K584q22j897K380m37k035K035
2460E01L24j962J537O92k389J505J120k469P41J879k116M17J669k428K16K308
2476A545j696r12K574j787q75K448j445j737K986o88j629K027o4k157J942N79
2492A111k353J318J141k002P79Q09k286J351J647k603N30K247k002k04J945k079
2508f51o19K776j880r89K496r79j390K232q74j506K666m64k275K013N52k191J423
2525C40R22k627J297J365k520N00J957k379Q19J644k322J05K636k152n49K247
2541A283j315p78J950j456j007K350n20j906K272oj948J638M50k675J981J145
2557A458k584Q33J546k358J027J275k434O40K050j966k87K209j786l79K314j584
$$ plain form
2443 -494 -418 1222 -532 -878 1461 -193 -1439 941 191 -1307 1277 455 -1442 938 501 -1534 501
2460 501 825 -1137 400 1092 -1297 208 1328 -1141 -400 1479 -637 -220 1449 -979 -763 1545
2476 1545 -151 -1063 1511 -276 -1151 1297 -148 -1885 1101 413 -1216 811 747 -1410 532 1111
2492 1111 -1242 76 1217 -785 -6 803 -1483 -132 1515 -1088 -558 1689 -313 -517 1428 -651
2508 -651 -1270 1506 -374 -1363 1133 154 -1236 996 122 -1384 1282 818 -1457 556 1108 -1083 340
2525 340 1262 -1365 -68 1297 -1223 -723 1234 -1145 -326 1318 -1004 -899 1737 -415 -964 1283
2541 1283 -32 -810 1140 -316 -1323 1027 507 -1399 873 867 -1081 557 1007 -1668 313 1458
2557 1458 -1126 -293 1253 -1105 -78 1197 -1237 -597 1453 -513 -800 1409 -377 -756 1558 -26
2573b6j362K479o93j835K407n62j508K301o26k080J777O84k236J734L21k199J504
2590H0J250k754Q86J938k346L95K057k135l1K182j960o01K438j427o77J706j089
2607h8j230K486n29k211K020L45k161J681M21k042J669N28k082J018J255j991
2623i11Q60J334k251L92K214k265j02K077j719n28K142j448j179K494r11j632
2639a433K411n53j721K192p4k354J991N18k169J443J009k343J231J134k661J025
2655c54J703k152Q9K109k065p3K338k396K2K093j473j058K405j319j219K519o22
2672E47j989J919K36j818J543J31j916J778R62k705J320J413k410Q86R59j685
2688h29N02J976k310m24K298j518l67K041j690o14K205j113j472J921k50j945
$$ plain form
2573 -26 -1388 1091 398 -1437 970 408 -1100 1201 575 -1505 272 956 -1280 454 775 -1424 80
2590 80 1330 -1424 -538 1400 -946 -551 1506 -629 -660 1522 -438 -1039 1399 -28 -705 1001 -88
2607 -88 -1318 1168 639 -1572 448 793 -1368 313 734 -1308 361 889 -1193 -175 1080 -911
2623 -911 -51 1283 -968 -576 1638 -627 -729 1348 -371 -899 1243 -205 -1384 1110 199 -1433
2639 -1433 978 425 -1296 896 822 -1532 459 977 -1192 251 1260 -1083 148 1282 -1379 -354
2655 -354 1349 -803 -714 1395 -670 -743 1595 -801 -779 1314 -159 -1217 1188 -131 -1350 1169 547
2672 547 -1442 477 713 -1105 438 569 -1347 431 1393 -1312 8 1421 -989 -103 856 -829
2688 -829 -327 1649 -661 -1085 1213 -305 -672 1369 -321 -935 1270 157 -1315 606 356 -1589
2704a589K417m53j621J806L91k556J696R49j966J176P31k070Q86J497k182K07
2720f81J908j726r8J812j857k84K186j205j261K168p08j540K207p79j548K084
2736F78r7j714J439N33k144J556R72k672J772J091k448Q83J480k033M30K004k252
2753e22k58K192j666p61K360j774n87K259j372j467K315m85j556K082m01j496
2769a137J918J54k354J863Q18k267J091J065k207J053J367k218J90K120j802m27
2785g73J960k014k73K310j727o38K141j031r60K042q49j462K293l46j705J679
2801F47N5k130J757N84k320J354J263k117L11J518j932N20J908k237J2J836j462
2818d33l69J917j163q61K148j169j437K243l70j519J712k6j983K168j05k361J746
$$ plain form
2704 -1589 828 375 -1246 560 951 -1605 91 1040 -926 250 981 -1089 -203 1294 -888 -681
2720 -681 1227 -499 -597 1215 -642 -926 1260 55 -1206 962 254 -1286 921 142 -1406 678
2736 678 581 -1133 306 839 -1305 251 1223 -1449 323 1414 -1034 -151 1329 -704 -274 1730 -522
2753 -522 -780 1412 -254 -1015 1345 -429 -1016 1243 -129 -1596 719 234 -1322 760 359 -1137
2769 -1137 781 935 -1419 444 1262 -1005 86 1151 -1056 -3 1364 -854 -664 1456 -346 -773
2785 -773 1187 -827 -1100 1210 -517 -1155 986 -45 -1005 1037 188 -1274 1019 673 -1032 647
2801 647 702 -1428 329 913 -1407 -53 1210 -907 -596 922 -1010 -490 1418 -819 -807 1029 -433
2818 -433 -802 1115 -48 -909 1239 70 -1367 876 506 -1013 699 673 -1310 858 753 -1608 138
2835A38R15k046Q09R54k026J040J445j959j2K011j803Q8J737j705l87K136j367
2852c2q98J967r31j101J754n19j328K015l17k062J630P79j844J271L23j864J340
2869A83R93k280O68J676j974Q47J112j766o9J710j610k92J842j197o67J727p57
2886A46j493K291p63j252J807l02j521J497L36k025J553M72j744Q41J126j817
2902h48Q86J105j947N24J351j485k71J728j304l23J927j690n76K173j119q53J564
2919H42q88r68K022n38j629J868l5j932J473L80j658J111J078k265J088J085j734
2936g00M93J201j447P7J680j601o75J887r00r60K025q91j254K000n72j514J471
2953C20J65j478J527J50j822J240Q99j955Q86J056j862R55R45j861L41J604j603
$$ plain form
2835 138 1053 -993 -184 770 -1256 -216 1229 -730 -742 1269 -534 -446 1291 -414 -801 1335 -32
2852 -32 -930 1037 106 -995 759 240 -1088 927 610 -1452 178 957 -887 384 707 -1157 183
2869 183 1176 -1104 -436 1240 -734 113 1225 -541 -610 1100 -510 -802 1040 -157 -824 903 146
2886 146 -1347 944 181 -1071 736 434 -1087 410 746 -1279 274 746 -998 -157 969 -848
2902 -848 38 1143 -804 -280 1071 -414 -685 1043 -261 -584 1343 -347 -923 1250 131 -722 842
2919 842 -46 -1014 1008 470 -1159 709 674 -1258 215 595 -1063 48 1126 -1139 -51 1034 -700
2936 -700 -207 994 -453 -376 1304 -297 -972 915 15 -945 1080 189 -1065 935 363 -1151 320
2953 320 485 -993 534 684 -1138 102 1001 -954 -68 988 -874 81 1026 -835 -494 1110 -493
2970d93k2J583j403m50K047j512l23J784q93j613J997k53j465J885l57j839J658
2987C31K35j479R00P25j824J272R05j972N25J533j452j83J607j475q1J631j852
3004f54N9J694j167o47J296o56p31J761p29j465J735m8j297J131K86j501J181
3021B48N78j646Q31Q54j757P68J081j813N80J459j808l27J626q21n42J520j030
3038a99q91K318j301r72J924o69j309J689l46j153J635Kj806J027Q36j499O47
3055f7O10j381P71R88j601M37J136j330J38J261j383l46J540q64q15J608l94j330
3073a022J760l76j433J733m7j701J444J7j574J684J37j739J082O72j588Q44Q95
3090G88j500N88J312j904J89J756j414m88J592j312o57J858n55j340J940n37j339
$$ plain form
2970 -493 -515 1068 -335 -785 1262 -250 -573 1211 318 -1295 702 449 -1016 869 512 -1327 331
2987 331 566 -913 -13 712 -1112 160 1065 -907 -382 1151 -301 -484 1123 -352 -433 1198 -654
3004 -654 -595 1099 -68 -715 581 -75 -806 955 226 -1239 496 448 -849 282 568 -933 248
3021 248 826 -820 11 865 -892 -124 957 -856 -276 1183 -625 -952 674 -147 -689 831 -199
3038 -199 -1090 1228 -73 -1045 879 210 -1099 590 244 -909 726 728 -1078 -51 785 -714 -67
3055 -67 543 -838 -67 921 -680 -243 893 -437 -299 962 -421 -767 773 -91 -906 702 308 -1022
3073 -1022 738 362 -1071 662 615 -1086 358 375 -1199 485 622 -1117 -35 637 -951 -107 788
3090 788 -712 -124 1188 -716 -527 1229 -185 -673 919 -393 -1050 808 253 -1087 853 316 -1023
3107a023J765m67j376J595J6j542J446M35j955J358N61j647Q34Q63j394J50J487
3124A106j502M3J016q75l44J443j022o77J684r15p02J119k53r38J356j24j429
3141a014J444K8j260R61K48j114R44Q98j643M38O01j147K34J468j729r9J738j246
3159b50n87J387j023j76J402p46q12J409j52j284J192m2j056J238l1j183R96N55
3177H37j676R18O80j168N40P12j777L45J549j271n5J248j362j30J647j082o80
3194g25J593r34o03J455o27r94J242K15j356J065L73j327R69L39j643J035O93
3211G70j485K62J389j636M07J153j355J22J056r33m87J479r79l66J585r87p44
3228g49J484l52j248J260j37q42J028Nj570J055O85j705J037O62j239M99J111
$$ plain form
3107 -1023 742 275 -1101 494 510 -1032 414 849 -1106 252 813 -834 0 863 -531 -381 1106
3124 1106 -396 -353 663 -212 -556 887 -135 -812 872 -43 -745 374 121 -817 539 415 -1014
3141 -1014 430 458 -802 159 407 -707 237 1135 -508 -70 531 -616 -382 1086 -643 -742 996 -250
3159 -250 -837 550 -473 -649 753 7 -805 604 452 -832 360 318 -738 500 469 -714 282 837
3177 837 -839 79 759 -409 131 843 -934 -589 960 -311 -366 882 -480 -610 1037 -45 -725
3194 -725 868 -66 -669 786 159 -835 407 622 -734 331 704 -623 346 685 -958 77 770
3211 770 -715 -453 936 -700 -293 860 -495 -373 683 -250 -737 742 -237 -603 982 -5 -749
3228 -749 735 383 -865 395 258 -584 444 449 -1121 -66 619 -1086 -49 613 -626 -127 984
3245I84j854P40J035j213j93J319j305K6J398j315l25J247o93n54J355n52p49
3262f49J002m18o20J174o7j073J126Nj203R08O05j410M72J168j442PJ207j509
3280g17L44J408j042o13J582r22p09J444j048p7P81k9j035J011Q5j033R41k02
3298A69j038J195L17j501P34M42q83L92R27j305K75R57j085K15J023j178j70J168
3316F54p67n74J590o96n45J029o58p15J075K81j559J387n7j308J073L41j114P96
3334B33J94j093M80J084j146K66Q06j136l5P39p79%J320r12p35J515o25p13J269
3353G32n40p67J023O7j170J081J59j369R79M57j391R05N61j296K32J042j151O7
3371c79J063j445L80Q89n71l76J101q71n23J210o61o37J108j48o92J060m74p27
$$ plain form
3245 984 -870 -130 905 -308 -501 818 -487 -461 937 -378 -703 544 -149 -703 652 100 -649
3262 -649 353 -65 -685 489 422 -651 475 480 -723 185 790 -620 -148 1020 -422 -415 792 -717
3280 -717 -373 1035 -7 -620 962 40 -669 775 -273 -350 431 402 -633 378 463 -570 371 169
3298 169 -869 326 643 -858 -124 318 -565 -173 754 -551 -276 681 -404 -189 834 -344 -514 654
3316 654 -113 -687 903 207 -338 691 33 -682 393 674 -885 502 445 -863 210 551 -563 233
3334 233 427 -666 -186 898 -248 18 824 -312 -347 392 -387 -387 933 21 -714 801 176 -537 732
3353 732 192 -575 448 515 -655 426 585 -784 195 652 -739 166 727 -569 -337 705 -446 -379
3371 -379 684 -761 -381 508 -63 -439 662 -209 -732 478 -183 -820 288 140 -552 508 34 -693
3389f93J292m04q62J275M3j340Q91M29j383N79N63r67N29P64j012J30J095j235
3407c06k25J498j185k20R35n11m70R84l54r14J188j37q12R05m0j062Q97N50j475
3426g54O81N27r23M49P39j298K55J015j206J93J076q58n65J422r28p4P71k64r55
3445f97J072k20q80J143j10r22Q07K30j205Q80K73q22M62M63p97L64K55p68j30
3464f02J362j215K05Q44o51k30O45m17l68Q86n39m84J329q49p45J163p6p21P93
3483C30J01j034O82L77r76M90P92j138J20J052q18k70P46j101L75Q72q69j21J028
3502F38r01k32J314o69q59R95o7p22P05K1r01Q16K76r79O36L11o61M65M34j225
3522f05L75N80r61N64M80n26k77R89r21k3J000n65m31R77p09l29Q18k96l31K89
$$ plain form
3389 -693 599 195 -667 608 651 -689 202 631 -752 -173 390 -577 -48 716 -296 -166 929 -306
3407 -306 -531 967 -218 -438 497 -14 -484 500 146 -768 420 283 -529 376 336 -726 171 721 -754
3426 -754 -73 454 -469 -20 719 -579 -324 691 -515 -322 754 -104 -669 753 -175 -249 522 258 -697
3445 -697 375 155 -725 418 308 -614 193 423 -782 98 371 -451 11 474 -323 41 296 -472 -602
3464 -602 760 -455 -250 594 -57 -287 358 -59 -427 459 -80 -564 765 -84 -829 334 258 -463 330
3483 330 431 -603 79 456 -520 -30 762 -376 -256 796 -22 -292 454 -647 -272 600 -269 -390 638
3502 638 -263 -495 819 150 -709 286 219 -503 202 223 -678 138 414 -565 71 382 -279 186 620 -605
3522 -605 -230 350 -611 -47 433 -93 -370 619 -302 -325 675 110 -321 656 -53 -382 436 140 -191 98
3542I8L39j064Q08r3o64P48K7n40N15L36j139N69Q41j101P2N55n97M6P44n28m82
3563e10R76m63l00Q89o75k52N97l13m71P82l64n91R91J92p95N07K80j003N21N12
3583E10j120M43P68j193M76N47n71J1N29o74K46K81l50m26J019l65o26R07m53
3602d1o05P37K65r46O30J10m09N62j88l28J06N60q53K57N76q74K60P07p66o8P75
3623D67n92p0O87n25j37M58k13n31O74k59n07O97q6n47R68q8q64P91j3n60L58
3644A08K71p23M02K14n77R1L03k64J07M17l40j62O25m95l53P88l45n51P91j22
3664A85k95K67n8n42O73J82n93M39k26n88N04K83m01O9M50l94j64N77m04j55O82
3685D91n11j95L92q2l63O45j59o61P39j85n81O44n5k96K80R4n62N78j29l08J20
$$ plain form
3542 98 437 -627 181 88 -576 172 199 -341 174 510 -629 -60 781 -320 -248 307 -290 -244 500 -28 -510
3563 -510 466 3 -297 592 -83 -335 262 -51 -522 260 -104 -695 296 488 -307 200 480 -523 -2 510
3583 510 -610 -167 601 -592 -116 431 -140 -129 400 -274 -28 253 -97 -523 496 131 -495 412 -41
3602 -41 -646 91 356 -590 40 150 -259 303 115 -213 -107 453 -400 -143 433 -441 -181 526 -240 -308 467
3623 467 -125 -195 492 -33 -170 288 75 -456 218 -41 -548 149 63 -484 484 396 -468 323 310 -250 108
3644 108 379 -344 58 272 -305 -214 89 -175 -68 349 9 -153 472 -23 -376 412 67 -484 307 185
3664 185 -110 157 99 -443 230 412 -181 258 32 -556 -52 231 -170 -101 349 -45 -209 368 -36 -191 491
3685 491 -20 -215 177 95 -268 377 218 -443 296 111 -470 174 119 -177 103 197 -365 213 84 -224 -104
3706a04K65l83J67M88q25Q8L12k59Q0N71o47J40O58n26j9L23n18k33M86J17o45
3727d64O54J2m49M45J54o94K00L11k57Q7L48m86j10M07k01k29N62J32m96L86m09
3748i7q4N18m91j39O64n69l16P28O3n73M90no21N86m7j78O0M23o88K51L19m66
3770a72m4K06l7J6L44k79q3J41R0n34N51k19j91M80m69K8M10o0l74K66j01q7L88
3793B70k35j53J98N9k13J8K22m55L75K29n51o3L48j24J51o1j00j19M74j39l05
3814a74M05k20k7K13j86j09J57M4j68J45R9k68L38j15m76M56J24k71M9K09l60
3835a35J08M85l76K8K44l44N4J17P6p91M68J69l57K99r9j67K14O5l02K85J43p38
3857e54O55L1l54K46K12m18K45K4J55m58K41l55L33L21k57J23n6j19M1L76l40
$$ plain form
3706 -104 161 -222 -55 433 -392 -304 8 -251 -171 400 -247 -107 551 25 6 329 -189 -422 64 181 -464
3727 -464 190 202 -247 198 352 -342 -142 169 -88 -1 347 -139 -249 158 -43 -272 290 422 -74 312 -97
3748 -97 -181 337 -154 -293 371 -198 -514 214 277 -296 194 189 -432 154 107 -71 -11 412 -276 -25 294 -172
3770 -172 -216 -10 -47 -31 313 34 -49 92 182 -352 199 -20 -211 269 -200 -172 238 178 -196 70 -31 -118 270
3793 270 35 -118 80 139 -74 -56 166 -289 86 315 -236 -299 49 -75 76 15 -85 -204 270 131 -174
3814 -174 231 11 -16 197 11 -98 59 103 -65 80 179 -89 249 134 -342 114 238 -33 16 225 -135
3835 -135 -27 458 82 110 354 10 64 181 257 -534 -66 103 -254 45 -54 -221 -7 58 -244 41 184 -554
3857 -554 101 132 -222 24 236 -182 63 87 242 -216 25 -330 3 324 67 190 134 15 56 432 92
3878I2l49L59p1j20LJ79r6j80J28q8K89q5k31R6J57k72L02J7l55J9L92k39oJ18
3902E9k11J60J10k08O7M42n96p9J91J89k79N0rK9K62J92l58j16P2k68J04L04k22
3925a15N9M75p07L06N5mj97L20j81j31J09M2k34L79J5l16K78K01k09j0j51N8R4
3948A36Qj89j9K17j27k17M83m54KJ30K09l47K20m0m22O56n70J55N4J47j09N4K57
3971B34l02j85M58k36J54n6k58P8P8J7MJ21j4k26J92P2j3K0J12j15n4j57j00K54
3995G8n1Q3R5k60j10M13k40j11L27m07P5oM06n90J4L33n1rn0J02k4N3k58M41k97
4020d4k0k44K84K30l47L06k67K64p3J17o5J88l24P1j13J4k2L4J85l36K12J38j08
4043H0O8q9J38k30J13j33J93K03l49j05LJ18m64O07k69P0K33L09l94q9o0K36k24
$$ plain form
3878 92 -257 102 31 -89 -86 93 -3 -183 -55 -143 146 61 -170 -74 83 -189 113 130 -225 -206 186 -53 -59 59
3902 59 -152 8 118 -90 -23 419 -177 -256 -65 124 -155 -105 -114 -85 177 369 11 -105 -33 -301 -197 107 -115
3925 -115 -56 419 -288 18 73 69 -128 192 11 -120 -11 31 -203 176 191 -125 153 354 145 135 -16 42 136
3948 136 144 -45 -64 153 26 -191 292 -162 -160 -30 179 -168 52 12 -410 246 -324 -169 -115 32 -77 -23 234
3971 234 -68 -253 205 -31 123 67 -191 -113 -35 -18 -14 107 93 -133 59 131 118 138 250 135 81 -76 -176 78
3995 78 27 110 205 -55 -165 248 8 -103 224 -183 -108 -114 292 -298 -284 49 -2 -11 -61 41 17 70 -188 253 -44
4020 -44 -64 -308 -24 206 -141 165 -102 162 89 206 141 329 5 76 -37 -23 -45 -11 174 -162 50 188 80
4043 80 148 59 197 -33 80 -53 140 343 -6 -111 -108 10 -454 153 -116 -46 187 496 102 13 -47 189 -35
4066c5J89j38JJ65k40J47l1N3k31J96r8k35M77l37J14J86k03q4J67r7R3K17l40
4089f4j97J68J41j25P8j38J61k53J5J13J13M9oq5m2l3j2L05k13K16r0k71j1K09
4113B8j12J87k28M48k45n4K8j40K81p4j66K62l69L6J23R4j02r9K48l50Q7L48J5
4136B46l54j27P7J82o4j12J69J89n59J41L16k8j10jJ36l1J25J6m25O9J98j18Q7
4159B2J02o3j00j53K33M1Q1k14P9m6Q5k59K03r6j30M95n33K50O0p9j4P2j4l13
4183b91K85k38J26J52R2k85K3K72k99j6K49j30k23L56j46k1J56k02kJ39K14k44
4205c3K8M1m94K70L13m5j45L73m97L73l99J99RL12j54k21L08j34k46L89k51k73
4227b77M09P7k38j07J55k25M10j20l52j2K58l05K93J70m00K64J89m33J10L35j85
$$ plain form
4066 -35 154 16 17 182 -58 89 58 111 -120 76 -22 -257 220 -117 -3 183 -20 -104 63 -34 59 276 -64
4089 -64 -261 -93 48 -77 1 -137 24 -229 -214 -101 12 61 55 -30 -72 -105 -117 188 -25 191 101 -170 -181 28
4113 28 -84 103 -125 323 78 24 52 -88 193 119 -47 215 -154 -118 5 99 -3 -102 146 -204 -117 231 246
4136 246 -108 -235 -158 24 -40 -152 17 206 -353 -212 104 76 -34 -35 101 70 195 211 -214 -145 53 -65 22
4159 22 124 61 -39 -192 41 82 163 -51 28 -18 67 -192 11 -85 -215 280 -253 -3 57 -22 -36 36 22 -291
4183 -291 -6 -244 -118 34 126 -159 -136 136 -163 -179 70 -60 -283 73 -73 -94 62 -140 -142 -3 211 -33
4205 -33 -5 36 -458 -188 125 80 -65 308 -189 184 -215 -16 -7 305 151 -70 238 104 -142 247 -4 -277
4227 -277 132 209 -29 -136 19 -206 204 84 -268 -280 -22 -327 -34 136 -264 0 189 -244 -134 201 16
4248A6k80N87m15J61r6K55m91K44j78J55J10J33j67L4K04n91M20J56n15L20J22
4269A84j41J64j40j85J67n3j50L30P7l12k55N34k51L10k43p5j33K15K5m01O19
4290B86J13m82m4J92j0k04QK50m05M13J96l48l9K02j34n4l36M80J21k68J01J30
4312A68o7k34M33l20k22N40j86l78L47k15O5J29j20p6J01J49l40K43M06l78m2
4333CK83n49J48M12k19m09N82l58J79J81m01P6R8j54JJ42M4k40J91Qm1j31K48
4356I4k69J0L63k92Q4J15j04K6N6k33J15m6l75J49N49m14K5L54k93L7J17r2j33
4379a57J17K63m40K44L35n46K49J61m20O5M93m67L61j72k00R2K18m18R4K85j96
4400c9o9L85k11m73O94j87m82N89j64j98K93M8n62L59m0l39K93K10k08n6M91m73
$$ plain form
4248 16 -264 323 -92 69 -27 228 -263 -19 -197 -42 68 201 34 68 272 -319 101 257 -258 62 184
4269 184 43 207 67 -118 49 -4 -154 176 253 -59 -314 220 -31 279 36 -39 -172 43 68 -333 286
4290 286 399 -83 -127 65 55 -149 -141 109 -296 117 313 -35 -74 128 -6 -60 -396 84 205 -63 38 168
4312 168 101 -133 300 -20 -242 298 112 -266 81 -134 -69 60 -60 -136 -35 114 -226 17 423 45 3
4333 3 286 -263 -115 297 78 -331 251 -107 72 253 -148 -72 26 -128 -127 15 59 -181 10 18 -23 -154 94
4356 94 -175 -165 198 -94 -10 105 1 27 83 -150 -35 -81 -456 -307 242 -172 -147 207 -86 -49 68 -24 -157
4379 -157 -40 223 -217 27 362 -184 65 226 -194 -129 364 -103 258 86 -114 -22 196 -222 -128 157 -39
4400 -39 -108 277 66 -407 287 100 -382 207 43 -155 138 186 -376 -17 -57 -396 -103 107 -101 -157 334 -139
4422a39K71r5l24Q1M42l35M3J36m3k99L24j0l19K80j97p7M74j14l06J67J16l13
4444b37K72o9k23L58J22l86L36j34j40K48ol52K30L35m33j8M29j43k94Q0n2J20
4466D3M4j47M0m9J51k48p3L49j23L37k79m91N90K31l72J35j26k56J12O04p52J78
4488a02m3n1J24L64j99m00M27k6k38J63J77k07K4K94n36N28L0o21N37k6j52j89
4510a22L46n02L96n1j1R0j41k3qM79o98J06M98l07m17N08j69m3K47j35j56J58
4532D5j41J12j41R8j4J93O6m20K47J63l54l0M63m06k4M59l39Q8K85m07M0J49j23
4555Ik51M53k34j23M72k45m73M01K11m01L50l8m62J73J75j76L44j71k23L18R9
4576B08l36j72M70j57j37K05j48j65K38Q4l45K97j09J6K09j67k49M61O7m24L28
$$ plain form
4422 -139 132 37 -287 -206 236 -99 -56 80 37 -262 62 52 -267 13 -184 -261 213 99 -207 -40 76 -237
4444 -237 35 -34 -257 101 223 -163 173 39 -101 147 141 -211 19 354 -79 -97 332 189 -105 -25 -77 43
4466 43 87 -60 -20 -69 82 -166 -239 110 -13 324 45 -446 144 375 3 138 12 -244 -132 472 -280 -102
4488 -102 -145 -196 -72 292 93 -307 120 94 -144 19 196 -11 13 307 -229 299 329 -292 245 219 67 -122
4510 -122 224 -278 118 67 56 146 5 -18 -26 453 -245 -139 359 52 -365 143 -26 -69 178 43 -113 45
4532 45 -96 16 -125 -27 -41 152 218 -202 45 208 -146 -176 287 -119 -143 316 -23 65 350 -57 -17 132 9
4555 9 -242 211 -23 -146 326 81 -392 9 220 -181 169 131 -331 -158 17 -159 185 14 -209 109 208
4576 208 -128 -300 170 13 -124 81 -67 -232 6 90 -255 42 -67 -51 158 -9 -258 203 270 -154 174
4597A74j9m83K31L85n70L04K32k17j18K51m32L3M87l30N1J68l19Q1K14l56Q3M38
4619B88j57j93K85k1j99qk15M5L40O0p02O17K2n84M38J56l71K66K22n51L16K6
4641H0l18j10O43n27q2M61j83k16N59k68k84M11k97j89M71j21l51M30k46j22J93
4662f6K26o59M36K91l62J0N58o23J10K76l06j30M90k42m93P28m66m0N26n36j3
4683b85N05j28k17K62j6l26N50k64k58M54j72k83J03M25l83O0K25l61J40J80n19
4704c08j8N87l06o0M80p47K51L34R3p11O54j68k52K93J50l92L11l40j76L79J42
4725A96k20J35J91p11N12j9j38J02P3j97k0M15l17l40O48j65k52L14k19k12N18
4746B94j19k23L1K78k79J07o7k2K31l26q5L41P5m13J62R3l01J88M01m27j21N44
$$ plain form
4597 174 155 -328 -97 288 -282 22 254 37 -81 170 -262 -229 258 -72 -21 147 -172 -91 123 -233 -150 288
4619 288 131 -62 223 202 3 -5 -220 -175 165 225 -477 140 162 -422 16 172 -199 67 289 -262 54 80
4641 80 -238 -348 295 -232 -314 147 -36 -252 307 39 -245 166 -131 -320 151 30 -321 109 -137 -259 -66
4662 -66 160 -499 -63 228 -134 -124 434 -189 -79 197 -109 -239 251 9 -484 244 -222 -262 264 -272 -285
4683 -285 220 92 -125 137 121 -205 345 81 -177 277 105 -178 -75 350 -33 27 252 -109 31 211 -308
4704 -308 -326 261 -45 -105 375 -372 -121 213 306 -405 249 81 -171 122 272 -120 191 -149 -325 54 196
4725 196 -24 111 302 -409 103 84 -54 48 121 -76 -96 319 2 -338 310 145 -107 207 -12 -224 294
4746 294 175 -48 -17 261 -18 89 22 0 231 -95 -180 161 236 -177 -15 78 -223 -35 366 -61 -182 362
4768C62l97n0L03j76kK71m15j53L84k20j37M98r4m60O61k61k53K92J07l24L54
4789B90L2l99N9J80l86J53J81j52j67O34m9n00L95q6k40J95n41K15J63j50k02
4810c75M65p2mK13j26k05L23j88k27M13k29k85N5L12k79n5L84J4J70j93j72L8
4832b3L71k18j10O3j73j32M94k48n34P70l50k74L34O5j18J86J03l96K04J68l95
$$ plain form
4768 362 -35 -85 218 42 40 311 -104 -257 127 -93 -230 268 174 -286 375 114 -139 153 260 -64 290
4789 290 322 -77 -18 162 -224 -71 110 -42 -209 425 376 -124 271 185 -55 140 -401 -186 -23 -173 -375
4810 -375 90 18 14 227 101 -104 219 31 -196 217 -12 -297 -242 70 -209 -264 120 134 304 111 -61 -23
4832 -23 348 130 20 83 -90 -222 272 24 -510 260 -90 -364 -30 35 -83 103 206 -190 14 182 -213
$$ [...]
8191a28
##END NTUPLES=NMR FID
##END=
