##TITLE=1H_Pr 2056
 CDCl3,8 sc, 
 1.03.2021
##JCAMPDX= 6.0         $$ Bruker NMR JCAMP-DX V2.0
##DATA TYPE= NMR FID
##DATA CLASS= NTUPLES
##ORIGIN= UXNMR, Bruker Analytische Messtechnik GmbH
##OWNER= root
$$ XWIN-NMR		Version 3.5
$$ Mon Mar  1 12:46:27 2021 Russian Standard Time (UT+4h)  she@DPX200
##.OBSERVE FREQUENCY= 200.1315066352
##.OBSERVE NUCLEUS= ^1H
##.DELAY= (6, 6)
##.ACQUISITION MODE= SIMULTANEOUS
##.ACQUISITION SCHEME= undefined
##.AVERAGES= 8
##.DIGITISER RES= 18
##SPECTROMETER/DATA SYSTEM= spect
##.PULSE SEQUENCE= zg30
##.SOLVENT NAME= CDCl3
##.SHIFT REFERENCE= (INTERNAL, CDCl3, 0, 15.7039)
##AUDIT TRAIL= $$ (NUMBER, WHEN, WHO, WHERE, WHAT)
$$ ##TITLE= Audit trail, XWIN-NMR		Version 3.5
$$ ##JCAMPDX= 5.01
$$ ##ORIGIN= Bruker BioSpin GmbH
$$ ##OWNER= she
$$ F:/spectra/data/she/nmr/H-F/1/audita.txt
$$ ##AUDIT TRAIL=  $$ (NUMBER, WHEN, WHO, WHERE, WHAT)
(   1,<2021-03-01 12:45:21.06 +0400>,<she>,<DPX200>,
      <created by zg, POWCHK disabled, PULCHK disabled
       configuration hash MD5:
       00 E9 B6 7A A2 85 ED C7 34 08 36 98 17 FE 4E 26
       data hash MD5: 16K
       3E 4F AD 40 DF A3 B6 7D 51 4F 04 A8 78 37 B7 BA>)
$$ ##END=
$$ 
$$ hash MD5
$$ CF 46 FE CA 88 A8 81 D6 82 F0 F0 C4 28 BF 7B CB
##$RELAX= 
##$RELAX= 
##$RELAX= 
##$RELAX= 
##$RELAX= 
##$RELAX= 
$$ Bruker specific parameters
$$ --------------------------
##$DU= <F:/spectra>
##$EXPNO= 1
##$NAME= <H-F>
##$PROCNO= 1
##$TYPE= <nmr>
##$USER= <she>
##$AMP= (0..31)
100 100 100 100 100 100 100 100 100 100 100 100 100 100 100 100 100 100 
100 100 100 100 100 100 100 100 100 100 100 100 100 100 
##$AQSEQ= 0
##$AQ_mod= 1
##$AUNM= <au_zg>
##$AUTOPOS= <>
##$BF1= 200.13
##$BF2= 200.13
##$BF3= 200.13
##$BF4= 200.13
##$BF5= 200.13
##$BF6= 200.13
##$BF7= 200.13
##$BF8= 200.13
##$BYTORDA= 1
##$CFDGTYP= 0
##$CFRGTYP= 5
##$CHEMSTR= <none>
##$CNST= (0..31)
1 1 145 1 1 1 1 1 1 1 1 1 1 1 1 1 1 1 1 1 1 1 1 1 1 1 1 1 1 1 1 1 
##$CPDPRG= <>
##$CPDPRG1= <>
##$CPDPRG2= <>
##$CPDPRG3= <>
##$CPDPRG4= <mlev>
##$CPDPRG5= <mlev>
##$CPDPRG6= <mlev>
##$CPDPRG7= <mlev>
##$CPDPRG8= <mlev>
##$CPDPRGB= <>
##$CPDPRGT= <>
##$D= (0..31)
0 1.2 0 0 0 0 0 0 0 0.06 0 0.03 0 0 0 0 0.0002 0 0 0 0 0 0 0 0 0 0 0 0 
0 0 0 
##$DATE= 1614588320
##$DBL= (0..7)
120 120 120 120 120 120 120 120 
##$DBP= (0..7)
150 150 150 150 150 150 150 150 
##$DBP07= 0
##$DBPNAM0= <>
##$DBPNAM1= <>
##$DBPNAM2= <>
##$DBPNAM3= <>
##$DBPNAM4= <>
##$DBPNAM5= <>
##$DBPNAM6= <>
##$DBPNAM7= <>
##$DBPOAL= (0..7)
0.5 0.5 0.5 0.5 0.5 0.5 0.5 0.5 
##$DBPOFFS= (0..7)
0 0 0 0 0 0 0 0 
##$DE= 6
##$DECBNUC= <off>
##$DECIM= 32
##$DECNUC= <off>
##$DECSTAT= 4
##$DIGMOD= 1
##$DIGTYP= 9
##$DL= (0..7)
0 120 120 120 120 120 120 120 
##$DP= (0..7)
150 150 150 150 150 150 150 150 
##$DP07= 0
##$DPNAME0= <>
##$DPNAME1= <>
##$DPNAME2= <>
##$DPNAME3= <>
##$DPNAME4= <>
##$DPNAME5= <>
##$DPNAME6= <>
##$DPNAME7= <>
##$DPOAL= (0..7)
0.5 0.5 0.5 0.5 0.5 0.5 0.5 0.5 
##$DPOFFS= (0..7)
0 0 0 0 0 0 0 0 
##$DQDMODE= 0
##$DR= 18
##$DS= 0
##$DSLIST= <SSSSSSSSSSSSSSS>
$$ [...]
##$SUBNAM2= <"">
##$SUBNAM3= <"">
##$SUBNAM4= <"">
##$SUBNAM5= <"">
##$SUBNAM6= <"">
##$SUBNAM7= <"">
##$SUBNAM8= <"">
##$SUBNAM9= <"">
##$SW= 16.9725356469052
##$SWIBOX= (0..15)
0 0 2 0 0 0 0 0 0 0 0 0 0 0 0 0 
##$SW_h= 3396.73913043478
##$TD= 16384
##$TD0= 1
##$TE= 0
##$TE2= 300
##$TE3= 300
##$TEG= 300
##$TL= (0..7)
0 120 120 120 120 120 120 120 
##$TP= (0..7)
150 150 150 150 150 150 150 150 
##$TP07= 0
##$TPNAME0= <>
##$TPNAME1= <>
##$TPNAME2= <>
##$TPNAME3= <>
##$TPNAME4= <>
##$TPNAME5= <>
##$TPNAME6= <>
##$TPNAME7= <>
##$TPOAL= (0..7)
0.5 0.5 0.5 0.5 0.5 0.5 0.5 0.5 
##$TPOFFS= (0..7)
0 0 0 0 0 0 0 0 
##$TUNHIN= 0
##$TUNHOUT= 0
##$TUNXOUT= 0
##$USERA1= <user>
##$USERA2= <user>
##$USERA3= <user>
##$USERA4= <user>
##$USERA5= <user>
##$V9= 5
##$VALIST= <valist>
##$VCLIST= <CCCCCCCCCCCCCCC>
##$VD= 0
##$VDLIST= <DDDDDDDDDDDDDDD>
##$VPLIST= <PPPPPPPPPPPPPPP>
##$VTLIST= <TTTTTTTTTTTTTTT>
##$WBST= 1024
##$WBSW= 4
##$XGAIN= (0..3)
0 0 0 0 
##$XL= 0
##$YL= 0
##$YMAX_a= 213174
##$YMIN_a= -224409
##$ZGOPTNS= <>
##$ZL1= 120
##$ZL2= 120
##$ZL3= 120
##$ZL4= 120
##$ABSF1= 10
##$ABSF2= 0
##$ABSG= 5
##$ABSL= 3
##$ALPHA= 0
##$AQORDER= 0
##$ASSFAC= 0
##$ASSFACI= 0
##$ASSFACX= 0
##$ASSWID= 0
##$AUNMP= <proc_1d>
##$AZFE= 0.1
##$AZFW= 0.1
##$BCFW= 1
##$BC_mod= 2
##$BYTORDP= 1
##$COROFFS= 0
##$CY= 11.3945322036743
##$DATMOD= 1
##$DC= 2
##$DFILT= <>
##$DTYPP= 0
##$F1P= 15.9154993809931
##$F2P= -4.1035820241983
##$FCOR= 0.5
##$FTSIZE= 0
##$FT_mod= 4
##$GAMMA= 1
##$GB= 0.15
##$INTBC= 1
##$INTSCL= 1
##$ISEN= 128
##$LB= 0.24
##$LEV0= 0
##$LPBIN= 0
##$MAXI= 10000
##$MC2= 0
##$MEAN= 0
##$ME_mod= 0
##$MI= 1.114404
##$NCOEF= 0
##$NC_proc= 0
##$NLEV= 6
##$NOISF1= 3.799351
##$NOISF2= 2.8
##$NSP= 1
##$NTH_PI= 0
##$NZP= 0
##$OFFSET= 15.70392
##$PC= 1
##$PHC0= -10767.75
##$PHC1= 18.20094
##$PH_mod= 1
##$PKNL= yes
##$PPARMOD= 0
##$PSCAL= 0
##$PSIGN= 0
##$REVERSE= no
##$SF= 200.130013532006
##$SI= 16384
##$SIGF1= 3
##$SIGF2= 2
##$SINO= 400
##$SIOLD= 16384
##$SREGLST= <1H.CDCl3>
##$SSB= 0
##$STSI= 0
##$STSR= 0
##$SW_p= 3612.71676300578
##$SYMM= 0
##$S_DEV= 0
##$TDeff= 0
##$TDoff= 0
##$TI= <>
##$TILT= no
##$TM1= 0
##$TM2= 0
##$TOPLEV= 0
##$USERP1= <user>
##$USERP2= <user>
##$USERP3= <user>
##$USERP4= <user>
##$USERP5= <user>
##$WDW= 1
##$XDIM= 8192
##$YMAX_p= 0
##$YMIN_p= 0
$$ End of Bruker specific parameters
$$ ---------------------------------
##NTUPLES= NMR FID
##VAR_NAME=  TIME,          FID/REAL,        FID/IMAG
##SYMBOL=    X,             R,               I
##VAR_TYPE=  INDEPENDENT,   DEPENDENT,       DEPENDENT
##VAR_FORM=  AFFN,          ASDF,            ASDF
##VAR_DIM=   8192,          8192,            8192
##UNITS=     SECONDS,       ARBITRARY UNITS, ARBITRARY UNITS
##FACTOR=    0.0002944,     1,               1
##FIRST=     0,             0,               0
##LAST=      2.4114304,     0,               0
##MIN=       0,             -224409,         0
##MAX=       2.4114304,     213174,          0
$$ Real data points
##PAGE= N=1
##DATA TABLE= (X++(R..R)), XYDATA
$$ [...]
$$ plain form
1926 -498 130 222 -99 -211 7 114 -553 97 106 -238 136 143 155 -165 450 161 -134 84 20 -350 137 449
1948 449 -410 -25 122 -335 -290 367 -61 -323 508 -250 244 164 273 -76 58 324 -51 104 265 201 -312
1969 -312 -91 77 -373 474 276 -347 -234 287 -310 2 565 -6 341 127 127 -233 409 -264 -168 -83 -259
1990 -259 273 -334 496 -288 -86 -103 125 287 -292 380 -16 -296 235 303 -345 332 679 -269 551 233 -213
2011 -213 71 170 117 -319 475 45 -457 168 472 -461 331 739 -533 79 896 233 -429 581 -112 -280
2031 -280 617 -480 -330 150 805 379 31 845 377 198 202 123 416 -893 580 -42 -805 121 673 -16
2051 -16 55 -145 272 271 424 -150 197 536 88 -350 18 266 -241 366 -109 -765 631 26 -443 -265 341
2072 341 -411 -186 95 -540 -225 569 156 -301 6 138 -104 133 106 -22 -327 448 -190 -474 291 -56
$$ packed form
1926d98O28R2l21j12K18J07o67O50Rl44L74PJ2l20O15k89k95K18o4l70M87L12
1948D49q59L85J47m57M5O57m28k62Q31p58M94q0J09l49J34K66l75J55J61o4n13
1969c12K21J68m50Q47j98o23J13N21n97L12N63n71L47k14%l60O42o73R6Q5j76
1990b59N32o07Q30p84K02j7K28J62n79O72l96k80N31O8o48O77L47r48Q20l18m46
2011b13K84R9n3m36P94m30n02O25L04r33P92M08j272O12Q17o63o62J010o93j68
2031b80Q97j097J50M80O55m26l48Q14m68j79Mp9K93j309J473o22p63R26N52o89
2051a6P1k00M17jJ53n74L47L39m48m38L68K48n07O07m75o56J396o05m69J78O06
2072C41p52K25K81o35L15P94m13m57L07J32k42K37k7j28l05P75o38k84P65l47
$$ plain form
2092 -56 136 -285 -33 -85 -240 87 -378 199 -78 -175 -388 -73 -32 -345 -6 -3 -353 -151 504 50 -14 221
2114 221 313 -342 343 200 -199 320 282 -201 -448 356 -18 -345 381 -13 -279 -27 360 -451 142 75 -264
2135 -264 -14 123 126 -445 159 -52 -395 365 143 -132 -58 534 -412 -126 86 -41 -14 -63 328 -527 -50 266
2157 266 -339 -198 394 117 -383 104 -176 -271 -50 38 -189 -70 554 -294 92 205 261 -311 227 173 -349
2178 -349 264 292 -351 -391 497 -55 48 388 -10 -58 318 216 -489 131 142 -26 -54 207 -230 -302 404 -79
2200 -79 -156 125 368 73 167 185 -104 -240 103 -142 -319 162 259 -580 60 127 -350 108 352 -284 -129 329
2222 329 -219 -65 -188 -68 -413 254 264 -59 101 8 481 -82 281 -210 -395 367 -11 -349 -248 294 -430
2243 -430 -214 100 -52 -25 183 197 -234 93 39 -152 -195 194 -191 -132 191 -26 131 128 195 -83 17 394 -85
$$ packed form
2092e6J92m21K52n2j55L27m65N77k77r7k13L15M1l13L39Ll50K02O55m54o4K35
2114B21R2o55O85j43l99N19l8m83k47Q04l74l27P26l94k66K52L87q11N93o7l39
2135b64K50J37Ln71O04k11l43P60k22k75P4N92r46K86K12j27K7m9L91q55M77L16
2157B66o05J41N92k77n00M87k80r5K21Q8k27J19O24q48L86J13N6n72N38n4n22
2178c49O13K8o43m0Q88n52J03L40l98m8L76j02p05O20J1j68k8K61m37p2P06m83
2200g9p7K81K43k95R4J8k89j36L43k45j77M81R7q39O40O7m77M58K44o36J55M58
2222C29n48J54j23J20l45O67J0l23J60r3M73n63L63m91j85P62l78l38J01N42p24
2243d30K16L14j52K7K08J4m31L27n4j91m3L89l85N9L23k17J57lO7k78J00L77m79
$$ plain form
2266 -85 228 455 -85 -271 374 254 -468 280 -23 -146 -97 379 -311 35 458 -329 -313 36 -15 -609 110
2287 110 -70 -332 -147 97 -217 -187 441 -164 -352 415 -64 -472 99 365 -267 47 433 -286 -286 276 -3
2308 -3 -374 387 -32 88 -148 296 -522 -166 310 -95 -143 168 109 -133 376 239 -160 278 221 -114 -139 292
2330 292 -157 -370 388 -26 -216 199 347 -178 155 308 -238 -189 203 -383 -330 370 -40 -185 39 234 132
2351 132 -201 395 125 -178 157 -123 -245 -72 -60 -457 129 277 -237 93 335 100 1 128 -176 -204 89
2372 89 84 -600 -341 193 -793 -556 777 -239 -158 72 218 -158 132 180 -203 141 174 -329 -6 129 -21
2393 -21 -72 261 390 -475 484 191 -31 81 237 -50 -321 461 -152 -150 185 41 -229 167 285 -542 77
2414 77 170 19 -316 153 -2 -364 214 -48 -383 181 481 -201 -272 387 -24 -235 128 292 -241 98 133
$$ packed form
2266h5L13K27n40j86O45j20p22P48l03j23M9M76o90L46M23p87J6L49n1n94P19
2287A10j80k62J85K44l14L0O28o05j88P67m79m08N71K66o32L14L86p19%N62k79
2308cl71P61m19J20k36M44q18L56M76m05m8L11n9k42N09j37l99M38n7l35k5M31
2330B92m49k13P58m14j90M15J48n25L33J53n46M9L92n86N3P00m10j45K24J95j02
2351A32l33N96k70l03L35k80j22J73J2l97N86J48n14L30K42k35r9J27l04k8K93
2372H9no84K59N34r86K37J333j016Q1K30J46l76K90M8l83L44L3n03L23J35j50
2393b1n1L33J29q65R59k93k22J12J56k87k71P82o13KL35j44k70L96J18q27O19
2414G7R3j51l35M69j55l62N78k62l35N64L00o82p1O59m11k11L63J64n33L39L5
$$ plain form
2435 133 -265 38 226 59 -437 505 92 -301 360 121 -434 62 240 -422 -179 64 -61 -186 201 123
2455 123 -167 495 279 -172 -209 202 -484 -122 103 -393 -201 59 150 -330 254 163 -334 280 60 -102 -380
2476 -380 213 -221 -339 415 -71 -210 250 365 -222 175 394 -91 -20 218 98 -329 246 94 -428 316
2496 316 542 -154 -294 288 -45 -12 378 189 -355 105 385 -247 6 48 -286 -132 418 -206 -277 382 62
2517 62 -113 -106 380 -442 -125 -49 -391 -47 31 12 -461 125 191 -122 319 154 -248 -188 358 -402 -275 206 -95
2540 -95 -268 237 278 -388 212 175 -107 18 182 -228 -315 334 -125 -2 380 172 -309 169 266 -194 165 381
2562 381 68 -282 2 -33 -421 101 132 -367 78 359 -18 -25 438 -248 -64 279 141 -445 97 365 -439
2583 -439 -153 99 -77 -48 200 -132 -172 186 127 -399 -66 81 -335 -286 -55 -366 -267 69 32 -555 78 251
$$ packed form
2435A33l98L03J88j67m96R42m13l93O61k39n55M96J78o62K43K43j25j25L87p8
2455A23k90O62k16m51l7M11o86L62K25m96J92K60R1m80N84r1m97O14k20j62k78
2476c80N93m34j18P54m86j39M60J15n87L97K19m85P1K38j20m27N75j52n22P44
2496C16K26o96j40N82l33L3L90j89n44M60K80o32K53M2l34J54N50o24p1O59l20
2517F2j75PM86q22L17P6l42L44P8j9m73N86O6l13M41j65m02O0N46p60J27M81l01
2540i5j73N05M1o66O00l7k82J25J64m10q7O49m59J23L82k08m81M78R7m60L59K16
2562C81l13l50K84l5l88N22L1m99M45K81l77pM63o86J84L43j38n86N42K68q04
2583d39K86K52j76K9K48l32m0L58n9n26L33J47m16M9K31l11R9L36l7n87O33J73
$$ plain form
2605 251 -137 6 357 -360 -118 305 -403 -336 -23 255 -388 190 223 -329 240 289 -359 -16 310 -72 -418
2626 -418 156 -24 -303 -70 268 -304 285 658 -155 239 251 -12 -373 102 -58 -226 -122 235 -249 -89
2646 -89 568 110 -92 250 230 -352 171 254 -378 -150 114 -225 -305 468 77 -266 416 123 -115 324 268 -388
2668 -388 -22 -8 -294 -341 137 -60 -237 448 -11 133 369 104 -227 -15 163 -301 -346 271 -206 -300 13
2689 13 230 -326 291 365 -172 -144 221 -262 -353 546 -380 -295 51 373 -202 -143 424 -171 16 422 -20 2
2711 2 271 97 -339 17 55 -188 -116 513 -247 -57 373 -3 -315 505 261 -343 294 114 -254 20 -13 -247
2733 -247 -182 503 139 -295 297 67 -196 -46 294 -221 -250 326 -37 -374 201 348 -352 565 294 -215 -227
2754 -227 68 -194 -248 190 -390 -450 -36 23 -273 232 115 -322 176 274 -259 -43 239 -187 -140 394 204 -513
$$ packed form
2605B51l88J43L51p17K42M23p08O7L13K78o43N78L3n52N69M9o48L43L26l82l46
2626d18N74j80k79K33L38n72N89L73q13L94J2k63l61M75j60j68J04L57m84J60
2646h9O57m58k02L42k0n82N23Q3o32K28K64l39q0P73l91l43O82k93k38M39n6o56
2668c88L66J4k86m7M78j97j77O85m59J44K36k65l31K12J78m64m5O17m77r4L13
2689A3K17n56O17P4n37K8L65m83r1Q99r26Q5L46L22n75N9N67n95J87M06m42K2
2711BK69j74m36L56L8k43P2O29p60J90M30l76l12Q20k44o04O37j80l68K74l3k34
2733b47O5O85l64m34N92k30k63J50L40n15k9N76l63l37N75J47p00R17k71n09j2
2754b27K95k62n4M38n80o0M14N9k96N05j17m37M98R8n33K16K82m26M7N34j90p17
$$ plain form
2776 -513 205 231 -158 160 469 -175 -62 392 129 -202 3 102 -536 27 103 -219 -287 627 -129 -140 410 151
2798 151 -237 315 373 -205 12 -106 -102 100 113 87 -275 307 106 160 228 592 -463 -62 -15 -189 -314 -1
2820 -1 -259 -544 237 267 -321 388 195 138 -331 468 -54 -343 -57 -178 -925 -593 371 -238 529 722 -347
2841 -347 -104 412 -175 -118 421 -120 -504 64 137 -237 -131 366 -225 88 549 30 86 390 261 -394 212
2862 212 287 -285 -53 357 -206 -225 365 -55 -11 205 374 22 253 -1 -244 -191 227 -177 -310 494 -189
2883 -189 -53 308 314 -61 58 427 -293 -272 22 -454 -315 200 -33 -225 142 133 -152 -34 299 -142 -393 256
2905 256 -392 -76 -180 -178 -409 33 239 -282 9 249 90 -133 397 1 -201 231 153 -268 -150 234 -429
2926 -429 17 368 -264 40 374 252 -152 388 36 -508 188 -113 -446 -166 251 -305 -63 131 158 12
$$ packed form
2776e13P18K6l89L18L09o44J13M54k63l31K05R9o38N63P6l22o8R14p56j1N50k59
2798A51l88N52N8n78K17j18MK02J3k6l62N82k01N4O8L64j055M01M7j74j25L13
2820ak58k85P81L0n88P09j93n7m69P99n22k89K86j21p47L32R64o09P67J93j069
2841c47K43N16n87N7N39n41l84N68P3l74J06M97n91L13M61n19N6L04j29o55O06
2862B12P5n72K32M10n63j9N90m20M4K16J69l52K31k54k43N3M18m04j33Q04o83
2883a89J36L61Ol75J19L69p20K1K94m76J39N15k33j92L67rk85J18L33m41k51O49
2905B56o48L16j04Kk31M42K06n21K91K40j59k23N30l96k02M32p8m21J18L84o63
2926d29M46L51o32L04L34j22m04N40l52n44O96l01l33K80M17n56K42J94K7j46
$$ plain form
2946 12 284 197 -347 4 9 -248 -359 88 -152 -352 506 83 -264 118 241 -292 80 323 -298 -127 -93 39
2968 39 -338 173 -29 -338 115 34 -96 -85 207 -150 -133 21 -141 -75 69 2 -400 362 260 -148 -27 285
2990 285 153 -206 437 -217 -214 52 170 -446 25 351 -263 -65 263 137 -139 462 243 -277 399 -78 -139
3011 -139 -200 -12 -144 -110 416 -47 -182 313 378 -25 401 4 -284 -2 69 -97 -361 180 -76 -268 241
3032 241 126 -28 207 397 -162 353 348 -370 -109 -41 -271 -412 186 -141 -126 238 177 -115 118 545 -19 -275
3054 -275 196 -204 -461 -228 -16 -473 52 163 -225 -78 441 -45 -147 385 50 -196 -45 106 -416 -312
3074 -312 319 -310 -89 391 243 -293 393 104 -33 -22 -52 -299 -211 358 -410 -176 303 -178 -44 366 366 -152
3096 -152 414 356 -271 -221 81 -43 -268 353 -179 -131 336 204 -12 -60 498 -251 -177 29 -86 -460 -59 5
$$ packed form
2946A2K72q7n44L51Nk57j11M47k40k00Q58m23l47L82J23n33L72K43o21J71L4J32
2968C9l77N11k02l09M53q1j30J1K92l57J7J54j62O6J44o7m02P62j02m08J21L12
2990B85j32l59O43o54LK66J18o16M71L26o14J98L28j26k76O01k19n20O76m77o1
3011a39o1J88j32L4N26m63j35M95O5m03M26l97k88K82P1j66k64N41k56j92N09
3032B41j15j54K35J90n59N15np18K61O8k30j41N98l27J5L64o1k92K33M27n64k56
3054b75M71m00k57K33K12m57N25J11l88J47N19m86j02N32l35k46J51J51n22J04
3074c12O31o29K21M80j48n36O86k89j37J1l0k47Q8N69p68K34M79m81J34M10%n18
3096a52N66n8o27N0L02j24k25O21n32M8M67j32k16m8N58p49P4K06j15l74M01O4
$$ plain form
3118 5 -204 47 6 -150 37 467 29 -12 253 -324 -280 27 95 -491 -67 -18 -173 -149 304 76 -244 666 -196
3141 -196 -139 388 -105 -83 74 295 -250 -212 258 53 -43 740 216 -286 103 36 55 38 137 -355 -183 437 -12
3164 -12 309 208 337 262 398 -37 -238 27 -257 215 -319 278 -442 -617 493 57 356 -584 203 -262
3184 -262 177 275 -457 22 181 -277 -517 115 -76 -70 65 82 -86 40 215 6 -119 26 -131 -387 11
3205 11 159 -464 -207 20 -167 130 320 -124 -259 285 -248 -293 -102 82 -344 -49 53 -293 -178 202 7
3226 7 -201 241 -72 -210 246 141 -124 -87 147 -302 -209 220 -68 -22 300 265 -79 157 180 -215 -59 299
3248 299 -181 -129 110 -103 -343 83 332 -284 119 244 -111 -62 -85 -165 -372 70 -186 -323 87 -3 -370 -92
3270 -92 403 -31 13 446 -103 -213 154 -182 -490 34 -127 -252 27 165 -5 -165 539 140 -63 -36 164
$$ packed form
3118Ek09K51m1j56J87M30m38m1K65n77M4L07O8n86M24M9j55K4M53k28l20R10q62
3141a96N7N27m93K2J57K21n45L8M70k05r6P83n24n02L89o7J9j7R9m92J72O20m49
3164a2L21j01J29p5J36m35k01K65k84M72n34N97p20j75J110m36K99r40P87m65
3184b62M39R8p32M79J59m58k40O32j91OJ35J7j68J26J75k09j25J45j57k56L98
3205A1J48o23K57K27j87K97J90m44j35N44n33m5J91J84m26K95J02l46J15L80j95
3226Gk08M42l13j38M56j05k65L7K34m49R3M29k88M6L22l5l44K36K3l95J56L58
3248B99m80N2K39k13k40M26K49o16M03J25l55M9k3q0k07M42k56j37M10r0l67K78
3270i2M95m34M4M33n49j10L67l36l08N24j61j25K79J38j70j60P04l99k03K7K00
$$ plain form
3291 164 -348 -21 210 -218 -8 253 -137 -267 380 113 -11 260 -125 -64 -26 74 -449 -291 248 -268 -82
3312 -82 287 293 -116 17 289 -235 334 374 -100 -216 262 -408 -96 124 -65 -248 92 195 -311 34 89 -132
3334 -132 12 160 -319 -256 76 -49 -29 43 198 -49 61 178 -260 94 267 -49 -376 107 100 -477 71 114
3356 114 -162 -91 274 -38 -29 685 227 -104 59 183 -289 -106 72 -408 35 306 33 -192 81 -58 -172
3377 -172 315 204 -114 -71 126 -230 -89 -39 -87 25 147 190 -76 275 185 -56 -222 408 -322 -461 407 -174
3399 -174 -141 42 119 -221 48 461 -89 -85 55 240 -294 227 -94 -380 -76 -70 -382 -139 176 -180 202 244
3421 244 -27 -71 342 55 -570 158 -151 -265 -50 12 -115 90 257 -52 -186 -10 -33 -287 -10 -88 -335
3442 -335 -49 234 -11 43 308 166 -67 393 339 -186 -37 31 -63 46 188 99 -238 183 50 -124 299 102
$$ packed form
3291A64n12L27K31m28K10K61l90j30O47k67j24K71l85O1L8J00n23J58N39n16J86
3312h2L69Om09J33K72n24N69M0m74j16M78o70L12K20j89j83L40J03n06L45N5k21
3334a32J44J48m79O3L32j25K0P2J55k47J10J17m38L54J73l16l27M83pn77N48M3
3356A14k76P1L65l12RP14m58l31J63J24m72J83J78m80M43K71k73k25K73j39j14
3377a72M87j11l18M3J97l56J41N0m8J12J22M3k66L51r0k41j66O30p30j39Q68n81
3399a74L3J83P7l40K69M13n50MJ40J85n34N21l21k86L04Ol12K43L15l56L82M2
3421B44k71m4M13k87o25P28l09j14K15O2j27K05J67l09j34J76k3k54K77p8k47
3442c35K86K83k45N4K65j42k33M60n4n25J49O8r4J09J42q9l37M21j33j74M23j97
$$ plain form
3464 102 -295 501 -2 -44 -108 203 -252 -285 41 103 -291 102 325 -123 152 228 -176 -185 56 -71 -574 171
3486 171 62 -378 69 -116 -427 168 416 -326 35 394 122 -186 202 -151 -193 -7 22 -246 -127 152 -136
3507 -136 -120 347 4 -8 245 88 -374 -194 207 -96 -70 230 209 91 272 -82 -179 190 168 -113 95 321
3529 321 -116 24 183 -94 -235 175 106 -132 199 282 -150 -54 57 -175 -164 97 -13 -88 -30 141 -108 289
3551 289 152 -342 283 220 -101 82 173 -303 -288 180 -47 -321 -202 162 -86 28 163 19 -104 68 151
3572 151 -199 36 -11 -209 9 312 94 -323 71 -63 -362 314 26 -89 111 179 -295 -106 63 -73 -299
3593 -299 271 48 30 224 -51 -129 -153 -55 -1 33 49 -95 -27 94 232 88 61 31 190 -33 364 -62 -68 169
3617 169 -278 -47 -10 -96 -179 -76 151 -64 6 148 -81 -30 240 -98 -325 -14 -108 -307 35 342 -35 -109
$$ packed form
3464A02l97P96n03m2o4L11m55l3L26O2l94L93K23m48K75P6m04rK41j27n03P45
3486A71j09m40M47j85l11N95K48p42L61L59k72l08L88l53m2J86K9k68J19K79k88
3507a36J6M67l43j2K53j57m62J80M01l03K6L00k1j18J81l54r7L69k2k81K08K26
3529C21m37J40J59k77j41M10o9k38L31Q3m32R6J11k32J1K61j10p5N8J71k49L97
3551B89j37m94O25o3l21J83R1m76J5M68k27k74J19L64k48J14J35j44j23J72Q3
3572A51l50K35m7j98K18L03k18m17L94j34k99O76k88j15K00O8m74J89J69j36k26
3593b99N70k23j8J94k75p8k4R8N4L4J6j44O8J21J38j44k7l0J59k23L97m26oK37
3617A69m47K31L7q6q3J03K27k15P0J42k29N1K70l38k27L11r4j99L42L07l77p4
$$ plain form
3639 -109 234 -184 -23 233 -80 -276 303 38 -261 198 -77 87 -220 137 68 -62 311 48 37 -27 227
3660 227 -321 -53 -67 -308 -182 -96 113 -225 352 -56 -249 195 183 -118 -376 54 -35 -130 144 -43 -60 65
3682 65 54 13 288 113 176 -122 82 -27 60 33 -32 -132 15 357 -268 129 -119 274 148 401 -89 91
3704 91 114 292 -363 -159 63 -428 -110 264 -183 234 262 -192 -237 -71 26 -120 54 -21 -110 203 -142 -235 -189
3727 -189 231 -80 -19 56 175 57 128 187 -252 87 28 7 -44 213 -46 16 81 45 214 8 -70 -159 -177 -5
3751 -5 -20 -186 246 39 -102 213 211 -10 220 191 -88 125 52 -78 -40 133 1 -75 -47 152 -260 112 168 -34
3775 -34 -158 192 -125 -197 89 -89 -311 31 110 -350 -257 305 -353 86 325 -156 -35 107 -104 -208 184
3796 184 -295 -73 104 90 -126 -75 210 -83 92 -1 94 -153 -95 127 -529 -338 76 -51 -246 177 6 -59
$$ packed form
3639a09L43m18J61K56l13j96N79k65k99M59k75J64l07L57o9j30L73k63j1o4K54
3660B27n48K68j4k41J26Q6K09l38N77m08j93M44j2l01k58M30q9r5K74j87j7J25
3682F5j1m1K75j75O3k98K04j09Q7k7o5j00J47L42o25L97k48L93j26K53m90J80
3704I1K3J78o55K04K22m91L18L74m47M17K8m54m5J66R7j46J74p5q9L13l45r3M6
3727a89M20l11O1P5J19j18P1N9m39L39n9k1n1K57k59O2O5l6J69k06p8q9j8J72
3751ej5j66M32k07j41L15kk21K30k9k79K13p3j30L8J73j32p6K8J99m12L72N6k02
3775c4j24L50l17p2K86j78k22L42P9m60R3N62o58M39K39m81J21J42k11j04L92
3796A84m79K22J77j4k16N1K85k93J75r3R5k47N8K22o56J91M14j27j95M23j71o5
$$ plain form
3818 -59 31 -118 -32 -120 171 -16 -11 4 5 -193 -395 -147 -244 -188 88 -125 430 115 -232 -375 796 -89 -414
3841 -414 43 -624 369 480 165 -146 214 184 173 -298 8 -15 24 174 -73 -88 -150 -25 -192 -78 169 40
3863 40 162 372 198 -288 141 129 -103 -121 -67 -127 -91 159 69 -213 -35 -89 -142 180 162 -287 -12 -104 -189 -224
3887 -224 66 121 -120 134 -68 -127 -62 294 -151 -25 308 -65 7 98 -120 -26 89 21 -22 404 234 -32 14
3910 14 466 -202 -204 26 -112 132 211 57 -90 179 131 34 205 190 -83 -60 146 -79 -104 -145 203 -90 -288
3933 -288 68 -167 137 -22 -27 67 56 -165 -213 73 -94 -182 -196 -141 -151 -138 -28 -29 -97 179 119 -30 49 56 -90 -164
3959 -164 -91 50 -34 77 -150 -121 -1 207 17 108 112 -96 20 -162 -131 -57 187 161 -149 302 15 110 -76
3982 -76 46 -129 -196 275 -18 -4 189 -144 -294 127 25 -35 -29 49 48 -76 126 290 110 126 34 -25 165 63
$$ packed form
3818e9R0j49Q6q8K91j87NJ5Jj98k02K48r7N6K76k13N55l15l47j43J171q85l25
3841d14M57o67R93J11l15l11L60l0j1m71L06k3L9J50k47j5o2J25j67J14K47j29
3863D0J22K10j74m86M29j2k32j8N4o0L6K50r0k82J78n4n3L22j8m49K75r2q5l5
3887b24K90N5k41K54k02n9O5L56m45J26L33l73P2R1k18R4J15o8m3M26j70k66M6
3910A4M52o68kK30j38K44P9j54j47K69m8r7J71j5k73K3K06k25k5m1L48k93j98
3933b88L56k35L04j59nR4j1k21m8K86j67q8j4N5j0J3J10jo8K76o0j49P9Pj46p4
3959a64P3J41q4J11k27K9J20K08j90R1Mk08J16j82L1P4K44k6l10M51k87R5j86
3982g6J22j75o7M71k93J4J93l33j50M21j02o0OP8jj24K02J64j80J6r2n9J90j02
$$ plain form
4006 63 -67 45 -173 -5 -160 31 -129 -301 -14 47 -241 -282 -219 -56 129 75 -366 -72 48 23 67 69 218
4029 218 -108 22 148 -136 -101 -244 -87 -50 -151 148 -103 226 131 83 63 136 -124 -181 -210 -136 50 11 19 13 17
4054 17 30 -82 -89 113 -432 -155 294 -18 88 113 94 -456 109 17 -149 -35 43 118 -163 325 106 -63 -57 54
4078 54 -48 -22 106 269 11 -177 72 -66 2 -312 -50 141 39 66 -197 -99 71 -235 51 143 -102 -62
4100 -62 -119 -299 29 46 -24 154 242 248 -263 289 -172 -277 30 199 57 -13 7 -171 242 116 -18 206 123
4123 123 -148 -168 94 -42 -226 3 -183 -86 -10 337 87 53 -3 -41 -241 -14 -123 -45 68 62 -185 -178 334 106
4147 106 -155 191 -95 31 -76 -1 -34 53 182 137 -96 26 177 -39 -15 79 -130 2 8 -182 142 126 -77
4170 -77 -182 50 97 -286 -141 195 105 -135 83 67 -172 242 -228 -41 201 -79 -69 33 -144 139 -28 -105
$$ packed form
4006F3j30J12k18J68j55J91j60j72K87O1k88m1O3J63J85n4m41K94J20k5M4KJ49
4029B18l26J30J26k84L5j43J57L7j01K99k51L29r5m8k0P3k60n7k9P4J86l9QoM
4054A7J3j12pK02n45K77M49l12J06K5j9n50N65r2j66J14P8P5k81M88k19j69OJ11
4078E4j02K6J28J63k58j88K49j38O8l14K62J91j02K7k63R8J70l06K86R2k45M0
4100f2n7j80L28J7p0J78Q8On11N52m61j05L07J69j42p0K0j78M13j26j34K24q3
4123A23k71k0K62j36j84K29j86R7P6L47k50l4n6l8k00K27j09P8J13ok47PN12k28
4147A06k61L46k86J26j07P5l3Q7J29m5k33J22J51k16K4R4k09J32Oj90L24j6k03
4170g7j05K32M7l83J45L36r0k40K18j6k39M14m70J87K42k80J0J02j77K83j67p7
$$ plain form
4192 -105 76 -17 -7 -215 -283 54 -79 104 64 -269 -38 -102 317 -4 51 230 49 32 62 -157 -317 87 -104
4215 -104 65 40 355 -109 80 246 6 114 163 -219 -131 -7 13 -335 -25 209 -227 -152 184 67 70 -13 -139
4238 -139 6 171 31 -349 -29 72 -71 13 18 180 78 -138 87 154 -70 27 179 -71 55 -132 84 23
4260 23 -159 -278 -78 62 50 117 -66 -38 113 154 -173 -35 234 -90 7 223 29 -126 -111 244 -25 174
4282 174 109 127 -90 192 300 -175 1 -42 63 -32 189 -60 -81 -317 -71 -48 -4 140 159 49 17 33 -25 57
4306 57 162 -115 80 103 -89 -19 37 53 4 272 -34 -147 126 47 335 -98 -94 -181 -54 26 -158 -110 -297 -169
4330 -169 -157 147 -29 -54 -295 -261 158 -58 149 -287 4 29 -186 -49 51 -58 -31 122 54 110 -34 91
4352 91 -86 -166 -215 -1 26 286 70 91 21 73 -133 28 109 -1 -132 120 97 -35 -137 182 102 60 198 -60
$$ packed form
4192a05J81r3J0k08o8L37j33J83m0l33K31o4M19l21N5J79j81j7L0k19j60M04j91
4215a04J69k5L15m64J89J66k40J08M9l82Q8J24K0l48L10K34m36P5L36j17Lq3j26
4238a39J45J65j40l80L20J01j43Q4NJ62j02k16K25O7k24R7J52k50J26j87K16o1
4260B3j82j19K00J40j2O7j83K8J51M1l27J38K69l24R7K16j94j55J5L55k69J99
4282A74o5J8k17K82J08m75J76m3J05r5K21k49k1k36K46K3M4J44J9j10l2J6n8Q2
4306E7J05k77J95K3j92P0N6J6m9K68l06j13K73p9K88m33Mq7J27Q0j84M8j87J28
4330a69J2L04j76k5k41L4M19k16K07m36K91K5k15J37J00j09K7J53o8N6j44J25
4352I1j77q0m9K14K7K60k16K1p0N2k06J61Q1j10j31K52k3j32j02L19q0m2J38k58
$$ plain form
4376 -60 98 -183 175 -80 174 -20 -19 -49 -93 78 59 66 -147 199 136 -185 -62 87 103 -143 1 129 -63
4399 -63 -82 49 67 86 153 78 -125 -182 -26 6 81 72 228 122 44 43 41 -110 -70 -74 143 -98 143 52 101 -53 43
4426 43 45 -151 20 67 -86 71 31 -197 -299 -4 236 22 -179 41 -104 138 18 19 20 -76 170 -10 49 18
4450 18 60 -1 -37 22 18 309 134 33 86 -135 -70 -213 -169 241 -196 99 49 39 34 81 -157 17 -51 107 -64
4475 -64 14 -63 -86 37 -55 52 53 -167 29 -196 -83 -40 -26 -7 151 -63 137 35 -115 -5 35 157 -81 205
4499 205 -119 -183 95 108 -173 -37 57 -44 -107 -41 -20 -95 -279 -282 -91 243 153 65 34 -29 -67 -229 184 -9 80
4524 80 -119 74 32 -127 -84 -55 -33 -241 -137 -51 117 110 264 71 -144 -26 -199 261 -313 201 134 -50 -24
4547 -24 -1 -59 -99 68 -181 46 101 84 196 -120 -53 149 50 43 50 -48 -52 110 19 15 73 -2 251 -9 100 -171 -18
$$ packed form
4376f0J58k81L58k55K54j94Jl0m4J71j9Pk13L46o3l21J23J49J6k46J44J28j92
4399f3j9J31J8J9O7p5k03n7J56L2P5rJ56j06p8jkj51M0mK17k41K41r1M9j54R6
4426D3Kj96J71M7j53J57m0k28j02K95K40k14k01K20j45K42j20JJr6K46j80N9l1
4450A8M2o1l6N9mK91j75j01N3k21O5j43M4M10m37K95n0j0nM7k38J74o8J58j71
4475f4P8p7k3J23r2J07Jk20J96k25J13M3J4J9J58k14K00j02j50J10M0J22k38K86
4499B05l24o4K78J3k81J36R4j01o3O6K1p5j84lJ91L34r0q8l1o3l8j62M13j93Q9
4524H0j99J93m2j59M3K9K2k08J04Q6J68pJ54j93k15J18j73M60n74N14o7j84K6
4547b4K3n8m0J67k49K27N5j7J12l16O7K02r9pPr8mJ62r1mN8p5K53k60J09k71J53
$$ plain form
4574 -18 73 4 144 278 -39 -107 115 90 52 29 15 -57 184 28 27 73 -48 -91 33 -86 -33 109 68 -39 -55
4599 -55 -277 88 -255 -44 54 81 -155 -75 -194 32 -35 -26 5 -3 94 -110 123 177 -200 126 -67 -166 -231 204 320
4624 320 -94 75 -104 240 -91 101 -26 172 3 97 353 -8 -432 -10 -143 -216 468 -159 30 279 4
4645 4 99 -315 122 5 -169 341 -12 -5 -153 382 134 -371 568 -55 -36 268 23 807 461 274 -226 422
4667 422 264 128 -703 -248 135 -135 136 -200 -45 -71 -173 -14 231 -302 113 -163 -116 199 -184 52 130
4688 130 153 -117 86 66 -13 44 -98 -213 130 99 109 -56 -73 -119 233 -1 -407 19 86 122 -72 -91 -221 138
4712 138 -183 281 -259 122 -42 79 67 60 -9 -50 54 -133 139 50 75 -11 -143 55 -13 -33 65 -54 37 26
4736 26 -159 88 255 29 65 -29 129 -41 152 23 106 -117 105 -179 -245 -20 -120 -78 -90 -105 174 -220 -61
$$ packed form
4574a8R1o9J40J34l17o8K22k5l8k3j4p2K41j56jM6j21m3J24j19N3J42m1j07j6
4599e5k22L65l43K11R8K7k36Q0j19K26o7RL1qR7k04K33N4l77L26j93r9o5M35J16
4624C20m14J69j79L44l31J92j27J98j69R4K56l61m24M22j33p3O84o27J89K49k75
4645DR5m14M37j17j74N10l53Pj48N35k48n05R39o23J9L04k45P84l46j87n00O48
4667D22j58j36q31M55L83k70K71l36J55k6j02J59K45n33M15k76M7L15l83K36P8
4688A30K3k70K03k0p9N7j42j15L43l1J0j65j7m6L52k34m06M26O7L6j94j9j30L59
4712A38l21M64n40L81j64J21j2po9m1J04j87K72q9K5q6j32J98o8k0R8j19R1j1
4736B6j85K47J67k26L6r4J58j70J93j29Q3k23K22k84o6K25j00M2j2j5K79l94J59
$$ plain form
4759 -61 -51 68 145 -39 16 -41 183 -28 -82 226 -191 142 30 93 148 27 197 272 156 -72 -45 301 66
4782 66 266 317 528 70 -99 90 253 275 -303 -449 -556 -84 22 59 9 161 84 -149 27 -90 176 -75
4804 -75 130 -31 333 188 -128 -38 -43 45 -51 -102 -252 119 56 51 38 108 -188 293 49 73 74 20 -184 152 181 31
4830 31 53 132 -96 93 91 83 87 -52 -84 -18 -149 36 -316 -225 20 -50 99 172 -57 -114 -125 -29 -119 87 -75 -236
4856 -236 108 -99 -18 92 107 99 305 -145 -40 139 79 42 236 202 52 155 37 -8 -64 31 101 -300 81 -184
4880 -184 0 128 -16 14 -40 1 -63 -139 193 218 -32 64 250 -203 33 -128 119 -28 -9 -128 -19 -97 -66
4903 -66 45 -86 -90 -316 116 -147 372 -115 3 169 -9 275 58 -30 2 -140 1 -130 -72 -64 125 -91 82
4926 82 -101 37 89 -89 -50 -176 -33 39 -17 -133 -64 226 86 -81 4 139 -119 12 -223 -1 62 62 71 -88
$$ packed form
4759f1J0J19P7j84N5n7K24k11n4L08m17L33j12O3N5j21J70P5j16k28K7L46k35
4782F6K00N1K11m58j69J89J63K2n78j46j07M72J06L7n0J52p7k33J76j17K66k51
4804g5K05j61L64j45l16R0nQ8r6n1j50L71o3nj3P0k96M81k44K4Jn4k04L36K9j50
4830C1K2P9k28J89kqMj39l2O6j31J85l52R1K45p0J49P3k29n7j1R6r0K06j62j61
4856b36L44k07Q1J10J5qK06m50J05J79o0l7J94l4j50J03j18m5n6R5P0m01L81k65
4880a84J84J28j44L0n4M1o4p6L32K5k50R6J86m53K36j61K47j47J9j19J09p8L1
4903f6J11j31mk26M32k63N19m87J18J66j78K84k17q8L2j42J41j31N8QJ89k16J73
4926H2j83J38N2j78L9j26J43P2n6j16O9K90j40j67Q5J35k58J31k35K22O3%Rj59
$$ plain form
4950 -88 -75 127 -185 329 -319 13 -91 126 124 -132 -101 -88 -213 -56 193 -297 314 9 -157 -41 -86 -195
4972 -195 -172 53 -243 -241 -26 -289 159 -6 39 -225 76 -315 150 -137 -15 -226 -131 177 -419 -149 -319 223
4994 223 -323 -164 -220 49 -95 -92 119 14 123 -67 -184 -31 29 -227 -161 29 141 233 9 143 -239 63
5016 63 -79 -73 -98 -38 23 -175 -29 -189 -57 24 -90 -19 90 130 -5 36 271 24 71 21 17 46 8 10 -42 43 -80
5043 -80 -180 -150 24 -168 -274 -5 -74 -33 79 101 36 -50 -71 -32 -56 10 20 -284 167 -72 -97 -239 -28 -133
5067 -133 -94 37 5 132 -181 111 -232 1 74 -163 -117 -2 104 195 33 145 -203 312 49 60 27 194
5089 194 56 82 49 96 296 89 -2 -81 415 -4 -139 104 -55 145 78 -67 -190 53 302 106 -124 -310
5111 -310 51 49 -114 -68 45 -70 -220 -156 61 -269 -28 -122 87 42 -129 63 -48 0 149 63 116 65 175
$$ packed form
4950h8J3K02l12N14o48L32j04K17kk56L1J3j25J57K49m90O11l05j66J16m5j09
4972a95K3K25k96KK15k63M48j65M5k64L01l91M65k87J22k11R5L08n96K70j70N42
4994B23n46J59n6K69j44LK11j05J09j90j17J53O0k56O6J90J12R2k24J34l82L02
5016F3j42Ok5O0O1j98J46j60J32Q1j14P1J09M0j35M1K35k47M7n0mK9l8Kn2Q5j23
5043h0j00L0J74j92j06K69o9M1J12K2o5q6k1L9k4O6J0l04M51k39k5j42K11j05
5067a33L9J31l2J27l13K92l43K33P3k37M6J15J06R1j62J12l48N15k63J1l3J67
5089A94j38K6l3M7K00k07r1p9M96m19j35K43j59K00o7j45j23K43K49j96k30j86
5111c10L61kj63M6J13j15j50O4K17l30K41r4K09m5j71J92j11M8J49q6N3n1J10
$$ plain form
5134 175 -43 -139 70 -169 -70 46 -17 48 -99 -151 -267 -70 133 -47 -154 52 159 6 162 38 -66 -40
5156 -40 1 161 -41 59 0 -100 156 164 -155 179 -41 -45 29 -42 62 -45 -55 -157 95 -19 -253 -55 129
5179 129 91 -83 -74 16 -114 -239 18 274 79 272 -2 -18 139 -125 46 85 -60 -14 -70 69 4 -48 98
5202 98 -153 11 371 58 40 -175 -20 150 178 31 131 30 20 -31 -104 227 -62 -180 -159 183 -3 12 214
5225 214 44 -155 144 -20 -13 -39 53 10 96 -28 58 62 -23 120 -10 43 -47 107 -71 37 -218 -51 358 -57
5249 -57 -22 41 -27 -32 113 414 -177 275 -94 -48 -110 -13 215 -110 392 25 -175 -46 110 -152 -7 144 -38
5272 -38 43 76 24 -79 63 -41 -29 -15 146 -110 -80 164 -85 -50 -117 -113 -245 66 245 -121 1 141 1 -29
5296 -29 345 80 -425 102 -251 -68 -99 187 -38 -49 -139 -25 130 -173 -130 -40 -67 -21 -289 -24 -17 -121 -168 106
$$ packed form
5134A75k18r6K09k39R9J16o3O5j47n2j16J97K03j80j07K06J07j53J56j24j04K6
5156d0M1J60k02J00n9j00K56Ql19L34k20mP4p1J04j07j0j02K52j14k34J98J84
5179A29l8j74RR0j30j25K57K56j95J93k74j6J57k64J71L9j45M6n6J39o5n2J46
5202I8k51J64L60l13j8k15J55J70K8j47J00j01j0n1p3L31k89j18K1L42j86J5K02
5225B14j70j99K99j64Pk6R2m3Q6j24Q6Mq5J43j30N3r0J54j78J08k55J67M09m15
5249e7L5O3o8nJ45L01n91M52l69M6o2R7K28l25N02l67k00J29J56k62J45J51j82
5272c8Q1L3n2j03J42j04J2J4J61k56L0K44k49L5o7Mj32L11J79l66J22J40j40l0
5296b9L74k65n05N27l53J83l1K86k25j1r0J14J55l03M3R0k7M6k68K65Pj04m7K74
$$ plain form
5320 106 14 -130 143 -206 124 45 180 -181 -2 47 -27 -32 -31 133 -225 17 -138 96 -57 112 20 -132 -8
5343 -8 -13 110 -2 175 -83 -200 181 -114 58 245 9 79 92 51 -38 -143 19 -65 -74 -7 -257 -248 -34 57 325
5368 325 -37 -59 89 67 2 -294 -7 4 -100 82 184 3 -125 120 2 37 313 -27 -52 -108 -44 59 217
5391 217 47 -92 125 -73 39 73 190 270 -54 119 101 -203 95 81 -149 59 193 -16 -239 166 115 -9
5413 -9 84 -313 -282 -57 45 -129 -153 -137 84 130 163 -93 -32 32 85 -12 88 -43 126 -84 -242 13 88 91 26
5438 26 40 -168 80 -64 55 261 105 -108 1 58 48 -51 10 -65 102 307 -162 -19 77 -260 -2 113 36
5461 36 -158 -51 16 229 -181 286 65 -115 -30 -26 -56 -3 122 -92 252 87 -81 -225 -44 -96 -252 -39 53
5484 53 -224 -97 239 65 212 63 -165 203 22 -204 -255 -16 -191 -12 -173 -6 52 -7 174 -21 -148
$$ packed form
5320A06r2j44K73l49L30p9J35l61J79M9p4nJJ64l58K42j55K34j53J69r2j52J24
5343hnJ23j12J77k58j17L81k95J72J87k36P0J3m1q9j05J62q4rO7k50RK14R1K68
5368C25l62k2J48k2o5k96K87J1j04J82J02j81j28K45j18L5K76l40k5n6O4J03J58
5391B17j70j39K17j98J12L4J17Q0l24J73j8l04K98j4k30K08J34k09k23M05n1j24
5413iR3l97L1K25J02j74k4J6K21M6L3k56O1O4N3r7J00j31J69k10j58K55P5Lo5
5438B6J4k08K48j44J19K06j56k13J09N7j0r9O1p5J67K05m69J43R6l37K58J15p7
5461C6j94J07O7K13m10M67k21j80Q5Ml0N3J25k14L44j65j68j44J81n2j56K13R2
5484E3k77J27L36j74J47j49k28L68j81k26n1K39j75J79j61J67N8n9J81j95j27
$$ plain form
5505 -148 -34 -80 -1 31 132 -206 -102 -70 -99 165 -60 -134 -198 229 0 -10 -74 -92 -100 -24 -65 -104 89 79 -151
5530 -151 29 105 22 353 155 -45 -334 -152 37 -288 -58 -85 -256 5 90 29 207 -7 100 113 -140 28
5552 28 156 -304 -37 73 75 236 -212 110 117 286 19 -4 79 188 -15 -59 100 207 252 -488 39 20 -125
5575 -125 -43 257 377 139 173 -14 -43 -362 300 303 -158 178 -448 -148 -304 133 -128 -168 7 -319 -2 -283
5597 -283 182 312 34 471 -46 9 -643 -226 282 -711 -128 4 -341 587 183 -81 109 3 18 -339 423
5618 423 -105 98 237 -69 157 -170 4 -122 187 -342 -445 14 -77 -317 -52 -48 144 -118 112 241 -58
5639 -58 248 -81 -129 -49 -204 -90 -103 -206 -53 31 303 -20 -168 -61 15 -166 -60 -112 -192 30 -120 69 -282
5662 -282 161 97 7 135 -110 60 81 5 -135 66 83 -255 -107 231 125 -33 126 -87 0 11 19 230 9
$$ packed form
5505a48J14m6P9L2J01l38J04L2k9K64k25p4o4M27k29j0o4j8qP6m1l9J93j0k30
5530a51J80P6q3L31j98k00k89J82J89l25K30k7j71K61Q5o1J78k14J07J3k53J68
5552B8J28m60K67J10KJ61m48L22PJ69k67k3Q3J09k03m4J59J07M5p40N27j9j45
5575a25Q2L00J20k38L4j87k9l19O62Lm61L36o26L00j56M37k61m0J75l26L17k81
5597b83M65J30k78M37n17N5o52M17N08r93N83J32l45R28m04k64J90j06J5l57P62
5618D23n28K03J39l06K26l27J74j26L09n29j03M59r1k40K65MJ92k62K30J29k99
5639e8L06l29m8Q0j55J14j3j03J53Q4K72l23j48J07P6j81J06n2q0K22j50J89l51
5662b82M43o4r0J28k45J70K1p6j40K01J7l38J48L38j06j58J59k13Q7J1QK11k21
$$ plain form
5685 9 5 -56 -3 203 -290 -322 46 -69 -85 -107 208 -141 -158 140 103 -107 -81 -11 -212 -60 74 -7 -6 113 -106
5710 -106 208 145 -189 -232 141 11 -262 35 -4 13 -117 265 42 26 27 159 185 33 112 63 203 217 -106 37
5734 37 -133 3 -30 -113 92 -230 23 -117 132 41 342 89 260 -9 26 122 72 -58 -66 102 30 19 -91 43
5758 43 -258 63 11 -118 -137 93 75 1 268 154 -140 193 36 59 -78 44 279 -77 210 -303 161 94
5780 94 -236 123 -39 158 -232 -25 47 221 -238 8 -24 49 -103 -90 -41 23 -177 -45 257 156 221 -234 -43
5803 -43 9 -190 -59 191 -191 -154 54 5 -160 123 238 44 255 -2 -217 47 -65 10 105 -88 59 -102
5825 -102 110 -63 105 219 113 197 50 -3 -66 -14 86 64 165 -103 51 -14 236 -8 116 3 0 -18 6
5848 6 49 60 -162 -100 -71 123 94 194 -272 -61 -43 112 39 112 108 15 -69 19 -241 -20 86 239 45 43 36 -125
$$ packed form
5685Imo1N3K06m93l2L68j15j6k2L15l49j7K98l7k10K6P0k01J52J34q1JJ19k19
5710a06L14o3l34m3L73j30k73K97l9J7j30L82k23j6JJ32K6j52P9m9J40J4l23J43
5734C7j70J36l3q3K05l22K53j40K49r1L01k53J71k69L5R6n0j30qJ68p2j1j10J34
5758D3l01L21n2j29j9K30j8p4K67j14k94L33j57K3j37J22K35l56K87n13M64o7
5780I4l30L59j62J97l90K07P2J74m59K46l2P3j52J3M9O4k00J32L02j01O5m55J91
5803d3N2j99J31K50l82L7K08m9j65K83J15j94K11k57k15K64j12P5R5j93J47j61
5825a02K12j73J68J14j06Q4j47n3o3N2J00k2J01k68J54o5K50k44J24j13lj8K4
5848FM3J1k22O2K9J94k9J00m66K11J8J55p3P3mr3q4Q8k60K21J06J53j94kpj61
$$ plain form
5874 -125 150 -34 4 -28 -181 -193 -30 -90 -38 -78 43 133 16 17 -25 54 149 -167 32 -240 33 -39 -144 -109 50
5899 50 206 117 27 306 -11 23 -126 -245 -14 -226 -125 51 40 48 199 174 -147 121 -22 -231 27 127 124
5922 124 20 -8 -173 -42 -110 47 133 -171 -165 29 171 57 -49 -160 26 2 134 -31 -90 4 -143 27 221
5945 221 -226 168 22 -30 58 -44 -243 48 330 -213 -45 49 54 -11 -97 -59 151 -34 199 -252 3 -19 -108
5968 -108 -151 -151 -115 -167 43 147 158 -137 125 175 -206 40 -123 -19 -32 -14 -133 176 157 -108 56 -46 -78 237
5992 237 259 11 135 131 28 -215 118 49 -81 108 3 117 -22 52 -149 -161 -13 -131 -87 -41 -82 42 -86
6015 -86 269 -217 -232 112 58 83 57 2 67 -27 -93 -35 124 -297 -30 6 -174 218 -167 -76 107 -221 -36 -73
6039 -73 -98 -39 93 -204 69 -90 -10 243 -139 144 40 58 -163 -40 -191 162 -223 154 -174 -50 89 -102
$$ packed form
5874a25K75j84L8l2j53j2J63o0N2m0J21R0j17Jm2P9R5l16J99k72K73p2j05L5J59
5899E0J56q9r0K79l17L4j49j19K31k12J01J76j1QJ51k5l21K68j43k09K58J00l
5922A24j04k8j65J31o8J57Q6l04OJ94J42j14j06j11J86k4J32j65n9R4j47J70J94
5945B21m47L94j46n2Q8j02j99K91K82n43J68R4No5q6L8K10j85K33m51K55k2q9
5968a08m3%L6n2K10J04J1k95K62N0l81K46j63J04j3J8j19L09j9k65J64j02l2L15
5992B37K2k48J24mj03k43L33o9j30J89j05J14j39P4k01j2J48j18M4M6m1J24j28
6015h6L55m86j5L44n4K5k6n5O5r4o6N8J59m21K67L6j80L92l85R1J83l28J85l7
6039g3k5N9J32k97K73j59Q0K53l82K83j04J8k21J23j51L53l85L77l28J24J39j91
$$ plain form
6061 -102 73 -1 64 93 -82 -37 6 -213 -75 16 -19 -103 -231 -53 -48 149 92 -101 -61 29 159 -120 -7 -100 -317
6086 -317 93 26 8 9 99 -186 -113 60 -89 -128 -27 74 -105 290 -72 -30 83 158 55 -69 87 -173 -152
6109 -152 230 170 21 -142 -300 36 -200 37 88 -4 -41 -192 -70 86 257 -97 134 177 -137 207 -177 -145
6131 -145 188 82 -12 113 -46 -104 -22 1 111 218 -288 0 -168 -225 42 -102 -18 110 90 -137 20 -74 94
6154 94 26 171 74 48 -9 111 -199 234 79 -145 -102 -85 64 -57 -173 152 87 82 -85 -82 167 -74 -18 17 190
6179 190 203 -142 40 -27 -109 132 -217 145 -181 -38 -93 -190 2 -85 -18 118 -59 41 202 -29 -261 158
6201 158 25 7 -63 -40 49 -187 119 187 41 41 97 48 -268 289 86 65 39 -173 177 178 88 -87 -12 201 41
6226 41 285 -63 -33 -118 159 230 218 -222 446 175 218 -173 -205 236 204 114 -569 -135 221 75 276 230 17
$$ packed form
6061a02J75p4O5K9j75M5M3k19J38R1l5q4j28J78NJ97n7j93M0R0J30k79J13r3k17
6086c17M10o7j8JR0k85P3J73j49l9J01J01j79L95l62M2J13P5j03j24J56k60K1
6109a52L82o0j49j63j58L36k36K37N1r2l7j51J22J56J71l54K31M3l14L44l84L2
6131a45L33j06r4J25j59n8Q2K3J10J07n06K88j68n7K67j44Q4J28k0k27J57r4J68
6154I4o8J45r7k6n7J20l10M33j55k24M3J7J49j21j16L25o5nj67LK49k41N6L5J73
6179A90J3l45J82o7q2K41l49L62l26J43n5r7J92q7O7J36j77J00J61k31k32M19
6201A58j33j8p0K3Q9k36L06O8j46%N6m9l16N57k03k1k6k12L50Jr0j75P5K13j60
6226D1K44l48L0q5K77P1j2m40O68k71M3l91l2M41l2r0o83M34L56j46K01m6k13
$$ plain form
6249 17 -259 -440 -260 -263 195 222 -645 104 239 3 -33 -385 -420 31 -131 -256 278 -234 76 242 332 -275
6271 -275 -161 -66 92 -3 132 -119 -40 -204 -101 -29 106 -86 -67 37 -3 26 141 -94 132 -148 -25 -266
6293 -266 163 146 -249 86 -158 369 -18 101 -57 -121 -61 -196 135 18 -218 -97 -6 -64 -307 -81 -65 103
6315 103 246 206 -106 -20 156 -56 25 175 156 -342 226 -152 -98 35 -134 50 -57 320 -214 -77 -339 -50
6337 -50 -152 155 -163 70 -74 -37 85 -35 -19 -47 139 -20 -101 -196 264 188 52 171 -603 -120 438 93
6359 93 114 -358 -312 172 8 -120 -453 214 -150 -325 -150 -139 -58 41 -93 -66 -42 -131 314 -186 -418 -77 118
6382 118 48 400 -298 -288 387 -45 -145 154 -1 -67 211 -760 -705 725 -634 -20 204 -213 158 178 700
6403 700 53 791 -7 -465 315 -529 -224 204 -321 168 322 -828 -25 186 -702 138 -241 54 121 71
$$ packed form
6249A7k76j81J80lM58K7q67P49J35k36l6l52l5M51j62j25N34n12L10J66R0o07
6271b75J14R5J58r5J35k51P9j64J03P2J35j92J9J04m0K9J15k35K26k80J23k41
6293b66M29j7l95L35k44N27l87J19j58o4O0j35L31j17k36J21R1n8k43K26J6J68
6315A03J43m0l12Q6J76k12Q1J50j9m98N68l78N4J33j69J84j07L77n34J37k62K89
6337e0j02L07l18K33j44L7J22j20J6k8J86j59q1r5M60p6j36J19p74M83N58l45
6359I3K1m72M6M84j64j28l33O67l64j75J75J1Q1R9j34K7K4q9M45n00k32L41J95
6382A18p0L52o98J0O75m32j00K99j55o6K78r71N5J430j359O14K24m17L71K0N22
6403G00o47P38p98m58P80q44L05M28n25M89J54j150Q03K11q88Q40l79K95O7n0
$$ plain form
6423 71 23 256 -79 43 240 -89 244 530 -254 -667 515 -191 -170 10 -3 -241 -227 297 -547 -484 -139 -130
6445 -130 -802 -213 -803 454 142 -295 44 460 -979 -349 115 -241 -874 398 -129 -977 676 -422
6463 -422 -156 -79 254 92 130 122 99 194 -285 -73 32 -50 -247 -274 -110 -231 -177 -79 -305 -30 99 -370 -142
6486 -142 -253 -273 147 159 193 -280 -391 51 -78 -372 -153 46 -150 0 80 165 -132 -184 248 52 200 108
6508 108 191 193 83 154 -12 -10 -81 158 -102 -8 -43 -172 -32 -107 -289 -9 -83 61 -33 4 8 283 -141 5 63
6533 63 114 400 -232 -202 44 -3 111 71 47 36 248 139 291 -50 -111 -114 -291 -48 381 -146 63 -400 238
6556 238 189 24 167 -178 233 53 206 -114 -136 165 56 106 -27 40 69 7 18 67 57 -123 63 137 37
6579 37 129 56 -65 108 -30 -76 -155 -247 -43 155 -90 134 32 -66 -13 141 3 -28 30 119 -9 33 96 -75
$$ packed form
6423G1m8K33l35J22J97l29L33K86p84m13J182p06K1J80j3k38J4N24q44O3L45R
6445a30o72N89n90J257l12m37L39M16j439O30M64l56o33J272n27q48J653j098
6463d22K66P7L33j62L8qk3R5m79K12J05q2j97k7J64j21N4R8k26K75J29m69K28
6486a42j11k0M20J2L4m73j11M42j29k94K19J99j96J50Q0Q5k97n2M32j96J48r2
6508A08Q3Kj10P1j66Kp1K39k60R4l5j29J40p5j82K80p4J44r4L7MK75m24J46N8
6533F3N1K86o32L0K46m7J14m0k4j1K12j09J52l41o1lj77K43M29n27K09m63O38
6556B38m9j65J43l45M11j80J53l20k2L01j09N0j33O7K9o2J1M9j0j80J86P4j00
6579C7R2p3j21J73j38m6p9r2K04J98k45K24j02r8N3J54j38l1N8Q9j28M2O3j71
$$ plain form
6603 -75 20 81 -63 17 -33 -61 109 246 32 364 -204 -335 46 401 159 -19 45 -125 275 -287 227 -334
6625 -334 243 -344 146 79 -26 33 79 10 105 -145 42 79 -97 103 -120 -7 64 121 -23 -27 -78 208 67 44
6649 44 -102 57 -23 -23 -206 -117 139 47 4 362 74 -36 -32 -216 86 -127 168 -60 45 59 203 133 -114 -86
6673 -86 -71 -100 136 27 -117 170 -83 -72 60 -20 -30 9 -174 -274 4 -16 24 179 188 76 -166 74 115 -33
6697 -33 -128 -100 -122 88 -236 3 54 -27 318 -62 97 73 30 274 117 -324 -53 -140 72 -98 20 -44 -4 114
6721 114 -33 107 103 -28 -172 350 493 99 -45 -121 -116 292 374 356 173 -469 6 388 286 307 -95 366 227
6744 227 -182 -483 -16 70 210 109 -273 -303 -409 105 -232 11 -42 15 30 11 -18 -7 -212 -59 31 64 -22 -65
6768 -65 202 -64 -187 231 67 -177 -32 -41 122 -154 184 -177 104 67 -200 -48 29 174 -151 24 12 -34
$$ packed form
6603g5R5O1j44Q0n0k8J70J37k14L32n68j31L81L55k42j78O4j70M00n62N14n61
6625c34N77n87M90o7j05N9M6o9R5k50J87L7j76K00k23J13P1N7j44mn1K86j41k3
6649D4j46J59q0%j83Q9K56r2m3L58k88j10Mj84L02k13K95k28J05J4J44p0k47K8
6673h6J5k9K36j09j44K87k53J1J32q0j0L9j83j00K78k0M0J55Rj12k42K40M1j48
6697c3r5K8k2K10l24K39N1q1L45l80J59k4m3K44j57m41K71q7K12j70J18o4M0J18
6721A14j47J40mj31j44N22J43l94j44p6NM08Q2j8j83o42M75L82j02K1m02M61j39
6744B27m09l01M67Q6J40j01l82l0j06N14l37K43n3N7J5j9k9J1k05J53R0L3q6m3
6768f5K67k66j23M18j64k44J45rJ63k76L38l61K81l7k67J52P7J45l25J75j2m6
$$ plain form
6790 -34 -131 204 5 -170 -53 41 -123 -62 -29 -321 254 23 -80 68 111 185 147 135 34 -409 -102 163 312
6813 312 446 -382 -249 99 286 -28 -86 315 -219 275 -67 -25 -130 -179 347 365 -287 -224 -332 -115 -20 -436
6835 -436 192 -120 -553 -415 -238 -68 273 53 132 -503 166 -192 -341 433 -88 -143 81 -37 -436 -603 -604
6856 -604 -161 289 -406 -49 240 7 -282 -480 357 29 -18 -122 249 -163 58 -165 -138 -51 146 27 -55
6877 -55 39 91 -17 -129 -56 -111 137 22 -109 67 43 -117 123 -155 -13 206 190 109 72 158 109 128 -96 18
6901 18 -40 -279 104 -2 -209 -141 -79 -44 108 -72 -87 2 -82 58 120 59 -25 -98 107 16 -155 -19 80 28 -11
6926 -11 97 129 -195 -198 -63 -1 66 7 190 -48 128 -140 -234 114 82 -29 22 109 9 -211 -76 302 29 -116
6950 -116 -42 -56 -79 -146 -87 -168 235 44 -49 41 -71 299 136 -68 -60 -290 24 158 -143 -158 -107 246 -17 -158
$$ packed form
6790c4r7L35j99j75J17R4j64O1L3k92N75k31j03J48M3P4l8j2j01m43L07K65J49
6813C12J34q28J33L48J87l14n8M01n34M94l42M2j05m9N26J8o52O3j08K17R5m16
6835d36O28l12m33J38J77J70L41k20P9o35O69l58j49P74n21n5K24j18l99j67j
6856f04M43M50o95L57K89k33k89j98Q37l28m7j04L71m12K21k23K7Q7J97j19q2
6877e5R4N2j08j12P3n5K48j15j31J76k4j60K40k78J42K19j6q1l7Q6m9J9k24J14
6901A8n8k39L83j06k07O8O2L5J52j80j5Q9q4J40O2o1q4p3K05r1j71J36R9n2l9
6926a1J08L2l24lJ35O2O7n9J83k38J76k68r4L48l2j11N1Q7j00k20J35L78k73j45
6950a16P4j4k3o7N9q1M03j91r3R0j12L70j63k04Qk30L14J34l01j5N1L53k63j41
$$ plain form
6974 -158 -122 -149 75 -90 -81 0 160 -52 -131 -116 93 63 -79 111 -40 -128 -215 -19 64 -97 -54 -99 106 -146
6998 -146 -77 -98 -67 -74 -10 15 12 264 18 57 -160 -163 -30 153 -134 234 93 24 255 -191 -84 7 -7 -42 -159
7023 -159 108 121 -72 69 1 144 -114 -61 -127 -75 -33 34 -283 -104 69 28 8 55 194 -141 -48 20 -44 153
7047 153 165 65 105 174 151 97 17 -28 -69 -277 -175 -47 -220 2 -249 -41 117 40 157 -26 -57 -30 -107 -92
7071 -92 182 -35 169 -107 -18 -253 136 201 179 -30 -65 -72 382 -357 216 -467 405 36 -1291 129 -509 5
7093 5 273 -273 -265 77 -63 -221 237 270 -196 68 127 73 167 324 62 30 -128 122 117 -233 101 73 -20 1 79
7118 79 -58 -15 117 6 -3 116 46 213 -6 -29 -121 -308 -22 -26 -94 70 -7 -83 62 -38 15 62 -11 -48 -8 -11
7144 -11 156 -24 52 -93 -70 194 -239 207 -62 78 -121 121 -314 98 284 -190 85 37 -54 47 222 90
$$ packed form
6974a58L6k7K24j65RQ1J60k12p9J5K09l0j42J90j51q8q7J96Q3j61M3m5K05k52
6998a46O9k1L1pO4K5lK52k46L9k17lJ33J83k87L68j41o9K31m46J07R1j4l5j17
7023a59K67J3j93J41o8J43k58N3o6N2M2O7l17J79J73m1k0M7J39l35R3O8o4J97
7047A53J2j00M0O9k3n4q0m5m1k08J02J28j73K22k51K08J58p7J17j83l1K7p7J5
7071i2K74k17K04k76Q9k35L89O5k2k09l5pM54p39N73o83Q72l69j327J420o38N14
7093EK68n46QL42j40j58M58L3m66K64N9n4R4J57k62l2j58K50nl50L34k8r3K1P8
7118G9j37M3J32j11rJ19p0J67k19k3r2j87K86mo8J64p7p6J45j00N3M7p3l7M0l
7144a1J67j80P6j45K3K64m33M46k69J40j99K42m35M12J86m74K75m8r1J01J75j32
$$ plain form
7166 90 -274 -176 53 -68 -61 66 143 -85 -220 99 -208 105 136 27 -125 -132 -102 63 53 -164 75 -217 215
7189 215 104 91 52 -39 109 -2 33 -116 -148 134 -9 80 185 16 45 -97 -178 97 -5 116 -74 -85 -47
7212 -47 69 104 18 40 -131 -32 -211 -308 36 -129 -34 -167 29 -24 149 75 35 -128 41 -56 -232 58 -61 -178
7236 -178 43 75 -221 -86 -186 101 242 -164 -102 -179 96 260 -114 -181 112 -123 -18 -87 70 -48 -99 -88
7258 -88 -26 -172 -237 -90 -317 -72 67 90 -89 -157 87 -138 -86 -200 -90 -156 -3 -112 -55 -118 81 -84 -137
7281 -137 94 200 -54 -36 -75 19 45 -161 -188 133 159 106 225 73 -241 -135 84 2 -5 -154 -184 86 -13 -29
7305 -29 -178 133 61 115 -12 -151 -23 21 -2 -79 -8 -197 75 64 -39 95 -190 27 82 21 241 -132 -35 -65
7329 -65 42 3 22 -5 -139 3 198 -184 56 -198 -23 -99 -39 133 -319 -67 215 248 142 -213 -49 -459
$$ packed form
7166I0l64R8K29j21PJ27P7k28j35L19l07L13L1j09j52pL0J65j0k17K39k92M32
7189B15j11j3l9r1J48j11L5j49l2K82j43Q9J05j69K9j42q1K75j02J21j90j1L8
7212d7J16L5q6K2j71R9j79r7L44j65R5j33J96n3J73p4m0j63J69r7j76K90j19j17
7236a78K21L2k96J35j00K87J41m06O2p7K75J64l74o7K93k35J05o9J57j18n1J1
7258h8O2j46o5J47k27K45J39K3j79o8K44k25N2j14J10o6J53j09N7o3J99j65n3
7281a37K31J06k54J8l9R4K6k06k7L21K6n3J19j52l14J06K19q2pj49l0K70r9j6
7305b9j49L11p2N4j27j39J28M4k3p7P1j89K72j1j03J34k85K17N5o1K20l73R7l0
7329f5J07l9J9k7j34J42J95l82K40k54J75p6O0J72m52K52K82L3j06l55J64m10
$$ plain form
7351 -459 21 438 -421 221 -82 343 -397 6 220 -288 -203 -82 -477 -95 358 136 -233 98 -9 -55 -88
7372 -88 57 14 -158 -200 61 460 64 75 -90 128 37 -61 -43 -8 -127 7 139 224 110 5 80 -144 -127 82
7396 82 37 109 89 66 -94 -96 30 -339 -59 -310 -158 -17 -50 -133 -134 -18 65 1 59 38 -25 181 119 28 -83 162
7422 162 -235 -45 17 -11 107 -77 -118 3 22 309 -13 44 134 79 -9 -72 206 615 97 161 -212 -556 -326
7445 -326 423 -227 49 153 -139 460 97 -179 40 -77 -110 13 -16 241 43 -115 170 -223 141 -149 1
7466 1 -3 -50 -104 -197 228 -118 90 -58 -281 -299 13 -96 -43 85 -28 -12 -53 121 -70 69 254 181 -173 49
7490 49 68 -256 -24 -54 125 43 114 -18 51 -195 -179 119 128 -36 -186 69 58 38 -185 41 -74 -116 10 -99
7514 -99 6 234 10 -95 -227 95 11 7 -57 28 -156 125 181 63 110 84 -86 -205 -2 -133 -124 -122 -16 138
$$ packed form
7351d59M80M17q59O42l03M25p40M03K14n08Q5J21l95L82M53k22l69L31j07m6l3
7372h8J45m3j72m2K61L99l96J1j65K18r1r8J8L5j19J34J32Q5j14j05P5k24J7K09
7396H2m5P2k0k3j60kJ26l69K80k51J52J41l3q3jJ16Q3o4N8k1o3K06o2r1j11K45
7422A62l97J90O2k8J18j84m1J21J9K87l22N7R0n5q8o3K78M09n18O4l73l44K30
7445c26P49o50K76J04k92N99l63k76K19j17l3J23k9K57j98j58K85l93L64k90J50
7466Amm7n4r3M25l46K08j48k23j8L12j09N3J28j13J6m1J74j91J39J85p3l54K22
7490D9J9l24K32l0J79q2P1j32O9k46J6K98Rj64j50K55j1k0k23K26j15m2J26j09
7514i9J05K28k24j05j32L22q4mo4Q5j84K81N6j18M7k6j70j19K03j31RKJ06J54
$$ plain form
7538 138 158 151 222 -190 -29 -27 -262 -116 -113 130 -13 123 -48 4 61 77 135 -5 -64 -243 -434 -229 -42 16 198
7563 198 -241 -6 -137 130 102 -35 83 257 100 185 -151 61 -14 -81 -85 -13 -136 -248 147 -6 -18 76 162
7586 162 -89 -3 194 45 -109 -24 61 70 98 -80 24 61 -106 -181 -47 111 -136 -80 93 -59 57 -19 -61 40
7610 40 -11 -2 -26 100 50 100 -194 116 -11 -8 -63 -181 210 -106 217 17 209 -68 -101 174 134 34 -107 98
7634 98 29 -7 -118 17 50 129 94 31 105 47 -124 -195 -22 -50 32 -22 17 -66 -255 96 78 105 96 -78 79 -13 -184
7661 -184 -33 -2 144 -79 -253 206 110 -35 32 -120 -45 -5 161 -158 44 137 169 -68 60 139 88 76 16 12
7685 12 -310 91 -161 174 26 -62 93 199 246 59 -41 227 -93 -97 -105 121 150 72 -116 22 81 -177 -65
7708 -65 127 -209 -37 77 64 -19 97 -123 155 -31 -125 8 61 -292 -26 -139 -9 181 -180 -78 5 -260
$$ packed form
7538A38K0pP1m12J61Kk35J46LK43j43J36j71N2N7J6N8j40n9j79j91K05J87N8J82
7563A98m39K35j31K67k8j37J18J74j57Q5l36K12p5o7mP2j23j12L95j53j2R4Q6
7586A62k51Q6J97j49j54Q5Q5RK8j78J04L7j67p5J34J58k47N6J73j52J16p6m2J01
7610D0n1Rk4J26n0N0k94L10j27Ln5j18L91l16L23k00J92k77l3K75m0j00j41K05
7634I8o9l6j11J35L3P9l5o3P4n8j71p1J73k8Q2n4L9q3j89L51j8K7rj74J57r2j71
7661a84J51L1J46k23j74M59r6j45O7j52P5M0J66l19K02R3L2k37J28P9n1j2o0m
7685A2l22M01k52L35j48q8J55J06M7j87j00K68l20mqK26K9p8j88J38N9k58J12
7708f5J92l36J72J14j3q3J16k20K78j86r4J33N3l53K66j13J30J90l61J02Q3k65
$$ plain form
7730 -260 -54 228 -56 79 -97 359 -253 -46 -67 174 -39 -77 17 17 -61 -25 88 42 -27 170 238 24 -126
7753 -126 -146 -188 -14 -98 52 127 -88 -16 -40 -214 -215 10 -142 -41 -70 -116 159 -109 -28 32 -88 111 -36 160
7777 160 56 82 -171 81 -23 102 -72 74 -106 26 -73 -192 110 -191 -66 12 55 101 -79 110 -19 26
7799 26 20 -134 45 109 102 -158 -297 192 292 332 -319 236 306 -79 195 -128 -207 -7 339 28 212 188 -160
7822 -160 -138 -479 -270 -114 127 -12 -378 122 -313 277 -233 373 -169 -259 -315 30 340 -127 -50 -84 -136 261
7844 261 -55 -273 288 -64 -273 -450 254 443 -368 -454 56 -196 104 389 29 633 -14 -86 341 336 -15
7865 -15 542 211 479 -558 -76 365 -78 14 -367 -612 -89 -291 367 216 91 -77 -125 -209 -318 24 -125
7886 -125 -327 48 -314 32 142 194 549 -296 66 -187 142 -180 -152 -183 200 -24 -34 -21 -195 14 -13 -272
$$ packed form
7730b60K06K82k84J35j76M56o12K07k1K41k13l8R4%p8L6J13m6o9J97O8k14j50
7753a26k0m2J74q4J50P5k15P2k4j74jK25j52J01k9m6K75k68Q1O0j20J99j47J96
7777A60j04K6k53K52j04J25j74J46j80J32r9j19L02l01J25P8M3M6j80J89j29M5
7799B6oj54J79O4pk60j39M89J00M0o51N55P0l85K74l23p9K00L46l11J84k4l48
7822a60K2l41K09J56K41j39l66N00m35N90n10O06n42r0n6L45L10m67P7l4n2L97
7844B61l16k18N61l52k09j77P04J89q11q6N10k52L00K85l60O04o47p2M27nl51
7865a5N57l31K68j037M82M41m43R2l81k45N23k02O58j51j25j68m8q4j09L42j49
7886a25k02L75l62L46J10N2L55q45L62k53L29l22K8l1L83k24j0J3j74K09k7k59
$$ plain form
7908 -272 -98 125 362 31 -507 -289 -50 -434 167 274 159 481 66 637 85 313 250 -224 -656 448
7928 448 588 0 430 -81 290 131 22 359 -192 164 23 241 -393 -28 -135 96 -297 78 93 -107
7948 -107 300 -440 73 -192 38 426 22 351 430 -80 63 141 213 33 -344 281 206 189 -229 -202 51 3
7970 3 -121 -16 129 162 -161 -205 88 234 136 -259 18 -77 -7 -39 -35 -74 -133 314 -148 -66 102 -55 -10 128 197
7995 197 58 330 -104 213 268 298 14 -62 130 -145 -54 -51 201 -80 -173 18 121 -148 154 -8 170 -63
8017 -63 -30 -208 -54 18 -84 -159 -96 -13 -5 -179 28 98 -157 261 17 177 104 -30 -16 58 168 41 -51 79
8041 79 -56 -64 191 41 0 -55 -72 -113 -4 -156 68 -63 -133 131 209 -58 -57 161 -126 -180 -313 72 116 -130
8065 -130 12 247 63 30 13 -87 -232 146 -135 -268 2 306 266 69 177 -54 116 -69 -47 24 52 -150
$$ packed form
7908b72J74K23K37l31n38K18K39l84O01J07j15L22m15N71n52K28o3m74m32J104
7928D48J40n88M30n11L71j59j09L37n51L56j41K18o34L65j07K31l93L75J5k00
7948a07M07p40N13k65K30L88m04L29P9n10J43P8P2j80l77O25p5j7m18K7K53m8
7970Cj24J05J45L3l23m4K93J46r8l95K77r5P0l2Ml9n9M47m62Q2J68j57M5J38O9
7995A97j39K72m34L17N5L0k84p6J92k75R1LK52k81r3J91J03k69L02j62J78k33
8017f3L3j78J54P2j02p5O3Q3Qj74K07P0k55M18k44J60p3j34J4P4J10j27r2J30
8041G9j35qK55j50m1n5j7m1J09j52K24j31p0K64P8k67JK18k87n4j33L85M4k46
8065a30J42K35j84l3j7j00j45L78k81j33K70L04m0j97J08k31J70j85K2P1K8k02
$$ plain form
8087 -150 -183 150 237 104 -24 8 136 27 184 10 129 463 207 -162 -162 -180 -272 51 124 56 -323 -90 43
8110 43 -226 14 -113 -15 244 238 208 184 -131 -61 -160 -126 -103 117 56 133 -94 158 15 -1 173 94 13 51 89 -36
8136 -36 -106 -102 122 -62 134 -11 134 50 122 -274 178 6 56 56 -136 101 85 7 -17 -183 -134 -180 63 -20 -210
8161 -210 49 -153 44 293 -25 47 -2 -8 -71 -13 82 3 -92 -81 43 20 155 172 -38 -144 -95 -27 40 -135 -370
8186 -370 282 -278 -24 144 11
$$ packed form
8087a50l3L33Q7j33j28L2J28j09J57j74J19L34k56l69%j8r2L23P3o8l79K33J33
8110D3k69K40j27R8K59ol0k4l15P0r9L4K3K20o1P7k27K52j43j6J74p9q1L8L8j25
8136c6p0MK24j84J96j45J45q4P2l96M52j72N0%j92K37j6p8k4j66M9m6K43q3j90
8161b10K59k02J97K49l18P2m9oo3N8R5p9r5J1J24k3J35J7k10j06M9O8O7j75k35
8186c70O52n60K54J68j33
8191A1
$$ Imaginary data points
##PAGE= N=2
##DATA TABLE= (X++(I..I)), XYDATA
$$ plain form
0 0 0 0 0 0 0 0 0 0 0 0 0 1 -8 8 -8 8 -16 16 -24 24 -32 40 -48 56 -64 76 -88 104 -120 136 -156 177 -202 231
34 231 -260 293 -327 369 -414 462 -515 572 -636 708 -780 861 -952 1050 -1158 1276 -1406
51 -1406 1547 -1705 1881 -2076 2295 -2544 2826 -3156 3539 -3993 4544 -5231 6106 -7273 8917
66 8917 -11412 15724 -25286 96491 -111006 -137527 96090 -43840 30353 70149 -177152
77 -177152 -94400 213174 9937 -121436 16333 62970 29856 61380 -48034 -87254 60921
88 60921 61796 -57180 -103322 -11469 62874 10829 -49632 -19328 38922 33216 51810 -32398 -61938
101 -61938 54991 59963 -84325 -76126 44261 -6477 -22329 8941 -36632 -15947 109331 37380
113 37380 -114000 29774 94449 -34904 -31974 13171 -79979 -1497 105556 -80153 -88374
$$ packed form
0@%%%%%%%%%%%JrJ6j6J6k4L2m0M8n6P2q8J04j20J40j64J92k24K56k92L33l79M33
34B31m91N53o20O96p83Q76r77J087j208J344j488J641j813K002k208K434k682
51a406K953l252L586l957M371m839N370n982O695p532Q537r775J1337j3379J6190
66H917k0329K7136m1010J21777k07497k6521K33617j39930P4193L9796k47301
77a77152Q2752L07574k03237j31373J37769M6637l3114L1524j09414l9220J48175
88F0921Q75j18976m6142R1853P4343n2045o0461L0304N8250n706J8594q4208k9540
101f1938J16929M972j44288Q199J20387n0738j5852L1270m5573K0685J25278p1951
113C7380j51380J43774O4675j29353K930M5145r3150P8482J07053j85709q221
$$ plain form
124 -88374 88252 48130 -37158 49185 5714 -52601 77341 38257 -81530 -29002 39874
135 39874 -25221 -18526 20328 -23167 -7717 39338 42951 -17034 37 37381 -2099 -19086
147 -19086 19640 -7883 -69722 21292 28052 -50660 -111 43051 -23395 5221 74444 -29988
159 -29988 -32464 54109 851 -55403 12743 3101 -63371 17326 26342 -41834 -4538 54924 -7588
172 -7588 -19735 50669 -649 -35088 13246 10691 -50326 -6888 20266 -46295 -11285 41192
184 41192 -199 -28370 38911 21524 -19942 24192 10487 -38971 -9975 34864 -35376 -37726
196 -37726 24845 890 -17663 28169 21775 -30165 32437 42163 -28399 -13496 28670 -16115
208 -16115 -33281 25475 -15588 -34936 26931 24857 -26798 14190 46329 -18964 1437 35081
$$ packed form
124h8374J76626m0122q5288Q6343m3471n8315J29942l9084j19787N2528O8876
135C9874o5095O695L8854m3495J5450M7055L613n9985J7071L7344l9480j6987
147a9086L8726k7523o1839R1014O760p8712N0549M3162o6446K8616O9223j04432
159b9988k476Q6573n3258n6254O8146r642o6472Q0697R016o8176L7296N9462o2512
172g588j2147P0404n1318l4439M8334k555o1017M3438K7154o6561L5010N2477
184D1192m1391k8171O7281j7387m1466M4134j3705m9458K8996M4839p0240k350
196c7726O2571k3955j8553M5832o394n1940O2602R726p0562J4903M2166m4785
208a6115j7166N8756m1063j9348O1867k074n1655M0988L2139o5293K0401L3644
$$ plain form
220 35081 -12287 -31662 22436 -3624 -45945 16802 13058 -32065 4035 43424 -14901 -6015
232 -6015 43844 -8819 -19350 25034 694 -48036 7607 13115 -38240 -3108 22209 -13368
244 -13368 -8743 42446 -2166 -20223 28181 9902 -29768 -2599 12826 -37961 -9190 19307
256 19307 -19742 -18686 29181 12021 -21691 27243 17034 -20234 5615 19986 -28866 -21037
268 -21037 24776 -19292 -25650 18717 9747 -21684 23058 28101 -23305 12687 31392 -17483 -20394
281 -20394 25239 -12928 -30496 19236 -2367 -25746 17086 28936 -21587 7662 35819 -9093
293 -9093 -6530 21297 -6576 -29439 18189 -630 -34201 5077 18939 -14441 -2574 31722
305 31722 -7799 -3859 28379 -317 -25859 10123 9532 -34361 -2314 9579 -20142 -6826 24997
$$ packed form
220C5081m7368j9375N4098k6060m2321O2747l744m5123L6100L9389n8325Q886
232f015M9859n2663j0531M4384k4340m8730N5643N508n1355L5132K5317l5577
244a3368M625N1189m4612j8057M8404j8279l9670K7169J5425n0787K8771K8497
256A9307l9049J056M7867j7160l3712M8934j0209l7268K5849J4371m8852P829
268b1037M5813m4068o358M4367q970l1431M4742N043n1406L5992J8705m8875k911
281b0394M5633l8167j7568M9732k1603k3379M2832J1850n0523K9249K8157m4912
293i093K563K7827k7873k2863M7628j8819l3571L9278J3862l3380J1867L4296
305C1722l9521L940L2238k8696k5542L5982n91m3893L2047J1893k9721J3316L1823
$$ plain form
318 24997 -5277 -14351 31190 7742 -18049 8417 12961 -26788 -6356 14380 -28108 -14207
330 -14207 19534 -3754 -21009 24326 13022 -17489 17711 15749 -19802 -4474 21318 -22930
342 -22930 -19502 17029 -8673 -18086 15330 12224 -18373 18457 22326 -13349 576 20593 -8615
355 -8615 -19002 15720 -8399 -21822 10582 9469 -18467 6244 27376 -10164 2373 23074
367 23074 -3028 -13940 16808 -394 -28338 8083 6183 -19803 -1377 19944 -10716 -2313
379 -2313 28062 -3243 -10427 16170 7040 -23463 2812 6180 -23715 -3796 12610 -11827 -12283
392 -12283 25066 1928 -12776 17469 8876 -15370 3486 12104 -25492 -7492 13203 -14498
404 -14498 -15254 14019 3090 -14065 18755 8615 -12066 7780 14947 -14316 -10836 12968 -11984
$$ packed form
318B4997l0274r074M5541k3448k5791K6466M544l9749K0432K0736m2488J3901
330a4207L3741k3288j7255M5335j1304l0511L5200j962l5551J5328K5792m4248
342b2930L428L6531k5702r413L3416l106l0597L6830L869l5675J3925K0017k9208
355h615j0387L4722k4119j3423L2404j113k7936K4711K1132l7540J2537K0701
367B3074k6102j0912L0748j7202k7944L6421j900k5986J8426K1321l0660Q403
379b313L0375l1305p184K6597r130l0503K6275L368k9895J9919J6406k4437m56
392a2283L7349k3138j4704L0245q593k4246J8856Q618l7596J8000K0695k7701
404a4498p56K9273j0929j7155L2820j0140k0681J9846P167k9263L480K3804k4952
$$ plain form
417 -11984 -14289 7508 1279 -15436 11118 16735 -13216 6891 20427 -5907 -9471 18150 -6188
430 -6188 -19975 12694 -1311 -19320 7180 15242 -16512 6003 23567 -8107 -2086 17715 -1067
443 -1067 -14649 11788 -2843 -18987 4959 7578 -13318 -4029 19147 -3001 -3012 14585 1875
456 1875 -9215 10055 5864 -23020 -566 9206 -12754 -11130 9822 -1757 -6639 17197 290
469 290 -11082 10952 15387 -16838 -9686 11549 -10087 -9729 5345 -7784 -15599 20419 9361
482 9361 -22295 8493 20200 -7622 -3828 11915 -18003 -4745 19845 -15953 -21972 14248 10208
495 10208 -13128 7756 5316 -5086 14420 11583 -13701 -8601 16469 -1169 -14042 -3883 2134
508 2134 -1667 3529 7359 -10199 3309 20969 3686 -15227 6959 10569 -11187 1356 -233
$$ packed form
417a1984k305K1797o229j6715K6554N617k9951K0107J3536k6334l564K7621k4338
430f188j3787L2669j4005j8009K6500Q062l1754K2515J7564l1674O021J9801j8782
443a067j3582K6437j4631j6144K3946K619k0896R289K3176k2148j1J7597j2710
456A875j1090J9270m191k8884K2454R772k1960J624K0952j1579m882K3836j6907
469B90j1372K2034M435l2225P152K1235k1636L58J5074j3129p815L6018j1058
482I361l1656L0788J1707k7822L794J5743k9918J3258K4590l5798o019L6220m040
495A0208k3336K0884k440j0402J9506k837k5284N100K5070j7638j2873J0159O017
508B134l801N196L830j7558J3508J7660j7283j8913K2186L610k1756J2543j589
$$ plain form
521 -233 -15068 1062 18052 -12627 -11920 21271 4884 -7376 9295 4121 -13670 10961 6865
534 6865 -24046 -2661 13002 -9830 -10743 12816 -4102 -4333 16021 -468 -9913 8080 8979 -14051
548 -14051 -3348 3492 -7334 -6513 2408 -4 -8431 7382 7705 -5361 -626 13528 -2835 -11251
562 -11251 11479 -3129 -15229 6005 4204 -18049 5999 14147 -15930 4776 19148 -8306
574 -8306 -5966 18314 -5851 -11057 13285 -6497 -14338 9498 6736 -15608 4189 12997 -4664
587 -4664 3841 8332 -3716 -2963 12788 -2681 -12452 1307 3568 -3174 -4033 2927 -2859 3190 9306
602 9306 1877 -6608 2480 11802 -6052 -7098 2182 -3139 -8024 7020 -1200 -15926 11573 11214
616 11214 -11736 1062 14133 -10443 -1560 14052 -15931 -9234 13990 -6277 -16593 12128
$$ packed form
521b33j4835J6130J6990l0679P07L3191j6387j2260J6671n174j7791K4631m096
534F865l0911K1385J5663k2832r13K3559j6918k31K0354j6489r445J7993Q99k3030
548a4051J0703O840j0826Q21Q921k412q427J5813L23j3066M735J4154j6363q416
562a1251K2730j4608j2100K1234j801k2253K4048Q148l0077K0706J4372k7454
574h306K340K4280k4165n206K4342j9782p841K3836k762k2344J9797Q808j7661
587d664Q505M491j2048P53J5751j5469r771J3759K261o742q59O960n786O049O116
602I306p429q485R088R322j7854j046R280n321m885J5044q220j4726K7499l59
616A1214k2950J2798J3071k4576Q883J5612k9983O697K3224k0267j0316K8721
$$ plain form
628 12128 1208 -11889 12114 3826 -9701 6745 10584 -11917 -2665 7567 -6581 -4987 1330
641 1330 -1703 -6008 6316 4240 -5162 919 9358 3079 -6139 4991 -103 -5867 2818 2599 -10663
656 -10663 -2586 11689 -4292 -3207 8385 1837 -3397 10264 3368 -12350 5183 6698 -8826
669 -8826 -4318 6744 -6170 -3466 11908 -3204 -5753 9738 6727 -8651 4077 5250 -9819
682 -9819 439 4664 -7991 -6664 8635 -2900 -6462 7279 2938 -4077 2736 6382 -6865 -404
696 -404 5074 -6265 -6726 3359 1046 -8852 3153 2858 -3953 2824 7361 -4647 -4365 10119 -2079
711 -2079 -8001 1529 979 -7905 2839 4434 -10300 1882 10251 -1554 -5128 8166 685 -4819
725 -4819 7209 -1606 -9334 2466 7073 -8917 -2494 7800 -2288 298 6580 -209 -4767 9476
$$ packed form
628A2128j0920j3097K4003q288j3527J6446L839k2501R252J0232j4148J594O317
641A330l033m305J2324k076r402O081Q439o279r218J1130n094n764Q685k19j3262
656a0663Q077J4275j5981J085J1592o548n234J3661o896j5718J7533J515j5524
669h826M508J1062j2914K704J5374j5112k549J5491l011j5378J2728J173j5069
682i819J0258M225j2655J327J5299j1535l562J3741m341p015O813L646j3247O461
696d04N478j1339m61J0085k313r898J2005k95o811O777M537j2008K82J4484j2198
711b079n922R530n50q884J0744J595j4734J2182Q369j1805l574J3294p481n504
725d819J2028q815p728J1800M607j5990O423J0294j0088K586O282o789m558J4243
$$ plain form
739 9476 3035 -9132 770 4671 -3727 -3945 4591 -4611 -858 8672 -123 -6151 5152 8245 -5846
754 -5846 -322 2342 -4021 -1101 4385 -5214 -8100 8021 2436 -5812 323 5200 -2170 1361 4679
769 4679 -7692 -2907 6083 -648 -10142 1362 2859 -5314 2669 2104 -4981 662 9965 -4005 -6307
784 -6307 5694 -72 -5212 437 476 -7459 3959 4822 -6460 -523 7221 945 -3803 5440 -935
799 -935 -3218 4017 412 -6549 -571 6184 -4169 -1626 4051 718 -1125 5413 2648 -5936 4203
814 4203 4194 -4779 -2872 4660 -2845 -3354 6218 -2453 -3640 5520 4638 -5149 2599 4549 -5087 663
830 663 2925 -3981 -4605 5191 -1200 -5137 3066 1190 -2383 1399 4821 -4905 -720 5157 -2812 -4603
846 -4603 1807 118 -6348 3122 774 -5147 1361 4859 -2674 -2290 5303 -2199 -2117 2445 -771 -4735
$$ packed form
739I476o441j2167R902L901q398k18Q536r202L753R530q795o028J1303L093j4091
754e846N524K664o363K920N486r599k886J6121n585q248O135M877p370L531L318
769D679j2371M785Q990o731r494J1504J497q173P983n65p085N643R303j3970k302
784f307J2001n766n140N649L9p935J1418Q63j1282N937P744o276m748R243o375
799i35k283P235l605o961N978O755j0353K543N677l333j843O538k765q584J0139
814D203rq973J907P532p505n09R572q671j187R160q82r787P748J950r636N750
830F63K262o906o24R796o391l937Q203j876l573L782L422r726M185N877p969j791
846d603O410j689o466R470k348n921O508L498p533L84P593p502Q2M562l216l964
$$ plain form
862 -4735 1093 2712 -5571 -52 3368 -468 -2238 4324 777 -3604 4505 1325 -4599 -94 4630
877 4630 -4490 -1646 4843 -2830 -1013 4935 714 -4479 5545 2713 -4291 1528 2309 -2735 -1181
892 -1181 4240 -3753 -2206 4608 630 -2968 1953 3649 -3296 1951 2412 -3768 -1350 3889 -1571
907 -1571 -4969 3376 -707 -2317 1758 1539 -2962 1123 4284 -3082 -1486 1739 182 -3744 594
922 594 368 -4114 1470 2528 -2564 -2437 5372 -453 -3431 3327 -351 -3556 1666 1969 -6912 1049
938 1049 4044 -4218 -1057 3762 -651 -2204 5040 -1057 -3008 3670 1356 -4281 -427 3491 -3167
953 -3167 -14 2428 -1394 -1046 4135 688 -3568 3344 1824 -1975 -338 1563 -1763 -464 3098
968 3098 -2463 -1316 2004 2328 -2198 478 2579 -928 -315 2119 -696 -3808 3050 406 -4497 1805
$$ packed form
862d735N828J619q283N519L420l836j770O562l547m381Q109l180n924M505M724
877D630r120K844O489p673J817N948m221n193J0024k832p004N819P81n044J554
892a181N421p993J547O814l978l598M921J696o945N247M61o180K418N239n460
907a571l398Q345m083j610M075k19m501M085L161p366J596L225j557l926M338
922E94k26m482N584J058n092J27P809n825k978O758l678l205N222L03q881P961
938A049K995q262L161M819m413j553P244o097j951O678k314n637L854L918o658
953c167L153K442l822L48N181l447m256O912j520l799J637J901l326J299L562
968C098n561J147L320L24m526K676K101l507O13K434k815l112O858k644m903O302
$$ plain form
984 1805 2768 -3330 -138 4512 -4016 -670 4529 -2597 -3155 3008 -218 -5185 2867 600 -3739 1543
1000 1543 1467 -2175 -72 3119 -2564 -1239 2596 316 -3093 -208 847 -2371 632 508 -1151 -855
1016 -855 2991 -312 -2543 1153 1288 -110 -17 1270 -2470 593 2619 -1494 -1553 1166 2864 -2848
1032 -2848 1707 2261 -2748 954 3180 -2487 -1984 5163 -1303 -3304 3741 -95 -2941 2700 1421
1047 1421 -3744 3117 2155 -2275 -1109 2415 -1226 -1455 1544 -1930 -572 1705 460 -2252 -1008
1062 -1008 2238 -632 -1003 236 28 -2078 1242 870 -3443 187 1938 -909 -1955 1972 -1220 -936
1078 -936 3130 -384 -2375 536 1623 -2943 -225 1286 -2243 -357 2072 -365 -2285 2733 -80
1093 -80 -1466 1759 727 -1957 -173 2085 -2031 -25 1137 -699 -675 1668 1352 -1661 1162 979
$$ packed form
984A805R63o098L192M650q528L346N199p126n58O163l226m967Q052k267m339N282
1000A543p6l642K103L191n683J325L835k280l409K885J055l218L003j24j659K96
1016h55L846l303k231L696J35j398R3J287l740L063K026m113n9K719J698n712
1032b848M555N54n009L702K226n667N03P147o466k001P045l836k846N641j279
1047A421n165O861r62m430J166L524l641k29K999l474J358K277j245k712J244
1062a008L246k870l71J239k08k106L320l72m313L630J751k847j046L927l192K84
1078i36M066l514j991K911J087m566K718J511l529J886K429k437j920N018k813
1093h0j386L225j032k684J784K258m116K006J162j836K4K343l16l013K823j83
$$ plain form
1109 979 -56 -104 1262 -652 -1957 2529 502 -1367 39 2114 -1478 765 2438 -2612 185 2969
1125 2969 -301 -2451 2270 -437 -2041 2387 -652 -2329 549 2384 -2222 25 1272 -1556 110
1140 110 918 -366 -2210 1185 30 -1276 37 211 -752 -811 1587 -880 -789 485 581 -1177 -304 780
1158 780 -1600 -38 392 20 -1331 1163 840 -1650 804 1053 -985 -505 1965 -1552 -896 2763 -1036
1175 -1036 -1579 1490 808 -2063 1786 444 -2001 2219 1805 -1976 -792 2293 -633 -244 889 -1361
1191 -1361 -44 1923 817 -2073 555 942 572 21 -674 181 -253 1701 -789 -1493 -165 1712 -204
1208 -204 -1449 460 -334 348 448 -498 -1986 1405 1698 -2084 -831 602 149 -622 630 -1308 -1111
1225 -1111 2290 -238 -1922 -48 1666 -1292 135 15 -1449 864 1233 -1079 -2199 1811 784
$$ packed form
1109I79j035m8J366j914j305M486k027j869J406K075l592K243J673n050K797K784
1125B969l270k150M721k707j604M428l039j677K878J835m606K247J247k828J666
1140A10Q08j284j844L395j155j306J313J74r63n9K398k467R1J274R6j758Q73J084
1158G80k380J562M30l72j351K494l23k490K454K49k038M80K470l517O56L659l799
1175a036n43L069o82k871L849j342k445M220m14l781J184L085k926L89J133k250
1191a361J317J967j106k890K628L87l70n51o95Q55m34J954k490p04J328J877j916
1208b04j245J909p94O82J00r46j488L391K93l782J253J433m53p71J252j938J97
1225a111L401k528j684J874J714k958J427j20j464K313L69k312j120M010j027
$$ plain form
1240 784 -1007 157 -376 -182 792 1100 -1700 141 1305 -37 -709 -116 822 -347 1033 -246 -303
1257 -303 152 1389 -65 -873 958 231 131 6 622 -751 265 1289 -993 -300 806 520 -1017
1274 -1017 982 128 -799 842 199 -704 -101 1264 -811 -300 852 -444 -308 356 430 -1344 831
1291 831 -121 -1165 160 486 -515 -860 869 -525 -298 343 -172 -631 189 666 -1282 250 270 -231
1309 -231 -571 369 88 -842 967 133 -365 -101 839 -227 -315 488 -191 188 470 373 -897 610 541 -549
1329 -549 287 273 181 -527 1063 -448 -598 909 13 -770 -61 836 -781 402 303 -638 -198 860 168
1348 168 -993 727 184 -180 524 485 -364 317 840 -874 7 0 299 -739 -406 476 -572 -158 44
1367 44 -138 -794 160 156 -568 163 384 -469 -904 767 -783 107 24 -349 -270 500 -200 -716 401 -455 -223
$$ packed form
1240G84j791J164n33J94R74L08k800J841J164j342o72N93R38j169J380j279n7
1257c03M55J237j454q08J831p27j00j25O16j373J016J024k282O93J106k86j537
1274a017J999q54r27J641o43r03O03J365k075N11J152j296J36O64P4j774K175
1291H31r52j044J325L26j001l45J729j394K27O41n15m59Q20M77j948J532K0n01
1309b31l40R40k81r30J809q34m98K64R40j066q8Q03o79L79K82r7j270J507o9j090
1329e49Q36j4r2p08J590j511j50J507q96p83P09Q97j617J183r9r41M40J058o92
1348A68j161J720n43l64P04l9q49O81N23j714Q81pK99j038L33Q82j048M14K02
1367D4j82o56R54mp24P31K21q53m35J671j550Q90q3l73P9P70p00n16J117q56K32
$$ plain form
1388 -223 -23 -13 -238 -74 532 -519 -9 -32 65 -201 299 474 -515 489 468 -190 -189 496 -211 -192 994
1409 994 -304 13 307 474 -102 111 276 -516 354 -67 242 -103 492 363 -203 130 373 108 -498 418
1429 418 -214 -149 648 -140 -391 140 486 -817 385 178 -669 270 156 -458 -557 730 -564 -73 178
1448 178 -261 -162 -8 268 -779 301 -314 -27 -37 92 87 -177 179 -340 78 -490 35 18 -193 61 -209
1469 -209 202 -336 387 -313 -91 470 31 -113 157 340 -496 339 44 -376 198 184 -51 -46 908 -253 200
1490 200 630 -378 -72 340 297 -775 769 -116 -152 272 90 -550 18 485 -446 546 -137 9 90 -11
1510 -11 -301 -327 411 -514 247 -49 -162 425 -73 18 -177 297 -394 52 -204 -221 234 -6 -126 -654 449
1531 449 -625 -41 17 -465 187 358 -327 -522 607 -213 -164 347 -267 -67 278 29 -590 426 -42 52
$$ packed form
1388b23K00J0k25J64O06j051N10k3R7k66N00J75r89J004k1o58JO85p07J9J186
1409I94j298L17K94J67n76K13J65p92Q70m21L09l45N95j29n66L33K43k65o06R16
1429D18o32O5P97p88k51N31L46j303J202k07q47R39j14o14r9J287j294M91K51
1448A78m39R9J54K76j047J080o15K87j0J29nk64L56n19M18n68N25j7k11K54k70
1469b09M11n38P23p00K22N61m39j44K70J83q36Q35k95m20N74j4k35NR54j161M53
1490B00M30j008L06M12m3j072J544q85l6M24j82o40N68M67r31R92o83J46Q1j01
1510a1k90k6P38r25P61k96j13N87m98R1j95M74o91M46k56j7M55k40j20n28J103
1531D49j074N84N8m82O52J71o85j95J129q20M9N11o14K00L45k49o19J016m68R4
$$ plain form
1551 52 73 7 40 -21 479 -612 344 84 108 406 -146 84 -52 559 -177 40 -13 -60 93 -72 -268 30
1573 30 457 -231 127 -13 -145 60 119 -66 -264 136 -61 -83 88 -369 60 -11 76 -366 344 -28 46 253
1595 253 -75 -280 -88 98 -346 -64 -87 -74 -179 173 -123 -428 464 -262 136 -439 -447 -109 201 -20 -475
1616 -475 47 -182 346 -171 -117 177 203 191 -251 48 -66 406 246 -302 -209 200 492 -335 53 108 311 151
1638 151 -56 -262 -44 759 -211 -66 -499 226 686 -47 -251 -152 475 119 329 -348 -32 351 314 -267 -527
1659 -527 102 49 289 -197 -403 208 419 141 -523 130 -212 133 -21 -324 3 42 568 -625 103 166 -202
1680 -202 115 -155 -262 -244 390 -376 122 -331 172 96 31 616 98 45 -467 50 -622 -128 -9 37 430 183
1702 183 -284 -312 122 -363 -47 10 -41 6 -41 388 -297 162 175 -188 -37 304 290 -62 272 -170 1 311
$$ packed form
1551E2K1o6L3o1N00j091R56k60K4K98n52K30j36O11p36K17n3m7J53j65j96K98
1573C0M27o88L58j40j32K05N9j85j98M00j97k2J71m57M29p1Q7m42P10l72P4K07
1595B53l28k05J92J86m44K82k3J3j05L52k96l05Q92p26L98n75qL38L10k21m55
1616d75N22k29N28n17N4K94K6j2m42K99j14M72j60n48R3M09K92q27L88N5K03j60
1638A51k07k06K18Q03r70J45m33P25M60p33k04R9O27l56K10o77L16L83l7n81k60
1659e27O29n3K40m86k06O11K11k78o64O53l42L45j54l03L27L9N26j193P28O3l68
1680b02L17k70j07J8O34p66M98m53N03p6o5N85n18n3n12N17o72M94J19M6L93k47
1702A83m67k8M34m85L16N7n1M7m7M29o85M59J3l63J51L41j4l52L34m42J71L10
$$ plain form
1724 311 76 14 97 320 -170 -121 -161 -110 25 147 210 -177 106 63 149 55 164 -49 -72 182 -425 -248 -370
1747 -370 176 -204 -143 -16 -209 133 107 -221 -295 427 -148 -181 108 -188 -54 -211 266 -449 22 329 151
1768 151 -248 -68 -54 -272 475 -145 -153 -89 190 133 -359 276 -79 163 360 79 -155 187 531 -248 94 46
1790 46 -97 -163 242 -14 -317 547 129 41 -66 310 -148 95 358 -150 -7 77 86 -569 228 233 -117 76 -24
1813 -24 21 -235 581 -225 -261 78 102 -162 -204 10 -75 257 132 -10 -204 -58 253 -369 7 -360 -78 -122
1835 -122 203 -237 95 181 -204 96 -12 250 -144 17 -83 -174 30 531 -172 -198 287 13 -187 325 52
1856 52 -171 44 463 -241 216 588 -142 90 352 151 -170 379 -4 -73 314 358 152 145 522 -177 -32 349
1878 349 -12 -174 -174 336 -542 110 -99 -68 -250 269 -98 -426 550 52 -227 80 147 -409 71 206 -509
$$ packed form
1724C11k35o2Q3K23m90M9m0N1J35J22O3l87K83m3Q6r4J09k13k3K54o07J77j22
1747c70N46l80O1J27j93L42k6l28p4P22n75l3K89k96J34j57M77p15M71L07j78
1768A51l99J80J4k18P47o20qO4K79n7m92O35l55K42J97k81k34L42L44p79L42m8
1790D6j43o6M05k56l03Q64m18q8j07L76m58K43K63n08J43Q4Ro55P97Nl50J93j00
1813b4M5k56Q16q06l6L39K4k64m2K14q5L32j25j42j94J46L11o22L76l67K82m4
1835a22L25m40L32Q6l85L00j08K62l94J61j00r1K04N01p03k6M85k74k00N12k73
1856E2k23K15M19p04M57L72p30K32K62k01l21N49l83o9L87M4k06pL77o99J45L81
1878C49l61j62%N10q78O52k09L1j82N19l67l28R76m98k79L07O7n56M80J35p15
$$ plain form
1899 -509 111 120 -17 -247 273 73 -204 38 -302 194 -440 313 -175 -319 -10 179 62 152 302 -369 295
1920 295 354 -134 -87 214 -155 -132 268 -194 -53 120 -37 -42 19 235 -480 90 68 0 -422 15 386 -279 315
1943 315 188 -309 -58 494 -313 -40 364 -342 270 190 -83 -322 116 -191 -430 169 42 175 -159 247
1963 247 55 -167 -11 81 -256 -219 337 -208 -23 22 48 -225 371 172 -250 654 -211 -134 430 48 -543 -92
1985 -92 438 -91 73 213 188 242 -339 -91 -163 -18 -87 366 -438 224 -133 -36 -59 11 68 172 767 -262 286
2008 286 633 -97 115 -119 300 -298 544 268 -398 320 496 -474 -100 1109 -29 -60 139 -28 -452 318
2028 318 2 -647 404 -69 -662 364 754 161 11 105 84 -417 -276 -1 -253 -151 -905 -135 471 380
2048 380 193 -841 218 46 -306 -366 -244 327 -276 893 171 -275 101 -27 -1 339 444 -571 50
$$ packed form
1899e09O20Rj37k30N20k00k77K42l40M96o34P53m88j44L09J89j17R0J50o71O64
1920B95N9m88M7L01l69K3M00m62J41J73j57nO1K16p15N70k2o8m22M37L71o65N94
1943C15j27m97K51N52q07K73M04p06O12q0k73k39M38l07k39N99j27J33l34M06
1963B47j92k22J56R2l37L7N56n45J85M5K6k73N96j99m22R04q65P7N64l82n91M51
1985i2N30n29J64J40k5N4n81K48p2J45o9M53q04O62l57R7k3P0N7J04N95j029N48
2008B86L47p30K12k34M19n98Q42k76o66P18J76r70L74J209j138l1J99j67m24P70
2028C18l16o49J051m73n93J026L90n93j50R4k1n01J41K75k52J02p54P70O06r1
2048C80j87j034J059j72l52o0J22N71o03J169p22m46L76j28K6L40J05j015O21
$$ plain form
2067 50 326 -328 -186 413 -25 -169 261 -321 -145 140 300 -246 230 403 106 235 90 -125 -284 411
2087 411 -113 -898 44 43 -45 -276 760 115 202 353 -351 24 108 1023 -965 200 227 -159 -32 -129 -67 -353
2109 -353 585 -33 -235 270 9 -175 -243 466 -590 -143 254 -146 -444 364 234 -346 239 57 -403 16
2129 16 215 -328 -203 179 -211 -190 217 90 90 204 133 -429 -67 203 59 -105 247 -181 -279 308 -122 -245
2151 -245 -217 430 43 244 406 -148 -203 102 352 -311 79 112 -475 -116 93 -11 -27 603 -84 -220 327
2172 327 45 82 -77 214 -385 101 144 -212 -296 279 91 -79 331 -50 -78 198 -64 -223 -181 401 -53 -54
2194 -54 110 -184 -235 456 16 -513 175 352 69 -328 130 -256 -359 292 -273 -416 88 517 -350 37 293
2215 293 -69 10 400 210 -524 193 -106 -531 255 205 -315 0 470 -162 17 218 -153 -250 7 358 -230
$$ packed form
2067E0K76o54J42N99m38j44M30n82J76K85J60n46M76J73k97J29j45k15j59O95
2087D11n24p85R42jq8k31J036o45Q7J51p04L75Q4R15j988J165K7l86J27r7O2k86
2109c53R38o18k02N05k61j84o8P09j056M47L97m00k98Q08j30n80N85j82m60M19
2129A6J99n43J25L82l90K1M07j27%J14p1n62L62K70j44j64L52m28r8N87m30j23
2151b45K8O47l87K01J62n54n5L05K50o63L90L3n87L59K09j04j6O30o87j36N47
2172C27k82L7j59K91n99M86M3l56q4N75j88j70M10l81k8K76k62j59M2N82m54j
2194e4J64k94n1O91m40n29O88J77k83l97M58l86j03O51n65j43N04M29q67L87K56
2215B93l62P9L90j90p34P17k99m25P86n0n20L15M70o32J79K01l71r7K57L51n88
$$ plain form
2236 -230 85 136 18 -22 376 -146 -192 446 -29 -104 155 133 -247 138 367 -144 -186 170 74 -469 354 -27
2258 -27 -281 268 444 -245 33 281 -246 -29 222 -128 -87 -113 116 -151 175 129 -253 69 381 -79 -263
2279 -263 87 -135 -443 79 316 -368 -40 213 -292 147 235 -77 -267 470 153 -539 23 -91 -364 -203
2299 -203 429 -431 7 446 -90 -306 279 465 -226 222 15 -236 180 246 -173 -370 821 31 -153 274
2319 274 154 -53 293 555 -416 -21 -57 113 0 192 99 -297 315 279 -203 125 357 -280 -50 318 -257
2340 -257 -239 123 25 -540 190 262 -420 189 375 -237 135 360 -189 -114 185 46 -234 -181 279 -460 51 159
2362 159 -65 -146 287 -60 -436 115 530 -332 378 117 -187 -629 172 -288 -435 1022 359 -582 76 483
2382 483 -610 36 100 -41 -132 230 -116 36 381 -8 7 177 504 -423 162 472 -230 190 0 163 -522
$$ packed form
2236b30L15N1j18m0L98n22m6O38m75p5K59k2l80L85K29n11m2L56r6n43Q23l81
2258b7k54N49J76o89K78K48n27K17K51l50M1k6K29k67L26m6l82L22L12m60j84
2279b63L50k22l08N22K37o84L28K53n05M39Q8l12j90P37l17o92N62j14k73J61
2299b03O32q60M38M39n36k16N85J86o91M48k07k51M16O6m19j97J191p90j84M27
2319B74j20k07L46K62r71L95l6J70j13J92r3l96O12l6m82L28K32o37K30L68n75
2340b57J8L62r8n65P30P2o82O09J86o12L72K25n49P5K99j39k80N3M60p39N11J08
2362A59k24q1M33l47l76N51M15q62P10k61l04m42Q01m60j47J457o63r41O58M07
2382D83j093O46O4j41r1L62l46J52L45l89J5J70L27r27N85L10p02M20j90J63o85
$$ plain form
2403 -522 312 234 -393 357 264 -68 -197 366 -456 -218 89 44 -280 38 133 -377 137 296 -262 -234 89 40
2425 40 -324 305 -98 -434 -42 -116 -476 87 353 -586 193 324 -131 -351 260 99 -664 159 170 -553 -139
2446 -139 150 -174 -218 576 -406 12 339 238 -359 294 338 -119 -12 -12 -249 -221 375 -77 140 57 33 -104
2468 -104 120 415 -309 37 285 -239 -193 227 186 -575 260 146 -75 492 273 -122 35 333 -191 -137 166
2489 166 165 -394 210 284 -379 -239 219 21 -73 496 127 -348 130 -210 -395 -168 77 -557 -117 245 58
2510 58 -39 291 328 -269 347 217 -521 -208 157 -147 -178 331 -63 -347 428 263 -96 292 117 -307 303
2531 303 231 -378 -224 156 50 -297 420 9 -277 324 634 -341 99 301 -180 -84 14 -84 -379 150 133 -426
2553 -426 99 199 112 -37 645 28 -422 379 -204 -259 31 255 -495 342 402 -286 61 388 -20 -261 494
$$ packed form
2403e22Q34p8o27P50r3l32j29N63q22K38L07m5l24L18R5n10N14J59n58K8L23m9
2425D0l64O29m03l36L92p4l60N63K66r39P79J31m55k20O11j61p63Q23J1p23M14
2446a39K89l24m4P94r82M18L27j01n97O53M4m57J07%k37K8N96m52K17q3k4j37
2468a04K24K95p24L46K48n24M6M20m1p61Q35j14k21N67k19l95J57K98n24N4L03
2489A66jn59O04P4o63J40M58j98r4N69l69m75M78l40j85K27K45o34M40L62j87
2510E8r7L30L7n97O16j30p38L13L65l04l1N09l94k84P75j65l59L88j75m24O10
2531C03p2o09J54L80j06l47P17m11k86O01L10r75M40K02m81R6R8r8k95N29j7n59
2553d26N25J00q7j49O82o17m50Q01n83n5K90K24p50Q37O0o88L47L27m08k41P55
$$ plain form
2574 494 -131 -359 -6 40 -460 -7 12 -322 44 392 -75 -222 236 237 -304 87 -61 -220 -161 352 2 -164
2596 -164 177 -198 -147 286 244 -479 245 544 -377 -50 224 -185 -274 305 69 -305 378 474 -99 -122 550 -71
2618 -71 -52 331 -389 -259 326 -119 -304 296 390 -221 83 395 -258 -38 618 -294 -331 169 200 -385 36 204
2640 204 -406 147 159 55 -236 192 -62 -47 160 163 -177 -98 -7 -362 -154 399 -267 -22 437 142 -233 142
2662 142 30 -607 141 170 -299 -364 247 -343 -250 152 -94 -314 104 620 -399 32 81 -203 -244 -12 -324
2683 -324 -448 54 271 -306 -83 417 39 47 203 -255 -82 215 53 -407 95 184 -535 187 243 -115 -71 370
2705 370 -10 -224 459 22 -224 33 309 -660 122 393 -104 -42 229 88 -259 517 -29 -399 64 100 -519
2726 -519 -272 393 -322 -221 280 -28 -276 328 191 -300 253 85 -221 -91 114 -152 -384 210 -247 -169
$$ packed form
2574D94o25k28L53M6n00M53J9l34L66L48m67j47M58Jn41L91j48j59N9N13l50j66
2596a64L41l75N1M33m2p23P24K99r21L27K74m09q9N79k36l74O83R6n73k3O72o21
2618g1J9L83p20J30N85m45j85O00R4o11L04L12o53K20O56r12l7N00L1n85M21J68
2640B04o10N53J2j04k91M28k54J5K07Ll40P9R1l55K08N53o66K45M59k95l75L75
2662A42j12o37P48K9m69o5O11n90R3M02k46k20M18N16j019M31M9k84m1K32l12
2683c24j24N02K17n77K23N00l78QJ56m58J73K97j62m60N02Q9p19P22N6l58M4M41
2705C70l80k14O83m37k46K57K76r69P82K71m97O2K71j41l47P76n46l70M63L6o19
2726e19K47O65p15J01N01l08k48O04j37m91N53j68l06J30K05k66k32N94m57P8
$$ plain form
2746 -169 188 218 -189 88 305 -169 -252 -19 4 -292 154 43 -484 72 297 -131 -2 502 -259 257 173
2767 173 -125 -126 278 -20 -658 233 237 -190 180 394 -196 -342 553 28 -284 219 -55 -399 95 135 -83 15
2789 15 393 -250 -192 355 -31 -366 168 52 -392 32 231 -375 -190 258 -330 -262 415 -76 -357 452 103
2810 103 -394 -12 268 -236 -217 316 -197 -394 37 72 -71 6 405 -262 200 2 -172 -383 611 -48 -140
2831 -140 261 111 -153 -164 807 -668 617 710 203 -121 285 131 -568 349 -22 -647 216 175 -235 -11
2851 -11 487 139 -279 228 231 -20 34 2 -507 32 171 -317 12 331 32 -105 437 172 -215 475 97 -418
2873 -418 -58 331 -325 -57 17 -89 -174 103 189 -330 88 159 -193 -153 316 -334 -471 317 -253 -265 240 -30
2895 -30 -286 239 342 -369 -51 491 -117 -334 296 -219 -204 13 189 -223 -73 237 -187 43 279 -45 -206
$$ packed form
2746a69L57L0m07K77K17m74q3K33K3k96M46j11n27N56K25m28J29N04p61N16q4
2767A73k98jM04k98o38Q91Mm27L70K14n90j46Q95n25l12N03k74l44M94M0k18R8
2789A5L78o43N8N47l86l35N34j16m44M24J99o06J85M48n88O8O77m91k81Q09l49
2810A03m97L82K80n04J9N33n13j97M31L5j43P7L99o67M62j98j74k11R94o59r2
2831a40M01j50k64j1R71j475J285R3n07l24M06j54o99R17l71o25Q63m1m10K24
2851a1M98l48m18N07Lk51N4l2n09N39J39m88L29L19k99j37N42k65l87O90l78n15
2873d18L60L89o56K68P4j06q5K77Q6n19M18P1l52M0M69o50j37P88n70j2N05k70
2895c0k56N25J03p11L18N42o08k17O30n15J5K17J76m12J50L10m24K30K36l24j61
$$ plain form
2916 -206 214 -38 -222 371 42 -386 -11 399 -130 -55 715 -159 -63 246 291 -310 -50 173 -160 -100 124
2937 124 -220 -57 522 42 -170 538 69 -582 89 -19 -486 -172 364 -56 -267 27 75 -457 363 210
2957 210 -306 44 38 -279 -140 105 -347 -287 79 -54 -302 -26 362 -113 114 159 -37 -66 220 -232 -346 307
2979 307 -20 -432 -52 341 -157 -85 489 25 -178 269 39 -492 186 151 -205 15 14 -212 33 367 -223
3000 -223 -30 579 35 43 439 231 -409 112 97 -371 -257 82 -118 -161 409 22 -189 285 133 -207 -16
3021 -16 198 -323 -40 12 -115 -148 283 406 -514 334 166 -62 -52 69 -321 -419 72 -228 -379 135 21 -541
3043 -541 162 240 -208 194 124 -1 -142 426 -283 -241 169 -176 -358 122 136 -256 74 274 -61 -7 192 -118
3065 -118 -437 189 37 -186 85 305 -218 -114 152 -259 -214 506 245 -274 49 214 -201 -67 144 -292
$$ packed form
2916b06M20k52j84N93l29m28L75M10n29P5P70q74R6L09M5o01K60K23l33O0K24
2937A24l44J63N79m80k12P08m69o51O71j08m67L14N36m20k11K94M8n32Q20j53
2957B10n16L50ol17J39K45m52O0L66j33k48K76L88m75K27M5j96k9K86m52j14O53
2979C07l27m12L80L93m98P2N74m64k03M47k30n31O78l5l56K20jk26K45L34n90
3000b23J93O09n44QL96k08o40N21j5m68J14L39k00m3N70l87k11M74j52l40J91
3021a6K14n21K83N2j27l3M31J23r20Q48j68k28J0J21l90r8M91l00j51N14j14n62
3043e41P03P8m48M02p0j25j41N68p09M2M10l45j82M80J4l92L30K00l35N4J99l10
3065a18l19O26j52k23K71K20n23J04K66m11M5P20k61n19L23J65m15J34K11m36
$$ plain form
3085 -292 -252 203 159 -137 341 54 -32 214 226 -364 -219 236 -377 -310 64 33 -412 313 8 -244 218 341
3107 341 -125 14 180 -403 -495 276 240 -205 27 87 -100 150 267 48 -151 509 -187 -500 343 -257 -39
3128 -39 -147 212 -270 -91 367 -179 -93 598 80 -125 289 82 -322 217 -75 -459 -249 327 -140 -108 366
3149 366 68 -93 346 39 -305 37 392 -193 -292 -29 82 -176 348 76 91 104 485 -112 -43 662 -399
3170 -399 -246 346 -335 -346 85 -387 -621 519 377 54 -277 646 -405 -435 756 -530 -274 52 -116
3189 -116 -344 150 290 -354 -44 447 -124 -305 186 -386 -194 140 -96 7 96 188 -52 -94 395 321 165
3210 165 197 72 -221 65 62 -270 65 178 24 -116 367 141 16 387 182 -250 207 223 -376 0 182
3231 182 -242 -39 46 -122 -146 355 237 116 268 248 -403 23 98 -337 -492 142 158 -364 235 1 -342 53
$$ packed form
3085b92M0M55m4k96M78k87q6K46J2n90J45M55o13O7L74l1m45P25l05k52M62J23
3107C41m66J39J66n83r2P71l6m45K32O0j87K50J17k19j99O60o96l13Q43o00K18
3128c9j08L59m82J79M58n46Q6O91n18k05M14k07m04N39k92l84K10N76m67L2M74
3149C66k98j61M39l07l44L42L55n85r9K63J11k58N24k72J5J3L81n97O9P05j061
3170c99J53N92o81j1M31m72k34J140j42l23l31R23j051l0J191j286K56L26j68
3189a16k28M94J40o44L10M91n71j81M91n72J92L34k36J03Q9R2k40m2M89p4j56
3210A65L2j25k93K86ll32L35J13j54j40M83k26j25L71k05m32M57J6n99L76J82
3231A82m24K03Q5j68k4N01j18j21J52k0o51M26P5m35j55O34J6n22N99k34l43L95
$$ plain form
3253 53 10 -135 41 311 -155 -183 208 -34 -312 -16 109 -552 221 349 -275 -184 528 -200 -284 306 -190 -117
3275 -117 101 127 -304 65 385 -329 37 327 65 -36 484 -33 -350 139 162 -238 9 228 -68 63 227
3296 227 -127 127 175 344 -259 122 36 -123 -288 414 -212 -230 274 -47 -82 104 360 -250 185 413 -220
3317 -220 -231 148 -293 -282 7 -313 -181 95 -26 -101 221 373 -3 17 151 -138 -106 65 -115 -381 -26 462
3339 462 -155 193 62 195 26 187 -166 -173 -82 75 -165 121 170 -198 114 198 -40 -53 244 239 -98 193 146
3362 146 -76 -93 152 -199 -181 294 -367 -73 244 102 -382 330 147 -101 103 1 -291 -275 216 -233 -53
3383 -53 423 12 15 170 537 6 -9 -73 -422 -338 78 -136 -474 -31 -123 -225 262 24 -6 45 378 -183 -48
3406 -48 112 -292 -266 -80 59 -419 112 176 82 25 347 53 -183 114 -68 -248 135 1 -230 -96 -5 -212
$$ packed form
3253E3m3j45J76K70m66k8L91k42k78K96J25o61P73J28o24R1P12p28q4N90m96P3
3275a17K18K6m31L69L20p14L66K90k62j01N20n17l17M89K3m00K47K19k96J31J64
3296B27l54K54M8J69o03L81q6j59j65P02o26j8N04l21l5J86K56o10M35K28o33
3317b20j1L79m41J1K89l20J32K76j21p5L22J52l76K0J34k89L2J71j80k66L55M88
3339D62o17L48j31J33j69J61l53pR1J57k40K86M9l68L12Q4k38j3K97nl37K91m7
3362A46k22j7K45l51J8M75o61K94L17j42m84P12j83k48K04j02k92J6M91m49J80
3383e3M76m11LJ55L67n31j5o4l49Q4M16k14l38M43r2j02M87k38l0N1L33n61J35
3406d8J60m04K6J86J39m78N31O4r4n7L22k94k36K97j82j80L83j34k31J34R1k07
$$ plain form
3428 -212 226 397 118 -72 166 84 -281 -60 -51 -273 -204 249 -68 -73 183 284 -75 207 217 -179 295 145
3450 145 -163 -159 13 -332 -78 125 5 -266 339 86 -235 -53 382 -149 -34 221 -360 -303 257 253 -485 -23
3472 -23 270 230 -14 321 29 122 119 -261 -156 82 -287 -317 -51 205 -242 -32 291 54 -40 246 -317 -262 203
3495 203 30 -244 -76 96 -203 41 389 -188 74 130 110 -181 166 21 -34 -54 18 -434 55 355 -20 98
3517 98 426 238 -236 94 281 -393 238 51 -226 -306 154 -168 -231 256 -177 88 -32 161 -249 -134 288
3538 288 -154 -337 -167 -210 -299 183 -4 -266 119 358 -17 -210 320 -29 -131 245 -226 -301 -44 157 -310
3559 -310 -9 185 -221 49 203 -241 -223 193 129 -129 118 115 -141 -385 0 -321 96 208 -59 3 278 -38
3581 -38 -138 97 5 -332 -155 -25 -176 -228 385 159 -71 231 150 -159 179 246 -61 131 114 -174 -108 291
$$ packed form
3428b12M38J71k79j90K38q2l65K21Rk22O9M53l17nK56J01l59K82J0l96M74j50
3450A45l08MJ72l45K54K03j20k71O05k53l21J82M35n31J15K55n81N7N60mp38M62
3472b3K93m0k44L35k92R3ll80J05K38l69l0K66K56m47K10L23k37r4K86n63N5M65
3495B03j73k74J68J72k99K44L48n77K62N6k0k91L47j45n5k0P2m52M89L00l75J18
3517I8L28j88m74L30J87o74O31j87k77q0M60l22o3M87m33K65j20J93m10J15M22
3538B88m42j83J70m3q9M82j87k62L85K39l75j93N30l49j02L76m71p5K57K01m67
3559c10L01J94m06K70J54m44J8M16o4k58K47lk56k44L85l21M17J12k67O2K75l16
3581c8j00K35r2l37J77J30j51n2O13k26k30L02q1l09L38O7l07J92j7k88O6L99
$$ plain form
3603 291 -92 129 170 202 -275 -14 156 -5 -13 176 -279 -227 228 166 -297 -134 -61 -266 167 -3 11 -78 105
3626 105 -142 25 199 55 -399 35 101 -101 -166 -58 -267 50 264 91 -96 340 76 46 20 -154 -231 -181
3648 -181 -33 -152 -25 396 252 -87 170 -97 -133 23 176 -80 1 -38 -66 -166 323 -27 -214 137 188 -335
3670 -335 -12 302 -246 180 302 -127 -140 232 192 -89 68 338 -136 209 194 -210 38 158 -16 -344 303
3691 303 -136 -241 69 131 -366 -48 238 64 68 205 -62 164 -133 119 -195 99 -46 -139 -29 345 -93
3712 -93 -31 239 8 42 213 79 -260 -123 142 -253 -57 114 270 -147 -10 141 -144 3 84 60 80 286
3734 286 -192 41 60 182 -63 60 213 -146 223 173 82 199 281 -11 -18 397 54 -143 134 81 145 398 429
3757 429 -184 -59 246 -183 -146 3 111 -210 99 -212 139 -139 123 -111 -108 92 -109 -79 -51 126 -118 115
$$ packed form
3603B91l83K21M1L2m77K61J70j61qJ89m55N2M55o2m63J63P3k05M33j70J4q9J83
3626A05k47J67J74j44m54M34O6k02o5J08k09L17K14j73j87M36k64l0k6j74p7N0
3648a81J48j19J27M21j44l39K57k67l6J56J53k56Q1l9k8j00M89l50j87L51N1n23
3670c35L23L14n48M26J22m29j3L72m0k81J57K70m74L45j5m04K48J20j74l28O47
3691C03m39j05L10O2m97L18K86j74MJ37k67K26k97K52l14K94j45r3J10L74m38
3712i3O2K70k31L4J71j34l39J37K65l95J96J71J56m17J37J51k85J47Q1k4K0K06
3734B86m78K33J9J22k45J23J53l59L69n0r1J17Q2k92pM15l43j97K77n3O4K53L1
3757D29o13J25L05m29L7J49J08l21L09l11L51k78K62k34LK00k01L0K8J77k44K33
$$ plain form
3779 115 -241 -282 170 161 -313 -71 297 -147 147 221 8 -61 -7 63 -395 -14 61 -79 -147 -102 213 -96 254
3802 254 -80 -79 -51 151 -1 -153 127 -51 -8 -20 203 92 155 211 -166 65 183 -96 -183 157 -91 -287 280
3825 280 165 -137 -174 -220 -97 120 239 148 -430 -39 186 179 42 294 -738 -225 -246 -474 -48 -127 15 -26
3847 -26 497 -220 133 242 1 -339 79 -223 11 -170 157 -51 -21 290 -16 -133 79 62 -239 -40 260
3868 260 -20 24 -53 -110 -148 221 -254 -51 205 62 -157 -167 374 -110 -275 -19 -105 -103 108 196 -258 201 102
3891 102 162 50 215 12 -112 262 -10 -154 286 -84 15 76 149 30 202 7 -36 -30 -36 108 -70 161 -284
3914 -284 -157 179 211 -355 17 91 -198 46 176 322 -206 107 67 -51 65 -11 -309 -167 12 -245 -114
3935 -114 205 31 -108 45 16 -285 44 221 -118 -121 37 39 -308 286 272 60 103 17 -141 -48 249 -62 -81
$$ packed form
3779A15l56m1M52rm74K42L68m44K94P4k13o9N4P0m58L81P5j40o8M5L15l09L50
3802B54l34JK8K02j52j52K80j78M3j2K23j11O3N6l77K31J18k79q7L40k48j96N67
3825B80j15l02l7m6J23K17J19r1n78L91K25pj37K52j032N13k1k28M26p9J42m1
3847b6N23p17L53J09k41l40M18l02K34j81L27k08L0L11l06j17K12j7l01J99L00
3868B60k80M4p7n7l8L69m75K03K56j43k19j0N41m84j65K56q6KK11Q8m54M59r9
3891A02O0j12J65k03j24L74k72j44M40l70R9O1P3j19J72j95m3OoJ44j78K31m45
3914b84J27L36L2n66L72P4k89K44J30J46n28L13m0j18J16p6k98J42J79k57J31
3935a14L19j74j39J53k9l01L29J77l39lJ58Kl47N94j4k12M3q6j58R3K97l11j9
$$ plain form
3958 -81 252 -42 -149 166 54 -123 305 142 -56 56 159 -167 -117 179 -95 -140 80 248 -197 119 3
3979 3 -166 99 -7 -225 -306 101 -67 -100 352 70 -222 -100 473 -40 -73 48 -141 -127 11 28 -189 -123 117
4002 117 -263 -143 9 -269 30 91 -226 -171 126 -81 239 -204 66 -241 53 -136 42 -140 263 -73 69
4023 69 68 176 -45 12 186 88 -45 92 -3 -48 -18 -10 -67 10 177 -301 197 56 -27 -47 238 -96 -146 321 187
4048 187 58 -142 76 -436 124 17 -24 -182 209 107 -251 247 138 -76 -59 -152 -29 -31 141 -55 107 83
4070 83 21 -154 84 119 -197 76 -67 -174 -118 223 -118 168 -69 142 117 222 239 -50 -1 -122 -22 -315
4092 -315 2 -272 -153 206 99 93 1 -98 -137 -71 112 -117 261 261 82 -205 -126 -56 -53 -10 299 -29 15 192 11
4117 11 195 -17 13 170 -112 21 118 -6 2 -154 201 46 -49 -54 -88 -43 -122 382 112 -322 38 159 -118 25
$$ packed form
3958h1L33k94j07L15j12j77M28j63j98J12J03l26N0K96k74m5K20J68m45L16j16
3979Cj69K65j06k18q1M07j68l3M52k82k92J22N73n13l3J21j89J4J38J7k17O6K40
4002A17l80J20J52k78K99O1l17N5K97k07L20m43K70l07K94j89J78j82M03l36J42
4023F9jJ08k21N7J74r8j33J37r5m5L0Qn7P7J67m78M98j41q3k0K85l34n0M67j34
4048A87j29k00K18n12N60j07m1j58L91j02l58M98j09k14J7r3J23kJ72j96J62k4
4070H3o2j75K38L5l16K73j43j07N6L41l41K86k37K11k5J05J7k89M9j21J00k93
4092c15L17k74J19L59j07or2r9l9O6J83k29L78%j79k87P9P0LM3L09l28M4J77j81
4117A1J84k12L0J57k82J33R7j24Qj56L55j55r5nl4M5p9N04k70m34L60J21k77J43
$$ plain form
4141 25 181 -256 15 -137 124 -210 -143 -51 -84 84 -361 -167 -224 -31 -92 -153 -53 182 -176 -108 124 -29 -26
4164 -26 -3 115 -135 -101 55 -34 162 14 9 -55 -187 -54 -87 -41 23 -149 89 56 -205 118 232 129 45 48 319
4189 319 -48 42 21 -46 355 97 -112 -62 21 3 158 264 -47 -12 65 26 -47 7 -171 -52 229 -31 -168 123
4213 123 34 -416 160 124 239 -120 43 -194 1 -10 -81 -113 -188 123 84 97 35 -162 209 -136 216 -47 -108
4236 -108 90 113 -131 -111 -14 -122 221 -60 -151 294 -47 -108 239 270 72 -35 112 22 -108 45 -32 -189 346
4259 346 -29 -211 -14 7 -36 -101 -17 -89 -28 -207 136 61 -86 18 -38 85 -4 125 -171 -93 -109 -28 -71 -138 -70
4284 -70 -195 75 -239 185 159 -62 -32 -10 372 -186 52 -107 -118 -7 7 76 -131 113 34 -98 72 -227 122
4307 122 74 -44 -108 117 -184 33 81 -47 -161 68 170 22 -53 70 58 101 11 63 -18 -74 255 -219 159
$$ packed form
4141B5J56m37K71j52K61l34O7R2l3J68m45J94n7J93o1o1J00K35l58O8K32j53L
4164b6K3J18k50L4J56q9J96j48no4j32J33l3M6O4j72K38l3k61L23J14j03q4LK71
4189C19l67R0k1o7M01k58k09N0Q3j8J55J06l11L5P7l9p3N4j78J19K81k60j37K91
4213A23q9m50N76l6J15l59J63k37J95j1p1l2p5L11l9J3o2j97L71l45L52k63o1
4236a08J98K3k44K0R7j08L43k81r1M45l41o1L47L1j98j07J47r0j30J53p7j57N35
4259C46l75j82J97K1m3o5Q4p2O1j79L43p5j47J04n6J23q9J29k96P8j6Q1m3o7O8
4284g0j25K70l14M24k6k21L0K2L82n58K38j59j1J11J4O9k07K44p9j32J70k99L49
4307A22m8j18o4K25l01K17M8j28j14K29J02j48p5J23j2M3r0N2q1n6L29m74L78
$$ plain form
4330 159 207 180 -78 124 -142 139 99 73 -279 -101 322 48 -73 -118 -117 -155 255 -149 127 31 45 137 -92 86
4354 86 0 -42 -5 52 -116 -152 105 -27 122 82 53 -285 -98 -206 202 -156 -210 172 18 61 -74 51 35 -131
4378 -131 92 -25 -229 -133 121 -97 -119 42 -327 12 -58 374 -48 -98 134 -23 -220 167 -52 -216 188
4399 188 104 -32 -25 69 -5 243 2 118 63 -191 261 125 173 -3 180 8 109 71 -130 -33 -100 -90 302 -129
4423 -129 -63 14 199 48 14 219 24 198 -115 -35 1 -118 143 -97 37 174 78 -32 96 -16 44 14 -90
4446 -90 -80 -246 -190 -126 123 -67 -141 -76 -149 -77 -40 -236 -41 102 -212 193 -122 59 -78 -37 -19 -137 -31 -165
4470 -165 99 -132 -231 -49 -113 -19 52 -72 8 -29 72 -56 92 16 12 -145 -105 74 -100 -39 189 -247 153 325
4494 325 -49 144 -18 -18 25 -148 145 -190 6 -143 1 106 -178 -21 -32 230 -21 90 -46 64 -35 -128
$$ packed form
4330A59M8k7k58K02k66K81m0k6l52J78M23k74j21m5Jl8M10m04K76r6J4R2k29J78
4354H6q6m2L7N7j68l6K57j32J49m0k9l38J87j08M08l58n4L82j54M3j35J25j6j66
4378a31K23j17k04R6K54k18k2J61l69L39p0M32m22n0K32j57j97L87k19j64M04
4399A88q4j36PR4p4K48k41J16n5k54M52j36M8j76J83j72J01l8k01R7o7J0L92m31
4423a29O6P7J85j51l4K05j95J74l13Q0L6j19K61k40J34J37r6j10J28j12O0l0j04
4446i0J0j66N6O4K49j90p4O5p3P2L7j96J95J43l14M05l15J81j37M1J8j18J06j34
4470a65K64k31r9J82o4R4P1j24Q0l7J01j28J48p6mj57M0J79j74O1K28m36M00J72
4494C25l74J93j62%M3j73K93l35J96j49J44J05k84J57j1K62k51J11j36J10r9r3
$$ plain form
4516 -128 184 -87 61 110 -87 -25 -121 171 -195 68 -100 243 -174 123 -386 -62 171 -128 -99 -238 177
4537 177 -131 9 36 140 67 109 -88 79 45 49 -106 43 -122 -117 -56 17 103 209 -65 243 153 248 -97 -175 -61
4562 -61 -30 -5 -139 0 1 197 -32 57 -139 -217 100 -37 -7 -132 52 -17 -9 161 -309 30 -25 209 234 -35
4586 -35 30 143 69 -11 -76 -37 -1 114 99 32 -31 -29 -109 -176 78 40 -237 64 341 -101 -99 -201 -113 76 -29 -184
4612 -184 -263 -69 -148 75 -203 -86 179 181 -287 -26 273 140 185 -52 -151 60 47 227 117 -174 66 -391
4634 -391 130 -134 -179 -52 37 -59 17 -262 64 -230 -404 252 83 -93 121 170 -724 335 229 196 -18 49
4656 49 -26 166 -539 116 165 -181 386 -306 -520 -242 -30 -104 -232 384 153 -306 215 -100 -67 -36 -41 6 278
4679 278 -95 8 102 -75 -246 -242 125 -316 -16 -28 -64 -16 156 55 99 -11 -21 30 99 -114 77 185 80
$$ packed form
4516a28L12k71J48M9j97O2r6K92l66K63j68L43m17K97n09L24K33k99K9j39M15
4537A77l08J40K7J04p3M2j97J67l4Mj55J49j65NO1P3Q6J06k74L08r0R5l45p8J14
4562f1L1K5j34J39JJ96k29Q9j96p8L17j37L0j25J84o9QJ70m70L39n5K34K5k69
4586c5O5J13p4q0o5L9L6J15j5o7o3Kq0o7K54l8k77L01K77m42Kj02Q8J89j05j55
4612a84p9J94p9K23k78J17K65Km68K61K99j33M5k37r9K11j3J80j10k91K40m57
4634c91N21k64m5J27Q9r6P6k79L26k94j74O56j69j76K14M9q94J059j06l3k14O7
4656D9p5J92p05O55M9l46N67o92k14K78K12p4j28O16k31m59N21l15L3L1nM7K72
4679B78l73J03R4j77j71ML67m41L00j2l6M8J72j01M4j10j0N1O9k13J91J08j05
$$ plain form
4702 80 40 -45 -53 -27 26 -66 -91 176 17 -72 139 38 -55 -33 140 -99 -151 -12 -35 -171 -144 121 -87 -129 -9
4727 -9 29 -108 -177 168 -20 121 -143 -73 -107 13 -15 -193 166 -34 129 -51 36 -162 51 108 -78 175 -40
4750 -40 -123 59 254 158 -131 40 77 49 92 -155 183 -192 152 43 223 -213 -113 128 -180 81 129 238
4772 238 426 112 -19 -313 -291 -69 -517 325 624 226 389 -230 -83 454 948 168 -304 -119 -69 18 -7
4793 -7 7 -196 70 49 -112 -46 192 -81 182 197 149 70 -96 -89 -20 75 -286 -206 85 1 -29 149 81 -74 87
4818 87 -153 9 -181 -52 -4 -83 46 -29 12 58 -13 -80 35 -127 214 81 131 -48 -32 126 27 114 -109 30
4842 30 -25 -88 154 36 -96 147 64 53 -83 101 -52 238 175 336 144 218 77 -144 -154 -24 6 139 9
4865 9 -67 -14 -76 -113 160 -18 134 -3 21 56 57 -392 267 146 -73 54 5 -43 24 -214 -155 107 -27 32 -176
$$ packed form
4702H0m0q5qK6N3r2k5K67j59q9K11j01r3K2J73k39n2J39k3j36K7K65k08m2J20
4727iL8j37o9L45j88J41k64P0l4J20k8j78L59k00J63j80Q7j98K13N7j86K53k15
4750d0q3J82J95r6k89J71L7k8M3k47L38l75L44j09J80m36J00K41l08K61M8J09
4772B38J88l14j31k94K2K22m48Q42K99l98J63o19J47N37M94p80m72J85N0Q7k5
4793gJ4k03K66k1j61O6K38k73K63J5m8p9j66PO9R5l61Q0K91q4l0J78o8j55J61
4818H7k40J62j90J29M8p9J29p5M1M6p1o7J15j62L41j33N0j79J6J58r9Q7k23J39
4842C0n5o3K42j18j32K43q3j1j36J84j53K90o3J61j92P4j41k21j0J30L0J33j30
4865Ip6N3o2l7K73j78J52j37K4L5Jm49O59j21k19J27m9m8O7k38N9K62j34N9k08
$$ plain form
4890 -176 -64 31 44 -149 -390 186 72 -10 107 -134 -13 200 -134 -374 -229 -205 -66 -150 -21 -32 -87 -236
4912 -236 -183 105 159 47 -101 -58 43 -102 183 -70 31 -61 150 -21 61 -20 -292 -217 95 -49 75 165 125
4935 125 -165 -17 4 -86 210 -84 -110 -123 73 -3 -23 58 87 -77 -46 -143 -180 71 -48 42 -123 36 52 -97
4959 -97 55 -169 161 5 45 -122 29 35 -233 61 -161 -13 55 146 -140 -120 -48 12 100 6 120 35 65 -87
4983 -87 135 188 -166 -29 222 14 -412 -707 124 117 -103 326 9 -138 -37 90 -147 -284 -122 10 -352
5004 -352 -135 190 -32 -148 149 201 -35 89 68 19 -126 65 -173 42 294 -112 153 156 -43 80 166 21
5026 21 -85 216 -84 -14 26 -2 -191 64 87 -237 -36 -31 -128 95 240 -314 74 212 -119 26 -77 44 -109
5049 -109 16 65 -8 74 -104 -35 -8 38 252 153 258 116 -88 127 -114 49 -73 -47 -125 166 -241 129 26
$$ packed form
4890a76J12R5J3j93k41N76j14q2J17k41J21K13l34k40J45K4J39q4J29j1n5j49
4912b36N3K88N4j12j48M3J01j45K85k53J01r2K11j71Q2q1k72P5L12j44J24R0m0
4935A25k90J48K1r0K96k94k6j3J96p6k0Q1K9j64L1r7l7K51j19R0j65J59J6j49
4959i7J52k24L30j56M0j67J51Ok68K94k22J48O8R1k86K0P2O0Q8r4J14q5L0j52
4983h7K22N3l54J37K51k08m26k95Q31pk20M29l17j47J01J27k37j37J62J32l62
5004c52K17L25k22j16K97N2k36J24k1m9j45J91k38K15K52m06K65Lj99J23Q6j45
5026B1j06L01l00P0M0k8j89K55K3l24K01Nr7K23J45n54L88J38l31J45j03J21j53
5049a09J25M9p3Q2j78O9K7M6K14r9J05j42k04K15k41J63j22K6p8K91m07L70j03
$$ plain form
5072 26 -59 373 96 -57 134 -44 -85 -53 -99 300 239 88 -32 -123 109 -1 34 -118 76 15 27 27 -120 -131
5096 -131 -21 -38 -185 146 -90 -205 -126 92 73 -276 169 -80 93 -278 -120 -51 134 10 5 -102 -46 -53 19
5119 19 138 83 -16 19 73 25 131 -40 48 -124 27 -132 -6 -15 -60 103 30 -99 -195 -113 33 -15 45 148 26
5144 26 -66 116 -105 -226 -73 -35 -164 83 67 105 22 1 -41 -60 -66 123 214 -46 -46 88 34 63 4 -140 102 24
5170 24 -76 301 15 132 -147 -49 120 -154 -86 -102 35 -78 -79 91 20 -110 -108 7 -14 -97 148 -252 -22 -161
5194 -161 230 -126 221 -85 -116 -8 185 246 -16 3 149 93 -225 254 -19 -117 -112 31 -458 -198 -356 43
5216 43 -17 162 -132 -72 -46 -214 11 40 -65 -119 127 176 135 51 189 298 -44 50 -56 -45 -148 377 -23 -6
5240 -6 -29 -109 147 -197 98 -88 -198 -212 -37 233 267 -200 -45 173 58 -55 272 -184 -93 440 134 7
$$ packed form
5072B6q5M32k77j53J91j78m1L2m6L99o1j51j20r1K32j10L5j52J94o1J2%j47j1
5096a31J10j7j47L31k36j15P9K18j9l49M45k49J73l71J58O9J85j24nj07N6pP2
5119A9J19n5r9L5N4m8J06j71Q8j72J51j59J26rm5J63p3j29r6Q2J46m8O0J03j22
5144B6r2J82k21j21J53L8j29K47j6L8q3k1m2j9oJ89R1k60%J34n4K9n9j44K42p8
5170B4j00L77k86J17k79R8J69k74O8j6J37j13jJ70p1j30KJ15k1q3K45m00K30j39
5194a61L91l56L47l06l1J08J93O1k62J9J46n6l18M79k73r8NJ43m89K60j58L99
5216D3o0J79k94O0K6j68K25K9j05n4K46M9m1q4J38J09l42R4j06J1j03N25m00J7
5240fk3q0K56l44K95j86j10j4J75K70L4m67J55K18j15j13L27m56R1N33l06j27
$$ plain form
5262 7 186 125 -211 -191 308 -102 49 77 -145 -132 23 -10 -29 117 -44 8 -74 -60 101 -353 -27 101 -9 -76
5286 -76 -121 174 97 131 63 185 18 -161 -55 -175 335 -111 3 157 -122 -19 44 67 -4 -50 63 70 -69 208
5310 208 -166 -100 81 -356 -2 151 -183 -279 304 176 -24 -103 40 -80 -44 -80 2 -54 -51 82 -260 126 10
5333 10 40 71 -107 -101 -112 -65 269 -45 109 -124 -64 -10 -86 -176 -5 168 -98 -82 70 85 -55 -14 -110 -60 167
5358 167 -25 -31 58 74 7 -183 130 28 86 105 25 -84 -284 -230 -171 244 -129 163 231 324 37 93 -68 -120 140
5383 140 -165 102 -253 86 30 -97 -23 171 119 -31 19 184 193 97 27 -79 -75 182 -269 -117 73 -87 117
5406 117 -159 -93 -28 -99 -154 -66 -104 188 -120 -124 -128 0 -26 198 -62 -67 298 -135 -105 67 13 -163 59 25 79 20
5432 20 46 126 -215 57 190 -63 54 134 84 -73 208 -39 -284 -66 69 11 207 -63 -13 -99 109 -53 -75
$$ packed form
5262GJ79o1l36K0M99m10J51K8k22J3J55l3j9J46j61N2q2J4J61m54L26J28j10o7
5286g6m5K95p7L4o8J22j67j79J06j20N10m46J14J54k79J03O3K3p1m6J13Pj39K77
5310B08l74O6J81m37L54J53l34r6N83j28k00p9J43j20L6l6Q2n6LJ33l42L86j16
5333A0L0L1j78Oj1M7L34l14J54k33O0N4p6r0J71J73k66J6J52J5j40M1r6N0K27
5358A67j92oQ9J6o7j90L13j02N8J9q0j09k00N4N9M15l73K92O8R3k87N6j61n2K60
5383A40l05K67l55L39n6j27P4J94n2j50N0J65Rr6p0j06MK57m51J52J90j60K04
5406A17k76O6O5p1n5Q8l8K92l08mmJ28k6K24k60nL65m33L0J72n4j76K22l4N4n9
5432B0K6Q0l41K72J33k53J17Q0n0j57K81k47k45K18J35n8J96k70N0q6K08j62k2
$$ plain form
5455 -75 20 314 20 82 -207 -167 5 -75 91 -173 281 88 -2 -15 33 168 8 55 -220 -111 243 -52 -61 54
5479 54 101 -50 28 -5 -98 -10 -201 -80 142 56 -23 -14 65 -354 -87 119 34 -182 289 165 117 -53 70 227
5503 227 -203 226 -102 -57 31 -179 83 12 2 -94 210 -71 12 -106 59 20 -49 -54 -112 104 63 0 39 187 -91
5528 -91 -28 2 -113 165 -229 -114 -210 -35 -4 -76 66 -116 17 -329 45 -91 -102 213 172 -20 -111 -44 -161
5551 -161 -69 -46 65 198 -413 415 -548 -38 -17 -51 216 -363 -57 -79 124 -103 -38 -26 -20 61 59 -130 77 150
5575 150 -116 553 -247 81 378 319 -176 13 -183 -24 -439 -192 -287 -145 498 -144 -571 211 -73 -444 529
5596 529 -125 -762 -231 -266 -22 229 -698 501 28 -689 839 281 -397 11 -358 580 -1 119 190 -36
5616 -36 631 468 119 307 -195 590 -38 22 -56 -158 -150 234 155 175 -192 41 -272 120 134 47 -67 -51 479
$$ packed form
5455g5R5K94k94O2k89M0J72q0J66k64M54j93r0j3M8J35j60M7k75J09L54k95rJ15
5479E4M7j51P8l3r3Q8j91J21K22q6p9RP9m19K67K06q5k16M71j24m8j70J23J57
5503B27m30M29l28M5Q8k10K62p1j0r6L04k81Q3j18J65l9o9nn8K16m1o3L9J48k78
5528i1O3L0j15K78l94J15r6J75L1p2J42j82J33l46L74j36j1L15m1j92r1O7j17
5551a61R2K3J11J33o11Q28r63N10K1l4K67n79L06k2K03k27O5J2OQ1kj89K07P3
5575A50k66O69q00L28K97n9m95J89j96J59m15K47r5J42O43o42m27P82k84l71R73
5596E29o54o37N31l5K44K51r27J199m73p17J528n58o78M08l69R38n81J20P1k26
5616c6O67j63l49J88n02P85o28O0p8j02QL84p9K0l67K33l13L92J4q7j14J6N30
$$ plain form
5639 479 64 -127 -124 -128 -201 -287 248 -47 -186 -89 -27 -337 18 122 -13 79 -91 107 -13 39 -15 -192 -24 277
5663 277 -17 350 -79 -136 106 -96 81 70 -11 -50 11 -144 95 -164 197 326 -311 -8 -177 -150 -74 95
$$ packed form
5639D79m15j91Lmp3q6N35k95j39R7O2l10L55J04j35R2j70J98j20N2n4j77J68L01
5663B77k94L67m29n7K42k02J77j1q1l9O1j55K39k59L61J29o37L03j69K7P6J69
$$ [...]
8191e6
##END NTUPLES=NMR FID
##END=
