##TITLE=1H_Pr 2
 200.13MHz,CCl4,
 8 sc
 
 11.6.2025
##JCAMPDX= 6.0         $$ Bruker NMR JCAMP-DX V2.0
##DATA TYPE= NMR FID
##DATA CLASS= NTUPLES
##ORIGIN= UXNMR, Bruker Analytische Messtechnik GmbH
##OWNER= pz
$$ XWIN-NMR		Version 3.5
$$ Wed Jun 11 15:23:53 2025 Russian Standard Time (UT+4h)  she@DPX200
##.OBSERVE FREQUENCY= 200.1313
##.OBSERVE NUCLEUS= ^1H
##.DELAY= (6, 6)
##.ACQUISITION MODE= SIMULTANEOUS
##.ACQUISITION SCHEME= undefined
##.AVERAGES= 8
##.DIGITISER RES= 18
##SPECTROMETER/DATA SYSTEM= spect
##.PULSE SEQUENCE= zg30
##.SOLVENT NAME= CDCl3
##.SHIFT REFERENCE= (INTERNAL, CDCl3, 0, 14.3821)
##AUDIT TRAIL= $$ (NUMBER, WHEN, WHO, WHERE, WHAT)
$$ ##TITLE= Audit trail, XWIN-NMR		Version 3.5
$$ ##JCAMPDX= 5.01
$$ ##ORIGIN= Bruker BioSpin GmbH
$$ ##OWNER= she
$$ F:/spectra/data/she/nmr/H-C/1/audita.txt
$$ ##AUDIT TRAIL=  $$ (NUMBER, WHEN, WHO, WHERE, WHAT)
(   1,<2025-06-11 15:22:29.95 +0400>,<she>,<DPX200>,
      <created by zg, POWCHK disabled, PULCHK disabled
       configuration hash MD5:
       00 E9 B6 7A A2 85 ED C7 34 08 36 98 17 FE 4E 26
       data hash MD5: 16K
       85 19 82 CE 30 21 28 8C FA 46 84 83 58 BD 2B F5>)
$$ ##END=
$$ 
$$ hash MD5
$$ 7C 68 5D 32 B1 68 8F 44 25 29 A8 96 5F 9F 0C 74
##$RELAX= 
##$RELAX= 
##$RELAX= 
##$RELAX= 
##$RELAX= 
##$RELAX= 
$$ Bruker specific parameters
$$ --------------------------
##$DU= <F:/spectra>
##$EXPNO= 1
##$NAME= <H-C>
##$PROCNO= 1
##$TYPE= <nmr>
##$USER= <she>
##$AMP= (0..31)
100 100 100 100 100 100 100 100 100 100 100 100 100 100 100 100 100 100 
100 100 100 100 100 100 100 100 100 100 100 100 100 100 
##$AQSEQ= 0
##$AQ_mod= 1
##$AUNM= <au_zg>
##$AUTOPOS= <>
##$BF1= 200.13
##$BF2= 200.13
##$BF3= 200.13
##$BF4= 200.13
##$BF5= 200.13
##$BF6= 200.13
##$BF7= 200.13
##$BF8= 200.13
##$BYTORDA= 1
##$CFDGTYP= 0
##$CFRGTYP= 5
##$CHEMSTR= <none>
##$CNST= (0..31)
1 1 145 1 1 1 1 1 1 1 1 1 1 1 1 1 1 1 1 1 1 1 1 1 1 1 1 1 1 1 1 1 
##$CPDPRG= <>
##$CPDPRG1= <>
##$CPDPRG2= <>
##$CPDPRG3= <>
##$CPDPRG4= <mlev>
##$CPDPRG5= <mlev>
##$CPDPRG6= <mlev>
##$CPDPRG7= <mlev>
##$CPDPRG8= <mlev>
##$CPDPRGB= <>
##$CPDPRGT= <>
##$D= (0..31)
0 0.7 0 0 0 0 0 0 0 0 0 0.03 0 0 0 0 0 0 0 0 0 0 0 0 0 0 0 0 0 0 0 0 
##$DATE= 1749640949
##$DBL= (0..7)
120 120 120 120 120 120 120 120 
##$DBP= (0..7)
150 150 150 150 150 150 150 150 
##$DBP07= 0
##$DBPNAM0= <>
##$DBPNAM1= <>
##$DBPNAM2= <>
##$DBPNAM3= <>
##$DBPNAM4= <>
##$DBPNAM5= <>
##$DBPNAM6= <>
##$DBPNAM7= <>
##$DBPOAL= (0..7)
0.5 0.5 0.5 0.5 0.5 0.5 0.5 0.5 
##$DBPOFFS= (0..7)
0 0 0 0 0 0 0 0 
##$DE= 6
##$DECBNUC= <off>
##$DECIM= 32
##$DECNUC= <off>
##$DECSTAT= 4
##$DIGMOD= 1
##$DIGTYP= 9
##$DL= (0..7)
0 120 120 120 120 120 120 120 
##$DP= (0..7)
150 150 150 150 150 150 150 150 
##$DP07= 0
##$DPNAME0= <>
##$DPNAME1= <>
##$DPNAME2= <>
##$DPNAME3= <>
##$DPNAME4= <>
##$DPNAME5= <>
##$DPNAME6= <>
##$DPNAME7= <>
##$DPOAL= (0..7)
0.5 0.5 0.5 0.5 0.5 0.5 0.5 0.5 
##$DPOFFS= (0..7)
0 0 0 0 0 0 0 0 
##$DQDMODE= 0
##$DR= 18
##$DS= 0
##$DSLIST= <SSSSSSSSSSSSSSS>
##$DSPFIRM= 0
$$ [...]
##$SUBNAM0= <"">
##$SUBNAM1= <"">
##$SUBNAM2= <"">
##$SUBNAM3= <"">
##$SUBNAM4= <"">
##$SUBNAM5= <"">
##$SUBNAM6= <"">
##$SUBNAM7= <"">
##$SUBNAM8= <"">
##$SUBNAM9= <"">
##$SW= 18.0517328524113
##$SWIBOX= (0..15)
0 0 2 0 0 0 0 0 0 0 0 0 0 0 0 0 
##$SW_h= 3612.71676300578
##$TD= 16384
##$TD0= 1
##$TE= 0
##$TE2= 300
##$TE3= 300
##$TEG= 300
##$TL= (0..7)
0 120 120 120 120 120 120 120 
##$TP= (0..7)
150 150 150 150 150 150 150 150 
##$TP07= 0
##$TPNAME0= <>
##$TPNAME1= <>
##$TPNAME2= <>
##$TPNAME3= <>
##$TPNAME4= <>
##$TPNAME5= <>
##$TPNAME6= <>
##$TPNAME7= <>
##$TPOAL= (0..7)
0.5 0.5 0.5 0.5 0.5 0.5 0.5 0.5 
##$TPOFFS= (0..7)
0 0 0 0 0 0 0 0 
##$TUNHIN= 0
##$TUNHOUT= 0
##$TUNXOUT= 0
##$USERA1= <user>
##$USERA2= <user>
##$USERA3= <user>
##$USERA4= <user>
##$USERA5= <user>
##$V9= 5
##$VALIST= <valist>
##$VCLIST= <CCCCCCCCCCCCCCC>
##$VD= 0
##$VDLIST= <DDDDDDDDDDDDDDD>
##$VPLIST= <PPPPPPPPPPPPPPP>
##$VTLIST= <TTTTTTTTTTTTTTT>
##$WBST= 1024
##$WBSW= 4
##$XGAIN= (0..3)
0 0 0 0 
##$XL= 0
##$YL= 0
##$YMAX_a= 223590
##$YMIN_a= -208535
##$ZGOPTNS= <>
##$ZL1= 120
##$ZL2= 120
##$ZL3= 120
##$ZL4= 120
##$ABSF1= 10
##$ABSF2= 0
##$ABSG= 5
##$ABSL= 3
##$ALPHA= 0
##$AQORDER= 0
##$ASSFAC= 0
##$ASSFACI= 0
##$ASSFACX= 0
##$ASSWID= 0
##$AUNMP= <proc_1d>
##$AZFE= 0.1
##$AZFW= 0.1
##$BCFW= 1
##$BC_mod= 2
##$BYTORDP= 1
##$COROFFS= 0
##$CY= -3
##$DATMOD= 1
##$DC= 2
##$DFILT= <>
##$DTYPP= 0
##$F1P= 0
##$F2P= 0
##$FCOR= 0.5
##$FTSIZE= 0
##$FT_mod= 4
##$GAMMA= 1
##$GB= 0.15
##$INTBC= 1
##$INTSCL= 1
##$ISEN= 128
##$LB= 0.25
##$LEV0= 0
##$LPBIN= 0
##$MAXI= 10000
##$MC2= 0
##$MEAN= 0
##$ME_mod= 0
##$MI= 1.114404
##$NCOEF= 0
##$NC_proc= 0
##$NLEV= 6
##$NOISF1= 3.799351
##$NOISF2= 2.8
##$NSP= 1
##$NTH_PI= 0
##$NZP= 0
##$OFFSET= 14.38212
##$PC= 1
##$PHC0= -1350.732
##$PHC1= 8.592199
##$PH_mod= 1
##$PKNL= yes
##$PPARMOD= 0
##$PSCAL= 0
##$PSIGN= 0
##$REVERSE= no
##$SF= 200.129724274929
##$SI= 16384
##$SIGF1= 3
##$SIGF2= 2
##$SINO= 400
##$SIOLD= 16384
##$SREGLST= <1H.CDCl3>
##$SSB= 0
##$STSI= 0
##$STSR= 0
##$SW_p= 3205.1282051282
##$SYMM= 0
##$S_DEV= 0
##$TDeff= 0
##$TDoff= 0
##$TI= <>
##$TILT= no
##$TM1= 0
##$TM2= 0
##$TOPLEV= 0
##$USERP1= <user>
##$USERP2= <user>
##$USERP3= <user>
##$USERP4= <user>
##$USERP5= <user>
##$WDW= 1
##$XDIM= 8192
##$YMAX_p= 0
##$YMIN_p= 0
$$ End of Bruker specific parameters
$$ ---------------------------------
##NTUPLES= NMR FID
##VAR_NAME=  TIME,          FID/REAL,        FID/IMAG
##SYMBOL=    X,             R,               I
##VAR_TYPE=  INDEPENDENT,   DEPENDENT,       DEPENDENT
##VAR_FORM=  AFFN,          ASDF,            ASDF
##VAR_DIM=   8192,          8192,            8192
##UNITS=     SECONDS,       ARBITRARY UNITS, ARBITRARY UNITS
##FACTOR=    0.0002768,     1,               1
##FIRST=     0,             0,               0
##LAST=      2.2672688,     0,               0
##MIN=       0,             -208535,         0
##MAX=       2.2672688,     223590,          0
$$ Real data points
##PAGE= N=1
##DATA TABLE= (X++(R..R)), XYDATA
0@%%%%%%%%%%%%%%%%%%%Nj1J2j2J2j2J2j1RqQpN%nPrJ3k1K8l5M5n4O5p8R0j06
46e8J25j41J58j78J98k19K39k57K76k91L00l05K96k65K06j04o9L64q63J736l372
67b224O802j5816O6986J45972l17180J36175j3685J47536k80116M2428K76382
78A93260l64409J67009l1005J54734j99227K5991K67833l33238J60697p2219R3327
89F2753j30288l1389K41908k80314K02188p9175O7989l3669p1699J78895k62958
100a35759K05993j21635J3804O2011p8873J51568k07248K43830j35743n0688J21887
111F9147j13695Q3396j90807K62894j29493q2669K02170r9009N5600j72102K55558
122A40990j37602j47079K21816j03498L4752j40702K61596r1130j60904K38151
$$ y = [0, 0, 0, 0, 0, 0, 0, 0, 0, 0, 0, 0, 0, 0, 0, 0, 0, 0, 0, 0, 5, -6, 6, -6, 6, -6, 6, -5, 4, -4, 4, -3, 2, 2, -3, 4, -5, 8, -13, 15, -20, 25, -29, 36, -42, 48, -58, 67, -74, 84, -94, 104, -115, 124, -133, 143, -148, 152, -153, 143, -122, 84, -20, -89, 275, -588, 1148, -2224, 4578, -11238, 55748, 201720, -115460, 20715, 7030, 154566, -125550, -83122, 193260, -171149, -4140, -35145, 119589, -79638, -53647, 214186, -119052, 41645, -30574, 62753, -67535, -98924, 142984, -137330, 64858, -14317, 53672, 20003, -51696, 127199, -135759, 70234, -51401, -37597, 24414, -54459, 97109, -110139, 133691, -2052, -52740, 69147, -44548, 38848, -151959, 110935, -18558, -101227, 100943, 1934, 57534, -114568, 140990, 3388, -143691, 78125, -25373, 9379, -131323, 130273, 39143, -121761, 116390]
132A16390j04474J3172j48857K12241p0124j75196K34951q3560L8798j14084J74711
143I3968k7992j80541J93328j04523L9611j07059J19577J7447j41505J79098r5646
154a4237O8533q4754M4282L0727j31065J33233j14681R4014m3136L109O6131q1781
166b9625J08535j35702R4941k7797o5693O3706n1069R6794j34406J16249K3059
177E8992r3571O2147l2305O9722j58760R2882M5228j11540O2257J148Q2942j41363
189f2221P7184O7837j26685L3758j0261P2109j31778N3743R2496r6767L5036k946
201A505P5623j12639R050P9536r1660J9202j8058Q2648o7667k902Q3927n6863
213A702J5621m2089O1504m7378l7190N9859l1099L1379m5390O4802j390m4385
$$ y = [116390, 11916, 25088, -123769, 88472, 18348, -156848, 78103, -5457, 33341, -80743, 93968, 65976, -114565, 78763, -25760, 13851, -93208, 26369, 43816, -97689, 81409, -14237, 54296, -30458, 13824, 44551, -86514, 46719, -67962, 26052, -17084, -13975, 52156, -29625, 78910, -56792, 38149, 10352, -55341, 8365, -42704, 54090, -80316, 35933, 58992, -34579, 27568, -4737, 64985, -93775, -893, 44335, -67205, -4948, -3800, 79142, -62221, 14963, 82800, -43885, -10127, -20388, 51721, -80057, -26314, 66182, -30585, 4451, 1505, 77128, -35511, -26461, 53075, -38585, -19383, -37441, 45207, -22460, -25362, 58565, 1702, 17323, -24766, 36738, -10640, -47830, 12029, -19070, 12309, -33081, 31721, 30331, -14054]
225a4054L4281k2689K6248p0293L5599K4819m1198K2122K722N1805o5018J6088
237D32L9055m6312j0982r544N5081n9702J065O0915j7070j2894p504N8387n3264
250b337l1690M5630j1546k1661j6077O8535k1561l1202M3973Q288k3257l6222
262b9127M6521j1184m6013K5593K4482k191l2838M5743J4714m1876j47J8174j867
275I984m7443K0989L1054k5036n292K8545K2466m0663K43K9599k1740l0499J0795
288a6998L0909k8826q303M1142O495k7749P85L1794k3962l3804K2071J4843k6466
301a8069p571M2294L114k8658J3754K5402k4635k9385K2755R883l3456J189L6823
314A3440l90k5412K0314K3882k7577k2248K3878K110l3922L781L4733p687k0272
$$ y = [-14054, 20227, -2462, 23786, -46507, -10908, 13911, -27287, -5165, -2443, 49362, -15656, 432, 39487, -6825, -17807, -27351, 27730, -31972, -30907, 30008, 12938, 44, -7460, 50927, -2337, -34027, 11603, 57, -21604, -37681, 30854, 9293, -21909, 22064, 30352, 7095, -29127, 17394, 6210, -39803, -14210, 10272, 8081, -24757, 20986, 35700, -6176, -6323, 11851, 9984, -37459, -16470, 14584, -10452, -15744, 12801, 35267, -5396, -5153, 24446, 2706, -27793, -16998, 13911, -14915, -23218, 17924, 24419, -3330, -2545, 29249, 5287, -28517, -6446, 8397, -18069, -25640, 16654, 19768, -8890, 4864, 30266, 5631, -23754, -999, 8884, -24572, -23383, 13440, 13050, -12362, 7952, 31834, 4257, -17991, 5887, 7997, -25925, -22144, 12589, 4902, -15370]
327a5370K4936K1410k8409j4982K4680l994l4925P623K9658j3065j5947K9296
339A0911J7577k7688q433K6056j0690l3272J0706K3523j6724j3767L3804J2016
351B4019k6039k82K4323j2743l3896J6214J6577k2678o451K9655J2728k9530J0900
364B797K2325j8336k4703J2124J6496l1417K85K9882J462j6612O231L0246k7493
377C287j6291J5402K623k0665j0068L7718q610j3340J6113J6346j0223k9423K9459
390A2328o997k3865M66J9475Q162l2739L3433J2610j7718j0834J1829J4281m9762
403b9331J7549J7645j0521j1344J3449L8651m6366J0677J8529j0864k3265o068
415b1259M3244m4399N524K6412M024j0735j4275M9684m3544o919J2055o15n301
$$ y = [-15370, 9566, 30976, 2567, -12415, 12265, 8271, -26654, -19031, 10627, -2438, -18385, 10911, 28488, 800, -7633, 18423, 7733, -25539, -14833, 8690, -8034, -21801, 12003, 24019, -2020, -2302, 22021, 9278, -24618, -8404, 8173, -14505, -20956, 8699, 21427, -8103, 2797, 25122, 6786, -17917, -5793, 10703, -20714, -20429, 9453, 10915, -5697, 534, 30780, 3287, -13004, 2398, 5021, -15644, -25712, 12006, 3396, -9944, 6169, 22515, 12292, -17131, 12328, 5331, -18534, -18068, 1407, 9569, -23170, 10263, 22873, 5155, -5679, 6150, 20431, -29331, -11782, 5863, -4658, -16002, -2553, 36098, -10268, 409, 18938, 8074, -15191, -21259, 21985, -22414, -16890, 9522, 13546, 2811, -11464, 38220, -5324, -12243, -188, -803, -6104]
428f104k5668N4362k5089k7J2570P11P812m2279L9623k4583k427J727k418L2020
442B0230m0225L7188r693M486q183k0613M1769n1158J9120l010J7099n052k5221
455b3263O6145m6717N746m365J6488j3630m7331P6352m1295j78O733K8507k806
468B0386n8864Q2063m3189j5436p26K2831L323o5116R0685k9859j1463O783J5196
481A6614J0626p7177P8306l4424j3076R791P252K9525o6140P5698l0559r390J0484
494G530k0118L3793o4815O1672l0404L884K6660l3414M8133n1095M6204m1556
506a3526L847L0514o1117N4579l2986M0881l8683J6472M7768q2750N4463k5655
518f193K2266m9417J6649O1060r4612O3661n254J8901m7238J3040O6963j14042
$$ y = [-6104, -31772, 22590, -2499, -2526, 10044, 10755, 18567, -23712, 15911, -8672, -11099, -9372, -11790, 20230, -19995, 17193, 7500, 11986, 3803, -16810, 24959, -26199, -7079, -10089, 7010, 1958, -23263, 42882, -3835, 1911, -2454, 14034, 404, -46927, 29425, -11870, -12048, -5315, 23192, 20386, -38478, 43585, 396, -15040, -15766, 7065, 10388, -54728, 35957, 6098, -5365, 1418, 16614, 27240, -49937, 28369, -6055, -19131, -9340, -2088, 27437, -38703, 36995, 6436, -2954, 7530, -12588, 21205, -43610, 18062, -12342, -8458, 18202, -15212, 32921, -18174, 28030, -13526, -9679, 20835, -40282, 14297, -18689, 22192, -16491, -19, 47749, -35001, 19462, -6193, 16073, -33344, -16695, 44365, -50247, 13414, 8160, 27061, -20177, -7137, 59826, -54216]
530e4216N6563k078R517m0040J3839Q0593j09921O0101K728j253l5414l478P6133
543E3074j11006N9936N091r56j1450q920P5294j01884N4637o861j5657L413k3879
556b9168O8767q3453O3671q058j8648K8462l8568N1697p5967N9016k0821k9026
568c2096N5240m2325M4944n3880O5095k8100m2356P0888n8238K6245m3456O6932
580B8893k8178m5320R5295n7525J6814l1959N8895l4284o0124J01054o2094J2184
592f349j7527N9375k2578o0663J05253o4640K432j6027M1032j6410o2846J05101
604D6153n7678J0596m313K9143n529o3900Q9858o3399R802j085J1738J2011n1480
617c8083Q3593n7937J8662K538j3197J7340m8702O5001n9453K9727J3277k6448
$$ y = [-54216, 2347, 269, 9786, -30254, -16415, 64178, -45743, 14358, 17086, 15833, -19581, -23059, 53074, -57932, 2004, 7095, 6139, -5311, -14231, 61063, -40821, 13816, 6955, -8702, -5289, -29168, 39599, -43854, 19817, 11759, -6889, 21573, -16995, 34702, -41265, 17751, -3070, -32096, 23144, -19181, 25763, -28117, 36978, 8878, -33478, 37410, -20828, 5417, -38039, 28893, 715, -44605, 50690, -6835, 9979, -21980, 36915, 2631, -57493, 43561, -18533, -6349, -23876, 35499, 12921, -47742, 57511, -7129, -4697, -20724, 20308, 3898, -58948, 46153, -11525, -929, -5242, 23901, 18372, -45528, 44330, -19069, -9267, -10352, 1386, 13397, -38083, 45510, -12427, 6235, 8773, -4424, 12916, -35786, 29215, -30238, -511, 12766, -13682]
629a3682L4580l4979N0733o2363L0426J3145n0104M0140k5123M1972n5639M1091
641A0197K3853o0806M3965k0918K5519n8808L5461K8556o7788N0964r047K4264
653B5412m9554L2057L0467p4640M3230j1925J5939m1766K6296L9570o6049M6262
665A5299r363J2980l4918R833L3709o3355M0266j1419J5453j6976M411L6054n1409
678a9435L6031k1147P868q906j1024L0806l7915L8703k1038J1632P688j9402K2054
691A5915l2129L1083l0775N319J9914k2823K1549j7839L5531l0869j70K5310l0700
704a0684R117j5579L2507k8554j431L6527k4690Q403j1677K9521k9379j2618L3110
717A4573k5023M555p783L1165j6991j2321L3943k0418P54j4111K1804j3845j7614
$$ y = [-13682, 20898, -14081, 36652, -25711, 4715, 17860, -32244, 7896, -17227, 24745, -30894, 10197, 34050, -26756, 17209, -3709, 21810, -36998, -1537, 27019, -40769, 10195, 1148, 25412, -24142, 7915, 38382, -36258, 6972, -4953, 10986, -30780, -4484, 35086, -30963, 15299, 5936, 18916, -16002, -6169, 27540, -35815, 4451, -6968, 8485, -8491, -4080, 31974, -19435, 16596, -4551, 3317, -5589, -16613, 14193, -23722, 14981, -6057, 5575, 13263, -6139, 15915, -16214, 14869, -15906, -10587, 9327, -13496, 8053, -9786, 25745, -5124, -5294, 20016, -10684, -1567, -17146, 15361, -13193, -14624, 21903, -2787, 5616, -6061, 23460, -5919, -18537, 14573, -10450, -5895, -13678, 17487, 496, -11825, 22118, 1700, 2454, -11657, 10147, -3698, -21312]
730b1312K9725j2120P571j0346K0064l232j9600J8340j2952M921j5469J2253O502
743D345j4244J6433n604J2473j5782K914P931j6427M487p019J5516j1015K39J6900
757A1147p502J766q629J4771j3445j0581J3270m013k82o430K0075k969j1682J2507
771H003j195m935j3720J3642j342j3510J0433O964J452j0738J2665M065j5815
784d031P37L563J73j3400Q184J1009q068Q57P156N506j3641p60P812q242o731
799i876L954J0052o894j226J2768m38q051j303P711q387r141P480M561n735m85
814e010J2744M59r506L974M784q267q928P347L204q280K299J1834l57p579N255
829C973N311j0225o592O571P70q714L199J1296j834n601P316M346j0165n050O564
$$ y = [-21312, 8413, -3707, 3864, -6482, 13582, 10350, -9250, 9090, -3862, 1059, -14410, -2157, 4345, -9899, 6534, 930, 13403, -2379, 535, 8466, -7961, -3474, -10493, 5023, -5992, -5753, 11147, 3645, 5411, -3218, 11553, -1892, -12473, 797, -3216, -3498, -9928, 10147, 7178, -4504, 8003, 6808, 1873, -11847, 1795, 453, -13057, -2624, 4340, 5792, -4946, 7719, 11784, -4031, -3294, 269, 442, -12958, -4774, 6235, -1833, -976, 6180, 11686, -1955, -2715, 5097, -3145, -9876, -5922, 4130, -2764, -3990, 8778, 8340, 289, -1014, 6697, -1690, -10831, -3351, 1210, -4525, -5010, 7734, 8193, -1313, 2661, 7445, -822, -9750, -2403, 801, -7479, -5180, 6654, 6297, -1282, 3973, 9284, -941, -7533, -962, -192, -8906, -5707, 5589, 3755, -1846, 5470, 9816, -349, -5399, 1165]
844A165j672r293L938J0087l122l790Q930L521r599l546O745m219r087M627Q076
859B761l991k598J0456K745r257o37N217m484j0634O193N868n781j56R857L248
874H807r608K413N515p809p125L518O468r507K332J0612k93m605Q24Q350j0831
889i39n564N704o63m466j852J3893l483l364O010J510l525j0464R335l899o390
904h157L684M425M968r402J0821J649o768j890j334O237j5627O940N491j702K3
919f42K75J4334j5498J083M627m399m785o516J9127j3555J567R726J361k130j1046
934f471J9837j5862o033O911k16J075j2405K5170r530m065P734j941J467j9308
948a3637J9897j0165n188R057j946J0873j6756J9424p420o066N557j0951J2349
$$ y = [1165, -507, -9800, -5862, 4225, 1103, -2687, 6243, 9764, 165, -3381, 3364, -855, -9942, -5315, 2761, -1230, -3828, 6628, 9373, 116, -521, 4696, 212, -10422, -4229, 1639, -4142, -4298, 5559, 8807, -801, 1612, 7127, -682, -7807, -4289, 2179, -7328, -4996, 5616, 5323, 718, 1542, 9892, -939, -6503, -799, -1462, -5928, -7780, 6113, 2630, -734, 5276, 6786, 3261, -7203, 2132, -1767, -8157, -4473, -48, 4920, -4482, 6339, 7988, 1220, -670, -2004, 4233, -11394, -4454, 1037, -665, -642, -367, 13967, -1531, -448, 4179, -220, -5005, -11521, 7606, -5949, -4382, 5344, 6705, 4575, -6471, 13366, -2496, -8529, -1618, -1834, -759, -13164, 12006, 2476, -1589, 6145, 4204, 5671, -13637, 6260, -3905, -9093, -36, -1982, 8891, -7865, 11559, 4139, -1927, 3630, -7321, 5028]
961E028j8490J5340m401M94J0419j3786J9254j6965P469p118j778R372k2506K4690
975G022j0807O377l025L753J2561l0764K4733j0894k665m967M135J7701l3682
988b0522L1362l739m781l743J712J6997m1497K8293k515p864J284K727K3905l9761
1002a8142K9158j750j3186J522n452K2375l8936K8803J407j0935J0722q430K3312
1015B0468l6576K3411l902j6028J6058j5530K4265k7395K5577l068j5222K3663
1027A5721k4381J8084k3908J9896p117j5986L4812k7472J9201j3696J8964j0947
1039C171k0317L8653l6574J3069o806J7159q770j8010M8536l8815J0630k206J0046
1052I766j2068k2929N0413m0819J0485O591Q734n840k2766N0333m3419N736O783
$$ y = [5028, -13462, 1878, -2523, -2029, 8390, -5396, 13858, -3107, 4362, -2756, -4534, 4838, -17668, 7022, -3785, 2592, -433, 3320, 15881, -14883, 9850, -1044, -3709, -8676, -4541, 13160, -20522, 10840, 7101, 2320, -1423, 289, 17286, -24211, 4082, 1567, -6297, -5013, -2286, 21619, -18142, 11016, 9266, -3920, -2398, -7850, 14525, -24411, 4392, 5799, -5136, 5586, -2844, 20468, -16108, 7303, 3401, -12627, 3431, -12099, 12166, -15229, 10348, 7280, -7942, 15721, -8660, 9424, -14484, 5412, -1705, -17691, 17121, -10351, 8850, -4846, 14118, 3171, -17146, 21507, -15067, -1998, -8804, 8355, -415, -18425, 30111, -8704, 1926, -280, 9766, -2302, -25231, 25182, -15637, -5152, 1439, 10173, 4333, -18433, 31900, -11519, -5783, 1000]
1065A000j97k035k2534N0798l8604R807J1908o761L111k5116M2188l9946Q867
1078g514J3622j3449J3858k0469L8997l5478J1555J2333k5221J8061k1545K9373
1090A4123l1477J6127J6537k9868K8415j8292K0390l0145J5090J2748l8924L3752
1102H476j4970J5475k1988J8763J6069m4127L7099j6010N209k0211J5655J6481
1114A5921m4653M2525j1098L063j2997J2134J5464m8479L9546j2958k267o113
1126i912R528J9564m2641M0695j2511n173k407K29J6126m0427L7627j2128l574
1139e004Q247m031J7928l4289L2778j7040o874J1427j2474J7364k5424L1849j5304
1152h47l843J8977j9918J4450k2144K4606j8846m919K5035k2576J6290j2744K2728
$$ y = [1000, 803, -1232, -23766, 27032, -11572, -1765, 10143, 3382, 6493, -18623, 23565, -16381, -7514, 6108, -7341, 6517, -13952, 25045, -10433, 1122, 13455, -11766, 6295, -15250, 14123, -17354, -1227, 15310, -14558, 13857, -4435, 15955, -14190, 900, 13648, -25276, 8476, -6494, 8981, -13007, 5756, 21825, -22302, 14797, -1213, 3996, -16215, -560, 15921, -28732, 13793, 2695, 5758, -7239, 4895, 20359, -28120, 11426, -1532, -3799, -9912, -384, 19180, -23461, 17234, 4723, -450, -2857, -2628, 13498, -26929, 10698, -1430, -5004, 3243, -788, 17140, -17149, 15629, -1411, -8285, 3142, -9332, 8032, -17392, 14457, -847, -4690, 14287, -5631, 8819, -13325, 11281, -7565, -12484, 12551, -10025, 6265, -6479, 16249]
1165A6249j8223o574K6062k9443J2025r559J8375j5378m529L1416k7992J2156
1177D585n774J2302j5459r312K9107k8838J1537j369J1516q401q112K8657k8023
1190g584Q977l316M288n846r893K6607k2531J2027l18K287n6j2172K0124k2862
1204a0268J0088k563j309O510r627J8616j6472J1740l179o847Q040j2609J1872
1217C992j4659J3119j492o596J4142r449Q605j2974J0617l712j2296J4005q356
1230e054O594q331J2838L51j2290J4591q541J881r907Q843M25j2451J5063l865
1244A47L663n888P234K018j4250J0341o023J860n936N663N702r716J0478l129
1258B164K483n437p2M347j0579O381l279M885j762L19O975o308L917n109K747
$$ y = [16249, -1974, -8548, 17514, -11929, 96, -9463, 8912, -6466, -10995, 20421, -7571, 4585, -1189, 11113, -4346, -13658, 15449, -13389, -1852, -3221, 8295, -106, -8218, 20439, -7584, 1393, -1923, 2365, -3481, -13374, 13233, -9298, 2729, 2411, 4698, 4642, -7530, 12594, -10268, -180, -2743, -4052, 2458, -7169, 11447, -5025, 6715, 3536, -3311, 4729, -7880, 3992, -10667, 2452, 960, -5636, 8506, -943, 7662, -5312, 5305, 1593, -10703, 3302, -5054, 1540, -6791, 6047, 6398, -5892, 8699, 158, 2039, -7868, 975, 1400, -11051, 4012, 147, 3810, -2078, 5156, 7174, -7076, 3265, -2758, -898, -6834, -1171, 4531, -5185, 5293, 2164, 4647, -790, -862, 3485, -7094, -713, -3992, 893, -869, -550, 6425, 117, 4034, -1075, 1672]
1273A672l024m632O087l437M013k627N694P57n215M210l249K99n811L492J989
1288B18m962N075J249K784m320K274K342p174M95k5J451m213K857N336l037J188
1304A538J280J594n173j685L250l681j029J409M239j465k40M446j221k728j556
1319a022J827k567l202L330J615l53n8M187K23l792O53O65k728l113K155J965
1335b15j805J446L760K88k751P58J163l945k447J984P68j863J492M190j38j885
1351H00J579P58l745k388J925m39k117J680L884k16j218K436O74l654j910J642
1367c09j102k777K195K833p4p52L340N07l440r81Q70j467l145J913K848j236Q75
1384I8K493J533l694q5J235k958k142O81L106k207Q74M235l62j268j037K598m078
$$ y = [1672, -1352, -5984, 103, -3334, 679, -1948, 3746, 4503, -712, 3498, 249, 548, -5263, -1771, 218, -4744, 331, 1580, 4364, 44, 2318, 4660, -2514, -2019, -2044, -593, -4806, -1949, 3387, 350, 1538, 2818, 4412, -761, -2446, 804, -2877, -3906, -2497, 1742, 277, 37, 4483, 3262, 534, -1022, 805, -1762, -4964, -1634, -19, -372, -430, 3757, 3980, 188, 841, 1506, -1222, -4335, -2180, -215, -2020, -574, 3186, 3474, 723, 1481, 2644, -1301, -3748, -1764, -996, -2859, -1367, 2823, 2685, 800, 2379, 3137, -608, -2996, -1071, -1510, -3627, -1947, 1937, 1721, 503, 2939, 3613, -41, -1951, -309, -1411, -4188, -1993, 840, 766, 14, 3354, 3861, 421, -560, 310, -1157, -4302, -2389, 459, -777, 98, 2591, 4124, 430, 345, 1580, -1378, -3520, -2839, 267, -1940, -1066, 3169, 2807, 1539, 502, 3100, -978]
1401i78k557K275l51j0r51N628q95j687K461j035j070m424L098r29k612L431P31
1418A25K944l495L783k84l656P87k816K577m419K775K419j185L135k701N228n055
1434A62l96N93k730J628m991P597k640K24L516j123K539p803O486l766l442K501
1450a645m46M390p495R808j058m009K845k372L479j1045Q061m92m728N396j232
1465e43O762r918Q026n82p075M163m750O257r621Q017J849n352P785n814O958
1480F162r548M607k79p539Q987p959Q392n327N380J164o919J0830j2320O263n218
1495c324K365K76o321J4776j2424P653p68O26q13q445J5013j6660O014J774j64
1510d22J379o626J8564j7394N282K828m287q1q496J8546j7448N988P254m928L305
$$ y = [-978, -3535, -1260, -1611, -1621, -2572, 3056, 2161, 474, 2935, 1900, 830, -3594, -496, -1425, -4037, -606, 125, 3069, -426, 3357, 3073, -583, 204, -2612, -35, -4454, -1679, 740, -445, 2690, -11, 5217, 162, -234, 359, -2371, -743, -5734, 1863, -777, -553, 2963, 1840, 4379, -3424, 3062, -704, -4146, -1645, -2091, 2299, -5196, 4612, 3554, -455, 2390, 18, 3497, -7548, 513, 21, -4707, 689, -543, 6219, -3699, 4327, 3745, -3330, 833, -3917, 2340, -7281, 736, 2585, -2767, 5018, -796, 6162, -3386, 1221, 942, -6597, 2390, -5569, 2823, -2504, 2876, 4040, -2879, 7951, -4369, 1894, -3324, -959, -683, -7004, 7772, -4652, 3001, 2233, 2859, 2046, -6399, 8614, -8046, -2032, -258, -422, 957, -5669, 12895, -4499, 783, 3611, -676, -757, -9253, 9293, -8155, -2167, 5087, 159, 3464]
1525C464q729J7741j8871L536O601q898N469q163J8119j5629N146Q805j1781P410
1539D220j0411J3833j5765M411R337j3468J2720q394J2545j2667M272P870j8535
1552a0032J4591j0191Q585r525O216R432j8922J9280r773M044q030L736P460k2262
1566a5391K2054q807K489k535M773Q281k3745K2973j0653k542p73K433Q606k2759
1580a5596K5866q300l710L563o41P343k3941K3803r765n661P841k002R425j9893
1594a1668K3489r581p757R926q051Q211j8225K1542q837n791J4763j0188R431
1607G264j5148J7503j1072p377J6243j4963J0486j0423J6234q879n604J8773j9151
1620f114R446q951J0957r586n050K1194k0357J1709l868Q042q278n966K0289k4093
$$ y = [3464, -5265, 12476, -6395, -2859, 3742, -5156, 313, -7850, 10269, -5360, -214, 8591, -3190, 4220, -6191, 7642, -8123, -3712, 5625, -7843, 4877, -3517, 9028, -3639, 633, 8503, -10032, 4559, -5632, 2953, -6572, -356, 9076, -9846, 9434, -339, 3705, -4325, -589, 6871, -15391, 6663, -2144, 345, -2190, 2583, 10864, -12881, 10092, -561, -3103, -3876, -1443, 7163, -15596, 10270, 1970, -1740, 1823, 1182, 8525, -15416, 8387, -1378, -7039, 802, -1200, 8225, -11668, 11821, 2240, -5517, 4409, -3642, 4569, -13656, 7886, -951, -6742, 8021, -2167, 7264, -7884, 9619, -1453, -8830, 7413, -7550, 2936, -7487, 8747, -132, -5736, 13037, -6114, 3332, -5619, 5338, -4248, -9298, 11896, -8461, 3248, -620, 7422, -856, -6822, 13467, -10626]
1634a0626J0411j974M613n269l922K2020k3369J1228k77n09m338o196J9891k3614
1648a1931J1958K409j755N56n349J8066k2821J0138J377o536L104o250J6961j9128
1662i201J2258K825q248O429q198J2420j8111J0425J786r615J0852p044J1587
1675H165j3862J0236R11j2561J1844r614P849j1153J0188K134j1657J5615r069
1688i74N533q893P165L02j3983J6231r120M660m530P423K059j3369J6158j0057
1702a395J260l541L685K094j2077J6796q039K192k48J879K059j2447J3643r119
1716c258N92J217K92M883r549J3418p646N78J315l399L780r400J0712p040J993
1731a512M069l618N671p158P983p400L71L257o503N886n201P525n029K230M788
$$ y = [-10626, -215, -2189, 2424, -2845, -6767, 15253, -8116, 3112, 2835, 2326, -2012, -8208, 11683, -11931, 27, 2436, 681, 1237, -4112, 13954, -8867, 1271, 2648, -3888, -784, -7034, 9927, -9201, 3057, 5882, -2366, 4063, -4135, 8285, -9826, 599, 2385, -7230, 3622, -3422, 8165, -5697, 4539, 5450, -7111, 4733, -4881, 2968, -8185, 2003, 4137, -7520, 8095, -974, 4559, -4334, 2831, 3133, -10850, 5381, -3739, 921, -3609, 3814, 5873, -7496, 8662, -1395, -135, -3676, 9, 2103, -9974, 6822, -1217, 975, 727, 2606, 4665, -7782, 5861, -3258, -2666, -1449, -1157, 3726, -5823, 7595, -51, 527, 1842, -1557, 2223, -7177, 3535, -3505, -1512, 2557, -1061, 4610, -2548, 5435, -1965, -1594, 1663, -4840, 1046, -4155, 3370, -1659, 571, 5359]
1746E359p323M910m923L912n655Q66N518p199O485k019L921l930K02M269q300
1761c907M051k436K320k501P13O120o261M797j680R14k658j736M126o214L719
1776f33n89K004j5r05M677n215K258k273Nl28k420M192k777L122n34J004J087
1793B660k812J952l283J070j726J08K269j673K950p54J844j494q83J181l060M46
1809a205j044J766o31K38L216j361P26p95N68j663j851J499j260L61M88K051M67
1826A570r56J784j360r01j261J96k97j172J908O36O17J12R01J99j795k21n38o98
1844a276p63O48J500k78Q49J088K25j150p16Q2j433p95N83P25K18M17J832O6p23
1863A099l22o7j365j291N65L78r6R28J379N86p89L13k63j255j231J02J00m46R96
$$ y = [5359, -1964, 2946, -1977, 1935, -3720, -2854, 2664, -4535, 1950, -69, 3852, -78, 124, 4393, -3907, 144, -2292, 28, -2473, -1760, 4360, -1901, 2896, 1216, 2130, -528, -2264, 1862, -4352, -633, -1222, 782, 767, -138, 4539, -676, 1582, -691, -686, -1014, -3434, 758, -2019, 1103, 569, 1573, 2660, -152, 1800, -1483, -413, -2139, -2031, 238, -1435, 1515, 761, 2605, 1111, 228, 1409, -1651, -1205, -2249, -483, -1114, -876, 2340, 979, 1705, 910, 1478, -185, -2036, -537, -1797, -1436, -948, 1103, 1570, 614, 2398, 1038, 137, -1124, -928, -1225, -2397, -489, 147, 764, 876, 1777, 1976, 181, -40, -578, -1276, -2039, -1391, 109, -169, 680, 1768, 1993, 843, 127, 209, -1224, -2019, -1436, -711, -493, -76, 1756, 1822, 1099, 777, 710, -655, -1946, -1381, -1003, -1099, -171, 1208, 1794, 1005, 1318, 1055, -200, -1431, -1329, -1229, -1675, -679]
1882f79J255O29j96M89J15j563p09l16j14p81P54J539R2O22L22N10j324j093L41
1901a07j320j87o5J583K35J23J574m03q7j549O04j136j400J156j44J158m91K054
1919A598M82j560R91j433M6k374J217K65j118K294j16J814j503Q97J90k904J130
1936h4j995J579j441J220J877j339K641j989J370j728p30N18k764K976k321K559
1952C49J18P1J811k602L170m338J266o07j358J749k088N077l565K296J224k436
1968A37J392l776M361n421J606K251k314L032k375N585n079R42K175m662K279
1983A33l690N488m703J535M512m373L854l519M509n448k56M027o327M811l096
1998b543N333l528O20N085p456N232m489K598l358O4N361p639P966l380K479j955
$$ y = [-679, 576, 1205, 1009, 1498, 1613, 50, -659, -975, -1089, -1870, -1116, 423, 515, 1137, 1459, 1969, 645, -448, -107, -1427, -1614, -1679, -96, 139, 262, 1836, 1433, 1346, -203, 401, -735, -2135, -979, -1123, 35, -456, 1598, 2080, 520, 1511, 78, 124, -2250, -1033, -768, -1886, 408, 292, 2106, 603, 1500, 1690, -1214, -84, -2079, -500, -1941, -721, 1156, -183, 2458, 469, 1839, 111, -619, -101, -2865, 111, -2210, 349, 467, 538, 2349, -253, 2917, -1421, -155, -762, -2120, -371, -2459, 2618, -947, 1349, 2573, 137, 1529, -2247, 2114, -3307, -1701, 550, -1764, 1268, -1107, 4478, -601, 341, 2516, -2146, 133, -3557, 1931, -2772, -1237, 3275, -1098, 2756, -763, 3746, -1702, -1958, 2069, -4258, 553, -2543, 2790, -738, -118, 4967, -2489, 2743, -1746, 852, -2506, -2442, 2919, -4720, 3246, -134, 2345, 390]
2014C90o82M483r809P721m212Q79J11J21N738r354R739m214j513Q19j983M693
2030B927j0605J0759l325j788M068j742N051j0795J0178m446m510M947l423N498
2044B794r365J1629l272m478P055n254M141r668R748l758n611R717n890N637p177
2059c752R228l567o736R969q812M708o023P679k486n552J2854r958N294m397M831
2074C280l394o518J2838j1934O096j562M090j769n289J3434j3718N025r27M76
2088A28j174n410J4414j3612O866J661j508p5n723J2577j5213N817K850l823K548
2103C23m302J3163j4288O396L475p345L222n371J0894j3609O914N222q139O390
2117B945m810R216j2741N605M137j0939Q076m905Q006r669O467M994j1516R533
$$ y = [390, -292, 4191, -5618, 2103, -2109, -1230, -1119, -998, 4740, -4614, 5125, 911, -602, 217, -1766, 2927, -7678, 3081, -244, -2032, 2036, 294, 5345, -5450, 4728, 282, -4228, 719, -2704, 2794, -6571, 5058, 1786, -2692, 4363, -891, 3250, -6418, 3330, -428, -6039, 3678, -2212, 3425, -3752, 5476, 1909, -4827, 5142, -3670, 1038, -4985, 2694, 208, -5344, 7510, -2448, 2846, -1551, 3280, -114, -6632, 6206, -5728, 368, -1194, 2896, 1127, -4162, 9272, -4446, 579, -348, 128, -1046, -6456, 7958, -5654, 1212, 2873, 1365, 1290, -4433, 8144, -7069, -1252, 1598, -2225, 323, -3979, 9184, -5104, 1292, 4767, -2578, 644, -4727, 6167, -7442, -528, 4694, -3445, 2945, -1865, 7351, -5390, 215, 4352, -6587, 1489, -3416, 4590, -5079, 1388, 6382, -5134, 4399]
2131D399o132M979q670M947M397j2065J2430n488M590n769M341L653j3299J2277
2145D590o944J940l045L624M354j1838J4210o790M67j229J079K769j2321J4058
2159D924o766j5K274P25L545j0935J3308p896j936L153k088L680r293J3190o367
2174d97j394N570l767L372r107J0722p114k078O891n038M968o509J0106o248k075
2189b198O820p537L934n813P945n270j198Q522p577N167m123N539n401k005P338
2204D143r004N450k700M462k861j036Q063r769N175k627J451k697j494P544q810
2219d710O458q35P69r82j988O318r628M965q23r86P16j244O557p691N600n95k147
2236b46P84k683M865p314M827L29j989K996k116M708o319L828p96l463K889k865
$$ y = [4399, -1733, 3246, -5424, -477, 3920, -8145, 4285, -1203, 3387, -2382, 1959, 5612, -7687, 4590, -2354, -414, -3459, 165, 4519, -7319, 6891, 101, 568, -661, 418, 3187, -9134, 4924, -1842, -1857, 417, 1142, 4687, -6248, 7060, -836, -2772, 381, -1707, 1973, -7320, 5870, -497, -1891, 3679, -88, 3284, -5823, 4899, -2215, -4293, 2598, -2440, 2528, -3981, 6125, -123, -2198, 4622, -2915, 1019, -4794, 3151, -2119, -3317, 5205, -2372, 2795, -1328, 4211, -1190, -3195, 4143, -4861, 589, -2111, 2351, -510, -1546, 6517, -3252, 1923, -704, 747, -1950, -3444, 4100, -4710, 1748, 913, 1682, 700, -1288, 5030, -4598, 367, -456, -1442, -726, -1970, 4587, -3104, 2496, 1901, -246, 538, -2145, 2720, -4594, 233, 562, -1427, 1569, -547, 4161, -2158, 1670, 874, -2589, 300, -2565]
2252b565M052m260M108N05k774L916l642K483m111K371k06l097M490k460K850
2267A660k111K390n3l438L685l770J395j738J425Q49k182M633k629J229r69J77
2283E53l2l142L272k531J304L23O82J182k151L090k593J73n06p49P52j828K762
2300E61j118J199N31m01P27k061J409k029J30K77m12J511r65J973p07L46K29j553
2318c53O40j602P27p54P91P55m84J683p10M63p96m87l5j307Q25l53O03K98O65
2337E69P33p85O02p58n21n30l99N09n08R81L50O39K6k19K46r96k25m74j09o1J28
2358h02R86K40N56O2j14l60q06j36n09j11J34M71N25M47M27N6l18n42m18l60n92
2379a164K32L26L12N60M76K29m0l59m10n68m05j77L45l4O86N13L78J00l19m9q60
$$ y = [-2565, 1487, -2773, 1335, 1840, -934, 2982, -660, 1823, -2288, 83, -123, -3220, 1270, -1190, 1660, -451, 1939, 1886, -1552, 2133, -1637, -242, -1980, -555, 294, -1888, 2745, 116, 1345, 376, 553, 521, -2621, 651, -1880, -576, -253, 429, 1611, -540, 2550, -43, 130, -376, -1125, -373, -2201, 561, -557, 642, 1173, 772, 1499, -562, 847, -1182, -1052, -775, -1187, 324, -641, 1332, 625, 971, 1200, -353, 287, -1315, -588, -1342, -551, 204, -280, 1403, 693, 1156, 360, -127, -162, -1469, -644, -997, -394, -96, 569, 1302, 517, 1119, 361, -160, -690, -1089, -580, -1088, -107, 243, 882, 908, 689, 935, -61, -286, -760, -869, -930, -802, 184, 424, 980, 1042, 928, 568, -238, -374, -883, -994, -860, -389, 136, 583, 1010, 1066, 748, 206, -212, -572, -1164, -932, -606, -294, 266, 742, 971, 931, 572, 162, -406, -811, -988, -643, -677, 9, 522, 900, 1000, 681, 632, -228]
2400b28l03m82J66R1K70Q44K24M30j46j44l54r62J9n33K94Q9N81O12J01N62m79
2421F52n4p80l46N9p99P28j44R48J68L49O26j008K43j001o7p12mJ001o12J332
2441E79k25R65n96l67M14j645N49r06P60j52K9J642r70J252p74Q5o74r89J150
2460A27k016J769n68R46M28l59J551k346J383j348l80K33r61K112k173K714o01
2477E11j5P55j462J494l153K036r87p02J716p38K250k544K863j121j593J575k143
2494a258J717l065L016l93j106K959j932K009k980K369j195k478L251k746K391
2509E59k043K941l05k285M033l647J488k362J890n27k691N182l691K686j238J607
2525A597m36l367M990n125K029q32J064M71k542O144n409K575l67p92K04l163
$$ y = [-228, -531, -1013, -847, -756, -486, 358, 582, 1012, 866, 722, 368, -594, -575, -1108, -814, -725, -144, 468, 569, 1131, 652, 598, -182, -528, -469, -1268, -540, -684, 264, 432, 781, 1407, 399, 642, -359, -426, -1138, -1142, -141, -753, 579, 354, 1319, 723, 356, 770, -875, -326, -1232, -472, -624, -595, 1047, 77, 1329, 555, 640, -34, -1023, 127, -1889, -120, -688, 258, 686, 327, 1878, -468, 915, -433, -813, -580, -1541, 571, -1602, 1112, 511, 496, 1251, -211, 1283, -1870, 166, -821, -1523, 193, -545, 1705, -839, 2024, 903, -690, 885, -1258, 459, -2606, 410, 17, -1089, 1870, -62, 1947, -1033, 1336, 141, -2337, 914, -1832, 559, -1484, 1457, 1152, -1133, 2900, -747, 741, -1621, 269, -258, -2949, 2233, -1458, 1228, -10, 1597, 1161, -2206, 2784, -2341, -312, -1144, -80, 391, -2151, 3993, -1416, 1159, 792, 0, 204, -2959]
2541b959N709n906K873J395j114J405k929N886o586K142R64k862J982k785O232
2556C447n984K990K353l849K447l144M818o543K546K797m848M048k338M980n725
2571b005K679K655o541M455l253L646m816K823L564o606O266k978K385m263J929
2586f0K750p784O886l079K021k196K071L396q022P601l971L39j818J132L063p673
2602e344Q807l578K76M00K05K419q280Q412m584p23J868m70L223o932R097m466
2618C30j742L119k462K367o841Q598m520j355N048k916K998n915P662n059k483
2633c171N672m783K995m341P257l905j931O796o121L058m051N362m441j973P322
2648C745o549M077k472M582l492k164P061q181L710j948K904k520j352P773q131
$$ y = [-2959, 2750, -3156, -283, 1112, -2, 1403, -1526, 4360, -2226, -84, 880, -1982, 0, -2785, 3447, -2537, 453, 2806, -1043, 1404, -1740, 3078, -3465, -919, 1878, -2970, 1078, -1260, 3720, -2005, 674, 3329, -3212, 1243, -2010, 1636, -3180, -357, 3207, -3399, 2867, -111, 2274, -1989, -60, 2690, -5094, 1792, -1287, 734, -1462, 609, 4005, -4017, 3584, -387, -48, -1866, -734, 2329, -5344, 3463, -115, 161, 561, 766, 3185, -5095, 3317, -1267, -1990, -122, -592, 2631, -4301, 4796, 330, -1412, 1707, -755, 1612, -5229, 3369, -1151, -2506, 2542, -374, 2624, -3291, 4371, -688, -3171, 2501, -2282, 713, -3628, 3629, -276, -2207, 4589, -1532, 1526, -2525, 2837, -1604, -3577, 3745, -2804, 1273, -1199, 3383, -109, -2273, 4788, -3393, 317, -1631, 1273, -1247, -2599, 5174, -2957]
2663b957M532j147J042k030k123O803q627M712N5J17j35j673O768q730M645k93
2679I59k085M63j773O075p730N471N45k661J978k303M701p668M556L18l580L404
2695F70j892M698o233M625N44m716L734l115L336n311M295Q26m243N217k899K817
2711B353m330L293P8n074N304l444K438k468L129P42m471N682l848J254k307J773
2727A04O05m483O295l527J601n10J199L45m226N176m154P21Q4L87J230l187N543
2744C203l596P06O21j055P86l550M674l410O61J789j112J815k818M046l486P5
2760f51J234k083J674k352L800k416P37K013k391J896k433K174k446M5J872k381
2776a708K360j170K185j639K22J557l071J664j602J155j104N20J878k191K318
$$ y = [-2957, 1575, 428, 1470, -560, -2683, 4120, -4507, 205, 260, 377, 242, -1431, 5337, -3393, 1252, 959, -1126, -663, -2436, 3639, -4091, 1380, 1925, -736, 1242, -1061, 3640, -4028, 528, 846, -2734, 670, -1222, 3476, -2757, 1868, 2412, -2304, 1430, -1685, 1651, -3660, 635, 1461, -2782, 2435, -464, 2353, -1977, 1316, 1394, -3680, 1624, -1820, 618, -1850, 1279, 2021, -2450, 3232, -616, 638, -1669, 104, 709, -3774, 2521, -1006, 595, 85, 1284, 1629, -2597, 2579, -1575, -854, -770, -383, 847, -2340, 3203, -393, 313, 934, -121, 665, -2885, 1789, -1621, -960, 829, -283, 1532, -1286, 2760, -726, -651, 583, -1500, 174, -2178, 1622, -794, -57, 1956, -435, 1461, -972, 1202, -1244, -1199, 673, -1708, 652, -518, 1667, 28, 250, 1807, -1264, 400, -1202, -47, -1151, -631, 1247, -944, 1374]
2791A374r43M81q29n20J223k726K003p89P00J65r4J636k132J512j010l76n0p05
2809a080J308j552J819k57J21M81o37Q82j880R31p98k39O06m38J366q86J194k50
2827F91n61L69j044M76j090P89j03N9J035m38P85n62K00n36n93M05q80P21k69
2846e46P60J63j06P09o43o6l92k66j06n16Q24j36N49J66K57R3m13J41q01r7j89
2867f15j1K65J53O36N6J09k3l02q9n30p3l01R5L01K48N94l3K16k29k49k16n85
2889e83O0k50L95J25N15L25nJ07k98k34l01l35p6j28M81J82L12J79J47J9m08k03
2911B6m32j42J7NM17Q0N85LJ54l12k70k26n41R4j76L42L06J11N83j37K43n59O6
2934B37m29m35J02j64N65q1O49Q9j19L70n78p8q42L21p8l20R24k17O78k40K97
$$ y = [1374, 431, 912, 83, -437, 786, -1940, 63, -726, -26, 139, 45, 1681, -451, 1061, 51, -325, -375, -1080, 228, -1324, 495, 238, 359, 840, 203, 1085, -795, 136, -662, -901, -295, -733, 633, -253, 941, 691, 130, 499, -545, -69, -1159, -370, -473, -414, 621, 183, 968, 406, 606, 70, -523, -118, -998, -277, -546, 214, 377, 271, 980, 337, 271, -121, -387, -493, -1009, -185, -321, 228, 394, 651, 744, 331, 472, -329, -426, -615, -626, -361, -208, 428, 484, 593, 570, 268, 179, -351, -424, -725, -630, -329, -81, 513, 480, 696, 467, 218, 2, -583, -523, -773, -378, -253, 262, 587, 582, 689, 391, 157, -144, -479, -555, -683, -202, -20, 292, 471, 618, 637, 229, 26, -406, -548, -531, -526, -109, -29, 556, 559, 713, 401, 131, -95, -636, -542, -718, -376, -70, 41, 624, 487, 730, 171, 237, -192, -627, -525, -689, -124, -205, 444, 533, 414, 784, 206, 128, -714, -393, -471, -791, 133, -84, 594, 354, 651]
2955F51p1p55L72q37K78m21M14N52l51J202q17N00o44pr9r94J127j002R01J17
2975A16L01M72q41J121j507L29l89j78K77r01J978j250J085K42n71M45j388J469
2993H10j917O82K91m67J015p90J999j630M79L49j419O63j315J834j873R80J169
3010H60j162J407j351J640k040K89J001k111J579j153J845j302Q23J449k514J769
3026A029j649J150j723L16J692k583K736j257J297r86J19J448l602K920j759N78
3042b74m76L11K003l174L489j635O4k99n23J576l909L921j539P6Q94l24J768l888
3060a939M065k297q74R65q55J844l530M614j725p59J966j643J496l708L930k137
3076e87j410K874j758K180k965M116k072j795L296l197J831k667L431j695j411
$$ y = [651, 580, -175, 197, -640, -362, -783, -369, 183, -168, 1034, 217, 717, 73, 66, -33, -1027, 100, -902, -1, 116, 417, 889, 48, 1169, -338, -9, -398, -576, -299, -1200, 778, -472, 613, 855, 284, 729, -659, 810, -1107, -425, -134, -601, 414, -376, 1623, -7, 472, 821, -598, 65, -1250, 584, -1289, -309, 860, -302, 1105, -246, 1394, -646, -357, 644, -1467, 112, -1041, 804, -498, 325, 1774, -740, 1029, -620, 530, -1193, -877, 815, -1768, 968, -289, 1008, 22, 141, 1589, -2013, 907, -852, -274, -750, -439, 1564, -1610, 1879, 244, 308, 9, -514, 1062, -2847, 1074, -465, -389, 505, 181, 1949, -1939, 2126, -171, -1045, -80, -935, 909, -2621, 1993, 268, -491, 1475, -168, 1328, -2380, 1550, -587, -1997, 877, -881, 1299, -1666, 2450, 378, -1417, 1879, -1318, 513, -2154, 1277, -418, -1829]
3091a829M321l394K139k149K710k022k046M432m395K474j179K367j249j508M760
3106C432m995K147j061R18j153j607N081n139L139j80L08o01j726M544n914K743
3122f4Q2n42L04j351M875n510L226L37j947P01j914M254n691L442J000k201J969
3139I70j710L844n451L025O64l539K680j959L319m360L484J138l846L353k185
3154e73K210m083K563J078m283M595k074K109k948K543Q20m572M397k888J334
3169B28k135K361R41m072N194k789R34j260J184M97m568N443l182R28j38J034
3185F00R94l892N209l448k9L58k52R51l480N442l046J70J629j028J086l480M512
3202B296l555r1J939j333J517k533M543l102j37K104k564J454k489L313k624K09
$$ y = [-1829, 2492, -902, 1237, -912, 1798, -224, -2270, 2162, -2233, 241, -938, 1429, 180, -1328, 3432, -1563, 584, -477, 441, -712, -2319, 2762, -2377, 762, 582, 890, 289, -1437, 3107, -2807, -64, 18, -524, -220, -1571, 3304, -2206, 1020, 1357, -590, 111, -1803, 2451, -3240, 202, 1202, -999, 970, -740, 3104, -2347, 678, 1342, -2197, 483, -1476, 1843, -2517, 967, 2105, -1741, 1612, -573, 1637, -2446, 117, 1195, -3088, 1507, -567, 1542, -1406, 1137, 1957, -2615, 1782, -1106, 228, -1907, 454, 1395, -2677, 2517, -272, 662, -598, 586, 1083, -3485, 1958, -1224, -296, -434, 600, 1594, -2298, 2911, -537, -566, -208, -460, 491, -2989, 2453, -593, -423, 1206, 178, 1264, -2216, 2296, -1259, -1350, 589, -744, 773, -1760, 2783, -319, -456, 1648, -916, 538, -1951, 1362, -1262, -1053]
3218a053K816k678K174k044K895k801m02K635l412K315j564K309j865J90K939
3233B454l669K132j381J133j590j84K654l558K807q77R94r36j46K168l838K345
3249E08j000J92k96j28K469l186K725p27l70j5q22J736l181K540n86l35Q91o06
3267a91J884k807K077p49j047P78r56J641j955K058k58o52J225j256J093j935
3283a050J422n37j085J573r94J426j140J401l15j189J376j494O96j024R48j85
3299a71p02J875j162Q57o66K47p1j124J380j421P51j98N73L50q75J577j291L43
3317B72m25k32R3o96J320p98O71J44p2L99r39Q15j137L01q9j03N56n57J186n52
3337A57L41j9n10J90p50N28o07M19K27p6O43l45L62m65P8k26n41K78j31K83k5
$$ y = [-1053, 1763, -915, 1259, -785, 2110, -691, -1093, 1542, -1870, 445, -1119, 1190, -675, -485, 2454, -1215, 917, -464, 669, -921, -1105, 1549, -2009, 798, -79, 915, -21, -167, 2001, -1837, 508, -492, -300, -596, -724, 1745, -1441, 1284, 557, 187, 172, -650, 1086, -2095, 445, -141, -476, 415, -191, 1693, -1114, 963, 214, -833, -55, -1011, 630, -1325, 733, 475, -177, 1048, -208, 885, -1050, 372, -165, -1250, 323, -671, 755, -385, 1016, 701, -488, 888, -606, 90, -934, 14, -171, -873, 1002, -160, 697, 31, 278, 207, -917, 463, -958, -207, -405, 168, 518, -357, 1220, -71, 272, -153, -385, -292, -988, 332, -466, 205, 349, 277, 676, -263, 552, -585, -284, -373, -476, 80, -477, 709, 157, 498, 479, -31, 159, -591, -63, -670, -251, -24, -100, 543, 198, 560, 95, 173, -53, -594, -316, -447, -164, -189]
3358a89M64K50l16L38m50j02k27j47N1k13M70O1K96P7k6J37n70J51m29L1RK0K96
3381a8m4M27Q4q7m3l12j10l51R1K4J74L02nK96n6j4j98j67j71k33O2M2K16K74
3405A83m8K48k66L21k50k33j97r8q5J7M17Q9K78L2q8jm28j9k78J46j01J31L61
3428A31O9K88l2M0k58m39k1k12QJ89K9M14n2L92l57R5j90k74n6k99L04j07M05
3451F7pL07J70m23K43l85k2m64J33K02k69O65j39M11j58q9J40p79L31m71M40k33
3473c30J03N90k52N52m30K71l87m10K86q21P86l65M38K29j87O41q86O28o24K7
3493a41r8k09N28q00J269l27J01R7l07M41j316Q66n77N6M15k46P99q11J214p27
3513B27l06M31q28N87j124J221m81j75J052m99P52j201J058q40p23J185j233J050
$$ y = [-189, 275, 525, 209, 547, 97, -5, -232, -379, -328, -541, -71, -10, 286, 363, 337, 474, -96, 55, -374, -343, -334, -314, -18, -62, 365, 449, 362, 319, 7, -103, -454, -363, -339, -165, 137, 132, 428, 372, 358, 160, -7, -178, -411, -349, -307, -91, 183, 135, 383, 117, 438, 188, -45, -242, -340, -425, -408, 9, 98, 376, 408, 320, 319, -109, -128, -406, -260, -361, -230, 131, 200, 488, 456, 496, 238, -201, -222, -434, -426, -237, -208, 206, 154, 546, 189, 284, 94, -180, -236, -535, -231, -338, 67, 60, 367, 537, 114, 357, -28, -50, -514, -381, -179, -448, 217, 78, 489, 331, 242, 382, -397, -66, -537, -97, -330, -227, 363, 111, 663, 233, 504, 117, -293, -7, -828, -42, -407, 31, 260, 73, 714, -172, 456, -168, -141, -239, -448, 80, -720, 549, 222, 323, 420, 113, 554, -762, 104, -473, -417, -2, -248, 551, -260, 954, 227, -79, 352, -476, 111, -1013, 208, -273, -448, 604, 105, 857, -344, 714, -126, -849, 336, -897, 153]
3531A53r20J419l86n04J247j302P12j209J156o34p88J761j367J219o71R00m01
3548C85j082J885k211J055o82O95k61n83K325k121J308n73O1n2j288K284k456
3565a311J359l1N6L32q46K185k756J336j20p10K96r53K372k438J558N18j057Q20
3583F10j329K093k902J396M88j462J426p68J989k569J480O11k064J451j287J631
3599G94k223J465J005k283K344j196J335k131J248O57k855K680j642J361j342
3614g83J137J052k805K923j812N35r99O19Q15k857L587j779P38m02N00P33l122
3631a920L469k298J92K33K42R52k741L948k280K2O14n47O41k596L584k240q5J541
3649G31p57J016k329L457k597l91J699j545J057j978L261k104j45K162k077J291
$$ y = [153, -767, 652, 266, -238, 1009, -293, 419, -790, 366, -268, -1056, 705, -662, 557, -114, 786, 385, -697, 1188, -1023, 32, -650, 45, -216, -799, 1526, -595, 713, 140, 201, 149, -1139, 1145, -1311, 48, 17, 73, 405, -441, 1744, -1012, 324, 204, -506, -210, -1163, 1209, -1229, 329, 847, -210, 610, -719, 1374, -1528, -132, 356, -1106, 320, -448, 1541, -1028, 452, 1063, -1001, 450, -837, 794, -1429, 36, 1041, -1242, 1102, -94, 1241, -890, 358, 1015, -1840, 840, -802, 559, -783, 354, 1406, -1399, 1524, -288, 247, -752, -133, 682, -2175, 1412, -367, 371, -31, 469, 1202, -1920, 1549, -749, -557, -324, -82, 870, -1871, 2077, -203, -181, 433, -114, 527, -2069, 1515, -725, -810, 731, -26, 990, -1339, 2118, -479, -870, 829, -716, 341, -1637, 1624, -480, -625, 1537, -540, 751]
3665G51j890K500k159m55K610k445J568j226K305j773m87K522l063J633j258J560
3681F93j452l64L034l151K054p12Q57j323n43K484l542K178m68N83n20j70K473
3698B111l526K217o21m28o5o31K251l280K686k65n27M82p32J913l320K233l10
3715A88j127J046o97K035k736K294k70j362J102j178J526k535K071Nj436J848
3731G74q71J289k121J730k93j906J927j325J116j299J485J78j615K338j680P74
3747E01j209R51j07j528K393j494P85m39P38k0j605K274j930O13l95N30J75j214
3765i81K287j736P19r6N2R5j434J899j493K66N54j64O49j088J720j614K38L68
3783B41p73N78r47J505j129N37P32p98N95j002J218j359J91N97r09R73o33J083
$$ y = [751, -1139, 1361, -798, -1253, 1357, -1088, 480, -746, 1559, -214, -701, 1821, -1242, 391, -867, 693, -759, -1123, 1911, -1240, 814, 102, 959, -364, -907, 1577, -1965, 213, -255, 328, -192, -362, 2111, -1415, 802, 181, -247, -312, -943, 1308, -1972, 714, 449, -78, 404, -328, 1585, -1735, 498, 188, -939, 107, -590, 1445, -1291, 1003, 733, -629, 473, -705, 821, -1714, 357, 362, -1074, 774, -97, 1192, -929, 801, 508, -1398, 529, -796, 320, -979, 506, 684, -931, 1407, -273, 501, -708, 243, 136, -1392, 1001, -493, 292, -147, 591, 571, -1034, 1240, -690, -77, -472, 58, 233, -981, 1306, -430, 289, 193, 245, 340, -1094, 805, -688, -422, 132, -32, 617, -471, 1249, -365, -127, 241, -532, 46, -901, 604, -525, 12, 744, -54, 541, -461, 757, -602, -411, 186, -723, 250, -383, 700]
3801G00p73J94O86j235P48q80P31p52K38Q22j002J198o29L10l84J5L67j148Q94
3820A00n55L37M0J71O10q72P70o41Q5k94j61M93p38Q13j45P7J87k49M49p70N93
3841C00m81k07K40k66M63k64O75k52j84K18n20L34m34K47r1O4L02j74M40k93K15
3862C32j49l76J76m97K86r7M06R6k10N49m53J97j74r7k16j54L67l32M04K21o8
3883B11Q0j71R8l10K7j89o3O6O9L98j42K26lj53K6l65J69k61N1J49j5L53j74K81
3907C58m6j50j16k92O8k76K81J7Q6J04J28K10j46o6j39j63j16o8K30m7K76OL1
3930A70O1k7j24k35Qj51j4J42O3L44n7J03j4r8j03l28J73k34Q8J35J78J27o5J57
3954B99k61J50q1l32J14j84K08j5K62K9p7K93l47J51k29j97Q4k53L20j43M22l1
$$ y = [700, -73, 121, 807, -428, 320, -560, 171, -581, -343, 479, -523, 675, 46, 356, -28, -13, 354, -794, 100, -455, -118, -78, 93, 703, -169, 601, -40, 45, -249, -410, 83, -655, 158, 13, 90, 277, 28, 477, -293, 300, -181, -388, -148, -414, 49, -215, 460, 208, 24, 242, -278, 56, -378, -131, -222, -158, 144, -30, 410, 117, 332, 183, -193, -17, -514, -228, -325, 81, 177, -33, 516, 63, 260, 86, -11, -227, -381, -14, -346, 58, 279, 211, 291, 120, 218, -92, -65, -254, -317, -251, -182, 216, 74, 300, 297, 144, 170, -195, -26, -287, -236, -87, -102, 251, 77, 358, 312, 162, 46, -246, -178, -454, -173, -156, -70, 34, 162, 372, 226, 160, 21, -142, -258, -326, -96, -143, 133, 139, 170, 231, 204, 80, -155, -147, -298, -312, -170, -107, 237, 180, 283, 269, 171, 68, -260, -87, -321, -233, -98, 80, 207, 142, 299, 38, 188, 107, -225, -111, -295, -87, -102, 160, 189, 112, 405, 58, 209, -20, -217, -133, -386, -66, -209, 213, 182]
3976A82J50m2l61J72l26P1m9L5Q6n8N24k17J52j88m3km32L30l29K53k7J22L38
3999C41m07N51o24J54r7l2K6l80O57m54L91J30j56L23n95N43p50K05O4k42N21
4020A69m00P83n51K18J75n87L48o89O43o99M13M54m62N98l70N93q52K00K34p61
4040e43N23m86Q02o81L98P03j027P52n34L35p37K16M95j012J196m82M73m69J55
4059G7O49j334R74p29K14k69J46R37j332J357m97k1n8l23O00j466J398o37J20
4078a94K51qP13j471J472p23k13K79n21P87j384J630o19j31P05n90O67j435J417
4097F32q66n66J128p43Q75j142J546o17o17J132j176O24j156J517p60n36J610
4114H85j208Q00q87J111p48p66J590j548Q59o79J076m98o07J826j689P34l93M22
$$ y = [182, 332, 290, -71, 101, -225, -154, -203, -168, -82, -140, 384, 167, 319, 131, 88, 86, -346, -16, -345, -92, -119, 3, 341, -66, 485, -139, 15, -82, -114, -88, -468, 189, -265, 126, 256, 100, 423, -172, 371, -379, -174, -110, -352, 169, -231, 552, 1, 219, 394, -193, 155, -534, 109, -590, -177, 277, -185, 413, 43, 636, -216, -16, 218, -543, -20, -506, 296, -385, 13, 716, -311, 441, -93, 242, -495, -279, 216, -796, 400, -82, 391, -78, 77, 726, -608, 366, -363, -149, -418, -272, 665, -667, 690, 193, 172, 114, -209, 391, -1075, 323, -314, -194, 57, 49, 762, -709, 763, 40, -173, 106, -415, 372, -1012, 618, -1, -132, 573, -17, 650, -785, 632, -234, -800, 328, -415, 460, -682, 864, 247, -370, 762, -414, 210, -946, 571, -189, -725, 885, -323, 477, -410, 701, -47, -813, 777, -771, 88, -591, 485, -13, -620, 1206, -483, 251, -142, 280]
4132B80n22p92K046j926J100k17M77k05q71J926k312J131j58j50J05o12K007k095
4150g88J167R8m43Q2o88J601k269J199L10o44O35o19J762k242J195K24j313Q91
4168A58p93J298j735J366M00j198J146q38J043j824J052M21j641J529p65R43j224
4185f62J166L81j805J725j139N77j034R16M46j712K141j163O44p97O57K18j834
4202a275J972j129L22k16N11M90j654K173j306L2k8Q8J73j392K085j169J46M52
4220B75j18M28j397J694j260j11O02m16N78j112K040j395j8J003q80M10j167J487
4238F43j128k5J129r94P23p43J246j054k22J030j393Q46p77J217r29J26J270j521
4256e56J110q38P50q82j71J293j516R72l38O45l78k05J023j518Q65m59N7o5m5
$$ y = [280, -242, -1034, 1012, -914, 186, -31, 446, 241, -630, 1296, -1016, 115, -43, -193, -88, -700, 1307, -788, 379, 477, 34, 116, -572, 1029, -1240, -41, 269, -375, 260, -359, 1403, -839, 356, 580, -733, 158, -635, 663, -1072, 294, 694, -504, 642, -196, 847, -977, 75, 496, -1145, 384, -381, 562, -662, 504, 885, -920, 805, -334, 243, -791, 125, 571, -1141, 1000, -163, 481, -316, 341, 559, -1275, 697, -432, -110, -326, 185, 675, -979, 1194, -112, -80, -108, -20, 153, -1239, 846, -323, -177, 275, 157, 585, -812, 882, -378, -489, 113, -303, 275, -837, 1203, -192, -210, 793, -87, 323, -844, 643, -485, -510, 619, -375, 348, -395, 851, -203, -425, 605, -788, 58, -719, 498, -431, -305, 965, -556, 554, -284, 466, -416, -587, 706, -810, 162, -176, 469, 91, -114, 909, -609, 256, -203, -146, -211, -256]
4275b56Q82j240R60j20q2j5l70P82j378J047l47o8K78k71Q45j099Q84k62m32K58
4295dl90O62r43R15j18k99N76l97M74r14O55k97m50N63k90N96n20N28l0n29O13
4316D01o64M92n84K78j2l05P45m67M91l88L13q5n02M98n99L08r8J67L69o10Q76
4337F24o78K83j26k43J15m34O20m78K07K72m5J21l18L80n33R8m4q9J89k62N38
4358A97k62L09N7k96J96l86K90m05J06K20j63L03j22K95k35j20J44m25K44j84
4378b37K33q8p9M13k28L35l46N3j10j88P9j32K31l3P4K05N1Rk33J14k35j5J3p4
4402a88J01J12J19N9k8M8j23n3k21k3L4n0J77M2P0RK4J16k28r7m1no7J02J37j4
4428A2J66k5J05j51p7j15j57N0N6J7J59J3J55k03K19j94o1Rq2l4JJ61j05K17J5
$$ y = [-256, 626, -614, 346, 226, 144, 129, -241, 541, -837, 210, -137, -205, 73, -198, 647, -452, 432, 170, -262, -4, -394, 268, -675, 240, 122, -177, 399, 2, 476, -438, 217, -80, -530, 33, -257, 339, -181, 347, 317, -212, 401, -263, 229, -355, -77, -89, -394, 351, -116, 375, -13, 300, 215, -287, 211, -388, -80, -178, -11, 358, -252, 624, -54, 229, 103, -140, -25, -459, 161, -317, -110, 162, 117, 238, -80, 300, -233, -135, -179, -268, -79, -341, 197, -65, 244, 301, 5, 201, -185, 105, -300, -194, 26, -137, 166, 44, 339, 104, -16, 128, -297, -53, -237, -4, -92, -171, 242, 14, 349, 3, 56, -54, -242, -163, -295, -64, -97, -23, 182, 233, 242, 9, 123, -112, -127, -114, -188, -87, 25, 144, 203, 175, 223, 100, 47, -174, -197, -163, -213, -36, 6, 76, 85, 109, 225, -3, -100, -141, -146, -213, -111, 26, 12, 178, 153, 258, 107, 30, -85, -242, -192, -136, -119, 40, 53, 208, 5, 224, 30, -31, -22, -104, -138, -137, 24, -81, 136, 151]
4453A51J62k09l2j42p2q1k1J21J6J54J13p9K14o6k00j18j25J34j52J69R3O2J20
4476B12j43Q3k32M3k8p1J76k55L55k7r4L7J14O7l41J14j73J17j50K2K76k47L81
4499B36j16k0M6o5jl39J88j15L5J68n0L69l93L66j17k88l4o0K21m99N27m7Q2J26
4523B20j27K78n33K52k45PJ88k77M77n01O08j75r0J13l27M18p19N07j83j89M62
4544A64k10M58n14L02j83k70M68o45N31n30N90j36j89O29n67M10n12K90j36l83
4564d33O52m94L70l14M50nl74O88q86L10k71L44j32m48J090p24M59k39J00p6n49
4585d82R93j056M07J13l2J56l10R48r12L73j22k16J61n22R92j153O92K51l86M75
4605C70n75Q05j226O48M4n83N85m17J002j058N95M23r52O35o54P88j016N16M32
$$ y = [151, 313, 104, 72, -70, -142, -223, -244, -123, -107, 47, 160, 81, 295, 229, 29, -89, -214, -80, -232, -63, 30, 92, 212, 69, 152, -80, -37, -65, -136, 40, -215, 140, 113, 19, 56, 170, 237, -104, 10, -163, -46, -196, -174, 102, -145, 236, 120, 100, 146, 81, 80, -259, -71, -186, -151, 17, -33, 336, -57, 309, 192, -96, -130, -190, 31, -468, 59, 12, 94, 220, 93, 371, -162, 90, -155, -148, 40, -237, 240, -261, 347, 172, 82, 195, -132, 286, -433, 74, -109, -298, 164, -46, 412, -102, 200, 17, -253, 215, -430, 101, -429, 161, 25, -164, 465, -102, 308, -204, 86, -50, -433, 219, -275, 95, -219, 231, 226, -148, 540, -346, -36, -307, 37, -95, -543, 547, -177, 282, 43, 143, 67, -482, 511, -545, -138, -25, -57, 99, -211, 737, -175, 198, 76, -140, 21, -501, 491, -662, 30, 281, -105, 370, -205, 600, -626, 22, 66, -517, 68, -349, 653, -405, 190, 613, -339, 296, -358, 430, -586, -70, 362]
4624C62q99Q54l96P04r18M45K21j093R82n29M23o32N06N56j129J194p05K06n28
4643c76L52M14j438J413n81M09l24K55M48j353J413r45K83j37K2N96j309J573
4661G15q73K64J99l61N91j557J606p75j68M17j38N68j008J529j074k05O10o26
4679b86M51r84J408p32k53J016p55M96r54J192q49m13J206j093Q09o87J078o09
4697D1k84J139j249M26m72P62o64l68J435j213P57l27N55o69l95J327j517O97
4715a9j69K90j96k97J424j602Q95k73Jj32m47J174j596J153j01p6J31k86R76j496
4735f46R54k19n36M36l71J084j398R81J35n38M68o77Q35j355R81m0o61P97l93
4754a63P94j201R98m3q99Q90p74P18r65Q39Q1q58J137o78L68o67N17J04j021J276
$$ y = [362, -537, 317, -79, 625, -293, 152, 373, -720, 262, -267, 156, -476, 30, 586, -543, 651, -54, 152, -376, -24, 390, -1048, 365, -216, 193, -131, 124, 572, -781, 632, -313, -30, -167, -145, 451, -858, 715, -158, 106, 305, -56, 535, -1022, 584, -191, -359, 58, -80, 488, -520, 1009, -65, -270, 340, -286, 165, -819, 589, -143, -396, 620, -135, 361, -593, 599, -250, -663, 543, -550, 259, -428, 650, 41, -243, 896, -353, 73, -399, 363, -301, -669, 766, -447, 310, -17, 538, -131, -526, 801, -716, -19, -188, 102, -94, -391, 1033, -569, 326, 53, 54, -78, -525, 649, -947, 206, 105, 29, 160, -126, 850, -646, 308, 89, -447, -11, -382, 702, -696, 285, 420, -118, 350, -327, 508, -847, 134, 94, -567, 230, -163, 631, -570, 428, 385, -514, 376, -398, 320, -645, 194, 275, -583, 554, -124, 244, -423, 94, 198, -823, 453]
4774D53p61M51k81L94K00r91J275r89K60k31J55J76p50J263p63K95J8O5K9q09
4794e41R90p97J30J97k5K54o44J122q58K42J16l57K96p64J043p24K87K47k32L07
4814B89m57O60o18k20N66n48M26l35N91l31n9M96o92M83n27M38n44P0O31o87O26
4835B58k85L51k69j74M82q34N36l56K35j49R2N37n56M06k62J34j01j57K61n39
4855c90M98q3k4K12k16L90n18L28k13j44P1k44L60k60M54o8j09J81j96J01k76
4876a46J89r1j46K63r4J34K8j2K1k55L31m17R0q7J29mp8M94m18K65l15K11k11
4899a19j97K47j73K03N0M3Q1n1P8j67j1j48k9K01k33K07M7R5l1l7J27j87N0j19
4923g3n4O8q3J70L0P2R1q1J1j88m2p9K07j46J27K9lK23k11Q2j14j86J00k00K60
$$ y = [453, -308, 143, -138, 256, 456, -535, 740, -249, 11, -220, -65, 111, -639, 624, -139, 156, 174, 239, 268, -541, 449, -348, -218, -21, -46, 208, -436, 686, -172, 70, 186, -171, 125, -639, 404, -320, -33, 214, -18, 289, -168, 492, -126, -346, 220, -328, 98, -237, 354, 23, -36, 460, -232, 251, -276, 162, -382, -312, 319, -368, 258, -27, 324, 55, -119, 363, -471, 65, -291, -56, -205, -113, 424, -132, 274, 12, 146, 45, -112, 149, -390, 108, 25, 1, 213, -3, 387, -131, 197, -16, -160, -89, -333, 27, -233, 221, 153, 44, 225, 29, 130, -146, 43, -48, -194, 69, -25, 109, 137, 125, 146, -109, 222, -195, -105, -192, -63, -67, -145, 349, -69, 196, -119, 92, -119, -316, -69, -242, -39, 11, 54, 135, 84, 162, -5, -16, -164, -193, 8, -225, -18, 29, 124, 93, 56, 183, -4, 46, -73, -127, -59, -142, 28, 58, 130, 221, 140, 151, -37, -79, -158, 49, -97, 30, 59, 56, 279, 68, 150, 36, -150, -50, -250, 10]
4948A0j58J99o4J65J32j94R2j64L8k44j21K48k3O4K1R9N7j61J78k49m5r3J32N7
4972b4j13K32Kj5Q4q6j0j75L7j45J83q4J14N5q8J89j23L7n9m0J0k16J49k0R6m
4998a4R4J80j44J9j36O1k41l0J31j31L29R5o8n0o4R6l25K54k07J7P4K0J82j87
5022d5L28j87N6k00l5k7k73L88k12K26K6L9J04k32J73k19j9J3o4R8p6M22k88J53
5046A49Q5k47K54l88L26m95K83J40j28K25k85M28l57J04K7m88M32m55N04l49Q8
5067a47O15o40L70k79K19l01qL51n81N03k51L62j54R6K80o88M43l06J43k08K5
5088a56M94p78P57j79k3Lj94L99q51P05l71N7J7M9M35p65P93k66j89j1j52M70
5110B44q62Q61j73k05M08k69L29o33O74l58m14M35k66L70o42R15j66l90N46n34
$$ y = [10, -148, 51, -13, 152, 284, 90, 182, 18, 56, -188, -309, -61, -84, -20, 1, 100, 157, -4, 174, -75, -120, -213, -81, -24, -137, 95, 97, 82, 166, 80, 70, -105, -68, -213, -30, -114, 0, 55, -33, 156, 33, 70, 11, -29, -19, -235, -86, -106, -10, -14, 80, 260, 116, 135, -1, 60, -181, -211, -80, -211, 118, 213, 145, 95, 31, 127, -198, 56, -151, -134, -60, -40, 142, -45, 283, 96, 152, -48, -83, -110, -383, 5, -207, 19, 45, 84, 188, -44, 129, -90, -109, -96, -160, -62, -138, 284, -4, 149, 234, -13, 241, -147, 179, -316, -33, 107, -21, 204, -81, 347, -10, 94, 121, -367, 65, -390, 114, -235, -147, 468, -172, 198, -81, 138, -163, -171, 180, -401, 102, -149, 213, 59, 155, 435, -253, 190, -116, 27, -181, -156, 338, -440, 317, 138, 115, 118, -76, 323, -528, 177, -194, -137, -120, -71, 364, -401, 392, 126, -63, -74, -226, 244, -618, 243, 70, -135, 273, 4, 333, -300, 374, 16, -398, 37, -229, 141, -501, 414, 248, -142, 404, -130]
5130a30L43p72O96j85l66Q18o41N68n51P13m63n31R23p84M33m58O75l40l55J047
5150F40q78M66l22L99m01m75J026r57N01j24M20j70l59Q67j070L90j01J79j36
5169a05m60J310j352Q14P9k32M1l71Q75j182N38O1k47L55l60J139j258M83K82
5188D10o98L27l33P25j144P41L96p67O77m23N02r35O02J09r22Q58m43O46p65O73
5208B36K61r96Q41o40N07o27K88M74r08J087o44M69n81N53J45j136J140r13M19
5227b5k89L64L18j115J427n91p7j42J45J94j076J171n77K73J17r9L27r00J291
5246G36q72j26L25k44K67o79J241q42Q8N24n31M30q08Q82o45l4N30n85N71n27
5266b99R39p19m9N23q17M79n02P21n24N5O69q44O53m09N52o32p7O80q73O44l68
$$ y = [-130, 213, -559, 137, -48, -414, 404, -237, 331, -220, 493, 30, -501, 422, -362, 71, -387, 288, -52, -407, 640, -238, 228, -94, 305, -96, -571, 455, -502, -1, -125, 295, 125, -234, 633, -437, -47, -148, 31, -105, -565, 745, -607, 207, 286, 54, 95, -276, 599, -583, -45, 16, -231, 124, -236, 903, -355, 128, 410, -288, 39, -294, 431, -713, 28, 424, -343, 334, -89, 413, -522, 80, 189, -733, 125, -318, 328, -437, 236, 497, -499, 342, -298, 209, -418, -130, 344, -564, 523, -121, 348, -233, 320, 465, -671, 469, -444, -25, -314, 50, 368, -747, 680, 89, 12, -130, 15, 209, -867, 304, -273, 0, 117, 18, 345, -555, 736, -136, -262, 63, -181, 86, -593, 648, -194, -106, 418, -113, 317, -491, 391, -254, -288, 242, -343, 228, -299, 640, -79, -128, 395, -422, 57, -445, 276, -248, -193, 476, -368, 285, -124, 428, -204, -281, 399, -474, 170, -198]
5287a98L68k71M6O67j010O15m02K84k32j37O59q51P12j48j5Jj90N20j041O51k15
5308a87J9R8r1O36q07O64j62k33J47k66L26o28N79q2j73M46l08M11n42L87k25
5329Il07L20k75M38m49M87l1l75M88m32L16m13J80n1k36N48l74L05j12J72j0m93
5351b95M90m36J56j34J58O3k23N78l92K64j04l0j0m82N39l67K42R2j05J62j23
5372D3K87m30O4Oj37J38k00L74k01R6J60j51J44l57J95j21j0N7j39K57p6J21j9
5395A01m0L4r5O1j01Nj10M6J80m2J34q6O9k12K3J24k97J58n2J33O2k4J43j99o1
5420d6J9M2j53OK08k44K70N0L5Jq7k3j19L2j12QJ26m5Q6j04K76l9o4R9l04jp9
5447a62J18j2K7K28j69K34j46K1j04j05l9p1J17nQ5R7J7K7j63J58k20p1J21j66
$$ y = [-198, 170, -101, -55, 612, -398, 217, -185, 99, -133, -270, 389, -462, 250, 102, 87, 88, -102, 418, -623, 28, -187, -168, -70, -161, 475, -332, 332, 170, -63, 84, -182, 144, -484, 95, 13, -160, 286, -22, 389, -153, 234, 9, -298, 22, -253, 185, -264, 223, 192, -183, 305, -127, 189, -224, -44, -95, -331, 217, -157, 148, 36, 208, 198, -295, 195, -241, -85, -219, -61, 2, -221, 357, -35, 229, 125, 95, 85, -397, 142, -225, 17, 109, 4, 166, 43, 330, -100, -36, -30, -167, -29, -229, 145, -56, 40, 200, 49, 193, -164, 31, -90, -100, -43, -182, 75, -1, 120, 101, 61, 95, 0, 61, -40, -35, -145, -99, 81, 39, 173, 87, 156, -56, -33, 91, -206, -48, -100, 33, 95, 71, 214, 15, -46, -27, 15, -138, -132, 76, -168, 102, 152, 187, 188, 101, 78, -41, -9, -121, -113, 13, -32, 54, -50, 226, 187, 123, 222, -82, -83, -162, -44, -56, -29, 199, 30, 264, 118, 139, 35, -70, -109, -180, -63, -68, 17, 114, 131, 158, -5, 153, -67, -138, -17, -183]
5471a83K39j08J91m0Q8n2j06j8j29M4K2o5j7L7K44j97K44o6q8j10K7k2j52J64
5495e3j17J64J43nj12M9l0j54j9J29j68J17p6K33M0j29J71j37N8j93k8O4n8K00
5519H9j31J95j35J6R0k38J72k77K29j37J6J85j44K21j30K01k40J1j44%P2k28K64
5542d3qpJ80o7K17m10K08j68p3O1j15L59l61L39k4m7J64j90O2l58K63j09l7J44
5566b0n5K70j93K11r9k33J68m63L97j90K82r3l7K66r9Q0m36L34k70r3M50l79L30
5589A28j34K58q2l61O02n47K52k34J39r2k31O37m98L37j85K02j68k41N38o03K72
5610a1j33J00O9j38N54n97L42n5j93O0l88P60o80K54Q3pK60m44P14r23L92j5l03
5633b99K78l03Q50q19M21K55n64M46m83M31o22L06K20l27M23k98N25p02L66K13
$$ y = [-183, 56, -52, 139, 99, 187, 135, 29, 11, -118, -74, -52, -117, -134, -97, 147, -50, 194, 128, 40, -70, -43, -65, -217, -53, -170, -6, 137, 132, 20, 69, 39, -115, -134, -5, -173, -56, -132, 101, 141, 12, 183, 46, 104, -89, -117, -53, -111, 89, -42, 153, 18, 34, 124, -114, 58, -219, 10, -127, -111, 74, -70, 151, 21, 222, -18, -7, -151, -151, -79, -307, -43, -51, -58, 122, 55, 272, -138, 70, -98, -171, -110, -225, 134, -227, 112, 88, 41, 205, 15, 77, -281, -18, -127, -164, -20, -75, 195, 2, 213, 114, -119, 49, -414, -17, -207, 75, -18, -55, 211, 112, 192, -244, 90, -180, -273, 177, -202, 128, -6, 252, 170, -191, 411, -136, 116, -118, 21, -71, -302, 335, -163, 174, -11, 191, 23, -218, 320, -283, -11, -144, -44, 25, -113, 441, -156, 186, 131, -62, -2, -390, 370, -310, -56, 27, 20, 280, -164, 550, -373, 19, 4, -299, -21, -324, 526, -293, 128, 383, -181, 265, -218, 213, -409, -103, 117, -210, 213, -85, 440, -262, 104, 317]
5653C17o45N05n70M85m08K76L89q00Q70m26L30n51K59J59o97P55m83L58j30J30
5673A23K78r69J088o87J22j18RL19p88J157o88J08N7J0J62p08Q15n94m1M09q9
5694b5K81p03J108o52k30L95l29K82o84J006o15l7O21m72L33m76P67p34j90N59
5714B05n49M76m20P73m74j73P60q44L96m63N64m79q9Q34q92O04l25M29l95k60
5734c22R01j106O01k64K43j66j94R16j141P66j31pj11k51P25j122Q40k11Q0K7
5754G3k46Q95j218P96l35k01J84j26O09j014Q24q5l10L07k67M63r24O83m6l84
5774c22L26o1M59p51O12j8m99N19m22K57n89N87J7n19Q46m82L13n51M77k13m85
5795d99P24n20M58l21L67j2m82P45o78L11k34J14L4m57R13n88K24MN7N1m90P24
$$ y = [317, -328, 177, -393, 92, -316, -40, 349, -451, 419, -7, 323, -228, 31, 190, -507, 248, -235, 123, -7, 123, 401, -568, 520, -167, -45, -163, -154, 165, -623, 534, -154, -46, 11, 21, 183, -525, 290, -304, -345, 64, -25, 256, -447, 661, 9, -221, 174, -155, 127, -557, 449, -166, -203, 418, -54, 279, -197, 570, -164, -354, 205, -344, 132, -288, 485, 11, -162, 598, -246, 150, -313, 251, -228, -317, 517, -375, 229, -96, 333, -62, -322, 579, -527, 74, -190, 53, -113, -307, 609, -532, 234, 103, 96, -15, -266, 459, -663, 177, -34, 46, 73, -173, 722, -496, 300, -35, -236, -52, -178, 431, -583, 241, 156, -154, 153, -114, 349, -575, 108, 62, -322, 4, -57, 402, -349, 263, 245, -254, 265, -157, 100, -489, 98, 115, -404, 442, -40, 273, -278, 199, -14, -499, 225, -295, 163, -158, 209, 197, -285, 460, -218, 93, -141, -27, 7, -450, 463, -125, 99, 103, 160, 211, -279, 445]
5817D45q51J55J78J0J84m42Q32o31J62Nj31J15m15P46o32J90K19r6J94l70N96
5838D63o96J08K15l72M02l02M10k57J34J34k87J96l30L20m47J49L49l82L61j71
5858cK38l10K13Q5n38L76j39J78k21M7L08l90K95j32J71j59l6J03m90L81PO3j34
5881h7J13J70l86L42k71K15j48j17J64k71M26j33J0J58k18J9j72L13l35k9L35
5902I8j63K00j18K64k94p1J87j93J28j81J67j60K4J92m5M1j02Q7n6o9m1r7J07
5925i5K6RK00j64J81q4p8r5rl7P3J06l7R1N8q5J0j82J82j78m6P0j03J65K3K66
5951B67j69m2P4j02n7q1L3j35N9K59j23J46r8J01r0n8k8q6J63j38J70k9L6J13
5975A85j12lj01j1n4N3N6j68J37j14K49Qr8Q9k41J79l01M0R0O6J34n4J41k03J72
$$ y = [445, -406, -251, -73, -63, 121, -321, 511, -120, 42, 47, -84, 31, -384, 362, -270, -80, 139, 43, 237, -133, 463, -233, -125, 90, -282, 120, -182, 228, -29, 105, 239, -48, 148, -182, 138, -309, -160, 189, -193, 168, -3, 235, -75, 138, 223, -315, 61, -78, 100, -121, -74, 234, -156, 139, 7, 178, 19, -17, 86, -404, -23, -16, 47, -87, 26, 196, -190, 152, -119, 96, -52, -169, -5, -276, 150, 17, 27, 185, -33, -14, -186, 127, -208, -237, 98, -65, 135, 17, 281, -13, -84, 103, -90, 38, -143, 24, -136, -112, 80, 35, 76, -26, 61, 5, -64, -105, -202, -95, -69, -60, 140, -24, 157, 73, -5, -100, -109, -146, -73, 33, -4, 87, 145, 60, 70, -112, 70, -108, -154, -84, -187, -22, 1, 267, 98, 56, 130, 28, -29, -110, -77, -212, -153, 106, -17, 129, 31, 132, 42, -16, -44, -130, 33, -105, 65, 36, 72, 185, 73, 70, -31, -42, -96, -43, 13, -155, -18, -132, 117, 125, 27, 116, -125, 54, -247, -207, -117, -51, 83, 29, 170, -33, 139]
6000A39j75k1L2n7k0n9O3K00r0O5J54p5k26R7q2r3K25j99K42j24Q3O8j78L5r0
6025h6O5m6N0m8m4K53j09Q4l1n5k5n6J16k77J71J1N2m6m4J98j70J08jj40L8oO0
6052B2j51J66O4Lk5p3J72k31K5n5r6M0j45M76j48Q2K8j24O2j73J93k00j2K28j28
6077@J41j21J64k15J80j27k27K32j51K08l16L00K6j31L00l04K17k73J18Ok82L00
6099D5j99L39k61K02J12m27L48j45K7j97J08J09m02O47k32J49j65o2j3l13N20
6120A90l58J81o5Q8L10n63O36l89M1j19m0K26o86P08l22J35Q1PK74o51O42m93
6142a67n5K51k53K71j83N36l98M7J97m23K62m33M75l20q2N07l43K09l00N88m09
6163b3k15M11l31K24l39N40m16Q1M77m86L93m55L11l42m0N33n43K59j35L51l28
$$ y = [139, -36, -57, -25, -82, -102, -161, -98, 102, 12, 77, 231, 156, -70, 27, -55, -148, 77, -122, 120, -4, 79, 147, -31, 4, -86, -21, -67, -17, -65, -109, 144, 35, 119, 88, 33, 8, -48, 68, -209, -38, -27, 25, -21, -65, 133, -37, 71, 70, -70, -32, -38, 22, -129, 37, 101, 104, 79, 6, 178, -53, -28, -83, -179, -139, -284, 192, 44, 126, 154, 30, 92, -81, 112, -88, -100, 128, 0, 141, 20, 184, -31, 149, 22, -205, 27, -124, 84, -232, 68, 94, -37, 263, -41, 176, -97, 21, 27, -255, 45, -154, 185, -76, 126, 238, -189, 159, 14, 41, -156, -48, 61, -341, 306, 74, 223, 58, -4, -17, -330, 190, -168, 13, -52, 36, 346, -217, 419, 30, 71, -48, -88, 138, -548, 160, -162, -27, 54, 61, 335, -316, 326, -167, -222, 29, -224, 47, -136, 400, 2, 49, 246, -177, 85, -348, 127, -193, -275, 232, -111, 98, -202, 386, -23, -238, 173, -158, 66, -273, 267, -149, -68, 409, -77, 316, -139, 172, -170, -210, 323, -220, 39, -96, 255, -73]
6184g3j57P59p30L72k62J28k41J74M85p31N13k25J28j0k55O04r96N86j22r2J75
6205C0k15N74p04N77j63j03O1k86M81p58P40o3k65J85j01L89p59N08n1m72M38
6226D3k29N32o58N68k7n48N51l78L52o13M53j16k87N94k48J99l55N70j34o46O30
6247B53o24K58j04L46L4m23P97n72J69k45K08o7n34P44l98J20M1J62O4m27P28
6268E30o75J18l5n3K30m22P48o06L42o0L1Pl96O48p30K70J13l30K73k11N77n08
6290a39K35M2l39J63k19N42m81J79K92l65K81k75M14o58J01L81n13M83j87J74
6310A11k59K27K04n51M32l24K99k70l2K79n52O55j82Q5j76lL10o07N26l17N3J52
6332F0l7K64m87N16l71n0J37j42J58m39N57k44L9J29r9K61m27M09l52o2J12q6
$$ y = [-73, -230, 529, -201, 171, -91, 37, -204, -30, 455, -276, 237, 12, 140, 130, -125, 479, -517, 69, -53, -145, 30, -185, 389, -315, 262, 99, -4, 57, -229, 252, -506, 234, 171, -94, 91, -10, 379, -380, 128, 77, -395, 43, -186, 346, -312, 256, 229, -319, 232, -146, 206, -407, 46, -70, -357, 237, -11, 188, -167, 403, 269, -377, 253, -371, -113, -217, 129, 163, -260, 537, -35, 134, -111, 97, 30, -504, 240, -158, -38, 3, 165, 229, -198, 530, -145, -27, -62, -115, 115, -307, 441, -165, 177, 117, 148, 155, -241, 407, -323, -53, 60, -270, 3, -208, 369, -139, 96, 138, -201, -38, -257, 285, -196, -17, 275, -90, 191, -84, 330, -328, -227, 154, -359, 124, -63, 111, -148, 79, 283, -268, 164, -160, 139, -131, -163, 116, -436, 219, 37, 122, -54, -57, 253, -354, 172, -145, -92, 60, 23, 287, -200, 316, -55, -105, 32, -110, 48, -391, 166, -78, -39, 90, -9, 252, -175, 234, -118, -180, -68, -154]
6354a54L30m29N05j66j24J28j22R6k62K81k39j00M17k95K15j61J19p1rJ96l32
6375a77K07j64J38l9j61N18l86L10l02N8l2j70L03k80K53j1J8nj74L49n26L29
6397E6r9j3o3n5L26l30L30o3j42J21j51J16k63J40L1m8J65n7J72j43J11j03j39
6420a01J21m9r9qJ35l5Q7J30j00K1k56J86M5l37L32j36K2Q6K6J31k17J81j82Q4
6444F7j28K3mj9J03N2N9j04j03J40j45r3J21m3J40j15R6K9J49k36Q2K6j62k9p8
6469a72K46o6Q7k0j13J73j74J51m5j22L3j39J88M3o0J9JRp6R9m3j10M5J1p7j2
6495a24J88k7p1PJ20o1j91K02j54J3O9N0J26r0n1P0J8m7j88J50j09O3J97k06K02
6520A56j40J15j06J8m7n7J1n3J08j14J56q7K9R3j44J16j59K8pk8J74j36J53K6
$$ y = [-154, 176, -253, 252, 86, -38, 90, -32, 64, -198, 83, -156, -256, 161, -134, 81, -80, 39, -32, -41, 155, -177, 30, -134, 4, -35, -196, 322, -64, 246, -56, 2, -30, -200, 103, -177, 76, 65, 83, 78, -96, 253, -273, 56, -43, -56, -119, -174, 152, -178, 152, 89, -53, 68, -83, 33, -230, -90, -59, -107, 58, 1, 173, 30, 141, 38, -101, 20, -29, -128, -136, -1, -36, 51, 181, 81, 102, -154, 32, 77, -260, 72, -64, -42, 44, 70, 201, -16, 165, -17, 67, -61, -38, -42, -61, 42, 94, 153, 49, -54, 86, -59, -152, -31, -74, 66, -49, 47, 76, 225, -11, 71, 97, -65, -94, -172, 74, 8, 95, 75, -38, 135, -39, 112, 67, -55, -22, -161, 27, 70, 10, 29, 30, 39, -37, 62, 19, -91, -46, -35, -112, -124, 64, 37, -34, -27, 93, 32, -159, 43, -111, -98, -29, 21, 147, 57, 6, 76, 94, 47, -141, 9, -100, -37, 160, -46, 156, 16, 131, 25, 43, -4, -61, -50, -103, 5, -109, 47, -40, -11, 82, -62, 54, -105, -77, -84, -112, 62, -74, 79, 105]
6544A05j08K9M7l9j30mL3J30l5p5J24o7J21k02J11m4j92J15m7J42n7J23K6N4K
6569A62k09J63j36j36jJ37O0j53L91k16j24J25jj3j64J60m2p9M9J1Q5j00J98l4
6593A33j92J09j45J65j45Q4o7R0K46l73K77k83K32j53j09L02l09K83j77J78j16
6614C0oK62l58O8q6J35k73P4L29l07K28k09K54q6j06K24m17K72j71K24p2j8K24
6637B15l89L46j70lk1j41K97l36K04j3J64r5o7K24m26K84k1j82Qj49N12m86M61
6660B16r3j36J87k44L08n50L15j8j00K07k6J20l79L13j44r0K19l01K29k65L78
6681A46m1k28L69k90J49j87K26K2m13M20k03K19k99L11j72k08L57l75K04j12K06
6702A01j55k14N46m45J73m9J67O6m54N85m58K37m6L4N9l57N49m14L8J10j19M3
$$ y = [105, -3, 26, 73, 34, -96, -100, -67, 63, 28, -47, 77, 10, 131, -71, 40, -4, -196, -81, -128, 14, -43, 80, 106, 160, 162, -47, 116, -20, -156, -157, -20, 40, -113, 278, 62, -62, 63, 62, 49, -115, 45, 3, -76, -27, -16, 69, -31, 167, 133, -59, 50, -95, 70, -75, 9, -58, 32, 278, -95, 182, -101, 131, -22, -131, 171, -138, 145, -32, 146, 30, 24, 286, -72, -4, -90, 45, -228, -154, 175, -132, 96, -113, 141, 55, -51, 173, -244, 28, -143, 81, 9, -9, 215, -174, 172, 2, -1, -22, -163, 134, -202, 2, -11, 153, 58, -9, 215, -211, 73, 52, -130, -122, -271, 241, -245, 216, 123, -13, 174, -70, 238, -312, 3, -15, -115, 92, 66, 186, -193, 120, -24, -114, 105, -196, 33, -232, 146, 105, -123, 246, -44, 105, -82, 144, 166, -247, 173, -30, 189, -110, 201, 29, -179, 178, -197, 7, -105, 101, -54, -268, 278, -167, 6, -43, 124, 190, -264, 321, -137, 100, 54, 88, 147, -210, 339, -75, -37, 73, -46, -3]
6724cl64O77n79K72L24l43J50k40N11o81L34m7k08K38k04M26l78O5K26k84J52
6745D4k45M14n36K64K16k77L48k98L23m68J92J56k75L11l59K43j92ML35l90M05
6766B15k05J03k20N4K27m56M42j60J15k32J74J20m75N48l56J65j09r7L07n71O70
6787B59j41m1p7kJ38o01N94j77j2O0m2L14n64O10l53k11K88k75M12l93M51l20
6809h3n6K88j49J02k66L69k19j92L30l16K11k10L58j06j63K90l16J75j88K21j20
6830d0j78L85l41L59k29J15J5k92K98k80J48m9J83j32RK45l33J55O3j58Qk08M76
6853B19n26L70J22j77J85j77J49l45K54j50j6m1L5L14l79K41Mr2N4j71J41k48
6875b34R1J53k12K65j11J60j22L5J12k47P3p1J92j41R8J14j47J01j60J61j66K3
$$ y = [-3, -367, 310, -269, 3, 327, -16, 134, -106, 405, -276, 58, 11, -197, 41, -163, 263, -115, -50, 176, -108, 44, -201, 213, -323, -59, 157, -120, 228, -70, 253, -215, -23, 133, -142, 169, -190, 53, -139, -135, 200, -190, 215, 10, 113, -107, -53, 174, -282, 160, 0, 115, -117, 57, 177, -298, 250, -106, 59, -50, -147, 160, -411, 259, 118, 77, 0, -2, 136, -465, 129, -48, -60, 0, -42, 272, -292, 318, -35, -246, 42, -233, 179, -214, 237, -83, -139, 149, 0, 102, -164, 205, -14, -206, 124, -192, 19, -191, 167, 61, -102, 188, -128, 47, -141, 80, -40, -218, 167, -174, 185, -44, 71, 86, -206, 92, -188, -40, -89, 94, -38, -29, 216, -117, 38, 101, -57, -49, -257, 219, -307, 63, 185, 8, 193, 16, 165, -180, 74, -76, -92, -133, -98, 216, -163, 78, 82, -10, 44, -127, 14, -234, -143, 10, -202, 63, -48, 112, -10, 25, 137, -110, -37, -108, 84, -57, 41, 155, 8, 109, -51, 110, -56, -33]
6897c3j0k22K55n3J39r4P6J05l13K43j16O5q8o6J74k10K99j06k4o0lN5j24J78
6921F7j12J16o3l8J98j31P6Lj31J01k34J59n4P3j00M9J94k43O5l0k3j21R2J87
6945A00j77J20m9O1Kr6J39p1K4j29N8K1r7K26k45J64n1oR6r0L2o2M7j08LJ00m1
6972b9J55j70J16O4q2l1j21m8J7P1k5J35p8M9N9q8m7K7K6p7RLJ44o2J73k54P0
6999Fr4J45j02q2N9O5p9O2N0j22R3n2m5J43j51J4RK4J08l2j3Q7q6k1l8L7j64K27
7027D8j11QL2o3K30K0j07j23N3k2K4r7J9Q2l1R1m1J3J06k54R5j27K24j24J32m6
7053C1NJ37k50J42p0Jm1j04J11Q5k8l8KJ32k18R6P4k01J28j34J84j12J84j10N4
7078F0J3r3J41j95J82j37J0j11K03J06k96J62j16M7q4L1P1r2J26nj30J61k8J4
$$ y = [-33, -43, -265, -10, -63, 76, -18, 58, 163, -150, 93, -23, 42, -46, -112, 62, -148, 151, 45, 21, -39, -42, 13, -111, 67, -45, 71, 8, -30, 168, 37, 113, 116, -15, 86, -148, 11, -43, 30, -70, -21, 173, -70, -5, -35, -58, -179, -87, 100, -77, 43, -6, 55, 57, -39, 100, 29, 53, -76, -18, 3, -94, 132, -113, 51, 0, -6, 90, 0, 32, -30, 17, -91, -88, 12, -29, 126, -44, 72, 136, 54, 23, -98, -146, -129, -58, -83, 52, -26, 23, 82, -6, -53, -26, 0, -77, -68, -65, 79, 17, 190, -64, 6, -88, 57, -45, -127, -68, -3, -82, -20, 30, -92, 1, -51, -96, 47, -104, -90, -81, -57, 51, 19, 6, 93, 7, -14, -52, -15, -179, 48, -63, -55, -23, -86, 144, 164, 57, -66, -13, -35, -11, -108, -89, -7, -38, 53, 12, 25, 131, -123, -28, -155, 69, -55, 77, 31, 36, 173, -77, 65, -5, -4, -45, -149, -38, 47, 19, -19, -17, 115, -103, -7, 67, -134, -6, -140, 44, -68, 116, 6, 60, 73, -20, 121, -74, 108, -29, -19, -130, 73, 179, -117, 45, -71, -24, -108, -77, -6, -98, 28, 23, -107, 54, 26, 40]
7102D0q0J26j14R2o1j05P6m3QK14j39L0r9J41j18N1o8j17J30O4Mm5J18p7k96K88
7128B0j06M0q8J98k8oJ21k25R7m3L4J1j68J63pj0Q7P8j24p3R2Mj05N2n4J14j79
7155a05J88k08J25J15n8k5j13K80k41L5m3PK0r3K80k75K01j1l6K6k94L93l60K72
7179H0k2j20J98l37K91j92J09Q2j88Pp1K06j25Q2J74k29J04k35K04j57P3J69k88
7202a85K79j58J76j67L6J02k35K08j92K19j18o7K38k93J98n7J42j87J38K8k56
7223a51J49q2J43r5J06J30l60L61k43J4n4Q3J11l13M16k41M2M8NJ30m12M08l45
7246a50k9K36j37J57k03L50j25j55J2n7M4k01L99k24j11K96p9O3j18J89k06j17
7268a66K90j97R7j80K11Pj54K72j86lj1R8j49j05J93j23J62m2J9J1r6K43l38K18
$$ y = [40, -40, 86, -28, 64, 3, -102, -26, -69, -61, 153, 14, 44, -55, 86, -32, 19, -49, -166, -36, 28, 32, -13, 105, 28, -268, 20, -86, -46, -134, 64, 36, 30, 151, -74, 23, -20, 14, 25, -143, 20, 13, 3, 90, 168, 44, -29, 63, 67, -38, 14, -40, 74, -105, 83, -125, 0, 115, 57, 32, -81, 199, -42, -7, -50, -43, -23, -116, 164, -111, 90, 79, 43, 69, -225, 168, -192, 80, 58, -62, 136, -201, 90, -102, 7, 89, -99, -92, -163, 43, -82, 0, 174, -55, 49, -186, 18, -139, -66, 103, -185, 94, -64, 112, -55, -19, 83, -152, 56, -136, 83, -35, -102, 136, -157, 41, -16, 126, -61, 77, 105, -151, -2, -84, 59, -36, 70, 200, -160, 201, -42, -28, -82, 1, 112, -201, 215, -26, 16, 64, 69, 199, -213, 195, -150, -179, 57, -80, 77, -126, 224, 99, -56, -44, -101, -57, -258, 141, -83, -194, 102, 23, 86, -32, 157, -49, -166, 124, -73, 24, -156, 55, 62, -92, 180, -6, -9, -20, 78, -71, -176, 17, -106, 56, 14, 33, 44, -52, 191, -147, 71]
7292G1j19n5M6p4L25k23N2j5K5o1j09K41l59L55r6o7O4NK08l88K01N9j26Nj06
7317a41L08l35K28M5k21K72q2L5k56J84k4m4k2m7L50k75J85q9j56J86j43J61l92
7340b73L24M1l13K51j48J92k46J71L4k25L20k18MQ4P0om0J85k45J9k4O0K4k25
7364a84K42n7K3n6N8N5j00J08k60N3J33j63J67m1K08j91o1P4r9k3O7J67j71J8
7388c3P0k3J2n4K08j70k9R1p5J09k07J88j42r5K23q5J02p5m1n1K5J27j53R7j53
7413a34J61%J9L0j43Q8j21PQ9k7J42k7J16j59o4Nr2P1Oj2l6J0L3J48l2j8O0j23
7441cPL6p1pN7k8N3j5Rk1m2k6J18r8j3O6j21J18K6K6j49O2j7M8N5j06M5o6Q8j35
7471a04J13O5j24J7K9l1P1j18J31n5P1M9j13K9K0j19J13on3L5M5j3l5o6p8R6K1
$$ y = [71, -48, -103, -57, -131, 194, -29, 23, 8, 33, -28, -137, 104, -255, 100, 4, -63, 1, 6, 214, -174, 27, 86, -40, -35, -141, 167, -168, 60, 105, -116, 156, 74, 109, -147, 37, 13, -31, -53, -100, 250, -25, 160, 71, -85, 101, -42, 119, -273, 51, 92, -221, 30, -118, 74, -172, -1, 33, -192, 128, -90, -86, -2, 68, 62, 22, 207, -38, -19, -43, 17, 41, -184, 58, 1, 24, -32, 26, 81, -19, 89, -171, -118, 15, -148, 19, -22, 186, -5, -66, 8, -91, -114, -47, 120, -51, -33, 37, 14, 26, -28, 180, 10, -19, 72, -3, 106, -101, 87, -55, -150, 73, -12, 90, 15, -26, -77, -52, 75, -78, 19, -134, 27, 27, 46, 76, -67, 21, -100, -93, -4, -31, 111, 84, 200, 41, -23, -18, -110, -39, -33, -45, -81, -71, -38, 110, 78, 60, 120, -3, 4, 40, -31, -38, 19, -9, 44, 29, 38, 17, -25, -51, 67, -31, -44, 22, -99, 19, 45, 71, -78, -16, -33, 15, 70, -36, 9, -57, 31, -104, 9, 74, -50, -33, -4, -35, 36, -82, 49, -6, 65, 114, 1, 30, 50, -69, 44, 38, -15, 20, 65, 52, 17, -49, -127, -31, -10]
7498a0Ol0n6J42j31M8L9N1r8M1Ql8N8j83J20j1K0P6j09K4ppM6N2l1j72K45k70
7526a77K15l1qR2o8J2m4J4M3j34J23k4J15j38Q1j0j35J64j75J60j00p2K8J3J30
7551G4j0m4J7K7lj41Q4q5nR9m3J41q3O7j35M2M6L1j2j73R6m6k9J2L2K34k50Q9
7579C2j19J51j03r5J72m2M2o4J56j40N5n3M7mm6j1l2J60p0n3J02k5p6k4K0m1N4
7606gQ8j26L1P1M5o0j36J59n6L3j20j4J07j03J36k2L7P9p5k1l2J2Lj18J57j71
7632a03J17nK8j7j6Q0j43J40r5jj18J05J55j25RK1OK1j55J4K4K6O5k8j8O7Q4j32
7660FJ22k48J22lP3j29l8J96j28J27j40Q3J01j22J01j04j27N8l8J11j21K27Qj30
7684Gl4p2J16j33J43l5P3p7P2M4j60K10j84N5l5j49J57j63K36L1j03j9kR2j16
$$ y = [-10, -4, -34, -90, 52, -79, -31, 8, 59, -39, 2, 10, -28, 30, -153, -33, -44, -24, 52, -57, -33, -40, -47, -1, 51, 20, -152, 93, -177, 38, 7, -1, 91, 23, 35, -9, 5, 48, -86, 37, 13, 128, -10, 71, 61, -74, 90, -85, 75, -25, -97, -69, -56, 74, 64, 20, 37, 64, 61, -80, 4, -81, -86, 13, -30, 111, 28, 95, -40, 2, 48, 79, 67, -106, -10, -56, -85, -73, -41, 193, -57, 32, -87, 64, -39, -134, 38, -4, 38, -26, 130, -10, 45, -8, 39, 35, -11, -22, -54, 106, 36, -17, 85, 60, -16, -40, -20, -61, -7, 81, -45, -14, 57, 102, 42, -94, 65, 9, 42, -78, -92, 15, -88, 48, 26, 63, 142, 67, 46, 14, 26, 29, -89, 68, -103, 14, 9, 37, 20, 4, 84, -59, 81, -14, -15, -133, -28, 127, 2, 11, 32, 38, 59, -96, -82, -58, -32, 33, 5, -13, 54, 138, 6, 128, -120, 2, -1, 72, -57, -95, 101, -27, 100, -40, 43, 144, 22, 123, 19, -108, -50, -88, 23, -98, 129, 137, 7, -27, -99, 17, -116, 27, -8, 65, -12, 60, 104, -56, 154, -30, 25, -10, -159, -2, -165, 71, 102, -1, -20, -22, 70, -46]
7709d6J30j17k07K29N1Jj58K01l7j28J38r7J64k14J57j47J11L2j46J13m1J05l0
7732F4j45K00j77j3k7J12J7m6J85j93N3L5j32J07j18J56j94J95q6J2J44j55J90
7755A84k29Q9j18O9l5n6L37l67J50r2n2K17j27M7k75L39k5j41J77j44J76k59J45
7778A0Q9j13P0j56J89k95K87O7j76N1N9j29j51J47J14j75J50O6l2q2J24l9l18
7801b43L77k59O6L8N2K5k05L39j81M7Q1l4r2j54J93q0j9N2o9J59j87J48o1Q0k8
7826D5o4l6K0Q0o8P1J55j84L0j20K70k54m4J95k61K58r6R1l7n8J73j83Nj04J21
7851En2KK95k21O7j16JoP7o8L9j4o2J31j58J43om1j4j71J98p7J25J0j14P2l9L8
7879D4j7l2J75k32R6l9k5L9k4J7p3J83j13M8l5m2MJ1J49k17Q4P7K4J1j91J49j60
$$ y = [-46, 84, -33, -240, -11, 40, 41, -117, 84, 47, -81, 57, -40, 124, -90, 67, -80, 31, 63, -83, 30, -11, 94, 64, -81, 119, -58, -71, -98, 14, 31, -15, 170, -23, 30, 65, -67, 40, -78, 78, -116, 79, -7, 5, 149, -6, 184, -45, 44, -74, -5, -40, -96, 241, -126, 24, -68, -120, 97, -30, 17, -258, 81, 56, -85, 92, -52, 124, -135, 10, 99, -14, 56, -100, 89, -206, 81, 148, -28, 23, 82, -47, -198, -51, 63, -112, 38, 104, 72, -10, 114, 75, -243, 134, -125, -59, -21, 31, 56, -149, 190, 9, 56, 137, 103, 11, -143, 50, -30, -49, 3, -66, 93, -94, 54, -7, 73, 45, -19, -55, -35, 45, -23, 48, 203, 19, 49, -71, 199, -55, -99, 96, -165, 93, -3, 88, 51, -7, 166, -17, -12, -116, 5, -47, -45, 250, 29, 96, -20, -19, -25, 52, -16, 23, 9, -53, 78, -80, 63, 57, 16, 2, -169, 29, -48, 77, 87, -27, 45, 6, 44, 27, -5, 170, -62, 34, -5, -30, 9, -15, 2, -71, 112, -1, 47, 12, -30, -26, -15, 134, -83, 1, 78, 102, 113, -78, 71, -89]
7906h9M9J47k50L4M8J29j17M4Q8l0r7J8nkK1P4l8R3j22O8j2r7Lr8J95j42J09p6
7934e5R1l6O0M0m9p2J64j75R2n3m6K00j58Oq1R2j20Q5L0j16O6n2J93j09mmJ8J22
7962A29k38K05k05p7K10n0J5j51J20j8N9J43k65P3L7J5r5J25J47k66Q2j2O2Ko7
7987b0mJ2p3Q3PJ02j18J07k3qj14M3o7P0J2q8P7l6K2PN6l2Rk0R5j50M9l8O6r0
8017f4m7J05%N5M9J3kqo4r9K5J9Q5l4j35J83j55R6j6k5K5l5P0j9m7P1j1L3p3j6
8047b1p9O6R8n6P8j3n5j35J00J1j9l1M8O2o2M8l2Ok9K0J1o5j2k0P6L4L8p8M7K2
8077E8r2M8p3j7J02j8J39j63%J14q8l3p7J15q1J29j9j17J33k8q7O4J45k4o0o8
8103Bj21L6Q4K4o3l5J36j2n8M8l3P4j44p5Q3J7j2M1K2K4QOJ3j4Qk9n3Q8j64R4
$$ y = [-89, -40, 107, -143, -109, -61, 68, -49, -5, 83, 53, -44, -26, -31, -33, -12, 62, 24, 117, -5, 63, 51, -46, -43, -141, 54, -88, 21, -55, 36, 0, 60, 100, 51, -21, 143, -32, 60, 7, -39, 161, 3, 9, -72, 20, -100, -15, 15, -101, -35, -87, 106, -3, -7, -11, 7, 129, -109, 96, -109, -186, 24, -26, -11, -162, -42, -60, -1, 142, -123, -50, -13, 2, -93, 32, 179, -87, -5, -17, 45, 47, -20, -24, -12, -85, -2, 5, 107, -11, 96, 73, 65, -49, -6, -73, -3, 9, -79, -2, -38, -16, -9, 47, 15, 24, 4, 99, -51, -2, -40, 26, -64, -111, -6, -6, 49, 98, 111, 109, 101, 37, -62, -37, -18, 67, 33, -102, 81, -74, 22, 6, -19, 6, -29, 41, 22, -25, 46, 35, 68, -5, -21, -100, -34, 64, 8, 86, 73, 18, -117, -17, -6, -25, -56, -8, 54, -8, 40, 8, 14, -15, 5, 16, -49, -61, -81, -5, 29, 67, -11, 36, 58, -34, 14, -59, -76, 26, 8, 147, -16, -16, 98, 10, -23, -100, 15, -66, 63, 44, -73, 60, 32, -55, 9, 154, 130, 70, 2, -119, -83, 1, 25, -38, -73, 63, 51, -7, 41, 8, 82, -62, -137, -54, -37, -49, -8, 14, 38, 46, 52, 65, 51, 59, 30, -23, 65, -99, -5]
8133em1N3J1K1K9j65J80k94J02J56o6N0o2R4J8p4L6O9n3j07J13r7l3J59j41P9
8159C2r3J4P9p1J31j46J9j2J30j09m8J00j06J88j66N2K9J4N0j23Q0q6J02o5L8
8184C3qo3J04j36J36l9j23
$$ y = [-5, -46, 7, 18, 39, 68, -97, 83, -211, -109, 47, -19, 31, -31, 63, 81, 7, 43, 112, 59, -48, 65, -32, -65, 94, -47, 32, -61, -47, 32, -39, 92, -54, -35, -47, 83, -26, -74, 26, -80, 108, -58, -6, 23, 37, 87, -36, 44, -42, 60, -5, 33, 25, -38, 66, -70, 66, 27, -96]
8191i6
$$ Imaginary data points
##PAGE= N=2
##DATA TABLE= (X++(I..I)), XYDATA
0@%%%%%%%%%%qJ6j6K4l2M0m8N6p2Q8j04J22j47J78k10K43k84L33l83M39n04N77
32C08o57P45q43R51j072J205j349J507j679J867k075K298k541K811l104L425l773
49a976M154m576N039n551O117o746P452q250R156j0195J1406j2836J4549j6647
63h904J9290k2740K7457l4355M5589o8205J87379j91450m2869J76344p2203k6280
75a0947j97588M32125l27110K7171J58935m3411J668j79355L46566k76964j9825
86h8735J47256j05439P9474j80479L09649k04591J5282J27293j44327J20317j86713
97a11013J99622j61477K4919J18996j79167K07479j50561J34917j15147M1545
107A0113Q3916k45330K31872j30954N3024o5961P8443J00868k67888K73923j00665
$$ y = [0, 0, 0, 0, 0, 0, 0, 0, 0, 0, 0, -8, 8, -8, 16, -16, 24, -24, 32, -40, 48, -56, 66, -81, 97, -113, 130, -154, 179, -204, 235, -269, 308, -349, 396, -447, 504, -568, 637, -712, 795, -884, 983, -1092, 1206, -1335, 1476, -1628, 1797, -1976, 2178, -2398, 2641, -2910, 3207, -3539, 3913, -4337, 4819, -5376, 6030, -6806, 7743, -8904, 10386, -12354, 15103, -19252, 26337, -41868, 145511, -45939, -88808, 87536, 15333, -10947, -208535, 223590, -103520, -76349, 82586, 39175, 40843, -138512, 208054, -68910, -88735, 58521, -46918, 32556, -147923, 161726, -42865, -27583, 99710, -44617, 75700, -111013, 88609, -72868, -47949, 71047, -108120, 99359, -51202, 83715, -31432, 10113, 94029, -151301, 80571, -50383, 2641, -63320, 15123, 115991, -151897, 122026, 21361]
118B1361j9094n9940O7854Q4556l00451K82559n1431m6525j5792P7209J00859
129A41165l11929K54101m4319q7624j4607N3676J19679k81220K41418m205q1097
140a4962N418J1021J15085k67891J79756m865p1368L2959j2590J41450k04669
151i0656J42861r489o4648L7986p6243J25678j55446J02865p011k9640Q3414j04581
163d4910J20875j04075N6453m2517l1001R8543j40019J09115l6999M9289l9683
174d929j5868J27073j67381O9963j4011K0496n9463j6455J53835j52435N9684
185E09K8167K1574o1825l9405J48086j55941K0780L5459K5106m1549l8085J59846
197A02722j17066K980K8901J4499m0080o9843J35095q6416k762L1916K8766n29
$$ y = [21361, 2267, -57673, 10181, 94737, -205714, 76845, 25414, -21111, -36903, 40306, 141165, -170764, 83337, 39018, -48606, -63213, -9537, 110142, -171078, 70340, 66135, -14962, -9544, 1477, 116562, -151329, 28427, 23562, -47806, -14847, -27437, 114013, -90656, 52205, 42716, -21932, 16054, -60189, 65489, -89957, 12908, 5897, -23743, 59671, -44910, 75965, -28110, 28343, -14174, -45175, 53368, -86651, 22464, -14535, 34754, -4929, -20797, 106276, -61105, 8858, -5153, 15343, -44120, -60575, 93260, -59175, 509, 28676, 50250, -11575, -50980, 97106, -58835, -38055, -2596, 22510, -19039, -57124, 102722, -14344, -11364, 17537, 32036, -8044, -77887, 57208, -29208, -31970, -54, 28712, 28183]
209B8183p3686J10226o0605j9347o84J0428J8671p7036Q6745j7140K244m530L858
222G327M2983q5255M0033j1760L329k1122o760P2011n7987K1979R741J9076l0819
235B776l6175O8854n4796r196Q871L8308j5436l7257Q0318k4762k6249m379L1813
248B2690j8829o0300O4450j765k1481k928M6861O225o1535M3293O511l0801k7003
261c4612L1179J9666n3777L0953L1621p738k7930K0030K8057n5191l194K2343
273A407J298l1764J1134M7796k5912j1774K4583J3497l6186j7778L7046j7388
285d041k6327J5302L4932j6239j9236L9328M594l4716o563K6663j3451l6217K6105
298i866K4665k0267r223L6906O751l7715M305K3575k1939k9695K3416K1562k6554
$$ y = [28183, -45503, 64723, 4118, -15229, -15913, -5485, 13186, -63850, 22895, 5755, 7999, 3469, 7327, 50310, -34945, 5088, -6672, -3343, -24465, -31225, 40786, -17201, 4778, 14519, 33595, 2776, -33399, 35455, -19341, -28537, -19666, 18642, 3206, -34051, 46267, 21505, -4744, -9123, 22690, 3861, -56439, 8011, 6246, -15235, -18163, 28698, 34923, -26612, 16681, 23192, -7609, -34612, -3433, 16233, -37544, -6591, 25030, 17292, -10638, 9392, 37449, -17742, -20936, 1407, 2705, -29059, -17925, 29871, 3959, -7815, 16768, 30265, -5921, -23699, 13347, -4041, -30368, -15066, 19866, 3627, -15609, 23719, 28313, -6403, -12966, 13697, 246, -35971, -9866, 14799, -5468, -14691, 22215, 28966, -8749, -4444, 19131, -2808, -32503, -9087, 12475, -14079]
311a4079q42L7826Q43l1457Q978K2607k7522k5576K4713J2737k7820L590L7362
324B1360l416k7048J6492J8835k9536k1447K5398M492k9063P643L5939q459k1161
337i971K1597J6150l1009j5857K4450k330l0769J3164L0222j0338j7235K6917
349A4991J3146l2344p895K1861p590l0811J4843K8431j9039o983K6467J1802l1204
362d325l391K5251j9508k2925J2793K3260k0239o798L5722j365j9673j874K3031
375A9959j9203k8018K4524M659j1918p581L3420L788k8097J6896P859j0638k8976
388b3326J8848J3242l1552J2492J6774J2777k8666J3513K5440l4202o292M986
400e966J7380l4313J536M1697k0452k585L642L2253l4218j8836L7722k3266j0682
$$ y = [-14079, -14921, 22905, 23748, -7709, 1269, 23876, -3646, -29222, -4509, 8228, -19592, -16002, 21360, 17944, -9104, 7388, 26223, -3313, -24760, 638, 5130, -23933, -16290, 19649, 11190, -9971, 11626, 27776, -3233, -19090, 5360, 3030, -27739, -14575, 15647, 5309, -11926, 14991, 28137, -4207, -12102, 9759, 2169, -28642, -13799, 14632, -4407, -11390, 15077, 26879, -4325, -7716, 17535, -1973, -24898, -12105, 11155, -9084, -15882, 19840, 18475, -1198, -3072, 19959, 756, -27262, -2738, 1921, -9997, -17578, 15842, 19630, -8467, 8429, 16288, 5650, -23326, -4478, 8764, -22788, -10296, 6478, 19255, -9411, 4102, 29542, -4660, -10952, -5966, 11414, -22899, -21363, 20334, -118, -2703, 939, 33192, -1026, -19862, 17860, -5406, -16088]
413a6088p241M1709j8367k1324M7193j2663o653k1649L4583j6904l6911L9478
425E163j0563P193k1119L7445L588l6401L2278j7597R590l3562J8292J3533l1794
438b3954L1921j5617L2443k7682L909K0808l2774J7114l3118L9313k2286j1357
450b1280L6606j6036K1589m1261N0005j8537l6645L2095j5402J7674n1865O0831
462A7774K025m4442M2197q040J8168o6896N3222N303o1156M1543l732K8733o2338
475c7639N5958K1210o6907M0016j5078K4696o6324M0971K8384o2786N0411j5659
487b747L5850n3024K6446K5837o6578M7027l4679L4435l4636J6096L3217n2611
499b5367O0391m8045L0830k0340o880K0335m9424O8240n9610L2718J0593j3888
$$ y = [-16088, -23329, 18380, 13, -21311, 25882, 13219, 6566, -15083, 19500, 2596, -34315, 5163, -5400, 1793, -19326, 18119, 21707, -14694, 17584, -13, 9577, -23985, -5693, 7840, -23954, 7967, -7650, 24793, -2889, 1020, 21828, -10946, 6168, -26950, 12363, -9923, -21280, 15326, -710, 20879, -20382, 29623, 11086, -25559, 6536, -8866, 8808, -43057, 17774, 19799, -24643, 17554, 9514, 27682, -39214, 14008, 19311, -41845, -302, -4034, 24699, -37639, 18319, 39529, -27378, 12638, -2440, 22256, -44068, -3097, 25287, -37499, 12912, -2747, 33103, -19921, 6525, 32362, -34216, 12811, -21868, 12567, -22069, -5973, 27244, -25367, 35024, -13021, 17809, -2531, -9411, 10924, -38500, 29740, -29870, 2848, 13441, -447]
511d47J9058m3413P5274q0136J7763K5624k8674J3059l3358R1146q0630J5325
523i409M7950m0680M822l8895Q9333q9617M528O4837m3022J2996l0719R3612q4462
536a8726o006O6168n7455J1877l5951Q6348p0699m950P6010n7610K6059l8481
548b3416O9156o2870j4962O6130o6147M0738l4264N8008l7850r256O1216p5730
560b9247N1845m2060K9915k4737p075N4649p6916P4674l2624J0327o461o456L9963
573C5797r1917Q2996l3148j0816J2916L617L9853r1322R4896k8480l4626J9964
585b70k922L0250r5625R9762j7164m1137L7073p02L0167r6103R0510j7743n5527
598c9431M0989p466L3618q2619Q6873n791n4062M6868k0961K9677p7945O7321
$$ y = [-447, 18611, -24802, 50472, -29664, -11901, 13723, -14951, -1892, -35250, 55896, -24734, -9409, 38541, -2139, 2683, -36212, 53121, -36496, -31968, 32869, -10153, 2843, -27876, 65736, -18726, -24732, 41436, -16019, -4142, -40093, 46255, -24444, -29394, 46616, -10994, 15065, -23416, 45740, -17130, -32092, 34038, -32109, 8629, -25635, 32373, -5477, -14733, 46483, -29247, 22598, -19462, 10453, -14284, -21359, 33290, -43626, 31048, -1576, 8751, 2290, -4166, 35797, -56120, 26876, -6272, -17088, -4172, -555, 39298, -52024, 42872, 14392, -20234, -270, -3192, 27058, -68567, 31195, 14031, -27106, 9967, 9265, 39432, -56671, 33839, 16096, -39431, 1558, -5908, 27710, -54909, 31964, 26173, -27889, 18979, -1982, 27695, -50250, 17071]
610A7071n653m9724N5510k6700L8299n6617N1650n370m7977N3894m7845L6025
622A2563m0517L6953j812l2202O4236n7642L7388k4598J4218r726k9899O5028
634C3990o9633L9843j442O474n970k0194O6885q0870L0756O616j0006p702j5431
647b6684P2530p6712L1945K1853j6916p550j9602O4665p9045K2216K6809j8556
659e047J603j5031O6328o7221J5703K5595k7244K587k4120N6685n4453J4294K8554
672A8233k1678J5248k5833M5650m4451N010J7573k7494K4470k8456L9367k4561
684f922R289J4445k7146L0945l5121K0821j6799N555Q304k5782M4508k9769J4877
697G205m249N816N12l3509M3433l1331K238M158J0610L882k9504M8552k4745p058
$$ y = [17071, 11418, -38306, 17204, -9496, 28803, -27814, 23836, 18466, -29511, 24383, -23462, 12563, -27954, 8999, 7187, -25015, 39221, -18421, 18967, -5631, 8587, -1139, -31038, 33990, -35643, 4200, 2758, 9232, 3262, -16932, 49953, -30917, -161, 6455, -3551, -11253, -26684, 45846, -30866, 1079, 22932, 6016, -1534, -21136, 43529, -35516, -13300, 13509, -5047, -3444, -18475, 47853, -19368, -3665, 21930, -5314, -2727, -26847, 29838, -24615, -10321, 18233, -3445, 11803, -14030, 31620, -12831, -7821, 9752, -17742, 6728, -21728, 17639, -6922, 2367, 16812, -10334, 20611, -14510, 6311, -10488, -4933, 3371, -22411, 22097, -7672, 7205, 2956, 8772, 9284, -24225, 19208, -12123, -9885, -5727, 4883, 8765, -20739, 27813, 3068, -3990]
711c990L322N114o02l4902M5595j6414o888R586R638N013l4349L6367j4258j4217
725a0985L694M394J0092k9559L3639l208p869L299m75J0897l0933J8100k466n826
739g206K806j437K0640k0765J2459K93k787l071j2300J8397j7153L907L387N993
753C163L246j2819K0839j0172m854l387M127O09j8278J9734k05k524p59R351N085
768A3156k1347J1041P49q227o697P646J0512j6489J0807Q634k722r001K861Q880
782I803j8621M4P941N56o566L386J5952r906k972N840J443j1277n445J1994n399
797c227n543P094R377l670o423J1202j791j0765k056O815l289q992R644P547n025
812H98j966R360N70j2675Q43N673o527p111Q184P583o890Q82J0499j298j0612
$$ y = [-3990, -668, 4446, 3844, -31058, 14537, -1877, -8765, 821, 10459, 15472, -18877, 17490, 3232, -10985, -7291, -2897, 7195, -22364, 11275, 8067, 198, 3497, 3022, 13919, -17014, 1086, -1380, -7206, -4400, -5837, 14803, -5962, 6497, 6790, 4003, 932, -11368, 7029, -10124, -6217, -2830, 3163, 6409, -6410, 14429, 4257, -597, -3984, 143, 752, -17526, 2208, 2003, -521, -1280, 8071, 13156, -8191, 2850, 3599, -4628, -11325, -3679, 6833, -9656, 1151, 9785, 7063, -1938, 923, 9803, -8818, -8774, -833, -277, -6843, -3457, 12495, 2589, -383, 5457, 6900, -4377, -9822, 2172, -3227, -8770, -1676, 7701, 4031, -2392, 8810, 7019, -3746, -5802, 1013, -2276, -11268, -1624, 5923, 898, -1068, 8292, 8862, -3813, -2970, 2703, -3824, -10935, -2751, 4832, -2058, -1176, 9323, 8025, -2587]
827b587J782N160q695o527Q822M398o473K216J1415k372q960L773M046j0267n418
842i687Q142K297p341M247J0942k922p066N745K502j0381m717P787m82p385N612
857b707R963l313n139P316K018j1496k471O024j934p899O153R955n657j503P597
872F907J705j0774k088P455o886n612N519Q145n020j996J2088k875o918j571N987
887D066o653q651J0256J282k506l63J0176N31j0842O541j268l910q002O271N045
902A973r465P851L791L302p601J864O833j3326P09j206O437p257Q2J4714p410
917A291J941k598Q822r220r942J3239q051K62m124J5031j908j0990J6876o150
931D479j492j1429J1903k150j7083J7692k369L669q690J3485L930k0628J4696
$$ y = [-2587, -805, 4355, -4340, -10867, -2045, 2353, -4120, -1904, 9511, 7139, -1821, 1952, 5998, -4269, -9687, -1545, 752, -6589, -2342, 8600, 5678, -1388, 4357, 6859, -3522, -8239, -452, -934, -8319, -2707, 7256, 3943, -1196, 6120, 8138, -3358, -5829, 195, -1739, -9638, -3485, 6470, 813, -690, 6907, 8612, -2162, -4250, 3205, -3681, -9293, -3774, 4371, -649, -2645, 9443, 6568, -350, -1921, 4066, -2587, -11238, -982, 300, -2206, -2569, 7607, 8138, -2704, 3837, 2569, -1341, -9343, -3072, 1973, -7492, 359, 4150, 7452, -149, 1715, 8548, -4778, -4069, -5275, 1162, -6095, -6013, 8701, 1291, 3232, 634, 9456, 236, -9706, 3533, -4518, -4256, -8380, 6651, 4743, -6247, 10629, 4479, 2987, -8442, 3461, 1311, -15772, 1920, -449, 3220, -5470, 8015, 11945, -8683, 6013]
944F013p135J864j2814R701Q527j8072J8586m898O860j0042K447Q507k1692J4563
958B415j0689R188m788K61J4200j5523J6879j5434Q380l150j0868J1923j4483
971a1689J8863j7560J2946P511j4144J2711j2620J7364k6255Q560J1785k0621
983a3149J3868p102K2996k5573R159J8838k7776J0681j0058K0271k8504O854K5827
996A6332k7357J5449o250K1261k7087N80K5713l4286J4691q585K0234j9623J304
1009g624L0370l2888J8595j1279J2965j6860n695K7240l4238K5171j0240J1429
1021F946n105n829K4267l6547K6791j5894J013K396p285K3021l3183L6555j4710
1034B436n242J0759j1622J5389l7021L8646j6319j1601K2521r212J5502l3905
$$ y = [6013, -1122, 742, -12072, -2371, 6156, -11916, 6670, 1772, 8632, -1410, 1037, 9544, -12148, 2415, -8274, 914, -3874, -3613, 10587, -4936, 11943, -3491, 4889, 1739, -9129, 2794, -11689, 7174, -10386, 2560, 10071, -4073, 8638, -3982, 13382, -12873, -4313, 7472, -13149, 719, -6383, 16613, -8960, 199, 19037, -8739, 1942, -8116, 12155, -16349, -9495, 16332, -11025, 4424, -1826, 19435, -7652, -7072, 18641, -15645, -954, -9539, 10695, -8928, -7624, 22746, -10142, 8453, -2826, 10139, -6721, -12416, 14824, -19414, 5757, -4483, 6946, 1841, -3988, 20279, -16268, 10523, -5371, -4358, -1962, -9247, 13774, -19409, 17146, 2436, -2806, 7953, -3669, 11720, -25301, 13345, -2974, -14575, 7946, -1266, 14236, -19669]
1046a9669M2007j7716k1538K6317j4962J1454l2693M4268j2825k2591L5119j5999
1058A172J0102l1819L7525j3720k8882L7934j8879J3039k4427L6209q456k8609
1070a8811L9163k6045J0546k2296K5501n400k5957M3195k7534J6139j3885J6587
1082A1203m613k6007L9405l6375J7026o565Q001J971j8509M1715m0269J8684j624
1095D043n628J131j7179L9272m3608K3361Q328j1366O382j3244L5814m8248J9919
1108a023J0736k1213R406r469L6320m4173K2146J6616k7061J0606j1820K9503
1120B0574m3734J8075J9967k8977J7865q885K8177l7337J4623J8047l4194J8362
1132B563j2688K2581k8632J3806K0442l1520K5162j5099J6191k3150O984J4763
$$ y = [-19669, 22338, 4622, -16916, 9401, -5561, 5893, -26800, 17468, 4643, -17948, 17171, 1172, 11274, -20545, 16980, 3260, -25622, 12312, -6567, 6472, -17955, 18254, 9798, -18811, 20352, -5693, 4853, -17443, 8058, 2658, -23299, 19896, -7638, 8501, -5384, 11203, 6590, -19417, 19988, -16387, 639, -5926, 2075, 4046, -14463, 27252, -13017, 5667, 4043, -1585, -454, -17633, 21639, -21969, 1392, 9720, -1646, 4736, -8508, 27306, -20942, -1023, 9713, -11500, -2094, -11563, 24757, -19416, 2730, 19346, -7715, 2891, -8929, 20574, -23160, -5085, 14882, -14095, 3770, -5115, 23062, -14275, 348, 18395, -15799, 2563, -10125, 12456, -16176, -2370, 18072, -13448, 11714, -3385, 12806, -10344, -3360, 11403]
1144A1403l2211K9247j5754J3856j0680O374J3204l1152L1014k1693N559m551
1156e384J835J1127k7182L7054j9843K954L565j818N967k8214L4574k1834j828
1169i027J1114j919Q072k3427L5903k0729o980J2563p689M822k2623L3364j6233
1182b789o255J8270p367O827k1272K7365j6469j0264J6657j0516R179j6038K4778
1195A2106r639q021J6616j4067Q966j6868J5966q124o634J6688j3528J4450j1412
1208c501J1244n079o814J2028j8307J3418r547O135n62k105J4023j7667J5325
1221H591p371r20j825l531J0687j8648J5852j497j743K361r64J0278j9901J2117
1235C486k110o361J208o61J1548j5676J2534K676o188J333l220Q422j6512P517
$$ y = [11403, -20808, 8439, -7315, 6541, -4139, 2235, 15439, -15713, 15301, -6392, -833, -5384, -3549, 7578, -19604, 17450, -2393, 561, 4126, 2308, 8275, -19939, 14635, -7199, -9027, 2087, 168, 8240, -15187, 20716, -13, -6993, 5570, -2119, 2703, -19920, 13444, -2789, -9044, 9226, 1859, 8686, -12586, 14779, -1690, -11954, 4703, -5813, 3366, -12672, 12106, 2467, -5554, 11062, -3005, 5961, -10907, 5059, -3065, -9699, 6989, -6539, 7911, -3501, 7743, 2664, -4150, 7878, -10429, 2989, -6558, -423, -985, -3090, 10933, -6734, 8591, 1220, 300, -1525, -5056, 5631, -13017, 2835, 1338, -405, 1956, 992, 11270, -8631, 3486, 1376, -4985, -3777, -4438, 7110, -8566, 3968, 6644, 456, 1789, -1431, 6991, -9521, -2004]
1249b004K809m814L402j258J1005j1546M925K165n996J096n734Q568q369L365
1263b386M411j705M099n609P770o619j192K18k580L568o285P814o99M52J553j090
1279A720L954q864L170r43j972o04M06O774n490L581K728j457k385k384M476p078
1295d368K49L113R11o28J50O562l902j788J420o64l152l206N319j619j006L439
1311H30K713m24l251L419j682m044p07J796J3k577M252K740j306n41J781J0n082
1328b060j43J622j833j427K955L273j544K31K865r49l747o53J628k888j652L085
1344a237K470j300Q85L303r41l478K11O16k999j994L153J515j279J522L494q69
1360C072k914R97L07l738j681K476P67j733K497L334o65j978J336K66m274j139
$$ y = [-2004, 805, -4009, -607, -1865, 9140, -2406, 2519, 4684, -1312, -216, -5950, 2618, -5751, -2386, 2025, 320, 4419, -1190, 6580, -39, -1231, -1013, -3593, -25, -6310, 1504, 805, 1257, 2810, 1720, 5674, -3190, -20, -963, -2935, -3539, -3133, 3641, -1849, 1732, 4460, 3003, 618, -1766, 2710, -4368, -4119, -1006, -95, -723, -573, 5989, 2087, 299, 1719, 1055, -2097, -5303, 16, -1603, -2609, 830, 3543, 3119, -132, 3287, 1605, -2439, -3146, -1350, -1337, -3914, 338, 3078, 1772, 1231, 3012, 3022, -2060, -2203, -581, -2414, -3841, -886, 2387, 843, 1074, 3939, 2990, -757, -1410, 218, -2670, -4322, -1237, 1233, -67, 818, 4121, 3180, -298, -87, 529, -2470, -4464, -1311, 204, -1075, 447, 3941, 3072, 158, 1155, 1462, -2276, -3957, -1481, -714, -2447, 50, 3384, 2719, 741, 2077, 2343, -1931, -3070]
1376c070J640P7j731K365L920j303q43J610Ml658j869K569k097r66K045L289n85
1393A397j188L904j569k860j127R79j029l473M429Q78J19j36K939O60n173K306
1409A056j130j815j863J501L487l879M430O72O31k082q36K217o027J898r34J743
1425i31K4n62N806l776K284k226Q05j097n003M866l492L057j974L826K542n515
1441a366N554l618J032n016J265L646p735O889q80L796m119K164M973j0463M871
1456I93l034K196m836J405Q516r525P419j272K666n002j668P560j2391O195j760
1471b538K900j405r19J0282j1448P321l728k3j213m771R205j1090R751k469P30
1486E85L483n353Q161j2030Q619n669k760O532o465R151r665J2356m987m619R150
$$ y = [-3070, -1430, -1353, -3084, -719, 3201, 1898, 1055, 2665, 2669, -989, -2858, -289, -2386, -3352, -1307, 1982, 1397, 209, 4113, 2544, -316, -1443, -464, -1493, -4966, -537, 341, 460, 324, 3263, 3923, -1250, 1056, -74, -1889, -3752, -2251, 1236, -2643, 1787, 2459, 3090, 1008, 172, 2389, -3638, -1740, -2674, -931, -907, -1469, 4337, 561, 2845, 619, 1424, 327, -4676, 190, -3302, -245, -2219, 1607, 4149, -1366, 4188, 570, 1602, -3414, -2149, 1497, -6238, 651, -229, 3567, -552, 1612, 6585, -3878, 993, -2041, 155, -4681, -3276, 5240, -4285, 3134, 1862, 4528, -474, -2142, 5418, -6973, -778, -2538, 362, -1043, -1962, 8320, -3128, 4193, 465, 442, -771, -5542, 3663, -7427, 2324, -145, 585, 4068, -1285, 6876, -5154, 3465, -2204, -4964, 1568, -4897, 4254, -5411, 6945, 1958, -2661, 6489]
1501F489r492N557j0747J1897n312n962J4412q955O902q968J2256o518r990J4948
1515F517j1712N075p131J2799l709r496J8890j2730M389p388Q978m319j1980J9802
1529G985j3430O492l576Q129j251j2209J9406j6753N262l563L395Q61j0809K1426
1543A1365j6542Q078k19j328J781j1761J8437j9549Q534K850m526O234q684J8643
1557A3313k0611R397L364j1155O777q669J6573j9931J1722P682j3777J0418p788
1570b685J3730k1585R993P721j8296J3135o025J3514j7991J0914R742k1435J4040
1583D772p908R058j6746R116J1014k1461J8369o468P656j2740O335R411k4115
1596a3707J8692q720N233p258N543J0917k2014K1457j0468J842m423J100Q186
$$ y = [6489, -3003, 2554, -8193, 3704, -1608, -7570, 6842, -2113, 4789, -4179, 8077, 1559, -8431, 6517, -5195, -120, -7251, 5548, 1839, -7657, 11233, -1497, 2892, -4496, 4482, 163, -11817, 7985, -5445, 1047, -2529, 5600, 4349, -7860, 11546, -5207, 55, -3508, -113, 748, -10061, 11365, -5177, 2901, 2682, 1354, 3135, -8626, 9811, -9738, -1204, 1646, -2880, 3354, -5330, 13313, -7298, 2099, 5463, -5692, 1085, -7584, 8989, -10942, 780, 8462, -5315, 5103, -2685, 11045, -10540, -547, 7174, -11122, 2013, -4012, 9502, -8489, 2425, 12167, -9268, 4772, -3136, 5922, -10824, -1708, 9306, -12155, 6214, -254, 7402, -5338, 997, 10408, -13707, 4985, -3735, 1498, -5760, -217, 10700, -11314, 10143, -325, 1517, -2906, -1806, 6380]
1609F380k1499K3271j0714J663K640p71P885k0452K2660j4139k090N990l835P647
1623D636j6706K4385j3038k706J0258p972N369j6499K2139j4370l788J4746q875
1636b421P042j2374K0707j4026n975J5328j3364N936j0643J8420j1046m842J8750
1649A1492j4330P010r278J3456j1125o483J7823j6224R193n849J1461o813n389
1662e056J7176j8507Q891o350N845m746m579J7048j7351J1974l305K348k488n481
1676d581J3758j9521J1863k599n55J677l146J3724j7891J2346k077n589K624m775
1690d742J1133j6945J3138P09o141O064l885R256j6646J0688j52r213P176l892
1704c452R099j2705J0956J902r693P876n890O265j2182Q014K122q987J0260n078
$$ y = [6380, -15119, 8152, -2562, -899, 1741, 970, 8855, -11597, 11063, -3076, -5166, 824, -3011, 4636, -12070, 12315, -723, -3429, 6829, -1143, 4226, -12273, 9866, -4504, -8292, 6454, -2421, 4621, -7753, 12954, -1072, -7047, 8281, -5083, 853, -9790, 8630, -2416, -7258, 11492, -2838, 4172, -5106, 8350, -2775, -9258, 8565, -7659, 1534, -4315, 7146, 333, -5056, 12120, -6387, 2504, -3846, 1999, -2747, -7326, 9722, -7629, 4345, 1040, 3388, 900, -4581, 9177, -10344, 1519, -1080, -1635, 42, -3104, 10620, -7271, 5075, 2998, -2591, 33, -4742, 6391, -10554, 2584, 3293, -2848, 3216, -669, 8587, -8059, 2629, 2477, -6736, 440, -3452, 5647, -7058, 3898, 5800, -3893, 3983, -1907, 4358, -7824, 190, 2312, -6675, 3585, -1493]
1718a493O992q316N793J378j0079Q823p301N454n797M871K835p217J0369p492
1732a180M270m119Q62J267p549R817p499M845m38J088K162o202Q603q813K242
1747f44j00j520K037m374R385o507K789K243k602J130n545O996p206J213L318
1762F13j923K860l177P074n393j40K370l954J411m088N893l572N97L960k204K645
1778B972l696L747l516j595K033k967L049k612M202o99k12K020k627J888l877
1793a890J303q15p52J937j542M055j944J344K58j313J37k866K204k208J62J545
1809c85M07J428j494K977j454j415l0r62m3k006K544K34q9J420O32M86k127N90
1827G13p57j764NK88J278r08J952J078m54k46m25n1k101l31P46m48M23Q96J752
$$ y = [-1493, 5499, -2817, 2976, 4354, -5725, 3098, -4203, 1251, -4546, 325, 3160, -4057, 6312, -1180, 3090, -1029, -167, 1100, -6449, 3368, -4131, 714, 276, 1364, 3526, -2676, 5927, -2886, -644, -744, -2264, -227, -4601, 4784, -1723, 1066, 3309, 707, 1837, -3708, 3288, -3918, -2705, 613, -1310, 1550, -1627, 5447, 54, -86, 2284, -1670, -259, -4347, 1546, -2026, -1429, 2531, 327, 2972, -724, 3023, -493, -2088, -55, -3022, 27, -2585, 1617, 918, 706, 2726, 99, 1987, -1890, -587, -1402, -2154, -217, -1759, 2296, 352, 1696, 1954, 641, 778, -2088, 116, -2092, -1930, -385, 22, 1450, -44, 2933, 1479, 64, 34, -928, -971, -2977, -433, -199, -288, 1132, 1764, 2250, 123, 713, -44, -1808, -1803, -1515, -237, -1145, 807, 1885, 1431, 1185, 760, 709, -1392, -1723, -977, -1425, -1002, -106, 1646]
1846A646l78r6L86q40j136j036N03o07j12J348J056L57o7Q88n65j446p11j00n31
1865a441n40J295J039J3O94Q15j32j564l96j63j054n52P09J213j40Q30J264k50
1883A640q21n19j16j499n77O98K21M55O36J774l58m41j11m84j225j263R65k98
1901a323K44J057J022Q44j227J084q56j202q93j34N27j279K066O56M03K58N5Q26
1919B128k911M25n84n16j87J48K678j664J988K32k72p73j628J769l300J243J62
1936a062L28J335q29L156k573J203j002j179M04k508K754k161K355M00m17K674
$$ y = [1646, 1268, 1172, 1558, 718, -418, -1454, -951, -1558, -1670, -322, 734, 1091, 1024, 1912, 1347, -99, -810, -910, -1441, -1981, -686, 353, 366, 1060, 1875, 1743, 179, -217, -380, -1434, -1986, -1277, -64, -204, 626, 1890, 1640, 819, 300, 184, -1315, -1892, -1194, -973, -518, 118, 1892, 1534, 1093, 982, 498, -727, -1990, -1025, -1323, -1079, -22, 1000, 1844, 617, 1701, 845, -357, -1250, -1384, -857, -2136, -70, 586, 989, 1247, 1302, 2128, -783, -358, -942, -1458, -1645, -1497, 1181, -483, 1505, 1737, 1465, 692, -936, 833, -2467, -1224, -1062, -734, 601, -228, 2928, 355, 1558, 556, -623, -219, -2727, 27, -2134, 221, 621, 204, 2878]
$$ [...]
8191A28
##END NTUPLES=NMR FID
##END=
