##TITLE=1H_Pr 2-OMe
 CDCl3
 8 sc, 
 15.04.2022
##JCAMPDX= 6.0         $$ Bruker NMR JCAMP-DX V2.0
##DATA TYPE= NMR FID
##DATA CLASS= NTUPLES
##ORIGIN= UXNMR, Bruker Analytische Messtechnik GmbH
##OWNER= root
$$ XWIN-NMR		Version 3.5
$$ Fri Apr 15 15:50:28 2022 Russian Standard Time (UT+4h)  she@DPX200
##.OBSERVE FREQUENCY= 200.13135
##.OBSERVE NUCLEUS= ^1H
##.DELAY= (6, 6)
##.ACQUISITION MODE= SIMULTANEOUS
##.ACQUISITION SCHEME= undefined
##.AVERAGES= 8
##.DIGITISER RES= 18
##SPECTROMETER/DATA SYSTEM= spect
##.PULSE SEQUENCE= zg30
##.SOLVENT NAME= CDCl3
##.SHIFT REFERENCE= (INTERNAL, CDCl3, 0, 15.7039)
##AUDIT TRAIL= $$ (NUMBER, WHEN, WHO, WHERE, WHAT)
$$ ##TITLE= Audit trail, XWIN-NMR		Version 3.5
$$ ##JCAMPDX= 5.01
$$ ##ORIGIN= Bruker BioSpin GmbH
$$ ##OWNER= she
$$ F:/spectra/data/she/nmr/H-F/1/audita.txt
$$ ##AUDIT TRAIL=  $$ (NUMBER, WHEN, WHO, WHERE, WHAT)
(   1,<2022-04-15 15:49:01.92 +0400>,<she>,<DPX200>,
      <created by zg, POWCHK disabled, PULCHK disabled
       configuration hash MD5:
       00 E9 B6 7A A2 85 ED C7 34 08 36 98 17 FE 4E 26
       data hash MD5: 16K
       E4 68 BF 2D 78 C0 36 AC 12 08 40 2B 63 DD A7 66>)
$$ ##END=
$$ 
$$ hash MD5
$$ 73 FD DC F8 5B 38 2C 0F E3 A7 6A 30 66 51 EB 89
##$RELAX= 
##$RELAX= 
##$RELAX= 
##$RELAX= 
##$RELAX= 
##$RELAX= 
$$ Bruker specific parameters
$$ --------------------------
##$DU= <F:/spectra>
##$EXPNO= 1
##$NAME= <H-F>
##$PROCNO= 1
##$TYPE= <nmr>
##$USER= <she>
##$AMP= (0..31)
100 100 100 100 100 100 100 100 100 100 100 100 100 100 100 100 100 100 
100 100 100 100 100 100 100 100 100 100 100 100 100 100 
##$AQSEQ= 0
##$AQ_mod= 1
##$AUNM= <au_zg>
##$AUTOPOS= <>
##$BF1= 200.13
##$BF2= 200.13
##$BF3= 200.13
##$BF4= 200.13
##$BF5= 200.13
##$BF6= 200.13
##$BF7= 200.13
##$BF8= 200.13
##$BYTORDA= 1
##$CFDGTYP= 0
##$CFRGTYP= 5
##$CHEMSTR= <none>
##$CNST= (0..31)
1 1 145 1 1 1 1 1 1 1 1 1 1 1 1 1 1 1 1 1 1 1 1 1 1 1 1 1 1 1 1 1 
##$CPDPRG= <>
##$CPDPRG1= <>
##$CPDPRG2= <>
##$CPDPRG3= <>
##$CPDPRG4= <mlev>
##$CPDPRG5= <mlev>
##$CPDPRG6= <mlev>
##$CPDPRG7= <mlev>
##$CPDPRG8= <mlev>
##$CPDPRGB= <>
##$CPDPRGT= <>
##$D= (0..31)
0 1.2 0 0 0 0 0 0 0 0.06 0 0.03 0 0 0 0 0.0002 0 0 0 0 0 0 0 0 0 0 0 0 
0 0 0 
##$DATE= 1650023341
##$DBL= (0..7)
120 120 120 120 120 120 120 120 
##$DBP= (0..7)
150 150 150 150 150 150 150 150 
##$DBP07= 0
##$DBPNAM0= <>
##$DBPNAM1= <>
##$DBPNAM2= <>
##$DBPNAM3= <>
##$DBPNAM4= <>
##$DBPNAM5= <>
##$DBPNAM6= <>
##$DBPNAM7= <>
##$DBPOAL= (0..7)
0.5 0.5 0.5 0.5 0.5 0.5 0.5 0.5 
##$DBPOFFS= (0..7)
0 0 0 0 0 0 0 0 
##$DE= 6
##$DECBNUC= <off>
##$DECIM= 32
##$DECNUC= <off>
##$DECSTAT= 4
##$DIGMOD= 1
##$DIGTYP= 9
##$DL= (0..7)
0 120 120 120 120 120 120 120 
##$DP= (0..7)
150 150 150 150 150 150 150 150 
##$DP07= 0
##$DPNAME0= <>
##$DPNAME1= <>
##$DPNAME2= <>
##$DPNAME3= <>
##$DPNAME4= <>
##$DPNAME5= <>
##$DPNAME6= <>
##$DPNAME7= <>
##$DPOAL= (0..7)
0.5 0.5 0.5 0.5 0.5 0.5 0.5 0.5 
##$DPOFFS= (0..7)
0 0 0 0 0 0 0 0 
##$DQDMODE= 0
##$DR= 18
##$DS= 0
##$DSLIST= <SSSSSSSSSSSSSSS>
$$ [...]
##$SUBNAM2= <"">
##$SUBNAM3= <"">
##$SUBNAM4= <"">
##$SUBNAM5= <"">
##$SUBNAM6= <"">
##$SUBNAM7= <"">
##$SUBNAM8= <"">
##$SUBNAM9= <"">
##$SW= 18.05172834244
##$SWIBOX= (0..15)
0 0 2 0 0 0 0 0 0 0 0 0 0 0 0 0 
##$SW_h= 3612.71676300578
##$TD= 16384
##$TD0= 1
##$TE= 0
##$TE2= 300
##$TE3= 300
##$TEG= 300
##$TL= (0..7)
0 120 120 120 120 120 120 120 
##$TP= (0..7)
150 150 150 150 150 150 150 150 
##$TP07= 0
##$TPNAME0= <>
##$TPNAME1= <>
##$TPNAME2= <>
##$TPNAME3= <>
##$TPNAME4= <>
##$TPNAME5= <>
##$TPNAME6= <>
##$TPNAME7= <>
##$TPOAL= (0..7)
0.5 0.5 0.5 0.5 0.5 0.5 0.5 0.5 
##$TPOFFS= (0..7)
0 0 0 0 0 0 0 0 
##$TUNHIN= 0
##$TUNHOUT= 0
##$TUNXOUT= 0
##$USERA1= <user>
##$USERA2= <user>
##$USERA3= <user>
##$USERA4= <user>
##$USERA5= <user>
##$V9= 5
##$VALIST= <valist>
##$VCLIST= <CCCCCCCCCCCCCCC>
##$VD= 0
##$VDLIST= <DDDDDDDDDDDDDDD>
##$VPLIST= <PPPPPPPPPPPPPPP>
##$VTLIST= <TTTTTTTTTTTTTTT>
##$WBST= 1024
##$WBSW= 4
##$XGAIN= (0..3)
0 0 0 0 
##$XL= 0
##$YL= 0
##$YMAX_a= 694266
##$YMIN_a= -461867
##$ZGOPTNS= <>
##$ZL1= 120
##$ZL2= 120
##$ZL3= 120
##$ZL4= 120
##$ABSF1= 10
##$ABSF2= 0
##$ABSG= 5
##$ABSL= 3
##$ALPHA= 0
##$AQORDER= 0
##$ASSFAC= 0
##$ASSFACI= 0
##$ASSFACX= 0
##$ASSWID= 0
##$AUNMP= <proc_1d>
##$AZFE= 0.1
##$AZFW= 0.1
##$BCFW= 1
##$BC_mod= 2
##$BYTORDP= 1
##$COROFFS= 0
##$CY= 11.3945322036743
##$DATMOD= 1
##$DC= 2
##$DFILT= <>
##$DTYPP= 0
##$F1P= 2.36226072786647
##$F2P= -0.459571619588291
##$FCOR= 0.5
##$FTSIZE= 0
##$FT_mod= 4
##$GAMMA= 1
##$GB= 0.15
##$INTBC= 1
##$INTSCL= 1
##$ISEN= 128
##$LB= 0.24
##$LEV0= 0
##$LPBIN= 0
##$MAXI= 10000
##$MC2= 0
##$MEAN= 0
##$ME_mod= 0
##$MI= 1.114404
##$NCOEF= 0
##$NC_proc= 0
##$NLEV= 6
##$NOISF1= 3.799351
##$NOISF2= 2.8
##$NSP= 1
##$NTH_PI= 0
##$NZP= 0
##$OFFSET= 15.70392
##$PC= 1
##$PHC0= -18388.73
##$PHC1= 8.200751
##$PH_mod= 1
##$PKNL= yes
##$PPARMOD= 0
##$PSCAL= 0
##$PSIGN= 0
##$REVERSE= no
##$SF= 200.130013532006
##$SI= 16384
##$SIGF1= 3
##$SIGF2= 2
##$SINO= 400
##$SIOLD= 16384
##$SREGLST= <1H.CDCl3>
##$SSB= 0
##$STSI= 0
##$STSR= 0
##$SW_p= 3612.71676300578
##$SYMM= 0
##$S_DEV= 0
##$TDeff= 0
##$TDoff= 0
##$TI= <>
##$TILT= no
##$TM1= 0
##$TM2= 0
##$TOPLEV= 0
##$USERP1= <user>
##$USERP2= <user>
##$USERP3= <user>
##$USERP4= <user>
##$USERP5= <user>
##$WDW= 1
##$XDIM= 8192
##$YMAX_p= 0
##$YMIN_p= 0
$$ End of Bruker specific parameters
$$ ---------------------------------
##NTUPLES= NMR FID
##VAR_NAME=  TIME,          FID/REAL,        FID/IMAG
##SYMBOL=    X,             R,               I
##VAR_TYPE=  INDEPENDENT,   DEPENDENT,       DEPENDENT
##VAR_FORM=  AFFN,          ASDF,            ASDF
##VAR_DIM=   8192,          8192,            8192
##UNITS=     SECONDS,       ARBITRARY UNITS, ARBITRARY UNITS
##FACTOR=    0.0002768,     1,               1
##FIRST=     0,             0,               0
##LAST=      2.2672688,     0,               0
##MIN=       0,             -461867,         0
##MAX=       2.2672688,     694266,          0
$$ Real data points
##PAGE= N=1
##DATA TABLE= (X++(R..R)), XYDATA
0 0 0 0 0 0 0 0 0 0 -1 8 -8 8 -16 16 -17 24 -32 33 -48 50 -64 74 -89 105 -124 145 -169 195 -224 259 -294 334
32 334 -380 434 -487 551 -616 689 -774 862 -958 1068 -1182 1310 -1448 1601 -1765 1948
48 1948 -2144 2364 -2604 2870 -3163 3492 -3857 4273 -4742 5285 -5915 6659 -7548 8650
62 8650 -10034 11849 -14338 17985 -23863 34961 -63460 306738 554498 164038 120883 233873
74 233873 550098 694266 613028 286372 43166 19331 247521 465679 504004 265708 -47367
85 -47367 -213899 -101399 136974 293812 201391 -68423 -325319 -348735 -142308 103992 159645
96 159645 -10739 -277516 -414637 -311846 -50847 138025 97962 -132760 -348648 -371911
106 -371911 -174297 76769 166024 19008 -230129 -369774 -285203 -51326 138542 116242
116 116242 -106509 -332267 -368484 -197513 31920 128875 8377 -230200 -378065 -305068
126 -305068 -78678 110357 113325 -69407 -276232 -316156 -148604 85205 199154 113230 -88489
137 -88489 -227976 -169686 49995 244710 258639 98128 -92760 -149687 -15421 202478 317279
148 317279 232817 28204 -122493 -97003 84505 264595 279724 114602 -89089 -165580 -59518
159 -59518 135967 251747 180001 -24846 -184917 -165902 6608 184152 218841 79856 -115448
170 -115448 -195117 -87790 113010 237902 189428 11172 -142948 -131728 37060 216797
180 216797 259422 137052 -45667 -134927 -50026 139009 261742 211788 37294 -117881 -130027
191 -130027 7725 174341 217614 92589 -96300 -195610 -133675 32019 152764 111902 -61257
202 -61257 -221188 -240312 -113355 49532 106131 395 -183296 -282966 -216131 -46541 83091
213 83091 66199 -83718 -236631 -256123 -121674 52410 121993 36059 -128831 -228009 -166476
224 -166476 5671 142349 134884 -1549 -146900 -175348 -55257 116379 191618 109660 -48897
235 -48897 -147406 -102723 51405 186677 187373 54441 -93161 -128278 -23548 134456 213331
246 213331 141575 -17287 -122090 -86694 55144 184752 193993 70039 -84032 -131198 -32950
257 -32950 118974 196062 133403 -20668 -136773 -115684 21686 152586 163152 44759 -107138
268 -107138 -166370 -80460 71603 153125 95424 -51534 -167163 -157344 -29004 107355 128787
279 128787 16740 -128086 -185643 -110182 35857 128449 86754 -52221 -165975 -157889 -36134
290 -36134 97984 133500 37805 -104797 -165654 -94984 46207 142000 114682 -13995 -133478
301 -133478 -134915 -15637 119329 158192 72924 -65880 -137523 -77443 64309 165171 141086
312 141086 16467 -104064 -117472 -6784 131680 175940 92337 -44904 -121672 -74099 59900
323 59900 166042 148423 22794 -99745 -119136 -22745 108183 159990 84091 -54720 -138473
334 -138473 -99767 23772 126180 118396 1021 -126129 -153712 -64334 60764 115268 52577
345 52577 -79377 -170191 -139748 -16229 89142 87478 -18127 -140512 -175272 -90425 41049
356 41049 105184 48716 -76533 -164331 -139018 -16452 98650 106220 5942 -111771 -146546
367 -146546 -67403 63979 138780 91521 -32751 -120756 -97007 17594 131343 148885 56034
378 56034 -64392 -105881 -34019 89766 162517 123810 3396 -93410 -81059 24999 131318
389 131318 149782 64361 -56961 -111331 -51345 68467 140448 104032 -10036 -108238 -108319 -9332
401 -9332 100747 126024 44908 -73136 -129746 -77465 42228 124016 95645 -15842 -113124
412 -113124 -116392 -23198 89608 125601 50661 -70671 -131041 -82339 31335 114897 96093
423 96093 -11938 -116265 -127532 -38930 71051 110211 44689 -73182 -141655 -99004 13947
434 13947 98984 88507 -7313 -108288 -126358 -41478 74840 121993 64694 -42958 -110119
445 -110119 -75597 35245 128662 125602 33033 -68390 -92441 -17805 95073 147082 89735
456 89735 -25315 -100363 -77260 21783 110578 109208 12024 -101538 -135431 -67880 37569 88842
468 88842 37729 -77406 -159080 -139509 -39226 53946 62376 -21181 -126476 -160081 -88412 26590
480 26590 89654 54691 -43197 -117521 -99235 3495 107641 126538 51981 -45565 -81226 -20503
492 -20503 90458 156913 124400 23199 -58372 -52707 34613 130261 148961 69603 -38949 -85471
504 -85471 -37598 60424 124066 93682 -10536 -101699 -102435 -17851 75935 98976 29020 -76753
516 -76753 -127496 -79234 23852 94327 74319 -18462 -105461 -109276 -23523 76605 106277 45060
528 45060 -53301 -106676 -67915 31999 106688 90452 -1052 -88350 -101178 -29079 66579 100362
540 100362 42319 -57946 -116652 -86781 4849 80874 73507 -13242 -102760 -117331 -47893 47509
552 47509 91213 45893 -49799 -110662 -80474 15987 96718 98714 21712 -67080 -87154 -18805
564 -18805 79772 126036 83543 -10787 -77651 -58146 32471 112500 112022 32686 -60021 -91884
576 -91884 -37644 55115 101542 58226 -39552 -110556 -99547 -19092 61211 67953 -6648 -98038
588 -98038 -131193 -79169 12978 68365 38748 -50783 -120104 -106586 -22998 62137 81510 20508
600 20508 -66786 -101155 -47324 49609 109834 86726 3034 -68490 -61681 20216 106639 125819
612 125819 63852 -26217 -68694 -25793 66993 126121 99910 12431 -63975 -67685 3177 87397
624 87397 109102 47065 -45992 -91706 -55557 30432 92357 73663 -10665 -87222 -92998 -26027
636 -26027 56943 86025 33858 -56063 -104200 -69892 14465 77716 66940 -9377 -87023 -98830
648 -98830 -33890 50357 81144 33295 -52764 -105118 -77680 6174 72003 64064 -9283 -86929
660 -86929 -103193 -42673 44025 80662 35947 -48433 -100013 -76054 5229 76658 76824 6587
672 6587 -70720 -87146 -29583 54833 97266 60434 -21601 -76367 -56419 19946 89686 95295
684 95295 31346 -48461 -73061 -21205 58583 100023 68340 -11164 -71949 -61949 9943 79187
696 79187 85644 24725 -54451 -85108 -40767 39395 84032 55409 -21497 -83397 -77500 -8738
708 -8738 64958 77752 18271 -59808 -90969 -50198 28977 79950 57505 -18715 -82372 -78397
720 -78397 -11765 61341 79814 26621 -52740 -87401 -49403 27816 79895 63848 -7163 -73205
732 -73205 -74755 -10353 63043 84113 37312 -37777 -77393 -46022 30401 85698 73144 5335
744 5335 -60601 -68575 -9833 64458 89225 43626 -31224 -74222 -48930 23602 81295 71650 1774
757 1774 -66411 -76704 -23040 49408 78183 35929 -41755 -87939 -64028 7122 64984 60250
769 60250 -5022 -74691 -88273 -34773 37799 68818 33268 -40049 -88623 -68654 2884 62459
781 62459 61345 1903 -65314 -83051 -34724 38722 74014 41489 -28603 -77080 -62879 4418
793 4418 66937 69938 12912 -53199 -73647 -30370 41575 81420 53284 -17368 -67590 -54824
805 -54824 8808 71182 79806 25658 -43295 -66683 -25369 45509 86025 62178 -6978 -61407
817 -61407 -53015 9328 71299 81292 31211 -38151 -66930 -30319 40326 81709 59818 -5956
829 -5956 -61153 -59289 -1464 61425 75200 27360 -40384 -71787 -41038 26045 71188 53884
841 53884 -10426 -66110 -67819 -14990 47634 66494 22666 -46105 -79781 -50699 14149 60482
853 60482 48251 -13689 -71512 -75833 -23019 40993 61937 22829 -44612 -81593 -54424 11832
865 11832 60123 51513 -6425 -65080 -73574 -23232 43248 66667 29399 -35515 -73857 -53074
877 -53074 10196 61226 55700 -803 -59570 -71351 -26798 37057 65158 31652 -33026 -72646
889 -72646 -55437 3650 56379 56814 4246 -55080 -68895 -24969 38121 69332 42715 -18779
901 -18779 -60682 -45547 14945 69162 72840 24628 -34806 -52138 -10826 53362 85720 60482
913 60482 45 -45102 -35443 21554 76896 80901 31601 -28612 -50067 -15696 45101 79541
925 79541 55923 -5220 -52549 -47863 3496 57497 66445 20364 -40838 -65149 -34919 22715
937 22715 59166 41930 -16529 -66115 -64541 -14735 38306 50491 10187 -49958 -78418 -51081
949 -51081 7137 45386 31341 -23948 -74184 -76705 -28038 28051 42420 4704 -52977 -82798
961 -82798 -58273 802 43344 32845 -20741 -69116 -72168 -25833 31804 52132 18354 -38361
973 -38361 -68268 -45180 12245 57227 52492 2369 -47239 -52257 -8856 47031 70594 41630
985 41630 -14441 -48536 -28896 26316 70470 67672 21002 -30851 -41475 -1900 53557 77862
997 77862 50648 -4775 -42158 -28770 24735 70685 68692 22122 -30412 -45259 -9599 45838
1009 45838 72741 45822 -11102 -49571 -38887 11218 57884 59507 13188 -40861 -57797 -24835
1021 -24835 29098 57576 34877 -21399 -62017 -53706 -5267 40685 46240 4849 -49146 -69657
1033 -69657 -38676 15485 45317 26878 -24936 -66619 -62078 -15100 33462 41519 3216 -48318
1045 -48318 -70259 -42493 11707 45239 28827 -20751 -61963 -59163 -14019 35824 47990 11182
1057 11182 -40827 -62528 -35972 16956 52369 39599 -9750 -52074 -50458 -6659 42929 56968
1069 56968 23279 -29015 -52930 -28382 23570 58815 49005 2526 -41098 -43497 -1732 47609
1081 47609 62777 32184 -17967 -44865 -24893 25375 62126 54628 10190 -33578 -39823 -2446
1093 -2446 46997 64868 35102 -14748 -43344 -27473 19794 57560 52472 7971 -38218 -46230
1105 -46230 -11206 35897 55247 28102 -23173 -54286 -39808 6144 44120 41566 -991 -47784
1117 -47784 -58283 -23739 24012 45184 21585 -26769 -59553 -47655 -1150 39235 39457 339
1129 339 -44695 -57771 -26376 22607 46601 26122 -20371 -53829 -45443 -1963 40148 43671 5840
1142 5840 -39623 -54271 -26417 21041 47751 30486 -16342 -51735 -44277 -1872 40071 46649
1154 46649 11267 -34592 -51116 -23242 24534 52630 37859 -7443 -43711 -38424 4530 47393
1166 47393 54500 21735 -23729 -42888 -18507 29370 58414 44287 -388 -37714 -36533 2114
1178 2114 44959 54285 21890 -24299 -46039 -26074 19036 49619 38767 -5868 -43962 -45612
1190 -45612 -10111 32224 44678 16077 -30369 -53815 -34816 9691 41277 33763 -7302 -46837
1202 -46837 -50098 -14269 29009 43691 17701 -27138 -52189 -34703 10426 43547 37572 -1438
1214 -1438 -40604 -46213 -12578 31924 48406 23484 -20627 -46247 -32003 10645 45121 41839
1226 41839 3505 -36098 -43816 -13790 29458 48646 26452 -17794 -45503 -33555 6475 41511
1238 41511 41473 5645 -35081 -45241 -16507 26145 46344 27520 -14876 -44669 -34867 5114 40735
1251 40735 42407 8842 -31868 -44170 -17076 26512 48057 29988 -11628 -41855 -34878 4022
1263 4022 41149 44205 10327 -30597 -43961 -19270 23023 46265 29667 -11661 -42780 -37618
1275 -37618 -611 36239 42348 10937 -30223 -45413 -22492 18388 43433 31028 -8482 -41270
1287 -41270 -38429 -2816 34550 42102 13969 -27031 -45248 -24513 16336 41880 30780 -7799
1299 -7799 -41325 -41754 -8008 30204 39174 11334 -28934 -48068 -30071 10481 38131 29245 -8470
1312 -8470 -42172 -42882 -10307 28766 41332 15976 -23627 -43253 -25869 13705 43284 38350 2440
1325 2440 -32297 -34968 -3667 34669 48690 26364 -13063 -36081 -22019 16213 45532 41068
1337 41068 6817 -28922 -35928 -7794 30122 44268 23341 -15420 -40080 -29459 7270 38065
1349 38065 35246 1622 -33820 -41487 -15592 22695 39595 19826 -18922 -43949 -33708 1661
1361 1661 33287 32848 479 -36050 -45034 -20198 17698 35661 18662 -19678 -46268 -37593 -2780
1374 -2780 28912 31184 2025 -34015 -45128 -21433 17296 37775 24204 -11239 -37758 -31723
1386 -31723 3210 37318 42204 15872 -18796 -31627 -10721 27519 50297 37816 2490 -25672
1398 -25672 -22734 8546 41897 47643 20106 -17370 -33131 -14860 20131 42002 29972 -7023
1410 -7023 -37656 -36991 -6961 25168 31985 5819 -31104 -48388 -30734 5121 28507 19707 -13791
1423 -13791 -43422 -43453 -12899 22066 32069 9958 -24614 -41781 -25688 10895 36545 30414 -559
1436 -559 -30487 -32799 -5336 29596 41518 20209 -15607 -34720 -22107 11800 38030 33325 1460
1449 1460 -30125 -34900 -9157 24432 37361 17941 -17891 -38857 -26437 7482 34217 31648
1461 31648 1426 -30015 -35298 -9317 25379 39111 21543 -12579 -33504 -23165 10355 37964
1473 37964 36286 7320 -24473 -32266 -9397 24411 39591 22146 -11848 -34611 -27754 2648
1485 2648 30360 30488 2228 -30056 -39352 -18402 14215 31048 17468 -15822 -39658 -33091 -2460
1498 -2460 26556 30153 5315 -26331 -36237 -15024 18701 37587 26191 -5250 -29223 -23994 6114
1511 6114 36017 39728 15122 -16712 -29044 -10947 21776 40323 28288 -4254 -30149 -28624
1523 -28624 -1743 27018 31360 6913 -25974 -40233 -25437 5776 26083 17048 -14035 -40619
1535 -40619 -39830 -12976 16604 24991 4652 -26773 -41102 -25646 6880 29376 24304 -3883 -29907
1548 -29907 -30128 -2960 27986 37875 19268 -11888 -27873 -14306 17510 40522 34659 5960 -21265
1561 -21265 -24253 -57 30332 39805 20233 -11687 -29643 -18725 11276 34273 29869 1178
1573 1178 -26855 -31154 -8510 21067 32848 16415 -15077 -33961 -24003 5296 29339 27951 1744
1586 1744 -26637 -32660 -11254 18727 32335 17502 -12918 -33145 -25588 3170 27865 27372 2195
1599 2195 -26432 -34361 -14682 15422 29486 15728 -14561 -35010 -29085 -1467 24247 25294 825
1612 825 -27344 -36074 -17245 12822 28751 16664 -12857 -33649 -27926 -889 24893 28388 5990
1625 5990 -22260 -31857 -14055 15657 32669 23244 -4632 -26690 -22919 3264 29472 34341 14065
1638 14065 -14120 -25720 -10381 19087 37075 28315 940 -21542 -21154 3075 29812 35347 14941
1651 14941 -13838 -27087 -14030 13451 32279 24179 -3368 -27406 -28303 -6088 20136 27373 8261
1664 8261 -20955 -34927 -22948 4505 24019 18757 -7053 -31363 -33059 -10804 16111 25308 9568
1677 9568 -18409 -33888 -23018 4683 25515 22417 -1452 -26055 -30281 -9627 18141 28424
1689 28424 13640 -13712 -30362 -22718 4062 25996 24274 603 -24186 -29401 -10414 17219
1701 17219 29606 16038 -10925 -27670 -19814 6401 29519 29767 7166 -17702 -23239 -4345 22940
1714 22940 36512 24554 -2380 -20889 -14867 10366 32802 33748 11873 -14388 -23221 -7344 18644
1727 18644 31969 20354 -6793 -27377 -24461 -1735 21200 22847 2217 -24253 -34457 -20664
1739 -20664 5747 20885 11682 -14060 -34280 -31418 -8577 15705 20683 2187 -22966 -32884 -18402
1752 -18402 8322 25137 18690 -5759 -26354 -24164 -1194 22806 28842 11851 -13745 -25268
1764 -25268 -12523 13383 30650 24499 576 -21081 -21558 -846 23442 29861 13164 -12111 -25496
1777 -25496 -15556 9610 27454 22653 -633 -22716 -25506 -6711 17469 26081 11048 -14472 -29230
1790 -29230 -20166 3826 22536 20101 -2224 -24721 -28252 -9916 14550 24420 11719 -12959 -27901
1803 -27901 -19737 4733 24582 23931 3193 -18831 -23082 -5225 20014 31138 19482 -4481 -19764
1816 -19764 -12888 10201 30829 30748 10348 -12379 -18431 -2951 20783 32863 21189 -3611 -20850
1829 -20850 -16941 3995 24119 24469 4464 -19876 -28116 -14585 8483 20673 10718 -13479 -32089
1842 -32089 -29308 -8286 12151 14780 -3112 -26532 -35106 -21596 2452 16094 8462 -13930 -31511
1855 -31511 -28981 -7625 14280 18194 1458 -20502 -29223 -16306 8042 23105 16590 -5320 -23027
1868 -23027 -21138 -1119 21152 26794 11237 -10956 -20492 -8884 14252 30321 25666 4585 -14065
1881 -14065 -13892 5142 27415 34245 20125 -2435 -13884 -3927 18696 34570 30651 9900 -10157
1894 -10157 -12500 4701 25601 32105 17893 -5991 -19414 -12443 8520 23960 19392 -2135 -23138
1907 -23138 -27175 -12039 8292 15361 1656 -21356 -35222 -28519 -8193 9088 7105 -11893 -31727
1920 -31727 -35272 -18829 3450 13685 3913 -16838 -29757 -22611 -600 18413 19695 2877 -16214
1933 -16214 -20421 -5073 17146 28381 19614 -1125 -16093 -11723 8291 26639 27089 9775 -11178
1946 -11178 -18343 -5942 14622 25741 16274 -5641 -21507 -18933 -159 17920 19633 2920 -18072
1959 -18072 -25068 -13036 8242 20501 12923 -6936 -22720 -20074 -1077 18027 21992 6809 -13450
1972 -13450 -21101 -9675 11583 24668 18601 -1076 -18054 -17522 446 19315 23572 9171 -11741
1985 -11741 -21700 -12000 8304 21842 16572 -3147 -20092 -20525 -3835 15705 21227 7918 -12352
1998 -12352 -22185 -12856 7722 22159 18461 -118 -17313 -17824 -1437 18184 24016 11629 -8745
2011 -8745 -18933 -11198 8558 22238 18935 364 -17845 -19740 -4952 13902 19924 7792 -12262
2024 -12262 -24163 -17522 1563 16122 13616 -3698 -21568 -24437 -10311 9411 17144 6879 -12513
2037 -12513 -24307 -18142 816 16829 16615 368 -16944 -20854 -7261 11935 21188 12458 -6537
2050 -6537 -19050 -14062 4285 20175 20598 5344 -12943 -17812 -4914 14055 23111 15273 -3446
2063 -3446 -16842 -13658 4057 20075 21159 6307 -11610 -18069 -7232 11579 21375 14087 -3975
2076 -3975 -18412 -16961 -897 15910 18035 3777 -14818 -22379 -12775 5492 16679 10774 -7066
2089 -7066 -21808 -21222 -5783 11668 15780 3470 -14908 -22754 -13390 5118 17610 13791 -2854
2102 -2854 -17558 -17191 -1782 15790 20498 9146 -8342 -17337 -9078 9095 21630 17705 1405
2115 1405 -13712 -15055 -892 16263 21759 10194 -7667 -17316 -10607 6528 19735 17152 1316
2128 1316 -14543 -16323 -3083 14231 20982 11436 -6329 -16824 -10815 6436 20333 19358 3974
2141 3974 -12329 -15357 -2873 14203 21482 12588 -5360 -16857 -12414 3830 16894 15767 549
2154 549 -16417 -21017 -9698 6845 13846 4972 -12702 -24848 -21174 -5529 8407 8527 -5700
2167 -5700 -21533 -26118 -15285 2299 11035 4513 -11684 -22775 -19436 -3212 12162 14445 2294
2180 2294 -13422 -18056 -7039 10351 20602 15323 -198 -12655 -9995 5031 20097 22808 10954
2193 10954 -5387 -11839 -3218 13404 23255 17757 1671 -11738 -11336 2542 17428 19667 7622
2206 7622 -8672 -16213 -8344 7660 17967 13206 -2558 -15807 -15387 -2381 12810 16542 5771
2219 5771 -10132 -17943 -10479 5566 16372 13245 -1722 -15306 -15780 -3118 12085 17047 7086
2232 7086 -9030 -17806 -11102 4562 15649 13606 -657 -14827 -16605 -4534 10889 16414 7344
2245 7344 -8352 -17290 -11844 3615 15820 14430 638 -13023 -15152 -3763 11557 17962 9663
2258 9663 -5867 -14833 -10127 4683 16583 16071 2584 -11873 -15119 -4679 9848 16434 8616
2271 8616 -7283 -17764 -14618 -551 11542 11325 -1634 -16476 -21289 -11563 3112 10703 4160
2284 4160 -11014 -21919 -19295 -5273 8075 9270 -2305 -16296 -20966 -11399 4186 13329 8062
2297 8062 -5931 -16119 -13547 427 14515 17137 6678 -7442 -11898 -2739 12443 21794 17256
2310 17256 3417 -7504 -5896 6976 20365 23046 12667 -1542 -8088 -646 13559 22418 17966
2323 17966 3592 -8578 -8727 2840 15515 18144 7838 -7108 -14434 -8740 4804 14179 10642
2336 10642 -3391 -15930 -16756 -5946 7371 11664 2281 -12065 -19064 -13476 553 10739 9032
2349 9032 -3970 -15870 -16755 -5626 8213 13121 5144 -8744 -16268 -10992 2896 13274 11738
2362 11738 -450 -13150 -14870 -4632 8780 13641 5951 -7586 -16106 -12112 1109 11844 10969
2375 10969 -1068 -13741 -16404 -6667 7087 13068 6443 -6921 -15819 -11860 1008 12874 12816 1543
2389 1543 -11066 -14079 -5072 8440 15088 9393 -4119 -13647 -10717 1739 12676 13282 2508 -10473
2403 -10473 -14820 -6495 6867 13525 7932 -5170 -14920 -12476 -437 11293 12388 2590 -9884
2416 -9884 -14167 -5618 7802 15832 11655 -697 -10011 -8152 3668 16116 18700 9315 -3496 -8211
2430 -8211 -1205 11773 20016 16284 3138 -7504 -7107 3468 14698 17436 7861 -5703 -12328 -6503
2444 -6503 5363 13387 9553 -2960 -14222 -15250 -4732 6538 9778 1145 -11857 -18339 -12830
2457 -12830 -291 8490 5794 -5916 -16370 -17109 -6807 5349 9192 2018 -10575 -16846 -12178
2470 -12178 429 9676 8187 -2507 -13485 -14633 -5705 7057 11810 5164 -7175 -14449 -9903
2483 -9903 2193 12091 11630 1197 -9476 -11437 -2333 10106 15698 10011 -1842 -9732 -5946 5638
2497 5638 15955 15547 5423 -5903 -8436 -400 11178 16871 10804 -1380 -9739 -7134 3625 13389
2511 13389 12939 3058 -9057 -12400 -5081 6122 11866 6425 -5719 -14290 -12630 -2000 8177 9289
2525 9289 -110 -11544 -15638 -8836 2907 10094 6104 -5286 -14031 -12856 -2514 8516 10615 2333
2539 2333 -9004 -13702 -7351 4683 12275 8552 -2168 -11577 -10824 -710 10512 12683 4823 -6724
2553 -6724 -11639 -5730 6165 13611 10820 351 -9352 -8746 916 11539 14720 7483 -3594 -9101
2567 -9101 -3970 7188 15356 13189 2618 -7185 -7861 522 11395 14693 8000 -3715 -10416 -6740
2581 -6740 4019 11887 10006 -294 -10909 -12953 -5134 5225 9097 2607 -8870 -15964 -12425 -2149
2595 -2149 6291 5547 -4173 -14068 -15986 -8223 3176 7968 2636 -7969 -14522 -10844 -51 9171
2609 9171 9424 485 -9472 -11297 -3578 7257 12297 7846 -2648 -9928 -7489 2397 11506 11720 3238
2624 3238 -7114 -10746 -4051 6349 12058 7392 -3295 -11317 -9650 -32 9322 10568 2391 -7909
2638 -7909 -11653 -5078 5418 11903 8467 -1663 -9444 -8050 1651 11093 13022 5595 -4530 -8342
2652 -8342 -2450 7919 14075 11045 959 -7356 -6760 1997 11286 13077 5581 -4853 -9556 -4960
2666 -4960 5044 11432 8554 -1246 -10059 -10156 -2101 7372 9969 3402 -6667 -12041 -7679 2640 9808
2681 9808 7978 -1334 -9883 -10544 -2686 7220 10451 4325 -5730 -11612 -7741 1943 9344 7752 -1376
2696 -1376 -10641 -12102 -4811 4479 8121 2109 -7972 -14151 -10957 -1472 5829 4597 -3839 -12707 -14274
2711 -14274 -7167 2804 7090 2232 -7355 -13042 -9919 187 8350 8847 1110 -7650 -9259 -2233 7987
2726 7987 13097 9093 -210 -6296 -3982 5376 13707 14384 6661 -2410 -4876 792 10744 15221 11370
2741 11370 1373 -5608 -4336 4168 12068 12735 4911 -5075 -8716 -3173 5734 10566 6928 -2743 -9977
2756 -9977 -9128 -1268 6730 7799 833 -8801 -12274 -7154 2133 7401 4386 -4421 -11695 -11229 -3214
2771 -3214 5258 7442 670 -8319 -12302 -7996 1285 7304 5128 -3416 -11099 -10998 -3515 5312 7700
2786 7700 1562 -7467 -11891 -7647 1621 8102 6655 -1731 -9145 -9647 -2062 7088 10026 4873 -3791
2801 -3791 -8332 -4258 4519 11746 10791 2778 -4725 -5616 1330 10211 13221 8529 -700 -5787 -2900
2816 -2900 5549 12097 11057 2958 -5104 -7153 -1204 7087 10461 5448 -3812 -9776 -7929 381 7067
2831 7067 6556 -953 -9177 -11529 -5521 2940 7089 3101 -5397 -11269 -9441 -1017 6242 6857 194
2846 194 -7767 -10417 -4925 3894 8605 4927 -3618 -9438 -8183 -407 6886 7717 1225 -7141 -10060
2861 -10060 -5017 3292 8085 5114 -3002 -9729 -8641 -1242 6504 7736 2100 -6295 -9417 -4651 4040
2876 4040 9415 7282 -574 -7254 -6652 872 8850 10633 5246 -3346 -6832 -2997 5456 10987 8896
2891 8896 1205 -6131 -5839 483 8159 10187 4498 -3905 -8219 -4512 3367 8685 6928 -632 -7676
2906 -7676 -8143 -1902 5632 8028 3171 -4948 -9158 -5885 1996 8010 6703 -214 -7359 -7988 -1994
2921 -1994 5973 8902 4408 -3571 -8123 -5772 1946 7784 7339 129 -7034 -8655 -3245 4629 7625
2936 7625 3424 -4393 -9900 -7799 -481 6049 5605 -973 -8424 -10464 -5361 2868 6586 2932 -4865
2951 -4865 -10060 -8193 -832 6243 6508 448 -6791 -8642 -3330 4779 8860 5863 -1374 -6676 -5305
2966 -5305 2169 8953 9486 3683 -3668 -6132 -1659 6060 10180 7749 -161 -5819 -5092 1413 8413
2981 8413 9317 3634 -4070 -6888 -3187 4430 8990 6643 -544 -6986 -6480 197 7287 8374 3078
2996 3078 -4313 -7626 -3850 3379 8312 6178 -948 -7315 -7128 -1422 5369 7303 2361 -5175 -9010
3011 -9010 -6161 798 5627 4129 -2975 -9319 -9961 -4539 2444 4762 310 -7095 -10886 -8030 -576
3026 -576 5079 4256 -2119 -8292 -8517 -2665 4668 7677 3924 -2735 -6830 -4014 3413 9232 9230 3247
3042 3247 -3341 -4203 866 8198 11087 7409 204 -4516 -2972 3815 9441 8616 2719 -4042 -5900
3057 -5900 -1538 4903 7882 4507 -2842 -7540 -6136 2 5681 5673 143 -6499 -8784 -4240 2926 6376
3073 6376 3747 -3289 -8048 -6689 -333 5876 6527 1054 -5559 -7691 -3702 3145 7264 4652 -2146
3088 -2146 -7536 -6668 -626 5241 6411 1620 -5708 -8428 -4449 2178 6266 4198 -2633 -8052 -7413
3103 -7413 -1562 4681 5821 1360 -5074 -8025 -4579 2335 7047 5328 -1212 -6467 -6307 -314 5911
3118 5911 7775 3422 -3159 -6352 -3354 3404 7900 6513 259 -5613 -5833 -369 5890 7875 3536
3133 3536 -3529 -7023 -4438 2088 6904 6007 -123 -5792 -6935 -1750 4831 7221 3502 -3004 -6740
3148 -6740 -4305 2139 7161 6648 1247 -4549 -5315 -661 5748 8677 5071 -1438 -5046 -3491 2541
3163 2541 7391 7250 1419 -4327 -5914 -1856 4267 6817 3608 -3134 -7613 -6203 -646 4577 4307
3178 4307 -959 -7145 -9231 -5211 1199 4483 1856 -4441 -9092 -7630 -1752 3834 4764 103 -5741
3193 -5741 -7518 -3737 2593 6508 4281 -1289 -5830 -5112 604 6181 7121 2364 -3256 -5761 -2492
3208 -2492 3731 7271 5362 -722 -5383 -5347 -241 5203 6628 2171 -3789 -6695 -3593 2545 6640
3223 6640 4936 -736 -5728 -5536 -742 5286 6540 2856 -3060 -6124 -3368 2421 6976 5771 106
3238 106 -5334 -5472 -772 4944 6457 2915 -3173 -6478 -4026 1577 5929 4868 -466 -5658 -6347 -1705
3254 -1705 4080 6014 2935 -2737 -6394 -3850 2107 6344 5937 687 -4139 -5234 -955 5045 7370
3269 7370 4148 -1688 -5019 -3768 2037 6504 5930 1279 -4166 -5760 -2006 3650 5847 2825 -2849
3284 -2849 -7118 -5505 -316 4575 4269 -151 -5740 -7770 -3941 1694 4468 2356 -3021 -6920 -5934
3299 -5934 -575 4320 5038 803 -4750 -6430 -2840 2681 6079 3661 -1531 -5332 -4896 95 5126
3314 5126 5605 1776 -3857 -6093 -3073 2547 5798 3988 -1427 -5550 -5571 -333 4712 5696 1619 -3812
3330 -3812 -5869 -3085 2243 5996 4777 -361 -4837 -4826 -91 5483 6486 3234 -2385 -4686 -2555
3345 -2555 2915 6642 5711 687 -3983 -4279 -64 5018 6363 3294 -2251 -4940 -3121 2027 5725
3360 5725 5057 7 -4920 -5239 -1559 3432 5546 2500 -3105 -5909 -4132 925 4804 4356 142 -4690
3376 -4690 -5509 -1943 3375 5360 2954 -2500 -5860 -4458 643 4865 4739 419 -4512 -5871 -2468
3391 -2468 2812 5196 2780 -2087 -5790 -4664 -177 3986 4133 149 -4943 -6104 -3278 2205 4497
3406 4497 2407 -2261 -6201 -4886 -314 3987 4737 1004 -3988 -5435 -2511 2919 5796 4096 -851
3421 -851 -4335 -3633 806 5421 6126 2621 -2478 -4186 -1794 3309 6189 5038 -7 -4180 -4157 -328
3437 -328 4361 5334 1837 -3242 -5499 -3279 1371 4622 3298 -1309 -5825 -5712 -1682 2818 4491 1331
3453 1331 -3628 -5934 -3718 972 4618 3950 -251 -4283 -4657 -461 4052 5798 3044 -1603 -4237
3468 -4237 -2553 2354 5699 5309 1208 -3297 -4255 -428 4021 5733 3170 -2131 -5124 -3646 730
3483 730 4395 4109 -322 -4834 -5833 -2615 2013 4001 1510 -3260 -6331 -4931 -424 3289 3814 -164
3499 -164 -4700 -5574 -2276 2655 4885 2806 -1343 -4357 -3208 842 5097 5441 1989 -2447 -3775 -960
3515 -960 3731 6158 4309 -353 -3536 -3053 976 4657 5149 1895 -2892 -4684 -2616 2197 4739 3056
3531 3056 -1413 -5193 -5124 -879 3322 3988 452 -3625 -5580 -3370 1317 4232 2998 -1199 -4622 -4633
3547 -4633 -726 3335 4461 1277 -3061 -5112 -2942 1577 4131 3312 -814 -4884 -4679 -1495 2580
3562 2580 3547 825 -3504 -5619 -3670 285 3670 2966 -847 -4531 -4897 -1420 3227 4790 2532 -1637
3578 -1637 -3723 -2013 2432 6298 5745 2281 -1842 -2300 1032 5489 7381 4843 666 -2072 -1352 2741
3594 2741 5996 5739 1753 -2321 -3704 -1152 2798 4497 1929 -2632 -5678 -5078 -1345 2150 2027 -1799
3610 -1799 -5422 -6754 -3997 32 2307 629 -3211 -6148 -5160 -1084 2565 3291 297 -3484 -4626
3625 -4626 -2135 2257 4670 3359 -277 -3693 -3071 624 4382 5182 2164 -2005 -3718 -1516 2615
3640 2615 4889 3522 -682 -3820 -3576 -69 3392 4344 1367 -2569 -4474 -2393 1431 4212 3102
3655 3102 -739 -3911 -3890 -708 3146 4232 1509 -2520 -4431 -2564 1174 4087 3060 -495 -3909
3670 -3909 -4152 -1094 2874 4209 1541 -2412 -4710 -2724 1200 4061 3244 -217 -3585 -4036 -815 2945
3686 2945 4524 2344 -1465 -3532 -2293 1425 4582 4362 1135 -2577 -3112 -641 3389 4734 3126
3701 3126 -941 -3557 -2441 1054 4234 4020 702 -2839 -3761 -1665 1994 3990 2049 -1783 -4257
3716 -4257 -3734 -165 2828 3079 116 -3752 -4881 -2538 1220 3285 1636 -1812 -5027 -4108 -692 2582
3732 2582 3060 233 -3432 -4921 -2337 1443 3642 2248 -1245 -4073 -3492 -278 3348 4150 1505 -1728
3748 -1728 -3596 -1393 2341 4824 3746 282 -2531 -2365 737 3965 4867 2297 -944 -2818 -1170
3763 -1170 2252 4622 3834 459 -2699 -3044 -436 2958 4008 1408 -2159 -4152 -2656 333 3000
3778 3000 2376 -898 -4285 -4510 -1982 1477 2731 695 -2855 -4911 -3731 -480 2541 2271 -766 -3884
3794 -3884 -4279 -1706 1694 3190 1614 -1723 -3657 -2292 766 3745 3840 1003 -2311 -3149 -465 2775
3810 2775 4172 2887 -733 -2863 -2291 876 3732 3554 1321 -2295 -3255 -1029 2328 3943 2704 -815
3826 -815 -3273 -2930 368 3345 3745 1148 -2312 -3374 -1239 1951 3918 2673 -534 -3255 -2881 193
3842 193 3160 3754 1221 -2198 -3356 -1701 1546 3390 2609 -727 -3727 -3455 -909 2158 2759 695
3858 695 -2460 -4262 -2737 314 2431 1846 -1139 -3863 -3992 -1120 1933 2813 802 -2444 -3876 -2499
3874 -2499 834 3116 2879 -240 -2875 -3087 -868 2512 3856 1791 -1125 -3189 -1757 1125 3770
3889 3770 3156 503 -2316 -2491 -407 2436 3967 2178 -1069 -2926 -2246 645 3246 2955 428 -2134
3905 -2134 -2931 -778 1987 3367 1746 -1150 -3377 -2434 214 2871 2812 109 -2926 -3730 -1608 1413
3921 1413 2759 1679 -1305 -3562 -2894 -256 2544 2989 536 -2220 -3022 -1425 1645 3427 2597 -439
3937 -439 -2598 -2457 314 3236 3548 1435 -1525 -2478 -1235 1713 3671 2381 -409 -2619 -2519 -314
3953 -314 2430 2744 1009 -1928 -3501 -2231 408 2704 1952 -868 -3225 -3038 -890 1874 3028 1144
3969 1144 -1790 -3293 -1838 745 3080 2485 -18 -2669 -2727 -509 1995 2960 1094 -1752 -3345 -2655
3985 -2655 208 2490 1995 -378 -3410 -3717 -1473 987 2188 911 -1818 -3308 -2679 220 2718 2232
4001 2232 385 -1933 -2497 -582 2238 4195 2699 189 -1703 -910 1837 4086 4057 2019 -674 -1502
4017 -1502 102 2596 3901 2706 -35 -2135 -1974 311 2088 2345 425 -2750 -3790 -2387 398
4032 398 1636 776 -2007 -4087 -3911 -1498 1056 1424 -627 -2829 -3971 -2485 326 2171 1788 -695
4048 -695 -2663 -2294 -129 2443 3189 1492 -1055 -2098 -691 1680 3689 3245 541 -1763 -1665 218
4064 218 2990 3387 1749 -1021 -2536 -1205 1316 3140 2607 82 -2238 -2508 -604 2114 2834 1395
4080 1395 -1419 -2833 -1926 647 2392 2237 -65 -2428 -2979 -1016 1546 2479 1238 -1577 -2936 -2172
4096 -2172 91 2242 2037 -411 -2770 -2974 -1364 1087 2079 938 -1701 -3348 -2732 -439 2100 1806
4112 1806 -53 -2367 -2887 -1139 1230 2615 1642 -692 -2353 -1934 698 2584 3292 1200 -886 -1574
4128 -1574 -123 2401 3832 2883 488 -1578 -1006 1035 3183 3322 1541 -989 -2112 -783 1547 2917
4144 2917 1941 -263 -2505 -2145 -487 1694 2156 302 -2097 -3094 -2258 57 1645 910 -1321 -3192
4160 -3192 -3148 -1198 1030 1536 143 -1941 -3333 -1959 448 2093 1480 -694 -2341 -2769 -470 1744
4176 1744 2416 1486 -1069 -2213 -1105 813 2718 2424 303 -1681 -1954 -156 1966 2887 1639 -626
4192 -626 -2136 -1616 931 2379 2401 187 -2086 -2148 -394 1391 2413 1203 -990 -2499 -1772 240 1713
4209 1713 1966 245 -1888 -2582 -1093 1169 2230 1048 -783 -2221 -1878 83 1979 2130 428 -1840
4225 -1840 -2117 -799 1288 2634 1699 -444 -1827 -1758 135 2269 2359 1050 -1456 -2095 -981 1200 2464
4242 2464 1609 -198 -1837 -2198 -116 1816 1993 885 -1384 -2215 -999 1193 2307 1749 -81 -1978
4258 -1978 -1797 -190 1893 2340 878 -1239 -2230 -1345 781 2301 1785 -248 -2340 -2234 -824 1296
4274 1296 1656 241 -1998 -3116 -2026 -114 1441 748 -972 -2588 -3007 -1379 705 1318 156 -1373
4290 -1373 -2473 -1797 311 2125 2037 176 -1601 -1793 -102 1876 2926 1795 -157 -1453 -653 1119
4306 1119 2685 2597 960 -694 -1115 -16 2097 2946 2004 -93 -1397 -968 681 2229 2160 746 -1306
4323 -1306 -1999 -665 1321 2458 1260 -961 -2019 -1818 -54 1338 1813 173 -1476 -2508 -1251 420
4339 420 1593 783 -1086 -2703 -2531 -918 1064 1339 -233 -1946 -2733 -1696 6 1170 739 -1040
4355 -1040 -2374 -2406 -607 1163 1684 477 -1365 -1988 -964 1010 2309 1804 -10 -1452 -1354 372 1927
4372 1927 2522 1386 -477 -1245 -527 1343 2698 2239 670 -944 -1284 418 2125 2401 1264 -355
4388 -355 -1662 -718 961 2258 2072 169 -1353 -1666 -287 1343 2037 964 -971 -1965 -1199 250 1563
4405 1563 1356 -122 -1793 -2204 -1086 435 1449 373 -1439 -2382 -2224 -446 1023 1310 -331 -1961
4421 -1961 -2395 -997 870 1647 1072 -684 -2058 -1396 332 1817 1847 482 -993 -1655 -334 1244 2107
4438 2107 1443 -173 -1498 -1299 438 1747 1995 712 -1052 -1749 -1005 825 1880 1286 -428 -1667
4454 -1667 -1730 -229 961 1489 347 -1580 -2118 -1418 541 1626 1012 -508 -1694 -1625 -453 1434 1822
4471 1822 680 -980 -1517 -803 978 2077 1662 180 -921 -1121 15 2068 2354 1202 -525 -1372
4487 -1372 -507 944 2033 1989 301 -1051 -1097 3 1636 1779 1002 -702 -1409 -1374 371 1319 1402 -255
4505 -255 -1415 -1791 -975 815 1286 641 -876 -1719 -1828 -118 1001 957 -467 -1778 -2090 -1338 597 1126
4523 1126 285 -975 -2027 -1660 -454 992 775 -521 -1747 -2104 -1125 256 1056 637 -729 -1978 -1707
4540 -1707 -244 1291 1446 346 -1044 -1505 -606 1102 2048 1561 293 -1037 -637 621 2109 2469 1370
4557 1370 66 -862 41 1479 2301 1861 311 -1054 -890 328 1684 2135 943 -743 -1582 -1001 418
4574 418 1522 1206 -75 -1447 -1718 -596 1080 1347 316 -1269 -1993 -1353 229 1333 1106 -78 -1792
4591 -1792 -1573 -699 845 1205 460 -687 -1739 -953 283 1242 1190 -185 -1288 -1648 -623 1004 1390
4608 1390 779 -646 -1497 -883 384 1514 1541 357 -856 -1351 -345 912 1509 962 -310 -1192 -1039
4625 -1039 390 1370 1493 282 -1058 -1555 -538 799 1452 590 -585 -1911 -1630 -296 995 1012 -29
4642 -29 -1428 -1716 -914 545 1368 786 -522 -1712 -1510 -477 790 1213 227 -1276 -1754 -801 382 1254
4660 1254 1058 -444 -1640 -1234 -218 1297 1368 356 -781 -1428 -864 507 1750 1068 -70 -968 -882
4677 -882 274 1258 1845 1101 -419 -972 -283 874 1872 1515 508 -525 -831 352 1680 2023 1128 -323
4695 -323 -1019 -670 434 1319 1207 65 -1043 -1131 -465 735 1145 301 -897 -1793 -1168 -96 950 796
4713 796 -51 -1305 -1696 -1017 445 724 200 -878 -1909 -1361 6 917 752 -253 -1254 -1399 -850 562
4731 562 1112 663 -618 -1590 -1273 -47 996 1209 77 -1098 -1509 -743 666 1441 841 -424 -1222 -1229
4749 -1229 282 1230 1366 476 -772 -1255 -789 513 1603 1055 -96 -1052 -873 -247 1153 1515 578 -684
4767 -684 -1220 -628 604 1241 993 -72 -1011 -970 -57 999 1661 683 -438 -1160 -561 643 1692 1503
4785 1503 103 -879 -843 -285 924 1739 658 -431 -1102 -589 508 1486 1206 145 -713 -1125 -140 933
4803 933 1504 726 -553 -1169 -914 280 1178 1012 -51 -1061 -1307 -512 481 947 293 -783 -1772 -1724 -181
4822 -181 683 735 -495 -1406 -1675 -991 126 629 231 -937 -1967 -1639 -474 478 594 -188 -1411 -1428 -768
4841 -768 459 1099 594 -417 -1059 -684 162 1438 1538 667 -395 -487 137 1062 2009 1646 293 -352 -154
4860 -154 683 1643 1861 1229 92 -658 184 968 1527 1442 232 -885 -748 119 1072 1144 357 -529 -1061 -685
4880 -685 435 965 642 -294 -1345 -1454 -523 409 714 85 -984 -1777 -1476 -277 264 57 -744 -1416 -1751
4899 -1751 -996 -33 631 78 -1057 -1768 -1304 -20 679 713 -178 -1087 -1060 -560 602 1179 845 -357 -764
4918 -764 -482 669 1347 1385 189 -447 -550 143 1063 1557 920 -197 -567 -479 460 1351 1072 438 -551 -965
4938 -965 -206 564 1252 527 -336 -1029 -497 -58 803 1173 327 -468 -982 -512 619 1017 695 -296 -903 -884
4958 -884 -63 803 1224 228 -605 -1094 -609 494 880 717 -222 -960 -829 2 777 796 134 -509 -928 -582
4978 -582 313 613 776 -22 -1262 -1161 -484 500 697 225 -782 -1582 -1053 -44 492 361 -601 -946 -1196
4997 -1196 -681 483 602 182 -611 -1243 -920 273 558 858 -150 -1022 -957 -427 907 959 461 -388 -865
5016 -865 -735 69 898 1073 110 -671 -793 -245 628 1257 712 -193 -455 -402 386 1278 1346 604 -228 -423 154
5037 154 996 1524 937 407 -180 -100 486 1279 1338 331 -355 -639 -158 630 1081 936 -215 -983 -791 -277
5057 -277 629 913 11 -943 -1182 -838 46 695 318 -298 -1074 -1332 -234 437 743 155 -675 -939 -646 177
5077 177 829 621 68 -936 -931 -205 483 630 250 -619 -1191 -733 109 709 566 -87 -1017 -1011 -291 391 664
5098 664 396 -538 -1145 -530 104 865 757 -152 -742 -684 -403 591 859 578 -419 -815 -579 287 779 894
5118 894 228 -446 -773 -295 504 1013 435 -82 -712 -462 381 864 1002 291 -635 -786 -164 529 762 691
5138 691 -532 -652 -788 151 851 585 147 -659 -778 -373 432 886 740 -33 -650 -721 240 769 870 307
5158 307 -152 -359 4 420 863 908 244 -516 -717 104 968 1387 744 -448 -357 -301 474 683 620 -180 -967
5179 -967 -748 -263 101 606 -50 -981 -1147 -953 -237 179 383 -538 -1075 -1399 -855 -65 130 -263 -764 -1098
5199 -1098 -1102 -320 580 564 -172 -856 -742 -314 344 799 353 -425 -778 -779 128 685 699 -52 -568 -790 -165 647
5221 647 1106 736 -86 -497 -426 327 629 1128 316 -65 -349 197 1011 1262 912 449 -336 -34 687 1415
5241 1415 1425 669 15 -104 23 740 973 740 313 -609 -650 23 734 817 -25 -657 -767 -405 157 228 307
5262 307 -592 -890 -1029 -218 246 321 -139 -727 -1131 -675 -65 508 371 -119 -799 -875 -245 355 641 -46 -527
5283 -527 -842 -468 208 581 405 -58 -598 -704 -174 495 589 342 -576 -759 -316 139 553 690 -59 -336
5303 -336 -506 -232 258 542 329 -220 -574 -321 8 421 717 -134 -441 -428 -235 334 724 276 -438 -464 -377
5324 -377 363 784 700 444 -479 -262 92 584 1041 728 -38 -507 -251 404 975 839 171 -173 -442 5
5344 5 724 660 555 -126 -377 -533 20 673 723 246 -414 -736 -460 -74 274 49 -564 -1078 -910 -450 8
5365 8 221 -62 -970 -1261 -899 -231 -32 -126 -456 -961 -868 -574 15 277 -43 -619 -718 -616 205 827 536 270
5387 270 -334 -285 226 887 837 796 -28 -377 165 509 1000 872 509 65 -116 400 768 998 558 234 -362
5408 -362 -42 507 875 899 299 41 -238 60 465 668 623 -158 -409 -204 125 667 505 108 -429 -422 -358 231
5430 231 608 112 -576 -631 -835 -498 64 -28 -343 -811 -1127 -629 -223 112 -342 -798 -1111 -678 -292 -10 406
5451 406 -174 -576 -933 -352 289 619 579 35 -383 -216 243 627 796 466 -66 -497 85 379 482 516 263
5472 263 -608 -386 91 546 447 4 -449 -648 -249 308 595 253 -169 -405 -337 -96 527 699 328 -11 -348
5493 -348 -183 250 480 459 397 -193 -224 127 856 984 439 98 -150 -23 369 702 759 51 -273 -513 -152
5514 -152 331 541 417 -297 -600 -245 -28 334 518 -149 -190 -404 -243 193 711 -29 -532 -681 -554 -89
5534 -89 -66 261 -77 -817 -805 -425 234 427 211 -280 -606 -596 -225 80 441 -104 -509 -653 -194 -5 385
5555 385 241 -245 -500 -394 120 335 122 -189 -220 -495 -350 -8 313 213 -188 -244 -297 -55 462 490 289
5576 289 -391 -414 -342 366 580 506 57 -285 -194 20 658 618 616 59 -216 -75 619 510 539 94 -72 -308 36
5599 36 391 552 266 -113 -331 -136 114 240 254 -312 -380 -478 -391 314 49 47 -131 -415 -136 107 354 69
5621 69 -51 -267 -410 -64 344 387 338 80 -289 -276 110 566 387 126 -342 -490 -99 371 331 459 -262 -196
5643 -196 -127 35 176 241 -133 -518 -576 -337 -48 102 226 -330 -370 -333 -342 44 268 69 -491 -352 -426 38 383
5666 383 282 15 -36 -224 -403 282 231 -97 -310 -443 -295 125 211 245 -162 -361 -340 -115 56 136 104 -405
5688 -405 -595 -320 -180 218 152 -171 -483 -520 -127 507 485 389 -25 -223 40 405 759 341 333 113 182 424
5710 424 892 618 928 391 166 394 451 824 450 260 29 -102 326 131 361 487 -176 -396 -388 -41 -116
5731 -116 77 -465 -601 -636 -445 -354 -168 -63 -603 -657 -478 -234 -181 -48 -364 -577 -535 -399 -85 143 -76 -295
5753 -295 -487 -162 -181 596 376 76 -528 -421 -342 155 185 141 -102 -274 -288 59 70 370 115 -166 -107 12
5775 12 489 601 281 -81 -239 -49 388 436 463 94 -65 -267 -72 73 519 270 137 -156 -275 -46 105
5796 105 535 106 -39 -111 -290 46 256 -1 -145 -249 -156 -318 220 437 151 -183 -35 -110 -60 291 189
5817 189 126 -16 -130 -294 286 226 234 -42 -351 -358 197 371 120 22 -393 -246 -59 306 252 389 -55 -442 -117
5840 -117 -62 82 76 26 -350 -184 -197 102 63 154 10 -333 -296 50 48 134 -307 -284 -327 -118 86 160 94 -158 -187
5865 -187 -424 -305 4 351 -51 -119 -154 110 216 291 534 340 -106 195 281 414 565 616 206 117 348 368
5887 368 686 339 116 -196 -213 43 330 223 49 -28 18 -35 -268 278 -211 -377 -356 -653 -436 44 -120 -223
5909 -223 -580 -304 -363 -291 -38 179 -233 -687 -410 -459 -151 161 -165 -249 -124 -272 -237 97 -113 -92 -385 -165
5931 -165 -107 198 400 301 -184 -243 20 -13 259 182 5 0 14 194 293 535 93 -159 -3 30 260 368 349 -6
5955 -6 246 23 190 348 486 410 175 -64 -30 464 243 359 394 -413 30 14 -32 168 -47 -34 -35 -57 60 103
5979 103 59 -209 94 -66 -414 -145 -118 244 -481 -172 -80 -219 -181 112 -58 -234 -390 -134 37 100 120 -221
6001 -221 -107 -70 -135 223 273 141 15 -164 -573 267 248 4 -235 -139 -211 13 124 -80 160 -384 -76 -173
6023 -173 42 268 -15 9 -149 -177 -84 283 104 157 28 -332 -223 180 237 146 53 -237 -446 -189 176 73
6045 73 28 -327 -144 -97 9 215 121 -98 -31 -50 35 384 479 328 -37 -81 14 230 330 438 225 -22 110
6068 110 356 355 109 -4 -10 0 -50 291 -150 155 155 -148 -9 212 -14 161 234 97 -285 -177 85 69 286
6091 286 9 -34 -104 98 -28 81 -21 -35 119 -84 -22 190 211 -94 -77 -266 -258 -56 32 -30 -277 -306 -377 -230
6115 -230 9 -190 -162 -74 -246 -338 -194 -160 -42 -247 -262 -149 -151 -47 158 145 -32 7 23 83 628 260 230 196
6139 196 233 218 86 177 328 385 -13 40 123 192 116 95 -185 -106 -152 -37 -4 -266 -192 -236 -218 -82 -124 86 -79
6164 -79 -48 -184 -182 -15 -4 384 -36 -301 -107 -44 121 170 136 -8 93 198 201 455 274 -87 341 -43 214
6187 214 105 69 58 65 -59 93 41 271 6 -170 -8 -138 168 -103 -23 25 79 52 -14 -274 169 187 -92 47
6211 47 -136 -132 -59 -129 -133 -199 -253 -271 -104 192 142 -196 -180 -102 -278 -101 -72 48 -376 -319 -270 -369 27 -105 -128 -171
6237 -171 -248 -188 -12 -1 125 -239 -291 -145 148 105 123 100 -137 166 16 220 762 254 325 237 109 327 431
6260 431 238 262 267 279 203 337 167 19 80 -243 74 -56 245 -140 42 -158 -88 -229 -193 188 39 -41 -288
6283 -288 -81 -189 -21 166 23 -266 -122 -108 -107 -17 -43 -229 -197 -73 88 28 -108 55 290 -128 160 -229
6305 -229 125 213 18 -4 30 277 -52 51 -29 4 -119 2 80 -63 43 -22 -71 -106 -28 -228 -313 -262 30 -4
6329 -4 -97 30 56 -30 -168 7 -95 22 150 140 153 -46 144 43 -114 50 -130 296 -51 -112 -67 204 -86
6352 -86 7 -248 -3 -150 248 263 39 4 0 48 -64 -56 150 -101 15 21 -54 -121 -179 95 7 117 62 -101 121
6377 121 -71 -195 -115 -134 84 224 150 107 -61 157 -80 -262 -25 27 -20 -90 -258 -164 -245 218 29 -303 -54
6400 -54 -235 -44 -177 -241 -90 -191 -135 100 56 -86 98 126 -332 89 74 -172 143 267 125 2 -72 7 133
6423 133 39 114 163 -79 -41 58 330 101 214 174 -165 4 222 41 -87 -108 80 53 -101 0 48 -118 -33
6446 -33 -212 -126 -214 149 103 -29 -60 41 132 -97 -194 -24 -54 39 -43 -51 -62 -116 99 -93 -456 -87 -232 -83 -65
6471 -65 121 -230 -105 -124 -209 162 -127 -344 -204 -247 -418 -57 15 142 -38 -131 56 5 -103 26 42 42 118 77
6495 77 112 296 90 234 -212 -35 -52 39 -34 50 5 -35 301 124 76 201 -42 -174 129 -123 -132 -38 266 -167
6519 -167 -57 18 -19 68 -68 207 -7 185 169 145 -73 229 123 -92 -129 138 -53 10 144 -220 -91 -67 -164
6542 -164 -20 -123 -218 -378 -161 -53 -216 -34 -92 140 -143 -102 38 10 -186 -106 340 10 191 -130 322 -25
6564 -25 283 -4 -127 68 81 -49 -139 339 40 -371 285 265 35 159 -30 -276 -161 -113 -5 -225 -262 -24
6586 -24 31 -68 -126 243 -74 -141 -97 -53 -40 -100 12 -245 -139 57 6 178 94 -104 -41 189 184 229 235 27 -99 -33
6612 -33 -27 -76 220 114 32 144 -87 149 -96 218 82 25 214 148 79 337 -86 -129 -128 -246 29 -110 141 -41
6636 -41 92 -1 -165 -247 56 -14 -33 2 -173 55 91 51 42 -203 67 274 24 73 3 45 -238 -268 -80 149 -28
6661 -28 120 -92 -336 -233 -35 -155 138 109 -200 -147 170 60 -39 235 -151 -64 181 44 152 192 139 152 45
6684 45 374 107 274 61 -39 157 -215 -74 61 204 56 -264 -272 -221 -110 226 -51 -305 -426 -281 -258 -273
6706 -273 -5 -255 -211 -409 -336 -65 -80 -104 -121 19 -198 1 100 -108 94 100 106 17 145 60 329 172 -38 -303
6730 -303 72 80 84 134 62 108 90 158 108 203 70 -33 -34 180 1 -62 46 -117 -214 -144 252 287 218 92 -229 -14
6756 -14 -22 162 -226 102 13 -373 64 240 47 118 63 -263 -157 1 -4 -62 -72 -132 84 -232 -44 31 114 -67
6780 -67 -120 -169 139 -110 57 -7 41 -43 -254 46 -58 317 -174 -291 183 79 321 347 26 110 2 3 -110
6803 -110 382 320 149 -39 79 52 -35 -12 -290 42 -144 -2 37 -99 -210 8 -252 -215 -164 147 238 68 -24
6826 -24 55 -19 -259 -76 5 136 -41 -57 47 333 76 270 232 -31 -71 -95 86 175 222 210 8 -1 119 -20
6850 -20 88 -101 -213 -130 20 42 -31 -37 -22 -97 200 69 -116 98 -235 -121 -108 -50 148 134 -53 -172 63 -42
6874 -42 2 88 103 194 50 -57 -84 -67 -74 25 120 -291 -110 -179 16 -105 -46 -242 -159 -99 -170 12 70 124 -261 -149
6900 -149 61 77 58 192 -172 150 -127 -108 251 166 448 -32 68 276 301 283 -64 147 -73 -188 300 249
6922 249 167 117 -184 -136 -78 71 -159 176 -59 -262 -58 77 103 -186 -38 -382 -305 -104 256 115 24 -51 -141
6945 -141 -201 -81 187 164 -96 106 -201 200 -42 -47 4 -101 -171 -191 -193 -53 255 118 -68 -259 -150 60 106
6968 106 245 -42 -202 30 -11 -144 84 15 -171 -100 -307 -182 -148 279 83 -10 10 25 63 162 259 113 279
6991 279 27 55 304 199 78 -284 88 138 324 20 -69 201 -79 -77 21 56 212 -74 -157 -440 -41 -71 70
7014 70 -32 -165 41 -260 140 -288 -174 -131 -309 -200 -57 -2 -222 7 -147 -150 126 77 263 -112 352 40
7036 40 -93 258 266 264 393 103 -318 269 341 270 513 138 74 -30 19 133 223 135 -197 -146 -82 39 -190 224
7060 224 -11 61 -5 -106 130 226 293 -43 -68 -42 -11 322 303 195 58 -266 105 245 82 143 -11 45 -136
7083 -136 -14 316 192 147 -241 -106 -70 7 -103 -93 -12 -266 -128 64 270 65 137 -186 20 -153 19 415
7105 415 300 -99 6 -248 -31 51 288 -72 116 -59 -240 61 146 -22 -82 -178 -143 -192 140 209 104 -162
7127 -162 -405 -378 -219 156 -222 -182 -292 -298 -77 165 9 -6 -34 141 -287 11 236 185 225 -16 101 231 160
7150 160 274 252 -96 -193 43 144 39 220 119 52 1 -48 123 177 -107 -85 -334 -115 -70 237 112 -168 -136
7173 -136 -65 200 248 -99 -81 -245 -119 -234 -45 127 6 74 -71 -140 -295 124 1 49 -1 -264 -144 49
7195 49 -126 -72 149 -364 -84 -135 -227 126 198 -247 24 -224 -184 -30 80 85 -192 -572 -184 -68 177 230 32
7218 32 -161 -215 116 153 97 146 226 -61 -100 285 138 89 57 -27 25 -96 -203 357 -205 -44 -225 -121 -136 2
7242 2 -215 -260 -312 -198 -253 -111 225 -69 -109 -210 -249 -204 26 125 -21 -68 -114 217 7 208 87 -508 -213 -191
7266 -191 -53 -5 195 395 81 -186 -93 -22 272 -260 -222 -47 -224 17 204 134 71 -54 -36 30 15 250 115
7289 115 236 -30 299 153 200 401 156 154 -13 183 140 280 218 266 -118 -70 144 104 98 50 -14 -120 -63 -130 33
7314 33 -4 -200 -237 -445 -60 245 19 -102 -415 -121 -263 -80 110 -90 67 -127 -101 62 133 304 130 132
7336 132 -14 3 -142 -7 230 -96 -194 -152 -118 32 180 22 -272 -139 -307 -55 107 87 -115 -554 -216 29
7358 29 157 -78 33 -123 -120 -54 -79 207 145 -26 -33 168 -148 158 -19 18 24 -264 -50 144 176 216 -40 -38 -35 29
7384 29 24 -152 50 -310 -210 -78 139 -76 -24 -125 -13 -350 -127 147 134 196 11 60 55 -242 65 293 112
7407 112 151 63 -32 39 200 388 5 -115 -123 274 33 217 85 -209 -69 -57 120 146 5 -3 -159 -180 -201 106
7431 106 164 20 4 -201 64 -135 -70 45 -181 84 -109 -34 110 163 38 -177 -122 -133 138 141 61 196 -89
7454 -89 -155 250 31 331 173 -38 136 59 204 206 485 -8 54 -229 215 232 21 322 25 -89 -73 -131 227
7477 227 1 122 42 -306 57 115 90 187 -136 -144 -331 -400 -188 22 62 -112 -202 -141 -196 206 194 -45 -56 -321
7501 -321 19 93 70 -43 -283 -487 -268 -61 -39 188 -163 -266 57 -317 -137 -149 77 -351 -139 -82 217 59
7523 59 6 101 77 -179 17 76 242 262 22 -50 -140 326 326 289 333 -80 -28 -61 232 30 264 77 -375 -263 -251
7548 -251 149 171 90 -63 39 -150 29 190 -69 -122 -52 -311 -106 67 92 -276 -209 -264 -367 -237 -171 -64 -46
7571 -46 -308 -206 71 9 93 -4 -260 -107 81 -69 113 140 -35 -82 7 54 217 105 152 -279 -166 -21 271
7594 271 352 196 -262 -54 204 15 150 277 90 -105 -90 -100 95 340 149 -44 -113 -30 56 31 190 -82
7616 -82 -243 -218 -70 100 35 114 127 -226 -20 -26 272 169 9 -9 -171 8 -16 402 76 -62 -37 101 -121
7639 -121 24 -34 366 -202 -317 22 24 75 222 -81 -206 -99 -139 300 -41 -36 0 -101 -246 283 60 103 -90
7662 -90 274 -178 82 114 224 249 -230 -75 -103 13 1 36 171 -271 -247 -73 437 293 -34 -78 -133 -190 -210 197
7686 197 254 107 -63 54 -300 148 304 -126 28 -169 -282 -65 -100 23 -362 -158 -237 -60 157 129 185 -179
7708 -179 -338 -191 -112 -189 242 141 -240 -207 -154 -68 213 -39 -127 -290 57 -64 14 247 170 -248 -313 -299 -337 -95
7732 -95 -98 -66 -150 -501 -168 38 177 -101 -497 -266 -120 53 268 97 141 -168 -143 25 15 24 -36 -103 -143 161
7756 161 352 276 230 156 -60 -67 155 305 135 150 -73 -218 -26 -23 141 251 293 -194 -94 -281 30 147 93
7779 93 -157 20 -216 -81 51 75 198 93 -109 29 159 333 109 98 14 -64 -80 122 188 58 145 -251 -143
7802 -143 65 -10 -25 -160 -317 -323 -160 102 126 -74 -508 -309 -216 -133 68 -202 -141 -143 -184 -44 -13 23 115 -122 -180
7827 -180 154 -53 24 241 133 84 1 165 280 198 97 22 -96 -64 -149 182 257 221 -121 -110 80 572 336
7850 336 130 150 -183 -27 210 188 407 75 -28 6 -181 -8 250 7 -24 -22 -256 71 142 200 -10 -186 -58
7873 -58 -80 117 68 -66 -208 -293 -331 141 187 -124 80 -51 -255 -2 22 53 -144 49 -507 -278 66 234 111
7896 111 -8 73 64 78 -11 183 269 260 -65 -164 90 38 204 23 9 -13 -99 -16 308 208 -106 -106 -133 -1 47 118
7922 118 -63 -66 -124 -273 119 227 50 -138 -265 -43 -178 202 313 162 -147 -331 -239 259 228 375 118 -124
7944 -124 -122 -187 72 90 -11 -114 -250 80 205 193 -14 127 49 -139 131 390 148 351 151 -392 -6 -19
7966 -19 -133 -172 -82 24 -244 -99 353 259 171 -110 -148 -343 75 -77 294 -18 -389 -146 -44 116 97 16 65
7989 65 -84 -305 107 163 -24 138 -310 -286 -127 326 185 107 -140 -254 -8 -76 224 183 515 74 -132 74
8011 74 118 191 131 -50 -60 74 53 285 382 -20 -3 -105 -364 98 98 -148 71 -236 -306 16 299 90 68 -234
8035 -234 -317 -265 -237 133 -95 -129 -382 -139 -65 -237 -31 -171 -117 -166 -42 -101 281 232 127 -121 -48 80 107 38
8059 38 201 -153 -52 -23 -30 321 198 -93 -331 -114 -92 124 208 330 22 -212 -127 66 265 -31 227 -301
8081 -301 -22 82 167 293 70 -104 -173 30 -13 113 140 -181 -136 -402 46 256 50 69 -53 -51 -94 -80 242
8104 242 109 -98 -193 -74 -112 -111 182 102 -152 -233 -286 -1 -111 84 -107 -14 -251 -183 334 -31 161 -176 -39
8127 -39 -285 -327 104 246 111 -145 19 182 12 334 -4 -151 -113 -276 -134 -10 249 324 -38 -126 -144 2
8149 2 178 110 43 47 13 -129 -32 273 4 -111 -308 -246 44 351 -78 -51 77 -266 50 91 90 434 44 -92
8173 -92 -91 -27 50 253 51 170 -298 96 207 136 -69 -92 -68 -132 89 50 -82 -36
8191c6
$$ Imaginary data points
##PAGE= N=2
##DATA TABLE= (X++(I..I)), XYDATA
0 0 0 0 0 0 0 0 0 0 0 0 0 -8 8 -8 8 -8 8 -16 16 -24 24 -32 36 -47 49 -61 69 -81 92 -108 119 -137 158 -175
34 -175 199 -225 251 -283 315 -349 391 -434 480 -534 589 -649 719 -790 873 -963 1058 -1167
52 -1167 1288 -1420 1569 -1741 1932 -2155 2419 -2723 3099 -3558 4142 -4916 5990 -7585 10225
67 10225 -15364 29248 -150938 -461867 -305669 -6105 297372 342751 162405 -93052 -141742
78 -141742 67740 393052 561149 473239 205633 7112 51222 312107 551473 575365 358966
89 358966 85630 -34310 98206 356925 502084 390028 116904 -103386 -103063 101891 328026
100 328026 364753 170298 -97462 -214498 -97081 149626 312279 244509 119 -207860
110 -207860 -207094 -5369 222251 285910 127244 -125852 -254537 -147946 86843 242786 190057
121 190057 -34069 -250340 -280135 -103649 112411 172845 24947 -213771 -353521 -277530
131 -277530 -59396 101012 64237 -135158 -331222 -364601 -204194 17849 107344 -9800
141 -9800 -218218 -335406 -261902 -51333 128633 129995 -40852 -223538 -252135 -99458 114350
152 114350 217915 125699 -76895 -205803 -148467 44130 212510 217755 53373 -143536 -200550
163 -200550 -69379 128370 220790 131803 -67684 -212243 -180598 -423 167860 177275 24322
174 24322 -161132 -224146 -106253 93147 200450 130059 -48586 -179420 -150256 21684 199288
185 199288 231467 95778 -76527 -132925 -25958 160807 276177 224181 52439 -84856
195 -84856 -67097 87357 248621 282709 154344 -27976 -105724 -18846 149027 252193 200012
206 200012 26965 -128531 -135100 6450 159907 188200 64685 -115519 -207228 -136156 30752
217 30752 141798 96994 -66563 -214198 -225842 -91084 71618 116307 7125 -159216 -243386
228 -243386 -176434 -12995 110606 86352 -65064 -204950 -213194 -86515 71729 130407 40511
239 40511 -118942 -206164 -143475 13802 134946 123163 -13066 -154150 -171530 -50441 104137
250 104137 165924 88374 -63273 -158823 -108893 47389 172042 162783 34356 -104214 -134235
261 -134235 -25436 130517 199203 123421 -28025 -126763 -90254 53929 181744 178552 49663
272 49663 -91480 -129749 -35977 110923 184608 116599 -37242 -142350 -113568 17364 138816
283 138816 146090 28332 -115381 -162860 -76541 65111 140005 85525 -57061 -166932 -147111
294 -147111 -18761 104013 119332 15299 -121891 -177365 -99811 45864 129552 81632 -51919
305 -51919 -159564 -149677 -27201 104255 130861 31526 -104634 -161571 -91072 51690 146248
316 146248 108497 -23849 -132705 -126206 -10559 120912 159105 69588 -68876 -130632 -63506
327 -63506 72399 166497 141305 17152 -97078 -101008 7944 135455 175138 94961 -39186
338 -39186 -112034 -58612 71871 163905 141261 24017 -92826 -111497 -15217 111215 153597
349 153597 74427 -57522 -135173 -95573 26760 123777 107615 -9539 -128544 -151350 -62704
360 -62704 62425 113710 41766 -91212 -170146 -132262 -13143 87353 83550 -24693 -145336
371 -145336 -170053 -79601 45771 103036 45859 -77519 -158905 -124941 -4694 100110 104262
382 104262 8860 -105110 -136801 -53044 73950 135002 85080 -29800 -112589 -91273 20103
393 20103 127662 136523 41968 -71558 -109818 -40527 79062 145103 99445 -18120 -106679
404 -106679 -92956 10269 116263 132992 42146 -76253 -119301 -53704 62854 133480 98559
415 98559 -15405 -110406 -101543 2413 109352 131256 50445 -66168 -118424 -60025 56637
426 56637 129926 98973 -10003 -107669 -111351 -16501 91108 115070 37440 -76505 -134190 -88412
438 -88412 22390 102136 78022 -28217 -122670 -128984 -41223 68919 106480 40041 -69627
449 -69627 -126050 -79498 32497 120341 111386 13055 -83706 -90226 -1839 108666 151956 93402
461 93402 -18248 -85111 -46833 62403 145785 132960 33501 -72690 -96508 -21256 83112
472 83112 121407 57931 -57449 -134221 -111053 -10599 73733 63179 -32987 -135285 -162112
483 -162112 -93107 13912 66620 17157 -88884 -156849 -129188 -27130 67393 77089 -3343
494 -3343 -98481 -121595 -49875 59687 120407 84395 -16533 -89422 -66324 32160 123440 134455
506 134455 56421 -45539 -83238 -22032 82636 138106 97417 -5745 -87904 -79360 10850
517 10850 101124 111916 33490 -68501 -111323 -58747 45392 108264 74594 -22973 -100501 -94648
529 -94648 -9192 86037 109720 41232 -58046 -99895 -51032 47618 115076 92036 -912 -83489
541 -83489 -84528 -6518 83434 109338 46549 -55495 -108691 -68283 25515 90127 71184 -17934
553 -17934 -105460 -116714 -41778 52545 82732 25245 -70800 -125041 -88503 9782 84759 74996
565 74996 -6999 -89103 -99888 -25999 74470 115745 64435 -28799 -81630 -49981 42626 120178
577 120178 116692 34341 -53766 -71958 -7415 82993 122811 74344 -23460 -87871 -67090 15609
589 15609 86773 83655 4656 -88523 -117116 -58590 30030 70990 29093 -62991 -129343 -113709
601 -113709 -28516 51577 56781 -14837 -100443 -127648 -68576 27937 80514 46603 -39574 -101990
613 -101990 -85978 -516 85656 99277 30814 -55434 -83164 -29559 61978 117222 88102 -226
625 -226 -69407 -59656 18568 98431 113388 48751 -41203 -77817 -31888 54566 107609 82725 -1070
638 -1070 -74361 -72835 1749 81499 98503 40014 -45508 -87058 -47980 38533 96580 75496
650 75496 -5364 -77079 -80438 -11839 69954 92553 35967 -50524 -94225 -60340 22084 83092
662 83092 66993 -14469 -89791 -95381 -30992 48885 76461 26083 -60917 -108618 -76506 5308
674 5308 67673 59044 -14140 -89022 -98952 -35640 46010 78258 37027 -42948 -92787 -66596 15082
687 15082 81014 76838 10362 -61880 -78093 -22372 59411 96658 57441 -22151 -73945 -55201
699 -55201 19425 86688 86644 19604 -55552 -76434 -27072 51762 92316 57348 -24136 -80562 -64342
712 -64342 6995 74149 79535 16767 -61198 -86770 -38287 40441 82494 52990 -24457 -84444
724 -84444 -73632 -2937 65571 74084 16818 -58803 -89371 -47194 31920 77729 51696 -21226
736 -21226 -79977 -75474 -10001 61464 76455 23176 -50814 -82444 -44300 32099 83329 63621
748 63621 -7943 -67637 -65136 -2895 68622 89127 39401 -36822 -72044 -35937 38466 89278
760 89278 73478 3119 -61823 -64807 -4021 66559 86725 39110 -36730 -77659 -46995 26705
772 26705 78006 63803 -3695 -68612 -77042 -20837 50913 74574 29626 -43435 -84331 -59602
784 -59602 10341 65893 57227 -7210 -71852 -82145 -30655 39842 68834 29895 -42428 -85473
796 -85473 -63133 4089 60145 57702 -2574 -69562 -83181 -32161 38070 68956 35583 -34809
808 -34809 -81246 -62438 5923 64187 64351 7255 -58548 -76136 -28113 43688 77552 46733
820 46733 -21089 -68628 -54997 10355 71762 75327 19549 -45300 -65173 -23494 45747 83388
832 83388 56896 -10465 -59806 -49594 10383 70758 79355 27961 -38587 -62283 -24336 41743
844 41743 80697 59490 -5864 -59255 -53550 5092 64472 74658 26814 -39757 -68570 -34510
856 -34510 32337 73051 52485 -11160 -65677 -64503 -8342 53883 66634 20654 -44961 -75377
868 -75377 -45316 20966 66398 50059 -12606 -66684 -67273 -14903 47467 66051 24299 -41439
880 -41439 -74168 -46766 15773 62082 51543 -8138 -64867 -69867 -20869 38524 59431 22478
892 22478 -42687 -80351 -57679 4546 50725 42601 -13002 -69859 -79671 -32636 29849 53825
904 53825 20030 -42092 -79123 -59134 3303 54809 51093 -1797 -56500 -66714 -22017 42038
916 42038 71630 41593 -19946 -57535 -39362 19971 71810 73039 22571 -34427 -48594 -7532
928 -7532 53144 83559 57915 -2925 -45239 -32453 22791 73032 76596 30242 -27830 -47961
940 -47961 -11970 47932 78736 55467 -2132 -46961 -40616 11484 63322 69325 24280 -34205
952 -34205 -57373 -26280 32026 66316 44101 -14233 -60319 -56970 -8465 43772 53122 9368
964 9368 -50874 -75560 -46132 10054 45925 28863 -27872 -75565 -73877 -26271 26763 40025
976 40025 1800 -55815 -83069 -55356 2137 40347 29017 -22033 -69644 -71466 -24425 31271
988 31271 48031 13898 -40366 -68941 -45632 11415 53650 45311 -4044 -50991 -55644 -12276
1000 -12276 44056 64895 32563 -22397 -52285 -31683 22539 66639 62110 12453 -37523 -44140
1012 -44140 -2289 52228 74642 45405 -11045 -44762 -26746 26579 69693 66792 19882 -31849
1024 -31849 -43474 -4969 48976 71569 44535 -9633 -46437 -34472 16142 60483 59653 13988
1036 13988 -36738 -51960 -18854 34526 60332 35565 -18112 -55728 -46768 1055 46400 48920
1048 48920 5267 -46294 -62175 -31136 20823 48915 28097 -25094 -64156 -55958 -8448 36888
1060 36888 42200 1847 -49822 -67910 -36709 15822 45119 26740 -23638 -63419 -57417 -10298
1072 -10298 36276 42917 6020 -43633 -63631 -36348 15960 48160 32158 -15646 -55011 -52044
1084 -52044 -8969 38961 50297 15705 -33022 -54458 -29932 20587 54966 43828 -3248 -43545
1096 -43545 -41976 -1107 45972 60561 29200 -20436 -44556 -21649 28108 61788 52731 7279
1108 7279 -35677 -37937 1768 48352 62423 32000 -17682 -45256 -26417 22198 57012 47874
1120 47874 3374 -39755 -46077 -10164 36982 53836 25142 -24242 -52213 -36599 9519 46859
1132 46859 41982 81 -43462 -51735 -18142 28698 49075 24528 -24017 -54166 -40045 4421
1144 4421 42188 40926 1377 -43849 -54928 -22391 24388 45367 23099 -24334 -56717 -45491
1156 -45491 -871 38084 38159 -8 -44614 -57195 -26507 22049 45719 24828 -20672 -52395
1168 -52395 -42944 448 42281 46164 9451 -34479 -47801 -19020 28019 54445 37591 -7807
1180 -7807 -40874 -34149 6844 47583 54368 20057 -25663 -42500 -16608 27992 54523 40103
1192 40103 -4009 -40451 -37928 1275 42120 49122 16756 -27979 -48246 -25832 19110 47260
1204 47260 34020 -8733 -45518 -45287 -7322 34871 44198 13284 -31262 -51280 -30556 13285
1216 13285 44146 33873 -7930 -44652 -45510 -9346 32326 45237 17359 -26683 -48400 -29709
1228 -29709 13088 44353 37664 -1702 -40209 -43563 -9561 31698 45854 21339 -21494 -46754
1240 -46754 -31325 10935 42786 37759 124 -38186 -44676 -12896 29020 45142 21472 -20875
1252 -20875 -46166 -33296 7953 42185 39209 1964 -36607 -43376 -13336 28564 47167 25665
1264 25665 -17327 -43800 -31175 8873 42683 42050 6239 -33207 -41984 -13695 27136 46628
1276 46628 27795 -13926 -43121 -33635 5729 39721 40658 8204 -31079 -43604 -17623 23902
1288 23902 45358 28747 -11471 -40535 -34474 3112 39310 42680 10976 -27513 -41695 -18459
1300 -18459 22677 45785 30355 -10009 -40332 -35844 -786 35125 40380 9480 -31245 -46952
1312 -46952 -25051 14706 38335 25420 -13802 -46328 -43315 -8547 27438 35232 7781 -31516
1324 -31516 -49069 -28212 12432 38085 28372 -7737 -39467 -38958 -5553 32547 42713 17825
1336 17825 -20219 -38747 -21393 17691 45497 37484 1838 -30487 -32737 -2561 34829 46913
1348 46913 22905 -16722 -36950 -21373 15776 43418 37491 2565 -31636 -35218 -5925 31124
1360 31124 44013 21743 -17312 -39456 -25554 11584 39776 35057 1603 -33377 -40183 -12353
1372 -12353 24715 38338 17154 -20915 -44848 -34754 592 30173 27599 -4908 -39557 -47881
1384 -47881 -23120 14060 31166 13503 -23135 -46613 -37613 -2744 29192 31572 2390 -31492
1396 -31492 -39510 -14449 23087 43350 29276 -6333 -31178 -22934 11922 43701 46706 18288
1408 18288 -16883 -28282 -5391 30525 48932 34529 -2030 -30069 -25624 5946 37212 39408
1420 39408 10349 -25668 -40063 -20479 14611 34707 21717 -13995 -41881 -39113 -8520 24137
1432 24137 30707 5010 -30001 -43855 -25482 10330 33625 24648 -8430 -36599 -34934 -4835
1444 -4835 28358 37040 14101 -21090 -37374 -20575 14322 37542 29375 -3171 -33243 -34331 -5676
1457 -5676 27316 35475 12783 -22002 -40000 -25017 9741 34141 26912 -5071 -34001 -35951 -8397
1470 -8397 25507 36782 15629 -18115 -35412 -22163 12013 38050 33945 3318 -26274 -29409
1482 -29409 -4150 28600 41298 22283 -11657 -32114 -21318 10450 35270 32379 3146 -28514
1494 -28514 -35498 -12101 19719 32809 15333 -18172 -40181 -31177 317 26884 25443 -1822
1506 -1822 -31857 -38912 -16271 17600 33456 18321 -13420 -33911 -25209 6398 35114 36431 10675
1519 10675 -19549 -27375 -6313 26640 43309 29957 -2707 -25793 -20019 8498 35705 37306
1531 37306 11602 -20867 -32626 -14558 16395 32545 20248 -11950 -37133 -34851 -7276 20391
1543 20391 24081 504 -31171 -43801 -26578 5893 25104 15213 -14567 -38362 -35739 -7842
1555 -7842 22208 29257 7380 -22930 -35001 -18096 14045 35356 27154 -2429 -27106 -25803 689
1568 689 29874 37444 16542 -14744 -29418 -14714 15703 36006 29604 725 -26368 -27725 -2941
1581 -2941 25951 34855 15595 -14887 -31316 -19376 10877 33129 28282 1120 -25504 -28663 -5513
1594 -5513 24624 35063 17275 -13041 -30172 -19667 9660 32642 29333 2008 -25109 -29432
1606 -29432 -7645 21362 33092 16091 -14631 -32749 -23840 4388 27491 25221 -621 -28732
1618 -28732 -34602 -13650 15097 27279 12871 -16850 -36637 -28737 -771 23078 22341 -1070 -28783
1631 -28783 -36163 -16679 12930 27268 14951 -13493 -33207 -27361 -349 25229 27474 4958
1643 4958 -21742 -29678 -12015 17347 34138 23310 -4829 -24849 -19666 5786 31363 35267 13521
1656 13521 -14281 -24027 -7683 20448 36656 26799 -882 -23576 -21191 3533 28280 32108 11341
1669 11341 -17026 -29432 -15439 12206 29405 21104 -5894 -28717 -28661 -5350 20517 26743 8160
1682 8160 -19329 -32445 -20553 7468 26717 20716 -4926 -27992 -29101 -7559 18580 27297 9829
1695 9829 -18173 -32773 -21900 4760 24220 19946 -5265 -29632 -32021 -11152 14997 24479 8485
1708 8485 -18838 -34247 -23681 3396 24085 21451 -1771 -24919 -28606 -7556 20218 31248
1720 31248 17563 -8499 -23883 -15093 11570 33676 32496 10083 -13860 -19406 -999 25451
1732 25451 37615 24253 -3002 -21068 -14875 8876 30098 29600 7212 -19066 -26850 -10699 14407
1745 14407 26699 14797 -11556 -30949 -26559 -2942 18846 20349 53 -25345 -33716 -17760
1757 -17760 8937 22840 12939 -11810 -30805 -26623 -2733 20755 23975 4513 -19733 -28621 -13935
1770 -13935 12437 28239 19736 -4806 -24080 -22006 -77 23653 28805 10654 -14448 -24916
1782 -24916 -12526 12441 28716 22480 -1449 -22507 -22199 -2214 21144 27003 10368 -14866 -27819
1795 -27819 -16624 7528 23993 18826 -4495 -26237 -27969 -8312 15367 21765 6281 -18320
1807 -18320 -31375 -21436 3001 20983 17218 -4607 -25655 -27264 -8261 16664 25340 12010 -11866
1820 -11866 -24608 -15080 9169 28781 26960 6571 -14760 -17478 693 24610 34925 22700
1832 22700 -1551 -16372 -9406 13470 32469 31281 10805 -12380 -18252 -2498 20387 30195 18075
1845 18075 -6152 -23156 -18581 3112 21994 21186 999 -21961 -28876 -14377 8674 19916 8624
1858 8624 -15160 -31695 -27296 -6083 13496 14701 -4111 -26703 -33446 -19299 3961 16475 7562
1871 7562 -15421 -32107 -28258 -7714 12655 15840 -746 -23176 -31132 -17578 6039 19624 13075
1884 13075 -8133 -25144 -22513 -1892 19993 24726 9798 -11283 -19848 -7417 16588 32236
1896 32236 26538 6168 -10982 -9835 9449 31267 36376 21722 -815 -10544 -409 21139 35481
1909 35481 29800 8010 -11535 -12790 3659 23038 27918 12162 -11403 -24116 -16060 3999 18398
1922 18398 13233 -7889 -28067 -30767 -14399 6027 12961 507 -21021 -33804 -25556 -3708 13533
1935 13533 11885 -5866 -24469 -26989 -10484 12062 21709 11340 -9225 -21764 -14929 6300 24022
1948 24022 23298 5403 -14450 -18532 -3814 17153 26284 15474 -6619 -20828 -15509 3642 20260
1961 20260 19990 1892 -18617 -24091 -10395 10464 20264 10945 -9976 -24561 -20045 -465 17496
1974 17496 19101 3090 -16833 -22683 -9708 11609 23345 15140 -4934 -19788 -16861 1805 20350
1987 20350 22357 6553 -13616 -21030 -10097 10564 22341 15260 -5239 -20955 -19222 -1534 16652
2000 16652 20038 4880 -14836 -23059 -11639 8522 21319 15926 -3207 -19026 -17469 753 19313
2013 19313 23422 9690 -9670 -18087 -7711 12410 25142 19972 1233 -15268 -15216 986 19090
2026 19090 23637 9839 -9990 -19935 -11923 6886 20508 15886 -2956 -19758 -21257 -6462 12049
2039 12049 18014 5931 -13886 -24357 -16978 1530 16100 13337 -3489 -20768 -22820 -7724 11060
2052 11060 17967 7354 -11530 -22317 -15546 3243 18134 16234 251 -16712 -19586 -5773 13256
2065 13256 21184 11632 -6941 -18358 -12751 5037 20665 20502 4997 -12305 -16601 -4035 14616
2078 14616 23639 15166 -3517 -16374 -12609 4139 19555 20187 5076 -13081 -19065 -8208 9509
2091 9509 19144 11800 -6861 -20845 -18713 -2381 13244 15002 812 -16755 -23686 -13009 5222
2104 5222 15828 9579 -7828 -21250 -19471 -3080 13976 16591 3854 -13396 -20332 -10559 7473
2117 7473 19298 13960 -3228 -17147 -16367 -1299 15145 19236 7175 -10567 -19016 -10417 7018
2130 7018 19030 14766 -1441 -16633 -16993 -2319 14460 19713 8973 -8610 -17555 -9739 8095
2143 8095 20996 18585 3106 -11775 -12802 1374 18452 24484 14336 -3021 -12378 -5769 10953
2156 10953 23959 21071 5179 -10610 -12741 -489 15394 21158 10453 -7563 -18398 -13348 1955
2169 1955 14048 11855 -3498 -19734 -23173 -11657 4362 10898 2237 -15219 -26305 -21281 -5258
2182 -5258 8396 8480 -5288 -20498 -24248 -12475 5069 13467 6654 -9051 -19723 -15893 465
2195 465 15301 16616 3651 -11511 -15793 -5424 11732 20529 13725 -2283 -13883 -10806 3532
2208 3532 17880 19264 6342 -9546 -14843 -5371 10403 19297 13143 -2951 -15239 -13263 807
2221 807 15272 17080 5432 -10521 -16651 -7975 8016 17630 12978 -2206 -14843 -14275 -421 14267
2235 14267 17573 6260 -9530 -16409 -9084 6803 17288 13064 -1780 -15204 -15092 -2471 12541
2248 12541 16396 5848 -9568 -17280 -10148 5256 16035 12988 -1474 -14565 -14645 -2026 12885
2261 12885 17878 8581 -6524 -14484 -7783 7637 18826 16781 3047 -10103 -11661 -44 14898
2274 14898 20261 11301 -3990 -13294 -8337 5867 17265 15189 1533 -12693 -16024 -6268 8372
2287 8372 14192 5679 -10255 -20180 -16683 -3021 8678 7768 -5051 -19435 -23087 -13075 1431
2300 1431 8396 1523 -13315 -23156 -19299 -5117 7342 8048 -3264 -16963 -20017 -9944 5486
2313 5486 13516 7797 -5833 -15261 -11759 2333 15708 17087 6547 -6631 -10789 -1832 13326
2326 13326 21760 16397 2719 -7953 -6073 6619 19270 21311 10383 -4020 -9758 -2447 11284
2339 11284 19884 14924 538 -11168 -10784 1032 13376 15986 5268 -8706 -15290 -8354 5254
2352 5254 14452 10376 -3063 -14636 -14229 -2524 10683 13893 4861 -8756 -15247 -8831 4916 14818
2366 14818 11461 -1536 -12865 -13421 -2530 10952 14885 6063 -8154 -15279 -10004 3049 13078
2379 13078 10761 -2016 -14245 -15600 -5508 7785 12728 4592 -9114 -17012 -11925 1469 12015
2392 12015 10587 -1148 -13223 -14952 -4794 8851 14029 6968 -6428 -14737 -10413 2297 13013
2405 13013 11886 145 -12004 -15172 -5945 7095 12346 5346 -8315 -17080 -13725 -1620 9327
2418 9327 8926 -1950 -14502 -17530 -8750 4465 11522 5815 -6606 -15424 -12081 635 12308 13680
2432 13680 4164 -7646 -11299 -2477 11044 18359 14174 1650 -7495 -5527 6475 18216 19400
2445 19400 9524 -2906 -7681 -1031 11572 18808 14072 1260 -8826 -8223 2431 13414 14948
2458 14948 5087 -7660 -12823 -6776 5316 12728 9219 -3482 -13702 -13203 -2938 8229 10846
2471 10846 2128 -10382 -16200 -10267 2002 9794 7020 -4720 -15375 -15968 -5574 5987 9311
2484 9311 1498 -11049 -17191 -12035 366 9182 7183 -3565 -14336 -15216 -5264 7184 11281 4569
2498 4569 -7294 -13734 -8903 3498 12982 12310 1577 -8477 -9898 -587 11340 16410 9689 -2459
2512 -2459 -9297 -4956 6515 15355 14605 4179 -6970 -9295 -1521 10072 14809 8878 -3479 -11745
2526 -11745 -8803 2074 11345 11039 1084 -10263 -13409 -6089 5997 11299 5958 -5954 -14309 -12029
2540 -12029 -1332 9072 9771 246 -11196 -14666 -7498 4194 10290 6040 -5546 -13828 -12118 -1654
2554 -1654 8663 9790 1156 -10276 -13873 -7385 4347 11067 6915 -3725 -12306 -10627 -422 10074
2568 10074 11855 4255 -6804 -10954 -4742 7124 14309 11545 1140 -7708 -7139 2642 13646 16127
2582 16127 8838 -2414 -7570 -2533 8714 16318 13288 2628 -7083 -7713 741 10855 13477 6218
2596 6218 -5188 -11534 -7362 2845 9876 7897 -2795 -12266 -13841 -5262 5211 8468 1822 -9403
2610 -9403 -14894 -10945 -83 8063 6608 -2714 -12129 -13017 -4666 5851 10265 4711 -5856 -12030
2624 -12030 -8726 1894 10431 9974 535 -9061 -11207 -4139 6504 11089 5728 -5232 -12489 -9780
2638 -9780 -151 8499 8335 -607 -10513 -13142 -6078 4555 9533 4822 -5004 -12171 -9652 119 9412
2653 9412 10187 1748 -7493 -10310 -3538 7441 13030 9075 -1109 -8194 -6705 2875 12156 13154 5171
2668 5171 -4856 -8506 -2645 7380 13270 9382 -645 -8768 -7723 1008 9834 11368 4150 -6034
2682 -6034 -10215 -5009 5239 11850 9160 -328 -8696 -8280 499 10038 12561 5816 -4452 -8937 -4225
2697 -4225 5820 12501 9949 446 -7985 -8450 -603 8627 10779 3853 -6114 -11900 -8104 1221 7986
2712 7986 5557 -3574 -12607 -13770 -6255 2647 5736 -497 -10276 -15990 -12332 -2549 4958 3712 -4573
2727 -4573 -12912 -14352 -6350 3485 7625 2912 -6506 -11977 -8108 1322 9608 9643 1928 -6783 -7876
2742 -7876 -674 8898 13387 8809 -353 -6531 -3609 5318 13107 13127 5342 -3725 -6201 132 9345
2757 9345 13519 9014 -468 -6995 -5074 3434 11136 11124 3197 -5712 -8643 -3075 5953 10961 6738
2772 6738 -2579 -9687 -7974 239 8066 8898 1745 -7497 -10675 -5484 3515 8614 5475 -3594 -11043
2787 -11043 -10146 -2450 5510 7088 311 -8860 -12936 -8087 1006 6671 3887 -4880 -11934 -11658 -4033
2802 -4033 4211 6399 417 -8202 -11931 -7259 1903 8260 6350 -1229 -8498 -8048 -486 8038 11150
2817 11150 5841 -2857 -6954 -2794 5787 12298 11003 3067 -4716 -5443 1414 9805 12360 7229 -1970
2832 -1970 -7160 -4315 3864 10565 8904 1143 -7179 -8525 -2588 5878 9118 4259 -4440 -9686 -7053
2847 -7053 1100 8098 7291 307 -7739 -9285 -3388 5019 8815 4678 -3781 -9158 -6920 738 7526
2862 7526 7248 539 -7612 -9740 -4438 3672 7797 3735 -4369 -10636 -9079 -1535 5480 6312 -543
2877 -543 -8480 -11029 -5829 2918 7058 3984 -3685 -9606 -8419 -570 7023 8154 2452 -5619 -8294
2892 -8294 -3730 4846 9956 7274 -423 -6603 -6056 1466 8686 10087 3871 -4100 -7483 -3240 4836
2907 4836 9522 7324 -772 -7191 -6963 -323 7160 8725 3219 -5043 -8420 -4699 3425 8731 6523
2922 6523 -491 -7504 -7195 -659 7186 9517 4403 -3664 -7626 -3693 3834 9566 8505 1134 -5986
2937 -5986 -6878 -755 6992 9388 4595 -3599 -8392 -5700 2007 7498 6433 -851 -7925 -9130 -3568
2952 -3568 3556 6434 2199 -5769 -10721 -8227 -579 5033 4589 -1839 -8814 -10205 -4694 3139 6634
2967 6634 2756 -4680 -9534 -7165 168 6783 6792 727 -6286 -7880 -2655 5138 8576 5712 -1873 -7307
2983 -7307 -5288 1487 8030 8570 2372 -5071 -7055 -2495 5220 9328 6222 -930 -6385 -5252 1411
2998 1411 8005 8747 3330 -3806 -6383 -2090 5551 9630 7203 132 -5458 -4511 1796 8397 9317 3772
3014 3772 -3460 -6521 -2744 4040 8345 5778 -1487 -7606 -7721 -1941 4331 5784 392 -7178 -10663
3029 -10663 -7795 -611 4214 2545 -4437 -10400 -10690 -4600 2698 4675 214 -6810 -10029 -6584 742
3044 742 6297 5417 -646 -6622 -6506 -569 6560 9039 4974 -2079 -5335 -2846 4490 9692 8623 2306
3060 2306 -3785 -4827 387 7019 9306 5278 -1925 -6259 -4026 2526 7496 6917 937 -5569 -7067
3075 -7067 -2260 4614 7642 4010 -2900 -7529 -5359 940 6852 6886 1371 -5356 -7066 -2455 4344
3090 4344 8196 4957 -2145 -7111 -5460 693 6420 7181 1125 -5466 -7586 -3472 3363 6786 3629
3105 3629 -2917 -8050 -6962 -999 4921 5490 336 -6423 -8471 -4667 2058 6152 3715 -2930 -7705
3120 -7705 -6993 -803 5169 6437 1711 -4923 -7204 -3845 3075 7330 5254 -1175 -6371 -5942 -253
3135 -253 5816 7170 2452 -4092 -7009 -4012 2554 6660 4934 -1353 -6848 -6775 -1276 4547 6418 2164
3151 2164 -4475 -7480 -4673 2271 6429 5469 -594 -5611 -5793 -387 5994 7989 4374 -1777 -5159
3166 -5159 -2366 3957 8738 7793 2218 -3340 -4180 431 6665 8960 5424 -1358 -5438 -3419 2455
3181 2455 7116 6290 686 -5736 -7005 -2908 3279 5952 2272 -4130 -8154 -6428 -941 4206 3947
3196 3947 -1148 -7042 -8225 -3931 2458 5439 2881 -3326 -7350 -5732 333 5333 5780 968 -4925
3211 -4925 -6494 -2401 3720 6638 4045 -1950 -6084 -5358 76 5645 6002 1181 -4555 -6597 -3470
3226 -3470 2709 6146 3907 -2154 -6642 -5564 -305 5111 6342 1657 -4298 -6321 -2787 2924 6823
3241 6823 4902 -653 -5557 -5130 -116 5490 6446 2600 -3732 -6241 -3234 2458 5964 4646 -861
3256 -861 -5942 -6063 -1434 4076 5451 1910 -3861 -6798 -4269 1833 5919 5011 -297 -5255 -5342 -358
3272 -358 5255 7131 3830 -2007 -4998 -2772 3246 7357 6894 1375 -3637 -4363 -484 5371 7560 3960
3288 3960 -1863 -5571 -3678 1676 5685 5449 -40 -5366 -6296 -2373 3118 5475 2231 -3117 -6942
3303 -6942 -5272 62 4301 4543 -177 -5284 -6408 -2790 2666 5715 3330 -2438 -6156 -4665 385
3318 385 5113 5081 555 -4608 -6096 -2730 2668 5474 3266 -2214 -6300 -5717 -696 4350 4761 264
3334 264 -4749 -6716 -3636 1856 5229 3520 -2085 -6115 -5268 -291 4658 5510 1583 -3651 -5510 -2713
3350 -2713 2833 6329 4708 -299 -4581 -4209 442 5343 6004 2692 -2421 -4888 -2255 2934 6304
3365 6304 5267 186 -4431 -4429 -358 4625 6136 2812 -2769 -5402 -3106 2194 5712 4675 53 -4680
3381 -4680 -5105 -931 4200 6011 2967 -2514 -5551 -3416 1654 5642 5202 142 -4454 -4798 -1100 3923
3397 3923 5875 3096 -2232 -5404 -3798 1012 4991 4374 -90 -4476 -5660 -2414 2684 4267 2206
3412 2206 -3032 -6341 -4979 -371 3714 3658 -297 -4914 -6464 -2781 2152 4794 2585 -2057 -5215
3427 -5215 -4500 446 4851 5340 1509 -3238 -4851 -1645 3540 6188 4328 -245 -4267 -3512 913 5463
3443 5463 6080 2199 -2795 -4669 -2182 2384 5564 3589 -1265 -5020 -5087 -1102 3523 4146 550 -4228
3459 -4228 -5943 -3663 1366 4041 2938 -1610 -5225 -5082 -926 3778 4996 2052 -2969 -4948 -2413
3474 -2413 2439 5871 4843 603 -3682 -3802 449 4826 6113 3207 -1712 -4210 -2687 2175 5248
3489 5248 4668 75 -3918 -4581 -1412 3060 4734 1775 -3045 -5706 -4346 199 3723 2766 -1077 -5229
3505 -5229 -6043 -2645 1909 4180 1647 -2971 -5682 -3901 472 4303 4417 374 -3374 -4401 -1095
3520 -1095 3815 6076 3680 -841 -3995 -2676 1768 5597 5439 1701 -2718 -4030 -1236 3332 5717
3535 5717 3685 -1087 -4571 -3756 500 4416 4311 841 -3644 -5011 -2243 2433 4579 2869 -1435
3550 -1435 -4537 -4036 -252 4044 4529 1325 -3083 -4668 -2345 2325 4663 3301 -1223 -4691 -4558 -899
3566 -899 2906 3756 576 -3963 -6062 -4016 190 3035 1963 -2414 -6098 -6261 -2633 1803 2842 -6
3582 -6 -4064 -6013 -3924 673 3991 3464 -254 -3895 -3346 95 4563 6283 4011 -26 -2449 -424
3598 -424 3911 7071 6518 2544 -1021 -1743 1257 5292 6770 3980 -816 -3382 -2241 1409 4326 3924
3614 3924 -93 -4107 -4924 -2388 1507 3025 934 -3270 -5896 -4627 -746 2387 2412 -873 -4645 -5567
3630 -5567 -2266 1641 3629 2010 -1949 -4501 -3703 429 4043 4173 985 -2913 -4112 -1415 2614
3645 2614 4682 3091 -1027 -3823 -3403 381 3588 4254 1126 -3030 -4492 -2051 2197 4418 3116
3660 3116 -920 -4104 -3558 -81 3543 4081 1328 -2625 -4197 -2265 1970 4129 3042 -620 -4010
3675 -4010 -3946 -504 3003 4086 1085 -2891 -4726 -2974 1149 3565 2858 -995 -4264 -4380 -1151 2718
3691 2718 3800 1535 -2482 -4163 -2716 1260 4117 3555 313 -2966 -3449 -181 3588 4759 2864
3706 2864 -1205 -3208 -1741 1761 4556 4291 940 -2514 -3079 -433 3439 4781 2909 -778 -3621
3721 -3621 -2481 991 3813 3493 512 -3268 -4068 -1536 2069 3917 1927 -1974 -4715 -3479 -170
3736 -170 3003 2889 -594 -3999 -4829 -2789 1220 3050 1403 -1936 -4743 -4171 -843 2448 2949 128
3752 128 -3263 -4448 -2095 1571 3602 2483 -1117 -3680 -2647 481 3814 4152 1743 -1715 -3006
3767 -3006 -709 2718 4995 4071 574 -2397 -2134 974 4003 4747 2255 -1444 -3097 -1354 2211 4010
3783 4010 3185 -266 -3499 -3541 -694 2509 3252 790 -2699 -4624 -2955 335 2711 1925 -1215 -4050
3799 -4050 -4364 -1459 1630 2918 828 -2516 -4303 -3056 111 2945 2786 -256 -3420 -3501 -1334 2507
3815 2507 3576 1695 -1647 -3397 -2172 921 3728 3470 440 -2700 -3289 -927 2449 3827 2223
3830 2223 -1286 -3248 -2623 545 3241 3307 444 -2379 -3304 -1037 2176 4186 2626 -772 -3110 -2352
3846 -2352 583 3606 3978 1189 -1705 -2950 -958 2252 4061 2722 -430 -2724 -2522 288 2872
3861 2872 3463 883 -2303 -3656 -2147 1097 3284 1849 -1238 -3868 -3517 -831 1944 2568 321 -2814
3877 -2814 -4154 -2332 632 2897 2095 -1052 -3733 -3740 -745 2420 3081 955 -2104 -3741 -2287 1210
3893 1210 3465 2609 -90 -2739 -3119 -460 2448 3481 1579 -1199 -2892 -1872 1265 3336 2941 287
3909 287 -2289 -2793 -339 2375 3717 1692 -1280 -2896 -2033 803 3045 2996 252 -2702 -3345 -1159
3925 -1159 1574 3189 1477 -1820 -3751 -2982 21 2487 2573 34 -2604 -3458 -1283 1677 3071 1687
3941 1687 -1179 -2993 -2397 453 3116 3482 1104 -1567 -2573 -656 2180 3530 2503 -376 -2462
3956 -2462 -2171 321 2989 3322 1016 -1742 -3064 -1704 1475 2912 2262 -629 -3022 -2856 -313 2254
3972 2254 2804 902 -1913 -3091 -1594 1415 3381 2498 -148 -2503 -2356 -358 2520 3206 1179 -1592
3988 -1592 -3255 -2071 757 2547 1873 -631 -3211 -3383 -1435 1362 1947 334 -2624 -4160 -3011 -390
4004 -390 1605 1161 -963 -3239 -3628 -1377 1509 2784 1285 -1142 -2613 -1626 1483 3548 3567 1262
4020 1262 -1019 -1102 411 3413 4607 3213 476 -1467 -828 1882 3855 3718 996 -1435 -2455 -585
4036 -585 1686 2775 1449 -1681 -3345 -3028 -790 1576 1738 -700 -3198 -4068 -2540 -13 1633 698
4052 698 -1809 -3441 -3233 -761 1730 2367 173 -2124 -2994 -1443 1368 2926 1985 -148 -2395 -2072
4068 -2072 218 2494 3048 1213 -1320 -2343 -1266 1477 3286 2421 -61 -2044 -2003 -156 2547 3169
4084 3169 1213 -1379 -2695 -1160 1363 3097 2383 56 -2075 -1901 -205 2261 3044 1359 -1156 -2571
4100 -2571 -1400 782 2825 1912 -88 -2346 -2642 -991 1592 2027 620 -1898 -3504 -2361 -274 1525
4116 1525 1291 -982 -2985 -3525 -1669 827 1807 729 -1952 -3418 -2454 -61 1893 1960 -200 -1904
4132 -1904 -2544 -688 1862 3264 1883 -264 -1718 -1138 1223 3471 3255 1377 -1020 -1435 266 2521
4148 2521 3547 2669 188 -1386 -1117 815 2597 2827 816 -1455 -2335 -1098 1262 2179 1442 -975
4164 -975 -2792 -2396 -451 1807 1613 113 -2279 -3138 -1865 293 1742 1370 -1067 -2973 -2871 -748
4180 -748 1540 1845 509 -1472 -2788 -1626 606 2568 1884 -410 -2190 -2227 70 1822 2466 1253
4196 1253 -1098 -1958 -1225 846 2671 2160 -25 -1784 -1923 -420 1812 2455 1396 -735 -2392 -1633
4212 -1633 476 2073 1825 -93 -2193 -2581 -1147 1403 2128 863 -1081 -2655 -2019 30 2206 1740
4228 1740 8 -2085 -2490 -871 1206 2346 1321 -606 -1953 -1667 285 2226 2030 388 -1606 -2136
4244 -2136 -780 1392 2335 1683 -521 -2092 -1679 340 2099 2188 550 -1416 -1989 -871 1332 2335
4260 2335 1777 -156 -1760 -1599 360 2328 2728 1109 -707 -1513 -777 1608 2767 2351 -53 -1803
4276 -1803 -1687 29 2001 2328 742 -1448 -2463 -1327 380 1749 865 -735 -2723 -2706 -1112 713
4292 713 1264 50 -2415 -3289 -2002 -463 1248 848 -994 -2606 -2747 -1008 1178 1720 786 -1338 -2053
4309 -2053 -1025 568 2261 2082 82 -1334 -1724 -143 1903 2845 1696 -420 -1611 -777 1051 2599
4325 2599 2415 807 -862 -1440 -146 1844 2692 1596 -476 -1511 -900 855 2355 2302 519 -1302
4341 -1302 -1585 -482 1636 2362 1404 -846 -1997 -1706 -54 1856 1626 43 -1885 -2642 -1541 492
4357 492 1386 497 -1239 -2859 -2368 -593 855 1167 -325 -2073 -2699 -1539 401 1286 760 -994 -2178
4374 -2178 -2179 -428 1230 1861 442 -1287 -2143 -1023 1186 2262 1609 49 -1496 -1296 114 1708 2458
4391 2458 844 -773 -1394 -432 1385 2591 2152 543 -1247 -1185 221 1937 2367 1421 -635 -1451 -815
4408 -815 905 2255 1761 217 -1517 -1506 -177 1278 1533 694 -1058 -2382 -1614 132 1498 919 -336
4425 -336 -1957 -2295 -905 741 1588 432 -1173 -2341 -1680 -96 1546 1434 -62 -1641 -1749 -512
4441 -512 1054 2051 1161 -483 -1587 -1138 646 2158 2079 699 -1082 -1877 -376 1052 2124 959 -649
4458 -649 -1655 -1404 134 1329 1464 105 -1445 -2260 -1194 590 1428 952 -610 -2150 -1827 -475 972
4475 972 1228 110 -1696 -1934 -1256 613 1603 982 -311 -1674 -1738 -68 1424 1877 853 -792 -1449
4492 -1449 -674 1022 2158 1648 231 -898 -883 222 1698 2405 1109 -219 -1248 -448 1232 2173 1649
4509 1649 396 -1094 -1199 200 1504 2188 817 -428 -1508 -1094 710 1808 1533 -131 -1326 -1808
4525 -1808 -314 1242 1513 648 -1174 -2140 -1395 -97 1095 823 -108 -2129 -2425 -1113 83 1172 124
4542 124 -1443 -2435 -2002 -681 622 760 -625 -1833 -2157 -1156 384 1246 509 -1084 -1719 -1545 -43
4559 -43 1381 1665 609 -881 -1258 -312 1059 2136 1750 135 -808 -896 556 2168 2076 1023 -331 -1141
4577 -1141 -204 975 1868 1458 163 -1180 -1016 158 1450 1829 588 -973 -1555 -743 418 1357 1116
4594 1116 -237 -1670 -1183 -462 896 1347 564 -1032 -1958 -944 322 1474 1206 -465 -1386 -1446 -351
4611 -351 863 1298 798 -852 -1818 -1095 470 1435 1270 0 -1051 -1325 -44 1368 1479 754 -588
4628 -588 -1120 -835 482 1560 1436 105 -1025 -1074 -165 1240 1702 810 -452 -1393 -958 50 1154 1188
4646 1188 140 -1246 -1692 -706 626 1467 622 -433 -1786 -1521 51 1203 1093 11 -1282 -1817 -1040
4663 -1040 532 1116 844 -862 -1747 -1318 -201 734 1018 -296 -1371 -1856 -963 369 990 751 -483
4680 -483 -1590 -1315 -532 940 1348 349 -924 -1293 -532 828 1575 1301 -34 -973 -649 296 1589 2132
4698 2132 1208 -6 -797 -93 1030 2070 1756 504 -676 -826 117 1322 1797 1173 -90 -1104 -907
4715 -907 538 1321 1302 18 -1317 -1184 -428 476 1274 556 -788 -1332 -931 86 1142 809 -87 -1098
4733 -1098 -1416 -609 619 1249 465 -789 -1539 -1562 -100 909 883 -22 -1402 -1455 -719 621 1057 708 -576
4752 -576 -1348 -1107 -197 1034 1169 380 -1099 -1400 -702 502 1213 718 -246 -1298 -1175 -174 1077 1231
4770 1231 318 -1069 -1287 -851 597 1234 614 -428 -1541 -1192 -287 1051 1188 569 -633 -1239 -548 534
4788 534 1305 1067 -340 -874 -910 -187 1106 1423 446 -409 -1172 -621 778 1222 1042 185 -974 -838 93
4807 93 1064 1540 997 -357 -835 -244 794 1810 1386 396 -665 -898 187 1266 1595 882 -193 -795
4825 -795 -723 283 1014 1027 39 -1060 -1406 -778 357 728 194 -1137 -1884 -1667 -332 449 350 -681 -1569
4844 -1569 -1663 -1064 104 441 19 -1250 -1615 -1485 -342 483 570 -279 -1227 -1190 -650 500 1082 951 -373
4863 -373 -969 -597 100 1346 1282 764 -242 -770 156 1157 1585 1367 381 -700 -520 637 1588 1748 1174
4882 1174 -209 -600 -87 1057 1726 1321 322 -610 -493 184 1226 1195 312 -744 -957 -721 279 888
4900 888 734 -473 -1368 -1234 -599 383 564 -169 -1044 -1839 -1252 -267 411 119 -737 -1389 -1542 -586 452
4919 452 802 -64 -820 -1373 -977 210 865 816 -101 -978 -856 -188 876 1205 730 -356 -927 -530 350
4938 350 1054 792 122 -625 -908 -49 756 1302 868 -280 -895 -771 206 1184 1252 482 -840 -665 -128 672
4958 672 1027 608 -217 -877 -718 330 1151 1086 393 -361 -964 -371 907 1243 861 -22 -556 -725 182 1110
4978 1110 1284 441 -502 -755 -231 370 1291 935 -110 -694 -829 -54 810 852 258 -803 -997 -757 129
4997 129 736 234 -516 -1279 -929 -381 346 539 56 -420 -1324 -762 12 621 607 -267 -944 -1187 -411 431
5017 431 641 80 -1044 -1263 -1313 105 718 378 -313 -1166 -1282 -413 201 744 256 -711 -1115 -906 38 882
5037 882 597 144 -553 -926 -155 767 1066 670 26 -866 -279 334 1456 1547 647 -188 -413 15 980 1376
5057 1376 949 10 -336 -454 519 900 765 384 -574 -713 -294 742 961 545 -279 -871 -794 -69 694 1042
5077 1042 53 -762 -844 -536 281 960 709 -411 -884 -481 -52 669 876 76 -476 -828 -341 275 899 490
5097 490 -57 -690 -1177 -99 699 843 70 -748 -1190 -624 202 669 579 -285 -895 -835 -332 453 701 345
5117 345 -710 -1234 -576 207 643 425 -167 -765 -1213 -86 486 689 4 -534 -811 -620 130 726 587
5136 587 107 -687 -726 -55 647 991 474 -202 -782 -511 -17 525 605 124 -581 -1007 -447 268 510 244 -367
5157 -367 -838 -670 -26 722 808 87 -538 -651 20 649 1064 799 58 -494 -147 653 1277 1030 578 -112
5177 -112 -395 109 854 1496 1004 188 -194 -119 373 942 983 397 -132 -632 -350 519 398 284 -404 -837 -1048
5198 -1048 -147 275 350 85 -796 -984 -971 -156 391 328 -76 -750 -1043 -406 92 316 101 -549 -1242 -587 99
5219 99 444 209 -412 -829 -1086 -692 30 159 8 -725 -1044 -806 -237 560 515 -290 -514 -788 -348 536 848
5240 848 444 6 -235 -248 327 1149 1172 600 -207 -315 298 968 1087 1099 171 -177 -45 421 1089 940 555
5261 555 -75 -554 -71 631 970 515 -24 -558 -488 91 456 615 205 -592 -788 -246 303 466 177 34
5281 34 -755 -545 -379 543 473 -109 -676 -844 -363 172 456 417 -235 -894 -715 -86 581 709 142 -319 -780
5302 -780 -315 26 492 339 -250 -599 -724 -293 236 303 185 -458 -986 -372 132 158 63 -218 -944 -922 -173
5323 -173 372 542 -139 -524 -1029 -555 126 475 468 -195 -469 -762 -227 664 950 286 -172 -388 -101 462 920
5344 920 876 292 -67 -235 60 797 897 1131 265 -175 112 682 1184 1106 363 -272 -296 332 855 841 487
5365 487 -297 -661 -427 1 478 573 -180 -435 -892 -716 86 377 31 -813 -1525 -1096 -400 -2 255 -421
5385 -421 -815 -1146 -808 -276 124 237 -488 -1002 -702 -143 427 351 -74 -672 -618 -294 148 474 239 104 -371
5406 -371 -271 182 373 506 310 3 -477 190 335 637 700 209 -309 -75 381 599 1158 760 1 125
5426 125 195 621 1060 773 581 -231 62 339 625 759 383 -6 -418 -155 231 642 338 -100 -700 -760 -342
5447 -342 -63 220 -165 -737 -834 -752 -123 -79 30 -396 -828 -723 -555 0 228 -89 -423 -849 -509 -40 352
5468 352 613 -129 -431 -451 -437 187 590 488 -160 -478 -556 -107 487 377 123 -267 -614 -362 -157 319 44
5489 44 -392 -601 -357 -198 218 314 -87 -352 -612 -470 130 485 60 65 -632 -275 -54 484 602 460 -73
5510 -73 -242 -21 437 737 613 269 -185 -80 246 691 576 329 143 -122 54 468 787 385 204 -152
5530 -152 -460 6 519 646 145 -94 -349 -289 253 717 254 51 -149 -442 -63 41 267 153 -204 -558
5550 -558 -365 295 284 385 26 -466 -741 -223 132 248 176 -235 -636 -368 -151 290 342 178 -435 -462 -224
5571 -224 55 312 93 -279 -533 -489 -150 430 70 -86 -597 -393 -431 41 326 119 -388 -348 -341 -240 231 287
5593 287 313 79 -254 -252 49 349 444 -2 -120 -93 216 644 668 413 -46 -291 15 41 551 512 34 -234 -526
5616 -526 163 217 354 89 -342 -468 -314 134 428 452 11 -387 -438 -199 362 467 247 -3 -198 -185 179
5637 179 455 732 358 4 -200 76 500 413 383 -121 -439 -404 -183 416 168 62 -112 -388 84 134 395
5658 395 189 -235 -305 -399 -109 376 214 -38 -351 -464 -297 212 353 74 -424 -396 -364 73 49 222 75 20
5680 20 -311 74 273 422 221 -331 -212 -433 -82 137 74 -48 -759 -384 -324 -130 -178 -197 -508 -775 -495 -347
5702 -347 -151 5 -10 -386 -351 -277 102 67 83 -134 -176 4 166 479 420 453 221 192 305 727 826 643 243
5725 243 388 218 405 671 738 732 212 31 -46 359 451 540 15 -206 -439 33 232 45 127 -264 -212 -324 -12
5748 -12 181 84 -52 -381 -566 -140 205 21 -218 14 -229 -278 -51 66 207 -130 -263 -549 -297 109 52
5769 52 12 -405 -370 -283 -321 -84 451 -73 -645 -491 -322 39 272 -187 -270 -225 -43 -65 275 482 212 -268 -285
5792 -285 183 384 286 302 176 -334 -201 157 250 382 14 -209 -35 -62 364 402 29 -129 -215 -268 197 287 189
5815 189 103 46 -405 -13 182 487 446 54 -131 -262 34 244 288 337 -129 -250 147 -153 281 219 56 -271
5837 -271 -226 -88 303 426 267 -17 -370 171 358 478 90 -8 68 -271 -239 155 315 191 -48 -265 -216 -274
5859 -274 30 -87 -355 -623 -212 -334 -172 21 195 -156 -397 -629 -221 -370 -100 -353 -481 -459 -370 270 -50
5880 -50 67 -112 -265 31 143 409 457 323 24 156 70 488 624 538 232 129 9 327 446 414 460 170
5902 170 0 221 205 142 482 174 -114 -284 33 307 243 73 -275 -594 -216 -111 138 51 -28 -319 -342 -172
5924 -172 -51 115 -19 -187 -402 -124 -16 35 25 -204 -352 -316 -145 -264 -113 -314 -124 -382 -254 149 92
5945 92 -138 -322 -582 -479 -128 -12 174 36 -161 -156 75 94 348 89 52 -18 -126 116 365 625 460 -142
5967 -142 -177 83 438 515 308 44 225 -120 220 302 188 112 -35 -208 78 -33 399 103 -14 -57 -447 -133
5989 -133 142 316 100 153 -467 -175 -43 359 148 46 -204 -235 -303 -90 59 -118 81 -62 -127 3 191
6010 191 65 -11 -124 -258 -102 -99 514 82 -5 -153 -208 118 239 254 321 -265 -23 22 26 443 326 -68 -336
6033 -336 -17 75 164 -97 175 -60 -159 -397 -35 95 12 -67 -76 19 -35 38 82 -159 -130 -16 -280 90 121 -70
6057 -70 -198 -59 -210 -234 35 127 -203 -30 -45 -33 -63 -31 200 76 -74 67 123 222 292 114 -170 113 51 111
6081 111 145 229 -176 -172 274 8 58 109 24 147 77 -94 -18 313 83 97 -25 -105 -185 -39 35 176 239 -129 215
6106 215 324 137 165 185 -11 -299 195 122 258 314 -373 -256 -158 -305 -69 -112 -3 -438 -133 -254 119 -317
6128 -317 -103 -183 -312 -214 -78 134 134 123 -11 -239 -171 240 371 303 17 -155 84 182 -17 225 313 152 156 -2
6152 -2 143 17 33 270 -77 -58 -83 -56 -118 -138 -400 -330 -303 -135 -239 -83 -155 -160 -105 -120 37 -82 -118 -27 -243 -44
6178 -44 -123 -51 139 49 94 -96 257 2 204 124 -6 258 -68 -70 208 184 248 46 -85 331 88 299 -35
6201 -35 342 -165 96 -23 117 424 142 51 -76 226 -48 215 293 44 -86 -56 -3 185 148 52 -90 -203
6223 -203 -41 99 238 -44 144 -80 -321 -142 -238 83 -85 -25 -325 -189 -234 6 -198 -172 -30 -541 -397
6244 -397 -261 -105 -154 -225 -349 -196 -270 -34 12 -140 -454 -285 147 -154 193 94 51 13 -47 -25 80 248 400
6267 400 85 -65 -90 264 428 172 85 171 232 -77 339 226 213 72 -89 97 47 -86 23 153 -289 -155
6289 -155 -281 -122 -155 -213 47 -53 -334 -190 -144 94 123 4 -25 -242 -128 -40 -66 -152 -36 114 42 108 112 134
6313 134 318 -91 82 71 159 182 54 181 178 123 182 137 -11 10 -127 -4 -135 218 255 57 77 59 65 26 -254
6338 -254 -129 156 -106 -197 -54 169 -70 -220 144 125 124 -11 6 207 -10 -132 56 -106 34 212 92 79
6360 79 -215 177 228 239 83 -106 -43 -148 264 72 75 147 48 -103 154 93 7 157 107 227 -27 109 128 66
6384 66 150 81 29 112 63 275 8 -43 -2 171 174 2 239 230 -32 -34 -83 -135 71 278 -73 72 -299 -34 -158
6409 -158 -246 -161 12 35 -201 -300 -74 -237 -223 -120 -202 -218 40 -51 251 19 -142 -143 -47 162 -157 95 -19 -35
6433 -35 -2 160 25 62 20 163 31 194 -178 35 -114 128 70 97 -25 2 104 14 122 86 -55 -253 150
6456 150 -24 -28 17 -15 244 110 115 168 69 -55 147 338 195 177 -125 -118 171 38 -144 101 33 -229 -140 90
6480 90 -167 1 -63 -32 -316 -163 -142 -249 -314 -58 55 -285 -23 -109 168 169 253 -77 73 82 47 117 -108 121
6504 121 253 41 21 132 179 91 -202 65 21 21 -72 89 89 69 -43 -192 -11 58 -83 47 115 137 -27 -77 40
6529 40 -32 -98 -105 202 22 305 346 -149 40 3 418 95 9 257 -110 73 121 -74 45 -85 -88 -92 -24 -185 -145
6554 -145 -281 -62 5 -23 -2 -101 -276 46 -47 -199 148 -59 82 -58 -113 -56 36 86 7 51 239 271 39 108
6578 108 179 171 250 191 163 -25 -174 251 37 139 22 -113 -275 -149 -5 89 68 -70 87 -238 -200 27 30 -170
6602 -170 -311 -228 88 -67 -126 -135 -90 108 42 24 -102 372 21 -150 34 35 215 -24 -1 100 -6 13 112 159
6626 159 45 276 46 44 367 88 19 162 -137 76 280 -104 91 312 267 61 19 -151 238 103 -135 84
6648 84 -245 -95 93 307 240 94 -37 -147 -58 111 134 -38 39 -361 -131 -227 -76 -70 -67 -145 -153 -107 -112 -83 -45 13
6674 13 -149 -56 -210 45 86 304 57 -289 -335 50 87 170 32 -6 35 193 63 206 143 84 130 104 163 193 256
6699 256 -76 16 -69 150 94 9 203 4 58 -135 -118 -103 -96 85 -457 -150 -164 -72 -6 -29 -87 -135 -437 -208 -211 79
6725 79 -66 -484 -219 -188 -24 227 216 198 -61 1 83 235 338 222 -49 120 -15 -82 352 134 28 -26 161
6748 161 88 90 253 -31 -5 -228 -20 38 30 3 -176 45 8 33 206 -84 14 112 -67 378 299 -81 80 44 159
6773 159 -54 108 -106 165 96 1 -246 87 -11 -80 -302 -206 -272 -154 -247 -61 -128 -173 81 -105 -255 -240 42
6796 42 -6 165 -114 -138 262 213 88 22 -50 3 -148 -15 131 -4 -57 147 234 -128 -78 170 245 -57 -41 29
6820 29 373 144 -198 97 -268 -228 -175 -121 -290 -50 -147 -273 -318 -155 -258 -115 -88 -231 -297 263 -35 -66 193
6843 193 -18 -9 -87 74 44 138 21 176 1 232 67 126 338 -68 99 -96 -93 -12 -96 94 -37 -145 -26
6866 -26 -85 97 -11 -133 21 -78 -11 70 363 156 75 72 -88 180 7 -28 -28 62 -240 -67 50 226 155 157 255
6891 255 -28 366 -102 377 2 7 -314 -224 225 -122 -53 -143 -358 -149 -156 -128 -148 14 -130 -291 -269 -35 151
6914 151 171 -76 7 -102 -125 235 141 -100 90 -59 -33 -16 176 148 150 61 73 149 31 185 469 -8 -95 231
6938 231 99 249 21 4 -41 -312 206 166 -7 -217 -195 -372 -121 -78 242 19 -217 -191 52 -163 85 206
6960 206 -86 -46 -36 34 -90 37 48 -79 -267 -55 170 -137 -65 61 -28 -242 13 -270 32 272 -236 -403
6982 -403 -17 -225 -91 21 3 -293 -386 -308 -20 140 271 261 135 253 182 58 218 368 33 468 4 234
7004 234 399 -33 167 191 -259 -76 68 339 372 306 41 -196 101 216 184 35 35 -377 -11 111 -141 -54
7026 -54 15 -275 -524 -272 -187 44 -94 -174 -330 -96 65 -298 -6 16 -20 -98 -4 153 193 -138 -316 -44 50
7049 50 -41 218 484 -17 -99 45 18 164 62 -122 25 -83 -34 53 247 244 156 -250 -93 30 51 100 141 -145
7073 -145 -407 18 -88 157 76 283 80 -167 66 -41 172 164 -22 -64 -184 130 271 154 117 -412 -458 -118
7095 -118 -10 119 -21 -22 -92 -122 0 249 212 -79 51 -200 -107 -64 284 172 118 -27 -252 237 172 167 340 -142
7119 -142 -73 60 -282 314 -52 105 25 -94 90 123 179 25 -148 -236 -101 66 -102 -92 -124 -386 -183 -49
7141 -49 -96 41 -53 -103 -554 -332 -58 283 275 206 -295 -149 139 100 131 16 -126 231 -392 -115 176 144 262
7164 262 29 -69 -83 277 161 205 173 -3 54 360 134 107 269 -98 2 76 291 115 93 95 -337 47 168
7187 168 277 246 106 -162 -177 -69 -2 206 178 -32 17 -232 19 299 61 169 -127 -117 -26 -19 0 -29 -248 9
7211 9 -140 47 -56 -134 144 23 -251 -123 55 333 47 113 -123 -131 32 -38 305 118 59 -118 -137 170 53
7234 53 355 47 10 113 -78 254 433 111 210 -163 -186 -85 285 -50 72 -185 -196 -165 378 385 -20 -110 -207
7257 -207 -69 -123 275 30 -208 -229 19 -21 -41 177 420 -132 -375 -376 -73 -64 302 -39 -93 -301 -51 16 85 -64
7281 -64 -122 -397 -132 -204 -224 201 -236 -175 -385 -302 0 85 20 11 -219 -260 111 263 174 249 -82 107 309 268 253
7306 253 118 7 -117 54 168 161 301 246 208 -198 131 293 199 158 18 -27 16 3 67 -101 44 -453 -250
7329 -250 -113 -22 211 40 -26 -244 -280 75 263 347 -28 64 -342 100 320 181 103 -153 -102 -115 -52 -6 272
7352 272 -11 10 -204 -263 44 221 90 139 -138 -215 -285 -94 297 -187 -198 -95 -417 -89 57 178 50 -44
7374 -44 -337 -278 4 43 42 92 -259 19 -42 59 357 133 -43 -180 -1 -36 144 133 -92 -61 -6 -82 0 77 251
7399 251 -97 -138 -32 -31 70 151 -34 -132 -92 326 -8 183 60 156 -234 189 -33 145 45 239 -55 52
7421 52 74 137 294 220 -118 -142 -37 218 579 236 74 -17 -174 284 43 362 88 -76 -135 -260 -91 -50 192
7444 192 -290 -161 -41 -134 -130 72 28 -64 -302 -425 -169 -30 -52 -69 -421 -113 -136 104 68 5 -328 -13 -34 -131
7468 -131 70 189 332 17 5 -81 56 55 88 100 -209 38 212 21 478 43 -70 56 -198 -58 208 130
7490 130 48 -136 -168 -185 -151 184 80 -34 -80 -100 107 -4 86 -230 -255 -282 39 -57 162 -194 -218 -62 -162 -89
7514 -89 74 100 -196 -260 -125 51 10 169 -136 -230 -81 -252 -122 112 136 17 -239 -270 135 323 214 47
7536 47 -55 160 -180 -80 163 452 262 -46 68 0 177 302 115 205 117 -62 303 362 163 111 -160 -35
7558 -35 111 217 40 321 86 30 71 -317 39 300 -268 -274 -79 -278 -103 -175 -168 -299 -285 -271 -131 -191 240 -207
7582 -207 -616 -111 -29 121 289 127 -313 -204 -359 -15 501 210 -176 -16 -191 151 125 -2 -22 -11 -132
7603 -132 -75 149 57 246 77 -176 -200 -95 183 334 299 -103 -240 -152 124 113 16 -25 14 -75 -76 72 167 121 -60
7628 -60 -100 -128 -163 190 353 131 -41 -142 -118 -106 221 145 133 -17 -166 -130 244 21 268 -91 -219 257 113
7651 113 101 89 -104 -97 -105 -206 95 86 -101 -53 -110 -168 28 193 112 111 -51 -163 146 -84 80 39 -1 -389 86
7676 86 15 -18 -120 -191 -190 -355 -14 20 189 213 26 -240 -224 85 128 418 178 -241 -116 -163 450 211 230 -318
7700 -318 -181 -30 64 65 175 -139 -382 -167 -253 -159 20 168 -65 -87 -95 68 2 117 -121 -223 -19 180 -206
7723 -206 338 199 -46 77 -183 -17 99 94 198 -53 -189 -91 -174 99 8 -316 -313 -157 136 -53 178 -284
7745 -284 -106 -102 -129 -40 -127 341 -10 -182 24 25 269 220 114 86 -394 205 124 27 353 259 145 247 182 3
7769 3 217 128 255 38 -113 13 275 102 -18 -112 -256 -56 193 189 202 -21 -91 -58 63 274 179 -154 -6
7792 -6 92 303 140 251 364 271 -186 175 188 239 496 -133 -49 -109 186 105 140 152 -46 -214 -64 23 -58 -9 -103
7817 -103 -110 -413 -204 117 -31 -200 -596 -321 -539 -132 -281 -69 -334 -233 -271 -128 74 8 26 -210 -169 -128
7839 -128 2 9 363 -122 -50 -35 -92 29 603 315 155 150 52 -40 153 213 277 -150 -59 -268 30 94 235 58
7863 58 104 20 63 87 330 35 -80 87 -89 112 -32 138 3 -75 -175 50 257 304 197 -37 -10 -20 73
7886 73 4 -157 -193 -332 -273 -179 -84 93 138 -154 24 -353 -20 -151 -10 -143 -214 -391 136 224 139 132 -83 -35
7910 -35 249 -99 254 -20 -304 -216 -147 -122 -14 460 346 -111 49 -243 -44 59 33 -150 185 -150 -155 29
7932 29 157 275 -409 -143 21 -214 93 264 -203 -200 -85 -74 48 208 -40 -31 20 -474 -74 66 -191 30
7954 30 -269 -216 -39 -2 219 23 16 -140 -108 349 179 133 5 -159 -268 42 5 238 146 -93 -68 -198 117
7977 117 316 347 151 -5 2 -36 55 177 109 61 21 -202 -239 68 53 74 -28 -188 -176 42 93 76 -179 -168 -489
8002 -489 -226 199 60 -1 22 -101 -89 -388 108 360 15 -104 -96 -71 -10 -33 255 113 49 -33 317 251 286 109
8026 109 -78 -332 -73 155 85 118 12 -86 6 62 -32 225 -92 -210 -32 -13 81 42 -5 5 -457 -97 49 18
$$ [...]
8191B61
##END NTUPLES=NMR FID
##END=
