##TITLE=1H_Pr 2-C6-HCl
 D2O, 8 sc, 
 9.7.2020
##JCAMPDX= 6.0         $$ Bruker NMR JCAMP-DX V2.0
##DATA TYPE= NMR FID
##DATA CLASS= NTUPLES
##ORIGIN= UXNMR, Bruker Analytische Messtechnik GmbH
##OWNER= root
$$ XWIN-NMR		Version 3.5
$$ Thu Jul  9 11:57:48 2020 Russian Standard Time (UT+4h)  she@DPX200
##.OBSERVE FREQUENCY= 200.1315
##.OBSERVE NUCLEUS= ^1H
##.DELAY= (6, 6)
##.ACQUISITION MODE= SIMULTANEOUS
##.ACQUISITION SCHEME= undefined
##.AVERAGES= 8
##.DIGITISER RES= 18
##SPECTROMETER/DATA SYSTEM= spect
##.PULSE SEQUENCE= zg30
##.SOLVENT NAME= D2O
##.SHIFT REFERENCE= (INTERNAL, D2O, 0, 15.7039)
##AUDIT TRAIL= $$ (NUMBER, WHEN, WHO, WHERE, WHAT)
$$ ##TITLE= Audit trail, XWIN-NMR		Version 3.5
$$ ##JCAMPDX= 5.01
$$ ##ORIGIN= Bruker BioSpin GmbH
$$ ##OWNER= she
$$ F:/spectra/data/she/nmr/H-F/1/audita.txt
$$ ##AUDIT TRAIL=  $$ (NUMBER, WHEN, WHO, WHERE, WHAT)
(   1,<2020-07-09 11:56:44.15 +0400>,<she>,<DPX200>,
      <created by zg, POWCHK disabled, PULCHK disabled
       configuration hash MD5:
       00 E9 B6 7A A2 85 ED C7 34 08 36 98 17 FE 4E 26
       data hash MD5: 16K
       DD 52 D3 37 03 BF EB 3A 83 96 8E A6 2E D6 BC E9>)
$$ ##END=
$$ 
$$ hash MD5
$$ D3 01 2D 88 FA CD 97 46 BC 0C 2C CC 86 D3 F2 F9
##$RELAX= 
##$RELAX= 
##$RELAX= 
##$RELAX= 
##$RELAX= 
##$RELAX= 
$$ Bruker specific parameters
$$ --------------------------
##$DU= <F:/spectra>
##$EXPNO= 1
##$NAME= <H-F>
##$PROCNO= 1
##$TYPE= <nmr>
##$USER= <she>
##$AMP= (0..31)
100 100 100 100 100 100 100 100 100 100 100 100 100 100 100 100 100 100 
100 100 100 100 100 100 100 100 100 100 100 100 100 100 
##$AQSEQ= 0
##$AQ_mod= 1
##$AUNM= <au_zg>
##$AUTOPOS= <>
##$BF1= 200.13
##$BF2= 200.13
##$BF3= 200.13
##$BF4= 200.13
##$BF5= 200.13
##$BF6= 200.13
##$BF7= 200.13
##$BF8= 200.13
##$BYTORDA= 1
##$CFDGTYP= 0
##$CFRGTYP= 5
##$CHEMSTR= <none>
##$CNST= (0..31)
1 1 145 1 1 1 1 1 1 1 1 1 1 1 1 1 1 1 1 1 1 1 1 1 1 1 1 1 1 1 1 1 
##$CPDPRG= <>
##$CPDPRG1= <>
##$CPDPRG2= <>
##$CPDPRG3= <>
##$CPDPRG4= <mlev>
##$CPDPRG5= <mlev>
##$CPDPRG6= <mlev>
##$CPDPRG7= <mlev>
##$CPDPRG8= <mlev>
##$CPDPRGB= <>
##$CPDPRGT= <>
##$D= (0..31)
0 1.2 0 0 0 0 0 0 0 0.06 0 0.03 0 0 0 0 0.0002 0 0 0 0 0 0 0 0 0 0 0 0 
0 0 0 
##$DATE= 1594281403
##$DBL= (0..7)
120 120 120 120 120 120 120 120 
##$DBP= (0..7)
150 150 150 150 150 150 150 150 
##$DBP07= 0
##$DBPNAM0= <>
##$DBPNAM1= <>
##$DBPNAM2= <>
##$DBPNAM3= <>
##$DBPNAM4= <>
##$DBPNAM5= <>
##$DBPNAM6= <>
##$DBPNAM7= <>
##$DBPOAL= (0..7)
0.5 0.5 0.5 0.5 0.5 0.5 0.5 0.5 
##$DBPOFFS= (0..7)
0 0 0 0 0 0 0 0 
##$DE= 6
##$DECBNUC= <off>
##$DECIM= 24
##$DECNUC= <off>
##$DECSTAT= 4
##$DIGMOD= 1
##$DIGTYP= 9
##$DL= (0..7)
0 120 120 120 120 120 120 120 
##$DP= (0..7)
150 150 150 150 150 150 150 150 
##$DP07= 0
##$DPNAME0= <>
##$DPNAME1= <>
##$DPNAME2= <>
##$DPNAME3= <>
##$DPNAME4= <>
##$DPNAME5= <>
##$DPNAME6= <>
##$DPNAME7= <>
##$DPOAL= (0..7)
0.5 0.5 0.5 0.5 0.5 0.5 0.5 0.5 
##$DPOFFS= (0..7)
0 0 0 0 0 0 0 0 
##$DQDMODE= 0
##$DR= 18
##$DS= 0
##$DSLIST= <SSSSSSSSSSSSSSS>
##$DSPFIRM= 0
$$ [...]
##$SUBNAM2= <"">
##$SUBNAM3= <"">
##$SUBNAM4= <"">
##$SUBNAM5= <"">
##$SUBNAM6= <"">
##$SUBNAM7= <"">
##$SUBNAM8= <"">
##$SUBNAM9= <"">
##$SW= 24.9337058887773
##$SWIBOX= (0..15)
0 0 2 0 0 0 0 0 0 0 0 0 0 0 0 0 
##$SW_h= 4990.01996007984
##$TD= 16384
##$TD0= 1
##$TE= 0
##$TE2= 300
##$TE3= 300
##$TEG= 300
##$TL= (0..7)
0 120 120 120 120 120 120 120 
##$TP= (0..7)
150 150 150 150 150 150 150 150 
##$TP07= 0
##$TPNAME0= <>
##$TPNAME1= <>
##$TPNAME2= <>
##$TPNAME3= <>
##$TPNAME4= <>
##$TPNAME5= <>
##$TPNAME6= <>
##$TPNAME7= <>
##$TPOAL= (0..7)
0.5 0.5 0.5 0.5 0.5 0.5 0.5 0.5 
##$TPOFFS= (0..7)
0 0 0 0 0 0 0 0 
##$TUNHIN= 0
##$TUNHOUT= 0
##$TUNXOUT= 0
##$USERA1= <user>
##$USERA2= <user>
##$USERA3= <user>
##$USERA4= <user>
##$USERA5= <user>
##$V9= 5
##$VALIST= <valist>
##$VCLIST= <CCCCCCCCCCCCCCC>
##$VD= 0
##$VDLIST= <DDDDDDDDDDDDDDD>
##$VPLIST= <PPPPPPPPPPPPPPP>
##$VTLIST= <TTTTTTTTTTTTTTT>
##$WBST= 1024
##$WBSW= 4
##$XGAIN= (0..3)
0 0 0 0 
##$XL= 0
##$YL= 0
##$YMAX_a= 160853
##$YMIN_a= -119620
##$ZGOPTNS= <>
##$ZL1= 120
##$ZL2= 120
##$ZL3= 120
##$ZL4= 120
##$ABSF1= 10
##$ABSF2= 0
##$ABSG= 5
##$ABSL= 3
##$ALPHA= 0
##$AQORDER= 0
##$ASSFAC= 0
##$ASSFACI= 0
##$ASSFACX= 0
##$ASSWID= 0
##$AUNMP= <proc_1d>
##$AZFE= 0.1
##$AZFW= 0.1
##$BCFW= 1
##$BC_mod= 2
##$BYTORDP= 1
##$COROFFS= 0
##$CY= 11.3945322036743
##$DATMOD= 1
##$DC= 2
##$DFILT= <>
##$DTYPP= 0
##$F1P= 16.9975609425685
##$F2P= -3.02152046262296
##$FCOR= 0.5
##$FTSIZE= 0
##$FT_mod= 4
##$GAMMA= 1
##$GB= 0.15
##$INTBC= 1
##$INTSCL= 1
##$ISEN= 128
##$LB= 0.24
##$LEV0= 0
##$LPBIN= 0
##$MAXI= 10000
##$MC2= 0
##$MEAN= 0
##$ME_mod= 0
##$MI= 1.114404
##$NCOEF= 0
##$NC_proc= 0
##$NLEV= 6
##$NOISF1= 3.799351
##$NOISF2= 2.8
##$NSP= 1
##$NTH_PI= 0
##$NZP= 0
##$OFFSET= 15.70392
##$PC= 1
##$PHC0= -9875.943
##$PHC1= 15.40092
##$PH_mod= 1
##$PKNL= yes
##$PPARMOD= 0
##$PSCAL= 0
##$PSIGN= 0
##$REVERSE= no
##$SF= 200.130013532006
##$SI= 16384
##$SIGF1= 3
##$SIGF2= 2
##$SINO= 400
##$SIOLD= 16384
##$SREGLST= <1H.CDCl3>
##$SSB= 0
##$STSI= 0
##$STSR= 0
##$SW_p= 3612.71676300578
##$SYMM= 0
##$S_DEV= 0
##$TDeff= 0
##$TDoff= 0
##$TI= <>
##$TILT= no
##$TM1= 0
##$TM2= 0
##$TOPLEV= 0
##$USERP1= <user>
##$USERP2= <user>
##$USERP3= <user>
##$USERP4= <user>
##$USERP5= <user>
##$WDW= 1
##$XDIM= 8192
##$YMAX_p= 0
##$YMIN_p= 0
$$ End of Bruker specific parameters
$$ ---------------------------------
##NTUPLES= NMR FID
##VAR_NAME=  TIME,          FID/REAL,        FID/IMAG
##SYMBOL=    X,             R,               I
##VAR_TYPE=  INDEPENDENT,   DEPENDENT,       DEPENDENT
##VAR_FORM=  AFFN,          ASDF,            ASDF
##VAR_DIM=   8192,          8192,            8192
##UNITS=     SECONDS,       ARBITRARY UNITS, ARBITRARY UNITS
##FACTOR=    0.0002004,     1,               1
##FIRST=     0,             0,               0
##LAST=      1.6414764,     0,               0
##MIN=       0,             -119620,         0
##MAX=       1.6414764,     160853,          0
$$ Real data points
##PAGE= N=1
##DATA TABLE= (X++(R..R)), XYDATA
0@%%%%%%%%%qJ6j6J6j6K4l2L2m0M8n6O5p3Q8j04J20j36J56j80K02k27K57k89L26
33A73l66M09m57N07n63O26o94P70q51R40j044J156j279J423j584J767j982K234
51A185k533K899l358L948m750N904p717J1004j8884P1922J01233q2219q2581p1172
65g5119k6885n823N0777Q3134P6499J4862l5475p0471p5351n5768O901O7808Q9692
78D4781N5564O514l7537o3671p1210m3349R078O0053P7121N7545J1266l7675p0059
91a579o8582l5588J5264N7920P2479N1365Q419l7009o5699o6334l4068J7690O0652
104b5070O9100M4491M488l5807o4937o4911k7355K6193N8792N7704L6655O884
116H6227l0923o4036o3508k2620K8152N4436N3097L6656P172l4133o4689n7547
$$ y = [0, 0, 0, 0, 0, 0, 0, 0, 0, 0, -8, 8, -8, 8, -8, 16, -16, 16, -24, 24, -32, 33, -40, 48, -56, 64, -72, 84, -96, 106, -121, 136, -153, 173, -193, 216, -241, 266, -297, 329, -365, 405, -446, 494, -550, 606, -673, 750, -834, 933, -1049, 1185, -1348, 1551, -1807, 2141, -2609, 3295, -4422, 6582, -12302, 59620, 160853, 78634, -3947, -75119, -102004, -107827, -57050, 26084, 102583, 117445, 81970, 11499, -63852, -119620, -112719, -44911, 44781, 100345, 106859, 69322, 5651, -65559, -108908, -99830, -39777, 37344, 94889, 106155, 68480, -1579, -70161, -105749, -90485, -32565, 39914, 91279, 99698, 62689, -3010, -69344, -103412, -85722, -25070, 44030, 88521, 93009, 57202, -7735, -72646, -100001, -73808, -15016, 42688, 79343, 86227, 55304, -8732, -72240, -94860, -66708, -12272, 40825, 77481, 84653, 50520, -14169, -71716]
128g1716j6288K7178M9351N1002L6734M652l6434o0817n0990j5942K2339M8889
140a2042N5692L6392l607m1734n5630m2493j3739J9463M7019N5050L4307o208
152G2470m2244n4353m0202r774K3554M6464M8306K7139o715l6258m8726l9964
164f0303j3008K2274M8530M9788K4555j1441l8243m5789l4577r324K1691M4710
176a137M6143K3563j0438l7119m5024l3642q113K2637M4987M5078K0823j3477
188E4281l8133m3056k9698m234K3991M1909L9383J7736j1318l4564m2615l0821
200e7139k756K7248M2069L5218J3302j2297l2265l9113k8207k607K5238M0379
212I070L5358J3319j4439l4302l7342k3328N37K3564L6246L2919J3923j2857l4125
$$ y = [-71716, -88004, -60826, -11475, 39527, 76261, 80913, 44479, -16338, -67328, -83270, -60931, -12042, 43650, 80042, 76435, 34701, -20929, -63422, -77161, -57698, -10679, 44371, 78678, 72470, 30226, -24127, -64329, -74103, -50549, -4085, 44221, 71360, 64645, 28387, -20339, -60303, -73311, -51037, -2507, 47281, 71836, 60395, 22152, -23637, -58214, -67538, -45847, -1137, 45006, 68569, 58131, 21012, -24012, -57654, -65767, -43130, 1857, 46935, 67758, 54281, 16148, -26908, -56606, -60840, -36849, 5060, 44443, 62179, 50861, 16297, -26318, -57139, -59895, -32647, 9422, 44640, 57942, 45645, 13380, -25733, -53940, -56547, -31309, 9070, 44428, 57747, 43308, 9006, -28336, -51664, -51127, -27563, 8683, 41602, 55525, 42668, 8543]
225H543l8298k3025L276K6377L5547K8768J0168j3132l1572l5531k1637L278K5778
238b1460L4998K7857Q263j4987l1130l2613j8801L930K4800L3617K6151O446j5484
251C1587k9775l0497j7100M741K4162L1618K4323O132j4994k9456k9677j5311
263d4247N846K3215K9925K3550N790j5688k9300k7961j3631N962K2545K9417K2693
276C8116M311j6305k8342k6651j2821O768K3227K8632K0297K527j5949k6882k5595
289b8667j2260P509K3780K8074J8395L65j6702k5300k2757j0452O791K1705K6880
302A7361J8733R27j7150k6163k2509q741Q700K1925K5018J6484K36j6121k4987
315f287k2298q780R446K2923K4803J4719j600j6536k4016k0858p548J0172K2820
$$ y = [8543, -29755, -52780, -49504, -23127, 12420, 41188, 51356, 38224, 6652, -28879, -50516, -47238, -21460, 13538, 41395, 49658, 34671, 3541, -29072, -47873, -43943, -19143, 14474, 40625, 47071, 31587, 1812, -28685, -45785, -41044, -16882, 14736, 39059, 45191, 30197, 741, -28936, -44247, -38401, -15186, 14739, 38289, 44079, 28391, -909, -28870, -42501, -36539, -13994, 15423, 38116, 42427, 26122, -2220, -28871, -41692, -34924, -11697, 16935, 37232, 39759, 23810, -3072, -28667, -40927, -33418, -9638, 18436, 36831, 37196, 20494, -4806, -27563, -38015, -31224, -9519, 17361, 36094, 37021, 19871, -6292, -28801, -37542, -28842, -6917, 18101, 34585, 34821, 18700, -6287, -28585, -37365, -27919, -4996, 19807, 34526, 32926, 16390, -7626, -28484, -36032, -25860, -3040]
328c040K3709J3192k824j6982k3395j9060n348J1011K1417K1372J1859k738j6361
341A2812k2604j7976m451J0939K0669K0698J1336l477j6842k2035j6527l270J1185
354a9543K0034J9593J0283l961j6529k1287j5821k622J1643J9942J8889R126m986
367B4761j6860k0473j4186j320J1809J9226J7751P793o047j6521j8731j2369q39
380b6006J0965J8007J6866P531n720j5979j8489j2254l84J1590J8004J5967O364
393B6462o214j5625j7592j1467m3J1560J7757J5463N655o755j5558j7043j0834
406b4234N71J2032J7734J4596M419p497j5438j6215r607J698J2162J6539J3034
419A9794L639p154j4595j5418r038J800J1740J5998J2703L510p385j4730j5150
$$ y = [-3040, 20669, 33861, 31037, 14055, -9340, -28400, -33748, -22737, -1320, 20052, 31911, 29173, 12812, -9792, -27768, -32219, -21280, -611, 20087, 31423, 27946, 11104, -10931, -27458, -30728, -19543, 491, 20084, 30367, 26406, 9877, -11410, -27231, -29853, -18210, 1732, 20621, 29747, 24761, 7901, -12572, -26758, -28078, -16269, 2957, 20708, 28501, 22454, 5933, -12798, -25167, -26006, -15041, 2966, 19832, 27363, 21643, 5664, -12825, -25079, -25463, -13873, 4131, 20098, 26462, 20248, 4623, -12969, -24436, -24479, -12919, 4838, 20301, 25956, 19201, 3643, -13400, -24234, -23663, -11631, 6103, 20699, 25118, 17621, 2183, -14032, -23639, -21941, -9779, 6760, 19794, 23433, 16279, 1684, -13734, -22772, -20972, -9232, 6766, 19469, 22979, 15594, 864, -14286]
432a4286q324K560J2025J5504J1736K726p450j4236j4568p913K825J2172J5402
445H173J1293K023q105j4428j3952o728L789J2237J4646J0275J135q520j3984
458b146j2777n586M089J1654J3724R548Q68q326j3513j2282n240M293J1705J3459
472I470Q886J45q574j3122j1501m470M624J1400J2715Q203j34q447j2760j1083
486a4648m061M888J1421J2473P672q60q897j2509j0183l107N307J1076J1593O714
500A6879j274q528j1705r523k933N198J0837J1269O345j608q659j1546q963k138
514a6349N591J0463J0438N695j778q462j1058q392j788N560J0143J0029N253j936
528A3409q220j0700q190j672N819J0363R754M550k584q346j0174p312j004N721
$$ y = [-14286, -22610, -20050, -8025, 7479, 19215, 21941, 14491, 255, -14313, -22226, -19401, -7229, 8173, 19466, 21489, 13384, -1044, -14996, -21724, -17935, -5698, 8948, 19223, 20358, 11838, -2146, -14923, -20509, -16420, -4766, 8958, 18506, 19374, 11048, -2465, -14747, -19987, -15694, -3989, 9470, 18356, 18501, 9927, -3195, -14696, -19166, -14542, -3142, 9573, 17776, 17642, 9195, -3565, -14648, -18709, -13821, -2400, 10073, 17745, 16885, 7988, -4521, -14704, -17811, -12504, -1428, 10165, 16879, 15605, 7077, -4628, -14151, -17084, -11886, -1049, 10220, 16565, 14957, 6298, -5248, -14211, -16349, -10758, -295, 10143, 15838, 14060, 5598, -5460, -13852, -15640, -10080, 63, 10092, 15345, 13409, 5189, -5511, -13701, -15373, -9554, 809, 10563, 15113, 12529, 4183, -5991, -13303, -14307, -8586]
542h586R621R152M481k452q333j0211p084n45O123R688Q692L650l045q185r502
557f536o432k14O099R282Q052L219k945p837r218o243p8O157R227P862K932l342
573I985q020q920n634L75O206Q962P476K492l631p937q560n175P91O339Q677O890
589A0316K028l701p743q280m884J117O596Q651O437J219m300p515p231l873J157
604a0006N764P832O301J651l917p599p611l976J683O430P936N609P66m261p194
619e92o849l394J648N971P581N641Q09m531p455o639k833K162O075P241M934K26
635I995m537o980o085k443K222N836O732M590J69m481o833n717j976K311N307
650a890O233M565M62m304o923n906k029K649N925O381L843m98m448o232n152j728
$$ y = [-8586, 1035, 10187, 14668, 12216, 3883, -6328, -13412, -13957, -7834, 1854, 10546, 14196, 11151, 2966, -6536, -12968, -13182, -7083, 2199, 10251, 13470, 10525, 2688, -6530, -12773, -12851, -6694, 2533, 10395, 13327, 9985, 1965, -6955, -12589, -12214, -6008, 2954, 10430, 12922, 9291, 1354, -7206, -12381, -11590, -5251, 3426, 10316, 12344, 8643, 900, -7380, -12264, -11147, -4551, 4100, 10537, 11756, 7456, -59, -7290, -11163, -10006, -4242, 3590, 9891, 11542, 7625, 26, -7585, -11561, -9878, -3448, 4488, 10097, 10863, 6602, -592, -7441, -10835, -9187, -3216, 4365, 10006, 10815, 6284, -1171, -7810, -10643, -8481, -2406, 4835, 9769, 9995, 5458, -1522, -7607, -10050, -7828, -1992, 4740, 9330, 9499, 5018, -1815, -7532, -9508, -7197, -1890, 4343, 8908, 9370, 5066, -1857, -7763, -9792, -7143, -1218, 5163, 9006, 8508, 4060, -2172, -7324, -9052]
666i052K450N406O005L982p1m540o788n393j097L358N655N358K946p35m138n686
682b340m620j389K503N358N637L141q07m267n779m609j162K925N412N214K773
697G990q02m157n806m537q48L150N422N000K428j173m179n398m142q29L060N480
713F59M989K076j517m211n187l859m93L355N305M445J626j588m006m762l345l79
729f892K778M750M590K182j451m446n163l326Q5L383N018M102J303j863m059m467
745c476k938L3L069M655M061J559j806m453m724k479O83L162M285L674J298j990
761D613m274m205k156N11K943M239L573J035k001l990m027k173N27K918M132L507
777E172J158k022m365m205j810J149L173L801K908O40j999l686l589j895N55K967
$$ y = [-9052, -6602, -1196, 4809, 8791, 8720, 4180, -2608, -8001, -9098, -5740, -85, 5273, 8219, 7484, 3346, -2340, -6960, -8349, -5846, -488, 5149, 8290, 7483, 3216, -2563, -7172, -8334, -5409, 3, 5217, 7990, 7188, 3031, -2775, -7312, -8160, -5010, 412, 5412, 7840, 6667, 2488, -2910, -7052, -7881, -4821, 659, 5648, 7724, 6207, 1996, -3191, -7050, -7543, -4188, 1117, 5562, 7188, 5600, 1594, -3168, -6513, -6892, -4114, 636, 5226, 7408, 5957, 1511, -3652, -6978, -6893, -3510, 1508, 5610, 6913, 5050, 991, -3476, -6414, -6381, -3312, 1343, 5404, 6963, 5157, 704, -4020, -6499, -5816, -2654, 1631, 5305, 6603, 4613, 339, -3866, -6022, -5511, -2568, 1671, 5244, 6279, 4278, 288, -3739, -5912, -5385, -2467, 1665, 5172, 6330, 4308, -57, -4262, -6072, -4923, -1750, 2051, 4959, 5599, 3600, -86, -3675, -5570, -5015, -2048]
793b048M119L131M84k249l858l557j582J050L089L654K567M25j958l629l471j527
809e360J037K991L576K515L32j991l486l385j637J033L264L776K247j33k179l351
825g51l086j238J265L044L234J950R3j865l305l099j248J200L008L387K085j64
841D510k277l299k723r15J251K893L142J828k02k066l143k768r08J364K911L041
857B639J798k21k307l377k529l81J581K712K719J526l97k194k911k247o09J290
873b908K741K893J465n47k193k852k200n09J378K709K812J467o26k482k977j828
889c657o1J452K392K487J395n81k286k833j929k31J621K734K473R25r50k234k487
906a770j613n3J514K373K191R97p02k154k495j634q0J470K456K291R03r53k207
$$ y = [-2048, 2071, 5202, 5686, 3437, -421, -3978, -5560, -4510, -1421, 2233, 4800, 5225, 3267, -362, -3833, -5360, -4323, -1332, 2244, 4759, 5091, 3100, -386, -3771, -5408, -4375, -1111, 2665, 4912, 4779, 2600, -751, -3837, -5075, -3810, -766, 2468, 4418, 4511, 2646, -659, -3758, -5006, -3806, -798, 2589, 4674, 4510, 2233, -1066, -3789, -4704, -3453, -560, 2582, 4410, 4208, 2142, -1001, -3769, -4677, -3313, -402, 2639, 4437, 4216, 1909, -1468, -3997, -4378, -2797, -85, 2634, 4160, 3763, 1569, -1342, -3589, -4198, -2908, -167, 2726, 4191, 3644, 1451, -1401, -3601, -4110, -2732, -23, 2789, 4256, 3630, 1148, -1829, -3657, -3718, -2266, 126, 2613, 4008, 3427, 1141, -1692, -3621, -3852, -2231, 503, 2976, 3901, 2951, 717, -1770, -3383, -3436, -1922, 451, 2642, 3639, 2937, 783, -1712, -3346, -3426, -1956, 500, 2791, 3694, 2741, 534]
923E34k347j506mJ587K476K054O61r34k066k291j447J55J606K288J947P10r32
940B491k232k295j198L72J629K152J706M51r83j873j962j233J21J505K194J741
956B586M80q86j925k144j250L25J683K147J646M18j061k104j975q74M78J519J963
973A026J558L52j070j953j876r50M58J657K067J359R3j127j837j709p46N29J455
990g14J735J363L28j025j926j732p54M69J514J942J415N7j290j856j566o46N78
1007b108J620J832J111o8j152j744j508n28O48J474J671J163K4j236j847j407
1023b055l65O90J476J645R51k29j169j475j204n53M91J458J695R98j38j148j699
1040f31j395l84Q32J545J512Q32k64j262j625j094j65P40J311J431P62k54j143
$$ y = [534, -1813, -3319, -3323, -1736, 740, 2794, 3455, 2521, 455, -1836, -3283, -3128, -1522, 766, 2713, 3423, 2491, 259, -2036, -3234, -2862, -1233, 919, 2625, 3076, 2093, 220, -1742, -2975, -2854, -1349, 845, 2586, 3066, 2180, 255, -1889, -3139, -2814, -1131, 1016, 2662, 3080, 2019, -85, -2060, -2934, -2456, -937, 1026, 2584, 2936, 1866, -87, -1963, -2913, -2455, -798, 1269, 2628, 2721, 1594, -243, -1952, -2698, -2169, -714, 1021, 2384, 2712, 1687, -239, -1971, -2725, -2256, -742, 1200, 2615, 2672, 1382, -474, -2040, -2686, -2108, -488, 1344, 2455, 2387, 1235, -509, -2017, -2545, -1897, -423, 1248, 2411, 2435, 1199, -648, -2055, -2420, -1730, -254, 1391, 2342, 2113, 944, -531, -1735, -2288, -1797, -339, 1356, 2354, 2216, 1068, -631, -2026, -2410, -1578, -33, 1479, 2311, 2047, 785, -840, -1934, -2099, -1359, -48, 1383, 2145, 1891, 748]
1057G48j469j147l27P57J521J459N93m08j171j397j009j14P97J262J199O60k18
1074A736j081j444j038j98P37J382J417O48m85j315j379q48J0Q72J343J118L64
1091A839m44j055j196q29l5P42J203J117N74l75j180j355p84P6Q50J280J066L23
1109A817n57j073j057o92m2P19J201J081M21m52j123j271p49J17R31J288R80K14
1127A753o55j177j026m54K28P47J050Q43K17m80r39j009o39M2P98J220R45J89
1145A653o12j101j042m83K84Q77J028P39J28n46r59r43n04J42Q00J145Q79J04
1163A589p17j100r27l63L85R22R88N53p9o01q56p58l37K50P11Q94O70J07n38r45
1183a52q94l95K90Q86J043O23j11p55q97o97j95L44P74Q17M93mn59q56p89k88
$$ y = [748, -721, -1868, -2195, -1438, 83, 1542, 2135, 1727, 556, -841, -1850, -1964, -1167, 95, 1294, 1954, 1736, 655, -789, -1827, -2025, -1288, 94, 1511, 2159, 1674, 359, -1020, -1868, -1858, -986, 357, 1475, 1839, 1395, 340, -856, -1685, -1720, -978, 225, 1342, 1916, 1541, 361, -994, -1778, -1702, -852, 428, 1494, 1817, 1260, 187, -870, -1562, -1604, -885, 316, 1397, 1818, 1366, 243, -1028, -1777, -1660, -729, 559, 1539, 1753, 1098, -79, -1105, -1559, -1331, -584, 466, 1309, 1526, 1046, 107, -902, -1541, -1499, -701, 519, 1464, 1653, 1041, -60, -1102, -1585, -1301, -424, 604, 1343, 1471, 925, -34, -977, -1481, -1339, -539, 606, 1485, 1589, 872, -228, -1155, -1518, -1133, -211, 777, 1330, 1251, 650, -206, -964, -1301, -1051, -340, 554, 1224, 1331, 793, -152, -1046, -1441, -1151, -265, 778, 1401, 1290, 535, -362, -1059, -1254, -910, -136, 681, 1174, 1170, 611, -245, -1034, -1322]
1203a322L67Q41R33M95j78p41q61n53p2L69O97P08L76r5m88p08o43k90K69P51
1223a45Q56N10j07o60q87o51r2M75P72P18L15k13n99o95n30j00L46P04P23L47
1243A087j69o05p48n47p9M30P59O60K52k55n91o51m14k4L39O14N78L26q8n08p11
1264c45o09j53M54Q25P22K11l47o63o73l35N2M51O27N29J69k35n15n93m33m9M18
1285d92P06N86J54k99n91o03l32O6M39O09M76J08k39m83n38l76m4L97O53N87J58
1306I42l06o01o14l26R0N27O65M38%l65n32m56k25J19M03M90L91J37k27n10n32
1327d92l10J02M44O02M25K2l71n08m18j88Q9L73N14L80R8k41n17n47k89J64N13
1348a55N44L42J3l67n53m33j11K19M32M10K69k5k90l83l65k07O9L97N10L37J6
$$ y = [-1322, -955, -114, 819, 1314, 1136, 395, -466, -1019, -1091, -722, -25, 683, 1059, 964, 476, -232, -875, -1165, -896, -145, 711, 1221, 1114, 454, -433, -1084, -1176, -701, 71, 789, 1104, 891, 292, -403, -933, -1033, -687, 17, 740, 1087, 918, 313, -435, -982, -1061, -631, 128, 788, 1040, 785, 194, -457, -871, -895, -556, 58, 636, 962, 874, 366, -345, -954, -1107, -653, 172, 894, 1105, 758, 95, -578, -913, -861, -410, 217, 746, 915, 680, 165, -428, -861, -910, -492, 214, 800, 954, 655, 64, -539, -871, -805, -366, 243, 719, 827, 588, 105, -433, -809, -853, -456, 197, 784, 942, 636, 35, -579, -905, -815, -288, 377, 815, 815, 450, -82, -538, -763, -644, -241, 249, 640, 777, 550, 40, -492, -802, -700, -256, 346, 771, 793, 422, -86, -504, -692, -603, -230, 284, 664, 762, 521, 4, -543, -832, -668, -155, 389, 731, 744, 377, -176, -609, -720, -501, -69, 341, 610, 585, 295, -88, -453, -660, -591, -194, 316, 653, 669]
1369F69k81n04m50j71K25M41M32K56k1k58m46l88j89J65M16M83K96l5l24m71m31
1390e86j44K60N36M31J35j46l17l44l10p9J88L50L50K28%k55m34l82j36K01M43
1411a1M38K22j34l60l73k95r3K08M37L86J64j13k93l93l35q6K72M38L90J51j58
1432D62l96l98k15N4K63L41K87Q6j26k44k54k65j26J81L99L86J39j14l29m13k79
1453e61K0L36L79K63O7j49l05l35j77K4K13L40L20J04j87l10l37k17N1L15L74
1474B28J88j5j55k33k75j62O5K23K17J97J48o4k86l28k16OK39L72L14N5k43l43
1496f8k67j28J06K83K96J40pr6k14l07j77P4K61L04K07N4k17l27k52m3J14J97
1518f7K51J62l6j42j68j81j80k7K28L22K10L6j38k86l38j57J78L30K60J22m6k10
$$ y = [669, 388, -116, -566, -737, -512, -71, 361, 617, 596, 338, -108, -496, -685, -520, -104, 379, 675, 640, 316, -155, -586, -730, -470, 66, 497, 632, 486, 169, -175, -485, -564, -376, -26, 324, 552, 552, 297, -137, -519, -655, -454, -11, 427, 649, 515, 155, -218, -513, -606, -398, 39, 425, 589, 476, 183, -210, -545, -631, -359, 79, 469, 620, 462, 66, -332, -547, -493, -230, 111, 398, 484, 358, 114, -140, -405, -531, -350, 49, 435, 574, 460, 131, -282, -561, -541, -205, 174, 437, 504, 355, 50, -285, -462, -438, -225, 115, 435, 539, 352, 42, -295, -512, -461, -146, 228, 416, 401, 246, 13, -262, -424, -359, -136, 81, 278, 426, 362, 76, -252, -468, -462, -223, 149, 463, 518, 275, -68, -335, -463, -357, -74, 222, 362, 355, 259, 45, -262, -439, -365, -104, 200, 407, 461, 244, -83, -335, -378, -264, -67, 184, 346, 310, 168, 0, -181, -361, -388, -160, 162, 372, 408, 270, -16, -354, -511, -333, -3, 257, 379, 333, 123]
1540A23k58j63k2Q9J86K30J59l8j62j92j98j53J04K98K41Q8n8j37k12k18m1J61
1562a73J91J29J18O2j27k53k27q3R8K46K73J67j04k42k45j52j0J85K57J47j5n3
1584A89r3j74j84l2J18J74J57J55k0j97k42j36K3J00J96J85N5o9j42j48j27o1
1606b73P7K13J82R7k1j35k62k19K2K06K24J50L6j13j97j59k4K6Q2J18J44N9n6
1629A77r6j34j68q0J58K25J30L2m5j38j92j24L4J50J22J07Q5l7j52j88j14NJ03
1652a40K03J86J7j13j73j64r2O7J82J47L0j8kq2j43j11J6Q3J14J61J04m9j96j92
1676a65p7L1J36J95J18j2r7j23j19j14L4J52J36Q5M4m3j55k24p9J06J65J28Q4
1699B06pj21j65o0ML0N6R6R8K2k1r9j55j43K3J85J50Q6Qn8j86j88jJ39J09Q1P3
$$ y = [123, -135, -298, -320, -231, -45, 185, 344, 306, 144, -48, -246, -399, -295, 3, 244, 332, 274, 137, -75, -293, -334, -173, 18, 147, 265, 327, 200, -53, -280, -363, -265, -19, 254, 421, 317, 75, -170, -322, -332, -147, 110, 257, 242, 189, 96, -78, -262, -294, -176, -2, 155, 310, 290, 93, -149, -285, -262, -162, 34, 219, 274, 205, 63, -85, -212, -273, -196, 17, 199, 296, 275, 140, -122, -341, -319, -113, 111, 261, 297, 184, -13, -172, -196, -170, -88, 30, 174, 233, 177, 81, -53, -221, -301, -143, 82, 212, 244, 199, 61, -131, -255, -221, -71, 51, 158, 243, 206, 54, -134, -248, -243, -140, 63, 249, 266, 153, -20, -184, -276, -209, -27, 120, 150, 132, 130, 48, -95, -206, -190, -107, 7, 168, 272, 223, 27, -165, -242, -211, -75, 120, 238, 226, 129, 6, -113, -227, -193, -41, 95, 180, 224, 181, 26, -198, -277, -171, -6, 122, 206, 199, 78, -87, -147, -143, -113, -57, 39, 137, 159, 138, 39, -116, -259, -236, -51, 99, 185, 193, 135, -51, -239, -240, -101, 8, 89, 162]
1726A62L5j16j38r2l3L8J04J51J10m1r8j40j17k1J25J29O3j3kj1j02j02l1K5N4
1751f1R4J56O3j30j88j36j9P8J46J51O8j04j02r7n6k7Q7J00N2M2J3l6j44j31p
1776a88R4J03J10N4l0j46j07j3J7L7N0R4M6Ll0j06j40m4M8J77J37N9n8j17j97
1801a47q6R7J41P4L6K8n6q7o4j7k8L1Q7J12L9l0r6j29p0OJ38J04K8j2k2n8r8l4
1829a13PL0L5J10J12k1j22j64n9L2J10J47P7l7j16j05l6mO1Q2K7MK5Qn8r8n1J1
1857a06O7P8J01L4p7j51o3MM7N9P3K2Lj2o0p0p2lO6J12Q1K4q0j39j13K6J12O8
1885C1N4Jm3n1l8kkj7J0O5N4L5pp8j03n5N5J04P2J7Kp3p8l8J7M5K1K0Q6J3n3p7
1917a3o3m6L6J02R0L8o0r4p8j4L5P0L4k0JL3pm1n4k2j4K9J02P1J3q3r9n4JP6O3
$$ y = [162, 197, 81, -57, -149, -182, -144, -40, 111, 221, 180, 82, -58, -175, -196, -71, 58, 121, 108, 106, 95, -7, -109, -140, -115, -61, 33, 189, 252, 122, -66, -202, -221, -143, 3, 154, 222, 118, 16, -81, -137, -164, -77, 23, 75, 117, 130, 94, -50, -181, -188, -94, 9, 119, 173, 143, -3, -110, -123, -106, -69, -19, 75, 121, 124, 94, -12, -152, -196, -148, 29, 166, 225, 167, 50, -147, -233, -136, 5, 79, 115, 143, 87, 0, -64, -81, -109, -78, 9, 121, 160, 130, 34, -95, -165, -159, -21, 83, 111, 99, 77, 19, -79, -113, -106, -76, -41, 69, 181, 160, 38, -126, -185, -153, -43, 104, 181, 144, 28, -77, -113, -117, -56, 26, 53, 57, 82, 90, 32, -66, -117, -106, -39, 39, 140, 174, 97, -54, -117, -113, -66, -7, 66, 88, 91, 79, 19, -51, -123, -126, -60, 52, 133, 157, 77, -62, -175, -149, -37, 31, 85, 86, 43, -8, -46, -48, -50, -67, -57, 8, 62, 97, 90, 12, -91, -146, -91, 13, 85, 102, 104, 31, -47, -85, -68, -23, -2, 18, 104, 117, 64, -13, -76, -122, -86, 16, 106, 144, 84, -10, -88, -102, -67, 3, 37, 17, 18, 51, 44, 3, -51, -73, -87, -58, 44, 115, 128, 45, -54, -108, -107, -31, 32]
1948C2N2j1k6k7o2j1j3K2M7L7O1j3n8r5l7L4P1N3K8rl8n2oOJ1j0%M6L8K6l2o4
1980@p9l4N4R3N5K2m2q8o2J0M3L0K1J6L5k8l1n1k4oJ6N8N8J6n3n6k6oL2J6%K8
2012A7K1Kj4l5l1k6JM3P6N6l0p4p2m0M8M5P4L0k8l9m7onPJ5K8L8K7j4o0n2qLL4
2046a6L2K5J4l9k0k2pj4jK4O5K4lm0r5l2J4O0P0N4np1o9k9K3M5K3J2J3Oj9j7k5
2079b0j6j3J4N9M6jk7o0l0JK1J9M9Ojk6j0Jo4j3O6J8N6L8p7p3p2L9O1N4M6j3o9
2112INk8m0L0Oo7P8L5P1o7j53J09p3M1L6O0J7l0l4k3k3J6lJ0L8M8Jl5n2m1j2K9
2144d2N5P3Mo2n2l1NL7K9LJj5J4%j2k4k7j7M1N3N7l3n1n7j9K9K7K5N7l7j3j6k7
2177b5nj8J1M8K2K1%p3n2NL4L1L7J7j9n4j5K7K5j9j1lM1MLMl4n9j0M7O2K7mm5
$$ y = [32, 84, 73, 47, 20, -42, -53, -66, -44, 3, 40, 101, 88, 30, -65, -102, -68, 3, 56, 84, 75, 37, -15, -21, -15, -4, -14, -14, 32, 70, 96, 64, 0, -79, -113, -59, 34, 89, 111, 69, -19, -81, -71, -28, 2, 23, 39, 74, 46, 15, -36, -60, -66, -50, 8, 66, 82, 29, -27, -53, -59, -27, -11, -11, 17, 38, 40, 26, -9, -40, -66, -65, -22, 54, 110, 80, 6, -66, -106, -58, -13, 61, 91, 63, 24, -23, -29, -34, -27, -12, 16, 54, 81, 67, 7, -45, -53, -50, -16, 16, 41, 55, 16, -4, -26, -33, -47, -48, -24, 41, 65, 62, 22, -73, -105, -91, -31, 39, 93, 88, 17, -52, -81, -58, -13, 10, 22, 35, 41, 22, 5, -20, -36, -49, -35, 24, 70, 69, 42, -18, -48, -47, -26, -7, 42, 48, 47, 21, 11, 12, -52, -65, 1, 19, 75, 113, 36, -37, -109, -70, -9, 45, 91, 78, 9, 14, -14, -54, -24, -18, -85, -7, 28, 99, 32, -121, -12, -85, -44, -8, 52, 69, 39, 5, -18, -41, -25, -28, -18, 20, 68, 69, 34, -18, -59, -71, -42, 13, 86, 90, 28, -24, -55, -50, -13, 16, 19, 20, 5, 19, 19, 7, -17, -44, -61, -20, 33, 90, 57, 6, -51, -70, -41, -14, 11, 68, 31, 18, 2, -25, -30, -48, -37, 11, 33, 54, 54, -19, -71, -66, -32, -1, 36, 53, 34, -20, -35, -8, 17, -2, -13, -16, 25, 29, 32, 36, 2, -57, -67, -20, 42, 69, 65, 20]
2211B0n1j5K3K5J1jNK5l9j2j6oj2J8O0L3l4n5j9j0K1K1K8ml2OJ0Qjk9j3j4K5P2
2245D8L3n9n3qj0QP2L1mn5m2K0POoJ9J3NJ8pl6l7J7K4J7J8ok0m0oK8Rj8k0L6P
2281Ij1K7km7m2lN2L2L1k1m3m2pN9K2nJJl5RK0J4m4j7K8L9K1k4jl2k3K6RK9j1
2316A9j1KJ0j0j%m9J1N1M1Jm6l8j5j5L3N8L1m5m7qJ8J1jJ5k7kJ5K8ll7nl8J2M5
2351CK0Ok7k6lJ3k0J9KK7j4J1J1j6m6qK0M9QK3l1l8k5K0M2J8j3j2k6kK0K9lm1
2385a0j3K0L0kPpl7l3J2M6J0okmj0onnkJL8J5j0l5j4k2kM6M7rn9j5K0J9%JK4m9
2423b1lL4M4k4j9k1k5LM0L9Pl9j8Ok3J9K5K6j6l1K0J1l1k9LL1J4J0Rk3l7j0K4
2456eJ6JJj3j4j3L9J9m7k1PL0J7J8Ml5n2k3O2L2J1j0j3k0k5J8K4jj2J7K4j9jj3
$$ y = [20, -31, -46, -23, 2, 13, 12, 17, 42, 3, -9, -25, -31, -43, -25, 35, 68, 34, -21, -40, -50, -29, -8, 20, 16, -16, -10, 0, 8, 7, -22, -35, -49, -24, 48, 81, 22, -31, -39, -49, -41, 31, 62, 58, 3, -39, -19, -12, -6, -12, 7, 20, 25, 43, 36, 0, -37, -20, 4, 21, 39, 33, 13, -27, -33, -5, 4, -14, -34, 2, 9, -2, 25, 23, -24, -66, -69, -17, 15, 46, 25, -18, -60, -67, -8, 14, 9, 10, 11, -24, -15, 5, 19, -25, -42, -14, 25, 46, 22, 21, -11, -34, -8, 1, 30, 19, 8, 10, 20, 10, 9, 9, -40, -29, 22, 63, 64, 18, -20, -35, -50, -17, 41, 72, 27, -20, -28, -10, 1, 0, 15, -12, -14, 1, 29, 26, -11, -16, -54, -42, 3, 23, 29, 2, -24, -27, -14, -34, -15, -13, 14, 0, 11, 22, 6, -40, -48, -28, 21, 29, 52, 21, -17, -42, -22, 20, 38, 25, 13, -13, -15, 5, 34, 31, -10, -23, -3, 27, 25, 32, 25, -12, -45, -33, 13, 23, 17, 15, 11, 1, -5, -10, -15, -17, -16, 22, 37, 27, -8, -22, -44, -46, 0, 47, 38, -21, -36, -16, 3, 3, 4, 28, -21, -24, 10, 54, 30, 11, -10, -35, -32, 8, 47, 54, 15, -3, 3, -20, -1, 24, 50, 34, 3, 23, 34, 3, -26, -23, 8, 22, 32, 41, 18, -19, -29, -5, 11, 12, 13, 0, -14, -27, 12, 31, -16, -37, -30, 0, 17, 35, 39, 4, -48, -71, -9, 23, 34, 24, 11, -9, -34, -16, 8, 7, -5, 12, 36, 17, 16, 3]
2490Crk9J2M3M0k9ol0RklL1j5l5NN9nk3j3l1nJ7M2L4m3l3k5M%K7M2ml5j6K7Pk6
2527a5OkNLJ6J5k7m1K1J1J9JQk9j6K5J9qk3qK5J0NQQm2l8J9L3M1qj5k7k6LL0K5
2564C1j6oj2nJ2LJ1l1j3J1L4lok5Rj5JJ9J5om1K4J1Oj0j6j3lL4L1pk5j8mlJ8M0
2601C2J3m8k9J6K9NOLj5k8J4MK8k4j6rJ5J3J8qk0j4J9J2j9jQNk8K1K1j8k6j5K5
2636a1M0nj4Pm1k6K9L8mj7lk5mM8J8k5rj9J5K1%Jlj3j7J0L5oj7NLJ1j3j0Kj3J5
2673CJ3J3j7j3kpMJ7K4k0m4lK4K3joqk2qJ9K8K2m2ok6J1J2L0rj6oONoJ1Nnk5K7
2712EJ3l5jkJ4K2jKj3k1J1MK0Kk4nlJ6L0oj1l5QOJ3K8oj2k9k0K5J8loj2mJPpJ4
2752Ck3nK0Rnnj1j8J9J6klk3K0J1J0qo%l2J6L3%Jk2j7NJ9K5Pjl3rJ2pK2Kj2j7
$$ y = [3, -6, -35, -23, 20, 60, 31, 25, -5, 4, 2, -1, 30, 15, -20, -15, 44, 39, 16, 3, -28, -33, -16, 26, 60, 17, -16, -41, -37, -37, -10, 32, 28, -7, -23, 4, 11, -15, -9, -11, -6, -3, 13, 28, 1, -40, -19, -8, 11, 12, 20, -9, -25, 0, 19, 11, -12, -20, 5, 15, 20, 28, 36, -6, -44, -25, 8, 49, 41, 26, -1, -27, -24, 6, 31, 15, 9, -3, -8, 4, 7, 18, -13, -26, -15, 19, 16, 10, -15, -6, -21, -20, -1, 14, 8, -33, -9, 2, 8, -2, -18, -31, -34, 0, 31, 24, -1, -19, -23, -26, -8, 32, 45, -3, -32, -16, 13, 18, 24, 27, 12, -16, -2, 2, 30, 6, -10, -19, -4, 9, 27, 19, -1, -15, 4, 16, -3, -4, 4, 9, -19, 2, 23, 5, -21, -36, -11, 29, 24, 10, 17, -24, -50, -21, 17, 13, -4, -7, -32, -36, 12, 30, 5, -4, -23, -8, 13, 13, 14, 11, -2, -19, -9, 26, 20, 3, 8, 11, 22, 9, -1, 1, -12, 3, 16, 29, 12, -1, -3, -10, -6, 11, 35, 15, -29, -32, -8, 15, 14, 8, 0, -22, -30, -11, 17, 39, -3, -9, -35, -24, -12, 18, 9, -7, -13, -7, -2, -8, 3, 8, 3, -22, 5, 18, -17, -18, -20, -6, 16, 15, 17, 4, -17, -6, -2, 18, 20, -4, -9, -12, 4, 34, 28, 17, -18, -10, -4, 9, 37, 31, 19, -10, -30, -5, 13, 10, 4, -8, -12, -11, -4, -11, 3, -20, -25, -5, 4, -1, -6, -17, -35, -16, 0, -2, -5, -28, -8, 3, 13, 5, -1, -1, -33, -17, 16, 16, 17, -5, -22, -17, 2, 27, 34, 33, 0, -9, 3, -4, 18, 20, 8, -9]
2791ikK2Nj4rmjRJ6Orj9lRJ0jj9Lj9L2Lj4j2j4J1K4PJ2k5j3k2JM1J4Mk3qr%J7
2831cJJ4k5QJ0PKJl0rK0QJ0Ok1POj6J2kj1kOK6rj4j5j1J8J0K8j6j6k1qRK1J7j7
2870Aj0j9J8NQpqqOkJ4Nj0j8jRJ2KnKnMJ1j1%QjJ8Nj0k4mpK2K7Qj4k8rORJ3J0
2913B2j7j8mJ5J6Lrk4NmJ1MK0k4j2NQJMopOJ2lj9kPNJ5jj7j0j1NK2QRl0%PJ0M
2955FJ1qk0mPK0K2qj5j5qL0pnQj2j5OJ5Nj3kKNRJk3pjK4kjk8MJ3mJ4Joj3j1J0
2997a5J7J1Pk6kk2J0L1Nlj5j9J6OJ7%k0pKJ8OqpJmqK9j4nj4K3J3pjj2qoK8Jnr
3038Dk0mPK4JQl7k8K1K5Ojk6J7l3OL0J0j9j2PPRKpj0LkJ9KrJrMKJ8k3nqK4K5p
3080B2kj6j3j2J4L2j3oj3j4J5RQj1j2jPJ5kPj2k0kJ3J3Mj2j7OMj1PPkJkkJ6j2
$$ y = [-9, -11, 11, 16, 2, -7, -11, -12, -3, 13, 19, 10, -9, -12, -3, 7, 6, -13, -10, -29, 3, 6, -8, -20, -34, -23, 1, 8, 20, -5, -18, -40, -39, 2, 16, 20, -3, -11, -20, -20, -3, -2, 12, -13, -5, 5, 12, 14, 15, -15, -24, -4, 4, 14, 20, -1, 6, 12, -4, 8, 6, -5, -7, -1, 25, 16, 2, -13, -24, -6, 4, 32, 16, 0, -21, -29, -20, 1, 18, 1, -9, -28, -10, -5, 3, -4, -12, -20, -14, -16, -2, 3, -7, -25, -26, -17, -5, -3, -8, -6, -11, -7, 4, -7, -7, 1, 0, 18, 23, 13, -11, -15, -22, 0, 27, 35, 21, -7, -16, -10, -1, 12, 22, 5, -13, -17, -2, 14, 17, 8, -16, -11, -15, -4, 0, 20, -4, -16, -11, -3, -2, 2, -4, -11, -5, 7, 4, -15, -17, -10, -5, 10, 9, -8, -18, -29, -24, -2, 6, 15, -15, -15, -8, 2, 6, 17, 9, -11, -15, -8, 12, 34, 26, 11, -4, -12, 18, 11, 6, 14, 2, -13, -7, 8, 13, 0, -2, 0, 5, 14, 15, -8, -15, -16, 8, 6, 5, -23, -19, -6, -10, 4, 5, -1, -14, -25, -15, 2, 13, 20, -6, -8, -30, -20, 11, 16, 13, -2, -21, -5, 1, 18, 18, -2, -9, -7, 11, 17, 9, 2, 3, -1, -9, 20, 6, 1, -13, 10, 23, 16, 15, 3, -5, -11, 17, 18, 13, 4, -16, -20, -13, 11, 12, 20, -17, -45, -24, 1, 7, 6, -20, -3, -36, -30, 0, 10, -9, -21, -14, -7, 2, 4, -3, -13, -10, -12, 7, 9, 0, 1, -8, -4, -2, 16, -7, -12, -20, 4, 29, 22, 20, 4, -9, -21, -7, 25, 12, 6, -7, -21, -6, 3, 11, 0, -12, -13, -6, 9, 7, 14, 2, -18, -20, -7, 6, 10, -2, -19, -13, -9, -20, -13, -6, -8, -7, -9, -11, 5, -7]
3119gj0MOJ8jk4LJJ0JJ7Kj1j4KRK6%l2%JPJ1qJ2k1k0J6NM%Jk0j3J8J2j8nJ0J3
3159Ej4%j1J0j4nK5J2j3rKlQJ0Rk0pONJ2pkj7oLL6KJj3mNk1K0RPj5j1J7qqQ%j
3202CPLqlj8J1J5j6OKj0nlK7Oj9j6MjJJ6Qj3k4jK8j1POk2JRK1lmjmMoJ1Llk1j
3246a4K4Qj4q%JJJ7pj7nOJ4%jomjJ1J8nk0j7K2j0J8Rj8pj2kJ3Mj2J1Jj1jKJ1k
3287c%j7%J0J0j1nKMK6Oj9j0KJlL4jj7j7J1J6mMj3j8NJ2J5j1klrQmJ5Lj5j1KJ1
3328Dj5NKmlJ0Mmjj0QpLRlj3kQLJ0j0jqqK0J5Ol0mQJ4MlPk3jK2PJ0j2kmk1J6J4
3373B0Ok4%MjnMkrQ%Qjj6Nj0J4%mqqLK6kk0lOrj1L2J8k7k%nJ5nLJ7j5j4J4J0m
3417HQj3m%J4JJj0J1LlqJ3rj0PlJ4j0lrJ8jjnkj9%J5nJ2j0jk0ORJ6j2qj1J5j4
$$ y = [-7, -17, -13, -7, 11, 10, -14, -11, -10, 0, 1, 18, 20, 9, -5, -3, 6, 32, 32, 0, 0, 1, 8, 19, 11, 23, 2, -18, -2, 3, 7, 7, 8, -12, -25, -7, 5, -13, -18, -8, 5, -9, -9, -20, -10, -24, -29, -4, 8, -5, -14, -12, -15, -7, 3, 12, -8, -15, -9, -4, 8, 1, -1, -18, -24, -21, 15, 17, 18, 5, 1, 6, -15, 5, 14, 21, 6, -5, 12, 4, -4, 4, 4, 3, 10, 13, 5, 2, -16, -5, 10, -6, 0, 2, -8, -13, -16, 11, 17, -2, -18, -14, -15, -14, 2, 10, -3, -27, -28, 0, -11, -4, 2, -20, -19, -10, 11, 8, 4, 3, -1, 3, -3, 8, 11, 8, -13, -14, 10, 18, 4, -4, -4, -3, -2, 15, 8, -9, -14, -8, 6, 6, 5, -1, -5, -6, 5, 23, 18, -2, -19, 3, -7, 11, 20, 2, -5, -17, -19, -6, -2, -14, -3, -2, -13, -14, -12, -1, -3, -3, -20, -20, -10, 0, -11, -16, -14, -10, 16, 22, 3, -7, -5, -4, -7, 27, 26, 9, -8, 3, 19, 15, 19, 6, -12, -7, 5, 20, 9, 7, 4, -5, 3, -1, 14, 17, 2, -9, -7, 4, -11, -6, -4, -8, -11, -1, 3, -1, -2, -12, -4, -11, -8, 1, -2, -15, -17, -9, -6, 4, -6, -7, -15, -23, -3, 12, 18, -12, -16, -8, 6, 10, 7, 14, -9, -10, 12, 19, 29, 17, 15, 11, -10, 6, 20, 26, 2, 2, 6, 5, 0, 4, 2, -7, 1, 1, 9, 8, -8, -3, -13, 1, 1, -3, -11, -19, -16, 10, 8, -12, -15, -9, -18, -29, 3, 21, -6, -8, -8, -13, 2, -3, 0, 17, 2, -12, 2, 12, 8, 16, 3, -1, -1, 13, 14, 15, 5, 16, 19, 16, 8, 21, 12, 2, 9, 6, 20, 10, 7, -2, 16, 15, 14, 9, 7, -12, -12, 3, -2, 10, 0, -1, -21, -15, -6, 10, -2, -10, -21, -6, -20]
3459b0J6J1j9rOONkj0mJ2jKJ0ljpJ6noQrmRK4j2j0j0rJ8NPNj6j4LKK3j0J2k8J8
3501IqKKnmJ%oJ6Ok7oKJ1Rj5oMnJ3KRj8rJ2%J5Npj8KK5PPj6pj3LJ5RkNj7j1J0
3546ALNql%mK0mrj3OQrLJ0j5Lj0J5kj0J1oj1OJ6%k1qQOjJ5j5%knJ6J3j5Kj4J0
3589hJ9olLjnNQOj6JLKoJ9oj2OQkj9Nk0L3Rj2mj4Nj7J1J8jj5qkNQJ0Lj1Lj5Ok
3634iJ4j5JrK1%kqlJ0Jj0JJ1JJolJJkpK8qMkljlLOjmorJ4LKomKqj3K3J3l2LJj
3683a0J9pj3J3j7jNpJRk%OmOj6K0MLj1Mj2J3MlLj3MLMlJ4jpj5J3PllJkrnK1Jo
3729Hk1J3MKLj0Lj7PPj2J5j5lOKNMj0okMJ4nj2QNj3J5J2kj3pRQJ1opjnMRj0Pk
3774Fl%J5j0joKLRlj3OPnQJk6kLJ0J0j2Pj4j2K0lLjqj9nJ5K2qpNj5J6j1J4pOr
$$ y = [-20, -4, 7, -12, -21, -15, -9, -4, -6, -16, -20, -8, -9, -7, 3, 0, -1, -8, 8, 3, -3, 5, -4, -8, 1, 25, 13, 3, -7, -16, 2, 7, 14, 19, 3, -11, -8, -6, 17, 7, 19, -9, 9, 1, 3, 5, 0, -4, -3, -3, -9, 7, 13, -14, -20, -18, -7, 2, -13, -19, -15, -20, -7, -5, 4, -14, -23, -11, -11, 4, 9, 2, -16, -14, 11, 18, 25, 9, 2, -11, -8, 7, 16, 14, 19, 2, -9, 1, 4, 9, 1, -2, -2, -6, 14, 10, 1, -12, -6, 2, -7, -4, 6, -9, -6, -16, -1, -3, -13, -2, -8, -19, -13, 3, 3, -18, -26, -18, -12, -13, 2, -13, -13, -15, -20, -4, 9, -6, -4, -18, -8, 11, 5, 2, 5, 4, -1, 4, 12, 18, 2, 3, 6, 8, 2, 21, 15, 3, 9, 17, 15, -4, 1, -19, 14, 23, 11, 7, -7, -2, -19, -8, 10, 9, -6, -14, -16, -11, -3, 7, 10, -1, 2, -13, -7, -9, 5, -10, -9, -18, 3, 3, 1, -7, -10, 0, 1, -9, -8, 3, 4, 5, -1, -4, -3, -2, -4, -11, 17, 9, 13, 11, 8, 7, 4, 7, 13, 12, 8, 2, -7, 7, 10, 12, 6, 2, 4, -4, -17, 6, 19, -13, -10, -9, -10, 9, 2, -11, 2, -15, -16, -11, -18, -17, -8, -10, -10, -4, -8, -2, -18, 2, 6, 9, -2, 2, -10, 3, 7, 4, 7, -6, -2, 1, 5, 2, 16, 15, 8, -7, 6, 13, 10, 7, 8, 6, -3, -8, 13, 14, 8, -13, 0, 4, 6, 9, -1, 2, -15, -8, -1, -13, 2, -13, -16, -10, -8, -3, 1, -9, -15, -17, -13, 1, -4, -16, -8, -3, -16, -1, 11, 9, -4, -11, -2, 6, 17, 11, 4, 3, -2, 2, 11, 1, 8, 6, 3, 3, 18, 8, 7, 1, 3, 6, 15, 12, -1, 5, 12, 7, 15, 16, -10, -12, -9, 1, 11, -1, 6, -8, -20, 0, -3, 0, -1, -9, -28, -33, -18, 4, -4, -11, -6, -21, -5, -16, -2, -9, -3, -12]
3818a2J6j4J0J3pKpLrJ0kKQLj1KPk7J2J9p%j6JpnL1qJj6nJ3rRQj1j2jjJ5NkqJ
3862fnOLrNmoJ1jmRMj4J6lj0jJK7k1RLj2rMJ2RmrPrMJ7%k1J1qJ1KpqJ1mj0mJ2
3908Epj2J0noRJ1j0rKQRnrpJJ0mJ7j2pJ0Mj3J5nnLj5K0MlqMnQMlOj3NkPkPKj5
3955aJ4j4Mq%RnJ4j4PrMj4J3J1j3j0oOKJ4Nj4pkJ0OnKoJJ1nljkLNmmJ9j0Kj0J8
4000A3j1JJ2poJ3%j0nMlqK6Kj2pqJ2RqqPj6o%J4J2j0l1J4J0MjMj1j0J2J0j5%n
4041a9Rj1MJ3j0KMnJ4jqrJ8JjQlj3%J5QoJ8k0qjjNLjqNoK1pNk0JJKkOnqj2QMJ1
4089Aj6MKOKn%j8J1%J6k0QMjoNRmrMjJ6kL%j4%jK2j5NJ1j8oOJ5Nj8JMqjJ6mkj
4136FKqMPj4Lj3J2Mj0j2PJ3koO%j4KlK0j3kMj1J5MJ6jj5JrLJ3n%j4J5oJ4j1j6
$$ y = [-12, 4, -10, 0, 13, 6, 8, 1, 4, -5, 5, 3, 5, 13, 16, 5, 7, 14, -13, -1, 18, 11, 11, -5, -4, -11, -16, 15, 7, 8, -8, -13, 0, -9, 0, 8, -3, -15, -16, -17, -2, 3, 1, -7, -6, -11, -5, -2, -11, -6, -10, -16, -5, -6, -10, -1, 3, -11, 5, 2, -8, -9, -8, 19, -2, 7, 10, -2, -11, -7, 5, 14, 10, 1, 8, -1, 3, 20, 20, -1, 10, 2, 13, 15, 8, 0, 11, 7, -3, -7, 5, -2, -14, -4, -9, -15, -6, 5, -5, -14, -12, -4, 5, 0, -9, -16, -15, -5, -9, 8, -4, -11, -1, 3, -10, 5, 0, -5, -2, -17, 3, 7, 4, -4, 0, -5, 3, 7, 4, 10, -3, 2, 0, 7, 5, 12, 14, -1, 13, -1, 3, -5, -5, 4, -1, 13, -1, 6, -3, 1, -13, 0, 11, -2, -12, -18, -12, -10, 4, 9, -5, -12, -14, -4, 2, -3, -1, -7, -6, 5, 0, -3, -4, -6, -3, 2, -2, -6, 13, 3, 5, -5, 13, 2, 3, 15, 8, 2, 15, 15, 5, 0, 4, 1, -7, 19, 21, 9, 2, -6, 6, 15, 7, -1, 6, -10, -16, -16, -2, 10, 0, -31, -17, -7, -3, -4, 0, -11, -21, -9, 1, -14, -14, -19, -10, -21, -17, -4, -14, -12, -8, -13, 1, 0, -8, -17, 1, 2, 1, 9, 6, -7, -7, 8, 16, 10, 28, 8, 0, -1, -2, 3, 6, 5, -3, 2, -4, 17, 10, 15, -5, -4, -3, -1, -3, 3, -2, -10, -22, -14, -10, 1, -15, -11, -9, -3, -1, -6, -6, -24, -13, -13, 3, -17, -9, -5, -6, -12, -7, 2, -2, -11, -7, -8, 8, 6, 9, 9, -5, -5, -6, 16, 1, 6, 17, -1, -7, -1, 14, 19, 1, 2, 6, -2, -3, 13, 9, 7, 6, 8, 0, 4, 11, -3, 0, -13, -1, 3, -7, -19, -12, 1, -1, -7, -1, -1, -15, -13, -16, 4, -9, -11, -7, -18, -3, 1, 17, 16, 1, 2, -7, -4, 9, 4, 4, -10, 5, -1, 13, 2, -14]
4178a4J6Nk%Oj4KJ5OoNk1QJrJ0Lj0LnnJ3qk%j0J2KLj9J0kPj0%J0rPj6nK1j1lJ0
4222fJPqJ2Jj7lK4pK%Pk2QOJ0Mj4jqMMJqJRkOoqRj3RjjoJ8j5j3PJ0Nj1j5J2JN
4269bj0j5J4mlJ6Qj3j0NOpK6k6lKJ7J%JoOk%J%Nk2J2J7MrPj6jKqMJ3%qK%oj8N
4315a5JJ1Kj7J7Lj6kJ0nJ6j4k3K8kmJ6lj4j0J0OLmJmj0J1OLqk6K9lJ2rNnnJ0o
4356e%kKMKRMLj6JnQlNkj0OmK6l0j6RJ6jNj7jkj0J4JLjj3J2j1K0j5J8j3J0oMj
4400bJ3qnoJ1Rj0k2L1j5J0Oj3kR%JJ1j0Nk0MNJJ0mj2nRoPNqpOnOLqMklJkNpJ%
4448iOMpnnNOJ2qoRoJ9j3m%J3k2K6lQrj6PMMQQj4rKNoLmj4J6jOlk6K4mJ0j7Qj4
4495a2J4j3M%%jKJLjLj3J3JpLLQj6ljJ5lK%j5RJ0rJ0Q%j3LMjQlj1kNoRNmMqjJ
$$ y = [-14, 2, 7, 5, 5, 11, -3, -1, 14, 20, 14, 19, -2, 6, 7, -2, 8, 11, 1, 4, -1, -6, 7, -1, -3, -3, -13, -1, 1, 4, -15, -5, -7, 0, -10, -10, 0, -9, -2, -18, -23, -2, -13, -16, -6, -5, 2, -6, 6, 7, -10, -13, 11, 4, 6, 6, 13, -9, -1, 5, 15, 19, 5, 4, -4, 0, 4, 5, -3, -2, 7, 5, 11, 5, -3, 6, -7, 2, 1, 0, -6, 12, -3, -16, -9, 1, 6, -5, -20, -8, -7, -2, -12, -27, -13, -17, -20, -4, 4, -9, -19, -14, -8, -15, 11, -15, -18, -16, 1, 2, 2, 3, -3, 3, 1, 1, 2, 2, 7, -15, -3, 14, 18, 9, 16, 0, -1, 1, -7, -3, 10, 10, 2, 4, 4, -2, -20, -15, -14, -3, -1, -18, -1, 2, -14, -16, -6, -11, 5, -9, -32, -4, -6, -10, 6, 3, -11, -21, -11, -5, -2, -6, -5, -9, -19, -8, -2, 1, -7, -33, -4, -7, 5, -4, 1, -4, -9, 1, -5, -5, -7, -5, -1, 1, 10, 14, 17, 1, 2, -3, 5, 2, 7, 5, -5, 1, -3, 23, -7, -23, -14, 2, 1, 6, -11, -12, -14, -24, -10, -9, -6, -7, -20, -8, -19, 1, -14, 4, -9, 1, -5, -1, -2, 11, 3, -2, -8, 3, 12, 2, -20, 11, -4, 6, 12, -1, -3, 6, 6, 7, 18, 8, 13, -7, -3, 2, 3, 13, 9, -3, -8, 1, -5, 2, 7, -1, -8, -2, -7, -1, 2, -6, -2, -4, -7, -6, -8, -3, -10, -9, -9, -3, 1, -6, -11, -16, -11, -5, 7, -1, -7, 2, -4, 15, 2, -2, -2, 11, -11, 15, 12, 20, 11, -5, 2, 6, 10, 18, 26, 12, 3, 5, 10, 4, 7, 3, -11, 5, 4, 10, 7, -19, 5, 1, 11, -6, 2, -12, 2, -11, -7, -7, -7, -8, -6, -5, -2, -3, 0, -13, 0, 1, -6, -3, 0, 8, -8, -11, -12, 3, 0, 2, 2, -13, -4, 6, -3, 7, 15, 15, 2, 5, 9, 8, 16, 13, 2, 0, 5, -1, 8, 13, 9, 13, 5, 4, 5]
4544Emo%Rkj2Qj2%J3pKn%LjNjJ6k0nNjRrJ4j8MKKMj3NJ9j6J0%NpJjJoQJMoJ2M
4593A9j3J0j4lPJ3j2JlJpNJ3j4knnJ0qJRqMnMJnpMJ3mPk5NORj7K8nj7J5Mj2nL
4638djRkJ5j1nMnJ5Mo%MJj2%OJ2j1j5pJ1MNj%j6lKNKj0QmrOM%j2JJ3Mj9QnJ3o
4685hkRjo%J3KRj4pJPjQLmoMLKJ0k0nJ0lqJ7j4J4k2J0J0nRk0J8mqOMj5OjJ6j9
4730bnkQrQNnQj5nJ0jnOjnlOJ3o%lOjqRO%pQKmNNj5PLj1J0lLqLRLj6lQpmJ2j9
4782a0Q%kPprNmRnKkMQnkjmmJ8prjJ0j0PK%rJ7pJJmJ5nkkRJNpNlk2K7mjKkQj2
4834IJ3jr%qkjkmNMj6J0lqJ6rjmOJKj2J2%nJ4lj0%NJ0Kj3nNMQJ1j3Jj1MmKJ4n
4881IpRjJ0Kmj9KQnKJQj5KJ8k6J2qLlJ2Jj9OkrLJ0mjpPrR%j4J4nPKJ0j2qJ1pL
$$ y = [5, 1, -5, -5, 4, 2, -10, -2, -14, -14, -1, -8, -6, -11, -11, -8, -9, -4, -5, 11, -9, -14, -9, -10, -1, -10, 4, -14, -10, -8, -6, -2, -15, -10, 9, -7, 3, 3, 8, 1, 2, 1, 2, -4, 4, 5, 9, 3, 15, 19, 6, 16, 2, -1, 6, 19, 7, 8, 5, 6, -1, 4, 17, 3, 1, -4, -9, 1, -7, -6, 3, -5, -1, -6, -2, -1, -6, -13, -9, 4, 0, 7, -18, -13, -7, 2, -15, 13, 8, -9, 6, 10, -2, -7, -4, -5, 4, 2, 17, 6, 1, 5, 0, 15, 19, 13, 13, 17, 18, 6, 6, 12, 24, 13, -2, -9, 2, 6, 11, 10, 10, -6, -9, -7, -2, 0, -10, -2, -6, -15, -9, -5, -5, -17, -16, -3, 1, -18, -10, -15, -2, -8, -10, -1, -2, -8, -8, 5, 7, 16, 2, -5, -4, 3, 2, 10, 13, 9, 3, 7, 10, 12, 22, 2, -3, 7, 4, -4, 13, -1, 13, -9, 1, 11, 6, 15, -5, 13, 9, 1, 7, 11, -4, 2, 1, 17, -2, -7, -9, -1, -10, -2, 3, -2, 6, -9, -14, -4, -5, -10, -4, -5, -10, -13, -7, 6, 0, 0, -3, 3, 2, -6, 3, 9, 9, 2, 10, 12, 8, 13, 18, 3, 10, 13, 2, 12, 9, 12, 4, 7, 16, 19, 3, 0, 8, 1, -3, 9, -10, -2, -2, -4, 3, -4, -13, -8, -12, -3, -8, -6, -8, -4, 4, -1, -3, -4, -8, -12, 6, -1, -10, -11, -1, -11, -4, -2, -2, -11, 6, -1, 0, 1, -3, 12, 7, 5, 3, 12, 13, 18, 11, 16, 13, -9, 18, 14, 13, 15, 13, 21, 9, 22, 21, 12, 12, 4, 2, 1, -1, -5, 0, 4, -12, -2, -5, -13, 3, -6, -7, -11, -5, -4, -2, -14, -2, -2, -7, 7, 4, -6, -6, -1, 9, 11, -2, -7, -2, 2, 10, 21, 8, 9, -2, 2, -2, 0, 14, 9, 2, 11, 10, 20, 22, 18, -1, 1, 9, 4, 6, 7, 15, 0, 2, 20, -6, 6, -2, 1, -2, 10, 11, -8, -2, -4, -13, -10, 0, -4, -5, -12, -5, -14, -5, -5, -19, -5, -10, -3, -1, 9, -3, -11, 0, -7, -4]
4928d%J2jjj4J0J1onRj6PJ3oJpKkJ4lnlj1J4j7J6mkkj2J1J3oqJj1OKlljkPMkm
4974h%j2J9NJoNrljJ7j9Qj3J8RKNrKOrPKj0RqmKMPj9J0mPrJ0mqJ1nnNmnJ0qnL
5023colMLjLLLj1qK0rKnQJ0mj1J2%loQlln%J0j0RK0k1KJ4j0J3kKoj3qJ6Kj5J0
5068HoJ5j0Qopk2MP%MJmpJ2j5J4m%J2j2JkJ1j0o%J2NJnqNMm%lJ0%NNroKQpKmJ2
5117A1j7%QPkkrNOMp%oJ3k1NRljj0J5njj3OmOkMjr%mMOJJ5jj7OJ2rJJ3j0PLkq
5166COjKJOJpnQrJ0mmLj6MJ2j0PlLj0JJ3Lj3JqjJ0oNkkJrPrJ1j0J7lnMj2J2mP
5214EpJ7j4OMJpLrNMNMj1J8j1jLo%Qj0O%mkpkmOL%kjnLJNj7J0qJ1lMnlJoLJ0k
5265ajRqpkJ4%mjlOJ0momKRkOlllNLQmkJ0k5J0%NpQJ0j5kJlrRj1POqkNNj6MLp
$$ y = [-4, -4, 8, 7, 6, -8, 2, 13, 7, 2, 11, -5, 2, 15, 9, 10, 3, 5, 3, 17, 14, 9, 6, -5, 9, -8, 8, 4, 2, 0, -12, -1, 12, 6, -2, -1, -12, -6, -4, -7, -10, -11, -13, -6, -2, -4, -8, -8, -20, -1, 4, 5, -1, 4, -5, -8, -9, 8, -11, -3, -16, 2, 11, 13, 18, 9, 11, 17, 8, 15, 17, 7, 16, 8, 4, 6, 10, 17, -2, 8, 4, 11, 2, 12, 8, 0, 11, 6, 1, 6, 2, -3, 7, -1, -6, -3, -9, -12, -8, -5, -6, -3, 0, 3, -8, -16, 4, -5, -3, -8, 0, 10, 6, -5, 7, 7, 4, -2, 6, 3, 0, -5, -5, 5, -5, 4, 24, 3, 5, 19, 9, 22, 20, 22, 16, 3, -5, 11, 13, -2, 8, 2, 17, 7, 15, 9, 2, -20, -16, -9, -9, -5, -4, -8, -15, -3, -18, -4, -8, -8, 4, -8, -7, -9, 2, -8, -14, -14, -2, 3, 4, -1, -9, -4, 0, -4, -4, -7, 3, 3, 8, 13, 4, -2, 0, 8, 1, 3, -1, 11, -6, -6, 2, 9, 7, 5, -4, 1, 7, 11, 4, 4, -2, 11, -10, -5, 4, 1, 0, -10, 5, 0, -1, -14, -8, -12, -6, -8, -4, -5, -14, -14, -18, -14, -8, -7, 8, 7, -10, -4, 8, -1, 0, 13, 3, 10, 13, 11, 3, 9, 8, 10, 11, 17, 18, 11, 6, 14, 5, 15, 11, 7, 10, -6, -2, 10, 0, 7, 4, 7, -3, -2, 11, 14, 1, 2, -6, -7, 3, -3, 2, 0, -2, -1, -10, -3, -12, -1, -11, 6, 3, -2, 2, -10, 2, -2, 5, -2, 15, 1, 7, 11, 12, 5, 8, -1, 4, 8, 13, 17, 6, 24, 13, 12, 15, 9, 9, 17, 7, 13, 13, 9, 7, 0, -2, -6, 0, 3, 3, 1, 0, -5, -2, -1, 4, -13, -3, -11, 0, -3, 1, -4, -7, -6, -12, -9, 1, -1, -2, 7, -1, -8, -10, 4, 4, 0, -1, -4, 2, 12, 8, 2, -2, 0, 9, 7, 13, 10, 7, 4, 9, 12, 20, 16, 14, 24, -1, 9, 9, 14, 7, 15, 25, 10, 8, 9, 6, -3, 6, -5, 2, 8, 0, -2, 3, 8, -8, -4, -1, -8]
5317hjLoJ1qmJ1J2oJj3JOjKKjMj0MNJPqPj0J2kJj6%MkJ0rKJ2r%RmkmQprqJ1No
5367cMpoNjkKpMPOj8KM%lPJOlk0J8J5j2nJ1MPlNojJ2j5K1j0m%KkrK1k2OnJ6j6
5414FLlPnMqOojJ2j6NkOj1NkoLLj8J0J4j3lJ3oNj0J1jNnJrPnP%rJ0J0rJ0J3j7
5460A1KLj2J3j7J6j0MJmJ5k2LJ0p%j3QmJ0NnpLJoOljjMj0%j6K0lQj7PkJ6jpPo
5505aKj3J7j4PKjlJ2l%lJLQnjkKlJ2j0KpkKRPrQj3JpJ0qj1J8j6KJ4qpPqKnKLJ2
5554Ej5LllJ1nLOj0J0j0J1rRO%nkjnK0j2J%pJOkmOKj5PqJ7JrKPlnLQoKNj2%Jj0
5604h%KPj2Mj2K1lmqQkj2J0jPJoQLOqMlRLkkj7J7lkRj3J9mjpNmklqjQJ2j1r%J
5654d%MMmrJoJ5llPkj3%PnRKmj1J%mJ5k%Pmjj1RkjJJ1J0kj7J0j0JK1oOnOrKqm
$$ y = [-8, -9, -6, -12, -1, -9, -13, -2, 10, 4, 5, -8, -7, -1, -2, 0, 2, 1, 5, -5, -1, 4, 5, 12, 4, 11, 1, 13, 11, 12, -4, -4, 0, -2, 8, -1, 1, 13, 4, 4, 13, 9, 7, 3, 11, 4, -5, -13, -2, 3, -3, 1, -6, -12, -7, -8, -10, -8, -15, -11, -4, 2, -16, -14, -10, -10, -13, -6, -5, 1, -2, -22, -4, 11, -1, -6, 5, 9, 16, 13, 18, 12, 11, 23, 8, 29, 19, 15, 15, 17, 15, 6, 27, 5, 11, 6, 22, 6, 9, 6, 13, 8, 12, 4, 10, 4, 3, 15, -1, 4, 2, 8, -3, 2, 0, -6, -3, 0, -18, -8, 6, -7, -10, 3, -3, 2, -8, 3, 2, 7, 2, 3, -6, 1, -4, 3, 3, -6, 4, 14, 5, 15, 28, 11, 13, 16, 4, 17, 0, 16, 6, 10, 11, 7, 22, 0, 3, 13, 6, 6, -7, 1, -3, 7, 12, 7, 0, 3, 4, -2, 4, 1, 0, -1, 3, -7, -7, -23, -3, -6, 2, -15, -8, -10, 6, 5, -2, 5, -1, 1, -12, 5, -9, -2, 0, -1, -4, 8, 5, 5, 2, 3, 6, 14, 9, 8, 6, 8, 5, 17, 7, 9, 2, 0, 2, 11, 18, 9, 17, 4, 5, -2, 8, 0, -11, 7, -9, -7, 7, -1, -8, -1, -9, -7, -12, -10, -7, 5, -10, -7, -10, -13, -2, -7, -4, 2, -8, 2, -8, 3, -6, 3, 9, 9, 4, 2, 1, -4, 16, 4, 5, 5, -2, -1, 5, 3, -1, 5, 7, -8, -1, -9, 8, 9, 0, 2, 9, 6, 1, 4, 12, 6, 8, 13, 1, 1, 2, -8, -8, -6, 1, -11, -7, -19, 2, -1, -5, -13, -5, -7, -19, -9, -10, -3, -2, -8, 0, 3, 9, 1, 5, 2, 11, 14, 12, 10, -7, 10, 7, 5, 14, 1, 20, 16, 15, 8, 13, 9, 7, 4, -4, -5, 3, 15, 4, -5, -5, -4, -4, 0, 4, 0, -9, -8, -14, 1, -2, -5, 2, 0, -13, -13, -6, -11, -2, 0, -4, -15, -14, -14, -18, -3, -5, -5, 2, -2, -3, -14, -5, -7, -8, -7, 4, 14, 12, -5, 5, -5, -4, 17, 11, 17, 12, 18, 9, 11, 3, -1]
5704aNJ4j4jrKjQjKLkJpj4J1Jj8QJ1Pqj1Rj2lJ2OkMj1PMj1J6p%Mjj4J6mkmJ0q
5750eQKP%qOlmKMj5RqOlKNlpNqnj%JNjOpKnJ1j0Rj1NPjj4J8j4LOKNn%qJ9pLpJ
5803alJ1nJ3j0lqJ8j7J0oM%pNJ0jj4J3j3J7j0j1K1j4rPmMPnkj1J4j4J1jlolJ0
5844froJ6pl%QpJ2j2MPj5J7qjJ4rJ6%JoJmLNj0LJOjLppkqK6j8P%j9OnJ4olqJ9
5892BjrPmlnjJ0qLj1nLJ8k%qPkkJ0jj2J1nPmkqK1%QlkrPrJ8Lj5kKLj1OKpNj5J0
5942cP%oLJ2j5J2j4pmJ2LqMnJlMLLkJqKmJ0K%j1MJ1J%j4J0OnJ0l0J3J5lPjj1J1
5988A3j0QJj5PKlQ%oJ0ooKJrLrJJ5j3Oll%qlJ0J0ooMknJ3kJkQmJ4j5j0K4k4O%
6035cnJ7jpJNoP%%qjkJ2OlKj4J2qqPpJ2rNNoNqjnK0j8Lj5Rjkp%kJ5qMKKqlQo%
$$ y = [-1, 4, 18, 4, 3, -6, -4, -5, 3, 2, 4, 7, 5, 6, -1, -15, -4, -3, -21, -13, -2, 5, -3, -14, -5, -17, -20, -8, -2, -4, 0, -11, -4, 0, -11, 5, -2, -2, 2, 1, -13, 3, -1, -3, -7, 3, -5, 3, 5, 12, 12, 4, 10, 7, 3, 5, 9, -6, 3, -5, 1, -2, 0, 5, 2, -5, 0, -8, -13, -14, -14, -13, -8, -9, -3, -10, -8, -13, -2, -12, -3, -14, -9, -2, -3, -17, 1, -13, -10, -4, -2, 3, -2, -2, -10, 9, 2, 5, -2, -1, -4, 7, 2, 15, 5, 2, -6, 12, -5, 5, -1, 3, 3, -4, 1, 11, 10, -4, 9, -4, 13, 3, -8, 13, -1, -10, -3, -7, -3, 4, -1, -3, -14, 0, -14, -3, -4, -7, -13, -16, -6, -15, -21, -5, -12, -15, -15, -7, -14, -2, -14, -10, -3, -18, -1, -9, -10, 4, -5, 11, 11, 12, 6, 7, 3, 6, 11, 1, 4, 5, 11, 10, 13, 6, -1, -3, -11, 15, -3, 4, 4, -15, -9, -14, 0, -6, -9, -17, 2, 1, -8, -1, -5, -8, -13, -14, -4, -12, -9, -20, -25, -22, -4, -6, -6, -14, -7, -9, -11, -1, -2, -14, -3, -8, -1, -5, -7, -15, 6, 6, 14, 11, 9, 0, 7, -2, 16, 19, 4, 2, 4, 7, -4, 2, 4, -3, 2, -13, -3, 4, 4, -2, 1, 13, -2, 10, -4, -11, -15, -3, 0, -8, -4, -9, -8, -11, -7, -4, -1, -3, -2, -10, -8, -12, -2, 0, 0, -11, -7, 4, 5, 5, -9, 1, 7, 2, 12, -18, -5, 10, 7, 14, 13, 2, 13, 3, 11, 12, -3, 4, 6, 3, 11, 11, 5, 15, 9, 3, 5, 6, -3, 0, -9, -8, 7, -6, 0, -3, -6, -6, -14, -17, -7, 3, -3, -9, -5, -7, -12, 1, -1, 0, -2, 6, 2, 16, 1, -9, 15, -9, -3, -3, -8, 9, 8, 1, 2, 7, 1, 8, 8, 8, 0, -1, -3, 9, 15, 12, 14, 0, 12, 4, -4, 3, -4, 8, -1, 4, 9, 3, 8, 0, -1, -6, 14, -4, -1, -16, -7, -8, -10, -17, -17, -19, -4, -12, -8, -6, -4, -12, -15, -7, -13, -13]
6087a3J4%LqnPLNnMjKoQmJ1nlQj5KlPJJ%rkJ3%%j6kPMJL%j1lMj4K2j6oKRj0KM
6137a0Mj3PJMj0RkJ0j0J0%pJ4MjqKnRj4J3OkknklQMJMk4PPj1OJ0k5J0OlNj5j0
6182b1J0JnKJ3j8J5j%JqJ3j5J3pKrJ3NqmL%%J1rqOJ3j2PLkj1RJ4j9J5rMKMJlk
6227IpPj5J8mmJ0k1J3moNOoJlJoj1MJ6j6pQOpOj%J3j1J7j7Qj7J4JOOqlMPKj4J6
6273A6plrNJ3j2koK0j4J2%J1j1onJ5Jj3%plJ2j3nJ4lpkORmOj1j1pJ5KqjJ0mOL
6317Bj2Rj2J1KP%qJ9l9J9J4j6LjJ5rjK2j2j5J3moNnOjrJ0pPj3%%MqQKjj0jK0j7
6361iK%mNjmLMNnkmPj7jJ3KpJ0jj3KOnJ6jlNjkP%jQLjLjj4MqRmjM%j8NPKj6Mk
6414a0JMOj7J3j1JlJ1MKj3Oj4J7nj0KJ3pLQ%j0Nj0K6j9PRk%j2NOKlPJkrJ8j7n
$$ y = [-13, 1, 1, 4, -4, -9, -2, 1, 6, 1, 5, 4, 6, 0, 8, 4, 15, 10, 7, 15, 0, 2, -1, 6, 7, 8, 8, -1, -3, 10, 10, 10, -6, -8, -1, 3, 4, 7, 7, -4, -7, -3, -17, 5, -11, -17, -15, -6, -16, -14, -10, -6, -19, -12, -11, -7, -17, -8, -10, 0, -10, 0, 0, -7, 7, 11, 10, 2, 4, -1, 8, -6, 7, 13, 11, 9, 4, 2, -1, 7, 11, 12, 16, -8, -1, 6, -5, 1, 11, -14, -4, 2, -1, 4, -11, -21, -11, -10, -15, -13, 0, -18, -3, -4, -4, -3, -11, 2, -13, 0, -7, -5, -14, -1, 4, -4, -8, -5, -5, -5, 6, -3, -11, -5, 8, -4, 3, 6, 4, -7, 2, 16, -3, 12, 3, 7, 9, 13, 14, 11, 9, 2, 9, -6, 12, 8, 4, 14, -7, 6, 2, -4, 1, 7, 1, 2, -1, 0, -6, -17, -13, 3, -13, -20, -12, -6, -13, -7, -8, -8, 5, -6, 11, -6, 2, -15, -1, 0, 6, 12, 4, 1, 5, 12, 14, 0, 16, 9, 6, -3, 2, 15, 3, 1, -5, 15, 1, 13, 13, 24, 13, 7, 2, 17, 18, 5, 5, -2, -5, 7, -6, -11, 3, 0, -7, -9, -3, 6, 2, 8, -3, -14, -21, -6, -4, -12, -13, -3, -7, -1, 2, -10, -1, -13, -2, 0, 7, 7, -1, 18, -21, -2, 12, -4, -1, -2, 13, 4, 3, 25, 13, -2, 11, 7, 1, 6, 1, 7, 6, -3, 7, 0, 7, -6, -6, -6, -2, -10, -2, 0, -1, -11, -12, 8, -9, -7, -7, -11, -6, -7, -11, -8, -4, 1, -4, -6, -10, -3, -20, -21, -8, -6, -13, -3, -4, -17, -15, -9, -14, 2, 1, -2, 3, 2, 0, 7, 7, 6, 14, 17, 16, 19, 18, 4, 8, 0, 9, 5, 4, 8, 8, -10, -5, 2, 4, -12, -8, -10, -9, -5, 1, -16, -3, -14, -13, -16, -5, -1, 1, -12, -6, -20, -3, -8, -18, -16, -3, -10, -7, 1, 1, -9, -4, -14, 12, -7, 0, 9, 7, 7, -5, 0, 6, 8, 5, 12, 13, 11, 2, 20, 3, -2]
6458bLK2j7NkkmNOp%j0RmplNqJ3j6J2KrJ1omLolQOk1J6oJ0mRj3KJ0qQJ0KorjM
6506C%JLKmPj5NJ2j5O%pNJ2k2J6j6J4j0j4J9kj0oJ1oMKnqJ3qOJLpRj0JmQJoJ1
6551@mqJ5j7LJ0KKMjoRj3J7j0KPj0M%oQjlj0MJ1roJ0kMk2MJ3KrOkj3RJ1llKJ0
6597A1j3kNpKOqOlJjOnjLr%RJ2Kk2J1j0OJJ6oj2JNQj4J6KnMlmqOj2MkJ7j1nJ8
6644A5j2jj2Lm%RnKJ0j4lPRj0NRk2LOKL%MpmnLRQqkPj4QMMrPQpJ0j5MmP%mRqj
6695DPnKqmPljMqmLPj2J4r%Rj3nQpLKMKPklKQrlJj%kLLoJ1qLLlLMjrNQj8PQlJ9
6751B4k0L%Jj3MQlokLkOnpMNo%mPo%Lmj0K5rkkpQRj1JJ7Nj1nJ1j5J0rJ7j0jJk
6799@O%N%nqQpLlQPjj5K0j0lnkKPJrLqmJ2j0RpjJ%%jMj1Oj1J7lLlPJrjJoJ9nN
$$ y = [-2, 1, 23, 6, 11, 9, 7, 3, 8, 14, 7, 7, -3, 6, 2, -5, -8, -3, -11, 2, -14, -2, 0, -9, 2, -4, -8, -5, -11, -14, -6, 0, -21, -5, -11, -1, -5, 4, -9, -7, 3, -5, 3, 13, 15, 9, 0, -1, 3, 3, 4, 7, 9, 5, 12, -3, 2, 14, -1, 5, 5, -2, 3, 15, -7, 9, -7, 7, -3, -17, 2, 0, -10, -16, -5, -11, -7, -5, -10, -18, -5, -13, -7, -6, -3, -10, -1, -11, -10, -14, -6, -5, -11, 0, -4, -12, 3, -14, -11, -1, 1, 3, 7, 6, 0, 9, -4, 13, 3, 5, 12, 2, 6, 6, 0, 8, 7, 4, -6, -2, 9, 0, -6, 4, 2, 6, -16, -12, 1, 3, -6, 0, -2, -15, -6, 5, 2, -1, 1, 11, -2, -4, 1, -6, -4, 2, -6, 0, -3, -2, -3, 3, -2, -3, 0, -9, -9, 0, 12, 14, -8, 3, -7, -1, 0, 16, 10, -2, -1, 4, 12, -2, 14, 16, 11, 15, 12, 8, 0, 6, -6, -2, -4, 13, 2, -3, 15, 3, 2, -10, -7, -11, -11, -2, -7, -5, 5, -9, -12, -5, 4, -6, -1, 8, -14, -11, -5, -3, 0, 0, 4, -3, -7, -12, -9, 0, 8, 0, -2, 5, -9, -1, 3, 7, -2, 5, 13, 6, 16, 1, 5, 1, 8, 8, 4, 13, 5, 4, 11, 6, 8, 0, -4, 3, 0, -1, 3, -5, -9, -6, 1, -11, 3, -6, -6, 3, -10, -15, -7, -14, -11, -9, -5, -3, 4, 2, -1, 1, 9, 0, -3, -2, -3, -3, -5, -2, 1, -5, 6, -2, 1, 4, 1, 4, 8, 7, -2, 3, 11, -7, 0, 8, 5, 24, 4, 7, 7, 8, -5, -1, 7, 4, -2, -4, -1, -3, 3, -2, -9, -5, 0, -6, -6, -10, -3, -9, -9, -6, -10, -20, 5, -4, -6, -8, -15, -7, 2, -9, -8, 9, 14, 3, -2, 9, -6, 4, -5, 12, 2, 1, 2, 0, 6, 6, 11, 11, 6, -2, 6, -1, 2, -1, 7, 14, 13, -2, 18, 8, 5, 0, -2, 0, 7, 8, -1, 2, -6, -10, 2, -8, 1, -6, -7, -6, -6, -6, -7, -3, -14, -8, -19, -2, -5, -2, -5, 2, 3, -6, -7, -6, -12, 7, 2, 7]
6851GoJ2mm%MKpJ0poLKJ0jj6RkljqJ5j0kJ2j7mK4j4%J0j6kjJPmLoNqKOLKNj7%
6899a2OOplJ0j0O%KNPj3QRqOj5J5j7J4%pjNQk%KjnoLQr%j4J0Qj2jMrJ1%rlPpK
6948imJ0pNJ0j1oJQJ6qnj%J0j2J2j1LRjmjK%kpPPnKmJ4j1PnLQk2%J1Jq%oJ7Nj7
6996ANq%Nj5kOLkMlJ0j8ML%KRmkQj0pPQJj2J1KkLlkKLNpMoqQkO%Ok1J3Nj1MNn
7048CpJ1Kkj2J0Mk3J6m%j2OlkJ5j1KOoJ3j1j4KMMKPrNplNJ1%ojPJ3Mj5QJjJlN
7095A5%pqLMKKJljj2K0j7JK3j6lj7J0JLqj0K1lj3NRrnJ7q%%JrRLj0LkoJ3mkj1
7141a8J6PJ0mpnlQP%%KoLkJ5j9%jjmJ4rjknJ1knJj2MO%oKoMnnpJ0j0K3pnP%lq
7191a8J6NkNj1MqQLj6LRJ5mj5K1nj3PnqK4j2Oj2J0KJlJmmPpOjjrJnJ6j5QpJKq
$$ y = [7, 1, 13, 9, 5, 5, 9, 11, 4, 14, 7, 1, 4, 6, 16, 15, -1, 8, 6, 3, 2, -6, 9, -1, -3, 9, -8, -12, 12, -2, -2, 8, -8, -10, -11, -10, -3, -7, -4, -10, -5, -13, -11, -5, -2, 0, 5, -12, -12, -6, 0, -7, -10, 0, -10, -4, -4, -2, 3, 10, -3, 5, 14, 6, 12, -3, 12, -5, 9, 9, 2, 1, 6, 14, 12, 12, 14, 13, 8, 2, 5, 13, 4, 4, -10, 0, 8, -4, -5, -1, -10, 1, 1, -8, -11, -4, -11, -9, -13, -3, -10, -5, 5, -6, -12, -11, -3, 13, 5, 0, -1, -1, 9, -3, 9, -2, 1, 10, 9, 5, 4, 6, 6, 4, -3, 4, 11, 6, 8, 4, 18, 7, 14, 9, 12, 20, -2, -2, 9, 10, 2, 2, -4, 13, 18, 1, 6, -2, -2, 3, -12, -14, -8, -5, -7, -3, -6, 4, -14, -10, -7, -7, -5, 4, 0, -2, 6, -4, -11, -4, 4, 5, -7, 4, 6, 4, 7, 4, 2, 4, 7, 12, 5, 9, 3, -5, 3, 1, 7, 7, 13, -8, 5, 10, -1, 3, 8, 3, -4, 7, 9, 7, -5, 5, 9, -14, 2, -2, -2, -14, -8, -11, -13, 2, -9, -7, -1, -7, 6, -5, -19, -17, -13, -9, -7, 0, -9, -4, -11, -14, -9, 2, 2, -4, -5, 2, 15, 19, 4, 12, 13, 12, 13, 10, 15, 15, 8, 0, 3, 7, 9, 11, 12, 9, 8, -4, 16, -1, 0, 23, 7, 4, -13, -3, -2, 1, -7, -17, 4, 1, -12, -7, 2, -7, -12, 5, -3, -3, -3, -2, -11, -2, 1, -9, -6, -8, -14, -1, -5, -7, -18, -2, 5, 15, 11, 4, -1, -4, 4, 11, 11, 11, 13, 7, 10, 8, 23, 4, 4, 3, 2, -2, 12, 3, 2, 0, -5, 6, 4, -1, 0, -12, -8, -2, -2, -8, -6, -12, -8, -13, -18, -25, -15, -25, -2, -9, -14, -7, -7, -10, -18, -2, 3, 1, 6, -5, -1, -9, -1, 2, -14, -11, -2, 13, 9, -6, 15, 10, -3, 4, -1, -9, 15, 3, 9, -3, 7, 9, 10, 7, 8, 4, 0, 7, 0, 6, 5, 4, -5, -4, -9, 7, -8, 0, -7, -6, -4, -12]
7238a2PqMlnJ3j1jMoJ5KmOJNonnJ7rK%NNojlLpJ6Nj0MpLkrj%ONqJ3lkj9J5Qj3
7288brQJ1Mk1J2mqLmjRnj5K1oKrJ4klrNRnNJ0j5KJ1kpJjP%J0nnqLJOkj7K0Kj5
7336dJRKj0llNonMLLL%%pJ2qjPqnljJ4j1nJ4n%moMOoJ4jqJ1nK%NJmJ2j9J3NnJ0
7387A7j8J8j3JkQmlJ0kojmMj8LJ2Jj4OmqJ5l%%nNkolRlMJONj4KMP%Nj4J7j3Rq
7435APjrMj%MKLmj4QJ0LlOnk3K0qLLj%kj0kJ0kJlLj8J5Lj6J0%mjnRmJ5j4jJ1r
7483iMJ0kp%%kLJ1j5J5OMqj0KJ2nJ1j6mJ2j3J3qQj2jOQj0kMMpMopMJ2nqN%nkq
7530a4J5j0j2J1oJ0qJ8kqJkJpQpNJ1KqpNK0j8RKJ1oj%Kj7ORoJ3pj2JpoLJ0Kpm
7576gKKJ2%%j3nkJ0kNj4NJklPLOk4J5nJJ0pjj0K7j9jJ5k0J8J3j2nPmNqJ3Lj4J4
$$ y = [-12, -5, -13, -9, -12, -17, -4, -15, -16, -12, -18, -3, -1, -5, 1, 2, 7, 1, -4, -9, 8, -1, 1, 1, 6, 11, 5, 4, 1, 4, -3, 13, 18, 8, 12, 5, 8, 6, -3, -4, -4, 2, 7, -1, 12, 9, 7, -12, 3, 11, -2, -11, -3, 8, 12, -9, 3, -1, -9, -6, -10, -11, -2, -7, -22, -1, -7, -5, -14, 0, -2, -5, -14, -9, 0, -5, 0, 10, -5, -3, 8, 6, -1, 0, -1, 6, 6, 16, 11, 6, -2, 1, 2, 8, 6, -11, 9, 11, -4, -3, 6, 8, -2, -5, -8, -3, -9, -14, -10, -7, -4, -1, -1, -1, -8, 4, -4, -5, 2, -6, -11, -14, -15, -1, -12, -17, -3, -8, -8, -12, -18, -14, -8, -14, 0, -1, -9, 2, -3, -1, -1, 4, 5, 1, 13, -6, 7, 12, 7, 17, -1, 17, 4, 5, 3, 11, 7, 4, 14, 12, 6, 5, 1, 5, -13, -10, 2, 3, -11, -5, -9, -17, -2, -5, -5, -5, -10, -5, -7, -13, -16, -7, -10, -6, -5, 1, 6, -8, -6, -2, 5, 5, 10, -4, 13, 0, 9, 1, 8, 7, -2, 2, 1, 1, 5, 7, 10, 6, -8, 0, 10, 13, 10, 16, 11, -12, 8, 0, 3, 6, 5, 5, 3, -7, -9, 1, -1, 0, -3, 0, -18, -3, 0, -16, -6, -6, -10, -11, -16, -7, -11, 4, -10, -11, 0, -9, -5, 5, 3, -4, -4, -4, -6, -3, 8, -7, 8, 14, 18, 10, 0, 2, 14, 9, 20, 4, 0, 12, -1, 12, 4, 12, 0, -1, 5, 13, 3, 1, 5, 9, 2, 6, 0, -7, -3, 9, 4, -4, 1, 1, -4, -6, -14, 1, -9, -21, -10, -16, -6, -14, 4, 2, -6, -5, -7, -6, -13, -5, -12, -7, 4, 6, -2, -9, -4, 16, -2, 7, 9, 20, 14, 13, 13, 15, -2, 4, 13, 7, 20, 13, 1, 2, -5, -11, -8, 2, 4, -3, -7, -5, -3, 9, 9, 9, -4, -9, -11, -1, -3, 2, -12, -7, -6, -8, -11, -4, -1, 5, -19, -4, -9, -8, 2, -5, -6, -16, 11, -8, -9, 6, -14, 4, 17, 5, 0, 7, 3, 8, 0, 13, 16, 2, 16]
7620A6kqj0J5lKnLj1J3olJ1lj5Rj1KRqj7QJJ1mj1PJ0j0J0lpKRlnJKl%JMoJ1jJ
7666CJ0qjJ0LorJNmkjKQ%j3OMLpPLnrOj0MOp%L%Kj5jMKOj4QLlkJ1k0RKjNj%lL
7719cJ3rKkKkNnKJ1j3J6k0K5k2%KOKj3QjJ3j2lQlLlPpKj0lPM%j5NmmJ4roLRKj2
7767a0llNJpJ6Jmj2J4rRPMooJ2jRj1J7j7LpPljJ4j1jj4J2Lm%J0j3JjKMmKj0PN
7813Gj7LN%rJ2lRNoj0rJ1j3J1ORj2pOJNoMnKJPormJJ0OoJ2j1kLKJ4kj5QmOLlj6
7862fNLj1K0j0Mj3jjmQqlPJLnmkMqJ6nnkOKJlJ6Mj3mlJ1rQknO%J0j6J6ljJJLl
7912F%Rj7O%lPOk4J6ok%LJ1k0Qj%oKj4J1nlLP%KnjrKkJ1NKj3J1oLNRpPj7J6Lj0
7961@MQj3PoKOj6J6mqNjNLj3KjnoRlmJK3j5JnjjKJJ%J0j7lLKJOj0KpRLPkn%jJ0
$$ y = [16, 14, 6, -4, 11, 8, 10, 5, 8, -3, 10, 4, 1, 12, 9, -6, 3, -8, -6, 3, -5, -22, -14, -13, -2, -6, -17, -10, 0, -10, 0, -3, -10, -8, 1, -2, -7, -6, -4, -7, -7, -6, -2, -8, 3, 2, 3, 13, 5, 4, 14, 17, 11, 2, 3, 8, 4, 2, 1, 3, 11, 11, -2, 4, 8, 11, 4, 11, 14, 9, 0, 6, -4, 0, 6, -1, -1, 2, 2, 4, -11, -12, -8, -6, 0, -14, -6, -3, -6, -8, 3, -17, -8, -6, -7, -2, -3, -3, -6, -3, 10, 1, 3, 1, 3, 1, 6, 1, 3, 14, 1, 17, -3, 22, 0, 0, 2, 8, 10, -3, 5, 4, 17, 5, 2, 10, 7, 10, 7, 14, 7, 9, -1, -4, 3, 7, 7, -8, -3, -7, -11, 3, -6, -12, -9, 0, 2, -10, -13, -16, -11, -10, -17, -1, 0, -4, -16, -2, -11, -2, 5, 9, 3, -3, 9, 8, 17, 6, 23, 6, 9, 2, 9, 6, 5, 19, 8, 7, -7, 5, 8, 4, 4, 14, 1, 2, 1, 3, 7, 3, 5, -5, 2, 7, -10, -7, -2, -2, -11, 1, -2, 7, 12, 6, -4, -13, -2, -15, -4, 2, 11, -1, -8, -2, -1, 4, -2, 2, -3, -1, 0, 7, 1, -8, -12, -11, -1, 5, -1, 11, 0, -2, 1, 3, 17, 15, 0, 8, 4, 10, 13, 10, -6, -1, 2, -9, 11, 1, 5, -8, -9, -10, -14, -6, -14, -17, -10, -9, -6, -11, -15, -17, -13, -21, -5, -10, -15, -17, -11, -9, -8, -11, 5, 9, -4, -8, -11, 0, -9, -1, -3, -8, -2, -2, 8, -8, 8, 5, 4, 5, 6, 9, 6, 6, 15, -2, 4, 4, 1, 8, 14, -10, 6, 0, -2, -2, 1, 12, -8, 0, -1, -1, -7, -5, -19, -8, -13, -16, -13, -6, -6, -4, -9, -10, -19, -17, -19, -8, -3, -1, -14, -3, -9, -6, -1, 8, 1, 8, -9, 7, 10, 0, 4, 12, -1, 6, 0, 2, 8, -8, 8, 4, -4, 1, 0, 5, 8, -5, -3, -4, -9, -15, -6, -9, -13, -12, 11, -4, -3, -8, -9, -10, -8, -7, -6, -6, 4, -13, -16, -13, -11, -10, -4, -14, -12, -19, -10, -7, 0, -2, -7, -7, -8, 2]
8013B%JllOPj0JoLQnlJ0Kj2RKqQmqR%j6Ml%nOLlnO%%j1K1j2Qj7J8j2MKoJ4nmK
8063eoLJ0j4Lj3K8%j4MQJLjj3RqJ0mlMnJ1jLJj0JJ0j1J4oj2Pk0K0kkj4OPon%q
8108b0QrJ4KKmoOnLmj0QJ7lmk%lJ3rJ2kpmJ2j1RmJ1rPokpqQJ2pJ3pqnJ1koJ0Q
8156A2prJj6J3qJ2mmNLlj0J5nlom%KJ2npJ4j0J0Jk%lJ1j6MJ7j0
$$ y = [2, 2, 3, 0, -3, 3, 10, 0, 1, -5, -2, 6, 1, -2, 8, 10, -2, 7, 9, 1, 9, 5, -3, 6, 6, -10, -6, -9, -9, -14, -8, -5, -8, -13, -7, -7, -7, -18, 3, -9, -1, -18, 0, -12, -8, -6, -12, 2, -3, -7, -5, -11, -8, 2, -12, -9, -22, 6, 6, -8, -4, 4, 5, 8, 7, -6, 3, -5, 5, 1, -2, 2, -3, 8, 7, 10, 11, 1, 2, 12, 1, 15, 9, -3, 4, -16, 4, 2, 0, -14, -8, -1, -7, -12, -12, -20, -12, -21, -7, -5, -3, -7, -13, -7, -12, -9, -13, -23, -15, 2, -1, -5, -7, -7, -10, 3, -6, 6, 4, -3, -7, 5, -6, 3, -1, 10, 1, 8, 2, 0, -7, -15, -7, 5, -2, 11, 4, -4, -9, 2, 0, -6, 4, 12, 5, -4, -3, -19, -6, -14, -2, -6, -10, -5, -2, -5, -15, 0, -5, -8, -14, -18, -18, -16, -4, -9, -16, -2, -12, -2, -1, -3, -3, -6, 5, -11, -7, 10, 0]
8191@
$$ Imaginary data points
##PAGE= N=2
##DATA TABLE= (X++(I..I)), XYDATA
0@%%%%%%%%%%%qJ6j6J6j6K4l2L2m0M8n6O7p5Q8j04J19j35J52j68J91k15K40k72
34a44L04l39L77m18M65n15N70o32P01p78Q58r51J059j176J311j467J648j865K126
53A134k449K862l410M181n348P355j1730L7244m0341j04409l892L1992O0731O5262
67C9182O7585J3627m8451q5522o7899l4168J5887O4149R1744O0444m022n9743
79E2813p3213n9852k6342J8177O3490P7892N2363r26m9712p4256o3575k4681K6691
92h1131O4549P2170M4399l683m9155o9095n8505k2151K5436O4624P1529M0206
104I9193r981m9457o4377n4315k0514K9146O7135O5366K8202j3868m1933n6373
116b1776n3269k1165L1136O6387N9559K4051j2132l9215n6944n2701j5703L4839
$$ y = [0, 0, 0, 0, 0, 0, 0, 0, 0, 0, 0, 0, -8, 8, -8, 8, -8, 16, -16, 16, -24, 24, -32, 35, -40, 48, -56, 63, -72, 80, -88, 103, -112, 128, -144, 160, -179, 198, -220, 245, -270, 300, -332, 369, -409, 449, -502, 557, -619, 692, -775, 873, -992, 1134, -1315, 1547, -1863, 2318, -3030, 4325, -7405, 29839, -10502, -114911, -118803, -86811, -26080, 39182, 106767, 120394, 71943, -13579, -81478, -115646, -99759, -35610, 56134, 116578, 112556, 52813, -20400, -80252, -106594, -88417, -24927, 52965, 105328, 104402, 54690, -19566, -83141, -107822, -81131, -16582, 55588, 99987, 96304, 47149, -21946, -80451, -102602, -77166, -12542, 58987, 99193, 89212, 39755, -24622, -78937, -99451, -70305, -3170, 62196, 90398, 76530, 34597, -21776, -75045, -96210, -65074, 1313, 60872, 84923, 72791, 33576, -23368, -76069, -91772, -56933]
128e6933O2289N2524K2189j0094l9038n7032m8429j0710L2952N6080N1468K6287
140H1553j0643m5656n8886m0383k599L1780M9591M8114K6337j1192m6456n7434
152c5874l7449k03L3530M9864M4436J9502j4918m2499m9423l3293k880K8627M8498
165G918M6510K0372j7662m5627m8499k8405J670K9031M4685M1614J8043j6352
177E3298m2774m6624k7797J977K9268M4301M0532J6386j8288m3715m5124k4248
189f2808N399L0396M2265L5768J1835j8427l9074m0814k4382L317L0816M3994
201A8285L4356P317k1110l7074l6464k1175L814K8742M0895L2776P970k0366l8005
214c9l6923j8451P849K9314L6855K8222P126j7870l5544l6597j9296Q253L1287
$$ y = [-56933, 5356, 57880, 80069, 69975, 30937, -26095, -74524, -85234, -52282, 3798, 55266, 81553, 70910, 25254, -33632, -74015, -76614, -44834, 4757, 52871, 79208, 68016, 21560, -35874, -73323, -73526, -39996, 9868, 54304, 73806, 58888, 16389, -33034, -66327, -69207, -40580, 7918, 54428, 74800, 57138, 11511, -36988, -65393, -63723, -34692, 9993, 51607, 69650, 53298, 10524, -36100, -63897, -61920, -32652, 11649, 52181, 68567, 50279, 6564, -38560, -62808, -57409, -27013, 15252, 51020, 62855, 44428, 5354, -35460, -59842, -56525, -25709, 18285, 52641, 59958, 38848, 1774, -34690, -55865, -52051, -23309, 17586, 50362, 58332, 37966, -39, -36962, -55413, -47564, -18250, 18605, 46827, 53953, 36083, 539, -36058, -55354, -47101, -15814]
227a5814L7785K5737K815j9701l3124l2552j7016P895K9608L6224K4827K171k0519
240B8336l3261l0680j3863R460K8221L3642K3080J348k0727l2199k8420j1914
252d6977R881K7276L1810K1047M51j9740l0586k7584j1380J0779K7216L0049J9137
265D1379K35j9041l0182k6823r788J1640K6255K8457J8424j79j9591k9788k5158
278c4160q324J1787K5843K7976J7075k094k0115k8103k3008p505J1520K5552K7520
291B3964J5832l742k0888k7123k0552n241J1717K3401K5048J5202k648j9898k7277
304a2205k0930m616J3191K4153K3992J2881m235j9313k5300j9567m701J2691K4346
317C87K4195J2024n921k0215k4414j7698l278J3091K3832K3075J0585p004k0240
$$ y = [-15814, 21971, 47708, 50523, 30822, -2302, -34854, -51870, -43975, -14367, 21857, 46684, 48855, 28336, -4925, -35605, -49468, -40008, -11787, 21855, 44935, 46283, 25556, -6643, -35063, -46977, -37096, -9820, 21990, 43037, 43488, 23748, -6838, -34422, -45802, -35023, -7807, 22242, 41379, 41614, 22573, -7609, -34432, -44220, -32580, -6325, 22132, 40556, 40377, 20786, -9002, -34160, -42484, -30697, -4854, 23122, 40197, 38103, 17988, -10115, -33123, -40628, -29108, -3556, 23964, 39796, 36054, 15166, -11957, -32509, -37750, -26033, -2632, 22416, 37618, 34970, 15072, -12205, -33135, -37751, -24560, -407, 23585, 36466, 32231, 12918, -12382, -31949, -36650, -23959, 387, 24582, 36606, 30685, 10470, -13944, -31642, -34920, -21829, 2003, 25078, 35663, 28659, 8419]
330H419k3480j6232j672J3997K3049K0721Q420p176j8822k2016j5362j184J3957
343a7381K2191J9521P816p203j8808k1730j4317R5J4343K1370J8193O802p578
356B3314j8373k0729j3397N56J4379K1065J7503N809q338j8451k0036j2010J896
369b6812J4643K0074J6070M730q862j8264j8688j0152K860J3875J8337J4795M511
382B7117q318j7418j8055j0002K785J3971J8412J4314L489q992j7104j7045r000
395b5846L166J3689J7842J3747L022r337j7016j6431q191L653J3767J7622J3186
408B2873K031j0116j6900j5446o980M474J3872J6743J1600R20r902j5688j4303
421a6822o512M414J3377J6007J1045Q21r687j5516j4121o082M958J3631J5632
$$ y = [8419, -15061, -31293, -32965, -18968, 4081, 24802, 33222, 26046, 7224, -14792, -30154, -31338, -17381, 4810, 24331, 32147, 24944, 6136, -15594, -29911, -29816, -15473, 5897, 24090, 30892, 23314, 4941, -15788, -29185, -28629, -14250, 6815, 24318, 30127, 21789, 3338, -16698, -28708, -26812, -12169, 7905, 23975, 28705, 19843, 1579, -17109, -27261, -24401, -10526, 7811, 22606, 27117, 18799, 1381, -16674, -26676, -23891, -9920, 8492, 22806, 26295, 17303, 199, -16846, -25846, -22680, -8991, 8851, 22598, 25620, 16283, -733, -17164, -25355, -21702, -7935, 9687, 22873, 24904, 14788, -2112, -17558, -24538, -20064, -6192, 10551, 22151, 23071, 13169, -2519, -16822, -23334, -18920, -5543, 10464, 21509, 22330, 12643, -2873, -16994, -23076, -18118, -4487, 11145]
434A1145J0166m9r906j4947j3222n515N010J3406J5367R779n52j0307j4989j2767
448a7381m567N967J3575J4560Q567j367j0443j4501j1761l444O440J3028J3374
461A2047P644j585j0043j3812j1146l137O416J2794J3069P191k117j0280j3436
474f395j0346k390O674J2445J2312O423k438j0021j2856r797k072O762J2277J1960
488A2538N937k860j0278j2691r089j128P229J1948J1028N009l311r974j1800q209
502a5651q49O891J1399J0611M753l471r901j1562p765l33P234J1192R819L917
516A6284l691r520j0946p214j8P140J0750R301L572l786r290j0472o839O3P037
531g629J0737R212L152m368r485j0008o040P68P126J0084Q318K753m085r018r852
$$ y = [11145, 21311, 21262, 11356, -3591, -16813, -22328, -17318, -3912, 11455, 21234, 20682, 10375, -4614, -17381, -21948, -15981, -2406, 12154, 20721, 19354, 8911, -5590, -17351, -20795, -14355, -1327, 12047, 19691, 18106, 8063, -5749, -16895, -20032, -13616, -822, 12247, 19438, 17321, 7041, -6395, -16741, -19131, -12457, -12, 12300, 18723, 16285, 6264, -6592, -16389, -18461, -11699, 578, 12538, 18475, 15615, 5337, -7354, -16443, -17571, -10342, 1606, 12634, 17643, 14332, 4358, -7442, -15651, -16500, -9609, 1790, 12401, 17154, 13683, 3782, -7780, -15545, -15878, -8644, 2548, 12367, 16284, 12593, 3073, -7873, -15087, -15105, -7965, 2785, 12086, 15658, 11872, 2582, -7890, -14729, -14666, -7629, 3108, 12320, 15472, 11104, 1619, -8389, -14429, -13661, -6535, 3549, 11867, 14620, 10535, 1517, -8335]
546h335n949R58P400J0099P985K133m635r068r185n092J355P205R615P395J664
561A3545m664q594q632m890J316P104R484P181J429m855q668q479m384J837P199
576d071R089O670J067n005q556q084l905K181P210Q813O150N49n133q239p605
591h869l569K311P258Q689N810J8n607q228o879k509K783O631P577N201L28m887
607F058p863p064k862K809P119P920M908n05n467p627o278k110K969O640P268
622E915M606l33n279p705o310j767L479O800O939L992q79n409p259n591j329L438
638f692O473O463L574r86n151o924n363j106L621O220N838L200p49m692o779n531
654h584j233L673O525O134K993j554n296o407m536o25L497N930N623K798j248
$$ y = [-8335, -14284, -13326, -5926, 4173, 12158, 14291, 9656, 588, -8597, -13689, -12334, -5129, 4486, 11881, 13545, 8881, 287, -8345, -13235, -11919, -4815, 4669, 11850, 13279, 8424, -244, -8723, -13107, -11270, -4071, 5018, 11688, 12755, 7750, -806, -8890, -12795, -10614, -3404, 5409, 11559, 12108, 6975, -1264, -8869, -12438, -10127, -2869, 5820, 11630, 11648, 6041, -2187, -9066, -11575, -8792, -2161, 5416, 10617, 10945, 6058, -1805, -8869, -11731, -8922, -1803, 6117, 11025, 10520, 5053, -2574, -8852, -10962, -7993, -1353, 5915, 10521, 10188, 4909, -2796, -9106, -10873, -7394, -594, 6345, 10337, 9458, 4049, -3210, -8801, -10130, -6692, -219, 6244, 9818, 8832, 3681, -3243, -8606, -9712, -6091, 129, 5967, 9167, 8418, 3726, -3053, -8584, -9817, -6144, 381, 6515, 9508, 7954, 2658, -3749, -8285, -8910, -5413, 517, 6140, 8938, 7690]
669G690m851o476m979o25M205O493N325J862k024m819n604l895l44L366N571N218
685F113K400j715m952n737l881k61L578N775N060J886j976m756n440l816j88L779
701d131N826M837J561k228m826n195l308J05L573N538M774J510k498m959m996
716d417k908L53L689N461M393R65k649m688m548k518N30L454M826L998J294k069
732E166m660n022k821Q03L987N144L803O20k741m607m258k094Q64L554M684L553
748E975P43k418m548m564k176J383M023M475K930L90k387m372m226j727J459L659
764a381M113K905M05k475m286l870j564J307L514M085K821L40k375m251m095j620
780f427J775L967L954K209j83k464l859l393j222J349L290L832K645N4k710m133
$$ y = [7690, 2839, -3637, -8616, -9241, -5036, 1457, 6782, 8644, 6620, 1801, -3803, -7698, -8042, -4676, 895, 6113, 8513, 6798, 1846, -3891, -7772, -8033, -4455, 1320, 6380, 8266, 6290, 1534, -3906, -7722, -7910, -4131, 1695, 6532, 8093, 5865, 1039, -4156, -7464, -7359, -3786, 1752, 6526, 8036, 5538, 579, -4417, -7325, -6972, -3283, 2178, 6571, 7536, 4887, 199, -4349, -6867, -6337, -2883, 1943, 5941, 7235, 5166, 506, -4516, -7337, -6534, -2547, 2597, 6400, 7020, 4279, -328, -4586, -6680, -5816, -2262, 2422, 5975, 6718, 4300, -248, -4812, -6988, -5605, -1582, 2893, 5823, 6213, 3826, -546, -4772, -6499, -5040, -1381, 2732, 5637, 6042, 3567, -719, -4589, -6153, -4846, -1332, 2753, 5574, 5914, 3539, -712, -4807, -6427, -4652, -685, 3269, 5478, 5295, 2831, -1028, -4421, -5643, -4294, -1004, 2828, 5473, 5527, 2817, -1316]
796a316l352j026J634L549L689K058l58k514l610l116j075J547L437L565J973
811E085l36k498l573k985r81J462L392L730K041o88k874l532k582o27J611L326
827b9L329J533p26k421l152k620q24J562L310L290J646o69k650l435k443l34J768
844b865L096L017J412p50k549l144k292m11J670L159K993J266q29k531l229k324
860d311j33K108L153K541Q91r11k416k949j944l3J747K800K610J132r31k585k902
877b133j812L3J759K819K539J007r58k614l023j752M05K114K636K034P95q77k379
894E93k814j684K60J958K754K295O37j338k571k476j252M17J888K482J944N02
910C595j092k270k424j363L68J865K431J972N79j196k452k389j133N10J827K412
$$ y = [-1316, -4668, -5694, -4060, -511, 3178, 5236, 4878, 2364, -1246, -4362, -5437, -3890, -453, 3112, 5085, 4749, 2251, -1322, -4307, -5288, -3826, -434, 3296, 5337, 4649, 1775, -1757, -4339, -4966, -3355, -29, 3300, 4833, 4107, 1686, -1466, -4086, -4910, -3348, -38, 3252, 4898, 4229, 1579, -1856, -4299, -4633, -2865, 231, 3248, 4660, 3910, 1361, -1783, -4075, -4486, -2816, 343, 3336, 4602, 3773, 1242, -1987, -4311, -4444, -2336, 817, 3358, 4249, 3338, 922, -2027, -3971, -4004, -2257, 543, 3153, 4285, 3354, 769, -2133, -3945, -3912, -2153, 666, 3205, 4212, 3254, 640, -2383, -4135, -3730, -1616, 1020, 3054, 3849, 2972, 593, -2221, -3905, -3645, -1687, 1067, 3362, 3999, 2661, 90, -2386, -3638, -3221, -1333, 1149, 3093, 3595, 2503, 233, -2191, -3554, -3186, -1321, 1110, 3082, 3661, 2465, 13, -2376, -3509, -2999, -1172, 1240]
926A240J878L59j337k310k148j083M99J870K374J681K49j218k249k225j023P26
942b717K007K231J411Q5j305k085j864p75N21J643K133J569J71j284k060j892
958b211r15N49J876K246J396j4j326k102j919o95Q70J881J917J169K3j277k017
975e49j788o12P64J788K027J240k16j460j947j524m73Q31J716J768R81j03j164
992A279j866j649n50Q56J723J781J101j22j426k030j489k73R26J683J754R49l57
1009B290j451j781j302k64R05J672J580P92k49j310j830j380j58J059J651J458
1025A682P15l88j402j649j021q9P67J400J554Q58l82j369j685j176j64R82J702
1042C35J466N62n36j381j606j035Q7J065J464J214N09m52j290j488r36kQ87J494
$$ y = [1240, 3118, 3477, 2140, -170, -2318, -3401, -2902, -1032, 1342, 3023, 3272, 2054, -195, -2420, -3443, -2717, -710, 1521, 2932, 3017, 1712, -373, -2237, -3012, -2491, -848, 1285, 2854, 3025, 1741, -319, -2211, -3126, -2577, -701, 1545, 2941, 2927, 1601, -501, -2420, -3115, -2245, -364, 1553, 2722, 2745, 1468, -549, -2337, -2949, -2185, -397, 1630, 2870, 2654, 1194, -753, -2277, -2750, -1919, -203, 1565, 2546, 2443, 1279, -587, -2236, -2786, -1930, -207, 1574, 2675, 2553, 1127, -903, -2392, -2665, -1739, -56, 1698, 2647, 2290, 839, -942, -2244, -2508, -1603, 69, 1649, 2441, 2192, 882, -948, -2328, -2486, -1427, 224, 1682, 2397, 2009, 607, -1042, -2063, -2152, -1385, 15, 1569, 2427, 2045, 676, -1009, -2185, -2349, -1367, 335, 1801, 2363, 1827, 446, -1160, -2195, -2108, -1043, 421, 1635, 2144, 1692, 402, -1086, -2022, -2024, -1137, 357]
1060C57J387N07o66j393j380p82R1R79J420J088L45m81j145j361q98L0R50J408
1078D56J215M61n59j428j472o90K69J068J362J032J87p08j220j133n98J83R10
1095f65J227R49K93n31j177j301p30K89J064J272R29J80p11j229j107m43K80Q59
1113e52J133R41K39o24j184j179n84K76J054J299Q80N0p94j246j083l02M89R73
1131b14J008O29P5o37j047r23m09K42Q32J149Q57O8p58j169j010l16M47J006J049
1150H79O07q6p10j020q51k95L44Q64J044P19Np85j167r07j91N34R95R95M76k38
1170A212p81r44o36j25M09Q00Q27M96m3o29r34q17k39M35R09R73N42j86q48j025
1190f04o42j0N34Q38P77L60k10o43q44o41j67M39Q85Q87L96k64q07r38n50R5N97
$$ y = [357, 1744, 2251, 1585, 192, -1188, -1970, -1879, -900, 520, 1608, 1953, 1472, 327, -1034, -1932, -1902, -952, 456, 1671, 2132, 1573, 145, -1327, -2017, -1748, -680, 682, 1714, 1901, 1193, -27, -1160, -1758, -1575, -665, 562, 1511, 1804, 1273, 96, -1205, -1935, -1646, -582, 690, 1619, 1799, 1088, -141, -1248, -1691, -1411, -552, 581, 1522, 1761, 1137, -47, -1226, -1810, -1534, -480, 819, 1699, 1749, 955, -291, -1374, -1676, -1187, -214, 794, 1423, 1498, 861, -186, -1109, -1518, -1276, -444, 705, 1562, 1630, 872, -297, -1307, -1623, -1176, -170, 879, 1486, 1400, 690, -330, -1181, -1476, -1132, -268, 776, 1495, 1500, 715, -452, -1359, -1550, -1016, -21, 974, 1450, 1212, 431, -513, -1149, -1274, -865, -65, 762, 1258, 1215, 586, -348, -1165, -1404, -969, -60, 913, 1455, 1269, 421, -604, -1246, -1256, -722, 116, 893, 1253, 1043, 400, -444, -1085, -1252, -813, 72, 959, 1355, 1091, 284, -654, -1204, -1109, -512]
1211e12P52O22K48k28o35p13m90r5L40P42P85M00k10o96q92n94MN76Q55O96J91
1232A146l46p06p25m13N4M77P09O30K48k55o70p52m48O3N12P51O30J84l54o92
1252D3o75l23J17M81O27N01J86k35n38o67m65l7M68P80P04J84m19p78o95k70K06
1273h05N47O24M85O0l53o11n41k83Q1M39O65N43J23l86o87n90k14J65N27N90M25
1294H04M1l77n56m87k29R6M10N95N14J10l60o61n73k39K05N39O43M16l9m76o24
1315b48m26r5K18M57N16K97Kl19n04m80k21J60M97N74L65j0m23o02m29o3K46M06
1337h2M48L27Ol32n01m61k12J78N31N86L12j07m17n32m34p1L33M86M30J88j17
1358E59l62m15l10p8J66L65M57L21m6l76m77m10j04K37N08M80J88j46l58m12l37
$$ y = [-512, 240, 862, 1110, 882, 247, -466, -956, -1051, -711, 31, 816, 1216, 1006, 310, -582, -1176, -1172, -596, 259, 955, 1146, 800, 94, -631, -1044, -990, -513, 196, 826, 1074, 819, 149, -603, -1051, -988, -476, 275, 905, 1089, 735, 43, -632, -955, -838, -357, 270, 771, 957, 722, 184, -483, -948, -985, -517, 263, 967, 1151, 732, -46, -741, -1011, -805, -258, 366, 851, 911, 558, -53, -594, -877, -796, -357, 308, 851, 974, 588, -99, -689, -903, -738, -211, 379, 804, 845, 468, -88, -575, -804, -708, -298, 297, 811, 921, 561, -100, -673, -912, -707, -168, 475, 891, 852, 376, -248, -674, -769, -551, -94, 422, 719, 721, 402, -102, -582, -803, -643, -146, 428, 793, 783, 360, -242, -671, -734, -488, -82, 366, 693, 699, 367, -134, -595, -807, -629, -98, 488, 800, 693, 276, -256, -690, -761, -428, 58, 488, 676, 559, 197, -218, -528, -606, -440, -75, 382, 703, 657, 281, -196, -606, -710, -473, 35, 515, 703, 557, 199, -213, -550]
1379e50r9K36M13M50K47r2l94m78l42p3K66M97M91J44k49m35l64j93pK21L87L45
1401D21J37r2l07l83l26o9K35M34M43J89j78m25m18k26K0K42M21L79J28j90l72
1422F3l56k43j2K66M33L89J08k09m29m01j93J14L44L50K65K5k05l24k73j34J0
1443d12J49L44L58J64j93l78l69k30L9L23M47K79Jk52l19l12j42J02K74L10K55
1464D38P2j93l71l22j33R3L07L61K68o8k81k72j93j08P6K57K91J43lr1k27l18
1486b74j87N5K76L28K72O5k42m11k99o0J55L02L15J59j05k08k28j94j34P5K69
1507g1L30J66l4j98l18k69m7K03K63K24J13l6k13k37j51k9K7J55K99K26mk13k78
1530i2k37j49J26L76L40Q4j28k41k50j85J9J69K20J77J06k6k00k50j51l4Q0K50
$$ y = [-550, -649, -413, 0, 450, 697, 605, 211, -267, -609, -682, -416, 81, 572, 716, 467, 32, -332, -525, -532, -311, 76, 421, 558, 466, 159, -224, -550, -619, -384, 50, 493, 682, 504, 79, -339, -565, -545, -303, 118, 497, 625, 435, 63, -293, -536, -548, -282, 151, 540, 648, 439, 10, -391, -584, -470, -126, 224, 489, 514, 309, -15, -288, -422, -412, -263, 81, 439, 603, 410, 32, -337, -567, -528, -205, 242, 521, 522, 270, -49, -361, -503, -401, -127, 183, 438, 510, 317, -54, -376, -509, -416, -109, 252, 520, 452, 171, -101, -294, -402, -326, -69, 222, 365, 362, 271, 44, -274, -461, -406, -130, 198, 470, 535, 293, -118, -417, -477, -322, -20, 295, 454, 349, 141, -87, -281, -415, -340, -71, 259, 425, 391, 193, -125, -394, -441, -238, 25, 249, 362, 326, 113, -124, -275, -304, -277, -122, 177, 403, 399, 186, -92, -329, -478, -352, 24, 364, 448, 320, 79, -171, -356, -337, -168, 52, 229, 335, 309, 109, -141, -292, -326, -246, 4]
1552DK84J27j39k35j82j44l5J25K66J98J1m1j18j98k12p1J38K42K34J43p1k73
1574E3l02j23M4J97K45K01j8j57j49j17j00n2J22K13J71M1l1j53k37j72L8J81
1596a05J99J48L9p7k08j62p2L1O7J87J82P6p9j74j79j81k3K06K78J71l2j35j94
1619c7j86m9J20J41J07O3M9n2j58j28r3k6Q1K17K14Mj35j52j31j21K1J79K02P8
1643B08Jo5j31j64j17N3J33J55J71N5j34k34j45l5P0J57J86P7p4j15o9o6j00O
1667a77J15J45P9N4k8j52k27r4Q4J65J59J25oj47j79r1k4K3J22J86P6j1j09j11
1691b3j35j14O8K07J73M3m9j20j58j00K3J25P6P1O4jo6r1j01p9kJ33K06R6n5j11
1717H0j33j30o5J20J93J16%l5o9j22j27j2Q9R9J15Q9k3j38j52r3J7R0J58J11n
$$ y = [4, 288, 415, 276, 41, -141, -285, -320, -195, 71, 269, 280, 239, 121, -77, -289, -360, -222, 20, 254, 397, 326, 53, -249, -372, -328, -131, 114, 315, 297, 140, -9, -126, -226, -278, -156, 57, 228, 269, 238, 85, -152, -324, -286, -105, 94, 242, 281, 204, -4, -166, -238, -207, -140, 47, 229, 305, 226, 52, -127, -308, -331, -125, 153, 324, 292, 157, -37, -223, -272, -152, -11, 96, 159, 208, 156, -2, -130, -223, -249, -168, 49, 263, 267, 132, -20, -151, -272, -251, -72, 130, 208, 209, 144, 13, -151, -268, -215, -82, 73, 244, 299, 165, -69, -214, -249, -179, -22, 164, 241, 167, 52, -17, -83, -183, -177, -62, 83, 162, 216, 188, 36, -191, -285, -201, -36, 123, 248, 242, 95, -84, -175, -199, -176, -54, 132, 208, 197, 88, -23, -158, -272, -204, 3, 176, 219, 170, 50, -108, -208, -185, -60, 16, 87, 151, 150, 84, -7, -108, -187, -189, -56, 150, 246, 191, 80, -53, -183, -248, -128, 65, 181, 181, 146, 77, -45, -172, -184, -95, 4, 119, 208, 185, 47, -105, -198, -181, -91, 67, 178, 173]
1742A73j14n5n2o4m3M4R1P0P8M9m7j85j69j9J24J55J30N7p7j60j36j9L1P5J00
1767C7J05jn3n4p7j07m3J09J50Q0K3l1j09j28q2Q3P7O6N5L3l1m8r3o8o3L2J54
1794A6J57L3o7j23j44j06M1J85J55Om6o5p6o7l7L9N9N3O5O7l6j10j14o0K4J05
1820d6J52N8o4p8l6n6m4J1P8N5M7N5%r0j61p5N3J08J34R8qj49j38p2N4Q8O8N3
1848I5Nn7ol4n2p0RP9Q4O1Ql6j24j00j6P4J02M2K3pn2m3n2m1kP0R7O8Mo0j13j04
1880a48l3J28J25O2k9o4n1o6KL4L8J2MN2L1k7o0q4n5K4J14J02J9m8n4q3o7K0Q2
1909b0N5NJ1J8%j00o9k2M3Q2R7L2n0j06q4j4M7R2M4Kl5k0Jk7l2k4J0L4N9O8J0
1940A07n7j26o6L7P4P9N1j7m5o1m4J2j5M4N3K9K2lk9q8o7J6R9N6L8k6m6n6k6J2
$$ y = [173, 59, 4, -48, -112, -155, -111, -20, 50, 128, 177, 130, -55, -224, -243, -119, 36, 166, 223, 146, -14, -150, -169, -138, -63, 37, 142, 141, 88, 34, -43, -150, -193, -84, 66, 146, 169, 138, 29, -99, -181, -98, -21, 45, 100, 133, 102, 54, -39, -107, -170, -138, 16, 173, 206, 139, 16, -128, -234, -193, -8, 147, 153, 107, 42, -34, -101, -138, -99, -40, 13, 78, 145, 109, -1, -115, -175, -151, -46, 106, 164, 100, 22, -14, -70, -114, -103, -25, 30, 77, 132, 132, 42, -119, -194, -141, -33, 101, 199, 191, 42, -96, -168, -114, -26, 42, 95, 100, 43, 37, 3, -49, -119, -110, -31, 53, 114, 122, 86, -38, -138, -154, -80, 22, 64, 87, 80, 28, -15, -67, -108, -110, -40, 57, 125, 129, 69, -44, -148, -181, -53, 72, 134, 105, 41, -10, -76, -74, -40, -2, 10, 14, 66, 97, 70, 10, -74, -129, -105, 9, 111, 130, 82, 28, -55, -122, -102, -20, 35, 40, 51, 69, 69, -31, -100, -122, -79, 3, 100, 132, 82, -24, -108, -122, -75, 17, 61, 63, 28, 8, 9, -18, -50, -74, -64, -30, 29, 97, 107, 50, -76, -142, -105, -31, 48, 99, 82, 37, -24, -68, -56, -71, -27, 26, 55, 77, 74, 45, -43, -110, -94, 5, 61, 99, 73, 27, -29, -55, -43]
1970d3L6J3j3QN1J8k7m9o7l1L2Q6P1J3m3p3q1j2N1Q5K5j0j4j2j4n2k2K1J9M7N1
2001F4J6k3p0m7qL5N1K2Oj3Qj6k9m0j2J6L1O7L4Oq0j01l0M4O4O2K9k8m9n8k7J5
2033f1L5K0RJ2J9Ql8o4l5M6L6L5M0j0l3o0k7J4J8J3K2K6M0ll3p5m2QP6N7L2Kn4
2066C3r3k6K9M6N8J0j4j6kl8j3qLJ8K7N1Ml6n9m5QL5L1K1K3j8j3l2l9LK1L1L0
2099C0M0J7m5q7o3%J02K5K6O1p7n4k6m0O1N5j4MN6Po4j6j11K4m5J11Q5J5j9m3
2129A5m2m2M2J9K5K3J2Mk2n5k8j3L1N5N1J5l6q2m2lN5M1Pmk5oqMj5j4oJ6M1L8
2163E1J6m7p9j7J8M5M7J3J4m4m0k0J2J1J8J6L2J5om3o2oL2N4L6Nl5k6l8j2M3K6
2195B9nk8J4K3Rk4k1k6l1K8N8M3om1n0m0lO9J4J1qmkk8k3LJ7NL6K1J3o1m8LL1
$$ y = [-43, -7, 6, -7, 1, 52, 70, 43, -6, -73, -104, -72, 14, 85, 98, 55, -18, -99, -111, -60, 25, 50, 40, 26, 14, 0, -52, -74, -53, -34, 13, 64, 80, 57, -13, -60, -68, -33, 18, 40, 46, 33, 41, 25, -4, -44, -56, -40, -9, 58, 92, 98, 18, -83, -113, -69, -5, 57, 86, 58, 9, -49, -76, -61, -26, -6, 3, 15, 34, 42, 4, -60, -95, -49, -13, 22, 62, 52, 19, -41, -68, -54, -36, -23, -1, 25, 65, 62, 29, -46, -88, -80, -4, 53, 85, 87, 33, -60, -86, -57, -11, 47, 57, 43, 27, 25, -13, -26, -34, -31, -13, 14, 65, 69, 33, -26, -71, -63, -28, 3, 24, 47, 29, 16, -16, -55, -52, -31, 0, 30, 70, 87, 42, -45, -108, -108, -6, 19, 45, 106, 29, -25, -51, -91, -30, 25, 11, 15, 71, 78, 14, -2, -113, -89, -134, -23, 62, 77, 58, 15, -27, -69, -27, -8, 17, 40, 52, 56, 34, -21, -49, -62, -31, 24, 75, 90, 54, -28, -70, -73, -18, 23, 30, 26, 1, -5, -13, -9, -24, -38, -44, -28, 13, 51, 67, 20, -59, -76, -58, -13, 34, 47, 61, 17, -23, -43, -31, -20, -2, 14, 46, 61, 55, 12, -50, -56, -24, 30, 66, 71, 36, 10, -28, -40, 3, 29, 24, -4, 10, 33, 42, 18, -3, -29, -60, -32, 26, 69, 63, 22, -28, -68, -71, -2, 12, 23, 15, 11, 9, -19, -42, -39, -22, -17, 19, 40, 53, -8, -56, -53, -22]
2230b2L1J4J1k1j8mK2j6j1j2POM6M5j8n8o4K0K6L0M9J1l4o2k0L1K4lKmJ6Kmj6
2264Fm7lK9K6RQkm6k5J3M8Jk6lK4Nj1l%l4l6L9O2L2l6m9j2k6K5N9J4j3k8jj2o
2300a9L4jk5qK3M8j3m1j1koJ0L7J7k6l4J6QrLj3j7K1L9J2k3n9j5RK4K0L7J5o1
2334a0m6RL8K9k5Oj6NJ7Qj0k2j0JJ7L0J5pl9k8K6K2moJ7LnlNom5OL8L9Ll0k0n0
2372d8OL1N6j4j5k0j0LJ7J6k5l8OL1K7J6m5rj2k5L1M9Lk5j7jmjJ8plJ0M2ll6k4
2408b0qlJ8M5M4m2n6j4M0RoJ7j0l5J9K8J9j7n1j2J8J1L9K5m3n3LJ9rJ8K1K1k5
2441A0m0K3mj2k5L4L2jnrk7l6L4K8K9j1j8j0j5J0J7J0l2k8L7M0Jqj0l0l8KN3M5
2475D6jm3ooj7K7K5jj6PJ6j6l3OKj9K7L7K2o6k5J3JPJ6J7k1k2J1K7lk4k7PPK4
$$ y = [-22, 9, 23, 34, 13, -5, -9, 13, -3, -14, -26, -19, -13, 33, 78, 60, 2, -62, -42, -16, 14, 63, 74, 40, -22, -42, -11, 13, 10, 12, 8, 24, 26, 22, 6, -41, -44, -15, 11, 20, 28, 26, -20, -45, -32, 16, 17, -9, -12, 12, 17, 6, 3, 3, -31, -67, -28, 34, 66, 30, -19, -31, -57, -32, 27, 41, 28, 0, -1, -13, -19, 15, 14, -11, -19, 4, 52, 39, -2, -13, -15, -21, -11, 26, 43, 17, -17, -1, 7, -2, 1, -12, -29, -8, 31, 43, 20, -39, -54, -45, -21, -1, 36, 51, -10, -56, -47, -9, 20, -5, 1, -15, -10, 7, 15, 5, -17, -27, -26, -9, 21, 36, 29, -10, -38, -12, 10, 6, 0, 17, 20, 15, 12, 17, 11, -34, -28, 10, 49, 52, 22, 2, -48, -42, -11, 45, 31, 16, -4, -14, -11, 6, 22, -3, -41, -35, -4, 23, 39, -6, -15, -27, -52, -21, 28, 31, 6, -11, -12, -16, -17, 1, -6, -9, 1, 43, 40, 4, -20, -28, -31, -13, 32, 76, 34, -22, -36, 4, 13, 7, 24, 14, -21, -2, 26, 45, 28, -23, -35, -17, -6, 33, 58, 15, -38, -35, -16, -25, -7, 14, 35, 10, -30, -7, -11, -23, -48, -14, 18, 17, 12, 3, -24, -60, -26, 2, 31, 20, 2, -8, -23, -13, 4, 14, -18, -46, -9, 31, 32, 24, 14, -16, -54, -52, 1, 46, 45, 2, -4, -10, -27, 0, 25, 24, 8, 15, 31, 15, -18, -12, -10, -29, -2, 35, 57, -9, -34, -21, -20, -13, 3, 20, -1, -23, -12, 15, 12, -12, -39, -32, -25, -1]
2511aM5j1n4l4RL8%K4K5k7m4RK7Qk0LRJ9j6J1rk8j2L1J9MRj9j4j8J5K9k3k1mL1
2547A0PJ0qk1k3m3N9M8Pl7k4k3kK3K6Mlk3qKJ1J7jl6jL3J0Ll0j5K2j1J2J5Rk7
2583hj0J6J6kl0J7j1PM4Kj8m9j3K6J8K2J9k4m5k2M1L1j7lmlrKK7Jl3j0LK0lQk
2620Dk0rRJ5oj4J0J1j4J2nNl2qM4K3j1j9j5j2J2L1PNk2j8rOK8J7k5k3jK1K1jr
2657H%k2MJ5K1Jl3Q%onJ2j2j1K0J3Lk4mj5J8K4KNk4m0J4K9J4lk0pj4KL1J3%k5
2695hj6J0PK6J4j7k9pJ7Pj2K4%j5nJ8Kpk5J2K5Lrj6jj2PL2j4k6%j1QK7Onl7rJ
2734c5L3J6Lk2j0l5J6K0K8j3j3j%J2oOj0LnJ4Nr%j6PJ0J6oj3mJ7J9k2kRk0JJ0
2772CL2Ll8j4pK4RK5j2k5j0j9K5J3J2qj2j6oK9nj5qLJ7Pmkmj0oJ0K6k3j8OK3N
$$ y = [-1, 44, 33, -21, -55, -46, -8, -8, 16, 41, 14, -30, -21, 6, 14, -6, -3, 6, 25, 9, 20, 11, -17, -29, 2, 21, 25, 34, 15, 1, -17, -2, 27, 4, -17, -21, 10, 17, 27, 19, -2, -25, -68, -9, 39, 46, 9, -15, -38, -40, -17, 9, 13, 10, -13, -21, -19, -8, 9, 8, -28, -29, 4, 14, 17, -13, -28, -6, -17, -5, 10, 19, -8, -18, -2, 14, 12, -18, -1, -12, -5, 39, 41, 23, -26, -39, -13, 5, 27, 46, 22, -23, -45, -4, 27, 10, 7, 3, 0, -9, -7, 20, 21, -12, -22, -19, 1, -2, 6, 4, -16, -25, -16, -1, -7, -21, -11, 0, -14, -2, -7, -2, -34, -42, 2, 25, 14, -5, -20, -32, -20, 11, 18, 23, 1, -17, -26, -20, 8, 25, 0, -23, -24, -3, 18, 17, 8, 8, -14, -10, 5, 26, 27, -6, 2, 2, -4, -9, 3, -9, -20, 0, 13, 16, -8, -12, -27, -9, 15, 17, 22, -2, -42, -28, 1, 15, 12, -8, -15, -29, -27, 4, 17, 17, -8, -24, -14, -7, 19, 33, 16, -13, -20, -3, 4, -8, 16, 16, 1, -4, 14, 16, 9, -16, -4, 21, 24, 15, -1, -2, -14, -7, 25, 11, -15, -15, -26, -18, 9, 15, 10, -27, -36, -35, -2, 14, 17, -5, -15, -50, -34, -14, 14, 1, -12, -13, -13, -1, -7, -1, -11, -8, -13, 1, 6, -3, -3, -19, -12, -2, 14, 8, -5, -9, 8, 27, 5, 3, 12, -8, -7, 3, 35, 38, 0, -14, -21, 3, 12, 37, 25, 0, -10, -29, -4, 9, 21, 13, 1, -15, -21, 8, 3, -12, -20, -17, 0, 7, 3, 1, -3, -13, -19, -9, 17, -6, -24, -18, 5, 10]
2810A0kk1nONJ6MNj4j9oJ7K1Qj8j2rKK6J3nk5j8J7K5%Kk2k5NL6mPk4%LljMNj5
2851a1mJ5J4k4j1rKK6J0Pj9j4j8RJ6K1mk2Rj9J2K5Nj7j0oJ0J3J1Lk0opJ6Q%j9
2888hJJ6pKrM%JK0jmk8j1NK7J6j4k0roJ1K2JNk7rlK0J6j0j8qK5pJ3j%k4%J5jK
2930cJ0k1LJ9nj0j2RMK1njj8Mj2K0J9kjl0pjJ9J1Mk3o%J0J5Kj4l2K2rK0Ojj8j0
2970b3J6j0MJ7%j5R%Rk8%OQJ2Mrj0mLJ8MQk0k1%J7J8K5m1Ln%LL0rj1l9J2K1Q%
3011A0Mj8JmJ2rnJ4nrj0J1Rj8oJ7Rk0Kj4J3J2LPj0mk5J0J9J8nkk8kJ4K3Rk6j8
3050b1K1j0J9J1mj3j1OPjmLj1J9j3J3%j4kJ7KnpJj2nK4Mlk0qpJ3J1J5jk7pJ4q
3090a4RRj8j4KJ8J5kk1L%NKK2j0j5lrK8j8J4NkJ0jKj9moOJ6KJ0l0j0PK3kqJ1j8
$$ y = [10, 8, -13, -18, -12, -7, 9, 13, 18, 4, -15, -21, -4, 17, 25, 7, -5, -14, -12, 14, 27, 22, -3, -21, -4, 21, 21, 23, 1, -24, -19, 17, 13, 20, -4, -4, -1, -4, -5, -1, 4, -11, -15, 0, 14, -10, -21, -30, -28, -2, 8, 15, -4, -18, -36, -27, -11, 10, 6, -16, -7, -26, -14, 11, 16, -1, -11, -17, -7, 6, 17, 20, 0, -6, -13, 3, 11, 11, -8, -7, 9, 2, 4, -5, -1, -1, 0, 20, 19, 15, -13, -24, -19, 8, 24, 10, -10, -19, -25, -14, 8, 9, 14, -13, -22, -25, -5, 11, 1, -17, -25, 0, -7, 6, 5, 5, -19, -19, -4, -5, -3, 7, -14, -11, 8, 3, -7, -19, -10, -6, 15, 10, 9, -9, -5, -17, 3, 22, 20, 19, -11, -18, -19, 0, 11, 15, -8, -14, -14, -4, 11, 13, -1, -33, -11, -20, 0, 6, 5, -13, -23, -7, -17, -13, 4, 4, -11, -2, -2, 7, -21, -21, -15, -7, 5, 9, 0, -10, -14, -11, 7, 11, 19, -1, -22, -22, -5, 13, 38, -3, 0, -5, -5, -2, 28, 19, 8, -31, -19, 2, 10, 10, 14, -4, -3, -7, 5, -4, -9, 5, 0, -9, -19, -8, 1, -17, -23, -6, 3, -17, -15, -29, -16, -4, -1, 6, -4, -8, -33, -23, -4, 14, 9, 7, -21, -23, -9, 14, 23, -3, -21, 0, -10, 9, 20, 16, 3, -8, -2, 5, 4, 0, 3, -8, 11, -2, 11, 11, -3, -5, 12, 14, 9, 2, 3, -9, -14, 10, 14, 11, -9, -17, -24, -11, 0, 15, 14, -13, -20, -6, -14, -5, 4, -14, -28, -26, -8, 7, 5, -16, -13, -13, -8, -6, 16, 6, -9, -12, -21, 7, -11, 3, 8, 6, 16, 15, 17, -2, -6, -12, -6, 10, 12, 22, -8, -18, -11, 12, 10, 2, 13, -5]
3131ej0JJ4J8k6qk0K9J6qJoj0pJ2J2Lqmj2kJ7lJj3PjQj5OPqNK1J5j3k5NLK0Kp
3173A2j3j2J4PKKnoj5J5K5j4j3mQkj0J9Lj6j2QJRj0qK3j5%%%qjJ2J3njj0j0KO
3214iK2Pm0NJK1j2OJ3l5lJ2K1Qj6JMj3MJ9kppJ1knRJrj1K5lmj7pJ5m%lJ0l2J2
3256a4J8Kj3jolnK4J4lj8j4JPMROk5j1J3K1Nn%j4lJ1NOk0J1J1j4JN%j0%K1MKl0
3298hOoOPJ3ok0j4L0Op%j0mnK1J4j0j6j4%%J3J1pk6%J3lMnJ9rlQJ1qj4J0PKLK
3341A1Lk1J0L0j3j3j0NnlJ7J4rk4MJ6Lnjj7JMOKLKj4JnJ5Jlj2J0m%j3J4Mj5qK0
3383AOk1J5j8J1J2Lj3pmkL4j3lkj5JJ9PRk1j9K1PM%JorrJ7J5j1lkj6QKNlpJ6j
3426Imj2OlkKKJ2j7j5J1J5Mj0rj2MQJ9Kmj9lJ3jJ8qnj1kJJ1Jljj3QJ5J2k7OJM
$$ y = [-5, -15, -14, 0, 18, -8, -16, -36, -7, 9, 1, 2, -4, -14, -21, -9, 3, 6, -2, -6, -18, -20, -3, -6, -5, -18, -11, -12, -4, -19, -13, -6, -14, -9, 12, 27, 14, -11, -6, -3, 17, 19, 12, -1, -13, 1, 8, 10, 12, 7, 1, -14, 1, 26, 12, -1, -5, 3, 1, -9, 10, 13, -3, -15, -7, -6, 3, -7, -15, 8, -7, -7, -7, -7, -15, -16, -4, 9, 4, 3, -7, -17, -15, -9, 13, 20, -20, -15, -14, 7, -5, 1, 14, -21, -24, -12, 9, 17, 1, 2, 6, -7, -3, 16, 14, 7, 0, 11, 9, 4, 13, 14, 5, -6, 19, 16, 12, -5, -12, 3, -1, -1, -4, 6, -26, -14, 4, 6, -7, -8, -14, -17, -22, 2, 16, 13, -5, -19, -18, -11, -7, 2, 8, -17, -28, -15, 6, 11, 6, 6, -8, -11, 0, 5, 11, -9, 2, 13, -1, 0, 5, 5, -5, -5, 16, 20, 22, -8, -2, -8, -2, 5, 18, 12, -8, -22, 8, 14, 7, 7, -3, -7, -12, 9, 23, 13, -3, -17, -17, -17, -4, 7, 0, -26, -26, -13, -16, -12, -17, 2, -7, -10, -2, 9, 1, -13, -3, 4, 6, 9, 11, 14, -7, 3, 33, 20, 7, -3, 2, -3, -6, 11, 25, 16, -8, -4, 12, 15, 10, 9, -8, -7, -3, 3, 5, 8, 10, -4, -3, -8, 7, 8, 5, -7, 3, -1, -1, -14, 0, 4, -11, -19, 1, 7, -14, 1, -17, -6, 6, 9, -4, -11, -15, -17, 17, 4, 1, -1, -16, -15, 4, 11, 20, -1, -20, 1, 8, 12, 12, 13, 7, -2, -11, 6, 21, 10, 7, 5, -11, -3, -1, 4, 1, -6, 10, 9, 5, -7, -1, -4, -6, -4, -2, 10, -7, -22, -11, 4, 8, -2, -11, -23, -19, -11, 8, 10, 6, -13, -16, -3, -4, 14, 6, 1, -10, -12, -11, 0, 1, -2, -3, -16, -8, 7, 19, -8, -2, -1, 3]
3469CLJ4j2j0jkJ6Rj9lmrJ7Ppj4j9J9OPkKj4j9K6P%j0Pj8RpJ6nj1kJ3NnJ2Kj8
3511a1%RRj2j1KJ6j9RJ2Kj4j0J0POJj1rJ5kK1j4j0oOJ2j4K2Lk4j1KNLLj0oJ4q
3551a3qJ8lk0J4J0kOmk5OJ2Njj%lJKQonjJ3J3rmonKJ4Rlrj6J9pPPj1rNoJ4nLp
3598apJ4k0POllpJ6j5J2lj%Mom%lKKJ1kj5j1mK1J0%moJ0qK2j4J0m%j6J3NLj9n
3642a3J3J7mlNj6nK0lj5Oj6J9n%qlj3J1QMj%nj5J4J6orJ6k4JnJ1%jkmJ3j3J0M
3684aj1rRQj4J4J0k0J0LkOqoQJ6mqjj0PMJQj3rkQJ2pPj3nQMJ3j8j8PJ0j4NRjj2
3729a9jJ1mMjjRj2LOjPj3OQlJk0PmJ6J2pj0nRMJ2j2R%j9MJ3Lj7LOjPnmkmJ0NJ
3776A1jj4njNNLj1j3J7%JPoj4PQLj2jj2J4mJ5Knj0lqK6J3mqj1QJ1j2Oj9KJ0J0
$$ y = [3, 6, 20, 8, -2, -3, -5, 11, 20, 1, -2, -6, -15, 2, 9, 2, -12, -31, -12, -6, 1, -1, 1, -13, -32, -6, 1, 1, -9, -2, -20, -11, -18, -2, -7, -18, -20, -7, -2, -7, 5, 7, -11, -11, -2, 7, -5, -16, -14, 2, -17, -8, 4, 6, -8, -18, -8, -1, 5, 6, -5, -14, 1, -1, 20, 6, -4, -10, -4, 8, -6, 16, 19, -5, -16, -14, -9, -6, -3, -13, -19, -5, -13, -21, -3, -6, -26, -12, -2, -4, 2, -2, -27, -21, -9, -4, -5, -6, -6, -9, -8, -6, 2, -4, -9, -10, 3, 16, 7, 3, -3, -8, -6, 8, 17, 14, 5, -11, 8, 1, 8, 15, 4, -5, 0, -6, 8, 3, 6, -1, -8, 6, -14, -7, -1, -4, -7, -14, 2, -13, -1, -4, -5, -5, -1, -7, -11, -11, -14, -12, -10, 1, -1, -16, -27, -31, -10, 0, 0, -4, -10, 0, -8, 14, 0, 10, 6, 6, -10, 3, 8, 11, -8, -13, 0, 17, 13, 10, 15, -1, -6, 14, 11, -4, 2, -14, 5, 0, 0, -8, -11, -24, -13, -5, -1, -2, -2, -7, -22, -8, 8, 2, -7, 9, -15, -14, -19, -8, -8, -9, -11, -15, -2, -15, -5, -1, -12, -21, -12, -4, -18, -4, 6, -14, -4, -1, -3, 3, -5, -11, -3, 13, 9, 1, 0, -10, -3, 1, 2, 10, -3, -12, -14, -6, 6, -1, 6, -7, -12, -4, 0, 13, -5, -23, -16, -6, -20, -15, -6, -7, -19, -20, -9, -13, -9, -10, -11, -2, -14, -11, -5, -6, 1, -12, -6, 2, -1, 0, -20, -13, -17, -1, 11, 4, -6, -11, -2, 2, 14, 2, 11, 11, -8, -4, 9, 12, -5, -2, 4, 3, 10, 5, 1, -1, -5, 5, 10, 11, 10, -4, -9, -10, -5, 0, 3, -8, -21, -4, -4, -3, 4, -2, -16, -9, -1, 2, -10, -11, -23, -9, -13, 2, 4, -1, -11, -14, -22, 4, 17, 13, 5, -6, 2, 13, 1, 7, -12, -10, 0, 10]
3818A0nnRKj0pPqJ3oPkj4J0j9J3mlJ4Qj8lnMMP%J3l6J1lJ6JJj8JJ3JJ4oqj1Mj
3862i%J2mJmlPnOJ4j6LNmmjJJ3oMrPj4ON%Kj1jklPJKp%J5j4J6j7%j5J3lJ1%qJ
3910hmJ0lj5J6JOrOj0jJ2mj0K1Mj3jnPKJ0jk3QNJ7Lj3oMpO%nRj6OmJ3j5kkJ0j2
3955a3Qj4J5j1J3jj1PKj0LORkjj3jQRnJNl2J6KJ5j6J2nqK4Rj1j1JJrMJ4Pj6j1
3997a0J0Rj3J9rooNQmp%J1j9LJ5j8Jj1K5Lj5kj4J1OJ0oj3NpJ2Nj8J0Kj7RJ8%P
4038Ij3J1q%JJ2j2kmMJ1lj1J3Ml%Nnj3MLJJ4qpj1J2KoJmjrNpJ9j6oMKJ4qOoj5
4084b1J1MJ7nj4KLL%mOj4RNKMjmj1MMJ4j2j1J7lMKqPk2RK2rj8Mkr%K9j7Pj1nP
4129eoJ0JnlJOmj1jqK1j5J5Nj7MJ3knoJ1rkRJ1Qj6qJ0MmJ8j8lnmJ9m%%lkJ1J0
$$ y = [10, 5, 0, 9, 11, 1, -6, 1, -7, 6, 0, 7, 5, -9, 1, -18, -5, -9, -12, 2, 10, -8, -11, -16, -12, -8, -1, -1, 12, -24, -13, -16, 0, 1, 2, -16, -15, -2, -1, 13, 7, -1, -12, -8, -9, -9, 3, -1, 0, -4, -7, 0, -5, 1, 15, -1, 2, 7, 3, -1, -2, -1, 12, 6, 10, 1, 8, -6, 0, 5, 5, 7, -4, -5, -7, -10, -3, -2, 0, -7, -7, 8, -6, 10, -7, -7, -22, -9, -12, -1, -1, -9, -8, -12, -2, -5, -20, -4, -3, 3, -6, 0, -10, -11, 1, -3, -13, 8, 12, -1, -2, -7, 0, 2, 12, 11, -12, -4, 1, 18, 21, 8, 2, 6, -1, 5, 5, 0, 9, -7, -1, -5, 8, -7, -9, -11, -1, -13, -5, -19, -4, -15, -2, -3, -14, -7, -5, -15, -12, -6, 3, 1, 0, -13, -14, -6, 3, -2, -1, 4, -28, -12, -10, 5, -11, 1, -4, -12, 12, 21, 10, -1, 0, 1, -8, -4, 10, 17, 1, -10, 0, 9, -4, 15, 6, 0, -6, -1, 7, 3, -4, -4, 7, -12, -9, 6, -12, -11, -22, 3, 6, -9, -11, -25, -14, -8, 2, -4, -17, -12, -19, -7, -2, -20, -10, -8, -25, -16, 2, 2, 9, -4, 7, -1, -1, 0, 12, 0, -2, -6, -2, 9, 6, -5, 8, 12, 9, 9, 14, 9, -4, 0, 3, 4, 18, 10, 3, -8, 4, 6, 0, 1, -3, -4, -13, -8, -15, 4, -12, -18, -14, -12, 2, -6, 0, -6, -21, -10, -6, 11, 6, -8, -6, -3, 0, 0, -4, 2, -12, -3, 2, 4, 8, 7, 3, -8, -4, 0, 14, 2, -9, 8, 5, 9, 11, 3, 10, -12, -3, 19, 10, -8, -4, -6, -15, -15, 14, -3, 4, -7, -12, -5, -11, -1, 0, -5, -8, -7, -1, -5, -16, -17, -25, -4, -19, -4, 1, -16, -12, 1, -1, -6, -12, -1, -10, -12, -3, 8, 16, 0, -8, 2, 6, 2, 20, 2, -1, -6, -10, 9, 5, 5, 5, 2, 0, 11, 21]
4174B1j2j4oJ8j2mNoJ1oNkJkopQJ1j3QjqPk%Oj0j2RPPJ2k1mNJ%J2Qk0nNJ5kmJ
4220DmPj2LlQ%mlJ2j7JjLRMRj8NoQlRj9mNMkQlmkqQOqKj2%J1KmNrOj0J6kmOpJ3
4272EnJ1pMoJ2j0mMqLkJ0mkmlKLJK0qj9J0qJ2j1J3nj5jQnJ5pplJOkk%Nj0J6Np
4319Ak3pK6lpLMM%nJ4k4NjLJ3jjj3J2mMJJ8rj7J0kl%MlqJ5j3K0j0oj2%%J6J5k1
4363eoOQjlJkpKKKnj2J2nJ3kmK%%oJ1Mm%j4J2Oj6QmJ3mlkNkpJ1QnQnj8J2%Kj5
4412iJ8j5PoLNk0J2nKJ6k0nmMJ8rQMRk6QLQlpQj1PJjljJOmN%qJ1j1LJ4j1jlQp
4460a%lKNpJ9j0jj6J2j1J5NnOk0OnJ0Lkj1PrK0oj7J2poJ0%LjmJKqJ2jLqJ3rPm
4506AkPKkKjk2J3LMRQj3pJ2j7%RrLj5J6JkMrj%pJ3Pj2nK%Pj0kjj2K2lOj1lJ0k
$$ y = [21, 9, -5, -11, 7, -5, -9, -4, -10, 1, -5, 0, -2, -1, -3, -9, -16, -8, 3, -10, -2, -3, -11, -4, -6, -6, 0, -10, -22, -13, -6, 1, 13, -8, -12, -7, -6, -6, 6, 14, -6, -11, -6, 9, 7, 3, 4, 0, 7, -5, -2, -5, 3, 3, -1, -4, 8, -9, -8, -9, -6, 3, 7, 16, -2, 3, -3, 5, 2, 11, -8, -12, -7, -3, -5, 3, 0, -4, -6, -14, -6, 0, -8, -6, -18, -18, -7, -5, -9, -4, -13, -7, -17, -1, -3, -7, -1, -8, 5, 0, 11, 4, 8, 2, 14, 4, 0, 4, -4, -1, -3, 7, 3, 1, -3, -6, -4, -1, 0, 20, 12, -7, 3, -5, 7, -4, 9, 4, -11, -12, -4, -9, 6, -1, -8, -11, -10, -4, -6, -8, -8, -3, -13, 3, 8, 1, -22, -29, -3, -6, -13, -10, -6, -2, -2, -7, 7, -17, -12, -13, -10, 3, 2, 1, -12, 0, -4, 0, 1, 19, 10, -7, 3, 1, -2, -2, 2, -1, -9, 6, -7, 13, 3, -3, -15, -15, -15, 1, 16, -5, -11, -5, 3, 2, -1, 0, -2, -9, -7, -5, -3, -8, -20, -8, -13, 0, -2, -6, -4, -4, -4, -10, 1, 5, 1, 1, -13, -1, 5, -11, -3, -7, 6, 2, -1, -3, 2, 0, -7, 4, 12, 7, 15, 10, -8, 4, 4, 6, -9, 9, -6, 1, -5, -2, 3, -17, -5, -10, -8, 8, -12, -17, -21, -17, 1, -8, 0, 4, 13, -13, -5, -2, 6, 3, -4, 4, -7, 0, 1, 0, -3, -4, -3, 3, -1, 4, 4, -4, 7, -4, -1, 13, 2, 1, -2, 6, -1, -1, -4, -2, 3, -4, 15, 5, 4, -12, 0, -11, 4, 9, 4, 10, -10, -4, -9, 1, 4, 2, -9, -2, -11, 9, 3, -14, -2, -9, -15, -5, -5, -2, -3, -7, -6, -4, -12, 0, -1, 2, -6, 7, -2, 5, 1, -1, 6, 8, 6, 8, 7, -15, -2, 1, 5, 14, 22, 9, 2, 14, -3, -3, 6, -3, 0, -15, 1, 2, 0, 4, -5, -6, -6, -13, 0, 7, -5, -10, -8, -8, -1, -11, -13, -14, -26, -4, -7, -1, -12, -15, -5, -7]
4553gP%j6NQ%RnmLKKKQj8J4j4OPLqJ5k9RJ3j1J1rMLj0LLj1QNj6J2qjkj5J1J9o
4598Blj4PjKOMjk2J0LJ1j3KkNKJ2j1oLj4RJ1LjpOLKjknN%rRlkoQNPj0Oj2rJ0k
4647cLJPj1JOj8Rkkj0K4nkPj6MrJ3nj1QoJ4PprPKJ1j4jN%J0mp%NmLoK0j1lKNj2
4695dj0K7lnLj6J1j0J5Pj6q%J4jokKpNNj4J3j6J9Jrj5K0j2lJ2ljNn%JJJ5k2On
4738a1RJ1nnlJ3rmOJ3j5%j1OJ7Rrj4J2rMjkMjPnjj5jJPKPplj2NJ1NpqnJ4oRol
4786fopJ0%oRQj0oJ1KJJoJ7mj5RJJ3rmRrpjJ7%Krj4RJk3J7OnOj1MpJ6j2RqP%j0
4834a0JOmjLRj0mmRJ%Lj3J0J4k2NK%Oj4K1Jmr%RmJ0lLj7LKRNj3LnoOJ3%j3LLm
4882@mjKmKj3RJ1qkNj0KM%j0jON%OOj5QjJ1rj1RjlLOJ%j0LJ0jKj4OkOJLklJj1
$$ y = [-7, 0, 0, -16, -11, -3, -3, 6, 1, -3, 0, 2, 4, 6, 14, -4, 10, -4, 2, 9, 12, 4, 19, -10, -1, 12, 1, 12, 3, 7, 10, 0, 3, 6, -5, 3, 8, -8, 4, -4, -5, -7, -22, -11, 8, 2, -1, -15, -8, -9, -7, -1, 3, 2, -20, -10, -7, 4, -9, -7, -9, -4, -2, 10, -1, -7, -4, -18, -9, 2, 5, 4, -3, 3, 6, 8, 7, 5, 0, 5, 5, -4, 5, 2, 0, -6, 2, 7, 14, 4, 10, -2, -11, -1, -3, 0, 1, 8, -3, -2, 4, -14, -5, -7, -9, -19, 5, 0, -2, 5, -11, -7, -16, -3, -8, -19, -11, -17, -3, 4, -3, -12, -5, -3, 8, -6, -7, -2, -2, 8, 4, -3, -3, 2, -2, 1, -5, 15, 4, 1, 3, 8, -4, -14, 13, 10, 5, 8, -8, 3, -7, 8, 15, -1, -9, -9, 5, 4, -2, -4, -2, -9, -4, 1, -13, 0, -16, 3, 4, -5, -20, 0, -12, -15, -3, -6, -7, -2, -7, -7, -6, -5, 10, -12, -6, -11, -2, 9, 4, -1, -4, 9, 0, -4, 2, 15, 0, 0, -11, -5, 12, 21, 12, -2, 10, 1, 5, 4, 2, 6, 5, 12, 7, 6, -9, -10, -9, -2, 0, 7, 0, -3, -15, -10, 1, 6, -1, -9, -14, 0, -6, 3, -3, -6, -12, -19, -9, -9, -15, -6, 2, -8, -14, -3, -1, 0, 1, -5, 12, 8, -7, 2, 3, 16, 7, 3, 12, 3, -4, -5, 12, 12, 14, 5, -9, 0, 1, -22, -5, 1, -4, 2, -9, -5, -12, 4, -8, 1, -7, 0, 0, -10, -9, -3, -7, -8, -5, 4, -6, -10, -14, -5, -4, -4, -1, -14, -4, 10, -12, -7, -5, -5, 1, -13, 8, 9, 5, -4, -4, 5, 1, 11, 8, 11, -6, -3, -1, 8, 13, 0, 3, -2, -8, -2, 11, 11, -2, 1, 4, 0, -4, -5, -3, -7, -5, -18, -9, 2, -6, -8, -3, -13, -11, -7, -7, -17, -18, -12, -7, -7, -1, 5, -10, -2, -3, 8, -1, -12, -3, -4, -7, -4, 2, 3, 3, -7, -4, 6, 5, 7, -7, -1, -3, 3, 4, 7, 5, 2, 3, -8]
4932hj3J8jNlj0J0Ojj1MmPQk7J7j5NLjlLJ2nj2J6qKJoJ6okPk2J2KLPJjkj8K0m
4977BQqnQq%LJrMJ0mmKmLj0J8Kj0j4KJ1RnJj0qLK0j4Kj3J0p%RlRoj5J7kkoJ0P
5024Dj0KoNmJNnJ6j0Omj0J1J5qrljJ3Oj3OlklJ2m%nj1mK3ppLqKNJjoj0lJ8%Rj
5072Ejj1LOJpRnNj1MKRJj8%MRoQ%lJKkJkJ0j1OjNrK0j6jOpnPpJ0ojnj0J4%j5k
5122a4J3%rK1lrnj0J2kQqnjJ5qnJ8j4jML%J1kj6J4j0PMj0J5roJ0JqKJ1k2J3J2
5164A7j8P%j3nK1Kj0kj2J1lJ3k3%J3LpmMNk0J4LpK0j5jLO%ml%QLj5J3%JMj0kK3
5208B0j8rQMMkJmJ3j2Mj4MJ4mqRqrJjOPnoJ2j2oJ6loJ1j7K0jqLnjj1ONLoQj4J1
5255@pNJ1k0KJ0mM%Pj2%J5Llj0QJmNJ1k5JMKQk%Mk4J2Lkj9K5j1NmrKRkNj4pJ6
$$ y = [-8, -21, -3, -4, 1, -2, -12, -2, 4, 3, -8, -4, -8, -1, 7, -20, -3, -18, -13, -10, -11, -14, -11, 1, -4, -16, 0, -8, -6, -5, -11, 5, -1, -3, 4, -18, -6, -4, -1, 6, 7, 6, 4, -14, 6, 2, 10, 2, -3, 5, -3, -3, 0, 1, -8, -4, 6, 2, -2, 0, -4, -1, -11, 7, 9, -1, -15, -13, -2, 7, 2, 3, -7, -15, -12, 8, -6, -4, -17, -7, -14, -14, -5, -8, 1, -5, -20, -3, -5, -7, -13, -3, 4, -6, -4, -10, -5, -9, -8, -3, -8, 8, -2, 4, 0, -10, 1, 16, 8, -1, -4, -5, 8, 14, 1, 7, 4, 2, -1, 11, 7, 7, 2, -9, -13, 10, 3, -4, -1, -9, -7, -2, -1, -2, -8, -18, -21, -3, -3, 6, 5, 4, -7, -4, 2, 3, -4, 5, 0, 5, -6, -2, 0, 9, 10, -8, -8, -4, 5, -1, 7, 7, 4, 5, 7, 5, 6, 4, 14, 3, 9, 8, 13, 4, 24, 8, 7, 13, 6, 1, 8, 1, 11, 5, 4, -1, -11, 3, 3, -12, -14, -1, -1, -10, 11, 8, -1, -6, -16, -4, -6, 2, -6, -11, -12, 3, -5, -10, 8, -6, -7, -3, 0, 0, 11, 9, -7, 7, -3, 4, 8, -2, 13, 4, -2, 8, 9, 1, 3, 14, -8, 5, 17, -1, 6, 6, -7, -12, 9, 11, 1, -1, -13, -2, -5, 8, -15, -15, -2, 1, -6, -10, -6, -1, -21, -7, -4, -11, 9, -6, -7, -4, 2, 2, -2, -5, -5, 3, 6, -9, 4, 4, 5, 9, -1, -3, 20, 2, -7, 1, 5, 9, 7, 8, 4, 17, 5, 9, -5, -1, 13, 9, 1, 10, 2, -7, -6, -7, -1, 6, 1, -5, 7, -5, -11, 5, 2, -4, 7, -10, 10, 9, 1, 4, -1, -2, -13, -7, -2, 1, -5, 3, -11, 0, -7, -2, 9, -11, -9, 1, -3, 1, 1, 8, -4, -4, 11, 14, 11, 1, 9, 10, 6, 11, 22, -3, -2, 2, 4, 12, 10, 10, 14, -10, 2, 5, 3, -16, 9, -2, 3, -1, -10, -8, 1, -1, 4, -10, -17, -1]
5301akMqJ2j0jJJ0j9Pj0J3Oj5QJlJ2j0JJmPLRj2%LkmJ3qOrkMQnonJ0J0qKj3NJ
5348@kLmKmKOlj2J8j0nRj0QQqlJJ1j2jJ0rOLqLJO%jPkMnpnJ4ljnO%j1KJOj4Qk
5399bOQj9MMJMmpJ3qJ1j0Oj9J0mnPkJ3j7JLJ0lkqJ0noJ3Rj8j7K5jJmlrJ3LRMl
5445A2jq%J2njJNmjj0%%Kj5J5lLnNj%PJ7k1krmNkJ0j5J7oLj4J2oJ8j4LoRppJ1
5491@KpPPn%J6j3j4K0j0OmRn%kKLjj1RJJ0k3MMlNN%kpkmpJJ0Mj0qOjKJNqJ4no
5541elRqlOnJ6jLjKlJjKMj5LKnJ0mj0J6JklQPj4%J5k5Rkj4NjJ5jjrmkJ1Qj4m%
5590g%lMK%Rr%JkjJ5nj7J2qJ9mmo%K0moj3PQmjNj2J4jRrOqmPmPqkJ1nLnloRj3
5641fkNKJ1j9jlK4j5nkMjkOoRl%mJ4k1RpnL2j7kN%MKpOjlpJ5JnknJ4j1MMnrOJ
$$ y = [-1, -3, 1, -7, 5, -5, -6, -5, 5, -14, -7, -17, -4, 2, -13, -5, -4, -7, 5, -5, -4, -3, -7, 0, 3, 12, 0, 0, 3, 1, -3, 10, 2, 8, -1, -3, 1, 9, 4, -2, -7, 3, 13, 5, 7, -6, -1, 0, -2, 1, -3, -1, -5, -3, 3, 0, -12, 6, -4, -9, 0, -10, -2, 6, -2, -5, -4, 7, -5, -6, 4, -5, 1, 4, -4, -1, 0, 6, 6, 5, 12, 10, 14, 9, 2, -3, 11, 8, 7, 2, 8, 8, -3, -1, 0, 6, -8, 0, -2, 4, 12, -7, -3, 1, 2, 6, 2, -5, 8, 0, 11, 1, 7, -12, -2, -6, -11, -4, -6, 7, -10, -9, -6, 4, 1, -1, -9, 1, -4, -10, 3, 12, -6, -23, 2, 1, 2, -2, -5, -14, -1, 2, 11, 15, 12, 11, 3, 3, 15, 10, 9, 10, 15, 11, 10, 0, 0, 0, 2, -13, 2, -1, 2, -3, 2, 1, 1, 8, 25, 4, 2, -7, -11, -6, -8, 2, -13, 4, -2, 1, -13, -1, -7, 11, -3, 0, -6, 3, -4, -11, 0, 2, -5, 2, 9, 4, 4, 20, 7, -7, 13, 3, 9, 5, 14, 9, 9, 7, 9, 12, 11, 0, 9, 10, 20, -3, 1, 5, 2, 7, 12, 12, 10, 3, 1, -3, -10, -9, 1, 5, -5, -13, -7, -8, -6, -5, 0, -8, 6, 1, -5, -8, 1, -7, -10, -4, -9, 7, 6, 9, 8, 10, 7, 8, 7, 9, 13, -2, 1, 3, -2, 8, 4, -6, 10, 11, 9, 6, 14, 21, 7, 7, 22, -3, 6, 4, -10, -5, -6, 9, 8, 7, -2, -6, -8, 3, 11, -3, -7, -7, -7, -10, -6, -4, -4, 5, -4, -4, -3, -5, -6, 9, 4, -13, -1, -9, 10, 6, 2, -4, -4, 16, 12, 6, -7, 0, 8, 4, 3, 8, -4, 10, 9, 18, 9, 15, 7, 3, 10, 6, 13, 5, 3, 14, 9, 12, 7, 4, -2, 7, -6, -8, -3, -1, 10, -9, -10, -13, 11, -4, -9, -11, -7, -8, -10, -4, -10, -1, -4, -4, -8, 6, -15, -6, -13, -18, 14, -3, -5, 0, 0, 4, 6, -1, 5, 4, 1, -6, 9, 10, 5, 3, -2, 12, 1, 5, 9, 4, -5, 1, 2]
5691BJ5j7J0j6OpJ1j2jKJkJOJpoJ2j2K0qmQj4JRj6QllJ8jk%mklNKRrQjqJ4jnN
5739A0j1jJ5pjj2R%J6oj5jPJkNj2OMj7NMQj0j3PLJ3j3MqMRpOjrOoLKJJ7k0OQj7
5786a0J5j0Rk%J2j1LNj6J2MlJmj3J7oKKmlOQnj1NomK1k9RKpRjj1PPjrrJ2%jNJ
5833bjoRmj3JJ4j0NlJ0JnJ0nPP%pmMKMj7Q%moJ2Qj8nJ2kPj1%PrJ1j3JplJ7k%l
5881cqJ0LJ0k0LMJj2J1oQrKkKjkJ6j4J%JQJ4k1%J1oJ0oj3J3KlQqpOMLk1K0j0%
5926alJ0lkpjQKj0J0j3LkJ0pojMJ1kj1MjlNKj8K0mjLnPJ5j6OnNOok%nR%%KNpj0
5976eJ2%lNoJqjQqJ5lqnRRrjj1MJJ3j0nJ2jMoj3K0k5K2Jj1LRj1RMjkj2NMj4J1
6022BlJ7nmnkmP%JL%MJ0j2pJLjmLlkJ1kj2oJ3pJMn%jOrRrJ0nnRJj2JJ1j7J4j0
$$ y = [2, 17, 0, 10, -6, 0, -7, 4, -8, -9, -7, -6, -8, -7, -1, 0, -7, -13, -1, -13, 7, -1, -5, 3, -11, -10, -1, -17, -9, -12, -15, 3, 2, 0, 0, -4, -6, -9, -4, -2, 7, -2, 6, 5, -3, 11, 10, 5, 10, -1, -2, 13, 6, 5, -7, 2, 2, 18, 12, -3, -4, 3, 4, 2, 7, -5, 1, 5, -12, -7, -3, 5, -5, -18, -11, -8, 5, -8, -4, -12, -8, 1, -6, 0, -1, -10, -4, -10, -7, -5, -4, 13, -7, -1, 7, -10, 5, -5, 4, 2, 2, 14, 3, 6, 11, -5, 7, 11, 8, 9, 5, -8, 9, 3, 5, 7, 3, 0, 6, 14, 9, -2, 3, -3, -7, 14, -15, -6, -4, -11, -2, -3, -14, -7, 0, -1, -10, -19, -7, -7, -8, -3, -2, -3, -9, 0, -4, -17, -16, -2, -12, -7, -10, 0, 1, -4, 6, 1, 8, 15, 15, 8, 4, 8, 10, 14, -3, 5, 5, 1, -5, 7, 15, -3, -8, 4, 2, 9, -2, -2, 5, -4, 7, -6, -5, -12, -15, 2, 0, 0, -3, -11, -1, 2, 12, -8, -5, -1, 0, -12, -1, -7, 1, -8, -6, -8, -6, -7, -9, 7, -7, -6, -6, -5, 3, 17, -4, -4, 7, 1, 11, 5, -8, 5, 7, 4, 12, 4, -3, 3, 7, 10, -11, 9, -1, -1, -4, 6, 3, 1, -6, -7, 1, 3, -7, 3, -10, -7, -9, 1, -6, -12, -13, -9, 2, 0, -11, -7, -8, -11, -6, -4, -22, -2, -6, -7, -4, -9, -2, 13, -3, 3, -2, 3, 9, 3, 1, 1, -4, 5, 5, 5, 7, 12, 5, -5, 7, 7, 4, 9, 3, 4, -4, -5, 3, -5, 10, 7, -1, -6, 3, 12, 3, 2, -9, -5, -4, 9, -1, -6, 6, 5, 9, 3, -10, 10, -15, 7, 8, -3, 0, 9, -2, 7, 11, 10, 8, -4, 1, 5, -9, 2, -1, 16, 11, 7, 2, 0, -4, 3, 3, 4, 7, 7, 11, 21, 9, 2, 3, 6, 5, 1, 4, 1, -1, 10, 8, -4, -10, 3, -4, -3, 1, -4, -4, -5, 1, -8, 1, -8, 2, -3, -8, 1, 2, -10, -9, 2, -15, -1, -11]
6071a1K4qrLj0MRPqJmjQnMj2kJ6%nRj5J5j4OQpj0jQoJpMPMrNnLR%mlkJlnnJ2O
6122CnOpqpK0qJ9j7jQMqnOK2l0J4krNJ1j4J0NqLkoPMnkRoOj0LqKopJ3J6j0j0K
6169cNrNNlO%jKnJ%Rk1PlPMj4Qj1RJ0K%Kj2QnjKlJkPpOj2J0J0krj1LOJ1j2KNL
6219A0j0nNKMJrrJ5kJj4MOj0Pj1%RJ9j8K%JrjJ3Pj3J1k2J0J3j4J0jNj0kJ6JrO
6262IkOj2J3j2J0%j1LMqJNj4RLNk5K7rkjJLj6Rkj0J2j1Q%jQqnpPJ3lOj0JnJ2P
6308Hj1jjRkj2J1JMQk0K9k6OlQRj3NpJ2rj2QNNKk6POLomMjlLrKOLQj2lRk0J2M
6356dPjJjpJ8jj4%NqOPKmQj0NkrK5j6J0qKKj4J0lJOjj2QojMMj2nJ4Jj0jNrJ1K
6404ELrnJOoJ0j2qMLpJ2k%QoQj4J7ooK0j7%QKomJ2Klj5J8lkQqnNnlnJ3oPKp%n
$$ y = [-11, 13, 5, -4, -1, -11, -7, 2, 9, 1, 2, -2, -3, 5, 0, 4, -8, -10, 6, 6, 1, 10, -5, 10, -4, 2, 10, 3, -7, -8, 0, -6, -5, -12, -8, -1, 3, -6, -1, -6, -3, 6, 6, 2, -1, -3, -2, -5, -10, -15, -3, 3, -2, 4, -3, -11, -18, 2, -6, 13, -4, -5, 3, 7, -1, -6, 0, 22, -8, 6, 4, -5, 0, 11, -3, 7, 12, 4, 7, 5, -1, 6, 10, 5, 3, 12, 6, 12, 2, 5, -3, -1, -7, -14, -1, 15, 5, -5, -3, 2, -7, -2, 3, 0, 6, 6, 5, 7, 2, 3, 3, 12, -9, -2, -5, 2, 6, -8, 0, -11, -2, 8, 10, 10, 12, 0, 8, 3, 2, 4, 1, 2, 0, 7, 0, 6, -6, 4, 14, 12, 3, -8, -5, 1, 12, 0, 2, 7, 10, 0, -5, 0, 2, 6, 7, -2, -11, 4, 2, 3, -11, -7, -1, -11, -4, -15, -15, -6, 13, -5, -3, -3, -2, -11, -12, 1, 8, -5, 6, -16, -6, 7, -7, 3, 2, 7, -3, -5, 11, 12, 3, 9, 7, 13, 1, 14, 2, 12, 12, 1, 4, 8, 0, 1, 6, -8, 1, 4, 9, -16, 11, 2, 0, -1, 0, 3, -13, -4, -6, -16, -4, -15, -7, -7, -8, 0, -8, -13, -20, -13, 0, -3, 3, -7, -6, -11, 1, 8, -3, -4, -5, 4, 2, -10, 1, 2, 6, 14, -6, 23, -3, 3, 0, 8, 17, 4, 9, 2, 14, 5, -7, 1, 6, 11, 13, -13, -6, 0, 3, -3, -7, -3, -4, -7, -4, -13, -11, -5, -2, 6, -6, -9, 0, -20, -8, -4, 3, 2, 3, 2, -5, 13, 12, -2, -2, 3, -5, 1, 8, 10, 6, 14, 4, 9, 7, -2, 23, 7, 17, 9, 11, 13, -1, 9, 6, 7, 13, 12, 0, 8, 2, 1, 5, 9, -3, -8, 6, 7, -3, -4, 1, -8, 3, 5, 8, -1, -6, -5, 1, -5, 5, -7, -15, -11, -8, -15, -3, -5, -5, 3, -3, 5, -9, 8, 2, -4, 16, -1, -1, 7, 9, 3, -1, 11, 13, 10, -5, 13, 10, 8, 16, 8, 3, 8, 3, 0, -5, 8, 2, 9, 11, 4, 4, -1]
6454aOkjMkjrjOkKmLmMJlkjJ0pMQj3PomRpNpJ0lkMJ2j1NrJ1PrMmkJ0j1J0Rj7l
6505C%J0j0lmKJNkMkLj0oJ3pMKpPk0J4jmPMOrJjLLj3QOkrQjJ5k2J3JQjmrJK%N
6556A2pOMmj6%RjqKJ1pkJ0Pj6m%lMLmMNj1LmJ3pJklJ3qnNmRkkM%ljKlQnJ3kj1
6607CQmOkmnOlJJj6JJ7j4J1lj4J5KoKNoPj0KOqj1J5KklrLNkJ0oJj3RP%JmKkRm
6657F%qMNMpMjj0RmkPKroQJj2PJ0j0J0loJ2k4J1kjMqJ9j5J7j6J2k1QoQMpJ4oj
6703A%j1pJ4j0J3k%%JlNpJ3j1Rj0NLNj2OMJokRNnNKJj1JOj0KJkJ0oJlJpLJpJN
6753BJrJ0jnj0MPqJ6j5RKjNj0Qnj2J6lMOJ%k0J3jpJlkJ2KK%KLj1jKQj3OmPJ4k8
6801fJ8oPj1LKJ0j6jMMNlj1nmjQm%OJ0Lj8Qj4K3j6qK3pqJKkJ0O%pOj3Qjj0K1j7
$$ y = [-1, 5, 3, 2, 6, 4, 3, -6, -7, -1, -3, -1, -5, -2, -6, -2, -1, -4, -6, -7, 3, -4, 0, 8, -5, 2, -4, -8, 1, -6, -1, -8, 2, -1, -3, 1, 13, 2, 7, -2, 9, 16, 7, 11, 7, 5, 15, 4, 14, 23, 6, 3, 3, 13, 3, 0, -4, -2, -1, 4, 2, 6, 4, 7, -3, -9, 4, -3, 1, 3, -4, 3, -17, -3, -4, -8, -1, 3, 9, 0, 1, 0, 3, 6, -7, 1, 7, 5, -4, 4, 3, 18, -4, 9, 10, 18, 17, 13, 4, 5, 7, 7, 12, 5, 11, 15, 11, -5, -5, 4, 3, -5, -3, 8, 1, -1, 9, 16, 0, -4, -4, -7, -3, 0, -4, 0, 5, -6, -3, -7, 6, -1, 0, -2, -5, 8, 0, -5, 0, -4, 5, 3, 1, 5, 5, 2, 1, 3, 0, 8, 3, 16, 14, 3, 11, 7, 13, 11, 7, 2, 8, 5, 6, 7, -9, -8, 9, -5, 6, 3, -11, 4, 6, 0, 2, 7, 1, 8, -2, 0, 6, -2, -13, 2, 4, 2, -1, -10, -7, -2, -4, 6, 0, 1, -12, -3, 4, 4, 5, 1, 3, 1, 10, 6, 6, -2, 2, 7, 11, 4, 8, 7, -3, 6, 2, 0, 7, 9, 0, -6, 2, 3, -9, -2, 8, -2, 8, 5, -1, 11, -13, -2, -4, -5, -1, -9, 10, -5, 12, -4, 8, -13, -5, -11, -3, 1, -6, 8, 2, 1, 1, -10, -17, -3, -13, 0, -2, -2, -2, -1, -4, 1, -6, 7, -4, 5, -5, 0, 3, 8, -4, 2, 6, 7, 1, -1, 8, 13, 8, 13, 15, 16, 5, 6, 12, 2, 4, 5, 3, 13, 7, 8, 5, 6, -1, 2, 3, -4, -3, 2, 3, -6, 4, 3, -2, -12, -8, -1, -9, 7, -8, 1, 3, 2, 7, -3, 5, 0, -12, 4, 1, 5, 11, 12, 12, -8, 5, 4, -3, -2, -5, -7, 5, 7, 9, 9, 11, 14, 3, 2, 4, 12, -1, 5, 1, 8, 22, -6, 12, 6, 13, 2, 5, 7, 17, 1, 0, 4, 8, 13, 10, -1, -6, -10, -11, -3, -7, -7, -1, 9, 12, -6, 2, -12, 11, -5, -13, 10, 3, -5, -4, -2, -4, 6, 12, 12, 5, 11, -2, 6, 5, -5, 16, -1]
6847aKmLOjKkMMlJj2J5j0rKKjJJnQQrpJ0k3J5Qjj2OPj0J6k1lJ4kNNj5PJ0qKLq
6895@QpOnmQJ0Jj7QOj4RnLJj0J9j6oQMomPjqMJ0j0Jk4K7j2kJ1k%JoJ0jj7K1qM
6941BkjmLMoKMJ1j1%kJkQJ0rMMk0QmJRnkNjMk4MOlJ2%l%pj0NJjmJ0nNJOqJ0lm
6993anQKoK1j6LkLLjlQj1rJ9j1QLj0oLKpRKMjMjLrpJrOLJ%J4j3NoN%ok%MPj0r
7045a0J7j0Lj4J4j3J1kNllQmLLmqJ2Mj0JlJ7pJpMOllNLj5J6j3J1%pnMlJ2kj3%
7090bJJ7k6J5j0OmPJ1k6K2k0OJj4K6j5LJ3j4KjjqJ2qnOMjLoJ1m%JomRJ0qNpMR
7135A4Mk2J4o%lPjkRqqJ0Lj1j0J3mNKj1nJ1O%Mj5LMj2J4Lj6J4j2J3j4J6no%MO
7178HmpJ4j8jJ0MoQj8L4l1J1OnlQmM%j1J0JPqrJ6j0mMj0PJ0j1Mj2Lj0J5J2k1R
$$ y = [-1, 1, -3, 0, 6, 5, 7, 5, 9, 13, 10, 11, -1, 14, 4, -5, -3, -1, -2, -1, 0, -5, 3, 11, 2, -5, 5, -18, -3, 5, 4, -8, -2, 5, -5, 11, -10, -13, 1, -1, 4, 9, -6, 1, 11, 3, 5, 8, 0, 8, 1, 7, 2, -2, 6, 16, 17, 0, 8, 14, 0, 9, 4, 7, 8, -2, 17, 1, -5, 3, 7, 1, -3, 4, 3, -5, -1, 9, -1, 0, -24, 3, -9, -11, 0, -2, -2, -1, -7, 3, 2, -15, 6, -2, 2, 0, -1, -5, -2, 2, -4, -2, 2, 13, 2, 2, 0, 1, -1, 7, 17, 8, 12, 16, -4, 4, 0, 1, 10, 5, 3, 8, 7, 11, -13, -9, -3, -6, 6, 6, 3, 3, -4, -14, -9, -8, -9, -13, -3, -8, -3, -2, 4, -4, 6, 3, -1, -6, 2, 4, -2, 19, 3, 6, 4, 7, 10, 9, 6, 14, 3, -6, 13, 2, 10, 13, 3, -3, 0, 2, -5, 4, 6, 10, 9, 13, 12, 15, 6, -1, 0, -9, -3, 0, 1, 1, 15, 2, 7, 1, 6, 6, 0, -2, -2, 2, 9, -1, -10, 7, -3, 0, -14, 0, -13, -2, -4, 1, -2, -5, 3, -1, 2, 5, 1, -7, 5, 9, -1, 0, -3, 14, 7, 8, 1, 5, 11, 8, 5, 10, 13, -2, 14, 1, 12, 12, 5, 0, 4, 1, 13, 11, -2, -2, -1, 16, -10, 5, -5, 1, -3, 4, 15, -11, 11, -9, -3, -2, -16, 10, -5, -2, 11, -3, -1, -2, -3, -11, 1, -7, -12, -6, -2, -3, 0, -6, 5, 1, 1, 2, -4, -8, 1, 11, 3, 8, 1, 5, 14, 18, -4, 10, 4, 4, 1, 8, 7, 5, 14, 6, -2, 8, 11, 0, -10, 3, -1, 4, 6, -5, -10, 1, 7, 7, 11, -4, -1, 3, -9, 5, 8, -8, 6, -6, 7, -7, 9, 4, -2, -2, 2, 8, 4, -3, 11, -7, -8, 2, 6, 0, 8, -10, 24, -7, 4, 10, 5, 2, 10, 6, 10, 10, -1, 9, 10, 17, 9, 0, 16, 6, 2, 6, -4, 3, 13, 2, 6, -6, -3, -13, 2, 14, -7, 2]
7220Bj2OJ1oKj8J1Qj0PMpMJ1kKrPj8J3J%%mklJ2%oJ5rQj4J0nj1J6j8J6qjMmjK
7265DRj3lMqjJ0PpJMqJ2Jj4jkMrJ3oJ2Mk4J6pJ3qQMj5jLRlJ2j2J%nm%MjOpJ6j0
7313Hj2PmKPKJj6J7jj2Pj8J9kokOoLMj1J3lkkqJ1prQOnJ0rjRj7J1Oq%QPljj6J1
7361B%pJ2lQrMpLqQ%L%j0J0Kk%nMm%%j0J2j8J2LNj7J1pQrJ2mOMjj0Mm%nK6qnO
7410A2jkj4J6j5J3kmk%J5kk1JJ6pJ7j7PM%rM%Joj0lNJ2j2J3krJ0nokKl%%J0kk
7455@J%%LrJ0rQRj4Qj6QkmJ0OmLoJ2qnPlN%Jk%J%j%KokJ4qnJKQl2K0jlRlokOj0
7508gKNJ0j4Rk0jNLLKkj6J8j0MJ9j2J1JlpJPlP%j3NllJ6Kj0%Oj4RqQNk2J5lLO
7554A1lJj6LjRj2KJ2rRqJ1j2oJj2J9QOj2%j6J3JRpJj0OJllJ3ojPj2J3jj1J7qJ
$$ y = [2, -10, -4, 7, 1, 3, -15, -4, 4, -6, 1, 5, -2, 2, 13, 11, 13, 4, 11, -7, 6, 7, 7, 7, 3, 1, -2, 10, 10, 4, 19, 10, 18, 4, 14, 9, -2, 14, -4, 12, 4, 3, 7, 3, 2, 4, 13, 0, -3, 1, -7, -8, 2, 9, 2, 3, 7, -1, 11, 12, -2, -3, -5, -1, -10, 3, -3, 9, 13, -11, 5, -2, 11, 3, 11, 15, 0, -1, 2, 11, 8, 20, 8, 9, 9, 4, 0, 0, 4, 3, 9, 2, 18, 8, -4, 3, -1, 1, 8, 10, 11, -5, 12, 11, -1, 6, -12, 7, 5, -1, -3, 3, -3, 0, 4, -7, 6, 3, 1, -1, -9, 2, -5, -14, -6, 0, -5, 5, -4, -5, 4, -13, -2, 4, -4, -4, 4, 11, 8, 7, -9, 2, 2, -5, 7, 4, 12, 3, 7, 0, 3, -5, 3, 3, 6, 6, -4, 6, 8, 6, 6, 1, 5, 1, 1, 1, -9, 3, -15, -3, 0, 5, -12, -1, -8, 0, -9, 3, -1, 5, 9, 8, -2, 2, -2, -2, -7, 19, 11, 6, 12, 11, 9, -5, 11, -4, 9, 7, 3, 1, 1, 16, 14, -7, -6, 10, 3, 20, 3, 10, 14, 14, 5, 9, 9, 10, 4, -6, -9, -4, 8, -4, 9, 7, -2, 8, 3, -3, -5, -3, -6, -6, -6, 4, 2, 0, 1, 1, 1, 4, -5, 5, -4, 4, 13, -1, 7, -9, -1, -3, -7, 3, 9, 5, 8, 2, 14, 6, 1, 8, 5, 10, 10, 11, 9, 9, 10, 10, 9, 9, 11, 5, 3, 17, 9, 4, 5, 7, 15, -17, 3, 2, -1, 8, 5, -1, -3, 3, -7, -5, 0, 10, -4, 5, -15, -16, -11, -8, -5, -3, -5, -21, -3, -13, -9, 10, -2, 9, 10, 7, 0, 1, 8, 5, 12, 12, -1, 4, 1, -2, 14, 16, 6, 6, 12, -2, 7, -1, 7, 12, -10, 5, 2, 5, 11, 8, 9, -7, -4, -5, 4, -8, -6, 6, -3, 6, -2, 9, -3, -9, -8, -20, -1, 7, 13, 1, 1, -15, -2, -1, 8, 1, 2, -8, -2, -1, -4, -7, 6, 0, -1, 6, -6, 7, 6, -5, 12, 4, 5]
7598EkpJKRJ1j7qJ5KlpOpkRljpoNJ5qj1J1j3PjNj2J0rRljJ3lj4LlPPj0J2j3MO
7645CJkJoPj5K2oj5J9LjnkJjK2k2jJ2j7R%MkLj4MPnkjpJ4KrLJmKqPj0NLQj1LL
7694CMj1OK1l4OLj1OQmNJ0j4J4n%p%mlMJ1pKLmQRj7J2noNj%rQPj1JLLj0jjQk1
7742a6K2om%%J2qqmJ8L%j0%OMj2QMj3KOJ1oooQMoOPj0NpOolQlMmj3K2plJ2j0J1
7790A8qoJ6j7rJ2nj0J3jRoLJproK1j5PJ1j0Mj1j2K4rONRj2qP%J3j6QnJ0mj8J5
7832HJNj5K2j6JLmNrKMJj5MJ5l%ljKqjMOj2MpJ3rnOKkPKnRj8JQKqJ3j0Oj0MOK
7882GqRkJj0J6mkr%lNQnmK0n%ooLj8J8j0OOj0%J1olRk0RJ0pj%Mj%j3J2lnkJ6q
7930aRkoPlRj6MJ%k%PjlJ0k1J9lnKPK%j3jJNLmJkJ0jmmJMj3PMqj1PLLjpP%LMj6
$$ y = [5, 3, -4, -3, -1, 8, 19, 2, -6, 9, 11, 8, 1, 7, 0, -2, 7, 4, 3, -4, -10, -5, 10, 2, -9, 2, -11, -4, -5, 0, -12, -2, -11, -2, -5, -6, 7, 4, -10, -7, -10, -3, 4, -6, 6, -7, -3, 3, 4, 2, 3, -3, 4, -11, 11, 5, -10, 9, 12, 11, 6, 4, 5, 4, 26, 4, 3, 15, -2, 7, 7, 11, 9, 12, -2, 2, 9, 4, 2, 1, -6, 8, 10, 1, 4, 5, 1, 3, -5, 2, -8, -3, 0, 8, -3, 0, 3, 7, -4, 2, 23, -11, -5, -2, -13, -7, 1, -3, 2, 12, -2, 12, 7, 7, 0, 0, -4, -7, -3, 8, 1, 3, 6, 2, 10, 19, 2, 14, 9, 3, 8, 7, 7, -2, 6, 13, 2, 3, 6, 9, -1, -2, -3, 5, -16, 6, 0, -4, -4, -4, 8, 0, -8, -12, 6, 9, 9, -1, -1, 5, 9, -3, 5, 9, -4, -2, 4, 15, 9, 3, -3, 5, 9, 3, 9, 16, 6, 11, 4, 10, 4, 1, 9, 6, 10, 6, -7, 15, 8, 5, 17, 7, 18, 10, 4, 20, 3, -6, 6, 1, -9, 4, 3, 12, 6, 9, 10, 3, -6, -12, 9, -6, 1, 12, 2, 6, -5, -17, 7, -2, 4, 9, 18, 6, -2, 5, 5, 18, 2, 10, 5, 15, 11, -7, 8, 9, 14, -1, 21, 5, 6, 9, 5, 10, 1, 3, 7, 8, -7, -3, 12, 9, 9, 6, 5, 7, -1, -2, 2, 8, -4, 0, -7, 6, -3, -8, -2, 0, -2, 5, 7, 2, 11, -7, -6, 2, 4, -4, 9, -1, 5, -5, -1, 5, 7, -1, 8, 6, 7, -3, 13, 9, 7, -2, -2, -5, 0, 8, 3, -1, 19, 14, 14, 8, 2, 5, -13, 5, -5, 1, 7, -3, -3, 8, 2, -1, 8, -12, -3, 7, 0, -1, -1, 3, 2, 2, -11, 1, -2, -7, -9, 7, -1, 8, 6, 0, 7, 4, 13, -3, 1, 2, 2, 0, 0, 7, 6, 3, 13, -8, 11, 8, 3, 5, 12, 14, 14, 1, 0, 1, 6, 9, 5, 6, 4, 14, 13, 9, 5, 6, 10, -3, 4, 8, 0, -11, -4, -1, 2, 1, -6, 1, 1, 4, 8, -8]
7983hRnOj4LJ2Kj0QLJqNJLq%J1j1J3j6J1J8j9Nm%Lj0OlLPqpPj0J1Lj4J8pj2QQ
8028A1j1LjMoj2kNPOj2JNoQlrJ1jkMlRkkmJ%OnMJoJ6Mj3pJ1RonLommJ5j5lJ5j3
8078dLNp%OmNJ1k1kJ3%rRkj2QrJ3oLLnPj1kJ8rk%o%J5Lnj4KnOJ5kp%J1nmMnLM
8128ImK%JJKMj6NpQj4PKLkRj4jpJ2kLMj4KnJ7j1NJrQqJ0jpJ7qmpOQMkj0LJ1pj1
8178gJ3qJ0kj2J4kpMJ5j5Mj1
$$ y = [-8, 1, -4, 2, -12, -9, 3, 5, -5, 3, 6, 7, -1, 4, 5, 8, 0, 0, 11, 0, 13, -3, 8, 26, 7, 12, 8, 8, 11, 1, 7, 4, 7, 14, 6, -1, 6, -4, 7, 10, -4, 14, 7, -5, 3, 11, 0, 3, 2, 6, 0, -12, -14, -9, -2, 4, -8, -7, -2, -8, 0, -3, -12, -1, -2, -4, 0, -3, 6, 4, 2, -2, -1, -1, 5, 0, 4, 5, -1, 15, 19, 6, -1, 10, 19, 13, 8, 11, 5, 1, -3, 12, -3, -6, 9, -4, -1, 4, -3, -3, 3, -1, 4, 15, -6, -8, 5, 5, -4, 5, 3, -9, -1, -10, 3, -3, 0, 3, -2, 5, -6, -8, 10, 1, -1, -1, -7, -7, 8, 11, 6, -8, -6, -11, -5, 10, 8, 1, 1, 12, 7, 3, 7, 2, 5, 9, 5, 7, 7, 8, 9, 11, 15, -1, 4, -3, 5, -9, -2, 0, 3, 1, 10, -4, -5, -12, 0, -2, 1, 5, -9, -7, -12, 5, -6, -1, 0, -9, -1, -9, 1, 0, -7, 10, 2, -2, -9, -3, 5, 9, 7, -3, 0, 11, 4, -7, 6, -2, 8, 6, -6, 8, 6, -1, 3, 18, 3, 7, -4]
8191d
##END NTUPLES=NMR FID
##END=
