##TITLE=1H_Pr 2-5066-d
 DMSO,8 sc, 
 22.9.2021
##JCAMPDX= 6.0         $$ Bruker NMR JCAMP-DX V2.0
##DATA TYPE= NMR FID
##DATA CLASS= NTUPLES
##ORIGIN= UXNMR, Bruker Analytische Messtechnik GmbH
##OWNER= root
$$ XWIN-NMR		Version 3.5
$$ Wed Sep 22 09:13:46 2021 Russian Standard Time (UT+4h)  she@DPX200
##.OBSERVE FREQUENCY= 200.1314
##.OBSERVE NUCLEUS= ^1H
##.DELAY= (6, 6)
##.ACQUISITION MODE= SIMULTANEOUS
##.ACQUISITION SCHEME= undefined
##.AVERAGES= 8
##.DIGITISER RES= 18
##SPECTROMETER/DATA SYSTEM= spect
##.PULSE SEQUENCE= zg30
##.SOLVENT NAME= DMSO
##.SHIFT REFERENCE= (INTERNAL, DMSO, 0, 15.7039)
##AUDIT TRAIL= $$ (NUMBER, WHEN, WHO, WHERE, WHAT)
$$ ##TITLE= Audit trail, XWIN-NMR		Version 3.5
$$ ##JCAMPDX= 5.01
$$ ##ORIGIN= Bruker BioSpin GmbH
$$ ##OWNER= she
$$ F:/spectra/data/she/nmr/H-F/1/audita.txt
$$ ##AUDIT TRAIL=  $$ (NUMBER, WHEN, WHO, WHERE, WHAT)
(   1,<2021-09-22 09:12:26.25 +0400>,<she>,<DPX200>,
      <created by zg, POWCHK disabled, PULCHK disabled
       configuration hash MD5:
       00 E9 B6 7A A2 85 ED C7 34 08 36 98 17 FE 4E 26
       data hash MD5: 16K
       97 BD 4D C8 2B D9 AC 59 4C EB 83 C6 7E 19 62 CE>)
$$ ##END=
$$ 
$$ hash MD5
$$ 1F EE 04 58 A8 B8 C7 58 71 E2 C0 4C B9 DB AE 17
##$RELAX= 
##$RELAX= 
##$RELAX= 
##$RELAX= 
##$RELAX= 
##$RELAX= 
$$ Bruker specific parameters
$$ --------------------------
##$DU= <F:/spectra>
##$EXPNO= 1
##$NAME= <H-F>
##$PROCNO= 1
##$TYPE= <nmr>
##$USER= <she>
##$AMP= (0..31)
100 100 100 100 100 100 100 100 100 100 100 100 100 100 100 100 100 100 
100 100 100 100 100 100 100 100 100 100 100 100 100 100 
##$AQSEQ= 0
##$AQ_mod= 1
##$AUNM= <au_zg>
##$AUTOPOS= <>
##$BF1= 200.13
##$BF2= 200.13
##$BF3= 200.13
##$BF4= 200.13
##$BF5= 200.13
##$BF6= 200.13
##$BF7= 200.13
##$BF8= 200.13
##$BYTORDA= 1
##$CFDGTYP= 0
##$CFRGTYP= 5
##$CHEMSTR= <none>
##$CNST= (0..31)
1 1 145 1 1 1 1 1 1 1 1 1 1 1 1 1 1 1 1 1 1 1 1 1 1 1 1 1 1 1 1 1 
##$CPDPRG= <>
##$CPDPRG1= <>
##$CPDPRG2= <>
##$CPDPRG3= <>
##$CPDPRG4= <mlev>
##$CPDPRG5= <mlev>
##$CPDPRG6= <mlev>
##$CPDPRG7= <mlev>
##$CPDPRG8= <mlev>
##$CPDPRGB= <>
##$CPDPRGT= <>
##$D= (0..31)
0 1.2 0 0 0 0 0 0 0 0.06 0 0.03 0 0 0 0 0.0002 0 0 0 0 0 0 0 0 0 0 0 0 
0 0 0 
##$DATE= 1632287545
##$DBL= (0..7)
120 120 120 120 120 120 120 120 
##$DBP= (0..7)
150 150 150 150 150 150 150 150 
##$DBP07= 0
##$DBPNAM0= <>
##$DBPNAM1= <>
##$DBPNAM2= <>
##$DBPNAM3= <>
##$DBPNAM4= <>
##$DBPNAM5= <>
##$DBPNAM6= <>
##$DBPNAM7= <>
##$DBPOAL= (0..7)
0.5 0.5 0.5 0.5 0.5 0.5 0.5 0.5 
##$DBPOFFS= (0..7)
0 0 0 0 0 0 0 0 
##$DE= 6
##$DECBNUC= <off>
##$DECIM= 32
##$DECNUC= <off>
##$DECSTAT= 4
##$DIGMOD= 1
##$DIGTYP= 9
##$DL= (0..7)
0 120 120 120 120 120 120 120 
##$DP= (0..7)
150 150 150 150 150 150 150 150 
##$DP07= 0
##$DPNAME0= <>
##$DPNAME1= <>
##$DPNAME2= <>
##$DPNAME3= <>
##$DPNAME4= <>
##$DPNAME5= <>
##$DPNAME6= <>
##$DPNAME7= <>
##$DPOAL= (0..7)
0.5 0.5 0.5 0.5 0.5 0.5 0.5 0.5 
##$DPOFFS= (0..7)
0 0 0 0 0 0 0 0 
##$DQDMODE= 0
##$DR= 18
##$DS= 0
##$DSLIST= <SSSSSSSSSSSSSSS>
$$ [...]
##$SUBNAM2= <"">
##$SUBNAM3= <"">
##$SUBNAM4= <"">
##$SUBNAM5= <"">
##$SUBNAM6= <"">
##$SUBNAM7= <"">
##$SUBNAM8= <"">
##$SUBNAM9= <"">
##$SW= 20.0188988654967
##$SWIBOX= (0..15)
0 0 2 0 0 0 0 0 0 0 0 0 0 0 0 0 
##$SW_h= 4006.41025641026
##$TD= 16384
##$TD0= 1
##$TE= 0
##$TE2= 300
##$TE3= 300
##$TEG= 300
##$TL= (0..7)
0 120 120 120 120 120 120 120 
##$TP= (0..7)
150 150 150 150 150 150 150 150 
##$TP07= 0
##$TPNAME0= <>
##$TPNAME1= <>
##$TPNAME2= <>
##$TPNAME3= <>
##$TPNAME4= <>
##$TPNAME5= <>
##$TPNAME6= <>
##$TPNAME7= <>
##$TPOAL= (0..7)
0.5 0.5 0.5 0.5 0.5 0.5 0.5 0.5 
##$TPOFFS= (0..7)
0 0 0 0 0 0 0 0 
##$TUNHIN= 0
##$TUNHOUT= 0
##$TUNXOUT= 0
##$USERA1= <user>
##$USERA2= <user>
##$USERA3= <user>
##$USERA4= <user>
##$USERA5= <user>
##$V9= 5
##$VALIST= <valist>
##$VCLIST= <CCCCCCCCCCCCCCC>
##$VD= 0
##$VDLIST= <DDDDDDDDDDDDDDD>
##$VPLIST= <PPPPPPPPPPPPPPP>
##$VTLIST= <TTTTTTTTTTTTTTT>
##$WBST= 1024
##$WBSW= 4
##$XGAIN= (0..3)
0 0 0 0 
##$XL= 0
##$YL= 0
##$YMAX_a= 72510
##$YMIN_a= -125763
##$ZGOPTNS= <>
##$ZL1= 120
##$ZL2= 120
##$ZL3= 120
##$ZL4= 120
##$ABSF1= 10
##$ABSF2= 0
##$ABSG= 5
##$ABSL= 3
##$ALPHA= 0
##$AQORDER= 0
##$ASSFAC= 0
##$ASSFACI= 0
##$ASSFACX= 0
##$ASSWID= 0
##$AUNMP= <proc_1d>
##$AZFE= 0.1
##$AZFW= 0.1
##$BCFW= 1
##$BC_mod= 2
##$BYTORDP= 1
##$COROFFS= 0
##$CY= 11.3945322036743
##$DATMOD= 1
##$DC= 2
##$DFILT= <>
##$DTYPP= 0
##$F1P= 2.36226072786647
##$F2P= -0.459571619588291
##$FCOR= 0.5
##$FTSIZE= 0
##$FT_mod= 4
##$GAMMA= 1
##$GB= 0.15
##$INTBC= 1
##$INTSCL= 1
##$ISEN= 128
##$LB= 0.24
##$LEV0= 0
##$LPBIN= 0
##$MAXI= 10000
##$MC2= 0
##$MEAN= 0
##$ME_mod= 0
##$MI= 1.114404
##$NCOEF= 0
##$NC_proc= 0
##$NLEV= 6
##$NOISF1= 3.799351
##$NOISF2= 2.8
##$NSP= 1
##$NTH_PI= 0
##$NZP= 0
##$OFFSET= 15.70392
##$PC= 1
##$PHC0= -14069.74
##$PHC1= 6.200887
##$PH_mod= 1
##$PKNL= yes
##$PPARMOD= 0
##$PSCAL= 0
##$PSIGN= 0
##$REVERSE= no
##$SF= 200.130013532006
##$SI= 16384
##$SIGF1= 3
##$SIGF2= 2
##$SINO= 400
##$SIOLD= 16384
##$SREGLST= <1H.CDCl3>
##$SSB= 0
##$STSI= 0
##$STSR= 0
##$SW_p= 3612.71676300578
##$SYMM= 0
##$S_DEV= 0
##$TDeff= 0
##$TDoff= 0
##$TI= <>
##$TILT= no
##$TM1= 0
##$TM2= 0
##$TOPLEV= 0
##$USERP1= <user>
##$USERP2= <user>
##$USERP3= <user>
##$USERP4= <user>
##$USERP5= <user>
##$WDW= 1
##$XDIM= 8192
##$YMAX_p= 0
##$YMIN_p= 0
$$ End of Bruker specific parameters
$$ ---------------------------------
##NTUPLES= NMR FID
##VAR_NAME=  TIME,          FID/REAL,        FID/IMAG
##SYMBOL=    X,             R,               I
##VAR_TYPE=  INDEPENDENT,   DEPENDENT,       DEPENDENT
##VAR_FORM=  AFFN,          ASDF,            ASDF
##VAR_DIM=   8192,          8192,            8192
##UNITS=     SECONDS,       ARBITRARY UNITS, ARBITRARY UNITS
##FACTOR=    0.0002496,     1,               1
##FIRST=     0,             0,               0
##LAST=      2.0444736,     0,               0
##MIN=       0,             -125763,         0
##MAX=       2.0444736,     72510,           0
$$ Real data points
##PAGE= N=1
##DATA TABLE= (X++(R..R)), XYDATA
$$ [...]
1929b49q4M26m86J42N23o86K14K49n69L02M04o85M68R8l62L90l24k53O13j87k1
1950g7O12m32l00N22m83J65L78o31L56L35p68M44J03n71P67k93l44L27K34k86
1970E8L16k33l99R05n45n17O24o75M80L56l27j48N16p71L10M0p16Q33l77j21L76
1991a5M6l36N12m03r0O02p83Q0R86p32L4K93m29J91K98p47P42J3l34M50l93k33
2013b48N95o7p47Q83l95j43M73m46o2O33n41k68P63p29N34J4m29N0M80n44L47
2034A53n0n51P99n22j67N93m61j96Q69q87K50O49r66K68N00o53K23K62q36O18
2054a05J23n10O72J13m55N33l85m76O88m17j24P69n17j58P27q14L03P75q63L28
2074B07J36p47J026l09n37N75j85m53Q62l27o74P60k49k15M36k49m14Q28o98K19
$$ plain form
1929 -249 -333 93 -393 -251 272 -414 -200 49 -520 -218 186 -499 -31 67 -295 95 -229 -482 131 -56 -77
1950 -77 535 103 -197 325 -158 7 385 -246 110 445 -323 121 224 -347 420 127 -217 110 344 58
1970 58 374 141 -258 647 102 -415 209 -466 14 370 43 -105 411 -360 -50 -10 -726 107 -270 -391 -15
1991 -15 31 -305 207 -196 -286 316 -467 -387 599 -133 -99 194 -235 -44 254 -493 249 262 -72 378 -15 -248
2013 -248 347 280 -467 416 21 -122 351 -95 -157 476 -65 -333 430 -299 235 249 -180 -130 350 -194 153
2034 153 103 -448 351 -171 -338 255 -206 -402 467 -420 -170 479 -487 -219 281 -372 -149 113 -723 -105
2054 -105 18 -492 180 293 -162 371 -14 -490 198 -219 -343 426 -91 -249 478 -336 -33 742 -121 207
2074 207 343 -404 622 313 -224 351 166 -287 575 248 -426 334 85 -130 306 57 -357 471 -227 -8
2094hM69q01K29J55k85L23o5n59N40K8m53N24k95l16O77k51k58P89p76j69P01
2115A99m88J46L48l46L0M16p34M15J34m75Q87jq37M33K96o26N34j93l81Q66p22
2136i9k23Q00p78M51Q5m42J32M49l68j74M59l49K35n9q60O84K49p81J036p83j54
2157d90J026o15l95O52m24j97N55m40R4L68m52J73K41m51K49J04n06N85l2m53
2177d08N90j68j95M22M2l75O68k54k48L14n62L97L44r93M73J26m75M08o4k47M84
2198B79J03p07N82j16k52K71k53j60N94m01j55N09k60o1K90n83R9M80n70L02J8
2219Ik65K81j40l11N57j98m30N83k85M0L58l57j62N84m38k14N75j82J22N12j010
2240c71N15K60n36N30k23n93R86m24l67O28p32L8N70j92j16N91n21o4K40n11L29
$$ plain form
2094 -8 461 -340 -111 44 -241 82 17 -542 -2 26 -427 97 -198 -514 163 -88 -346 443 -333 -502 199
2115 199 -289 -143 205 -141 -111 305 -429 -14 120 -355 532 531 -306 127 423 -203 331 138 -243 623 -99
2136 -99 -322 478 -300 151 236 -206 -74 375 7 -167 292 -57 178 119 -741 -57 192 -589 447 -336 -490
2157 -490 536 -79 -474 178 -246 -443 112 -328 -234 134 -318 -145 96 -355 -106 -2 -508 77 45 -408
2177 -408 182 14 -181 241 283 -92 576 322 74 388 -174 223 567 -426 47 173 -302 106 42 -205 279
2198 279 382 -325 257 141 -111 160 -93 -253 341 -60 -215 294 34 -27 263 -320 -221 259 -311 -9 9
2219 9 -256 25 -115 -426 131 -67 -497 86 -199 -159 199 -158 -320 264 -174 -388 187 5 127 639 -371
2240 -371 144 404 -132 398 175 -418 568 144 -223 405 -327 -289 281 89 -27 564 43 -21 219 -292 37
2261C7M37n79K61j69k46L15J36o37P86l85l64M69l9l06N36o17P5N41o42J97J46
2282d8k35L98N2n46M01K86o59K85J73m61N67l92m1M81n4l99M67n4l67O29n32J
2304d8N30m98J38J76l01R9P4p08O68k7k95M22j1r12P99k28j9L17l60r2L97m90
2326c69k3N39n23K34J61m52N86l04k67M15K37o09L93j09n6M44m91o9M46m40K42
2347a5M23n85J57K54l38J19J30r7K25ln46O25q7k35J67o6j72L81n16P4L38o23
2369c90J18M25j80k82M38m53J46M42m36K56O4p28M22K00n80N22n5m4K07k54k43
2390d05M08j31k81P86n49n6M15l91J82M20p24M8L23l3J82K6l66L37k40r2L40j68
2412C1k31P12n71m2K55k46p3N20l33qK90m68J53L72m49J96J66n54K83K26j95J48
$$ plain form
2261 37 474 -105 156 -13 -259 56 192 -445 341 -44 -408 61 22 -284 252 -365 -290 251 -391 -194 -48
2282 -48 -283 115 167 -379 22 308 -351 -66 107 -354 213 -179 -220 261 207 -192 275 221 -146 483 -49 -48
2304 -48 482 -16 122 298 -3 96 170 -538 130 103 -192 230 219 -693 106 -122 -141 176 -184 -276 121 -369
2326 -369 -392 147 -376 -142 19 -433 153 -151 -418 -3 234 -375 18 -91 -147 297 -194 -263 183 -257 -15
2347 -15 408 -177 -20 234 -104 15 145 48 273 270 -276 349 262 27 194 128 -44 337 -179 -105 233 -390
2369 -390 -272 153 -27 -309 129 -324 -178 264 -172 84 148 -580 -158 42 -538 -16 -71 -115 92 -162 -405
2390 -405 3 -128 -409 377 -172 -228 187 -204 -22 398 -326 -278 45 12 194 220 -146 191 -49 -141 199 31
2412 31 -200 512 -59 -101 154 -92 -165 355 22 14 304 -164 -11 361 -88 108 274 -280 3 229 34 182
2434A82j43k57P50p79J59M05o86M14J23m72J87L73o51L08K39p18N50o0R2J71k43
2455e6m1L72k24j79L94k98k8L07l11k93P19n05L2M51n46M68K59r82N39J08n50
2476c64N46Q4m49L58j87k53K32n4j7M32k61m13M73m45M25o2m03K11J13k69K87
2497a6K78m53M13l10l27M35K7l63L88R2p47Q41l41j53Q03p05N7N64o79L02l3n15
2519d42N26K72q24P12J10l71J1k73P2L85j64m6M27k41k93N11n53K78L76r44O97
2540B26j57m02J62N96p50N97m25n5J36K88m58O50n38n2L55o55N27M8p9o6K60m74
2562b66J57K99l90K90rm64O14j18j84J8N7k94M56q9l71N23k99j94N62m61J93M07
2584D37n48J75K36l37qJ70l04K64r3l52J21L18j80L06p6r2M58n85K61n2l68J45
$$ plain form
2434 182 39 -218 532 -247 -88 317 -369 45 168 -304 -117 256 -395 -87 152 -566 -16 -76 16 187 -56
2455 -56 -97 275 51 -128 266 -32 -60 247 -64 -357 362 -143 -111 340 -206 262 521 -461 78 186 -364
2476 -364 182 266 -183 175 -12 -265 -33 -87 -104 328 67 -346 127 -318 107 45 -358 -147 -34 -303 -16
2497 -16 262 -191 222 -88 -415 20 47 -316 72 164 -583 258 -83 -236 567 -138 -81 483 -196 106 73 -442
2519 -442 84 356 -468 244 354 -17 -6 -279 -207 178 14 -32 395 154 -139 372 -181 97 473 -471 226
2540 226 69 -333 -171 425 -325 272 -153 -208 -72 216 -242 408 -130 -182 173 -482 45 93 14 -52 208 -266
2562 -266 -109 190 -200 90 81 -383 231 113 -71 -53 4 -290 166 77 -294 229 -70 -264 298 -163 30 437
2584 437 -111 64 300 -37 -45 125 -179 85 -8 -360 -239 79 -101 205 129 37 495 -90 171 119 -249 -104
2606a04M37l83K3L05p23L76K18k84M63l19l57N67o0m98K66J12l57M88m86J45N67
2627C96n13J48J40n00L92N6l59J71K0k18M89l2l37M37L1o22L03M9j85N49l04r1
2649B0J82j69kK85m68o9N86m47K05K08l00L86n34M7k0K72l81M21j22l04M64k03
2671E7r4K24j68l50N22k94n2L60k18o5K95l12J28J46n57O34p3l57J21J22n2K67
2693B84k92oJ1k33J12L80k06M4K18l38j65P04n64K63Q4n39L89k16j68K29J81n07
2715c35O55r5o75P68m37j88N41o12J54P79n84Q9M7n63L97N7j48L3J29k84L13J41
2737A82m12M06J9j44L22l00k38O02o94L98J81m93J56K12l82J59M1l47M91l7q1
2758D1K34k02l42O01n67K77J32m17o8P86n22R0K43l22P3j26j06J58K43o02K83
$$ plain form
2606 -104 333 -50 -27 278 -445 -69 149 -135 328 9 -348 219 159 -339 -73 39 -318 170 -316 -171 396
2627 396 -117 31 171 -329 63 119 -240 -69 -49 -267 222 190 -147 290 321 -301 2 51 -134 415 111 20
2649 20 202 33 31 316 -152 -221 365 -82 123 331 31 417 -117 -70 -90 182 -199 222 100 -204 260 57
2671 57 -37 187 19 -331 191 -103 -155 205 -13 -78 217 -95 33 179 -378 256 183 -174 -53 69 17 284
2693 284 -8 -14 -3 -236 -124 256 50 94 312 -26 -191 513 -51 212 296 -243 146 -70 -238 -9 172 -335
2715 -335 320 225 -450 318 -119 -307 234 -378 -224 555 -29 60 107 -456 -59 -2 -150 -117 12 -272 41 182
2737 182 -230 176 195 51 373 73 -165 437 -257 141 322 -171 -15 197 -185 -26 15 -332 159 122 41
2758 41 275 73 -269 332 -235 42 174 -243 -311 475 -47 43 286 -36 37 -89 -195 -37 206 -396 -113
2779a13K47k82L58j52l14N42k13j08rR4k86N82o14K34K77k51J1M68r09O48k84
2800g4j14L88l4j2j37K0j80K10j33MK30m84K84L0k18K12k44J03L61O4k34K67k84
2823B5l25N20r4L5k34L27l06L80l00l52J85R3q6J35k92J23M17l89r9L81m67L14
2845iJk49Q5J90j02K05J30p27O40l09l1J57r3J93J31k88K8M7j53J20R7k99K62
2868B6q5j44K85Pj08J59k07k78N23j22O7L33m62j88L37r5k21M09m55K01K95l59
2890h2j15K62j80K27Jn31M55R0k21J52J8k45L72m00p6J17J29j47K88l13p0O34
2912C65q40M92j8j06O9K06m1K9k29j66K78j40j45K21K15k52K76k82p0M65k31n9
2934C7K59m06K0k2r0K64O0l56L21J64k64K3k18JL66k40J5J95o0j63M18o96J06
$$ plain form
2779 -113 134 -148 210 58 -256 286 73 -35 -44 50 -236 346 -268 -34 243 -8 3 471 -438 210 -74
2800 -74 -188 200 166 154 17 37 -143 67 -66 -62 168 -316 -32 -2 -220 -8 -252 -149 212 276 42 309 25
2823 25 -300 220 126 161 -73 254 -52 328 28 -324 -139 -46 -132 3 -289 -166 251 -138 -237 144 -323 -9
2845 -9 -8 -257 -172 18 -84 121 251 -476 164 -145 -176 -19 -112 81 212 -76 -48 -1 -154 -34 63 -236 26
2868 26 -59 -203 82 89 -19 140 -67 -345 178 56 123 456 -6 -194 143 48 -173 236 -219 -18 277 -82
2890 -82 -197 65 -115 112 113 -418 37 127 -94 58 76 -169 203 -197 -273 -156 -27 -174 114 -199 -269 365
2912 365 -475 17 -1 -107 -38 168 127 156 -73 -239 39 -101 -246 -25 190 -62 214 -68 -138 327 96 37
2934 37 296 -110 -90 -112 -202 62 122 -234 87 251 -13 10 -208 -207 159 -81 -66 129 69 -94 324 -372 -266
2957b66L68l67N6K42l26L21J79m67M04j85J32j26J43l97M47Ml89J55J95m48O77
2978C52n44k58O06l78L97J89o04J82K52l64L28N2m28M95k87l26O64j58n92M79
2998E7J5l80O19n62J48K40q4j48L11j95LK76m32L30q9k72M86k51m77N09k85J04
3020g7p9J8L7K50m20K59K80k99J69J91n73K88J69k84J95k04m29P29k36M4J63l84
3042a93j74O11l82o6M20j47qJ45n49J08L43j08J2Q8m16N52l08m75O03J24k50k5
3064i5R9l01M87k54k1L16n08J84L35j66R5j32k44qK88m57M98L5l69L91l0l31K28
3087D0l7K1L14j42m49N71o71N6O92n03M0M69l10J50j13q9N5J44l55K02O7k18J81
3110A15k03r8K22j02j43N02k32k42J08J16j86L53l64K91N2l20K07K39n09M71l
$$ plain form
2957 -266 102 -265 -209 33 -293 28 207 -260 144 -41 91 -35 108 -289 158 162 -227 -72 123 -325 352
2978 352 -192 -450 156 -222 175 364 -240 -58 194 -170 158 210 -218 277 -10 -336 328 170 -422 57
2998 57 72 -308 311 -251 -103 137 53 -95 216 21 24 300 -132 198 109 -163 323 72 -405 104 -181 -77
3020 -77 -156 -138 -101 149 -271 -12 268 -31 138 329 -244 44 213 -71 124 -80 -509 220 -16 28 191 -193
3042 -193 -367 244 -138 -204 216 69 61 206 -343 -235 108 0 12 100 -316 236 -72 -547 56 180 -70 -95
3064 -95 4 -297 190 -64 -85 231 -277 -93 242 76 171 39 -205 -213 75 -382 116 151 -218 173 143 -188 40
3087 40 3 24 338 196 -253 318 -353 -297 395 -108 -68 401 91 241 128 39 94 238 -117 85 152 -66 115
3110 115 -88 -186 36 -66 -209 293 61 -181 -73 43 -143 210 -154 137 189 -131 76 315 -194 277 274
3131B74m38M60l88j18K08j98L0L72l77L93J21m73O4J10k15K91o7p4j16K2J25Q4
3153I0j41j54L92j15k04M86l18j01M94k88j26J46l38J23K32m28L09K13m55Q5J99
3174A01p5K36J32m46J19m2Q2Q8k50j26K35j48j91K94l6j02K35m32L07Q5j09L0
3196a3O5k31J69J29l45M41k84k10N54l16n4J74k97Q3N22m96L55N8n01K58J25o29
3218d43P09k7l07J21K28m26L94n6l99J34o4J36K10m99J07K27l82L72J90l75J96
3239D6L3j19L38Q1q09O25J8p23O50k08q2K00m06K24M2K90l31K34n6l55N54m86
3261b40J98O8k04J1J52j43J22K53k50j1L65o38O63l08l15K11J4q9L52l26K59O3
3283B07k83j25K55r6k4N7j95L96n1k50J49j52j38K70N7j36J36k39jK49m21L04
$$ plain form
3131 274 -164 296 -92 -210 -2 -200 -170 202 -175 218 339 -134 -70 40 -175 116 49 -25 -141 -119 6 90
3153 90 -51 -205 187 72 -132 354 36 -65 429 141 15 161 -177 -54 178 -250 59 272 -183 -98 101
3174 101 26 262 394 -52 67 25 107 195 -55 -181 54 -94 -285 9 -27 -129 106 -326 -19 66 -43 -13
3196 -13 52 -179 -10 119 -226 215 -69 -279 275 -41 -95 79 -218 -135 387 -109 246 304 -197 61 186 -443
3218 -443 266 239 -68 53 281 -145 249 193 -206 -72 -136 0 210 -289 -182 45 -337 35 225 -150 46
3239 46 79 -40 298 379 -430 195 213 -510 140 -68 -150 50 -356 -132 -90 200 -131 103 47 -308 246 -240
3261 -240 -42 26 -178 -167 -15 -158 -36 217 -33 -44 321 -317 346 38 -277 -66 -52 -141 211 -115 144 207
3283 207 -76 -201 54 -42 -66 -9 -204 192 141 -109 40 -112 -250 20 77 -59 77 -162 -163 86 -335 -31
3305c1J99j02j8L31n99N68j41k70K23K1k31L01k24m48N49K8k79L47k07q4J13k8
3327A8k14M52l3k11l2k04P3L88m77Jj5K59m03L62k19O71l91j09K44j65J00N4k68
3350a19J87J86k05k94L81r9k23N20n64L91j1m38K67J11m9Q3Pl81N66k40k61M39
3372B54q3m50M40j67J85J7k55J24j25k29L52J98k38J07K9k24K50l58J24J58k90
3393a81m4M78n99J57N12m25j02L65o1j08pj51K08m8j7P3J44m21M4M17m34J09J52
3416F1j89M28n44r2N79n19N5J69J88r9k0j33K00k21n0L80j34k77J9M02n3Q8m6
3439A92r1K10j33l77L87m56J53J0J5Q6l3j30K29r1k09L29p4K1j11Q7L9P8j98k38
3463c05P07o23K39L46j17l83L07m24L60P0l81L80m2l80K04J0k90O07m81r5K22
$$ plain form
3305 -31 168 66 48 379 -220 348 207 -63 160 181 -50 251 27 -421 128 156 -123 224 17 -67 46 18
3327 18 -196 256 223 12 -20 -224 -151 237 -240 -239 -254 5 -398 -36 -255 416 25 -84 160 -5 95 149 -119
3350 -119 68 254 49 -245 136 37 -186 334 -230 161 150 -288 -21 90 41 124 131 -250 316 76 -185 254
3372 254 171 -279 161 -6 179 196 -59 65 -60 -289 63 261 23 130 159 -65 185 -173 -49 109 -181
3393 -181 -225 253 -346 -189 323 -102 -204 161 100 -8 -15 -166 42 -6 -23 50 194 -227 -183 234 -200 -91 61
3416 61 -128 300 -244 -336 243 -276 -221 -52 136 37 17 -116 84 -137 -187 193 59 -218 -199 203 150 238 192
3439 192 101 311 178 -199 188 -268 -115 -105 -90 -4 -37 -167 62 -29 -238 91 17 38 -73 14 53 131 -67 -305
3463 -305 402 -221 18 364 247 -136 171 -253 107 177 -204 176 134 -246 -42 -32 -322 285 -196 -291 -69
3484f9K42m96L80o3r4K12l09L21J92m71j1N00l74q3L15l73L29J73l66o9L29l93
3506a78L19r5j19K77l13R2Q4k44R8K09l84N10M7n82L35K05l82K19J31m10K62k9
3528E2l48L40q9j11L61j82k96K90j49L52m7n8q0J61m05R4L56k84l8J00k98N75
3550B96m24o9M23m31j40J26K36m11N17k77P9N05q38M77P3l88L52J75m07J95p0
3571ar3J81j00J12J57n1m17M98m32k00K60O7j05J67j57j48K32m4J27J94m73J45
3593h1K65n57M81j47j70M15pk75m4m8J01J14k00O1K1k67K49K03k29k02N36l75
3615a56N33m7o85P16k79J9L1j69j94L44l26K20K00k47j37L10l55J65J52k24J83
3636E4P2k55K76K3o14O35l03j98K27J81k45M50l40m0K21j90K65K75n24l96O14
$$ plain form
3484 -69 173 -323 57 -6 -100 112 -197 124 316 -155 -166 334 -40 -123 192 -181 148 321 -45 -114 215 -178
3506 -178 141 46 -73 204 -109 -17 67 -177 -79 130 -254 256 303 -279 56 261 -121 98 229 -181 81 52
3528 52 -296 44 -45 -156 205 23 -273 17 -132 220 173 115 35 196 -209 -115 241 -43 -81 19 -279 296
3550 296 -128 -197 226 -205 -345 -219 17 -394 123 -154 -75 430 -408 69 142 -246 106 281 -126 69 -1
3571 -1 -94 87 -13 99 256 205 -212 286 -146 -346 -86 -19 -124 43 -114 -262 -30 -74 53 247 -226 -81
3593 -81 184 -373 108 -39 -209 206 199 -76 -120 -168 -67 47 -153 -92 -71 -338 -89 114 -115 -317 219 -156
3615 -156 377 330 -355 361 82 101 132 -37 -231 113 -213 7 207 -40 -177 133 -222 -57 95 -129 54
3636 54 126 -129 147 170 -444 191 -112 -310 -83 98 -147 303 -37 -77 144 -46 219 494 -30 -426 188
3657A88l74o2M11j97K61j62l82J48p3o4M54l12Q9J30j68J43k0l4j59L71k76j17
3679b05N52m82j72M32l25K58K07K4q0J32n27K75k9j94K27j63l2K65r6J11J57n14
3701a79jM21l95L12K04p17N64j1l30M15j61j52M09m10j42K97k37O6j16l3m0M67
3723B31j92j32j6N8j15L23l03K83k09K6m3K19k70O2J38R0J45k36J82p5m2j84K35
3746A75j96K04j36o5n6J41j47L04J24k92k84K05k19M11l91%J93j61J21K30k62
3767a01l0M18l42M0J01l01M6M64m35J50J29l42K82Q4l65M45j60m0L44l83k70J42
3789a24N9jJ57k5p5L06m08P0j24jJ4L37j50N3j19j0J86q1k33K52j21l20N53k94
3813i9j39K10j32j15M32l61O0K13j55r5M08m23J15K60l49J94J70l04J70j06P0
$$ plain form
3657 188 -186 -248 163 -34 227 65 -317 -169 -242 -306 148 -164 -75 55 -113 30 10 -24 -183 188 -88 -205
3679 -205 347 -135 -307 125 -200 58 265 289 209 341 -186 89 60 -134 93 -70 -102 163 67 178 335 -179
3701 -179 -180 241 -154 158 362 -355 209 198 -132 283 122 -30 379 -31 -173 124 -113 -47 -163 -196 -236 231
3723 231 39 -93 -109 -51 -166 157 -146 137 -72 -46 -89 130 -140 -78 60 150 295 59 241 166 124 -60 175
3746 175 -21 183 47 -18 -74 67 -80 224 348 56 -228 -23 -242 169 -222 -222 -29 -190 -69 161 -101
3767 -101 -131 287 -55 -15 86 -215 -169 295 -140 10 139 -203 79 163 -202 243 83 43 387 4 -266 -124
3789 -124 -65 -66 91 66 -9 297 -111 -41 -165 -166 -152 185 35 88 -31 -41 145 64 -169 83 -38 -358 195 -99
3813 -99 -238 -28 -160 -275 157 -204 -144 69 -86 -181 227 -196 -81 179 -170 24 194 -110 60 -46 24
3834B4J41k52P9J98k38j90L50j89L28k52k85K12M21m54j23K25N6mL94o88J46L79
3856B78n97O06k65o2J12j67J12K6m49K92J74k0l10L97k85K08J57m06J77M5l54
3877c31O62k92k58N38k73k87K29K2m0Q1m2R6j8k19K04K35o56N33L3m38J13J12
3899Dk88L72l4K7j60M7N6K00o06M00O9p2j79L84j90j08K21l20J74Q9k42J49K60
3922B53k37K21j96o6K12L0k06K47M6k97J05k15qJ48j68J00L55o77M40p4l81L68
3944@J9o3K83J52o64M25k50p4N9J85o6L55n09j46M66j36j31K71k15K4J07k65M32
3967B59k08j36L01l13nL29k99j39K93J93m20Q0N7j04M93n25l6J90p1R6J16k59
3989a08J29K48m04j5J52j45J88j08J21Q4j61n0Q5k98K19L39j61j82K43k62j85
$$ plain form
3834 24 165 -87 -8 190 -48 -238 112 -77 251 -1 -286 -74 347 -107 -230 -5 51 47 441 -247 -101 278
3856 278 -319 287 22 -40 72 -95 17 43 -406 -114 60 40 -270 127 -158 50 207 -199 -22 23 -331
3877 -331 331 39 -219 319 46 -241 -12 10 -30 51 9 105 87 -132 72 307 -349 184 217 -221 -108 4
3899 4 -284 88 54 81 -79 -32 24 224 -382 18 87 15 -164 220 30 -78 143 -177 -3 86 -156 -7 253
3922 253 16 237 41 -25 187 217 11 258 304 7 112 -103 -111 37 -131 -31 324 -353 87 13 -368 0
3944 0 19 -44 239 391 -273 152 -98 -172 -113 72 6 361 -148 -294 172 36 -95 176 -39 -15 92 -173 259
3967 259 51 -85 216 -97 -102 227 -72 -211 82 275 -145 -65 -8 -112 381 -144 -180 10 -61 35 151 -108
3989 -108 21 269 -135 -150 2 -143 45 -63 58 142 -19 -69 16 -282 -63 276 115 -67 176 -86 -271
4010b71N21k39J62j55l16M41K7m14K66K20j91J25l3q1K45l88J47p5J25k80OJ07
4032e1J64k11j16lL79m15J32K73k36J76M1k22L0n2m6K73k05K37j17k84K10K64
4054B21m90K15L4j5J31Q3j30K83l15l53K01K57k48J32J8m36L32j5J55N08n54l9
4076b5K23m84J10M17j72L06k12l59J27L61n04J17J46j24J26J5Q3k12j69J94K56
4097B20j74J66l19O3M8R7j04j44N54o23K29N1l45L27K25m11L89m95r6O68k89J02
4119A39k07J12j44K28k35K19J96n07K60K49m76K47J32j49J67r1l03O3J51q4J70
4140A37l72J33K24k76PK21l45K17Ml00L90Oj37L79m00n8K52K29n79N71l65j01
4162a63M40m30l6K76J8o3J7l08K06N74n78J85q6k17K20K2k89R0M07j88j44j61
$$ plain form
4010 -271 250 11 173 18 -298 143 170 -244 22 242 51 176 143 62 307 -81 66 -9 116 -164 -158 -51
4032 -51 113 -98 -214 -217 162 -253 -121 152 -84 92 133 -89 -59 -111 -157 116 -89 148 31 -253 -43 221
4054 221 -269 -54 -20 -35 96 179 49 332 17 -336 -135 122 -126 6 24 -412 -80 -95 60 568 14 -25
4076 -25 198 -286 -176 241 69 375 163 -196 -69 292 -212 -95 51 -73 53 68 151 -61 -230 -36 220
4097 220 46 212 -107 -44 4 101 -3 -147 407 -216 13 64 -281 46 271 -140 249 -246 -342 326 37 139
4119 139 -68 44 -100 128 -107 112 308 -199 61 310 -166 81 213 64 231 140 -163 -100 51 -33 137
4140 137 -235 -102 122 -154 -147 74 -271 -54 -50 -350 40 46 -91 288 -112 -170 82 311 -268 303 -62 -163
4162 -163 277 -153 -189 87 105 42 59 -249 -43 531 -47 138 52 -165 55 77 -212 -122 285 97 -47 -208
4184b08p9M59p5m91N67k34r1L54l20j12L87l01L93j79k41K14k91J9M46j63k37
4205a83M29k30k60L71p6k32N77n76O8J31k82K35J37lo3J63k10N5J43n15K65L13
4227B57n07J91J80M0l39L88l41L66m45L47Jo8j40J79j17J84K67m58K08l69qmK44
4250E6o2j00L3j43L26m5l9O7k38J69L5J85l96Q1l8K72j53k09K64n4j49J20k7K3
4274b2J74l08k40J57L21l9L18l30J7J63l27J81k04L11o4P2l14K74m4n5P7o9j51
4297a02M50l16k79N68k01k43L27r0j71K32l3j4K20m39J11L6k10K2O7ml1K80k89
4320a09L09l06K10j97K90k02M9j51O1J81l23j21L31K4m1M03o08J47m1o6J60K48
4342B48l45K07q3Q2l98M28k47L45l06j43N99k34j94K03k58J16J47k95L39k9m18
$$ plain form
4184 -208 -287 172 97 -394 173 -61 -152 202 -118 -230 157 -144 249 70 -171 43 -248 -229 217 54 -183
4205 -183 246 16 -244 127 51 -181 396 -180 -112 19 -263 -28 109 106 43 206 -4 51 194 -321 -56 257
4227 257 -250 -59 121 161 -178 210 -131 235 -210 137 138 70 -70 109 -8 176 443 -15 193 -176 -184 -188 56
4250 56 -6 -106 -73 -216 110 65 26 93 -145 24 59 244 -152 -71 -109 163 10 -199 65 11 -138 -18 -45 -22
4274 -22 152 -156 -396 -239 82 43 361 31 48 211 -116 65 -139 172 108 180 -134 140 96 41 118 49 -102
4297 -102 348 32 -247 321 120 -123 204 114 -57 175 142 128 348 -91 20 56 -154 -132 -65 -69 -100 180 -109
4320 -109 200 -106 104 -93 197 -5 44 -107 -46 135 -188 -309 22 46 5 408 -200 -53 -94 -160 0 248
4342 248 -97 110 27 109 -289 139 -108 237 -69 -212 387 153 -41 162 -96 20 167 -128 211 182 -236
4363b36J17K57j61J49q2l25M23p2j55N9J57l74J51J26q1p2J60P3L8l65J55J77
4385A19l83L91j32k91K55n4j13M74l36l0K33l40O5K14o5j41K1M1k37J79Q9M5j9
4408a5k34N29n13M7M98j50n23N11J77k67N0q5j04J6M8j03J87j06J27P8k94K10
4430H4M0l38L13N64q32K62l1q8l0O9o04R22l62j89L84m29L34L2k27q0M17k91P9
4453aK2J04o8N9j87J16K04m9q8l54j55M03pm0J86k26k5L42m32K81j00j29J29P8
4477F3l44J32j4r9L17l1p6J64j95k00J47L24k44R2j03k12O60m31j3K03j69R6L14
4500C81m69J75l23J39J85J47l11K12j41K8K71m80M8N8j21K25J83j84j49L02k74
4521i8j98M90k57n4J06K17j62o1j11L17j85o3J91J10J54k18l14O6L81m79P3L88
$$ plain form
4363 -236 -119 138 -23 126 44 -281 142 70 -85 -26 131 -243 -92 34 -47 -119 41 114 152 -213 -58 119
4385 119 -264 127 -5 -296 -41 -95 -208 266 -70 -100 133 -207 -142 72 7 -134 -113 -72 -309 -130 -41 4 -15
4408 -15 -249 280 -233 -186 312 162 -361 150 327 60 110 25 -79 -63 -15 -118 69 -37 90 168 -126 84
4430 84 124 -214 99 663 -169 93 62 -26 -56 13 -591 331 -31 -220 164 -265 69 101 -126 -206 211 -80 -1
4453 -1 21 125 57 116 -71 45 249 200 112 -242 -397 6 -1 -41 145 -81 -106 236 -196 85 -15 -144 -15 63
4477 63 -281 -149 -163 -262 55 24 -52 112 -83 -283 -136 188 -56 36 -67 -279 381 -50 -63 140 -29 67 381
4500 381 -88 87 -236 -97 88 235 -76 136 -5 23 294 -186 -138 -80 -201 24 207 23 -126 176 -98
4521 -98 -296 194 -63 -117 -11 206 44 -17 -128 189 4 -59 132 242 396 178 -136 -70 311 -168 -95 293
4543B93k58M7P4k15K40lm59M50l77K12J71j51P8n4j32O6m8J57l61L07j94J68J09
4566A20l35N4L24j44l75K85p5K35J05m30M73k58K8J28j01m0J48l54Q1K33O6n7
4588A11R1k78j60K84k20M33j41k51o9J43J68r4j07k52P14n00q1L17j37j37O0K28
4610A22k89K93k06k9K68j97O9J44m42K76J94l62K67k37m0L25lk91K21k40p4N18
4632B87o13J22K07j18R1J92%o0o3O5J02K13n59j1N9J10K48k87q7K74m02K94J41
4655B05k59J71j64N6j07nJ47Q2k09o5P7J81k09K14j20j42K43K24l13P8l37K87
4677C5k32M2k8N27k81k74L48o3k51L06j12j95p7K23k7P8K69l34k6l13N29j05j7
4700B2o3L8k90L28r6L9M4k6J83k7l66J4K10k24J35J94n7j30K6j02K30j71Q7qJ0
$$ plain form
4543 293 35 82 156 -59 181 178 -281 169 -208 4 175 24 102 48 -84 -18 -66 91 -270 37 -157 11 120
4566 120 -215 -161 163 19 -356 -71 -146 89 194 -236 237 -21 7 135 34 -6 142 -212 -131 102 168 111
4588 111 202 -76 -236 48 -172 261 120 -131 -200 -57 111 17 -90 -342 372 -128 -209 108 -29 -166 -106 122
4610 122 -167 126 -80 -109 159 -38 31 175 -267 9 203 -159 108 -129 -169 156 153 -138 83 -157 -231 287
4632 287 -326 -204 3 -115 -24 168 168 108 45 110 212 425 -134 -145 -86 24 272 -15 -102 172 -230 64 205
4655 205 -54 117 -47 9 -98 -103 44 126 -83 -148 -71 110 -99 115 -5 -147 96 320 7 85 -252 35
4677 35 -197 -155 -183 344 63 -211 137 74 -177 129 17 -178 -255 -32 -59 19 288 -46 -72 -385 144 39 22
4700 22 -41 -3 -293 35 -61 -22 22 -4 179 152 -214 -200 10 -214 -79 115 58 -72 -46 -148 82 -89 -2 -10 0
4725@j70K09J00j49J35j43K36K3m56M70m16j9J95J01l51Q5Q0o3K03l18L69k2n3
4748D6R5j68l4m5L01k18K36p8l98L39p4l38M61Om55L36k0J62k29P7j68N01j55
4771A80j23j01q6M9J71m12K90k8%J3L76r3J13k25m4J72l80r9K29lm2o0J26N6K38
4796C17Mm09K73n37K48K38m41M48q8j5JM1j65J09r3lK65L4O0n72J85q1L64k16
4820c3k14L60k20O4k1j04L02J26k25k45L30NJ01l20j98L13l0l82K47K77j8j09
4842FK4J59m1j42r3M28m44J80k4j26K30k4k79J35j49p2K89J34k14N37m05k11L26
4865B24n24J00L01m30K52L18k75K33N9l41J38K64m31J4J06k71M36l91J19M03l78
4886g4p7K97m25O1L34l5n7M2j84K75j65N9J34k27j12K00j15K16k17N2N5K4l9o
$$ plain form
4725 0 -170 39 139 -10 125 -18 218 241 -215 255 -161 -180 15 116 -235 -150 -70 -133 70 -248 121 99 46
4748 46 141 -27 -61 -106 195 -23 213 135 -263 76 2 -336 125 131 -324 12 -8 154 -75 2 -166 335 180
4771 180 57 -44 -130 -81 90 -322 -32 -60 -60 -47 329 236 349 124 80 252 -128 -227 2 -1 -43 -103 23 79 317
4796 317 321 -88 185 -352 -104 134 -307 141 53 38 39 80 -85 24 -69 -72 193 227 287 -285 -100 -181 183 -33
4820 -33 -247 113 -107 -43 -64 -168 134 260 35 -210 120 125 226 -94 -292 21 -9 -391 -144 133 115 6
4842 6 30 189 148 6 -87 341 -103 77 53 -73 157 133 -146 -11 -160 -232 57 191 -23 514 109 -102 224
4865 224 -300 -200 101 -329 -77 241 -34 199 258 -83 55 319 -112 -98 8 -263 173 -218 -99 304 -74
4886 -74 -151 146 -279 -218 116 81 24 66 -118 157 -8 51 185 -42 -154 46 -69 147 -70 -18 37 61 22 16
4910A6K91o12L05J82j36K82l41k77M47j92m0NJ22k87M28k18j56K63J35l32K35
4931A20m0k65L19j65J28o0N6j59kL19l15Q0k20j8M92k43j88j39Q8K68j14j01K29
4954G0l06K10J37j01J48k79%l2J38k20L34J3k83L98L24p42K51j62N1l9M8j0J68
4977A16j37j00M10m71K41j12j79J72L45l78%K16k17j71K30j57K43j17K2P8j70
4998a36k35M52n4o2m9L5j28K21k72J32K26k77J17K23k91p6K82k80K65J64m30M70
5020B97j58l02M33j97j95L6M8P4K2l53K68P9j66J50J26k56J79kk64L18k29M6K65
5043B19k33J54J9o04L79lo8J43r3P2L5r1j06K85K54n00K11N9k63L7K96l81M99
5066C20l98Q7J08j9j76R5l75K80J31K5m4L15o75J00L46l07M34k46k72L13k71J24
$$ plain form
4910 16 307 -305 0 182 46 328 -13 -290 157 -35 -75 -70 52 -235 193 -25 -181 82 217 -115 120
4931 120 80 -185 134 -31 97 37 93 -66 -68 251 -64 16 -204 -222 270 27 -161 -300 -212 56 -58 -159 70
4954 70 -236 -26 111 10 158 -121 -121 -153 -15 -235 99 112 -171 227 551 -191 60 -102 -51 -90 -42 -52 116
4977 116 -21 -121 289 -182 59 -53 -232 -60 285 -93 -93 123 -94 -265 -35 -192 51 -66 -44 34 -136
4998 -136 -371 81 27 -35 -84 -49 -177 44 -228 -96 130 -147 -30 193 -98 -174 108 -172 93 257 -173 297
5020 297 139 -163 270 73 -122 -86 -38 36 58 -295 -27 52 -114 36 162 -94 85 83 -181 137 -92 -46 219
5043 219 -14 140 159 -445 -66 -69 -137 6 -87 -15 20 -71 -177 108 362 -138 73 132 -131 -94 202 -179 320
5066 320 -78 9 117 98 -78 17 -358 -78 53 78 34 349 -326 -226 120 -187 247 1 -271 42 -229 -105
5088a05K18j34R6l3P0l2K72l33k4Q0j50J3J7o7P5oJ89j53P0l2Q2K58m08K1K35
5113B19k89N7O9l7p4rK77L2l38O4M3j2J35M7k91J62J21m37M4L35j56J7k84L59
5137E4j4l3n7J81j21j18J44j79k8K76k95J54K22k76M2J65l04K79n2p4J64J11m8
5160A93L3k58j51O9J7P9K3LQ4j48j16K93O3k23ON1J04k71K00l76L91l16L35J32
5184B17q7l91M02l14k1K52k39K2J36j76J45M2J80m52L23j08K05m8k66K25p3J4
5206a2J50j97j06M0o9J2M42k71j87K72l1j92J88P6k94J58M2m2O8k95J49l0j82
5229c11j8K86P1k4j51k14K74J57k42K15o4j20N30n33K27K13q8l22K76m1r8n8N
5252c0P8n6J70k81J85k5K96j62j93R7p3L4n4P3l39K45k3j03N47l85j1l64L8N32
$$ plain form
5088 -105 113 -21 75 42 112 80 352 19 -5 75 -75 -62 -45 -112 -37 -43 146 -7 63 31 113 371 -37 -16 219
5113 219 -70 -13 56 19 -55 -64 213 245 -93 -29 14 2 137 184 -107 55 176 -261 -217 118 -38 -21 -305 54
5137 54 40 7 -50 131 10 -108 36 -143 -171 105 -190 -36 186 -90 -48 117 -187 92 40 -34 130 241 193
5160 193 226 -32 -183 -114 -97 -18 5 8 92 -56 -172 121 184 -39 -33 18 122 -149 51 -325 66 -250 85 217
5184 217 130 -261 141 -173 -194 58 -181 -159 -23 -199 -54 -12 168 -284 39 -69 136 88 -178 47 -26 -12
5206 -12 138 -59 -165 -125 -194 -182 260 -11 -198 74 43 -149 39 115 -179 -21 21 -21 47 -248 -99 -129 -311
5229 -311 -329 -43 28 4 -147 -361 -87 70 -172 43 -21 -141 389 -144 83 296 208 -114 162 121 23 -35 -30
5252 -30 48 -8 162 -119 66 41 337 175 -18 79 6 40 -14 59 -280 -35 -58 -161 386 1 -10 -374 -336 196
5276A96k37m3K04l9j42k8j8%K52l96L27q6J67r1k9k09M00k11k05L35O4j88M7l23
5300b53R5K85k91J74j41K96k69N13k99Qj69K55k31PL05k60oK76j86p7J08j07m5
5323a2J21J20m26M7M40m12J7K69l00o6M71k10q3K07o4j82M09o12L73qp3J69Q4
5346B79m11L73l3l57L16k09K41j50P1j71K68j02l09L12o5J33j13N4l34K28K18
5367B39O9k88J04J74m53K87R7j98J27q1j51R8P7o85M24J03R5o7J66k62P0K30k46
5390g1L13l16J9J39k01kK23k97J50O9m33L53Q3p9j31L89n9m67L81k94J84K34m42
5413b55J45M36k81M2k6k24K01p0L6M1Pn7K0k10L34j15j00J8J23j83L5K31k72L23
5437A99j02k20m9M37n43K24K90k53L55l77L3K25n17L92k6N8O5kj76J8k9k85L47
$$ plain form
5276 196 -41 -84 120 81 -61 -89 -107 -107 145 -251 76 -10 157 66 37 -172 228 17 -188 147 211 23 70 -253
5300 -253 -158 127 -164 10 -131 165 -104 409 110 118 -51 204 -27 -20 285 25 19 295 109 32 140 33 -12
5323 -12 109 229 -197 -150 290 -122 -105 164 -136 -202 269 59 -24 183 119 -63 346 -266 107 99 26 195 279
5346 279 -132 241 208 -149 167 -42 199 49 120 -51 217 115 -194 118 53 186 73 127 -207 21 239
5367 239 308 20 124 298 -155 132 229 31 158 77 -74 24 101 -584 -160 -57 38 -29 137 -125 -55 175 -71
5390 -71 242 -74 -55 84 -117 -119 104 -193 -43 26 -407 -54 29 -50 -181 208 149 -318 63 -231 -47 187 -255
5413 -255 -110 326 45 87 61 -163 38 -32 4 45 52 -5 15 -195 139 24 -76 -58 65 -118 -83 148 -124 199
5437 199 97 -123 -172 265 -278 -54 236 -17 338 -39 -6 219 -298 94 68 126 191 189 13 31 2 -283 64
5460F4m3j79K56J0j92J91l3k72K64j11Q2K6j34L8P8M8o3J79n33L95qj76J19O5
5484G1j18L25q2q1j92K46j25N6j26J43j45r3J66K26l98K10m3k18L8J20J88k65
5506i7K94m77L33R6%J71k18l20J73q0m6N01l76j15J15m5l08L21K01p8k77L13k3
5529E8P9l73L22j47n9L25j12k63M29k28m11M33k87K83K8j59j87L17j70j0L97l62
5551i7K26J7l88K21K39j38J11l88M13J4j91k22M36l70K5j2j0K22j24N1l5N1k80
5574b29L31M6k53L6J11J08l45L02j3l1k25J15J78RK6k54j42L94r3r1K87k66N8
5597E9k55J17L35k70k05q9N10j80k55N53l40K0J36j74j04K63k19k38K18MN7K06
5619A49k60J93J43l43K73k96K02K14k15k33N0J9k05N82m17j20L60j56O1q3R6l7
$$ plain form
5460 64 21 -158 98 108 -84 107 74 -198 66 -45 37 63 -71 -33 45 93 30 209 -324 71 63 -113 6 71
5484 71 -47 278 196 115 -77 169 44 100 -26 117 -28 -121 45 271 -127 83 40 -178 -140 -20 168 -97
5506 -97 197 -280 53 149 149 320 102 -218 -45 -125 -171 330 -46 -161 -46 -91 -399 -78 123 45 -232 81 58
5529 58 137 -236 86 -61 -120 205 93 -170 259 31 -380 53 -234 49 77 -82 -269 48 -122 -132 265 -97
5551 -97 129 146 -242 -21 218 80 191 -197 216 230 39 -183 253 -117 -92 -104 -114 108 -16 35 0 51 -229
5574 -229 102 148 -105 -69 42 150 -195 107 94 63 -162 -47 131 140 166 -88 -230 164 71 -20 267 1 59
5597 59 -196 -79 256 -14 -219 -308 202 22 -233 320 -20 0 136 -38 -142 121 -98 -336 -118 -114 -57 149
5619 149 -111 82 225 -118 155 -141 61 275 60 -173 -123 -104 -309 273 -144 -264 96 -60 1 -82 14 -23
5641b3o6K98k01J55j18p4K40l26J41J69q2q9k31K20m5P0K94m02Q3J83j93j9l3
5664d9R2l14J88J73j63K48j26k52L04p3L0L5j61J55K26m38J9K03q7nO3q1k02L26
5688A11K1L9l22J19J06o2K8Q0l19K15l9j6k43L75jj13J85k71J06O8Ok73L72k78
5712a06Q1K36m65J64M19o64K47K1j91L32P6k08K33j23o4J47j67o2R4J54k75Q6
5734c5J9L88o18K38J17j85N5Q1J23j94L91n55K20M1j54O2Mj32J37P7k37O9J01
5757A3j51K31l8l52N31k27j84L53l99LJ75P9j48P4J1j28R7j03R1N92p30K75j54
5780h9J52l7k5K13j30k33J37J27j37J2J90m21K41K18m20K11n9j24M51k29j09L0
5802c1j14J81J75r6k43K92M1k98n3k6K26Q6M1K9p3j57O3J25p5l36K82l12M18j80
$$ plain form
5641 -23 -89 209 8 163 45 -29 211 -115 26 195 113 24 -207 13 -32 38 332 -70 13 196 3 -16 -49
5664 -49 43 -271 -83 90 -73 175 49 -203 101 28 58 93 -68 87 313 -125 -106 97 10 5 68 -13 -215 111
5688 111 132 171 -151 -32 74 12 40 120 -199 16 -23 -39 -282 93 92 -21 164 -107 -1 67 73 -200 172 -106
5712 -106 -25 211 -254 -90 329 -335 -88 -67 -258 74 150 -58 175 52 -12 135 -32 -94 0 154 -121 -35
5734 -35 -16 372 -246 -8 109 -76 -21 60 183 -11 380 -175 45 86 -68 -6 -2 -134 3 80 -157 -88 13
5757 13 -138 93 55 -297 234 7 -177 176 -223 -220 -45 34 -114 -40 -29 -157 -60 -163 -72 520 -210 65 -89
5780 -89 63 26 1 214 84 -149 -12 115 -22 -10 180 -241 0 218 -202 9 -50 -174 277 48 -61 -31
5802 -31 -145 36 211 115 -128 164 205 -93 -146 -172 54 140 181 210 137 -20 43 168 93 -243 39 -273 145 -35
5826c5J9M7L19k35J6r6o8K59k71l1J7N0L1pl96K23R5k8n6K51k50J86J6p2J56j95
5852e5n1J10N8k84J06J66k4K4M1o0%j14n5K77l84p5O54m10j91K73P7k09Q8N4Q8
5877A04k76K55j99K17N3P4m05N7L49r1r2K78m50K82M0l28n4K07l8K01j91j09k61
5900c77L06r0L04l20L0P4P0j31P5j7J72q6k17oJ91m0J04J12m40K02L29l82K72
5923A35J48m84L45o4j70K2J43n29K90K78k03J01p5L37k92lk1J74k71J79J12l96
5945b44M19l9J70j86k19J79R7On5l2j69J01K75k80o6O6R8k97K70j06jJ17q7j39
5969a22J91q4p1J97m08M31k70J53Q9q6k46M19j99j38K26kJ67k33k91M54l62K26
5991D1Qo8l65O88l93J93k1j29R3L81o85J06L86m13j10L96r7M0ok98L38j24m7K70
$$ plain form
5826 -35 -16 31 350 115 131 35 -33 226 -45 -76 -59 -9 22 15 -381 -158 -63 -91 -147 104 -146 40 56 -16 140 -55
5852 -55 -106 4 62 -222 -116 50 26 50 91 31 31 -83 -138 139 -245 -320 334 -76 -267 6 83 -126 -38 16 104
5877 104 -172 83 -116 101 154 228 -177 -120 229 138 46 324 -126 156 196 -132 -186 21 -17 184 -7 -116 -377
5900 -377 -71 -161 143 -177 -147 -73 -3 -134 -59 -76 96 10 -207 -213 -22 -62 42 154 -286 -84 245 -137 135
5923 135 283 -201 144 80 -90 -68 75 -454 -164 114 -89 12 -63 274 -18 -21 -42 132 -139 40 152 -244
5945 -244 175 136 306 120 -99 80 177 183 128 96 -73 28 303 23 -43 23 121 -176 94 -12 -13 104 17 -122
5969 -122 69 -15 -86 111 -297 134 -136 17 106 20 -226 193 -6 -144 82 80 247 14 -277 177 -185 41
5991 41 49 -19 -384 304 -89 104 83 -46 47 428 -257 -151 235 -178 -288 108 11 51 45 -253 85 -39 -86 184
6015A84p9j36K6K68k97K54j99N8n0k32J79R1M6j74j5kj0kj34K33p3j3M2J68j31
6040BK14N0l95L4N4O5K8O8j4j4j33P4J54k16J89j36k37J43L8L09M2j00l41J66
6064D4k10K6K04j48N4j01R7k6q9n1K41L8o2K6L9J30k31n7j8J04N6lN1p1O5M2j96
6091d6j85K05P7j34L11k44O6k80q3M40n0j66k01J55R1R0J03l0j19K85n55M00j32
6114bN4Pm1m3K44m76K43j69K7P0J96j39R4k33K78R8m65J08K74o3q9J23J22k54
6138c6P2J81j35L67l48J31j72k14J84j36J96k2n0k73K05J24k53K82m6M4j98J56
6160E9q6J5p3K27j8r0j52P5m6K9J92k34M19l43p8lL69j95r7qL4N8k52K25K90l43
6186b6MJ17j58J3N5k32K78m6O9J21j32j97K08j06r0QJ4P2J69l05OK16m9o7M14
$$ plain form
6015 184 105 -31 -5 263 -34 220 21 79 29 -203 -24 67 113 -61 -76 -78 -88 -90 -224 9 -64 -77 -35 133 2
6040 2 216 266 -129 -95 -41 24 52 120 106 92 -41 33 187 -29 160 24 -213 -70 -32 277 319 219 -122 44
6064 44 -166 -140 64 -84 -30 -131 -34 -60 -149 -200 41 79 17 43 82 212 -19 -76 -94 10 66 63 114 43 108 150 -46
6091 -46 -231 -26 51 -83 228 -16 50 -230 -313 127 77 -89 -290 -135 -44 46 149 119 0 285 -270 130 -2
6114 -2 52 59 18 -25 219 -257 -14 -183 -156 -86 110 -29 65 -168 110 208 -257 -149 125 62 -27 96 218 -36
6138 -36 36 217 82 449 101 232 60 -154 30 -106 90 68 18 -255 -50 74 -179 103 57 101 -97 59
6160 59 -27 -12 -85 142 124 34 -118 -43 -89 -60 132 -102 317 -26 -104 -107 262 67 -30 -38 -4 54 -198 27 317 -26
6186 -26 -22 95 -63 -50 5 -227 51 5 74 195 63 -134 74 -32 -122 -114 -100 -28 141 -164 -158 58 9 -58 356
6211C56l12n7n1LL7M26o09J77P6Q8r5k07J32Q4M1K8k5J7j45K09j73N3O9l40L36
6236A18Oql05L29q1K9j3q8l50L84L7Rl10K62J24o4j70J43J1j97kK85m6r0n0J02
6262F5m9k41J13M49k04j78O3j34K33m17J18L42k03q1p9J74q6K89m29K10j16J11
6284e0J96l2o2l48J92Q1j08J86l46N63J01o07M7J90nJ18j18j72L16P1j24r5j12
6307a18M0P5j02RJ23o8L69n06P8K03R1j08O3k35k72K10p2J39K0j24K4K98J16k58
6331el9nJ61k10M6k8P2J91j7j98j76L17R1m62K97J3j17J66n0p6r8n7N89m65Mj56
6357b12K45l4p5j50K68rJ01k78J74j15O8q8K39l29K15j21j86K73j36K11O3j34
6379a0K90Ql46L27l16Q6j67J18j43L00l05N4J18K3J05m22M30q0k34O3R8r5j48
$$ plain form
6211 356 44 -13 -64 -61 -24 402 -207 -30 46 134 39 -168 -36 48 89 117 92 109 -36 173 0 53 122 -218 118
6236 118 124 116 -189 140 59 88 75 -13 -363 21 58 67 -243 19 143 79 -91 52 63 -134 -136 149 103 13 -37 65
6262 65 16 -225 -112 337 133 -45 18 -116 117 -300 -182 160 -43 -124 -203 -29 -115 174 -255 -45 -161 -50
6284 -50 146 114 52 -296 -104 -23 -131 55 -291 272 373 -234 -187 3 -2 116 -2 -174 142 213 89 -6 -118
6307 -118 -78 -3 -105 -96 27 -41 328 -178 -100 103 194 86 149 -86 -358 -148 -220 -81 -61 -185 -161 137 253 -5
6331 -5 -44 -49 112 -98 -52 -80 -8 183 166 -32 -208 109 200 -262 35 48 -69 97 47 -29 -127 -184 405 -60 -56 -212
6357 -212 33 -1 -76 -226 42 33 134 -144 30 -85 -17 -105 134 -195 20 -101 -287 -14 -150 61 124 -10
6379 -10 280 288 -58 269 -47 39 -128 -10 -153 147 -158 -104 14 37 142 -280 150 70 -164 -101 -3 -98 -246
6402b46K48K76j88ml39J69lK14J9P6m11K95O6j42k08M04l70J15M2r0K68m0o9k11
6426a29M83o21O9M07j7j70j11n8J70J43k26J53j83P3kP8k53L15k11L29j17p0K00
6449B52k13k20J26M7k8M49o58L86j17J14m21K06J11M3k40P6J42k5j7J1L9o9j54
6472a60J12%K48j68j18L97k1j73k1k37m8M58j57r2m0M4m0L54k41j47K88j45n1
6495D2j34K4L2Q6k28K42Q3p8J5o9J2P8L5n2l80L26j14j0K13O4k86J20J06J9l27
6520a81J1Q7N4n7O7J0q0K06k09J23N7j66j16N60m06J56m9k04J78K8j1j79j77L3
6544b65K22j79K2M34l05L0q7J60J85k61k45N12k18J22Oq5Mk04K99j06o0J88l32
6567a63O6J00K44m8j03l22K53j03K44m49M34p4k40K06K5j9j55J6J73l56L85j57
$$ plain form
6402 -246 2 278 90 86 -253 -84 -87 127 146 222 -189 106 172 30 -178 226 -144 -29 13 -77 191 151 82 -129
6426 -129 354 -267 -198 209 192 22 -89 -147 23 166 -60 93 -90 -17 -19 59 -194 121 -90 239 122 52 252
6449 252 39 -181 -55 -8 -36 413 -245 141 24 138 -283 -77 34 77 -163 -87 55 30 13 24 63 -6 -160
6472 -160 -48 -48 200 32 -86 311 290 117 96 -141 -189 269 112 20 -20 24 -16 338 97 -50 238 93 42
6495 42 -92 -68 -36 50 -178 64 147 69 84 15 27 105 140 88 -292 34 -80 -90 123 187 -99 21 127 146 -181
6520 -181 -170 -83 -29 -86 -19 -9 -89 117 -92 31 88 -78 -194 366 -40 116 67 -137 41 69 58 -121 -298 -265
6544 -265 -43 -222 -200 234 -71 -41 -128 32 217 -44 -289 223 5 127 133 48 52 -152 147 41 -19 169 -163
6567 -163 -97 3 247 199 96 -226 27 -76 168 -281 153 79 -161 45 70 51 -104 -88 85 -271 114 -43
6589d3k52L39j00K32j44j55K44j9k13l6JJ31K15K8k98Jl8K80o6n64N62j56J11
6612F0J21j33j20k4K25M1Kk44l4L36j69k62J79M9J53l65L24q7l22M07j21J0k41
6635b15L18l5k41k6M21k02o3q8J9P0J8N6n9l7J55m9rj32J35k79n7P01l79M9J2
6660H3L6k02L28j05j50J32j46lK30o18M14l5R6K24l95J78j34rK80j98k56J24J81
6683E5j15K49j53k70L10j06J23r9j31J33p0J23K2o2n2mL22l51Q6R9j97J70l16
6706b34J38j35K44p8J78r3j29Q0J33k04N5J76m16K17m8P8Ok27M12j84J32L2j29
6729Do1lopM8LL8o9O2p0rJ43k91K75q4k15J59J59j49K05j87M9j12nJ73rQ9k83
6757a53K74l71L82m41L35K13k79PK05l24J99K19l80K64j27qP8P7k07j2j31J15
$$ plain form
6589 -43 -295 44 -56 176 32 -123 121 102 -111 -147 -146 -15 200 228 -70 -69 -107 173 107 -457 105 -51 60
6612 60 181 48 -72 -96 129 170 172 -72 -106 230 61 -201 -22 27 180 -185 139 52 -270 137 16 26 -215
6635 -215 103 68 -173 -199 222 20 -43 -131 -112 -42 -24 32 -27 -64 91 42 33 -99 36 -243 -300 401 22 71 83
6660 83 119 -83 245 140 -10 122 -24 -27 203 -415 -1 -36 60 284 -111 67 -67 -76 204 6 -250 -126 55
6683 55 -60 189 36 -234 76 -30 93 -6 -137 -4 -74 49 71 9 -43 -47 275 -76 10 109 -88 82 -234
6706 -234 -96 -231 13 -65 113 20 -109 -29 104 -100 -45 131 -285 -68 -116 -38 -32 -259 153 -31 101 133 4
6729 4 -57 -60 -66 -73 -25 -22 16 -53 9 -61 -70 73 -218 57 -27 -242 -83 76 -73 132 -55 -6 -118 -123 50 41 130 -153
6757 -153 121 -250 132 -309 26 239 -40 -33 172 -152 47 266 -114 150 23 15 93 170 -37 -49 -180 -65
6779f5K05j40O9j01o9j06N02k90J0K15m94K40o0K0J7M2j39N6P1J19j5J5k37K88
6803A53N0l16J25L19m54L44o4j52R5j68J60O1J1l6P0k07k6Q1k7N4j87K99K9k83
6827f9q7R4q1J85J43j99L19o3k60L4j75J39K38l72J33k2K1k33K80M5l4J3L6j7
6851F8J34l8k19q8k79M36k43K96O5k57K39nl87K10K88j97l31M44J22j72L9j17
6873Hj20mK25r9J96j90k32K07l02L77j87J0L2N5%j10kJ49j8P5j42M0J8J53M2q8
6899I3l0k7j4j02j16L14j61j17K81R1M2m74R3m7K57p2M5o1J39k47P2Q7j59M9K38
6924A74m1j01k87J31J72kp4L6K13N2j51L31k75Q1Kj72P9j27k38J58p3JJ06j40
6948a45L48l14L73k36p9P3J68k77o2K2l7J56Nq6p4K0J1O4N9p3O9K90l53j30L36
$$ plain form
6779 -65 140 0 69 -32 -101 -207 295 5 15 230 -264 -24 -84 -64 -47 -5 -144 -88 -17 102 87 102 -135 153
6803 153 203 -113 12 331 -123 221 157 5 100 -68 92 153 164 128 198 -9 -35 46 19 73 -114 185 214 -69
6827 -69 -156 -62 -143 42 185 -14 305 242 -18 16 -159 -20 218 -154 -21 -43 -22 -255 25 70 36 49 85 68
6851 68 202 164 -55 -143 -422 14 -229 67 132 -125 114 109 -278 -68 220 23 -308 136 258 86 125 8
6873 8 -112 -116 109 10 206 16 -216 -9 -311 66 -121 -111 -79 -24 -24 -134 -136 13 -5 70 -72 -32 -14 139 181 93
6899 93 63 36 22 -80 -196 118 -43 -160 121 212 254 -220 -127 -174 83 11 56 -5 134 -113 -41 46 -113 -64 174
6924 174 133 32 -255 -124 48 46 -28 8 221 273 122 453 178 259 261 89 168 41 -197 -39 -112 -111 -5 -145
6948 -145 203 -111 262 26 -53 20 188 -89 -151 -129 -166 -10 -5 -91 -165 -145 -134 -70 -11 -84 -15 275 -78 -208 128
6973A28m63J98J04P6Q0j13%m2J18j17j34J74J79qk91J59j24k51L55K27k01J8J33
6996B05m63J86k4L14k01j1k35L54k66P7K9k9J18k30J76J30j63n5K80j95j35J16
7018b2l7K52j60M5j27Q6mM8j88J93mJ74j08l72L58R8n88L56m6K97j88j90j14L85
7042A44P2j98m6J7K32j45j42j26J78J09n8L3k24L24J4k64L2Q1k2r1J04J11j96
7065f1K36j81k25L77m14K89J33Lj65K00k92N2J03m5L0N9k79L96n23J84J59j75
7087a39J76L7l3K08r9k28j88J91J28o1O1L13l02k87K25J12j65j00n9j7J55k25
7109b97L02qj24K4Q7j0O2p2k93K04L86k90L8o3J48Q9j92j24m9K20J56n1k77J11
7133b3p7k7K74j11l2p5j3N6M5j33K5O2l2j83J35O1O1Q3O5l61K95o4j93K7K48O7
$$ plain form
6973 128 -335 -137 -33 43 123 10 10 -32 86 -31 -165 9 188 180 -111 48 -76 -327 28 255 54 72 205
6996 205 -258 -72 -96 218 17 6 -229 125 -141 -64 -35 -64 54 -176 0 130 -33 -88 192 -3 -138 -22
7018 -22 -59 193 33 78 -49 37 33 81 -107 86 82 256 148 -224 134 232 -356 0 -46 251 63 -127 -241 144
7042 144 216 18 -28 -11 221 76 -66 -192 -14 95 37 70 -154 170 184 -80 -48 33 11 -80 24 135 -61
7065 -61 175 -6 -231 146 -268 21 154 157 -8 192 -100 -48 55 10 40 99 -180 216 -307 -123 36 -139
7087 -139 37 74 41 249 150 -78 -266 -75 53 -8 53 366 64 -223 2 114 -51 -151 -210 -227 -72 -297
7109 -297 5 -3 -127 -103 -16 -26 36 -36 -329 -125 261 -29 9 -54 94 183 -9 -133 -182 38 194 143 -134 -23
7133 -23 -100 -127 147 36 4 -71 -84 -28 17 -116 -91 -29 -61 -244 -109 -48 13 96 161 -200 95 31 -162 -135 113 180
7159A80l5j19mk68J48j03L87k8l14L95j45k40K11j10M1j13j14Q8R7P3J12p3j4
7182E2k8j2Q5L17n72L71j63j05r2J48j15k19L49j37J33m7J18j05J54k80L24j68
7204Hn9J93j12K36k65j10M4L0j32l9L76j00n01N95l4j35N9J74n14L86R8m5l34
7227a81K48m9lK38l8k65j75K22j43j60M37j16j38K24j75L12k44j63J64P5J44j74
7249D0k36K37m6j52j46L41J37k02M9o6j31K48L8N5k7k19q3J91J06j40J17k73J59
7272cJ0k19L65l77K25O0O3m6J4j13K50m27L44l06N10n23K89p6j50M44m55R3k52
7295b80J23K2K41k79L14j28j9k84L56M8k21J44k75j43L64k90O7N00l31J79l08
7316b00K98j15q2l9J74J15j61%j21M4m9O7J00n6m6q7j0J75Q6n7j54L9p6L91l30
$$ plain form
7159 180 145 26 22 -246 -98 -201 186 158 -156 239 94 -146 65 -45 -4 -117 -231 -143 -46 27 139 66 52
7182 52 24 12 97 414 -158 213 50 -55 -147 1 -114 -333 16 -121 12 -35 83 -22 132 -148 176 8
7204 8 -51 142 30 266 1 -109 -65 -35 -167 -206 170 70 -431 164 130 -5 54 228 -286 100 198 153 -181
7227 -181 67 18 15 253 215 -50 -225 -3 -146 -306 131 15 -123 101 -74 238 -6 -169 -5 70 214 40
7249 40 -196 41 -5 -157 -303 38 175 -27 22 -44 -175 73 111 166 139 -80 -163 28 134 -6 111 -162 -3
7272 -3 7 -212 153 -224 1 61 124 78 92 -21 229 -198 146 -160 350 -173 116 40 -110 334 -121 -28 -280
7295 -280 -157 -135 106 -173 141 13 -6 -290 66 114 -107 37 -238 -381 -17 -307 -240 260 -71 108 -200
7316 -200 98 -17 -99 -138 36 151 -10 -10 -131 -87 -136 -69 31 -25 -71 -158 -168 7 93 36 -118 -79 -155 236 -94
7341i4j48J82J21K81m67K21mNk03J31N2j54J11k30J61l2J94r3l46L12k9l42K98
7364g3J54j54K27j85O4R9q3N4l9l42K03L86m74K19j78J04O7k30J59j72J3M06o5
7387A60r3j00N6K87k06l0j42o9J73o4K34m0q9j27L9J48k40K50j74j69L40J75l28
7410ij14J15pQ1j69L9j78P8q4K44j55J86J77k10j20J00J42j28L22m08o9L67l94
7433a94J86j26J50J71j54J58J8k42j43K56O5M9m22L54j96J07J77M2j26K8k60K40
7455A38j16r4J83j11P8j33L8o2o2J52r5r0J60o1o7K80j51j62J44k35K40m1k1Q7
7479ap5J32j99K66J73j33l26K27k42M01k74P5l4J44m11K11lK20k95M57m71M55
7501B97j15k83R0J85k89j30M72m67J65o7J74Qj79K9K36r9n5j1k1l0K78j22k70
$$ plain form
7341 -94 -242 -60 61 342 -125 96 92 97 -106 25 77 -77 34 -196 -35 -67 127 34 -312 0 -29 -371 -73
7364 -73 81 -73 154 -31 33 132 49 103 64 -278 -75 311 -163 56 -122 -18 49 -181 -22 -194 -181 225 160
7387 160 67 -33 23 310 104 74 -68 -137 36 -28 206 166 77 -50 -11 137 -103 147 -27 -196 144 319 -9
7410 -9 -123 -8 -15 66 -103 -64 -242 -164 -248 -4 -159 27 204 -6 -126 -26 116 -12 310 -98 -167 200 -194
7433 -194 -8 -134 16 187 33 191 209 -33 -176 80 145 194 -228 126 -70 37 214 256 130 158 -102 138
7455 138 22 -72 111 0 78 -55 -17 -79 -141 11 -84 -174 -14 -75 -142 138 -13 -175 -31 -266 -26 -67 -88 -1
7479 -1 -76 56 -143 123 296 163 -163 64 -178 223 -51 24 -10 134 -277 -66 -69 151 -144 313 -158 297
7501 297 182 -101 -11 174 -115 -245 227 -240 -75 -142 32 40 -139 -110 126 27 -28 -39 -60 -90 188 66 -204
7524b04M48j53k01m7K05J28k50J20L6n98N84p6j38l7J53o5K75k72J02j91L28k05
7546e8r9K22j36N2M0J74m95K2M49n9r3k64K84L6p8p1O1j19K65k91R7K06j74J62
7570A33k56J61j77K43m9k30r1J12K17r9J43k70J91j09K21J41k71l09K52L96l34
7591A5J5J3O2Lj07j92K92l3j81Nl6J73k9J24j29K5j93K01J45l1j05N1k5K1j01
7616a7Q4N9k82K46j78N4k78N26k21r3K08j00j57K37o5o1K42j66j91K80j20oJ68
7639A69l03J54P8l00Q3n4N69q24M39k17K90O4R6k49J83O7k41J9N3N3k93p1R6l5
7663a74J73k55M46k20jK25K9l34J89Q1l16J09J81P5k10m5k01K84j45J36j25Q6
7685a2j13oM64l43J02k12K65l00M0K70k12r3J50Rk79M22j82K8M0k7j20Q8N3P8
$$ plain form
7524 -204 244 91 -110 -157 48 176 -74 46 82 -516 68 -8 -146 -183 -30 -95 180 -92 10 -181 147 -58
7546 -58 -157 65 -71 -19 21 195 -300 -278 171 112 19 -245 39 75 -3 -74 -13 -132 133 -158 -61 145 -29 133
7570 133 -123 38 -139 104 55 -175 -266 -154 63 -36 107 -163 28 -81 140 281 10 -299 -47 349 15
7591 15 30 43 105 108 1 -191 101 68 -113 -108 -144 29 0 124 -5 20 -173 28 173 142 37 88 63 84 -17
7616 -17 67 126 -156 90 -88 -34 -312 214 -7 -100 108 8 -149 88 23 -38 204 38 -153 127 7 1 169
7639 169 -134 20 98 -202 -119 -173 396 -428 11 -206 84 148 244 -5 178 245 4 23 76 129 -164 -235 -139 -174
7663 -174 -1 -256 190 -30 -31 194 223 -111 78 159 -157 -48 133 208 -2 -47 -248 36 -109 27 -98 -12
7685 -12 -125 -131 333 -10 92 -120 145 -155 -115 155 -57 -150 0 9 -270 152 -30 -2 38 11 -109 -21 32 110
7709A10J22m28K69j89M8P9j86J84m0j56p7L02p8R9j20j60L22k02K6K26p3l09K38
7732Gj46K04j04L34l24J65l80K02J5R9k69M00m46p0K54jJ13j91K48O1l88J59r2
7755a50J14k31J76J81j84Qo4J26K22k5l42J90%P3p6j97M19m20k03N43k5j12Q1
7778A04J39k70R6M8k01J9n2j17L67k42r5L67q1o0q9K50l17j6P3n8K60k56PK54
7802A30o6k46M63k41J18r2J3j29L05m39pK58J11n9j16K9L5K56p02M04j5J80l95
7825b05L34j32Q5j32R9Nj6n1j63J42P5nj08K48j80K8J57l11N9K33k5j64J78k89
7849a38j02L01n1k91L34j31K6K71m36N4j24K97J49j60j64L70k42k5K00j88J66
7870A16rn6j5j46K33n4J24k60K1J03k32n5K77j38J64l84M86k11j42j57P5O45m22
$$ plain form
7709 110 232 -196 73 -116 -68 11 -175 9 -31 -187 -264 38 -40 59 -61 -221 101 -101 -75 151 78 -231 7
7732 7 -139 65 -39 295 -29 136 -244 -42 -27 72 -197 203 -243 -313 -59 -60 53 -138 110 171 -217 -58 -150
7755 -150 -36 -267 -91 90 -94 -86 -150 -24 198 173 -169 21 21 94 18 -179 240 -180 -383 160 135 23 104
7778 104 243 -27 69 117 -84 -65 -117 -234 133 -109 -204 163 82 22 -67 183 -134 -150 -77 -135 125 -131 -124 130
7802 130 64 -182 281 40 158 66 79 -50 255 -184 -191 67 178 119 3 32 67 323 -379 25 10 190 -205
7825 -205 129 -3 82 -50 49 54 38 -13 -176 -34 41 36 -72 176 -4 24 181 -130 -71 162 137 -27 151 -138
7849 -138 -240 61 10 -281 53 -78 -52 219 -217 -163 -287 10 159 -1 -165 205 -37 -62 138 -50 116
7870 116 107 51 36 -110 123 69 193 -67 -46 57 -175 -230 47 -91 73 -311 175 -36 -178 -335 -260 385 -37
7893c7jJ04j07J13J14k60J15o0J33n6K74l46L10j86k36J76K5j45K55k23j05M22
7915B79n65L76K28j95j59m6n4j20K75J4o4j80J83J67k64P0R7r0K71l27P0q5N1
7938f8M5P2Q1N2m63L13Q2j32j10K12j75K84k57KL1j30O5J53%k84K73q8J8j47K53
7963H2r0L6k2q2L9j12K40r4K1J91k08p5l4Q7r9K9L90k30K9j72p9k5J37l5K29L1
7989A84k98M90l78P2j42O0M5k05Q0k1J32r0r6J9J24N4j11L56l5k93Q2n6j04K7
8013a04j65K58J61k90P3M9J39j17l40K26R1J40j62m3j29L82j58J2O4n8J05k56
8035a22J81j3J22M6k95j71K13L39l75P5J9J21m12J4K13k96K79J45J51j53M2k02
8057g9r8L51j40j92j26M35j49j37K53r9Q1p5k94L22q2j17K54l02L5K37k5L6j1
$$ plain form
7893 -37 -38 66 -41 72 186 -74 41 -19 114 58 332 -14 296 110 -126 50 75 -70 185 -38 -143 279
7915 279 -286 90 318 123 -36 -82 -136 -256 19 33 -31 -211 -28 139 -125 -55 42 -48 223 -104 -34 -119 -68
7938 -68 -23 49 130 182 -281 32 114 -18 -128 84 -91 193 -64 -62 -31 -161 -96 57 57 -227 46 -42 -24 -171 82
7963 82 -8 28 6 -76 -37 -149 91 -3 18 209 1 -74 -108 -21 -120 -91 299 69 98 -74 -153 -178 -41 -76 153 184
7989 184 -114 376 -2 70 -72 -12 33 -172 -92 -113 19 -71 -167 -148 -24 30 -81 275 240 -53 29 -27 -131 -104
8013 -104 -269 -11 150 -140 -67 -18 121 4 -336 -110 -19 121 -41 -84 -213 169 11 23 87 29 134 -122
8035 -122 59 46 168 214 -81 -252 -39 300 -75 0 19 140 -272 -258 -45 -341 -62 83 234 81 123 -79
8057 -79 -177 174 34 -158 -284 151 2 -135 118 19 100 25 -269 53 -29 -146 108 -194 -159 78 53 89 78
8080G8j8L4mL7j15J06l9n9k37K49k49Q6L1M29k75R0k17Q6J87P5j74j47N4J7M2
8105F7J69k59p9K91j96m0k79K12q5K35K22l65j4l2J43O5O4j38q1J27j20K09j35
8128a9J59q5n5j75l8L70P4o4q5j95nK20Q0k93K10r5Q6j04k7j11K21m0M4J00k74
8153a01K81j92l14N33k70K57n4j32k02L69k15K1r1k53N2J00L93k39jK26l45J1
8175a66jL77k71J69L1p5q4J94k56qrJ62k78M06m35J85
$$ plain form
8080 78 60 94 90 127 12 118 79 20 -217 32 -217 -131 -100 329 54 144 -73 13 200 275 101 -46 8 25 67
8105 67 236 -23 -102 189 -7 -47 -326 -114 -199 36 258 -107 -121 -153 -10 55 119 -19 -100 27 -93 116 -19
8128 -19 140 55 0 -175 -213 157 231 167 82 -113 -118 102 182 -111 99 4 90 -14 -41 -152 69 29 73 173 -101
8153 -101 180 -12 -326 207 -63 194 140 8 -194 175 -40 -19 -110 -363 -311 -211 182 -57 -58 168 -177 -166
8175 -166 -167 210 -61 108 139 64 -20 174 -82 -90 -99 63 -215 191 -244 -59
8191e9
$$ Imaginary data points
##PAGE= N=2
##DATA TABLE= (X++(I..I)), XYDATA
0@%%%%%%%%%%%%%%%%%qJ6j6J6j6J6k3L1l2L5m3M8n6O4p2Q5r3J04j20J35j50J68
39H9j89K10k32K57k84L15l49L85m24M66n13N67o26O89p60Q40r30J034j153J290
59F82j452J645j884K187k584L127l921N195p557J3377n3604q0974J16527Q1746
73G2510l6730p2155R890N3984M904l7515J1994J7377j4653p944L088P4K0230J4474
87C9528r286k8157j9880L3214M1190l4828m4950J5009K7790J889r889q72Q311
100A9069k2357k6590L0636K9951k9265l1561M402K5831J7118j6934j8221N925
112a1996k824k515O441n996L833J3748j2796j4791J2225K1321O859l0202k9978
125d6671K9630L6286j2495j9667O39J3137J1203r189l827J1521r751j1060J4534
$$ plain form
0 0 0 0 0 0 0 0 0 0 0 0 0 0 0 0 0 0 0 -8 8 -8 8 -8 8 -15 16 -16 19 -24 24 -32 32 -40 45 -48 56 -64 71 -79 89
39 89 -100 110 -122 135 -149 166 -183 202 -222 244 -269 298 -328 361 -399 441 -489 545 -608 682
59 682 -770 875 -1009 1178 -1406 1721 -2200 2995 -4562 8815 -44789 -125763 -9236 72510
73 72510 35780 -36375 -26485 27499 32403 -5112 6882 24259 9606 1662 4750 4824 25054 39528
87 39528 30242 2085 -17795 15419 56609 21781 -23169 -8160 19630 21519 11630 10758 19069
100 19069 -3288 -29878 758 30709 1444 -30117 -25715 116 17234 300 -17921 -11996
112 -11996 -14820 -17335 -10894 -16890 -13057 691 -12105 -26896 -14671 6650 13509 -16693 -46671
125 -46671 -17041 19245 6750 -12917 -12278 859 12062 2873 -954 10567 816 -10244 4290
138D290Q869J649R32r797k124O290k49N551m585j6560P017J2876l265J313K1q124
154D104l468n289M872J4357j2445j7650R318J0689L343l999j4130L48P556o883
168i277L39N475l605J675p57m929J0824L746j2325m987N03P156J1197q303p891
183a1159J1035K925k711J591l568J551J863p891O208J1727l237k753l396l401
197a216J1031K894j1988j789J813M155P812o330n117P883l509o456K920o63J566
212C006k23r804N058R657n525k963j996n469N023J809n275L428j347k730O607
227g44n13k176L554p673m771Q458K534q8l19o446O192P521p453j481L087k650
243b968K496k42j460R427j85p547K458J742M46M101p067m447P613J681Q52Q52
$$ plain form
138 4290 13159 14808 15740 5943 3819 10109 9860 15411 10826 -5734 1283 14159 10894 12207 12228 4104
154 4104 636 -4653 219 14576 2131 -15519 -6201 4488 7831 3832 -10298 -9950 -2394 -9277
168 -9277 -8938 -3463 -7068 -5393 -6150 -11079 -255 3491 -8834 -13821 -13318 -6162 5035 -3268 -11159
183 -11159 -124 2801 90 1681 -1887 -336 1527 -6364 -156 11571 8334 5581 2185 -1216
197 -1216 9815 12709 721 -1068 745 4900 12712 6382 1265 9148 5639 -817 2103 1440 3006
212 3006 2783 -7021 -1963 7694 2169 -794 -2790 -8259 -3236 -1427 -6702 -3274 -4621 -7351 -744
227 -744 -1257 -3433 121 -7552 -12323 -3865 -1331 -1419 -1738 -8184 -1992 5529 -1924 -3405 -318 -2968
243 -2968 -472 -714 -2174 7253 7068 -479 1979 3721 4167 8268 1201 -3246 4367 6048 6900 7752
259G752p203K463N005o900oK452l747J642K87k214O657j850q186K120o44j318
275c690M361l809k838N072k832J27N168n239j630J683m707M453M152n561J653
290c637J320j495N238j888n474M509j81k354M491o68M70M534n022n25N641k725
306B234r77J002l984M765N014n437J393Q38l546L367r13l786M325j509l316M404
322C874p37o51K584n988j638M847l444r30K459l835K012K664m849K244P23m759
338e424K200k74k153M901j293l496M878n75j977K795m322K41M370k829O89L896
354A627l091J664J800l921L635J496m839K091J509j673M718j443l142M118j451
369C098k478K979k413m64L703l585L54M515m228Q7J009l704K425O30m430K802
$$ plain form
259 7752 549 3012 8017 1117 1111 3563 -184 1458 1745 -469 6188 4338 -3848 -1728 -2372 -3690
275 -3690 671 -3138 -5976 -904 -3736 -3609 1559 -3680 -5310 -3627 -8334 -3881 271 -5290 -3637
290 -3637 -2317 -3812 1426 -462 -5936 -1427 -1608 -3962 529 -139 331 4865 -157 -682 4959 2234
306 2234 1257 2259 -1725 3040 8054 2617 4010 4848 1302 4669 3756 -30 4295 2786 -530 3874
322 3874 3137 2486 5070 -918 -2556 2291 -1153 -2083 376 -3459 -1447 1217 -3632 -1388 -665 -5424
338 -5424 -3224 -3498 -5651 -750 -2043 -5539 -661 -1236 -3213 -418 -4740 -4499 -129 -2958 -2269 1627
354 1627 -1464 200 2000 -1921 1714 3210 -1629 462 1971 298 5016 3573 431 4549 3098
369 3098 620 3599 1186 722 4425 840 1194 5709 1481 1568 2577 -1127 1298 1928 -2502 300
385C00Q74k606K874j962k612L208j897k511L862k018q11L739l851J106L074l861
401c092J73J807l260K584J115l106L827R13l433K642l0k250L673j982j547M836
417B870j696p41L231l113R83L076m645M06K871l070J941J341l269K931K66l766
433c84K829n82k560K990j826j420L954k238j309K553l042n04K167l680J152K399
449D99l244J398J661l292K589j24l712L171L44k662K753j202r97M263k843j543
465b941L324k166p7K389k751J763K709l501J606J871k915K188L71l163L194L06
481B207k656L289j017j411L006k393j483L795k643n35K662k829J039K148l868
496f89J738J511l710J411Lk427L038l34l022K996p80j905K234j933r59L501k590
$$ plain form
385 300 1174 -1432 1442 -520 -3132 76 -1821 -4332 -470 -2488 -3299 440 -3411 -2305 769 -3092
401 -3092 -2919 -1112 -4372 -1788 -673 -3779 48 961 -2472 170 140 -2110 1563 -419 -1966 2870
417 2870 1174 433 3664 551 1534 4610 -35 371 3242 172 2113 3454 185 3116 3382 -384
433 -384 2445 1863 -697 2293 467 -953 3001 763 -546 2007 -1035 -1539 628 -3052 -1900 499
449 499 -2745 -1347 314 -2978 -389 -513 -4225 -1054 -710 -3372 -619 -1821 -2818 1445 -1398 -2941
465 -2941 383 -1783 -1860 529 -2222 -459 2250 -1251 355 2226 -689 1499 1870 -1293 1901 2207
481 2207 -449 2840 1823 412 3418 1025 -458 3337 694 159 2821 -8 1031 3179 -689
496 -689 1049 2560 -1150 261 264 -2163 875 541 -2481 515 -265 -2170 64 -1869 -2828 673 -1917
513a917l24K672k248O55J975l502J444J316l011K139O69k064L013l91k386L007
529A047r15j903L166j318q29L404k557J34K533k040k52J814k838J263J721l278
545h48K243J436k746K274o02k233L112j245k121K592j410j129L001k693m17K430
561A644k488m05J791k883J423J567k963J863J076l376K298p8k090K213o89j852
577b949K873r73j228K899k114l75K510k611N44K209k003J281J187k650K132J376
593B108l167J958J86j762K727j210j446L258j171j387K672k003m01K095k090N04
609H71J665k537J210J013k724J204N34k520J965k42k348K878q46j922K756j665
625g08j523K528j489o08J843k342P78K042k707O27J804k448J186O46k334K501
$$ plain form
513 -1917 -2241 431 -1817 -1162 813 -2689 -1245 71 -2940 -801 -132 -2196 817 426 -1960 1047
529 1047 132 -1771 1395 77 -752 2652 95 229 2762 722 470 2284 -554 709 2430 -848
545 -848 1395 2831 85 2359 1757 -476 2636 1391 -730 1862 452 -677 2324 -369 -786 1644
561 1644 -844 -1249 542 -2341 -918 649 -2314 -451 625 -2751 -453 -531 -2621 -408 -1097 -2949
577 -2949 -76 -1049 -2277 622 -1492 -1867 643 -1968 -1424 785 -1218 63 1250 -1400 732 2108
593 2108 -1059 899 1085 -677 2050 840 -606 2652 1481 94 2766 763 362 2457 367 871
609 871 2536 -1 1209 2222 -502 702 1236 -1284 681 439 -1909 969 123 -1799 957 -708
625 -708 -2231 297 -1192 -1800 43 -2299 -1521 521 -2186 -1559 245 -2203 -1017 -371 -2705 -204
641b04J33k030K837p17j509K761q58j583K529j341k50K374k487K86K504k135M85
658G95J395k696J724P09k039J809M16k044J919l03k002K108j151j057K135j925
674b07l94K070k102q8J920k730M57J426k125J165O10k256J961J02k605K211l63
691i48j336J995j204j022L007j753m65K413j899L02K124k653J021J410k035J388
707C45J072k309J562J111k014J907l73j349K010r12j114K423j328o44K121k177
723C31K87J520j869L35J249k613J157R11k090J312J60k367J881n68j699K419r18
740e62j545K252j505n23J937j868L29J934k587M10J803k117J129P67k036J906
756b76L41j964K013k18j239K520o64j399K633j109r90K432j859K99K012k139N39
$$ plain form
641 -204 -71 -2101 736 19 -1490 1271 413 -1170 1359 18 -232 2142 -345 -59 2445 310 795
658 795 2190 -506 1218 1927 -112 1697 2113 69 1988 1685 -317 1791 640 -417 1718 -207
674 -207 -601 1469 -633 -721 1199 -1531 -1074 352 -1773 -608 2 -2254 -293 -191 -2796 -585 -948
691 -948 -2284 -289 -1493 -2515 492 -1261 -1726 687 -1212 -910 1214 -1439 -418 992 -1043 345
707 345 1417 -892 670 1781 -233 1674 1301 -48 1962 1050 -64 2359 1031 387 2508 331
723 331 618 2138 269 604 1853 -760 397 1308 -782 530 690 -1677 204 -364 -2063 356 -562
740 -562 -2107 145 -1360 -1883 54 -1814 -1485 449 -2138 -1728 75 -2042 -913 -146 -2182 -276
756 -276 65 -1899 114 -104 -1343 1177 513 -886 1747 638 -352 2080 221 520 2532 393 932
773I32J727k000N19R54k037J184K71j803J877n9k098J977n33j604J902j282j092
790a165K114j898j57J844k246L11J564k002N78P64j835J334L96j792J821l37j872
807b578K009n6j442K508j191j154K769j755R4K024k001O18J579k152J013J399
823A684j874J222P46k076J952N3k006J873j31j244J959j038j035K061j226p30
839A90J688j546l09J673k331Q25J263k403R00L77j686J371J51j960J692m61j607
856b173K447j062r69K064j852j47J562j266j99J693j869Q58J111j654R64Q41j651
873a302J607N33k023K322n51j304J909p66o92J833j262k83K040j535M4J389j838
890A21O45J105j705R41O61k077J435J89j605J546o18j525J773p11r51J671j144
$$ plain form
773 932 2659 659 1178 2132 95 1279 1550 -253 1624 1565 -533 1444 911 -693 1209 -73 -1165
790 -1165 949 -949 -1106 738 -1508 -1197 367 -1635 -1057 -293 -2128 -794 -398 -2190 -369 -706 -2578
807 -2578 -569 -625 -2067 441 -750 -1904 865 -890 -796 1228 -773 -155 1424 -728 285 1684
823 1684 -190 1032 1778 -298 1654 1707 -299 1574 1443 199 2158 1120 85 2146 920 190
839 190 1878 332 23 1696 -635 190 1453 -950 -50 327 -1359 12 163 -1797 -105 -566 -2173
856 -2173 274 -788 -1757 307 -1545 -1692 -130 -1396 -1595 98 -1771 -913 198 -1456 -492 349 -1302
873 -1302 305 838 -1185 1137 586 -718 1191 425 -267 1566 304 21 2061 526 570 1959 121
890 121 766 1871 166 1107 1768 -309 1126 1315 -290 1256 638 -887 886 175 -776 895 -249
907b49j178J798j665N69J009j794N72R14j789J310P70k400J630J13j440J690q6
924b26j115J467l26j446K317j219o1J623j343o8J964j962M28J691j890O22R29
941A385j470J026L68j802J647K24j842K074n44j432J799r94q59J993j522m37J528
958A142j572L6J194j526L24Q62j814J368j29j747J764j29j350J473m22j159J647
975c8p43o33J531j156l07J634j635M18J450j610P65J125j880J296P97j692J452
992G74j8j241J682k89q97J903j541j38J523j416j59J580j369k21J636j951P50
1009F08J111j949R16M11k014J290K51j510J169l92j152J808j420q14K054j408
1025a041k61J297j131L15J227k025Q24N11j317P73Q96j942J691j41j122J738m44
$$ plain form
907 -249 -1427 371 -1294 -725 284 -1510 -938 -24 -1813 -503 267 -2133 -503 -390 -1830 -140 -226
924 -226 -1341 126 -200 -1646 671 -548 -609 1014 -329 -397 1567 -395 33 1724 -166 456 1385
941 1385 -85 941 1309 -493 1154 1378 -464 1610 1066 -366 1433 439 -420 1573 51 -386 1142
958 1142 -430 -394 800 -726 -402 460 -1354 14 -115 -1862 -98 -227 -1577 -104 -526 -1685 -38
975 -38 -781 -1414 117 -1039 -1346 288 -1347 -929 521 -1089 -324 801 -1079 217 1014 -678 774
992 774 756 -485 1197 908 11 1914 373 235 1758 342 183 1763 394 173 1809 -142 608
1009 608 1719 -230 686 1097 -917 373 624 -886 283 -109 -1261 547 -873 -1687 367 -1041
1025 -1041 -1302 -5 -1136 -821 406 -1619 -795 -284 -1601 -828 68 -1874 -183 -324 -1446 292 -152
1042a52q82J825o57o57J622p78o47J697j090K27J167j718N11J082j619R55O33
1059A519j935J351L12j474J520m18j083J635r66n40J259j030o19J564j528k2J084
1076F29j679O19Q95j647O01R23j950J462k62j470J717m62j095J887o63q07J542
1093B40j207j33J502j534M02J503j595P81R74j757J171O40j579J212N27j624J568
1110A091k54j155J620q64m03J165p31l20J571j735L50J191j575L39Q87j450Q73
1127F00J35j504J226O9j200J072k02j314J351n50j196J915j047m90J463j466L18
1144h20J065j320K48J127j734R51N11j619J270K94j171J505k93r09J710q84m54
1161e23J590j045l69J475q84K6J267j457K76P88j574J067N37j463J334k7j370
$$ plain form
1042 -152 -1034 791 134 -523 1099 321 -326 1371 281 508 1675 -43 468 1550 -69 886 1519
1059 1519 -416 935 1247 -227 1293 875 -208 1427 461 -79 1180 150 -469 1095 -433 -455 629
1076 629 -1050 -431 464 -1183 -582 341 -1609 -147 -409 -1879 -162 -624 -1719 168 -495 -1302 240
1093 240 -967 -1100 402 -1132 -730 773 -822 -41 933 -824 347 987 -592 620 1147 -477 1091
1110 1091 837 -318 1302 438 35 1200 469 149 1720 -15 335 1526 -49 290 1177 -273 600
1127 600 735 -769 457 526 -674 398 196 -1118 233 -317 -1513 402 -645 -1135 328 -1138 -820
1144 -820 245 -1075 -827 300 -1434 -483 28 -1591 -321 -27 -1198 307 14 -895 815 -69 -523
1161 -523 1067 22 -347 1128 244 270 1537 80 356 1144 -430 637 1174 -289 1045 1018 -352
1178c52J444k40j324J564o31r23J665j234o74J540j375J6J198j308J04J019j354
1195h65M49M47j282R74R5j095J476o05j174J595o74o00J587r33j45J301j035j87
1213f71J289j216N82P08j318P27Q61j427J222J10j331J305R0j340J425n25o39
1230a48J496r35j021K291j252m57J443j556L20R43j196L96P67j887J039M81j446
1247g22J423m01j247J015l43o48J090p00o08J483j062l15J554j348J33O57j077
1264a116Q38N30j367P30N58j290J050Kp33J632m42r21J503q82l11J324j264M13
1282B54R86j272M64Q03j671P40Q58j161P10J80j121R44K15j567J552m85q88J220
1300G61m73n99J096j087j79R60q58k49J007j129P39L51j494J058K75j219R49j59
$$ plain form
1178 -352 1092 852 -472 1092 461 -462 1203 -31 -705 835 -540 -524 674 -634 -530 489 -865
1195 -865 -416 31 -1251 -277 -182 -1277 199 -406 -1580 15 -659 -1259 328 -605 -750 551 -484 -671
1213 -671 618 -598 -16 692 -626 101 962 -465 757 867 -464 841 931 -409 1016 491 -148
1230 -148 1348 413 -608 1683 431 -26 1417 -139 181 1124 -72 324 1091 -796 243 724 -722
1247 -722 701 300 -947 68 -275 -923 167 -533 -1141 342 -720 -1035 519 -829 -696 -39 -1116
1264 -1116 -278 252 -1115 -385 173 -1117 -67 -65 -798 834 392 -529 974 92 -219 1105 -159 254
1282 254 1240 -32 432 1235 -436 304 1162 1 711 891 -230 714 929 -638 914 429 -459 761
1300 761 288 -311 785 -302 -481 479 -379 -628 379 -750 -11 340 -1154 -96 179 -1040 -91 -250
1318b50j093J487o91o26J463q89n80J406r17l09J328r36K98R17r80J43J039j161
1336c51O12P85j259P68J24j119J394l11q92J310l77p50Q13n25k12J098j027K52
1354C33Q76j511L60N46r90O89M3j165R91mr31Q65L0r78J206n14p22J126q30l64
1374i44J294j052k06J183j002K16P05j240N57O42j012Q91K90j100J098k92l81
1391c53Q73l87n39J008m45l94R78o12j72J052j254M49Q92j246O50L32j179P37
1409C90N02j143Q57k3j259J305n54p43J244p42l55Q30p16k75J095j148K3R77j215
1428i50P00N43j198P89J51j012R40r5q18J189m60n30J266p08n93J266r26o4J237
1447G27r36n0Q40q90N38O19j253Q68J84r95R16k90o73J257j13o42R22r23j89R73
$$ plain form
1318 -250 -1343 144 -547 -1173 290 -599 -1179 227 -690 -999 329 -607 -309 608 -372 -229 810 -351
1336 -351 261 1046 -213 555 679 -440 954 643 -249 1061 684 -66 747 222 10 1108 81 333
1354 333 1209 -302 58 604 -386 303 346 -819 172 168 -763 102 132 -846 360 -154 -876 250 -580 -944
1374 -944 350 -702 -908 275 -727 -511 194 -1046 -489 153 -859 32 322 -778 320 28 -353
1391 -353 520 133 -406 602 157 -237 741 129 -43 1009 -245 204 1096 -150 500 832 -347 390
1409 390 892 -251 606 583 -676 629 75 -668 576 -166 -521 309 -407 -682 413 -735 -712 265 -950
1428 -950 -250 293 -905 -116 35 -977 -37 -132 -950 239 -221 -751 515 -193 -786 480 -446 -510 727
1447 727 -209 -259 581 -309 229 848 -405 463 647 -348 568 278 -395 862 749 107 1029 106 -83 890
1467H90q58k77J304j315J88Q43j296N74Q32j474N04N33j364J089k97o54R19l26
1485a85n95R22l54p99J425j121M4Q29j013L49Q68q17J55R80j292N27L71r18J002
1504C78m7o93J059m67l29P05j82o03R34n60l12J025r97K19P79r69L76M06q82M09
1524B49L96r63N18L28r33Q12j71n74Q66m80o76O99l69p1N79o73J50N85r06L31
1544c03N63q27N67M3j027J079kj108J256m07o18J156l68j82P67n28m42Q29o81
1563b33K49P89j127L25N62o70M40M21p90N56O5p65P60k0o58P83m65m19Q20o97
1583g4K5P72n03m19O96n79q9L90l81j59N23q64N21M8o25R93m64o92Q56p0p02Q77
1605H0n99N4M60p93M65P71r64L37N67q76O75K37p40Q16p3o42O55r4n03Q30k93
$$ plain form
1467 890 32 -245 1059 -256 -68 775 -521 53 885 -589 -85 448 -916 173 -124 -778 141 -185
1485 -185 -780 142 -212 -1011 414 -707 -663 166 -847 -498 370 -447 -292 688 -604 -77 294 -624 378
1504 378 331 -362 697 230 -99 606 424 -179 755 195 -117 908 -89 130 909 -60 316 722 -160 249
1524 249 645 -318 200 528 -405 407 236 -338 528 48 -628 71 -298 -369 210 -463 -313 272 -634 -303
1544 -303 260 -567 0 43 -984 95 93 -1015 241 -166 -784 372 4 -178 589 61 -381 448 -233
1563 -233 16 805 -322 3 565 -105 335 756 -34 522 587 -178 582 562 -96 687 222 -197 623 -74
1583 -74 -49 723 220 -199 497 -82 -171 219 -162 -321 202 -662 -141 -93 -718 275 -189 -881 -25 -95 -797 80
1605 80 -519 -465 -5 -798 -333 438 -526 -189 378 -498 177 414 -326 490 417 -225 430 336 -167 663 370
1626C70o05J042n44l68R46r71K83O61n05o0N26j156O72L7n58L39K62j033J037
1645C75j76p16P50j74l34M43l04n47R01o63l8O65q18L25O06j054N03L41o09N98
1665G4P0p63P28k21o78R90l51n57J092m93j5O26m23o3M74o42lO70o47L03K55l96
1687C0K62R4p34J037j93q25R61m87j77M78l44k70Q76p24j01O76q69K31J18m18
1707c79J62K86q26P97L1r03Q26m0q23P40O7m79P44m25j95N22p85PJ009m91j63
1728c18N10n30J65O32r57P41J13n13P66l29m71M59Q1m89P49m67l13R42q48j99
1748b76J031q59K5Q16q80L14L79r07N37O4m99N72l53n69P18j64m26M72r6L3K91
1769B23m67k14P09p10K29N39p64L66K81p33N31J63q83P34J26n95M11N9l96Q46
$$ plain form
1626 370 -235 807 263 -105 841 -130 153 814 309 249 775 -381 291 328 -230 109 371 -662 375
1645 375 199 -517 233 59 -275 168 -136 -683 218 -445 -483 182 -636 -311 295 -759 -256 85 -524 74
1665 74 144 -619 109 -112 -790 200 -151 -708 384 -109 -124 502 79 16 490 -152 -155 515 -132 171 426 30
1687 30 292 386 -348 689 496 -329 632 145 -32 446 102 -168 708 -16 -117 559 -310 -79 39 -379
1707 -379 -217 69 -757 40 71 -832 -6 -46 -869 -129 -62 -541 203 -222 -417 105 -680 -673 336 -155 -318
1728 -318 192 -338 -173 459 -498 243 356 -157 609 280 -191 268 349 -140 609 142 -171 771 -77 -276
1748 -276 755 -104 -79 737 -143 171 550 -357 180 244 -255 317 -36 -605 113 -51 -477 -5 -101 -68 223
1769 223 -244 -458 251 -459 -230 309 -455 -89 192 -541 -10 153 -730 4 130 -465 -54 5 -391 455
1789D55l12o35R17l95j19M59m05J06O38o77J14J15j97K51K50o26N82j76k02J13
1809B56R9m48M69j25o40J008m70n08R80j015R3P91r37L72L73p22L38J39p22P90
1829A21k18m12N18j43j22M97m04o76Q43j51l70Q36p41J18O41n96JM67n23M31R8
1850B15k53J76J01p12R11l13m62Q42k90l99P13k95k53K11k3J3M34p64K39L13o96
1871b92L17J16m36K56M46q06P14q3p36N20p6m11Q93o74k78Q22q15J97L39o71L20
1892c38O75r32L92L32p24M74K63n86Q18k48k06M92n93k03P61k41j99N42p19J47
1912i3L76m88L8P16o14K53K05p77O56O4o62N25m9j22L13l08m0M30l63r0K28l01
1934a03j92P64q63J79K62k09K31j6n01K46L77m88L05r0j82L67l27l85P29m56m1
$$ plain form
1789 455 143 -492 425 30 -89 370 -35 71 709 32 146 261 64 315 565 -61 521 345 143 256
1809 256 355 -93 376 251 -389 619 149 -359 621 -394 -301 490 -447 -75 298 -424 -86 53 -669 121
1829 121 -97 -509 9 -134 -256 241 -163 -839 4 -147 -517 319 -422 -304 337 -259 -258 209 -314 117 215
1850 215 -38 138 239 -473 438 125 -337 505 215 -184 529 234 -19 192 169 182 616 -148 91 404 -292
1871 -292 25 141 -295 -39 407 -399 315 232 -504 16 -60 -471 422 -252 -530 292 -523 -326 13 -658 -338
1892 -338 337 -595 -203 129 -595 -121 142 -444 374 126 -80 412 -181 -384 377 136 -63 479 -240 -93
1912 -93 283 -205 -167 549 -65 188 393 -384 272 336 -326 199 150 28 341 33 -7 423 60 -30 198 -103
1934 -103 -295 469 -394 -215 47 -162 69 53 -448 -202 175 -313 -8 -98 -280 87 -240 -625 104 -352 -393
1955c93N84o00P9R84r95J85N09p17O19L12o97M30o3m67P26m96k74O09o0n89P58
1976D44k64k31N98p12L9P17p91Q5N94m67O7L85r02L93L44p13N17J02n89Q19l58
1997G7n85N14j2l56O64o17J61M60n70j64O83q12L62J48n57O38L6m89N16k4m92
2018d19N93m78OQ52l80p03O67n2j96P56q56J95O06p98L13K92m32L97%q79Q35J34
2040D53m17L5l0j99O30n17j98O33k28k72K87p25L53O89j137L08M52q09P99K0n94
2061d67P63j38o06M52k49k77Q14m95l89O44l11k13P15o32M21K64n86J63M96l74
2081eO1N9k33M02J10o27O08j11n68N90j62j39O67p00k45Q86m00k44N68q79M25
2102F3M30p38P6M88l30O3qm45N93J01m14J28k45j55Q54q39l1M93k13J47K51p69
$$ plain form
1955 -393 191 -409 -330 654 -341 -156 353 -364 255 567 -130 300 237 -230 496 0 -274 335 275 -314 444
1976 444 180 -51 547 -165 -126 591 -200 -115 479 12 79 464 -438 -45 299 -414 103 205 -384 435 77
1997 77 -508 6 -6 -362 302 -315 -154 306 -264 -428 255 -557 -195 -47 -604 34 70 -419 97 73 -419
2018 -419 174 -304 -298 554 174 -529 138 86 -110 646 -210 -15 591 -207 106 398 -34 363 363 -516 319 453
2040 453 36 71 41 -158 472 -45 -243 390 162 -110 177 -548 -195 494 -643 -335 117 -692 107 127 -467
2061 -467 296 158 -448 4 -245 -522 292 -203 -592 52 -259 -472 243 -389 32 296 -290 -127 369 -5
2081 -5 56 115 -118 284 394 -233 375 264 -304 286 124 -15 652 -48 -293 593 193 -51 517 -362 63
2102 63 493 -245 -169 319 -11 52 44 -401 192 293 -121 7 -238 -393 461 -378 -409 84 -129 18 269 -500
2124e00M82R5l69P7N47n78M78L9m07M08j22k78N77k10l61N87n92J01N86n93J04
2145G1L32n24K97K54p49K32O86n46K91p8l51M61q9p05Q26l88j92K17m01j58J009
2166D95p52P2K60l26K58j78l06N05J57o78L44P2k63L92L0q00O17K64m01N00m29
2187a67k44P15n17M1M16n46K50L91n48M12K7l20N85p4n45L39kn05P17j51k51M35
2209D58l11m18P70n56p7P18n43m5K9k09N84k95n41L71M4l80M62j6l88M94j00o97
2231f46Q21k69k52M72l52m4M72m61j74N65n04o5M22l40L51M40m76M60j61n75M47
2252A31J2m96P02l35k54O95n47J05L05o89N86L06q26L65J12l76O82l12n72N79
2272A73K31l99K89l12k19N48n22j0O34o60p1L15j44J07N90p45o1M68m37J59J08
$$ plain form
2124 -500 -18 77 -292 -215 332 -246 232 271 -136 272 150 -128 449 239 -122 465 -127 -26 560 -33 71
2145 71 403 -121 176 430 -319 -87 599 53 344 266 -85 376 287 -418 408 20 -172 45 -356 -514 495
2166 495 -257 -185 75 -251 7 -171 -477 28 185 -493 -149 -77 -340 52 82 -718 -101 163 -238 262 -167
2187 -167 -411 304 -213 -172 244 -302 -52 339 -209 203 230 -90 495 421 -124 215 213 -292 425 274 23 458
2209 458 147 -271 499 -57 -134 584 41 -4 25 -184 400 105 -436 -65 -21 -401 61 45 -343 151 51 -646
2231 -646 175 -94 -346 126 -226 -270 202 -259 -433 132 -372 -437 -15 -355 -4 436 -40 420 259 -316 131
2252 131 143 -353 349 14 -240 455 -92 13 318 -371 215 521 -305 60 172 -204 478 166 -406 173
2272 173 404 5 294 -18 -237 311 -211 -221 413 -247 -318 -3 -147 -40 550 -195 -256 212 -225 -66 42
2293D2n72P35P9p79L26K07m89P10m02k30P58k22m65N58n15K31K30n12N01J60k00
2314A51oJ22l45J32L65m89M56j65m00L47j46m12P79n01j95N68m72J05M60p93L48
2335i1K60m99K90q5l38N38J3m82M80j13l20K80Oj46M70p87J82M10m01K67L32n11
2357b45N1N04n03R6K57m68N61j90n15O14k56n3M07k40k05P80l63m09O48l26n5
2378I0L25p56L89N45o92K14P0l81L07K89o10K40L0l74P80l62k08O9j01m1M39o00
2400c38N0N73n44M5L20k41J10J69n30N01k47l76N99l0n85P42j43m53M11Nk9M82
2422D91k90n44P70n01K68J41p50P12rm12L91m5m66O34k38j70L97m11k96M39N4
2443A65l10P50m22m77M37j83N7K23l89Q7N6j92L34L2l04O3J69m50N30j50o47P05
$$ plain form
2293 42 -530 205 284 -495 -169 38 -451 259 -143 -373 385 163 -302 256 -259 -28 202 -310 191 351 151
2314 151 145 267 -78 54 419 -70 386 221 -179 168 22 -390 389 -112 -307 261 -211 -106 354 -439 -91
2335 -91 169 -330 -40 -125 -463 75 88 -394 86 -27 -347 -67 -61 -207 263 -524 -342 68 -333 -66 266 -245
2357 -245 -194 310 -193 -97 160 -308 253 63 -452 162 -94 -147 260 20 -185 595 232 -177 471 145 90
2378 90 415 -341 48 593 -99 115 185 -196 111 400 -210 30 60 -314 466 104 -104 -35 -136 -177 262 -338
2400 -338 -288 285 -259 -214 106 -135 -25 144 -386 115 -132 -508 91 61 -524 218 75 -378 33 38 9 491
2422 491 201 -343 427 -74 194 335 -415 297 288 -124 267 222 -244 390 152 -18 379 -32 -328 111 165
2443 165 -145 605 183 -294 143 -40 17 240 -149 -62 -6 -198 136 168 -136 -73 96 -354 176 26 -621 84
2465H4o2l32M81j84rJ52k72K0M70n87M33N1l99J34K40m52L42J86m37L43m03m8
2487b49O17j14n56O01n23J7L36j07n5M57m71J07K62m60L54k08m24O25j20l09M58
2508B38j05k89K90m91k63P23m36j8O52o10K10N74p01M5N15n30O9M03n96L49R9
2529A28k61L22L2l52L60k24l74R65n95j17L87j35k91L81l16L5L77n33J67K69m27
2550b02M15L11r86N82j95j96O81k78n44O40m68j28O22k60j61K94l44L04k5j24
2570f2j75K96m05M75M2n34N59k85j08K29j13j55O38m11j23K83l55J8M65n07L07
2591G9J85l05o9L25l69M76j03k35L77k10k93M22j25m30M81j62k17K67l16K37L45
2612C60m56J47J33l68J36J97o00P19j02l26J54L15m86L90o7n20O96o88J92J69
$$ plain form
2465 84 22 -310 171 -13 -22 130 -142 -122 348 -239 194 245 -154 -20 220 -232 110 296 -141 202 -201 -249
2487 -249 368 254 -302 299 -224 -207 129 22 -33 424 -47 60 322 -138 216 8 -416 209 89 -220 238
2508 238 133 -156 134 -357 -620 103 -333 -351 301 -309 -99 475 -226 -181 334 -196 -127 276 -320 29 128
2529 128 -133 189 221 -131 229 5 -369 596 1 -116 271 136 -155 226 -90 -55 322 -211 -44 225 -202
2550 -202 213 524 -462 120 -75 -271 410 132 -412 228 -240 -368 254 -6 -167 127 -217 87 62 -62
2570 -62 -237 59 -346 129 171 -363 196 -89 -197 32 -81 -236 402 -9 -132 151 -204 -186 279 -228 79
2591 79 264 -41 -110 215 -154 322 219 -16 361 151 -142 280 155 -275 206 44 -173 94 -222 15 360
2612 360 -96 51 184 -184 -48 149 -451 268 166 -160 -6 309 -177 213 146 -374 322 -366 -174 -5
2632el16L13K1l21L46r6o3J15L81q02N54J35m95L52j66k78N17l08k56P09m82O
2654a39M44n14N2L54l18J76J04j31J67K25q17N22K90n35L13j12n86P65m9l92L80
2675A99k88L0J26j02k38N37n30kN16k00K3r6m44M09n9q4M73l01j02K71l02k19
2697c83P18j66k98K22k50o9M11k61j29O40m77K87k0l93L83Kp44N35K17n75K81
2718f9j17o2J65M7k04N77l31K3K30k24j06J77m16J81N03p26M47n6j48L50k10q0
2740d9N5l31J16L87N1n71N14l16J41K17l08j40L59l57J0N05m28M14l03j37N02
2761C31j40k74o6L4n6M09l30l3M00l15k54P56p23K96J87m56J59J38k59K56J16
2782A76n89M60J19m25L78j6k35N37m32m3L66m07n9K24l54K01L38n93N82j39r4
$$ plain form
2632 -5 -321 -8 13 -308 38 -58 -121 -6 375 -427 127 262 -233 119 -47 -325 192 -116 -372 337 -145 -139
2654 -139 305 -209 -157 197 -121 55 159 28 195 420 -397 125 415 -120 193 81 -505 260 211 -181 199
2675 199 -89 -59 67 -35 -273 264 -266 -268 248 48 71 -25 -469 -60 -119 -203 270 -31 -133 138 -164 -383
2697 -383 335 169 -129 93 -157 -226 185 -76 -205 435 -42 245 225 -168 215 217 -527 8 225 -350 -69
2718 -69 -186 -248 -83 -36 -240 337 6 29 259 35 -71 106 -310 -129 374 -352 95 39 -109 241 31 -49
2740 -49 6 -325 -209 178 229 -342 172 -144 -3 214 -94 -234 125 -232 -222 283 -145 269 -34 -171 331
2761 331 191 -83 -149 -115 -171 238 -92 -125 275 -40 -294 462 -261 35 222 -234 -75 63 -196 60 176
2782 176 -413 47 166 -259 119 103 -132 405 -27 -70 296 -111 -170 54 -300 -99 239 -354 228 89 -5
2803eJ65J3n93M74J85m27L12K0m91L00R5k67L56K04n78J46k8j45N73j75k00K01
2825A35p5k7kj97R0L1j81M73N3n37M00Qm81P15m35oN5l7r2J45l73O16j54j01k00
2850a77K44m36L79Qk01J72j2l28O49m72k20N88k82j77N39k38l12N86m38K21M6
2871A39l21o7M28o33M26K39l93L33j05k38J29P8m19O37m18o3L56k30J40J14l36
2892b04m8O57n27N09k30o3K41n01P2K60k05k86O63k89k50O65m15k81K76j30j55
2913b41K52k6p9R6m6j65L26j84n6L47n57M93o0l87N52k02n01P85l76k57M38k66
2935a14Q6K90m10n2K72l01L18pk49K97J45l02J4J20l52L79J1K50k59m88J93J68
2957In9J0L52k72k08M04m33K0K74j08j97M03n8j03l9m02N94k08N2L43o75o2L77
$$ plain form
2803 -5 160 173 -420 54 239 -188 124 144 -347 -47 48 -219 137 341 -237 -91 -119 -264 309 134 -66 135
2825 135 60 33 31 -166 -76 -45 -226 247 300 -237 163 171 -310 405 -30 -36 19 -18 -110 35 -338 278 124 23 -177
2850 -177 67 -369 10 18 -183 -11 -23 -351 298 -174 -394 194 -88 -265 274 36 -276 310 -128 93 139
2871 139 -182 -249 179 -454 -28 211 -182 151 46 -192 -63 15 -404 233 -185 -248 108 -122 18 132 -204
2892 -204 -252 405 -122 387 157 94 335 -166 -94 166 -39 -325 338 49 -201 464 49 -232 44 -86 -241
2913 -241 11 -15 -94 2 -44 -209 117 -67 -123 224 -333 160 100 -287 265 63 -438 347 -29 -286 152 -114
2935 -114 -28 262 -148 -200 72 -229 89 82 -167 130 275 -27 -13 107 -245 134 145 395 136 -352 -159 9
2957 9 -50 -40 312 40 -168 236 -197 -177 97 -11 -208 195 137 34 -5 -407 187 -21 31 374 -301 -363 14
2980A4o6l66P23n78K77K47l09R7J37l12J02K32k13K36k05j85L38k59j52L90O6
3001B14p9l6k30J35J29k80K0M12l55KJ35l12L50J31k87q3J75l31L42R5k06L09
3023B50l49k68M53J03J4j71j91K1L09k91J02K44n16J4K55q8M3J28k07J36l2K2
3045a9J60l23Q9K53K7n69Q09m48j52M05m70J04L48j31P5q1l72M90j87k25K80K3
3067H6r8J38L51l60M0j04M8j80Q9J5k0j27j88P54o79J36K58m03M30j2m97L58k60
3090b25K7M31j45m20L92j73j57L82n1L5N6l50J72J97n56P84k85k59K18J6k84M64
3112B69P2o05M51k56Q2N9j49k26M87Jk43L94j11j24K0j30J17J01l06q9L26k32
3134i2k34K57l88N47k46L8K67j52j25M80m43M6L75k75j83K73j58M3J85p65P03
$$ plain form
2980 14 -52 -418 305 -273 4 251 -58 39 176 -136 -34 198 -15 221 16 -169 169 -90 -242 148 214
3001 214 135 99 -131 4 133 -147 -127 285 -70 -68 67 -245 105 236 -51 -134 41 -290 52 147 -59 250
3023 250 -99 -367 86 189 203 32 -159 -138 171 -120 -18 226 -290 -276 -21 -109 -66 62 -145 -9 -41 -19
3045 -19 141 -182 -93 160 187 -382 427 -21 -173 232 -238 -134 214 83 158 77 -295 195 8 -217 63 86
3067 86 -12 126 477 117 157 53 101 -79 10 25 5 -122 -310 444 -235 -99 159 -244 186 174 -323 35 -225
3090 -225 -198 233 88 -332 60 -113 -270 112 61 96 152 -198 -26 171 -385 399 114 -145 73 89 -195 269
3112 269 341 -264 187 -69 13 72 -77 -303 184 185 -58 336 225 101 121 -9 108 209 -97 -186 140 -92
3134 -92 -326 -69 -457 90 -156 -118 149 -3 -128 352 -91 -45 330 55 -128 145 -13 30 215 -550 153
3155A53K7l14M64l54j49K05r3r1M04j82j15K31j43J61k21j30j63P15m08j67M15
3176B45l60O2M16p38M35J86n52M85j41l17L88l93k01O92k36M19m8m43O9J04m7
3197B5k70M63l62j72K65M3K21l38l65P51k52k55M83j50k97L61k2j51K56m43r9
3218c08M49k8P5k5l01M11M8l77K04j36M8J76k11k71M04j42n1K06k1k70L20k20
3240b0J04Qm1O7p7J5j38J60k21L05j45j11J05O8k38J75qj90k0J97l1J45l71Q0
3264a82k4R6K6K52l04J45K36k62lJ58L5N4Qk80J86l8k90N64k65l90M20m57J13
3287b02N07l59P9j8k49O0K38k90L78m5j57M06k52l74L69R4n53L52pk18M75l91
3309a57K1L10m15M5K30k94L67L3j84L11l04j85M33j44j23L03m22M7K94Q3l62M3
$$ plain form
3155 153 180 -134 330 -24 -173 32 -61 -152 252 70 -45 186 43 204 -17 -147 -310 405 -3 -170 245
3176 245 -115 -53 363 -375 60 246 -306 179 38 -279 109 -284 -485 207 -29 390 342 -101 -32 72 25
3197 25 -245 218 -144 -316 -51 -8 213 -125 -490 261 9 -246 237 87 -210 151 129 -22 234 -209 -308
3218 -308 141 113 188 163 -138 273 321 -56 148 12 60 236 25 -246 158 16 -35 171 150 -120 200 -20
3240 -20 84 92 51 118 41 56 -82 78 -143 162 17 -94 11 79 -159 16 8 -182 -202 -5 -36 109 -262 -182
3264 -182 -206 -110 -84 168 -136 9 245 -17 -20 138 173 227 235 -45 141 103 -187 377 112 -278 142 -315 -202
3287 -202 305 -54 25 7 -242 -182 56 -234 144 99 -58 348 96 -278 91 185 -368 -16 -23 -241 234 -157
3309 -157 -136 174 -241 -196 34 -260 107 140 -44 267 -37 -222 211 67 -56 247 -175 -128 166 249 -113 -70
3331g0j25K93M61o21J11j89O4J96k12r2K86J81l78K13j07k74M12J51l51J03j12
3352f0k7K79k23j56O46l25j60K01m35K50K25l87M48j47k60P8o0j58L86m3k05J09
3374b4k6m0K05N6n20M73l76r9M73n06K67L29k14J71O9l23L30p1m39O38n59r8M25
3397A41n3k90K10j78R4K47m95P1O07p90L83K68k10K4m1j41K04O6k36L87M1l54
3419d5P7q9P5J61j26k06K80P1k35L01j99J5J69j80K7K03m31K00p2j13jL04m36
3442b50M36j81m1K23j96K51R8k46LJ59o11K98J88m68P37l6k99R2J72m84K23K32
3464C00m27K71l14L06k61K98l70L54j67j61K25Q7%K61o92J48K89j98M33j73j64
3485D5J99j33k83N38m57k7K11o4J2j29K21k13L73k62K2J00j81J49J11l05J21J77
$$ plain form
3331 -70 -195 98 559 -62 49 -140 -76 120 -92 -184 102 283 -95 118 11 -263 149 300 -51 52 -60
3352 -60 -87 192 -31 -187 459 134 -26 175 -260 -10 215 -172 276 129 -131 -53 -113 -271 115 72 -133 -24
3374 -24 -50 -90 115 171 -349 124 -252 -351 122 -384 -117 212 -2 169 238 -85 245 174 -265 373 -186 -284 141
3397 141 88 -202 8 -170 -76 171 -324 -253 354 -436 -53 215 5 29 -12 -153 51 117 -119 268 309 -45
3419 -45 32 -57 18 179 53 -153 127 198 -37 264 65 80 249 69 96 299 -132 68 -4 -117 -118 186 -250
3442 -250 186 5 -36 187 -9 242 340 94 97 256 -355 -57 131 -337 400 364 65 157 329 -155 68 300
3464 300 -127 144 -170 136 -125 173 -197 157 -10 -171 54 141 141 402 -290 -142 147 -51 382 209 45
3485 45 244 111 -172 366 -91 -118 93 29 41 -88 133 -80 293 31 53 153 -28 121 232 -73 48 225
3507B25j72k13L43n02L93j63qR0j80J33L39l24q2L12l28N9L37l54R3J81l38M04
3529B45r7l1j19P5m91N17j34j04M81l20j61K72j00p2L56n40J42M4p4q7L76p8l59
3552b59K96k78M19r7n8N9j16k61N10l77oL51m73K00M49l38l7K56m63L30J46m04
3574a51K70j33R8J82j94k43L61j42l64L32L55j37J3l14M1K84o46L15L15k48l7
3595d3K80n06J24K21k66K84J36j22J33j48l03L42J19o49N34k43k09N13m32OO19
3616C90l59r1q3p8K90r5j04j84N74l77N40m79l84O01j68l03N66J08n37M52l12
3637c3PJ58k20P3P7k46L17m7m3J21l36j44L91k9q0K59r1k77K78j80r4M9J68k05
3661a27K81k27J77Q9m73L27J2j42l7M11l35K50k14N1j9q9J56j08PL8K15l69j72
$$ plain form
3507 225 53 -160 183 -319 74 -89 -97 -7 -187 -54 285 -39 -121 191 -137 -78 259 -95 -2 179 -159 245
3529 245 148 117 -2 73 -418 99 -35 -139 342 22 -139 133 33 -39 317 -223 -81 -37 -111 -198 178 100 -259
3552 -259 37 -241 178 81 23 82 -34 -295 215 -162 -168 183 -290 -90 359 21 -16 240 -223 107 253 -151
3574 -151 119 -14 84 266 72 -171 190 48 -316 16 371 234 247 -67 -26 258 -388 -73 242 -6 -43
3595 -43 237 -269 -145 76 -190 94 230 108 241 93 -210 132 251 -398 136 -107 -316 197 -235 -229 390
3616 390 31 -60 -143 -221 69 -26 -130 -314 260 -117 423 -56 -440 161 -7 -310 256 364 -173 279 -33
3637 -33 -26 132 -88 -15 62 -184 133 86 43 164 -172 -316 75 46 -34 225 134 -143 135 -45 -139 -90 78 -127
3661 -127 154 -73 104 193 -280 47 59 -83 -120 291 -44 206 -8 43 24 -65 91 -17 -10 28 243 -126 -298
3684b98M05k38K82Q6l01M2J7j9K40j73k53J24J51l4Q5j48k57K52J41l33M14l47
3706a62J82j3j51K27J16k84K3J00k44L69n3j30L70j29k16K38n48J65K19J9j05
3727gl7M6k33K85k74N04j52j56p8L02k51NK18j05J17M5m91M47P4m09L86j61l55
3750b80J71O8k06L75j22l8Q1j81rK17j05J21K42l12J1k49j16M75l33J56L32j82
3772A16j52L72k37j98M91n37L48r4l24K23p4j24K11j15k12L86l23R4J75k05J40
3793c9K70j33k76M83k04j08K18n14Q7N46k17k02j2m5j17L72r9J04J62l82J59k4
3815B9j19L51l82L8M8o9k0N69n11k87L75j55K01O8k97L96o0l03M3J71l14L56n4
3838G4k72L78k38k66L44j22k2L98k83j58K04j84L15J47l90J32J19k24J73P0k05
$$ plain form
3684 -298 107 -131 151 237 -64 -22 -5 -24 216 43 -210 -86 65 31 116 -32 -289 -37 104 -229 185 -162
3706 -162 20 7 -144 83 199 -85 -62 38 -206 163 110 -20 350 221 5 243 -305 -140 79 98 -7
3727 -7 -44 2 -231 54 -220 284 132 -24 -102 200 -51 -46 172 67 184 229 -262 185 259 -150 236 75 -280
3750 -280 -109 -41 -247 128 6 -32 49 -132 -141 76 -29 92 334 22 33 -216 -332 143 -190 -34 298 116
3772 116 -36 336 99 -99 392 -145 203 109 -215 8 -66 -190 21 -94 -306 80 -243 -149 26 -179 -39
3793 -39 231 98 -178 305 101 -7 211 -303 -216 330 113 -89 -101 -146 -263 109 10 114 276 -106 53 29
3815 29 -90 261 -121 -83 -35 -104 -124 445 -66 -353 22 -133 68 136 -161 235 175 -128 -85 86 -228 128 74
3838 74 -198 180 -58 -324 20 -102 -124 274 -9 -167 37 -147 168 315 -75 57 176 -48 125 195 -10
3859a0J8L23l05n2N9j77K13j29N8Q7l71K76K40Jj32J0j92K15m9k47J7M2M6j1K20
3884A50o10O31j57k18L93j51k62K85J30k47K05l35J1R3K46j20J88l67J4L20m67
3905b68M33k8k79n5K12q1K55l60r5K16J16j25L42k81j40J66p1N5P6m79M60P4l54
3928b11J52J75k72O49n74j51L85k45J70J49l86K7L72l83J90Q2j41o7k7Q5Q3j60
3950i8j21L22K29l39K97l35q5K3J73k86K01J61k93L04j43m7J24k63K70k05N8R9
3972D6O9l1L1j43j81K83J56l88L90k76K07R2m06J74J84j82m1J08j55N4K19k63
3994e3M6K64m70K98j93Q8Q6j2k28J92J49kq0k07Q4K64l04K45P7l60K51K17o05
4017b53L54j73q6K93p2j69M61R1o30J90K6J4L15k73j94L56k48k27L95k72j6K75
$$ plain form
3859 -10 8 331 26 -26 33 -144 69 -60 -2 85 -286 -10 230 231 99 109 -83 132 83 -164 -147 -105 -59 -70 150
3884 150 -460 171 14 -204 189 38 -224 61 191 -56 149 -186 -175 -82 164 44 232 -135 -121 199 -268
3905 -268 165 137 -142 -197 15 -66 189 -171 -266 -50 66 -59 283 2 -138 28 -43 12 88 -391 69 143 -211
3928 -211 -59 116 -156 493 -81 -232 153 -92 78 227 -159 -132 240 -143 47 129 -12 -79 -106 -21 62 -98
3950 -98 -219 103 332 -7 290 -45 -130 -107 66 -220 -19 142 -151 153 10 -37 87 -176 94 -111 -53 46
3972 46 115 84 115 -28 -209 74 230 -158 232 -44 163 255 -151 23 207 25 -16 92 -63 -9 210 -53
3994 -53 -7 257 -213 85 -108 -20 66 54 -174 18 167 165 85 -122 -38 226 -78 167 244 -116 135 352 -253
4017 -253 101 -72 -158 135 63 -106 355 446 -184 6 32 46 361 88 -106 250 2 -225 170 -102 -118 157
4039A57k62R2L39n50M52k23r8L49k77l50M84k01k3J16P9l14N30j94r9L37m46J08
4061FJ78j31J90k72l3j25J50K7R0p9k99M10l87K88R9o9n48O32m37L87J8q9O0J97
4085B63m73Q2M46m14o2N06o72M00jm2K94j89m96P33l00k6k84KK79J68l03r9K19
4108C1j29K54j94m00O13j71j58RO9j72J73M7OJ22j72l86P31l06l6J81l15Q1M62
4131C40l30k22L27l35K24K14j74j45K22l40O79p9l64K9Q3j34J91k01K4K32o9r8
4153G4o5l16L27J09j91J83o1k12L40l29j1K98jm43L51J04m53N16nj75L7j97K83
4176A63j75M21m95K33n6Rk2l02N05j35k03L01K61q10K15j34o1L62j12j69N57l32
4198B1N1Rj0j32L8j53L54j80j09q3J28M9J0N9r3n7M5j04L44l64qM21l09j31M73
$$ plain form
4039 157 -105 -13 326 -224 228 5 -93 256 -21 -371 113 -88 -111 5 84 -230 300 106 7 344 -102 6
4061 6 184 53 243 -29 -62 -187 -37 -10 80 1 -298 112 -275 13 112 43 -505 127 -310 77 95 6 66 263
4085 263 -210 -128 318 -96 -158 348 -324 76 75 33 327 138 -358 375 75 49 -235 -233 46 214 -89 -188 31
4108 31 -98 156 -38 -438 175 4 -154 -145 -76 -248 -75 -28 -22 100 -72 -458 273 -33 -69 112 -203 -122 340
4131 340 10 -212 115 -220 4 218 44 -101 121 -219 460 381 17 46 129 -5 186 -15 9 241 172 74
4153 74 9 -307 20 129 -62 121 60 -152 188 -141 -152 146 145 -298 53 157 -296 220 215 40 77 -120 163
4176 163 -12 409 -86 147 91 100 78 -224 281 146 -57 244 505 -305 -90 -224 -285 77 -35 -204 353 21
4198 21 72 81 71 -61 -23 -176 178 -2 -111 -194 -66 -17 -7 52 -41 -98 -53 -157 187 -177 -185 236 -73 -204 269
4223B69J7n19K91p9k5j4q3R4Nj08J90j26J56j48J65j96J98J94l06J08o6j99L22
4246A40q5k17P76q44K93k3j67R0L01m06J04j53R1K40k81lL52l76J69k6n8k34M29
4269A12r9l6K80l53P2O4j60J80m6r9J59j30rK78l44J36J09L6m01L95j29k48M35
4292B02l96J0M9K93l27L96m89J19N2PJ05p9l6M06m22J80j34j21K74k47J0O2L06
4315B20k32p3K95n36L55r1M3J66j68l7J01J6l03O04l44p1J36j19j43L84l52Q2
4337f7J89j75M5J29k60M5K07j27M1j1m3J65N5j05J55m68J83O9j10O2J92j03k72
4360b04N00l71J76k3k2k32K68J6L6J17k59M00n11K31Q7K06n90J51O6j63L27j96
4382A0r1K5j3J82q8n4j5P8j85J4L96m54J94j5k40N33k79l18N46m50k1J76oK78
$$ plain form
4223 269 286 -233 58 -21 -46 -60 -143 -49 -44 -152 38 -88 68 -80 85 -111 87 281 -25 83 17 -182 140
4246 140 55 -162 614 -230 63 40 -127 -37 264 -142 -38 -191 -100 140 -141 -144 208 -168 1 -25 -83 -317 112
4269 112 13 -23 257 -96 -24 40 -120 60 14 -85 74 -56 -65 213 -131 5 114 150 -251 144 15 -233 202
4292 202 -194 -184 -135 158 -169 227 -262 -143 -91 -84 21 -58 -94 312 -110 70 -64 -185 89 -158 -148 -86 220
4315 220 -12 -85 210 -326 29 -62 -19 147 -21 -58 43 59 -244 360 16 -55 81 -38 -181 203 -149 -67
4337 -67 122 -53 -8 121 -139 -94 113 -14 27 16 -27 138 193 88 243 -225 -42 27 -83 -21 171 68 -204
4360 -204 296 -75 101 78 56 -176 92 108 144 261 2 402 -109 122 209 415 -175 -24 42 -121 206 10
4382 10 -81 -56 -69 113 25 -29 -44 34 -151 -137 259 -195 -1 -16 -256 277 -2 -320 226 -224 -245 -69 -75 203
4406B03r3j58j21L46l37J60J40n9n8n8J14k40M63k60J53j68n1R1r4j21N8L08k53
4429c5p1j76L00M4j17j40L40K15j67n4Q1k48J95j94J78k20l44M30J01k30P2j09
4451a49k10O27k52P3L35m54J69j80j58K20K14l99K66j77Q1J61R3j97J19m11O1
4472a68J83L8q8P1J37k00K34j92r7J39O6j89J06qp1R1J8p2K5M0l7J21k97M04k39
4497A5j31J79L3nj9o5j70M27j75j55N0NJ37n4k78L73n9l61M16J3k22J17j58k14
4521c01M52j78J56M8j75p1K02k11q1K70k57J07K59k47J63N5j03k8J2o0K13m60
4543b35O1L00l81L48j95M4J09P6j88j57K33k26K90r9j77K07N8l51K71k76L33j65
4565a20J61j29k8K17j88J65L1k26J34o2j8J48p9J0j67J64J41l63J2M31l73o9M14
$$ plain form
4406 203 110 -48 -169 177 -160 0 140 81 23 -35 79 -161 302 42 195 27 -24 67 -27 -148 -90 218 -35
4429 -35 -106 -282 18 62 -55 -195 145 360 193 139 220 -28 167 -27 151 -69 -413 17 118 -112 -40 -149
4451 -149 -359 268 16 89 424 -30 139 -41 -199 21 235 -164 102 -75 6 167 260 63 182 -229 -168
4472 -168 15 53 -35 36 173 -27 207 15 -82 57 123 -66 40 32 -39 52 70 -2 23 63 26 147 -150 254 15
4497 15 -116 63 96 91 72 7 -163 264 89 -66 -16 -11 126 72 -206 167 108 -253 163 176 -46 71 -87 -301
4521 -301 151 -27 129 177 2 -69 133 -78 -159 111 -146 -39 220 -27 136 191 88 60 72 12 225 -235
4543 -235 -174 126 -255 93 -102 -58 51 127 -61 -218 15 -211 79 -20 -197 10 68 -283 -12 -288 45 -120
4565 -120 41 -88 -116 101 -87 78 109 -117 17 -45 -63 85 6 16 -151 13 154 -209 -197 234 -139 -208 206
4588B06k64L3j15J87k32K82k17P6L7j1N2L9j43J18j83k9K14K2l6M0q5n2R9R2l48
4613b18L98j27o2K67n52L26M7O4j66L77n58R2J37j2n3R2j43K47r8J21O3l29k7
4636a14L68r6l02L08j32J74k34p9jK65k08kj85j46M40k35J75J87j02l04K83j3
4658D7r8K19k05r5J67m1l8J22j23K18r5k40J78o2M9Q2J13k93K11p7k48L01j67
4681g5J8J89r4k93K96l1R6j42K1j68L72k66o1Q8k22M68k39l12M50k49N0N27m95
4704g2p4L14N2j02Lk48j8M47k32j75K23j43n4O0j63K13K69m77J10K40l45J49j17
4727a40J8qn7k51L36O4J06K6j55k5PP3J8J6p0J72j25j43K00J2j38L00j34k80M10
4752B32j40J32k24j66J47K52m70J91l9p8J90j3l7O6J46k58m8J14r1M0j16J98j01
$$ plain form
4588 206 -58 -25 -140 47 -185 97 -120 -44 -7 -18 34 73 -70 48 -135 -164 50 72 36 76 -9 -61 38 130 -218
4613 -218 180 53 -9 258 -294 32 79 143 -23 354 -204 -112 25 13 -40 52 -91 156 58 179 242 -87 -114
4636 -114 254 158 -144 164 32 206 -28 -107 -108 157 -51 -53 -238 -384 56 -179 -4 183 81 -223 60 47
4658 47 -51 168 -37 -132 35 -6 -44 78 -45 173 78 -162 16 -46 3 85 198 -95 116 39 -209 92 -75
4681 -75 -57 132 38 -255 41 10 106 -36 -15 -183 189 -77 -138 -50 -272 196 -43 -355 95 -154 -104 423 -72
4704 -72 -146 168 220 118 121 -127 -145 302 70 -105 118 -25 -79 -19 -182 31 300 -177 -67 173 -172 -23 -140
4727 -140 -122 -130 -187 -438 -102 -38 68 94 -61 -86 -79 -6 12 28 -42 130 5 -138 62 74 -64 236 102 -178 232
4752 232 92 224 0 -166 -19 233 -237 -46 -85 -163 27 14 -23 43 189 -69 -117 -3 -94 -54 -170 28 -73
4775g3J16r2j24l5L01R4l41K92K8p2l6K70l76Q2j2j74L17k9k72L74m73K57j5J74
4799A81k44Q1P4n99P28k47O3R5j01k76N22m40JJ64k22J31K8k9N7N8o2J71j78j84
4823b28K64K3q3m6j0J76k7R2j43j00J40n7j55J11K81l51LJ80k62J96K38k79L5
4846bL42m36m2K49k25j94N16k65m2o3n8K85K40l27p2K56k79Q3K04o8j13Nj56L75
4870B13l23q4O76m59N1j10j8O6R3k9P6j96n5L29m44K02j06J1L0J17J0j47n6J89
4894C6q2P6n8P0j15l64L29J09j59N4L45j86J09r6k61M34k42k53M64l36r9J35K35
4917A45j72L48m14O7J28k35M05j58k70O4J5J6J13J42J3N2j70l08J57jO7K85l91
4940a02J2K30j43k1K23m84M06rj09j38J00o2n4R9k7jP3J32o7k19K09J64l00j3
$$ plain form
4775 -73 43 -49 -173 -208 93 187 -154 138 166 94 58 328 -48 34 22 -152 165 136 -136 238 -235 22 7 181
4799 181 -63 18 92 -507 221 -26 37 132 31 -245 277 -163 -162 2 -220 -89 -61 -90 -33 25 -37 134 -44 -228
4823 -228 36 59 -24 -70 -80 96 69 161 18 -82 58 1 -154 -43 238 -113 -110 70 -192 4 242 -37 -2
4846 -2 340 -96 -138 111 -114 -308 208 -57 -99 -162 -220 65 305 -22 -94 162 -117 -34 170 102 -11 -6 -162 213
4870 213 -110 -194 482 23 74 -36 -54 12 105 76 152 -44 -99 230 -214 -12 -118 -107 -77 40 50 -97 -153 36
4894 36 -46 30 -28 42 -73 -437 -108 1 -158 -104 241 55 164 68 -193 241 -1 -254 210 -126 -225 -90 145
4917 145 -27 321 -93 -26 102 -133 272 114 -156 -92 -77 -61 52 194 207 259 89 -219 -62 -63 4 289 -102
4940 -102 -90 140 -3 -24 199 -285 121 112 3 -135 -35 -97 -151 -52 -79 -80 -7 125 58 -161 48 212 -88 -101
4964a01M48m48j72K61q9J56k38J07PO6j65j7M92j57k24L74l62j13J50j41K73J87
4986B94m62Q6P0j30N27l85j37J49j92o3L80k84L47l1l02K37K4m12O73j22l64K16
5008A19j16J97j49N9l18L29m56L62J05l39nJ05J61J53j72k61R2L56k21J86r4l05
5030b12L07j66J1K14j33L0j65j8K15j4J0l9J33l83L61j18k91L5pK4N05j67l93
5053b61M93k21J02j38l1p5K30L8k76K03m21L68L62o38L26K7k55K88j26MP6n1k63
5076b39L25M2q1k91K88k03K72l05L55K20n96K64Rj74j10L89j79P6L7j2k59J36
5098c6K33j7j28j55L4J82k23L00k47P0J73Q6k26PmJ30q2o1m4L1k43N29l45J19
5122H3M3n6j1L35p27K35N1J26j25j8J37p8K05n57K95ln1K26n8m66O02l03P4M05
$$ plain form
4964 -101 347 -101 -273 -12 -101 55 -183 -76 -69 -3 -168 -185 307 150 -74 300 -62 -175 -25 -166 107 294
4986 294 -168 -82 -12 -142 385 0 -137 12 -180 -243 137 -147 200 169 -133 104 128 -284 389 267 -97 119
5008 119 3 200 51 110 -208 121 -335 27 132 -207 -212 -107 54 207 35 -226 -134 222 1 187 93 -212
5030 -212 95 -71 -60 154 21 51 -114 -132 83 69 79 40 173 -210 151 33 -258 -223 -230 -206 299 132 -261
5053 -261 232 11 113 -25 -56 -131 99 137 -139 64 -357 11 373 -265 61 88 -167 121 -5 -1 75 24 -239
5076 -239 86 128 47 -244 44 -159 113 -192 163 383 -213 51 60 -114 -224 165 -14 62 99 87 -172 -36
5098 -36 197 180 52 -103 -69 113 -110 190 -57 13 186 272 46 53 49 179 97 36 -8 23 -220 309 -36 83
5122 83 126 70 59 394 -333 -98 -47 79 -46 -64 73 -5 200 -357 -62 -65 -116 110 52 -414 188 -115 -41 364
5146C64l60J7n3p5J2K16j40l0l4r0L37q5o6M3J33l81L43j03j16J48P5j52k4o5
5170h6J03J52j80M6N3l75M56N5m87J49K2JK07j36q5K07j67O9j23Q9m0K37P5m95
5194b53M91j59l80K75j36J10J26N1oK87j69j21m48J55J41mj74J92j14J17K5j74
5216a68lK98j21k46O72m41k67R7J67j07J56l32K60K81m53K60R1n50N57j03k52
5237b04J92JJ3L8j63o4K44m9j94K11K7p7K44n95L60K1j53J38j87J03nK20j22L96
5261C95l95M3r0QOO1j85K17R9k69L7N67o72J05J09j81R1j96L74l67N6M91k00k03
5285i9j66K25k56J93J54k06RQ4K50l12m5J09J85j5r3L1q0rO6N6k91K13K00o85
5309d82M32R9l08L11k17Q9K68m72J50M40m18k6K50o4J73j12k80L20j77n4J28j30
$$ plain form
5146 364 4 21 -32 -107 -95 121 -19 -49 -83 -173 164 79 13 56 189 -192 151 48 -68 80 155 3 -21 -86
5170 -86 17 169 -11 35 88 -287 169 224 -263 -114 -92 -91 116 -20 -105 102 -65 4 -119 -30 -70 167 242 -253
5194 -253 238 79 -301 -26 -162 -52 74 125 119 406 237 116 -332 -177 -36 -40 -214 -22 -136 -19 6 -168
5216 -168 -171 127 6 -240 432 -9 -276 -179 -12 -119 37 -295 -35 246 -207 53 144 -406 151 48 -204
5237 -204 -12 -11 2 40 -123 -187 57 8 -186 25 52 -25 219 -376 -16 5 -148 -10 -197 -94 -99 121 -1 395
5261 395 0 43 -47 -39 -33 28 -157 60 159 -110 -73 494 -178 -73 36 -145 -54 -250 124 -243 -187 304 104 -99
5285 -99 -265 -40 -296 -103 51 -155 -146 -62 188 -124 -169 -60 125 110 17 48 -32 -41 25 81 -210 3 203 -482
5309 -482 -50 49 -259 52 -165 -76 192 -280 -130 310 -108 -134 116 52 225 113 -167 153 -24 -78 50 -80
5331h0J65k01K71L5M0l63j0K20l44N05k95J50K58m48j1J73J12n29N07k53k17J53
5353a62N33m61k54M01j54K39n81M34J56k19k7j2J85n0p5j22L69j90j36L28j12
5374I0k81K61j49J02J17l59K14J60j41j12l2J1N8l2k14L68o4q0K09J66o60L59
5396iN9k76K24M5p2j09Q9k35J21J44P2M3L4p2k19J48J00k57J81M4J69k86J00j18
5420h0L94l17j25m3J44lj31K07q7J21k4m10N10k50o4L62j00k05N0j28J51n9L22
5443B35k58M7m5rL99k05k12n1K32k61L00p6j72K21L0l23J36p5O7J88l96M66m05
5466a67J77J05J31k39J63j58M2P3l13j4N34m57K96k93m9Q7m1R1Q6q0j11L14k22
5489d5p5M7K27m99L03J73l40K54J08j9J49j03k73K03k48J43j37M4L97l59NL76
$$ plain form
5331 -80 85 -116 155 190 230 -133 -143 77 -267 238 -57 93 351 -97 -108 65 177 -352 155 -98 -315 -162
5353 -162 371 -90 -344 57 -97 142 -439 -5 151 -68 -95 -107 78 28 -47 -169 200 10 -126 202 90
5374 90 -191 70 -79 23 140 -219 -5 155 14 -98 -130 -119 -61 -93 -307 61 -3 -83 126 292 -368 -9
5396 -9 50 -226 -2 43 -29 -138 -49 -284 -163 -19 53 96 130 58 -161 -13 87 -170 11 55 224 -62 38 -80
5420 -80 314 -3 -128 -171 -27 -30 -161 46 -41 80 56 -354 156 -94 -158 204 104 -101 -51 -179 -28 -87 235
5443 235 -23 24 -21 -30 369 164 -48 -99 133 -128 172 96 -76 145 175 -148 -12 -87 -20 168 -228 238 -167
5466 -167 10 115 246 7 170 12 54 127 -186 -200 334 -123 173 -120 -169 -82 -123 -32 54 -26 -137 177 -45
5489 -45 -120 -73 154 -345 -42 131 -209 45 153 134 283 180 -93 110 -138 5 -132 -88 309 -50 -45 331
5511C31l27j62L50j80j50L08k20J13J63l39L80j39L0k51L41k75q1Q5K26l48J61
5532A6k84L70O4L5j33J98j69n2l06J5N66k85m0J34J36k11L16m84K58k38k39M42
5554A09l2j86K04l4K7j62j68M75k00J69n43N88l03k8P9R2k52K92k82K87k15J10
5576B7j9J92l23K39j79M5k01K33k19J31m2k63L54j26N5K24J4k45J44o5Q7j12R5
5599D6M9k73K00k17N4m6K55P9l60L57j27N2R2k28QL27k16l1l60L42j44N7o5j51
5623c00L30k42K74R8l02K53j03k25M33n5k25J73k67J03M6l08J98k78J12M52L2
5644A99j62J4o1j58J04J78J9k89K22o9k1L69m64J81k6j35L69l09K69k62o7j7J30
5667A4j4k60M50k40M9k1Q8K42l35j2J02J3j86J11O0J44k58j02L91k37k46M39j23
$$ plain form
5511 331 4 -158 192 12 -138 170 -50 63 226 -113 267 128 158 -93 248 -27 -108 -23 203 -145 16
5532 16 -268 102 166 201 68 266 97 45 -261 -246 320 35 -5 129 265 54 370 -114 144 -94 -333 109
5554 109 77 -109 95 61 88 -74 -242 233 33 202 -341 247 -56 -84 -5 87 -165 127 -155 132 -83 27
5576 27 8 200 -123 116 -63 -18 -219 14 -205 -74 -116 -379 -25 -151 -96 128 142 -103 41 -24 63 -49 46
5599 46 95 -178 22 -195 -141 -187 68 147 -213 144 17 69 161 -67 -59 268 52 21 -339 3 -141 -84 -149 -300
5623 -300 30 -212 62 160 -142 111 8 -217 216 161 -64 109 -158 -55 -9 -317 -119 -397 -285 167 199
5644 199 37 51 -10 -168 -64 114 133 -156 66 -3 -24 345 -119 62 36 -99 270 -39 230 -32 -99 -116 14
5667 14 0 -260 190 -50 -1 -22 66 308 -27 -39 63 76 -110 1 61 205 -53 -155 236 -1 -247 192 69
5690F9PP1l94J82J31l30L55j7J18k33n4J43k98J85m6J71l61L34j91R7J07j20J01
5713B7r6P2j00J52j17J69k96K75q8k95J49J81j97L3K76q8j28K21k71J22J72k14
5735d1j7j76K45J42l5l7N1k80L66L5k97J16J54n06N04k75j56K01J75R0k71J28
5757A16j13R5j31J8j8N2j69J02R5m3J74l27M43k58lJ92q5l06J38j22k60K73L94
5780B57o06M96p8J39m2l48J80J72l27M83k26j97O4Mo9LL5O6J3J20rj75q0R4l6
5805f7jk0M78o80K99r2J85Oq9l49K79L30j96J51j85k75J99N8m6K18j69M4J14j45
5829D7n1n7j04J30Q3k63K54O6j14Q4m51J77M66n67K28K17j28K07j53j23j64M07
5851A91l23J75n8k31K61J8k00J71r4r6J8L56k47K29MO2k07K5J51j74n23N26j11
$$ plain form
5690 69 76 147 -247 -65 66 -264 91 74 192 -41 -95 48 -250 -65 -111 60 -301 33 -158 -61 46 -74 27
5713 27 -69 3 -97 55 -62 107 -189 86 -2 -297 -148 33 -164 -131 145 57 -71 150 -121 1 173 -41
5735 -41 -58 -234 11 153 118 81 132 -148 218 253 -44 72 226 -280 224 -51 -207 -6 169 259 -12 116
5757 116 3 98 -33 -15 -33 19 -150 -48 47 4 178 -149 294 36 33 225 140 -166 -28 -150 -410 -137 257
5780 257 -349 147 69 208 166 -182 -2 170 -157 326 100 -97 -33 -29 -98 -95 -60 6 19 139 130 -45 -125 -31 -67
5805 -67 -68 -88 390 -290 9 -83 102 108 19 -330 -51 279 83 234 49 -226 -27 31 -15 203 34 78 192 47
5829 47 -4 -61 -165 -35 48 -215 39 105 -9 75 -376 -199 267 -300 -72 145 17 224 71 -52 -216 191
5851 191 -132 43 -15 -246 15 33 -167 4 -90 -186 -168 188 -59 170 174 236 29 54 205 31 -492 34 -77
5874g7P5q6K1n9J97%j05N6l3m7J3L45n77L98R4k54J1p6K36j80j02j24K87R2J0
$$ plain form
5874 -77 -2 -88 -67 -126 71 71 -34 22 -11 -58 -45 300 -277 121 215 -39 -28 -104 132 -48 -150 -274 13 105 115
$$ [...]
8191A8
##END NTUPLES=NMR FID
##END=
