##TITLE=1H_Pr 2-5-4d
 DMSO, 8 sc, 
 29.7.2019
##JCAMPDX= 6.0         $$ Bruker NMR JCAMP-DX V2.0
##DATA TYPE= NMR FID
##DATA CLASS= NTUPLES
##ORIGIN= UXNMR, Bruker Analytische Messtechnik GmbH
##OWNER= root
$$ XWIN-NMR		Version 3.5
$$ Mon Jul 29 15:03:48 2019 Russian Standard Time (UT+4h)  she@DPX200
##.OBSERVE FREQUENCY= 200.13155
##.OBSERVE NUCLEUS= ^1H
##.DELAY= (6, 6)
##.ACQUISITION MODE= SIMULTANEOUS
##.ACQUISITION SCHEME= undefined
##.AVERAGES= 8
##.DIGITISER RES= 18
##SPECTROMETER/DATA SYSTEM= spect
##.PULSE SEQUENCE= zg30
##.SOLVENT NAME= DMSO
##.SHIFT REFERENCE= (INTERNAL, DMSO, 0, 15.7039)
##AUDIT TRAIL= $$ (NUMBER, WHEN, WHO, WHERE, WHAT)
$$ ##TITLE= Audit trail, XWIN-NMR		Version 3.5
$$ ##JCAMPDX= 5.01
$$ ##ORIGIN= Bruker BioSpin GmbH
$$ ##OWNER= she
$$ F:/spectra/data/she/nmr/H-F/1/audita.txt
$$ ##AUDIT TRAIL=  $$ (NUMBER, WHEN, WHO, WHERE, WHAT)
(   1,<2019-07-29 15:02:32.43 +0400>,<she>,<DPX200>,
      <created by zg, POWCHK disabled, PULCHK disabled
       configuration hash MD5:
       00 E9 B6 7A A2 85 ED C7 34 08 36 98 17 FE 4E 26
       data hash MD5: 16K
       48 23 D7 2D CD 10 93 B3 E6 BA 8B 39 F6 36 B6 C3>)
$$ ##END=
$$ 
$$ hash MD5
$$ 8F 30 38 78 A4 50 A2 60 33 D9 F0 7A 56 37 B6 CD
##$RELAX= 
##$RELAX= 
##$RELAX= 
##$RELAX= 
##$RELAX= 
##$RELAX= 
$$ Bruker specific parameters
$$ --------------------------
##$DU= <F:/spectra>
##$EXPNO= 1
##$NAME= <H-F>
##$PROCNO= 1
##$TYPE= <nmr>
##$USER= <she>
##$AMP= (0..31)
100 100 100 100 100 100 100 100 100 100 100 100 100 100 100 100 100 100 
100 100 100 100 100 100 100 100 100 100 100 100 100 100 
##$AQSEQ= 0
##$AQ_mod= 1
##$AUNM= <au_zg>
##$AUTOPOS= <>
##$BF1= 200.13
##$BF2= 200.13
##$BF3= 200.13
##$BF4= 200.13
##$BF5= 200.13
##$BF6= 200.13
##$BF7= 200.13
##$BF8= 200.13
##$BYTORDA= 1
##$CFDGTYP= 0
##$CFRGTYP= 5
##$CHEMSTR= <none>
##$CNST= (0..31)
1 1 145 1 1 1 1 1 1 1 1 1 1 1 1 1 1 1 1 1 1 1 1 1 1 1 1 1 1 1 1 1 
##$CPDPRG= <>
##$CPDPRG1= <>
##$CPDPRG2= <>
##$CPDPRG3= <>
##$CPDPRG4= <mlev>
##$CPDPRG5= <mlev>
##$CPDPRG6= <mlev>
##$CPDPRG7= <mlev>
##$CPDPRG8= <mlev>
##$CPDPRGB= <>
##$CPDPRGT= <>
##$D= (0..31)
0 1.2 0 0 0 0 0 0 0 0 0 0.03 0 0 0 0 0 0 0 0 0 0 0 0 0 0 0 0 0 0 0 0 
##$DATE= 1564398151
##$DBL= (0..7)
120 120 120 120 120 120 120 120 
##$DBP= (0..7)
150 150 150 150 150 150 150 150 
##$DBP07= 0
##$DBPNAM0= <>
##$DBPNAM1= <>
##$DBPNAM2= <>
##$DBPNAM3= <>
##$DBPNAM4= <>
##$DBPNAM5= <>
##$DBPNAM6= <>
##$DBPNAM7= <>
##$DBPOAL= (0..7)
0.5 0.5 0.5 0.5 0.5 0.5 0.5 0.5 
##$DBPOFFS= (0..7)
0 0 0 0 0 0 0 0 
##$DE= 6
##$DECBNUC= <off>
##$DECIM= 24
##$DECNUC= <off>
##$DECSTAT= 4
##$DIGMOD= 1
##$DIGTYP= 9
##$DL= (0..7)
0 120 120 120 120 120 120 120 
##$DP= (0..7)
150 150 150 150 150 150 150 150 
##$DP07= 0
##$DPNAME0= <>
##$DPNAME1= <>
##$DPNAME2= <>
##$DPNAME3= <>
##$DPNAME4= <>
##$DPNAME5= <>
##$DPNAME6= <>
##$DPNAME7= <>
##$DPOAL= (0..7)
0.5 0.5 0.5 0.5 0.5 0.5 0.5 0.5 
##$DPOFFS= (0..7)
0 0 0 0 0 0 0 0 
##$DQDMODE= 0
##$DR= 18
##$DS= 0
##$DSLIST= <SSSSSSSSSSSSSSS>
##$DSPFIRM= 0
$$ [...]
##$SUBNAM2= <"">
##$SUBNAM3= <"">
##$SUBNAM4= <"">
##$SUBNAM5= <"">
##$SUBNAM6= <"">
##$SUBNAM7= <"">
##$SUBNAM8= <"">
##$SUBNAM9= <"">
##$SW= 24.9336996594482
##$SWIBOX= (0..15)
0 0 2 0 0 0 0 0 0 0 0 0 0 0 0 0 
##$SW_h= 4990.01996007984
##$TD= 16384
##$TD0= 1
##$TE= 0
##$TE2= 300
##$TE3= 300
##$TEG= 300
##$TL= (0..7)
0 120 120 120 120 120 120 120 
##$TP= (0..7)
150 150 150 150 150 150 150 150 
##$TP07= 0
##$TPNAME0= <>
##$TPNAME1= <>
##$TPNAME2= <>
##$TPNAME3= <>
##$TPNAME4= <>
##$TPNAME5= <>
##$TPNAME6= <>
##$TPNAME7= <>
##$TPOAL= (0..7)
0.5 0.5 0.5 0.5 0.5 0.5 0.5 0.5 
##$TPOFFS= (0..7)
0 0 0 0 0 0 0 0 
##$TUNHIN= 0
##$TUNHOUT= 0
##$TUNXOUT= 0
##$USERA1= <user>
##$USERA2= <user>
##$USERA3= <user>
##$USERA4= <user>
##$USERA5= <user>
##$V9= 5
##$VALIST= <valist>
##$VCLIST= <CCCCCCCCCCCCCCC>
##$VD= 0
##$VDLIST= <DDDDDDDDDDDDDDD>
##$VPLIST= <PPPPPPPPPPPPPPP>
##$VTLIST= <TTTTTTTTTTTTTTT>
##$WBST= 1024
##$WBSW= 4
##$XGAIN= (0..3)
0 0 0 0 
##$XL= 0
##$YL= 0
##$YMAX_a= 168961
##$YMIN_a= -254218
##$ZGOPTNS= <>
##$ZL1= 120
##$ZL2= 120
##$ZL3= 120
##$ZL4= 120
##$ABSF1= 10
##$ABSF2= 0
##$ABSG= 5
##$ABSL= 3
##$ALPHA= 0
##$AQORDER= 0
##$ASSFAC= 0
##$ASSFACI= 0
##$ASSFACX= 0
##$ASSWID= 0
##$AUNMP= <proc_1d>
##$AZFE= 0.1
##$AZFW= 0.1
##$BCFW= 1
##$BC_mod= 2
##$BYTORDP= 1
##$COROFFS= 0
##$CY= 11.3945322036743
##$DATMOD= 1
##$DC= 2
##$DFILT= <>
##$DTYPP= 0
##$F1P= 20.1537800932815
##$F2P= 0.134698688090026
##$FCOR= 0.5
##$FTSIZE= 0
##$FT_mod= 4
##$GAMMA= 1
##$GB= 0.15
##$INTBC= 1
##$INTSCL= 1
##$ISEN= 128
##$LB= 0.24
##$LEV0= 0
##$LPBIN= 0
##$MAXI= 10000
##$MC2= 0
##$MEAN= 0
##$ME_mod= 0
##$MI= 1.114404
##$NCOEF= 0
##$NC_proc= 0
##$NLEV= 6
##$NOISF1= 3.799351
##$NOISF2= 2.8
##$NSP= 1
##$NTH_PI= 0
##$NZP= 0
##$OFFSET= 15.70392
##$PC= 1
##$PHC0= -9217.145
##$PHC1= 9.800967
##$PH_mod= 1
##$PKNL= yes
##$PPARMOD= 0
##$PSCAL= 0
##$PSIGN= 0
##$REVERSE= no
##$SF= 200.130013532006
##$SI= 16384
##$SIGF1= 3
##$SIGF2= 2
##$SINO= 400
##$SIOLD= 16384
##$SREGLST= <1H.CDCl3>
##$SSB= 0
##$STSI= 0
##$STSR= 0
##$SW_p= 3612.71676300578
##$SYMM= 0
##$S_DEV= 0
##$TDeff= 0
##$TDoff= 0
##$TI= <>
##$TILT= no
##$TM1= 0
##$TM2= 0
##$TOPLEV= 0
##$USERP1= <user>
##$USERP2= <user>
##$USERP3= <user>
##$USERP4= <user>
##$USERP5= <user>
##$WDW= 1
##$XDIM= 8192
##$YMAX_p= 0
##$YMIN_p= 0
$$ End of Bruker specific parameters
$$ ---------------------------------
##NTUPLES= NMR FID
##VAR_NAME=  TIME,          FID/REAL,        FID/IMAG
##SYMBOL=    X,             R,               I
##VAR_TYPE=  INDEPENDENT,   DEPENDENT,       DEPENDENT
##VAR_FORM=  AFFN,          ASDF,            ASDF
##VAR_DIM=   8192,          8192,            8192
##UNITS=     SECONDS,       ARBITRARY UNITS, ARBITRARY UNITS
##FACTOR=    0.0002004,     1,               1
##FIRST=     0,             0,               0
##LAST=      1.6414764,     0,               0
##MIN=       0,             -254218,         0
##MAX=       1.6414764,     168961,          0
$$ Real data points
##PAGE= N=1
##DATA TABLE= (X++(R..R)), XYDATA
0@%%%%%%%qJ6j6J6k4L2m0M8n6P2q7J01j18J36j58J85k12K43k82L23l66M17m72
$$ 0 0 0 0 0 0 0 0 -8 8 -8 8 -16 16 -24 24 -32 40 -47 54 -64 72 -86 99 -113 130 -152 171 -195 222 -250
30b50N32o00O73p53Q44r42J048j165J294j436J590j759J947k157K389k646K938
$$ -250 282 -318 355 -398 446 -496 552 -613 681 -755 835 -924 1023 -1134 1255 -1391 1547
47A547l268L644m082M592n193N924o834P998r550J1736j5081K0899l3875J15527
$$ 1547 -1721 1923 -2159 2433 -2760 3164 -3670 4328 -5222 6514 -8567 12332 -21543 93984
61I3984n8445k34576P1790J75246J20962n9335j17564j05261P908J07891J29914
$$ 93984 35539 -199037 -127247 47999 168961 109626 -7938 -113199 -105291 2600 132514
72A32514q656j35963j17294L8665J21541P6568l2196q5718p5965j202Q0616R6297
$$ 132514 123858 -12105 -129399 -90734 30807 107375 75179 -10539 -86504 -87706 -7090 89207
84H9207J96j02511r5389J8628R9931P2869k0534q2283o9550Q470Q3211P8951j3122
$$ 89207 89403 -13108 -108497 -89869 10062 82931 62397 -19886 -89436 -80966 2245 81196 68074
97F8074r2067o8487K8589Q6290N2333k6776o9917m7754J7463O6767N4234j5877
$$ 68074 -23993 -92480 -63891 22399 74732 47956 -21961 -69715 -52252 14515 68749 52872
109E2872p0886n1460K4640P2851M1700l0200o3198k7742K8321M5947K3019j0597
$$ 52872 -18014 -69474 -44834 28017 69717 39517 -23681 -51423 -23102 22845 45864 35267
121C5267l4751l8107p110M5918N9718j583p4193n9140L0257Q0273L0663m6544
$$ 35267 516 -37591 -44701 1217 60935 59352 -14841 -73981 -43724 36549 67212 20668
133B0668n9645j2143L3306M2893J8465k4628n0406k2211L7886N2305O88m5219
$$ 20668 -38977 -51120 -17814 25079 43544 18916 -31490 -53701 -15815 36490 37178 -8041
145h041k7199J4241K0560O226O035K892k0832k7697J0020M1780J7255k7539l0465
$$ -8041 -35240 -20999 -439 5787 11822 14714 -6118 -33815 -23795 17985 35240 7701 -22764
158b2764J169J7492J5238J0291m037k6214k2268J8002L8207N386l0850j9796R828
$$ -22764 -21595 -4103 11135 21426 17389 -8825 -31093 -13091 25116 30502 -348 -20144 -10316
171a0316J1922K000P732O609j9368k8440Q963M0255J3322l3189k9745J0524K4296
$$ -10316 1606 3606 11338 17947 -1421 -29861 -20898 19357 32679 -510 -30255 -19731 4565
184D565N137o941n122q525r672O443J9324O307j6017j5021Q41R196R590O602m146
$$ 4565 9702 2761 -2361 -10886 -20558 -14115 5209 11516 -4501 -19522 -18681 -9485 105 6707 2561
199B561j8101j1538J4584K3532K753k0197j6585M410J7652J2661l420j7169j0629
$$ 2561 -15540 -27078 -12494 11038 13791 -6406 -22991 -18581 -929 11732 8312 -8857 -19486
212a9486R563J7566K875j2190n916M981K798k695L847Q258l864j2658j961J1696
$$ -19486 -9923 7643 10518 -1672 -7588 -2607 191 -2504 1343 9601 5737 -6921 -8882 2814
226B814P258l596o045l372k773M129J1334K466j4434j0946J0739J4296o303j2618
$$ 2814 10072 6476 431 -2941 -5714 -1585 9749 12215 -2219 -13165 -2426 11870 5567 -7051
240g051M454R923p340j1608Q849J5930o192j9522r44J6563N771r354m014K129
$$ -7051 -2597 7326 -14 -11622 -2773 13157 6965 -12557 -13501 3062 8833 -521 -4535 -2406
254b406k829j035R865O747j2139j3289Q751J6188k811j3754P67J0023k225q818
$$ -2406 -5235 -6270 3595 10342 -1797 -15086 -6335 9853 7042 -6712 -5945 4078 1853 -6965
268f965N330J1484m523j4270O04J4279M316r810n292M347J771r39L074K645o964
$$ -6965 -1635 9849 5326 -8944 -8340 5939 10255 445 -4847 -500 1271 332 3406 6051 -913
283i13n861P223Q419n160r303L375Q413l459q079L570R030k922j0181J01Q652
$$ -913 -6774 449 8868 3708 -5595 -2220 6193 2734 -5345 -1775 7255 4333 -5848 -5747 2905
298B905K807n016l220K88J347K259K522k476n940R67P122N89p124j639P088K465
$$ 2905 5712 696 -2524 -2236 -889 1370 3892 1416 -4524 -3557 3565 4154 -2970 -4609 2479 4944
314D944p123l278O736M874n229m345J942K621J98J538M9n754k674P927O773p107
$$ 4944 -2179 -5457 1279 6153 924 -3421 -1479 1142 1340 2878 2927 -2827 -5501 2426 9199 2092
330B092r800N111J0392k873r410J829Q317k193p950K641P527j782p421J360N975
$$ 2092 -7708 -2597 7795 4922 -4488 -2659 5658 3465 -4485 -1844 5683 3901 -3520 -2160 3815
345C815k295l684L832K758o223l512P985N281q722p003P852Q147o714q999O120
$$ 3815 1520 -2164 1668 4426 -1797 -5309 2676 7957 -765 -7768 84 8231 1517 -7482 -1362
360a362Q655n169q644M293P846k729o752K120M295k303k004L558J559o568j463
$$ -1362 7293 2124 -6520 -2227 5619 2890 -3862 -1742 2553 250 -1754 1804 3363 -3205 -4668
375d668P756K404q241m226Q107N149p177o000N934O225m674n837L505M633k187
$$ -4668 3088 5492 -2749 -6975 1132 6281 -896 -6896 -962 5263 589 -5248 -1743 2890 703
390G03l309J293J154j405J72M012j901n158J343O642l96p301p31P118K010o525
$$ 703 -2606 -1313 -159 -1564 -1392 2620 719 -4439 -3096 3546 3150 -4151 -4882 2236 4246 -2279
406b279k303N550K077m517j612L209J447k550n04K382j474k169L248K412l702
$$ -2279 -4582 968 3045 -1472 -3084 125 1572 -978 -1482 900 -574 -2743 505 2917 -785
421g85m070L743N858m021o550L389O476k176o504J625N661j089n080Q66M275j238
$$ -785 -4855 -1112 4746 725 -5825 -2436 4040 1864 -4640 -3015 2646 1557 -3523 -2657 1618 380
437C80l301K030K116k838j983M583K271o036k941O502M729o615n352N602O418
$$ 380 -2921 -891 1225 -1613 -3596 987 3258 -2778 -5719 783 5512 -1103 -6455 -853 5565
452E565m961n643L871N095k751m391K728L164k908j461L745N33n002l65O676O16
$$ 5565 604 -5039 -1168 3927 1176 -3215 -487 2677 -231 -1692 2053 2586 -2416 -2781 3895 4511
468D511p332j929P685K971p173l606O074L569n388k973M387K358m389j395L966
$$ 4511 -2821 -4750 2935 5906 -1267 -4873 1201 4770 -618 -3591 796 3154 -1235 -2630 1336
483A336N69m027l2M425j055m554J277M792j307n586J517O099j337o306J117O449
$$ 1336 1905 -2122 -2154 2271 1216 -3338 -2061 2731 1424 -4162 -2645 3454 2117 -4189 -3072 3377
499C377L2n915p43N688L58l647K91K162m75j462K155J710l541k517M953L817m859
$$ 3377 3409 -2506 -3249 2439 2797 -850 -559 1603 1128 -334 1821 3531 -10 -2527 2426 6243 1384
516A384m751M423N734l733n274K394M959j973l781J237L358k085k201K506J065
$$ 1384 -3367 1056 6790 3057 -2217 177 5136 3163 -618 619 3977 1892 -309 2197 3262
531C262l323p26L761J177m982j980N695K185n424k947M061L239l709k768L072
$$ 3262 -61 -787 2974 4151 -831 -2811 2884 5069 -355 -3302 759 3998 289 -2479 593
546E93K049l059j428L586J018l842r71M030J286m135r11M057M67l956J38M238
$$ 593 2642 -417 -1845 1741 2759 -1083 -2054 1976 3262 -873 -1784 2273 2740 -1216 -1078 3160
562C160J48m991LN723L61o224j026O180K095n207k331L138J916j524q17J145j705
$$ 3160 3308 -1683 -1680 4043 4404 -1820 -2846 3334 5429 222 -2109 1029 2945 1421 604 1749 44
579D4j558L478L037m213n327L464O186k401o203P78N115j08m151N43K809j582
$$ 44 -1514 1964 5001 788 -4539 -1075 5111 2710 -3493 -2715 2400 2292 -1859 -1316 1493 -89
595h9k765K850L016l512l574L437L761k788l681K413M054k474l705L026L390k494
$$ -89 -2854 -4 3012 -500 -4074 -637 3124 336 -3345 -932 3122 648 -3057 -31 3359 865
611H65l113K690L088k683k255K787K236k657j639L092J125l053r87L267N98l389
$$ 865 -2248 442 3530 847 -1408 1379 3615 958 -681 2411 3536 483 -504 2763 3361 -28
627b8m16L829J26m742J68M789J44n864r79N629J823n971k700M306L155l015l628
$$ -28 -444 3385 3511 -1231 -1063 3726 3870 -1994 -2973 2656 4479 -1492 -4192 114 3269 254 -3374
644c374J511J277r13R02O78k770k556K487N011j613n925k25N220J606k943k125
$$ -3374 -1863 -586 -1499 -597 81 -2689 -5245 -2758 2253 640 -5285 -5510 -290 1316 -1627 -3752
660c752J070N81J28K122M96l814k056M735M271l844n059K208N321r77m131J027
$$ -3752 -2682 -2101 -1973 149 645 -3169 -5225 -490 3781 -63 -5122 -2914 2407 1430 -2701 -1674
676a674L071r56k193J923K346k823k722K787L746k103m649J706L508m33l043L25
$$ -1674 1397 441 -1752 171 2517 -306 -3028 -241 3505 1402 -3247 -1541 1967 1534 -1509 -1184
692a184J446r78l87J829n53k915Q2L875M96m712j110M373J438l907k213L863K122
$$ -1184 262 -716 -1103 726 173 -2742 -2660 1215 1711 -3001 -4111 262 1700 -2207 -4420 -557 1565
709A565l726j783L146J677k506j184L352l07k943O18M390p75n029j63N666K401
$$ 1565 -2161 -3944 -798 879 -1627 -2811 541 234 -2709 -2091 2299 1524 -3505 -3668 1998 4399
725D399n068k991L377K979j105j343j67o51M5K236K099l317m137K828N027j506
$$ 4399 -669 -3660 -283 2696 1591 248 81 -570 -525 1711 3810 493 -3644 -816 4211 2705
741B705n267L13M180j31k772K4J919j938j623K408K485k887m190K444M886j761
$$ 2705 -2562 -2249 1931 1800 -972 -948 971 -967 -2590 -182 2303 -584 -4774 -2330 2556 795
757G95m720J8L803K52k224l53J056q48j18J968P79l107j213L221K324k450k266
$$ 795 -3925 -3907 -104 148 -2076 -2429 -1373 -2221 -2339 -371 408 -2699 -3912 -691 1633 -817 -3083
774c083J976K141j545j379K084J078k398m91L191L17k659o27L311O01l448o00
$$ -3083 -1107 1034 -511 -1890 194 1272 -1126 -1617 1574 1891 -768 -1395 1916 2517 -931 -1531
790a531L929J312l834k080L756K138k748k374K125J534j228n94J312o52k341J066
$$ -1531 2398 3710 -124 -2204 1552 3690 942 -1432 693 2227 999 405 1717 1065 -1276 -210
806b10L319j182l638K72L476K73l114o68K376J53j809O74J562j611k092J620L358
$$ -210 3109 1927 -1711 -1439 2037 2310 -804 -1472 904 1057 -752 -78 1484 -127 -2219 -599 2759
823B759j588m026J316L877k35l682J72K433M96k148L16K086j633j859K168K496
$$ 2759 1171 -2855 -1539 2338 2103 -1579 -1407 1026 1522 -626 -310 1776 143 -1716 452 2948
839B948j619l373J399L172p78k309O30J519j279m50J305R30k733j242K637J550
$$ 2948 1329 -2044 -645 2527 1749 -560 70 1589 310 -140 1165 2095 -638 -1880 757 2307
855B307k203j780K062J820k478j498K611J210k608j507K615J292j916j742J891
$$ 2307 104 -1676 386 2206 -272 -1770 841 2051 -557 -2064 551 1843 -73 -1815 76
870G6J054j400j290K233N25k364o28K573O24k708l17K319P27k272k51J959L13
$$ 76 1130 -270 -1560 673 1198 -1166 -1794 779 1403 -1305 -1622 697 1424 -848 -1099 860 1173
887A173k309N01K138o53k075N02K642n88k990Q79K602l82k702P18K315p93k109
$$ 1173 -1136 -635 1503 850 -1225 -723 1919 1331 -1659 -780 1822 1440 -1262 -544 1771 978 -1131
904a131J199K031j425k134P64K497m72k398R7K086l09j682R36J247j443j400K186
$$ -1131 68 2099 674 -1460 -696 1801 1329 -1069 -972 1114 805 -877 59 1306 -137 -1537 649
921F49J246j512k556J573K414j499j945J435J292j573n81J498Q23j821j528K228
$$ 649 1895 383 -2173 -600 1814 315 -1630 -195 1097 -476 -1057 441 1264 -557 -2085 143
937A43J521j950j593K175R27j254j551J673J020j580j088K017Q56k136m63J790
$$ 143 1664 -286 -1879 296 1223 -31 -1582 91 1111 -469 -1557 460 1316 -820 -1283 507
953E07N59j771r97K224O24j823n06J738N36k169k55K177L4k239k06K783j63k051
$$ 507 1066 -705 -1702 522 1146 -677 -1183 555 1091 -1078 -1333 844 878 -1361 -1567 1216 1053 -998
971i98l89K038p9j715Q56J457n36j967O13J910m45k248L98K328p25j805R41J607
$$ -998 -1387 651 572 -1143 -287 1170 634 -1333 -720 1190 745 -1503 -1105 1223 498 -1307 -366 1241
989A241r68j518P59K157j105j954Q10J673o56j662R27J477j509j262J638J299
$$ 1241 273 -1245 -486 1671 566 -1388 -578 1095 439 -1223 -296 1181 -328 -1590 48 1347
1005A347j445j267J208J472j436j206J294J186j329j281J386J452j571o54J228
$$ 1347 -98 -1365 -157 1315 -121 -1327 -33 1153 -176 -1457 -71 1381 -190 -844 384
1020C84Q53j555j038J742R84j522j062J591Q98j719m70J550R86j867m65J780R0
$$ 384 1237 -318 -1356 386 1370 -152 -1214 377 1275 -444 -914 636 1622 -245 -710 1070 1160
1037A160j368n04J719J23j494n55J740n6j301j26J593Q6j807K3J851o2j748jJ862
$$ 1160 -208 -712 1007 1130 -364 -919 821 765 -536 -662 931 1017 -790 -767 1084 1022 -726 -727 1135
1056A135l15j776L61J568l66j678M98J430m63j223N24J265o72j406Q70J357p94
$$ 1135 820 -956 -595 973 607 -1071 -573 857 394 -829 -305 960 288 -1118 -248 1109 315
1073C15j366Q84R78l59j514R09J218n05j470P48J125p42j037P96J075j010p72
$$ 315 -1051 -167 811 452 -1062 -153 1065 560 -910 -162 963 221 -816 -20 1055 45 -727
1090g27R90R47j356j060J411J173j302j246J680R44j232j182J279R78j264j101
$$ -727 263 1210 -146 -1206 205 1378 76 -1170 510 1454 222 -960 319 1297 33 -1068
1106a068J766N56j691m45J293P32j476p23J413R95k118O1J288K32j584j22J681
$$ -1068 698 1254 -437 -882 411 1143 -333 -1056 357 1352 -766 -705 583 815 -769 -891 790
1123G90Rj462l6J401j33j285j02J532L20j518p3J208n7j381N8J856n24j553P36
$$ 790 799 -663 -699 702 569 -716 -818 714 1034 -484 -557 651 594 -787 -729 1127 603 -950 -214
1142b14J437o43j428J97J360L3j437K61J330l65j074K21Q56m85j212Q58J134o79
$$ -214 1223 580 -848 -651 709 742 -695 -434 896 531 -543 -322 534 49 -1163 -305 829 150
1160A50j587J329J055j022j174J064J029r18r13N86Q51o71p44R53N51j013j067
$$ 150 -1437 -108 947 -75 -1249 -185 844 -74 -987 -401 450 -221 -965 -12 539 -474 -1541
1177a541J378R09j005r67J022R01j004o30R40N30j098j97J308J7r17m69J308J15
$$ -1541 -163 746 -259 -1226 -204 697 -307 -937 3 533 -565 -762 546 563 -354 -823 485 600
1195F00j214j28J159J49q57o36J139N12j236l1R16K26j477R4J248m1j158o0J437
$$ 600 -614 -742 417 566 -291 -927 212 724 -512 -543 373 599 -878 -784 464 423 -735 -795 642
1214F42l7j280o7R09L25r73k31Q57j73j083Q58R68p29j131O12J246l56j621N70
$$ 642 605 -675 -742 167 492 -481 -712 145 -28 -1111 -253 715 -14 -1145 -533 713 357 -1264 -694
1233f94J173l30j009J66R63j4r29M62Q18q45m92P25J205j183j327J179Q89l82
$$ -694 479 149 -860 -694 269 255 -674 -212 606 -239 -731 -6 1199 16 -1311 -132 757 375
1251C75j310Q67P10p21m83P38L14o55p44J128M62j218l22P53R86j140o12Q95K57
$$ 375 -935 -68 642 -79 -562 176 490 -165 -909 219 681 -537 -859 -106 880 -260 -872 23 280
1270B80n98j6N08L70j042l63J120M53j399k85J271M08r05n07J185J62r31j78J020
$$ 280 -318 -334 174 544 -498 -861 259 712 -687 -972 299 707 -198 -705 480 642 -289 -467 553
1289E53l44o85j95J443k18j599N71J269q0j097l53J500J59j226J46P69P3r21K88
$$ 553 209 -476 -671 772 554 -1045 -474 795 715 -382 -735 765 924 -302 -156 613 686 -235 53
1308E3J30j57l89M92O48p72n41K12J030m43j308Q04P87Mj129J57R46q49o1J87
$$ 53 183 26 -363 129 777 5 -536 -324 706 263 -1045 -241 546 550 -579 -422 524 -325 -386 -199
1328a99N63o17m65P18N97n12r60O95P46j99r75M81N08o39n3O72j5n27m02O90N95
$$ -199 364 -253 -718 0 597 85 -875 -180 566 367 -608 -127 381 -258 -311 361 346 -181 -583 107 702
1349G02j133l55J066N42p27j56K54K49n34L9N86K02j414L12J091j31p48j21M43
$$ 702 -431 -786 280 822 95 -61 193 442 -92 -53 533 735 -679 -367 724 593 -155 -276 167
1368A67P27r07k92M21L61n58k39O94Q4r33N07N26l73p93K71P41j81q63L17Q60
$$ 167 894 -13 -305 116 477 -81 -320 374 458 -475 32 558 185 -608 -337 404 223 -640 -323 537
1388E37j57p52LJ094l02o89L1N63j82o82L37Q96k86j080M82Q52m82n47J7P99l77
$$ 537 380 -372 -369 725 423 -266 -235 328 146 -536 -199 697 411 -669 -187 665 183 -364 -347 452 75
1409G5l96M03M84m50q16Q94L89n81l93k5J071l44p69M58M08k99n89P62l31j78
$$ 75 -321 82 566 116 -700 194 583 2 -391 -416 655 311 -458 0 408 109 -480 282 -49 -227
1429b27j35Q43K25j224j26R98N9n59k77K39N89n12l30R77l14o51K30R57m50p16
$$ -227 -362 481 706 -518 -644 354 413 -146 -423 -184 405 -107 -437 540 226 -425 -195 762 312 -404
1449d04j27P06J83n42l8J95M41o90j21N95j70l56M0M27K2m03J40M62l73n26K29
$$ -404 -531 175 358 -184 -222 -27 414 -276 -397 198 28 -328 -288 139 161 -242 -102 360 -13 -539 -310
1470c10N45q9o43M40M90n2p24P7O88m45o2j04N97n8o75K14L55p1p11M09P16n23
$$ -310 235 146 -497 -57 433 381 -343 -266 422 -23 -85 -189 408 350 -325 -111 244 173 -538 -129 587 64
1492F4n30J92K47m4k08L68L22o10j96M53J42j47l80kO13j87l42M70J35m23k33
$$ 64 -466 -274 -27 -71 -279 89 411 -199 -395 58 200 53 -327 -329 284 97 -245 225 360 -63 -296
1513b96N28N5l78k61M98Q4m01l80L15Q41q37k29N82j60n51M31M85P0o89J90M19
$$ -296 232 287 -91 -352 146 230 -171 -551 -236 605 -232 -461 121 -39 -590 -159 326 396 -293 -103 316
1534C16l03m88J18O20Q6p55L28L39k76l74O7L67M6k81o5P65o98l67N88J27Pk87
$$ 316 13 -475 -357 263 349 -406 -78 261 -15 -389 -322 45 91 -190 -255 510 -188 -555 33 160 167 -120
1556a20K80J49k29p12M32L28o1l90N4L89Lo4m44P85n76j27L33M59l55n85N43Q6
$$ -120 160 309 80 -632 -200 128 67 -323 -269 120 123 59 -385 400 -176 -303 30 489 134 -451 92 178
1578A78Ql84K55pk46j60M21J67m06o5M85J11m45l0m7J74j40q5K73J32k76K5J08
$$ 178 186 -198 57 50 -196 -356 65 232 -174 -239 246 357 -88 -118 -165 9 -131 -216 57 189 -87 -62 46
1601D6K60k51k93L04M7l85M13j06Mj26k14M72J0l40m3N67l13m00J63L90j25j24
$$ 46 306 55 -238 66 113 -272 141 35 39 -87 -301 171 181 -159 -202 365 52 -348 -185 205 80 -44
1623d4j41M31Ql38j43P46n11k11J06L07o2m14J94K30j01m29L68J67PJ0L6L6l51
$$ -44 -185 246 254 -84 -227 519 8 -203 -97 210 148 -266 -72 158 57 -372 -4 163 170 180 216 252 -99
1646i9j60J00K93q4j49L75q6n09j72M13M27k27j92K57k25L0m6k22M71l88J71J52
$$ -99 -259 -159 134 50 -99 276 190 -319 -491 -78 349 122 -70 187 -38 -8 -54 -276 195 -193 -22 130
1668A30N9j84k77J40L68m16O7J01K79k95k25N88P4n50K3K17K33l57j7L11l64O6
$$ 130 189 5 -272 -132 236 -180 -113 -12 267 -28 -253 335 409 -141 -118 99 332 -25 -42 269 -95 -29
1690b9j15L16m06K61j96M16J17p4q12O85o3j05j14M17q0k08P9j41K02l74K00K44
$$ -29 -144 172 -234 27 -169 247 364 290 -522 163 100 -5 -119 298 218 10 89 -52 150 -224 -24 220
1712B20P0j98m3L57k94j30J28j60J67k80L55j8J40m14M31k61K42k70k23P49o24
$$ 220 290 92 49 406 112 -18 110 -50 117 -163 192 174 314 -100 331 70 312 42 -181 568 -56
1733e6n5J99ql74QJ14L96j65Pp8j7Qm44M17O9J06k21L71j97j21J43j39J14k52
$$ -56 -111 88 80 -294 -286 -172 224 59 66 -12 -29 -21 -465 -48 21 127 -94 277 80 -41 102 -37 77 -175
1757a75L05j51J63p2j9J30l51N8m9L79k56K25k76j81M53j4k83O2Q4k36J67K30
$$ -175 130 -21 142 70 51 181 -170 -112 -161 218 -38 187 -89 -270 183 169 -114 -52 32 -204 -37 193
1779A93l93LJ91j94K12k38N2K62p3n6L38m16K20r6j97J35k3Q9J51pm35L67n2K14
$$ 193 -200 -197 -6 -200 12 -226 -174 88 15 -41 297 -119 101 5 -192 -57 -80 9 160 153 -282 85 33 247
1803B47k18j14%J71p7j25j82K87j05j25J11O2L40j80k53J72K62m9K5j70j30lJ99
$$ 247 29 -85 -85 86 9 -116 -298 -11 -116 -241 -130 -68 272 92 -161 11 273 224 249 79 -51 -54 145
1826A45j59q2J33M9K2j72M9R4k0LJ3k09n7J31L14m2l62j69L90nQj2K42l09K02
$$ 145 -14 -96 37 86 108 -64 -15 79 59 62 75 -134 -191 -60 254 212 -150 -319 71 66 74 62 304 -5 197
1851A97m32J89K28n23L95J21n8n6p5o5J73M8J25o58O70m39J46r8K0j3r1K72N8
$$ 197 -235 -46 182 -341 54 175 117 61 -14 -79 94 142 267 -391 279 -160 -14 -112 -92 -105 -196 76 134
1874A34j56J78Pk19n1k13L93jk93K53K6n4j92Q3N4l2J05PJ75o0j36k3K94m4n03
$$ 134 -22 156 163 -56 -107 -320 73 72 -221 32 58 4 -188 -105 -51 -83 22 29 204 144 8 -15 279 235 -268
1899b68J57j6K54m00M61k44K9L30l26p0Q6M9K29o8m84K95J53k3%p6j23j15L78
$$ -268 -111 -127 127 -273 188 -56 -27 303 -23 -93 -7 42 271 203 -281 14 167 144 144 68 -55 -170 208
1922B08j08R4j65k76K89J15O3k60l7n7J32l45M10k83J42L2J42j59j6K9J73R3k31
$$ 208 100 194 29 -247 42 157 220 -40 -77 -134 -2 -347 63 -220 -78 -46 96 -63 -79 -50 123 216 -15
1945a5K61o3k78J79k63K89K60l02j16l1K1j55m0M86k54J03L3k78L47q9j69P0L0
$$ -15 246 183 -95 84 -179 110 370 68 -48 -79 -58 -213 -253 233 -21 82 115 -163 184 95 -74 -4 26
1968B6J08j60o7J34P6j94L62k31QJ16L3j98r6o9K19N2m38L55L1p0k58J70K07R4
$$ 26 134 -26 -93 41 117 -77 285 54 62 178 211 13 -83 -152 67 119 -319 36 67 -3 -261 -91 116 210
1992B10k45j62J21R6p8K32j12m9l3j21j7k9P1j11M6J71O4k48K75k06K21Ko6J48
$$ 210 -35 -197 -76 20 -58 174 62 13 -20 -141 -158 -187 -116 -227 -181 -10 54 -194 81 -125 96 98 32 180
2016A80k36O8p9j5L9J4K29l67L19l6j65J53j41j04L55o19J03N08l62K55j20J37
$$ 180 -56 12 -67 -82 -43 -29 200 -167 152 116 -49 104 -37 -141 214 -405 -302 206 -156 99 -21 116
2038A16k73K03j90N6K21k77k81L44n9L5J42P9j58K57j32j92M52o41L98L43l21
$$ 116 -157 46 -144 -88 133 -144 -425 -81 -140 -105 37 116 -42 215 83 -109 343 -298 100 443 122
2059A22k59Q1n6K96m86J57K45j41k95J71N67m28p9R6m8R3j04l0J62K06l79J30
$$ 122 -137 -56 -112 184 -302 -145 100 -41 -336 -165 402 -26 -105 -9 -57 36 -68 -98 64 270 -109 21
2081B1n2Q0k07K72O9k63J31N2QR2m80J24M27j77k40Q2N6K69n38N53m83L58j23
$$ 21 -31 49 -158 114 183 -80 51 103 111 203 -277 -153 274 97 -143 -61 -5 264 -274 279 -204 154 31
2104C1m6j34l9J75n5L51l12j52K46L9k67n1L16l1q1J29Q1n1k52kM97o06N4J25
$$ 31 -15 -149 -188 -13 -68 283 -29 -181 65 104 -163 -214 102 71 -10 119 200 149 -103 -105 392 -214 -160 -35
2128c5MO3j08oJ89j44R7Ql30L67j29J34k06l4j96L23J77m4k56L21r5j13j26n1
$$ -35 -31 32 -76 -82 107 -37 60 68 -262 105 -24 110 -96 -130 -326 -3 174 130 -126 195 100 -13 -139 -190
2152a90L74l2l49m4K23j49K37J30J6j20l06j7M13lj84k6m0J35K05m45J44k14j68
$$ -190 184 152 -197 -241 -18 -167 70 200 216 96 -210 -227 186 183 -1 -27 -67 68 273 -172 -28 -242 -410
2175d10O31q9k23r9L76j23l40j35L52L15j19l89K22P4m3j01L46p8j59j74L56m
$$ -410 221 132 -91 -190 186 63 -277 -412 -60 255 136 -253 -31 43 0 -101 245 167 8 -166 190 186
2197A86j45MK8J40l20j8J63M1l13K01J45J3l13O2K86l05L8J55j32L32n73K42N35
$$ 186 41 45 73 213 -107 -125 38 79 -234 -33 112 125 -188 -126 160 -145 -107 48 -84 248 -325 -83 452
2220D52j85k19j41J17K89o73J03M54m04RN1P73o88j64M83r6j03J9J9L45o08P7
$$ 452 267 48 -93 24 313 -360 -257 197 -207 -198 -147 626 -62 -226 257 161 58 77 96 441 -167 -90
2242i0K44Q1k56l73L98J36l42n6K36R3j64j09O06m01j07P2K70n1j36j54R9J72
$$ -90 154 235 -21 -394 4 140 -202 -258 -22 71 -93 -202 404 3 -104 -32 238 187 51 -103 -4 168
2264A68l01K61J9j1k42J32L9O1j09q8L12j44l53J54K72j85k9L5J12j32k18R5K07
$$ 168 -133 128 147 136 -106 26 65 126 17 -71 241 97 -256 -102 170 -15 -44 -9 103 -29 -247 -152 55
2287E5p8j85j0M30j3l06J87k25L95l06p3L7j30J19j75N48m02l9m7L18j96J18p3
$$ 55 -23 -208 -218 212 199 -107 80 -145 250 -56 -129 -92 -222 -103 -278 270 -132 -171 -218 100 -96 22 -51
2310e1P4k99j43M03o9Q3l18O92j46j45l81K61M0mm01L24L24l02l5q9K93k56L11
$$ -51 23 -276 -419 -16 -85 -2 -320 372 226 81 -300 -39 1 -3 -404 -80 244 -58 -93 -182 111 -145 166
2333A66k95J80k14k2k4N16n64P3L36l6l15KJ7L26M6l49N24m73q4J79J48n4K38
$$ 166 -129 51 -163 -185 -209 307 -257 -184 152 116 -199 -197 -180 146 192 -157 367 -106 -190 -11 137 83 321
2356C21m76N0O8M2j46M2J95k38K57j12j76J9J1R6L62o44N43J01j59l22N5K09K4
$$ 321 -155 -105 -37 5 -141 -99 96 -142 115 3 -173 -154 -143 -47 315 -329 214 315 156 -166 -111 98 122
2379A22k69K05K4m1oJ71r3k0j01j27K75j2m10K29N09q33K38k18L82N9j76j82K14
$$ 122 -147 58 82 41 35 206 113 93 -8 -135 140 128 -282 -53 456 -377 -139 -357 25 84 -92 -274 -60
2402f0L8m0j20N97l68k40M2J63j27J42J43p2J4l26L15J18j75j35K43k66P9O6j69
$$ -60 -22 -62 -182 415 47 -193 -151 12 -115 27 170 98 112 -214 101 219 44 -91 152 -114 -35 31 -138
2425a38L17j25k6j7L3j37R5K10k33n4O6K33q5j95j99O63k64m10lK92K6l17K8L17
$$ -138 179 54 28 11 44 -93 2 212 -21 -75 -9 224 139 -56 -255 408 144 -266 -269 23 49 -268 -240 77
2449G7K13l99J03L55l30J06l14M41k42l15K63M34m94M1q8K84o4j49ML36k12j41
$$ 77 290 -109 -6 349 19 125 -189 252 10 -305 -42 392 -102 -61 -149 135 71 -78 -74 262 50 -91
2471i1L81r3j90J9J67K65k84k75K39J20o9m12J56k9J89m85N83J87n08J53J21k45
$$ -91 290 197 7 26 193 458 174 -101 138 258 189 -223 -67 -96 93 -392 191 378 -130 23 144 -101
2493a01K34k63J08m9J20m1J75k31l50M02J29j14k93K41J12K57l41k4J36L9j75
$$ -101 133 -130 -22 -71 49 8 183 -48 -398 4 133 19 -274 -33 79 336 -5 -29 107 146 -29
2514b9Q1j00J25m5q9J00Q1q8n5L30m31l6j10M71j27m67J34L31Q4m96J47K70l4
$$ -29 52 -48 77 32 -57 43 124 36 -19 311 -120 -156 -266 205 78 -389 -255 76 160 -336 -189 81 47
2537D7m0j15L94k68L3J04rk49J00K68l0j95k83K80J64k3m67M60J11J19p00K93
$$ 47 7 -108 286 18 51 155 146 -103 -3 265 235 40 -243 37 201 178 -289 171 282 401 -299 -6
2559fJ71k03J6k68M55l41L18j46N1k16j81O20J2n24J33j5N11k45m0m20M86k35
$$ -6 165 -38 -22 -290 165 -176 142 -4 47 -169 -350 270 282 -242 -109 -124 387 142 102 -318 168 -67
2581f7j13N2J42q9k94O54j17m39J60J82N0m77L68J57q3k75J64R8k80L81m21J42
$$ -67 -180 -128 14 -75 -369 285 168 -271 -111 71 121 -356 12 169 86 -189 -25 73 -207 174 -247 -105
2603a05J57K7m22K56R7k83R4O1J24k0j98L66k94k72M26J61k48k55J17P42m35j88
$$ -105 52 79 -343 -87 10 -273 -179 -118 6 -14 -212 154 -140 -412 14 175 -73 -328 -211 531 96 -92
2625i2o1L23o9j75K59j10o7po9L12k47r1mN01o00j66M49P4N5l02J31R0k49k10
$$ -92 -153 170 101 -74 185 75 8 1 -68 244 -3 -94 -98 403 -197 -363 86 160 215 -87 44 134 -115 -325
2649c25M86K0l49J09K1J75m74L64q2K05l15K3M93m07j20J29M9k11R0n6K70%L1
$$ -325 161 181 -168 -59 -38 137 -337 27 -55 150 -165 -142 351 -56 -176 -47 2 -209 -119 -175 95 95 126
2672A26j79Q5K68j35m15K39n4M4r4J50n0q4K47J09l82q4J02L25N9o03K04L44k40
$$ 126 -53 32 300 165 -250 -11 -65 -21 -115 35 -15 -99 148 257 -125 -209 -107 218 277 -326 -122 222 -18
2695a8q2K51p8k1j27j5J66o5j99J57K71k39K3j4J37qj52J62J2o9o0OM6k1k58J9
$$ -18 -100 151 73 52 -75 -90 76 11 -188 -31 240 1 24 10 147 139 -13 149 161 92 32 38 84 63 -195 -176
2721a76K81r7k33J98K80m72L13q6L14l05l23N14J85k78k24K87L67o62k37J99J23
$$ -176 105 8 -225 -27 253 -219 94 8 322 17 -306 208 393 115 -109 178 545 -117 -354 -155 -32
2742c2nK31l53L21Q2k05j49L02m79J70N23J4o32N8K38r6nq9R2J7j40K5N2J98k55
$$ -32 -37 194 -159 162 244 39 -110 192 -287 -117 406 420 -212 -154 84 -12 -17 -106 -14 3 -137 -112 -60 138 -117
2767a17Q4J57j3L51l80J37j71k93M8M80k68l12K71N21j40l35J30r6J25m01P7J57
$$ -117 -33 124 111 462 82 219 48 -245 -197 283 15 -297 -26 495 355 20 150 54 179 -222 -145 12
2789A2l7K15k90N8J04j66J3L3R8l29M29J72m73k71M82K10p3l33Q9M2J62p5k42
$$ 12 -25 190 -100 -42 62 -104 -91 -58 40 -289 140 312 -161 -432 50 260 187 -146 -57 -15 147 72 -170
2812a70L14o5m15N46o2k75qJ65K66n51J76K3M64m53J9K28k41k78K10J18L91n08
$$ -170 144 79 -336 210 148 -127 -135 30 296 -255 -79 -56 408 -45 -26 202 -39 -317 -107 11 402 -106
2834a06J34o0J30j67k56M33L0k27k86N64p3l45K00K04J50l21m5rM21l57j20L06
$$ -106 28 -32 98 -69 -325 108 138 -89 -375 189 116 -229 -29 175 325 4 -41 -50 371 14 -106 200
2856B00q0J07j17j40oj50K3L81k86j62l3O90n23j08K11J40O4m69M97j78k01j89
$$ 200 120 227 110 -30 -36 -186 -163 218 -68 -230 -263 427 -96 -204 7 147 211 -258 239 61 -140 -329
2878c29K05M42j23l35J51J0j37k20N23K23m05k89N36K44k93l80J22J78L1m61M49
$$ -329 -124 318 195 -140 11 21 -116 -336 187 410 5 -284 252 496 203 -177 -55 123 154 -307 142
2899A42l6o8j65M16j09r2j33O1K22k23J98J49p10O10l60L68k14k47n5L21J71m53
$$ 142 106 38 -127 289 180 88 -45 16 238 15 213 362 -348 262 -98 270 56 -191 -246 75 246 -207
2921b07L0K14K02m65m8L55k28J09K04n8J65m81P8P5L37o21K80J08Q6j43nL08n15
$$ -207 -177 37 239 -226 -274 81 -147 -38 166 108 273 -208 -130 -55 282 -339 -59 49 135 -8 -13 295 -220
2944b20Q4K16p8J30j82j79L22j05j43L90j41J2m29J55J63N2l13Q2L09Om24O60
$$ -220 -136 80 2 132 -50 -229 93 -12 -155 235 94 106 -323 -168 -5 47 -266 -184 125 131 -293 367
2966C67l19K89n08L83j0k76J18p1L46l53J79m37N40n9l94L66Q1j7k22L5L00n38
$$ 367 48 337 -171 212 202 -74 44 -27 319 -34 145 -292 248 189 -205 161 242 225 3 38 338 -200
2988b00l4K78J39n81K60j85N80m20k9O27k76k95J96L6K26m32l7J59J81m72J09
$$ -200 -234 44 183 -398 -138 -323 257 -163 -192 435 159 -136 60 96 322 -110 -147 12 193 -279 -170
3009a70M62k90n1j60L34j05J18m07L12J44l49n4M08k77r8L49J12k12j55J70O2
$$ -170 292 2 -49 -209 125 20 138 -269 43 187 -162 -216 192 -85 -183 166 278 66 -89 81 143
3030A43R6k91J48K42l31k54k0N18m00M55m02K31M8l24R9J59l91j9M93j5l90j47
$$ 143 239 -52 96 338 7 -247 -267 251 -149 306 -96 135 183 -141 -42 117 -274 -293 200 185 -205 -352
3052c52M99O9n22K30J10K85m46j2K00p0k42J53O3J94l21J25K71N1k59k16J20J90
$$ -352 147 216 -306 -76 34 319 -127 -139 61 -9 -251 -98 -35 159 -162 -37 234 285 26 -190 -70 120
3074A20m54K92J22O6j07j56L41l58pN2K28p6J17j86p6J07l63M61j86o1L4PJ55
$$ 120 -334 -42 80 146 39 -117 224 -134 -141 -89 139 63 180 -6 -82 25 -338 123 -63 -124 -90 -83 72
3097G2P1l19K52nq5M2l17L56p2k93L09N5j8j84J78n3Q9j09m0M28m83l9l3N09m28
$$ 72 143 -176 76 71 -14 28 -289 67 -5 -298 11 66 48 -136 42 -11 78 -31 -71 357 -126 -165 -198 311 -117
3122a17J82N9K23l25o9P2L12j85q1k52K61J9k87J58J27k8l46K39L70n12K20k5
$$ -117 65 124 347 22 -47 25 337 152 71 -181 80 99 -188 -30 97 69 -277 -38 332 -180 40 15
3144A5L33J4n54J88n6J91p20R82o05J57K22j4O1l85K22n3l1j69L58p9j71k8R1
$$ 15 348 362 -192 -4 -60 131 -589 393 -212 -55 167 153 214 -171 51 -2 -33 -202 156 77 -94 -122 -31
3167c1K09l15k39R6R1K24m45L11M69j06k68j78N7L0j90j46N65n6j73J56J83j67
$$ -31 178 -137 -376 -280 -189 35 -410 -99 370 264 -4 -182 -125 -95 -285 -431 134 78 -95 61 244 77
3189G7k24L06K73l66m34J00L88k48Q5j87N89l14j98m9K28l22L53o1K45l97m3J84
$$ 77 -147 159 432 66 -368 -268 120 -128 -43 -230 359 45 -153 -202 26 -296 57 -4 241 -156 -199 -15
3211a5jK9k00n2L94k85q1J72J29N6l41K84M8Ql32K48Q2j38j04J30k00J19k99L60
$$ -15 -16 13 -187 -239 155 -130 -211 -39 90 146 -195 89 137 145 -187 61 143 5 -99 31 -169 -50 -349 11
3235A1K24k87k75L14O3l52Q2M97o2N3m54K55K16k29p4O0k16p2J67K37k11o6L7
$$ 11 235 -52 -327 -13 50 -302 -220 277 215 268 -186 69 285 56 -18 42 -174 -246 -79 158 -53 -119 -82
3258h2J96J06n15M67r9J77j16j10O1Q5j27o1J74n3n08L40R7L8j61K64j26k45j47
$$ -82 114 220 -295 172 73 250 134 24 85 170 43 -18 156 103 -405 -65 32 70 -91 173 47 -198 -345
3281c45K13J51l8j27L17j5l24k07J07M97o11K99J5J10O7j65L07n26J10R9J87m0
$$ -345 -132 19 -19 -146 171 156 -168 -375 -268 229 -382 -83 -68 42 109 -56 251 -275 -165 -66 121 81
3303H1j42l8m3K3K32Q0k01N8q0jJ30N4k84l86P40l2k13j62L33j27l68N50j15K51
$$ 81 -61 -99 -142 -119 113 193 -8 50 -30 -31 99 153 -131 -517 223 191 -22 -184 149 22 -346 204 89 340
3327C40o20J92J93R5m02j72M26J25J66l29L14m21j3o8L20k24l0R1j09q8K72n6
$$ 340 -280 -88 105 200 -202 -374 52 177 343 14 328 -93 -106 -174 146 -78 -108 -17 -126 -214 58 2
3349BJ44l42L45k73L05j23l82J65K38k04K37jL0k06m6J85J00l61J67LJ70m72K06
$$ 2 146 -196 149 -124 181 58 -324 -159 79 -125 112 111 141 -65 -111 74 174 -187 -20 -17 153 -319 -113
3372a13J83Q8k47k34J45J89k20K8L96o5j33N2K7R8l8l13Q0j53r8M10k06M55k17
$$ -113 70 158 -89 -323 -178 11 -209 -181 215 150 17 69 96 194 156 -157 -77 -230 -328 82 -124 331 114
3395A14k70L59j53o0l47L51k39K56J7J44j77j76K38K71l49n0O7k3J91k44J17j80
$$ 114 -156 203 50 -10 -357 -6 -245 11 28 172 -5 -181 57 328 -21 -71 -4 -27 164 -80 37 -143
3417a43K08k64P8M36l44J16j84m5J90j45o3K42j47k34J68N4J00l29K92NJ17K8
$$ -143 65 -199 -121 315 -29 87 -97 -142 48 -97 -160 82 -65 -299 -131 -77 23 -306 -14 -9 108 136
3439A36j92J48J81l90N2J87j14p9J6N31n25O3O9l9J35j26j31qQ7k12Q9K08j06
$$ 136 -56 92 273 -117 -65 122 8 -71 -55 476 -49 14 83 44 179 53 -78 -86 1 -211 -122 86 -20
3462b0k41M95l44J14k49J67J47j9j3n6L5J79k28J93O3l05K13M4Q7l40K43Q5J21
$$ -20 -261 234 -110 4 -245 -78 69 50 37 -19 16 195 -33 160 223 -82 131 175 262 -78 165 250 371
3485C71p7j49j08JM2o2o9L13j82j14J91m7l58K02J31K48l54K63M2k50j4p1L43
$$ 371 294 145 37 38 80 18 -51 262 80 -34 157 110 -248 -46 85 333 -21 242 284 34 20 -51 292
3508B92j93J28l20J93k8k77J07J41q8J27j73K57K3k6k69K66p8m08K74J35K4o35
$$ 292 99 227 -93 100 72 -205 -98 43 -45 82 -91 166 189 163 -106 160 82 -326 -52 83 107 -528
3530e28J43N51k97J10Q3n6l74K29J9K29p0L7K42J82q36K56P6J30r2p1N2L1k79
$$ -528 -385 166 -131 -21 62 6 -368 -139 -120 109 39 76 318 500 -336 -80 -4 126 34 -37 15 46 -233
3553b33J40Q5K40k41n1K9k0L8M6j5J35J3m42M14M3l10L8l6K06Nj65M54m6l08L6
$$ -233 -93 -8 232 -9 -60 -31 -51 -13 33 18 153 166 -276 138 181 -129 -91 -127 79 84 -81 373 327 19 55
3578E5R3l22j82N35R0m43J17L19k37J59l25J75j04M1K95k84K07j21j86j02K68
$$ 55 148 -174 -356 179 269 -174 -57 262 25 184 -141 34 -70 -29 266 -18 189 68 -118 -220 48
3599D8qj59o5k16K26J11n3K80j73j01k1L07j74j50K31J12j92l61M25n3j74R4k7
$$ 48 40 -119 -184 -400 -174 -63 -116 164 -9 -110 -131 176 2 -148 83 195 3 -358 67 14 -160 -66 -93
3622i3P4J00m7Q0j07QK3j3j03Q1j74J72J38k63L64n7k64J82n69Q22l73j94o3N54
$$ -93 -19 81 34 114 7 15 38 25 -78 3 -171 1 139 -124 240 183 -81 101 -468 354 -19 -213 -276 278
3646B78J06l36j76K6P6P4J24l6M2k50J40J21L0l73K97L2q0l7r0J98k80j24L16
$$ 278 384 48 -128 -102 -26 48 172 136 178 -72 68 189 219 -154 143 175 95 58 -32 166 -114 -238 78
3669G8J39Q9n15N19l66J93n66M92j64J69m65L16J21l62R4j7M16p6j68R7K21j63
$$ 78 217 306 -209 310 -56 137 -429 63 -101 68 -397 -81 40 -322 -228 -245 171 95 -73 24 245 82
3691H2j34p4R7j08j1p8J53J03J3k62J11M7O3k28L98l65M7J54Q2j18n8J83J97R
$$ 82 -52 -126 -29 -137 -148 -226 -73 30 43 -219 -108 -61 2 -226 172 -193 -146 8 90 -28 -86 97 294 303
3715C03n0j76j61N7k0J01J00k06j35J28M60J3o01K67N8j78J2K82k70r4K68L34
$$ 303 253 77 -84 -27 -47 54 154 -52 -187 -59 401 414 -187 80 138 -40 -28 254 -16 -110 158 492
3737D92l23j01j21j22K34m67L32J79l73M31k06K76l84J26j34L76k55j58K14lJ45
$$ 492 169 68 -53 -175 59 -408 -76 103 -270 161 -45 231 -153 -27 -161 215 -40 -198 16 13 158
3758A58m12L07K17j47k05oJ46J2q4J52K84l93k80K29K41J4n90L26K79n7m07K30
$$ 158 -254 53 270 123 -82 -88 58 70 -14 138 422 29 -251 -22 219 233 -357 -31 248 191 -216 14
3780A4q7JN7j60M12k53L05Q5l13l76J37J28J56j75M21m18J62j42k08L41O8j43
$$ 14 -73 -72 -15 -175 237 -16 289 374 61 -315 -178 -50 106 -69 352 -66 96 -46 -254 87 155 12
3802A2l1J20K5l1Q0j23j22Q6o6m3L81k97j1k89J68K70m27M85j53J4j07LL50m19
$$ 12 -19 101 126 95 175 52 -70 16 -50 -93 288 -9 -20 -309 -141 129 -298 187 34 48 -59 -56 294 -125
3826a25j07J63N1Q9M2j07j18j48L30j94L28k39N2k1J00n0Pq3k24l0J92L7N4L6
$$ -125 -232 -69 -18 71 113 6 -112 -260 70 -124 204 -35 17 -4 96 46 53 -30 -254 -284 -92 -55 -1 35
3850C5n4M77n64k38N47k61j30J09M3j69J90J2J68n32L95k26L72p5k35K41p5M0
$$ 35 -19 458 -106 -344 203 -58 -188 -79 -36 -205 -15 -3 165 -367 28 -198 174 99 -136 105 30 70
3872G0J65m11K2J69K88l43J9j12J73j37K24J89m37J64j82K78o2J28k36J70k6m29
$$ 70 235 -176 -154 15 303 -40 -21 -133 40 -97 127 316 -121 43 -139 139 77 205 -31 139 113 -316
3894c16K49N2kK2lK30j66j57O4J55k72K78L4l54K81k79M83r7l15k4J59j36k9K93
$$ -316 -67 -15 -17 5 2 232 66 -91 -27 128 -144 134 168 -186 95 -184 299 202 -113 -137 22 -114 -143 150
3918A50K51j48m50R9Q2L24o21M37j6Ql58L23p1q9K92r5J27j44j90k9K21K14n95
$$ 150 401 253 -197 -98 -16 308 -313 124 108 116 -242 81 10 -79 213 118 245 101 -89 -118 103 317 -278
3941b78M23j66j93j4N0J31j43J36k00K90j03K17o0p6j76J90J44k26Q0k7K90k71
$$ -278 145 -21 -214 -228 -178 -47 -190 -54 -254 36 -67 150 90 14 -162 28 172 -54 26 -1 289 18
3963A8L4J14k02q4K07J20O2j00k60J26O5m4k82M65l42J24p4j40P1J13j19J46r0
$$ 18 52 166 -36 -120 87 207 269 169 -91 35 100 56 -226 239 -103 21 -53 -193 -122 -9 -128 18 -72
3986g2J25j47J40Oj53KN2J66J81l29k80M40j41L58k90j21K2K25j84R5j19r5N85
$$ -72 53 -94 46 52 -101 -99 -47 119 300 -29 -309 131 -10 348 58 -63 -41 184 0 95 -24 -119 466
4009D66n88NQ8m9J68k11L95m37Q0k6m7R5J20j4K2J28j05l15r9N59k58Qj02J08
$$ 466 -122 -117 -29 -78 90 -121 274 -163 -83 -109 -156 -61 59 45 67 195 90 -225 -324 235 -23 -15 -117 -9
4033iO3J45j97j07K02j73r2L82Lj11pj29q9O9l5OM03k98j29J57k75K01k96L12
$$ -9 54 199 2 -105 97 -76 -168 214 217 106 99 -30 -119 -50 -85 -79 324 26 -103 54 -221 -20 -316 -4
4057dn0O5J93N0r2m77Q2K13K44k72L6rJ95j81l1N7P2ln02N22j76J16j50J98Q1
$$ -4 -54 11 204 254 162 -315 -233 -20 224 -48 -12 -21 174 -7 -38 19 91 88 -414 108 -68 48 -102 96 177
4082A77k92%Jm3K24Lr2j44M0J09R3k21K87q7o4j29L4N6J14Q7j32l57K53O8o8Q3
$$ 177 -115 -115 -114 -157 67 70 -22 -166 -126 -17 76 -145 142 55 -9 -138 -104 -48 66 153 21 -336 -83 -15 -83 0
4108@K15j99j44j5j43J89j57K53j94K18K9m2j26J0r3L61j97m5j14L00l29J34j15
$$ 0 215 16 -128 -143 -286 -97 -254 -1 -195 23 52 10 -116 -106 -199 162 -35 -80 -194 106 -223 -89 -204
4131b04jN53l10j84L87n9k70J07K6M9j36M4j16J37k16N8J64j29Q1o3J72J28n45
$$ -204 -205 348 38 -146 241 182 -88 19 45 94 -42 2 -114 23 -193 -135 29 -100 -19 -82 90 218 -327
4154c27O1K28R2m95M36o1j18L05j82J5lj52K88p3N9p1J43p6j65J74l6j07L9J83
$$ -327 -266 -38 54 -441 -5 -66 -184 121 -61 -46 -49 -201 87 14 73 2 145 69 -96 78 42 -65 -26 157
4178A57j38k3j95N59k8k08m46J28j29M17j49k2n8L55k00kM36n65l3Q6J62m13J90
$$ 157 19 -4 -199 360 332 124 -322 -194 -323 94 -55 -77 -135 220 20 18 454 -111 -144 -58 104 -309 -119
4201a19o1K63q7J04k97J91q6L9J96L9k2p3l31L14K17k19l05L76J36l43l6L1M45
$$ -119 -180 83 -4 100 -197 -6 -92 -53 143 182 160 87 -244 70 287 68 -237 139 275 -68 -104 -73 372
4224C72n09J19Q9J91j92q0k0j13J38j44J60J47o4m5j8j14j2J21L67j92m32L15
$$ 372 -137 -18 71 262 70 -10 -30 -143 -5 -149 11 158 94 49 31 -83 -95 26 393 201 -231 84
4246H4q3q1j51k3L99k60L40l38k13M91j67j77J28K38l11L40k7k57j60j36L65j06
$$ 84 1 -80 -231 -254 145 -115 225 -113 -326 165 -2 -179 -51 187 -124 216 189 -68 -228 -364 1 -105
4268a05K16J77k41l40L70j66l8K88m31J47k9J45R2K05m04k72L10L76l51r0Q3N3
$$ -105 111 288 47 -293 77 -89 -127 161 -270 -123 -152 -7 85 290 -114 -386 -76 300 -51 -141 -58 -5
4290ej3L40n06Q5J53r0J52J44j61j08j73L30K0j56j35L40m54L27j85J13k20L24
$$ -5 -18 322 -184 -99 54 -36 116 260 99 -9 -182 148 168 12 -123 217 -237 90 -95 18 -202 122
4312A22k58N6M2j50L73j46j70k35L45M0J28J04j80J01j90k82L32R7M0j70m7j72
$$ 122 -136 -80 -38 -188 185 39 -131 -366 -21 19 147 251 71 172 -18 -300 32 129 169 -1 -48 -220
4334b20J41O3p7J2o5K17p0kK88j85j08j4j68K81J51l73J90k80J60L54m58K42j56
$$ -220 -79 -16 -93 -81 -146 71 1 -1 287 102 -6 -20 -188 93 244 -129 61 -219 -59 295 -163 79 -77
4357g7r8J86j21o2k1K51k23N27m23M6J67J19k1k16p6P3K5j84J57k51M76m61K72
$$ -77 -175 11 -110 -172 -193 58 -165 362 -61 -15 152 271 250 34 -42 31 56 -128 29 -222 254 -207 65
4380F5K30l27r8M4J68j93J7K07k62K46J5k91L02Q5m32N12k52J11J5j81K23l45
$$ 65 295 -32 -130 -86 82 -111 -94 113 -149 97 112 -179 123 208 -224 288 36 147 162 -19 204 -141
4402a41O3P3N7Q5r9l7J73l47J03J92K4J09l76n3N73k39n1j97L84m91L29l65L58
$$ -141 -78 -5 52 137 38 1 174 -173 -70 122 146 255 -121 -174 399 160 109 -88 296 -195 134 -231 127
4425A27j78j91M02j53J51j69J44k12L3m0J14j67N7m0J72K24k66P5R4r1R6l04O0
$$ 127 -51 -242 160 7 158 -11 133 -79 -46 -86 28 -139 -82 -122 50 274 8 83 177 86 182 -122 -62
4448f2L3j69M59j82k26N0K9j81M25m24K46k99J89J89l69M55l11K54j29l3n5J25
$$ -62 -29 -198 261 79 -147 -97 -68 -249 176 -248 -2 -301 -112 77 -292 163 -148 106 -23 -56 -111 14
4470A4J28j26J4J76qj63mR6Q6l62L97l36J43j55J21r5NJ80j29l87M91k38M6k25
$$ 14 142 16 30 206 198 35 31 127 213 -149 248 -88 55 -100 21 -74 -69 111 -18 -405 86 -152 -106 -331
4494c31K45J53j97J51k15Q6K12j65J22K0k56kJ34P2j98J38K05p0k51J82J38j39
$$ -331 -86 67 -130 21 -194 -108 104 -61 61 81 -175 -177 -43 29 -169 -31 174 104 -147 35 173 34
4516C4M1j26j44k9J38J73k69J99k31J04J60L3j59J18k61J50K00J8n60J31J62j14
$$ 34 75 -51 -195 -224 -86 87 -182 17 -214 -110 50 83 -76 42 -219 -69 131 149 -411 -280 -118 -232
4538b32K23K5J36j76K77k04J7n3j74R1J9K4k39J59J16K2k1Q0K3n6J03k60k44L63
$$ -232 -9 16 152 -24 253 49 66 13 -161 -70 -51 -27 -266 -107 9 31 10 90 113 57 160 -100 -344 19
4562A9N2J11k12Q4m3J04k82K50n33O88j56r6J76k19o2oJ30L20j13l18K57j81O9
$$ 19 71 182 -30 54 11 115 -167 83 -450 238 82 -14 162 -57 -119 -125 5 325 212 -106 151 -30 39
4585C9J34m77N19j72J63j48J37j57K92k61K22l14m3N3Q2J75n81K18K87j19l32
$$ 39 173 -304 215 43 206 58 195 38 330 69 291 -23 -66 -13 69 244 -337 -119 168 49 -283
4606b83N82p62N23M9j06j85J90j79P4J90J38j52p5j56J20j18K73k4l6j7m9LN3
$$ -283 299 -463 60 109 3 -182 8 -171 -97 93 231 79 4 -152 -32 -150 123 99 63 46 -3 0 53
4629E3j58K04j75N2M2k18K15r0J06q2LJ92l24j44K79K91n4n22M70k99N87l13k53
$$ 53 -105 99 -76 -24 18 -200 15 -75 31 -51 -48 144 -180 -324 -45 246 192 -330 140 -159 428 115 -138
4652a38J14M16o01K34k23Q5L44l75N39k54k40K52r2l8j96J25k19L08m1M4K25k89
$$ -138 -24 392 -209 25 -198 -113 231 -144 395 141 -99 153 61 23 -173 -48 -267 41 0 44 269 -20
4674b0J01j68O9K47l61K54jj57J02j8j51n0L11n0n0J3J5r6L9K41l06l1j20L76
$$ -20 81 -87 -18 229 -132 122 121 -36 66 48 -103 -153 158 108 58 71 86 -10 29 270 -36 -67 -187 189
4698A89p6Mq9j7l7j09L95r6n7m5o4q9j21L60k20J72k85R3J55N0k39Q0K15ol02
$$ 189 113 117 28 11 -26 -135 260 164 107 62 -2 -91 -212 148 -72 100 -185 -92 63 113 -126 -46 169 163 -139
4723a39OJ56J68l59L10j81P1J04j02n5J71L6r4L9k51k0L67l73J0K38j83K73k14
$$ -139 -133 23 191 -168 142 -39 32 136 34 -21 150 186 92 131 -120 -140 227 -146 -136 102 -81 192 -22
4746b2j19Q9P1j16J20o8M6m81J81K00J31o1k24L82Mp5k3j36q1M39l40J49L15l76
$$ -22 -141 -52 19 -97 23 -45 1 -480 -299 -99 32 -29 -253 129 133 58 35 -101 -182 257 -83 66 381 5
4770EO8j50l8J77m05N10o1k18O3m2L89k87J87J34m28J06k07M35n30K95J90l03
$$ 5 73 -77 -115 62 -343 167 106 -112 -49 -91 298 11 198 332 -96 10 -197 238 -292 3 193 -110
4792a10K80k76M5J12J15k7J52l09m7O7N0J2r4J30j8J07p1j81L9o5J48j94M3q6
$$ -110 170 -106 -61 51 166 139 291 -18 -65 2 52 64 -30 100 82 189 118 -63 -24 -89 59 -135 -92 -178
4816a78J29j13J73j55J91l3L33k77N8k21r5M8K22l47M33j98k63K47j39J48j55
$$ -178 -49 -162 11 -144 47 14 347 70 128 -93 -188 -140 82 -265 168 -30 -293 -46 -185 -37 -192
4837a92K05k07r6L28m7J08j22J1j55R7J40m53J21J97J62J84k90o8j1r9K39k31
$$ -192 13 -194 -290 38 -9 99 -23 -12 -167 -70 70 -383 -262 -65 97 281 -9 -77 -88 -187 52 -179
4859a79K56o9p2k11K89R8m50M06J54j94m1j0K33l19N2k58M55k31K11K10k46J61
$$ -179 77 8 -64 -275 14 112 -338 68 222 28 -13 -23 210 -109 -57 -315 140 -91 120 330 84 245
4881B45O9L8n89M80j41k2J34k62r1L1R2M5P4j50l3JK03r9l27L8M16j04L6k04J19
$$ 245 314 352 -237 243 102 80 214 -48 -139 -108 -16 29 103 -47 -80 -79 124 25 -302 -264 152 48 84 -120 -1
4906aj42l5P1p0J28n1o8J31O8j7M29m12l8j98K71j07J39p2m9j37L39q6k38K18
$$ -1 -143 -178 -107 -177 -49 -100 -168 -37 31 14 443 31 -7 -205 66 -41 98 26 -23 -160 179 93 -145 73
4930G3m2j18Q4N9J29l99L53k9j87k1J03j6R5J62q2k37j4K63k15K82k64j60M8J35
$$ 73 31 -87 -3 56 185 -214 139 110 -77 -98 5 -11 84 246 164 -73 -87 176 -39 243 -21 -181 -133 2
4954Bk66K50K57l08J06N4l40K2L22m13Q6j7L75j01k34K90k10J84K4j40M1p4K46
$$ 2 -264 -14 243 -65 41 95 -245 -223 99 -314 -228 -245 130 29 -205 85 -125 59 83 -57 -16 -90 156
4977A56k92j82L41p1j15K09j1n7K37m16L85l18J3j41L36k33N7M3K7o9O4j21Q4
$$ 156 -136 -318 23 -48 -163 46 35 -22 215 -201 184 -134 -121 -262 74 -159 -102 -59 -32 -101 -37 -158 -74
5000g4m0Q2J20k44J91q8K17j07M8o3J23J8j2k74J4OL04k74J44o9j0O2kJ41k29
$$ -74 -114 -32 88 -156 35 -53 164 57 105 42 165 183 171 -103 -89 -83 221 -53 91 22 12 74 72 213 -16
5025a6J38l63M4L72j93j2j40K45l33K92L2j40M5m5L00j40J15l10J42n1r2j89J80
$$ -16 122 -241 -197 175 -18 -30 -170 75 -258 34 66 -74 -29 -74 226 86 201 -109 33 -18 -110 -299 -119
5048a19J97p6n0J04K85l65J49j01Ln1m80O66n2k49J9K68k56K02L9j87K9o0j39
$$ -119 78 2 -48 56 341 -24 125 24 27 -24 -504 162 110 -139 -120 148 -108 94 133 -54 -25 -85 -224
5071b24M15j19j43J95j35J77k44Q3k96K5J49J11K14o3k95P1r7J21j18k3L64P0
$$ -224 191 72 -71 124 -11 166 -78 5 -291 -266 -117 -6 208 145 -150 -79 -176 -55 -173 -196 168 238
5093B38p0lk18M2P9Lj02L96k88k55J37J2l8K4J13J28j83j16N3P2k99L24M1j25
$$ 238 168 165 -53 -11 68 71 -31 365 77 -178 -41 -29 -67 -43 70 198 15 -101 -48 24 -275 49 90 -35
5117c5k38J28Q9J80O5k50L56n7l26o2J79P3J96k49k83L33l5n53N47r4j28O2J09
$$ -35 -273 -145 -56 124 189 -61 295 238 -88 -150 29 102 298 49 -234 99 64 -489 58 -36 -164 -102 7
5140GN2j51J28K53k69p5r5j26N43m92P5r8J91J9M34k04l04K82k73j85J71J93n9
$$ 7 59 -92 36 289 20 -55 -150 -276 267 -225 -150 -248 -57 -38 396 192 -112 170 -103 -288 -117 76 17
5163A7J37l23l3K47j40P6J2p6L77j99j80K21j05j98K84k21J13R5j32J82k53J06
$$ 17 154 -169 -202 45 -95 -19 -7 -83 294 95 -85 136 31 -167 117 -104 9 104 -28 154 -99 7
5185Gj26j1J26P6O6k67M5r6K00O6k98l3K70j10K1J31Q6j55N0J47m03K25j07K8
$$ 7 -119 -130 -4 72 138 -129 -84 -180 20 86 -212 -245 25 -85 -64 67 153 -2 48 195 -208 17 -90 -62
5209f2K88l13L32qk4l5m16O7K6J77Q1J86n14K06j68K99l52J89J73k73K69l56J40
$$ -62 226 -87 245 237 213 178 -238 -171 -145 32 113 299 -215 -9 -177 122 -230 -41 132 -141 128 -228 -88
5232h8J77j44J92j68j04L87m3l7m13L09L7k00O5K98m00J51k15N54o38M09k35K32
$$ -88 89 -55 137 -31 -135 252 209 172 -241 68 105 -95 -30 268 -132 19 -196 358 -280 129 -106 126
5254A26J4j73K32o66M97l1k70M95m9m10L03o6j66Q1J70l66L72l33r0J53J42r0
$$ 126 140 -33 199 -467 30 -1 -271 224 175 -235 68 2 -164 -83 87 -279 93 -240 -330 -177 -35 -125
5276a25K51k2k63j59K87J03N1j84Q3J98j8l41P0J51l38J82P9K49j1o53M62J03
$$ -125 126 104 -159 -318 -31 72 123 -61 22 220 202 -139 -69 82 -256 -74 5 254 243 -410 52 155
5298A55j65o2L04k94J8j47K56J39k46J69r7O5j5k1n1m3K79j83r9k86K20K57k2
$$ 155 -10 -72 232 -62 -44 -191 65 204 -42 127 30 95 80 59 8 -35 244 61 -38 -324 -104 153 131
5321A31k59J77L2q5l03N09j27l4j21j15K75k71J94k6j76J47J05j26M1O1N4k56
$$ 131 -128 49 81 -4 -307 202 75 41 -80 -195 80 -191 3 -23 -199 -52 53 -73 -32 29 83 -173
5343a73K37m1j9j53K31j2N1NJ1l12N1K40O0m13L16J21l20K56j38L3j04K54m65
$$ -173 64 23 4 -149 82 70 121 126 137 -175 -124 116 176 -237 79 200 -120 136 -2 31 -73 181 -284
5366b84L12j0J59k40J78k21K37j99O2k90O6Q0j45O01m28M6L25l25j82J95K4n0
$$ -284 28 18 177 -63 115 -106 131 -68 -6 -296 -230 -150 -295 306 -122 -76 249 -76 -258 -63 -39 -89
5388h9j43M81l18J33o1k33L59o9p2N3J89l28J00P2j59L0j01O3MM7r7J90J57j04
$$ -89 -232 249 -69 64 3 -230 129 60 -12 41 230 -98 2 74 -85 -55 -156 -93 -89 -42 -139 51 208 104
5412A04j18N8J24j21l29L96k5p2l16M90k91J14%l9ML01l66n6lJ76K36k76j24M46
$$ 104 -14 44 168 47 -282 114 89 17 -299 191 -100 14 14 -25 -21 280 -86 -142 -145 31 267 -9 -133 313
5436C13m77J28j43M17j01l23K25l46K10p0L41k1k57J09P8N9k80J11M4J35j94J23
$$ 313 -164 -36 -179 238 137 -186 39 -307 -97 -167 174 153 -104 5 83 142 -138 -27 17 152 -42 81
5458H1j7p7J55l66l1M27l47J85q3J54M0k14L73k29j99m5K10J73j07k31J1LM93
$$ 81 64 -13 142 -224 -255 172 -175 10 -73 81 121 -93 280 51 -148 -193 17 190 83 -148 -137 -134 359
5481C59k49N2j90L1p2J2Lr3L00K25k58j89J75J04l00j60N04o9j69m3M3k7k1J33
$$ 359 110 162 -28 3 -69 -57 -54 -147 153 378 120 -69 106 210 -90 -250 254 185 16 -27 16 -11 -32 101
5505A01p9R0J22j79q9O6k12J75p0P5p8K37l22M91l95J30j10Q8k07L70m29J83R8
$$ 101 22 112 234 55 -34 32 -180 -5 -75 0 -78 159 -163 328 -67 63 -47 41 -166 204 -225 -42 56
5528E6N3K9m20J38O9j85M84j51j33J84l64L69l36L34k50M6k10O04l19L29n33p6
$$ 56 109 138 -282 -144 -75 -260 224 73 -60 124 -240 129 -207 127 -123 -77 -287 317 -2 327 -206 -282
5550b82L99j59l3N7K31j90J74k10l3J15o3J02l21N5J72J83O5N6o47O14p0k62J58
$$ -282 117 -42 -75 -18 213 23 197 -13 -46 69 6 108 -213 -158 14 197 262 318 -329 285 215 -47 111
5573A11j02J47j45Q4m04L67p5N9N3k75no5L84k4mk10Q9K7K6%J30k83r8L80k31
$$ 111 9 156 11 95 -309 58 -17 42 95 -180 -185 -250 134 110 106 -104 -15 12 38 38 168 -115 -213 167 -64
5598f4K23l3l31J08j52mJ77J07j19K63l31q9L14M10l72k86J32O2R2q4j18L00N4
$$ -64 159 126 -205 -97 -249 -253 -76 31 -88 175 -156 -245 69 479 107 -179 -47 15 107 23 -95 205 259
5621B59l33J07m1n6L21m75j01J25L43k83j25L35Q4o8o5j18P4J13j2j89r6M84k10
$$ 259 -74 33 -8 -64 257 -218 -319 -194 149 -134 -259 76 160 92 27 -91 -17 96 84 -105 -201 283 73
5644G3k31K41j69J7K17K3j31K4m4p5j17J76L2j02N4K20m18l1J54O8J91k8k29J46
$$ 73 -158 83 -86 -69 148 171 40 64 20 -55 -172 4 36 -66 -12 208 -210 -241 -87 -19 172 144 -85 61
5668F1K30n67K6K82O3q5j56O9K2j28J04n6J36L32j43j54j31J95k9J03k49j01l0
$$ 61 291 -276 -250 32 95 10 -146 -77 -55 -183 -79 -135 1 333 190 36 -95 100 71 174 -75 -176 -206
5691b06N50j74l37J86K04k73J97k39J19j45k04K39J51j47r6L28j47J02J49k76
$$ -206 344 170 -167 19 223 -50 147 -92 27 -118 -322 -83 68 -79 -175 153 6 108 257 -19
5711a9J06l4M6k08J95L3N0l47Oj07L35j51P7j09k4K08k56K40QK63l12K3R1K5m0
$$ -19 87 53 99 -109 86 119 169 -178 -172 -279 56 -95 -18 -127 -151 57 -199 41 49 312 0 23 114 139 99
5736I9N8j8j68K33k37O8K05q2j25L3j6o2k37K52k6o0M14m61J68K81n73J47K55
$$ 99 157 139 -29 204 -33 35 240 158 33 66 50 -12 -249 3 -23 -83 331 -130 38 319 -254 -107 148
5759A48j27k33K05K70l82K00J53j78M0k07J02p7K88k8j68J62k10Q5n7K31j48l05
$$ 148 21 -212 -7 263 -119 81 234 56 96 -111 -9 -86 202 174 6 168 -42 43 -14 217 69 -236
5781b36N03l59k03K21m7M00L3m42L21m56L51R1k70J61r3m5P2J86k93J91O4j34
$$ -236 267 -92 -295 -74 -121 279 312 -130 191 -265 86 177 -93 68 -25 -70 2 188 -105 86 150 16
5803A6P1k6p8j62J99j52L3K53m45N47m01L70l5m65K86q7o3J67J26k79j4K86j13
$$ 16 87 61 -17 -179 20 -132 -99 154 -291 256 -145 225 190 -275 11 -76 -139 28 154 -125 -139 147 34
5826C4K12n53M21l3j32K10l36M22k24k48N15m51J30K76k13m9n4J72J66l39l1j10
$$ 34 246 -307 114 81 -51 159 -177 245 21 -227 288 -163 -33 243 30 -19 -73 99 265 -74 -105 -215
5848b15K65l48J60K01l3K99l08J62k03p5J79J3j7J39k21P8j10J05j95M7O4J99
$$ -215 50 -298 -138 63 30 329 21 183 -20 -95 84 97 80 219 -2 76 -34 71 -124 -77 -13 186
5870A86p5m29J80L13k53j56K38K10l19K21r4O2O6k6k23on2K62j49O3Q0l28J80
$$ 186 111 -318 -138 175 -78 -234 4 214 -105 116 22 84 150 124 -99 -105 -157 105 -44 19 99 -229 -49
5893d9K51j87r1m5J43k85M14j7K95k05n69K34j51J11L68p0K0j15pJ9K9j08k9j13
$$ -49 202 15 -76 -121 22 -263 151 134 429 224 -345 -111 -262 -151 217 147 167 52 45 64 93 -15 -44 -157
5917a57K06j6o1Q0r6N94n12j15K53O2j05j48K47k68j66J72O4k54K05j00K08l73
$$ -157 49 33 -28 52 -44 550 38 -77 176 238 133 -15 232 -36 -202 -30 34 -220 -15 -115 93 -280
5939b80K19J88k0Qj72M5J67j67j00p1L56l09l7K05J82l27K47J4J4o1q9J67N6j19
$$ -280 -61 127 107 115 -57 -12 155 -12 -112 -183 173 -136 -173 32 214 -113 134 148 162 101 12 179 235 116
5963A16j65l4Q0J49k69J71k40J39K64l66J36m0j75K50k82Q5K62Q3K8J1l3l15L10
$$ 116 -49 -83 -3 146 -123 48 -192 -53 211 -155 -19 -59 -234 16 -266 -181 81 164 192 203 170 -145 165
5986A65j89j97L36j34K51l45P6K59M0l88K31p2l25N57j75l83M85j55L8n0Q5k99
$$ 165 -24 -221 115 -19 232 -113 -37 222 262 -126 105 33 -292 265 90 -293 192 37 75 25 110 -189
6008a89M5J69j43K30Q7J0j05l41M12k76J99J6k55J04J82M0l15j24N1J91L5oj39
$$ -189 -144 25 -118 112 199 209 104 -237 175 -101 98 114 -141 -37 145 185 -130 -254 -203 -12 23 17 -122
6031a22Q4j25K43R5R2n0m46lJ03K49k27J19Q9j47Q2J8n7J00k27J06L2q1q1K77
$$ -122 -38 -163 80 175 267 217 -229 -232 -129 120 -107 12 101 -46 36 54 -3 97 -130 -24 8 -73 -154 123
6055A23M7m9o0K18l42J13p6K34p0l94K78j35L91l99J77k58P0K23Q8l67L19o2K38
$$ 123 170 121 61 279 -63 50 -26 208 138 -256 22 -113 278 -121 56 -202 -132 91 179 -188 131 69 307
6078C07r9m46K19J59j23K7ro5NN0o2M0o0J17l31O7K02K58l37j02K99j54J1q8J22
$$ 307 208 -238 -19 140 17 44 35 -30 -25 25 -37 3 -57 60 -271 -204 -2 256 -81 -183 116 -38 -27 -115 7
6103Go4k4j26jJ81J23j22R7K10j46j39o1MJ57r6k80J51N3l9J83M6l4R0j82lr3
$$ 7 -57 -81 -207 -208 -27 96 -26 71 281 135 -4 -65 -61 96 0 -280 -129 -76 -115 68 114 80 170 -12 -15 -108
6129a08l2K26k03J71J9k1P7k31R2nq0n3M1L93k95j89j59J64j08O9J91M7k55M31
$$ -108 -140 86 -117 54 73 52 129 -102 -10 -15 -95 -148 -107 286 -9 -198 -357 -193 -301 -232 -41 6 -249 182
6153A82o4k24Q6K42m47m3K32n0J23k81K09o2J34Q0j98p3K51j55p7L4R2M92m45
$$ 182 118 -106 -20 222 -225 -268 -36 -86 37 -244 -35 -97 37 117 -81 -154 97 -58 -135 -101 -9 483 38
6176C8k3k23M24k26J94k74J55L68l16l84K48J53p4J39l02k54J74M84k75R8k41
$$ 38 15 -208 216 -10 184 -90 65 433 117 -267 -19 134 60 199 -103 -357 -183 301 26 124 -117
6197a17L39k43K60l33K32p9J38r0N6j98J98J80l42o0m3LP0RL8l33K03K16j42L0
$$ -117 222 -21 239 -94 138 59 197 107 163 -35 163 343 1 -59 -102 -99 -29 -20 18 -315 -112 104 -38 -8
6221hj71Q1L62k73j3n1j8J04O1l57K58K39q6j00J67l50J46j71K20O4k14o2K69
$$ -8 -179 -98 264 -9 -22 -73 -91 13 74 -283 -25 214 128 28 195 -155 -9 -180 40 104 -110 -172 97
6244I7j71J12k33L02k06o8M9j64K03R9J65l51J03j58L90p7k15K7M47m40J28j99
$$ 97 -74 38 -195 107 -99 -167 -118 -282 -79 20 185 -166 -63 -221 169 92 -123 -96 351 -89 39 -160
6266a60L7J17J99l32J42q0M4M5o0O2N4j30o2L46N8k85J05k23J11Q7p7K0j15K3
$$ -160 -123 -6 193 -139 3 -77 -33 12 -48 14 68 -62 -124 222 280 -5 100 -123 -12 75 -2 18 -97 -74
6290g4Q1L7J79m82M43R4m40O06k32j68m5k54J48M8qm7Q3J02j55K8nJ22j38J8l2
$$ -74 7 44 223 -259 184 278 -162 444 212 44 -1 -255 -107 -59 -67 -114 -31 71 -84 -56 -61 61 -77 -59 -91
6315i1JL55m78K58j07J79j85M4k3K17k31J11J95k15K03k47Lj27J70M9R7l61J23
$$ -91 -90 265 -213 45 -62 117 -68 -24 -47 170 -61 50 245 30 233 -14 -11 -138 32 81 178 -183 -60
6338f0j12J43L15o37M00J0r4K51k01k44L46k29L00k78M02q7l19j72L12J54j03
$$ -60 -172 -29 286 -351 49 59 -35 216 15 -229 117 -112 188 -90 312 225 -94 -266 46 200 97
6359I7P9K5j02J41n0k52j59Q2J98P5k21J90k23j30L76j02O1j92K69k9l89K61p4
$$ 97 176 201 99 240 190 -62 -221 -139 59 134 -87 103 -120 -250 126 24 85 -107 162 133 -256 5 -69
6382f9J47k16J34J40Q6pr3o8j06J8K3J54p5j70K65J9M0k11L2k24L04lj12k70L86
$$ -69 78 -138 -4 136 222 215 122 54 -52 -34 -11 143 68 -102 163 182 222 11 43 -181 123 120 8 -262 124
6407A24N9K3l44M09k32l12L52q8o6j29M5L09q2Ok8Pj67Q8R1j30r5p5M01l38J05
$$ 124 183 206 -138 271 39 -273 79 -9 -75 -204 -159 150 68 74 46 53 -114 -26 65 -65 -160 -235 166 -172 -67
6432f7L53k63J41k36L52l27J47j78J51j73l6J12l0J4P8K0j58L70Q4l78k5J21j50
$$ -67 286 23 164 -72 280 -47 100 -78 73 -100 -136 -24 -54 -40 38 58 -100 270 354 -24 -49 72 -78
6455g8l7Q5K18m38K71J94j06r2p5l1L70k58n6l3K81k38k44K59J17j78j20K07J49
$$ -78 -115 -30 188 -250 21 215 109 17 -58 -89 281 23 -33 -66 215 -23 -267 -8 109 -69 -189 18 167
6478A67j56Rk19j3M73l07j85K90J43m00M61o09O33l27l7P9J8k30Q3K40k17J34
$$ 167 11 20 -199 -212 261 -46 -231 59 202 -198 263 -346 287 -40 -77 2 20 -210 -127 113 -104 30
6500C0k9M6L9j52L3K43p8j85J76k51J27N3p4o2o7J97J47j64K37k52l05O0K55q6
$$ 30 1 47 86 -66 -33 210 132 -53 123 -128 -1 52 -22 -84 -151 46 193 29 266 14 -291 -231 24 -62
6524f2J02j81K02P9l48L60k41p5n7K70j22k11O11k24Q3k45k3K02o5J09k52L71
$$ -62 40 -141 61 140 -208 152 -89 -164 -221 49 -73 -284 327 103 186 -59 -82 120 55 164 -88 283
6546B83l99M83k89K08n91M63j25Rj93L06j27k16j31L87j1j80j13M2L70j51o8L21
$$ 283 -116 367 78 286 -305 158 33 42 -151 155 28 -188 -319 68 57 -123 -236 -194 176 25 -43 278
6568B78k99J87o4lp1K20j74l16J37J46K6j64J77j96N3k9K71K07l06j38J2J27j55
$$ 278 -21 166 102 99 28 248 74 -242 -105 41 67 -97 80 -116 -63 -92 179 386 80 -58 -46 81 -74
6591g4K38m08J86n9K57J5J94j83j88J50o6o4L99n8l94J49R2k37j15Q2J87l00L54
$$ -74 164 -244 -58 -117 140 155 349 166 -22 128 62 -2 397 339 -55 94 186 -51 -166 -84 103 -197 157
6614A57k5q9K88j84j64K25l57k1K25J88l61K11l50L68J1l37J06J09K97k18k09
$$ 157 132 43 331 147 -17 208 -149 -170 55 243 -118 93 -257 111 122 -215 -109 0 297 79 -130
6635a30K99k28j91J51J51k2K9j21P1k1p8J84L9k09N5J57j37n6m0K68K4p4k63N1
$$ -130 169 -59 -250 -99 52 30 59 -62 9 -12 -90 94 133 -76 -21 136 -1 -57 -97 171 195 121 -142 -91
6659i1k1LJ9J60P3j30P7n0J37l63J93k0l36L02o9J59J03l2J7J04m50N29n99N7
$$ -91 -112 -109 -90 70 143 13 90 40 177 -186 7 -13 -349 -47 -116 43 146 114 131 235 -215 314 -285 -228
6683b28L54Rj97Q2j24L73m89J09J00J4m6j00R5K41j41k33L57j6j63K52k09j38
$$ -228 126 135 -62 20 -104 269 -220 -111 -11 3 -43 -143 -48 193 52 -181 176 160 -3 249 40 -98
6705i8L09l21M65n68O4L58l47K95k12K04l86M15l34K6J0J19r6P3kr6L53j45J6
$$ -98 211 -110 355 -213 -149 209 -138 157 -55 149 -237 178 -156 -130 -120 -1 -97 -24 -26 -122 231 86 102
6728A02n59O55j71j41J91p5l17L98r5K32k56K7J28j57o9J15J5k90N42p9o8j68
$$ 102 -457 198 27 -114 77 2 -315 83 -12 220 -36 -9 119 -38 -107 8 23 -267 275 196 128 -40
6750d0J22K00m21j3L11k42j63K04J32j77J43K0l36L22K6P1m18K89J47j41k02R
$$ -40 82 282 -139 -152 159 -83 -246 -42 90 -87 56 76 -260 62 88 159 -259 30 177 36 -166 -157
6772a57J13o9kJ01j63n5M68o3l42M55k37j30L00j62J80j53l40J88L84k03q1o3
$$ -157 -44 -113 -115 -14 -177 -232 236 173 -169 286 49 -81 219 57 237 84 -256 -68 316 113 32 -31
6794c1K00K2k48M3j4j0l96L46P5L5J14m7j22J40J31l04J68j17r3J44m25L38j97
$$ -31 169 191 -57 -14 -28 -38 -434 -88 -13 22 136 89 -33 107 238 -66 102 -15 -108 36 -389 -51 -248
6817b48Q5j20J44J82J5P7k66M15m57J02j16J10J58k48L95n61J48K50M6j47j08
$$ -248 -163 -283 -139 43 58 135 -131 284 -173 -71 -187 -77 81 -167 228 -333 -185 65 111 -36 -144
6838a44k5L0p8L50k04p4K58O9p3l9l50K70j69k4K82q5J24k01j44J65J69J53j35
$$ -144 -169 -139 -217 133 -71 -145 113 182 109 70 -280 -10 -179 -203 79 -6 118 -83 -227 -62 107 260 125
6861A25j73K93j15r0j52M0k13R3L72l02K15N9k97k2J46J64r4j14N06o93K09K33
$$ 125 -48 245 130 40 -112 -72 -285 -192 180 -122 93 152 -145 -167 -21 143 49 -65 441 -252 -43 190
6883A90j95J91k47k96M73l3LN0k07J63k92J91M1m50L94k3L5K61l42J23k58K22
$$ 190 -5 186 -61 -357 116 83 86 136 -71 92 -200 -9 32 -418 -24 -47 -12 249 -93 30 -228 -6
6905fP4J1j51J47L2j40K71l74P6k18K12r4J68J25j51J85q0pj71K69k86M06j17
$$ -6 68 79 -72 75 107 -33 238 -136 -60 -278 -66 -160 8 133 -18 167 87 80 -91 178 -108 298 181
6928A81j75r5p9M09l72L44m7q8L2k23L6r4J32J77r5j97J19K0Q2n4K8n2K76l2j26
$$ 181 6 -89 -168 241 -131 213 166 78 110 -113 -77 -171 -39 138 43 -154 -35 -15 67 13 41 -11 265 233 107
6953A07l26R2J77QR2k05J24k66K17j8j18K6m4j00K04NJ13l35M06k2l80n3L65j6
$$ 107 -219 -127 50 58 150 -55 69 -197 20 2 -116 -90 -134 -234 -30 -25 88 -247 159 137 -243 -296 69 53
6977E3j28M34k27m9k13L01j10K01k15m01L71Jk28K93J54k61L6J34n5m38L13j71
$$ 53 -75 359 132 83 -130 171 61 262 47 -354 17 18 -210 83 237 -24 12 146 91 -347 -34 -205
6999b05L85l9kj75J20J45M7q0m67L13j6K46l44j9J34j33J58K1l2R6k71JK01Oj55
$$ -205 180 141 139 -36 84 229 276 196 -271 42 26 272 -72 -91 43 -90 68 89 57 153 -118 -117 84 90 -65
7024f5K66m14K90k93K34J27k49L00o0k7n0j37l8J05N5J40m16J85O2J85l09J97
$$ -65 201 -213 77 -216 18 145 -104 196 136 109 59 -78 -116 -11 44 184 -232 -47 15 200 -109 88
7046H8n7L1Qk60K03j38R3K25m43Q7J92J39j62n2P0p9P4l1n7J65k31L17j21K23
$$ 88 31 62 70 -190 13 -125 -32 193 -250 -163 29 168 6 -46 24 -55 19 -12 -69 96 -135 182 61 284
7070B84j94J0j13k5n0q5K17j07J77k07j0K51m5k62L95k17j99O0J51j9J21j29r2
$$ 284 90 100 -13 -38 -88 -173 44 -63 114 -93 -103 148 103 -159 236 19 -180 -120 31 12 133 4 -88
7093h8k15K65K8k71O26j62m0K7l02J40J28k83O3K80m13J48kJ91k8MO6l62K95j31
$$ -88 -303 -38 -10 -281 345 183 143 170 -132 8 136 -147 -84 196 -217 -69 -71 120 92 96 162 -200 95 -36
7117c6J03K84k24k28J39R4j35J63j15k43L08j39K10k42K13l29J93O2L0o9j08J51
$$ -36 67 351 127 -101 38 132 -3 160 45 -198 110 -29 181 -61 152 -177 16 78 108 39 -69 82
7139H2m0p7k82K10P6K7m3J34k53L89l36L66k27mj05J51j90j93J80%J78ok5jq8
$$ 82 42 -35 -317 -107 -31 -4 -47 87 -166 223 -113 253 26 22 -83 68 -122 -315 -135 -135 43 37 12 11 -77
7164g7K37l13J30J18k91L06P0K3l32lJ81k7j59QJ61m0J08l36L63r6r8J82j48K31
$$ -77 160 -153 -23 95 -196 110 180 203 -129 -132 49 22 -137 -129 32 -8 100 -236 127 31 -67 115 -33 198
7188A98p5l22K03R5J0k73N55k64q5J37l32R6l1j17M17J5j01k37L0j2J94k21J8
$$ 198 123 -199 4 99 109 -164 391 127 42 179 -153 -57 -88 -205 212 227 126 -111 -81 -93 101 -120 -102
7211a02K41J47J5j03J95k94l1N0R7j06j09j9r9L43J70j83j65K5K30m20r3R0K9
$$ -102 139 286 301 198 393 99 68 118 215 109 0 -19 -118 225 395 212 47 72 302 -118 -211 -121 -92
7234i2M24l7n74N19j70J8k53J57J84j67l87M64j41j10J36k35L31j11K49k72lJ19
$$ -92 332 295 -279 240 70 88 -165 -8 176 9 -378 86 -55 -165 -29 -264 67 -44 205 -67 -70 49
7256D9j42K54k09k19N04m2l6k08j41J38K32k77j54K63p5K73j39j49J4K90l00j26
$$ 49 -93 161 -48 -267 237 195 159 -49 -190 -52 180 -97 -251 12 -63 210 71 -78 -64 226 -74 -200
7278b00K64j3m00M48k0j39J72j19j99K81o9QK63l75K02k40M70j12m73N31m50M73
$$ -200 64 51 -349 99 79 -60 112 -7 -206 75 6 14 277 -98 104 -136 334 222 -251 280 -170 303
7300C03p5l26K09q9n7j43K12p7q5R7M2q2J13Q4Q1j47k76J3K70k83L13L4J68j10
$$ 303 228 -98 111 22 -35 -178 34 -43 -128 -31 11 -71 42 126 207 60 -216 -203 67 -216 97 131 299 189
7324A89m80O7L63j57J24l5Q1J43l85n3N8N1K81o8j75K04j34k67J18OJ1K35r5j29
$$ 189 -291 -224 139 -18 106 71 152 295 -90 -143 -85 -34 247 179 4 208 74 -193 -75 -69 -58 177 82 -47
7348d7N1nR0J01m1K2j68l60O59l24j07K35j38r0J03k79J92N10m50k9q0K27k80
$$ -47 4 -1 89 190 149 171 3 -357 302 -22 -129 106 -32 -122 -19 -298 -106 404 -46 -75 -155 72 -208
7371b08K50P6j41J38k00J31m00K54k1O5J65l35K55k60M04M8j79p0L47k37o3p1
$$ -208 42 118 -23 115 -85 46 -354 -100 -121 -56 109 -226 29 -231 173 221 42 -28 319 82 19 -52
7393e2J26k3j18oK97l46K2M0K62k10nJ93j03O1k17J02k69M61k97K02J9o8J4k86
$$ -52 74 51 -67 -73 224 -122 -100 -60 202 -8 -13 180 77 138 -79 23 -246 215 -82 120 139 71 85 -201
7417b01L31J34k98J19P1p7r5O7N9K45m55m6p6k6L33l0j93J14O8l7J27l37K70j56
$$ -201 130 264 -34 85 156 79 -16 51 110 355 -100 -146 -222 -248 85 55 -138 -24 44 7 134 -203 67 -89
7441h9Q2j59J75L39l83j01Nk4J95j43P0J51j56k63M43j57J87k4J21l55J54j34
$$ -89 -7 -166 9 348 -35 -136 -131 -155 40 -103 -33 118 -38 -301 142 -15 172 148 269 -86 68 -66
7463f6J63p3R6j00j32K16k36NK36k02J96l8j50j74R9J9P4j76J86O0NJ47j67p1
$$ -66 97 24 120 20 -112 104 -132 -127 109 -93 103 65 -85 -259 -160 -141 -67 -243 -57 3 8 155 -12 -83
7487h3m6K80k5N8j38j6j02J84l53R3K28K25l20J53k65N5J11K8q1k85L64R8K8N4
$$ -83 -129 151 126 184 46 30 -72 112 -241 -148 80 305 -15 138 -127 -72 39 67 -14 -299 65 163 191 245
7511B45j21M0m4j50j98L34L0J48j18k96j41L48O2k51J16K33k79k39K27K0r0KJ62
$$ 245 124 164 120 -30 -228 106 136 284 166 -130 -271 77 139 -112 4 237 -42 -281 -54 -34 -124 -122 40
7534D0K07m93J78K93j94j62j53N73m5K44m99K12k46M1j5m5l25M64j68L56m0l77
$$ 40 247 -246 -68 225 31 -131 -284 289 244 488 -11 201 -45 -4 -19 -64 -389 75 -93 263 223 -154
7556a54j25L39j97P4M9j3j16L79k21Q7j85j39K52R1r7o6K23k30N9m6K6j9K85l86
$$ -154 -279 60 -137 -63 -14 -27 -143 236 15 102 -83 -222 30 121 24 -42 181 -49 10 -36 -10 -29 256 -130
7580a30K48q4J81j66K34j49k75J76rJ58j51K8j06oL9J35j12j85O38k34j70k26
$$ -130 118 34 215 49 283 134 -141 35 26 184 33 61 -45 -51 -12 123 11 -174 464 230 60 -166
7602a66R4J0L52j30k66j69l2p0J18J93J76Mmk43Q6j00J8p2M0Q0J2R9j74J80n8
$$ -166 -72 -62 290 160 -106 -275 -307 -377 -259 -66 110 114 110 -133 -47 -147 -129 -201 -161 -81 -69 30 -144 36 -22
7627b2Q7Q0K20k96j99J2L55k86k4J03m7JM3j0O6Qj11Qk9N8J41Q4l13Rj01J79j86
$$ -22 65 145 365 69 -130 -118 237 -49 -73 30 -17 -16 27 17 83 91 -20 -12 -41 17 158 242 -71 -62 -163 16 -170
7654a70L66P4J34j14n28R3K50j40J00q1r9J69J77j93j70L75j70J9K9k70J34j5
$$ -170 196 270 404 290 -238 -145 105 -35 65 -16 -115 54 231 38 -132 243 73 92 121 -149 -15 -30
7676c0J66K0j83j52J99K7l4Nr0K8J28j32q6J03j76K19j27K94k40J55j62j03J53
$$ -30 136 156 -27 -179 20 47 13 18 -72 -44 84 -48 -134 -31 -207 12 -115 179 -61 94 -68 -171 -18
7699a8m5K13l5k25K47j31j43mQ2L06k97k2k03M88l29j27K16j37N45n34L39m03
$$ -18 -63 150 115 -110 137 6 -137 -141 -59 247 -50 -72 -275 213 -116 -243 -27 -164 381 -153 186 -217
7721b17L2O7K67l3J38l09j2O1L34k06p9p5P6l09O6K98k37J3K21L9j97j84j5K65
$$ -217 -185 -118 149 116 254 -55 -67 -6 328 122 43 -32 44 -265 -199 99 -138 -125 96 135 -62 -246 -261 4
7745Dq0l1J86L8j16K5l02K86Mj70j31L74j83qJ13N4m05K87J93k08L42j75o0k25
$$ 4 -76 -107 79 117 1 26 -276 10 14 -156 -287 87 -96 -104 9 63 -342 -55 138 -70 272 97 37 -188
7769a88K52j5k5J92j61j28J69j86K24j4k03J14k09K32l03K00J19j10mK03l34K62
$$ -188 64 49 24 216 55 -73 96 -90 134 120 -83 31 -178 54 -249 -49 70 -40 -44 159 -175 87
7791H7k36J55K30k52r4Q7L6K48l08k40N32j26k79K75j73p5O5pP6N2K6N3M0j0l90
$$ 87 -149 6 236 -16 -110 -23 13 261 -47 -287 245 119 -160 115 -58 -133 -68 -75 1 53 79 132 172 162 -228
7816b28K28m1rP4p0j99K14N4J92j04k37o2K86m18J80M48k82q0Q6k03L30j40J31
$$ -228 0 -41 -50 24 -46 -245 -31 23 215 111 -126 -188 98 -320 -140 308 26 -54 32 -171 159 19 150
7839A50q2l4p6M20m01k6O4j7J48l75N03l63J80l07K57j21K9M9O9l41L91j73K9
$$ 150 68 34 -42 378 -23 -49 15 -2 146 -229 274 -89 91 -216 41 -80 -51 -2 67 -274 117 -56 -27
7862b7J20k17L04l22K81J08k24R8n19O45k13N0J81p9k60J21O9l28K36m4j06J43
$$ -27 93 -124 180 -142 139 247 23 121 -398 247 34 84 265 186 -74 47 116 -212 24 -20 -126 17
7884A7P4l12J65K49k46MQ2j25J68k58K14K28N3o06K67N6k1kn0L83l65L46l89m8
$$ 17 91 -221 -56 193 -53 -49 33 -92 76 -182 32 260 313 -293 -26 30 9 7 -43 340 -25 321 -68 -116
7908a16K30r3N0j98J96JJ20k61J95J83j58J3k74rM49n55M0JK30L56l89N9j02j55
$$ -116 114 21 71 -127 69 70 190 -71 124 307 149 162 -112 -121 328 -227 -187 -186 44 400 11 70 -32 -187
7932a87O3J53j21j19K49j62R0J0r3p0L39l7R6m02J67p8K48k63J97j31N1p3K9Q8
$$ -187 -124 29 -92 -211 38 -124 -34 -24 -117 -187 152 115 211 -191 -24 -102 146 -117 80 -51 0 -73 -44 44
7956D4r4K37Q8o01L01j31L73k85P0l6JJ07L5j75J26j55K61q6j31L14l41O5J63
$$ 44 -50 187 275 -326 -25 -156 217 -68 2 -34 -33 74 109 -66 60 -95 166 80 -51 263 -78 -13 150
7979A50j49L03j85j56K90k10J1Pk05K4K6r2M29m78L44j72J74Qj10P8q8K1j05J21
$$ 150 1 304 119 -37 253 43 54 61 -144 -120 -94 -186 243 -235 109 -63 111 119 9 87 -1 20 -85 36
8003C6J3J84l3M8k18j74R7J88j12j80J90r6K57j71l31P01l20k19J29K03q5m9K41
$$ 36 49 233 200 248 30 -144 -47 141 29 -151 39 -57 200 29 -302 399 79 -140 -11 192 107 58 299
8026B99m08o3L68j1n9j20j14N1J47k41J58o8O8K71k20l1Ok33j37K21O0J80n2j88
$$ 299 -109 -172 196 185 126 6 -108 -57 90 -151 7 -61 7 278 58 27 33 -200 -337 -116 -56 124 72 -116
8050a16K01j55k09J02J77o9L12k93j19J85j29J63l4J6j8r9K08m6j26J36l99M78
$$ -116 85 -70 -279 -177 0 -69 243 -50 -169 16 -113 50 16 32 14 -85 123 77 -49 87 -312 166
8072A66k89M2J53j54Pk3J80l58J51J0K18j63Q6n2K05k14R0q7qJ79l24K75l19j73
$$ 166 -123 -81 72 -82 -75 -98 82 -276 -125 -115 103 -60 26 -26 179 -35 55 -32 -40 139 -185 90 -229 -402
8096d02M22Q8j59m4PJ8J05K8mJ06j99J14k60K83K6j80J49l06M23m89l6J97K41
$$ -402 20 108 -51 -95 -88 -70 35 63 59 165 -34 80 -180 103 129 -51 98 -208 215 -274 -310 -113 128
8119A28k40Q2J69P0m2n0o5j99J14J23rm9Q1k33J13L24l60J13J5r9o7J0L17m56
$$ 128 -112 -30 139 209 167 117 52 -147 -33 90 81 32 113 -120 -7 317 -43 70 85 -14 -81 -71 246 -210
8143b10K6M3J05p3k0J75k27j7K71k82r2M57k93n0J51kJ18j1j27L07k25m4J32O8
$$ -210 -184 -141 -36 -109 -129 46 -181 -198 73 -209 -301 156 -137 -187 -36 -38 80 69 -58 249 24 -20 112 180
8167A80k53m9L16l81L16r5K84j94l26L71l80J53k01M56j69l2l26J43K0K82M8k79
$$ 180 -73 -122 194 -187 129 34 318 124 -202 169 -211 -58 -259 197 28 -4 -330 -187 -167 115 163 -116
8189a16K37l9
$$ -116 121 82
8191H2
$$ Imaginary data points
##PAGE= N=2
##DATA TABLE= (X++(I..I)), XYDATA
0@%%%%%%%%%Qj6J6j6K4l2L2m0M8n6O9p7Q8j04J21j40J62j86K13k42K70l04L43
$$ 0 0 0 0 0 0 0 0 0 0 8 -8 8 -8 16 -16 16 -24 24 -32 37 -40 48 -56 65 -75 87 -99 114 -128 142 -162 181
32A81l83M28m78N32n93O59p30Q09q97R94j101J220j352J499j665J855k070K322
$$ 181 -202 226 -252 280 -313 346 -384 425 -472 522 -579 641 -711 788 -877 978 -1092 1230
50A230k619K976l414L962m679N659p087R364j3579K3995r6445j73581J62725K06525
$$ 1230 -1389 1587 -1827 2135 -2544 3115 -3972 5392 -8187 15808 -80637 -254218 -91493 115032
64A15032N0055j36816j33488l7670P8944J22687P3857p0449j47377o3985R8777
$$ 115032 165087 28271 -105217 -142887 -63943 58744 132601 62152 -85225 -149210 -50433
75e0433J34293K8444q7120r5181l0440N1974R1679N6133m8434j12550n4236O8818
$$ -50433 83860 112304 25184 -69997 -100437 -48463 43216 99349 50915 -61635 -115871 -47053
87d7053J10712L3778o7555r0144k9988N3763Q8257L9741n5514r6828l2750O7264
$$ -47053 63659 97437 29882 -60262 -90250 -36487 51770 91511 35997 -60831 -93581 -26317
99b6317Q7879J5350o3951p1605j3852N0252O7145K1065m7986p1490k0122N4299
$$ -26317 61562 76912 12961 -58644 -72496 -22244 44901 65966 17980 -53510 -73632 -19333
111a9333P0800J0798n7319o0330l02N1070M4024k52l4146l5234j5814J8621M9375
$$ -19333 51467 62265 4946 -55384 -55686 -4616 39408 39156 5010 -30224 -46038 -27417 21958
124B1958L5820k8785p3648l0316N8090P6844J875o8874n1787J6793N2756L3659
$$ 21958 57778 28993 -44655 -74971 -16881 59963 61838 -7036 -58823 -42030 10726 44385
136D4385p937l9586l9297J841M9367M0945j9777n3278j7716L0175K8121j086q154
$$ 44385 36448 -3138 -42435 -40594 8773 49718 29941 -23337 -41053 -10878 17243 16157 8003
149H003n365j6211j5410J8734L7383L415l8041k6967J3774K6659J0174l908j3007
$$ 8003 2638 -13573 -28983 -10249 27134 30549 -7492 -34459 -20685 5974 16148 12240 -767
162g67k1257r007K4923L2609o660l7165j5338K1010J8822j441k595K83j5879j7303
$$ -767 -22024 -31031 -6108 26501 19841 -17324 -32662 -11652 7170 5729 3134 3417 -12462 -29765
176b9765J7051L6866J953l9365k3176K2551K9301n84j5678p169k438j509J0037
$$ -29765 -12714 24152 26105 -13260 -36436 -13885 15416 14832 -846 -8015 -10453 -11962 -1925
189a925J6219o33j9078j2067R357J4158N939j839q371j4164l043J8493J9038o600
$$ -1925 14294 13661 -5417 -17484 -8127 6031 11970 10131 1760 -12404 -15447 3046 22084 15484
203A5484k4058j0904J3456J9594N118j1597j6664m091J4265J5831k855j5786n792
$$ 15484 -8574 -19478 -6022 13572 18690 7093 -9571 -13662 603 16434 13579 -2207 -7999
216g999Q571M883k598J247M655m925j0582J025J3066N244p804p810k95K342M510
$$ -7999 572 5455 2857 4104 8759 3834 -6748 -5723 7343 12587 4783 -3027 -3322 -980 3530
231C530P395j248j3745o955J2712J3322q260j3817M680J0914n992j0190Q587J3327
$$ 3530 10925 9677 -4068 -11023 1689 15011 6751 -7066 -2386 8528 2536 -7654 933 14260
245A4260q212j8703L138J8685L316j2846n937M992J164p43O777K928j1642j0398
$$ 14260 6048 -12655 -9517 9168 12484 -362 -6299 -1307 -143 -886 5891 8819 -2823 -13221
259a3221J0677J5406n180j5536R61J1910j014r150M108R816n436j2974L017J5098
$$ -13221 -2544 12862 7682 -7854 -6893 5017 4003 -5147 -1039 8777 3341 -9633 -6616 8482
273H482J698j2369n065O599M303j820P95J078n701l606P414P542o177r186M027
$$ 8482 10180 -2189 -7254 -655 3648 1828 2623 3701 -2000 -5606 1808 9350 3173 -6013 -1986
288a986R118l576q273L819Q818l535r847J265R698J828p236l579K542K620J114
$$ -1986 7132 3556 -4717 -898 7920 4385 -5462 -4197 5501 7329 93 -3486 -944 1676 2790
303B790M86k517m612J681O642J96p186j625P182K030p399k297O777L639n989m459
$$ 2790 3276 759 -3853 -2172 4470 4666 -2520 -4145 3037 5067 -2332 -4629 2148 5787 -202 -4661
319d661L212L836n46p69n33l472j235O908M923p988q211O069J0192l844r850K380
$$ -4661 -1449 2387 1841 1072 539 -2933 -4168 2740 7663 -325 -8536 -2467 7725 3881 -5969 -3589
335c589Q652k024q169K502Q098k480p886J967O180j096n185K837L298n032l302
$$ -3589 5063 3039 -5130 -2628 5470 2990 -4896 -2929 3251 2155 -3030 -193 3105 -1927 -5229
350e229P139M849q534o730Q815P525p407q683O485R136o071q837M855Q466l264
$$ -5229 1910 6759 -1775 -8505 310 7835 428 -8255 -1770 7366 1295 -7542 -2687 5779 2515
365B515p742K494N225j618l298K955J416m773j014O941J478p965l463Q301M828
$$ 2515 -5227 -2733 2492 874 -2424 531 1947 -2826 -3840 3101 4579 -3386 -6849 1452 6280
380F280p500n710O558O084n980n703M328N357k685m197J356K650j545l11K389
$$ 6280 -1220 -6930 -372 5712 -268 -5971 -1643 3714 1029 -3168 -1812 838 -707 -1018 1371
395A371j441m032J882O096j255p222J64P226J280o646k002O100K032m927j993
$$ 1371 -70 -4102 -2220 3876 2621 -4601 -4437 2789 4069 -2577 -4579 1521 3553 -1374 -3367
410c367L930J716k582r65K296m60j784K264K301l341l420M064N124l952o035L313
$$ -3367 563 2279 -303 -1268 1028 568 -1216 1048 3349 8 -3412 652 5776 1824 -4211 -898
426h98O310k208o614K073N454n70o066J356M548j320l728J562K604k462j842L791
$$ -898 5412 3204 -3410 -1337 4117 3547 -2519 -1163 3385 2065 -1663 -101 2503 41 -1801 1990
442A990J721n144k901O325L782o815n022O354N867n468n960M269N706l333m903
$$ 1990 3711 -1433 -4334 1991 5773 -1042 -6064 290 6157 689 -5271 -1002 4704 1371 -3532
457c532K817L785k659k380L248Q24l798m37N873M25p094j125P908K429p383k950
$$ -3532 -715 3070 411 -1969 1279 2103 -1695 -2132 3741 4166 -2928 -4053 3855 6284 -1099 -4049
473d049O533L421n566k924N041K418m611j449M041J255m365m3M234n61m452J058
$$ -4049 2484 5905 339 -2585 2456 4874 263 -1186 2855 4110 -255 -298 3936 3375 -1077 -19
489a9M554j911m826J369N741j689o194J329O058q77o170K48N498J06m589k79L077
$$ -19 4535 2624 -2202 -833 4908 3219 -2975 -1646 4412 3535 -2635 -2387 3111 3217 -1372 -1651 1426
506A426n02k095J662J367l080j767M452K869n312l502M270N298l714n570K762
$$ 1426 924 -1171 491 1858 -1222 -2989 1463 4332 -980 -4482 -212 5086 1372 -4198 -1436
521a436M893j551m288J510L783j585k406J815J585k557r73L392Q70m416r94M775
$$ -1436 3457 1906 -2382 -872 2911 1326 -1080 735 2320 -237 -1210 2182 3052 -1364 -2358 2417
537B417K263n390k879M749L193l886l221L286K219k875k036L122R07l627j195
$$ 2417 4680 -710 -3589 1160 4353 467 -2754 532 2751 -124 -2160 962 1869 -1758 -2953
552b953M096R47m239j083L905N48m178n14M497K29n207N03M917J84o127l45O030
$$ -2953 1143 2090 -2149 -3232 673 1221 -2957 -3471 1026 1255 -3952 -3449 1468 1652 -4475 -4820 1210
569A210J422n325k394M397K248k521j118J424n67j155K535K421m055l558L903
$$ 1210 2632 -2693 -5087 -690 1558 -963 -2081 -657 -1224 -2379 156 2577 -1478 -5036 -1133
584a133N681k462o561J484O112q69m000M56L077j183k434K470K760l359l237L345
$$ -1133 4548 2086 -4475 -2991 3121 2252 -1748 -1292 1785 602 -1832 638 3398 39 -3198 147
600A47M039l667m107K988L766k506m157K891L575l267l369K650K938k680k610
$$ 147 4186 519 -3588 -600 3166 660 -3497 -606 2969 -298 -3667 -1017 1921 -759 -3369
615c369K461K138k879j940L194R43k918j085L255P39l642k51L525L2m099J76M785
$$ -3369 -908 1230 -1649 -3589 -395 548 -2370 -3455 -200 539 -3103 -3354 171 203 -3896 -3720 1065
632A065j78n134n50N987J172o034k289N719L077m409k888K386J981q95j14J057
$$ 1065 887 -4247 -4797 1190 2362 -3672 -5961 -242 2835 -1574 -4462 -2076 -95 -990 -1104 -47
648d7j783k026L120M117l167n302P08O213J045m417j893J935J461l65J002j24
$$ -47 -1830 -3856 -736 3381 214 -5088 -4380 1833 2878 -1539 -3432 -1497 -36 -401 601 477
664D77l271r82M706L125m633m860L375N382j597m568O34L479k15k785J220K474
$$ 477 -2794 -3776 930 4055 -578 -5438 -2063 3319 1722 -2846 -2212 1267 1052 -1733 -513 1961
680A961k572k182L033K968k507l876K109M091j130l696N34K730n48q35J049J60
$$ 1961 -611 -2793 240 3208 701 -3175 -1066 3025 1895 -1801 -1267 1463 915 80 1129 1289
696A289k379K94L237M55m626o41M818J240m012k626M097K410m138j971L653J762
$$ 1289 -1090 -796 2441 2896 -1730 -2371 2447 3687 -325 -2951 1146 3556 -582 -2553 1100 2862
712B862l067j350K318R13k813M3L565q02m573K67N755P26n347k808M233L292k078
$$ 2862 -205 -1555 763 1676 -1137 -1094 2471 1669 -2904 -2637 3118 3844 -1503 -4311 -78 3214 1136
729A136k703L00N08Q2J970N96l113k791L520M172j912n305Q29M654P5l324N0K197
$$ 1136 -1567 -1267 -759 -677 1293 1889 -1224 -4015 -495 3677 1765 -3540 -2711 1943 2018 -1306 -1256 941
747I41q63k134K596K379k977l460K994M426k416m663J511M279J74l106m52J441
$$ 941 78 -2056 540 2919 -58 -3518 -524 3902 1486 -3177 -1666 2613 2787 -319 -771 670
763F70k20l71J553M06k773o98K922K101l059k536K622K441k141j314J684J059
$$ 670 450 79 1632 2038 -735 -1433 1489 3590 531 -2005 617 3058 917 -397 1287 2346
779B346j952j062L063M09l066m78K983Q04l578o87L937R41l814j750L849K148
$$ 2346 394 -668 2395 2804 -262 -740 2243 3047 -531 -1218 2719 3660 -154 -1904 1945 4093
795D093l582k354K433J892j438j037J245n77j532J036K211j182k795L52L175J6
$$ 4093 511 -1843 590 2482 1044 7 1252 675 -857 179 2390 1208 -1587 -1235 1940 1956
811A956k961n49K577R5k005M14J971j432k172J906K949j815l875J417M034p39
$$ 1956 -1005 -1554 1023 1118 -887 -473 1498 66 -2106 -200 2749 934 -2941 -1524 2510 1771
827A771l604k68L540jk571L82J865j071j808J672K381k065k456J126L361p87k891
$$ 1771 -1833 -2101 1439 1438 -1133 -751 1114 43 -1765 -93 2288 223 -2233 -1107 2254 1467 -1424
844a424L86K085p80j102J508O10k100j218K940J451k933j532K104J677j790j664
$$ -1424 -1038 1047 267 -835 673 1283 -817 -2035 905 2356 -577 -2109 -5 1672 -118 -1782
860a782K234J434k802j202K828J465k710j501K079J700k247j171K293R80k464
$$ -1782 452 1886 -916 -2118 710 2175 -535 -2036 43 1743 -504 -1675 618 1598 -866
875h66q28K764O05k801o06K469N29k060k81J536O34j855LK093n75k150O84K300
$$ -866 -1694 1070 1675 -1126 -1732 737 1266 -794 -1075 461 1095 -760 -757 1336 761 -1389 -705 1595
893A595o81k766Q52K902m46k871N45K145n77k136J032J979p21k536J075K469r97
$$ 1595 914 -1852 -1000 1902 1456 -1415 -870 1275 698 -1438 -406 1573 852 -1684 -609 1860 863
910H63k901R12K478n96k145Q55J305j067j248J651J787k241k020J930K109j418
$$ 863 -2038 -1126 1352 756 -1389 -534 771 -296 -1544 107 1894 -347 -2367 -437 1672 254
926B54j663Q80J593j561j077J680J327j905j167J969J600k288j505J454J652j631
$$ 254 -1409 -529 1064 -497 -1574 106 1433 -472 -1639 330 1930 -358 -1863 -409 1243 -388
942c88j342J722J124j583j119J915P10j699p38J664Q49k083n49K081O87j872o99
$$ -388 -1730 -8 1116 -467 -1586 329 1039 -660 -1398 266 1115 -968 -1517 564 1251 -621 -1320
959a320J759Q29j976m37J808L58j973r1K000J99j963k54K216k77j864P4K392n27
$$ -1320 439 1268 -708 -1145 663 1021 -952 -1043 957 1156 -807 -1061 1155 878 -986 -912 1480 953
977I53k162N37K131n43j886L04J506M0j914P39J728o61j797M79K196p80j558L01
$$ 953 -1209 -672 1459 916 -970 -666 840 880 -1034 -295 1433 772 -1025 -546 1650 870 -688 -387
995c87J852r76j418Q84J465j189j124J100J112j057j494J573J087j480j450J453
$$ -387 1465 489 -929 -45 1420 231 -893 207 1319 262 -1232 341 1428 -52 -1502 -49
1011d9J642j512j314J435J093j362j339J598J025j586q45J644P25j421q02J993
$$ -49 1593 81 -1233 202 1295 -67 -1406 192 1217 -369 -1214 430 1155 -266 -1068 925
1027I25M17j762n57J555N37j327o62J549O23j603n65J439O96j732l33J776L23
$$ 925 1342 -420 -977 578 1115 -212 -874 675 1298 -305 -870 569 1265 -467 -800 976 1299
1044A299j955r7J566L66j814j97J744j4j921J13J825k23j631J75J625k24j681
$$ 1299 -656 -753 813 1179 -635 -832 912 898 -1023 -910 915 692 -939 -764 861 637 -1044
1061a044L00J416p5j308k9J599m38j739Q98J509r49j329N49J595p39j409N79J545
$$ -1044 -744 672 597 -711 -740 859 421 -1318 -420 1089 140 -1189 -640 955 216 -1193 -614 931
1079I31o02j551O81J365o84j286J059Q65n34j496J306J128j278j032J251J186
$$ 931 329 -1222 -541 824 140 -1146 -87 778 244 -1252 54 1182 -96 -1128 123 1309
1095A309j304r52J059Q64j045p90J220N24r80p73J204R46j534q67J558N13j145
$$ 1309 5 -947 112 976 -69 -859 361 885 -95 -868 336 1282 -252 -1119 439 952 -193
1112a93j186J521Q40j424n22J225N94j786k86J827M5j679R5J409K38j791J13J465
$$ -193 -1379 142 982 -442 -964 261 855 -931 -1217 610 655 -1024 -929 480 718 -1073 -960 505
1130E05K18j771j84J293J25j115J53J425m18j188K97J767m53j879O40J575l31
$$ 505 723 -1048 -1232 61 186 -929 -776 649 231 -957 -660 1107 654 -1225 -585 990 659
1147F59j589K93J551n31j041N49P95m08j110N50J188q63j146R55J182p97j284
$$ 659 -930 -637 914 383 -658 -109 686 278 -832 -282 906 43 -1103 -148 1034 237 -1047
1164a047P30J450r23j157N03J035q22o77J080K63r65m08R97Q17q94j197J017R17
$$ -1047 -317 1133 210 -947 -444 591 -231 -908 172 435 -530 -938 59 876 -18 -1215 -198 719
1182G19r46j096J406M72q40k70M16O27r76j77J255J32j612R9J218M78j466j18
$$ 719 -227 -1323 83 555 -285 -555 -139 488 -488 -665 590 722 -890 -791 427 905 -561 -679
1200f79Q80N51j073m68J316Q1j190m4J452L7j213l53J271R2j440M4J322J37r42
$$ -679 201 752 -321 -789 527 608 -582 -626 826 863 -350 -703 568 660 -780 -736 586 723 -219
1219b19K9M97J48j011N21M74k53j065M49J494p47j106L34J340l16j486M23J192
$$ -219 -190 307 455 -556 -35 439 186 -879 -430 1064 317 -789 -455 885 569 -917 -494 698
1237F98n82n94R3R74o34n11Q33N85r11r29J004J048o68j168N37R26n78p21M30
$$ 698 116 -478 -385 589 -45 -556 277 862 -49 -978 26 1074 406 -762 -225 701 123 -598 -168
1256a68Q30m64m06M96N08r16n81R24Q41o64j385J339O09j048o7N29L06j187J7
$$ -168 662 198 -208 288 796 -120 -701 223 1064 400 -985 354 963 -85 -152 377 683 -504 -487
1275d87R78L51j387P3J150L81j252n08J292n9p21m74J363k28p29KP26J05j022
$$ -487 491 842 -545 -472 678 1059 -193 -701 591 532 -189 -663 700 472 -257 -255 471 576 -446
1294d46Q1J127j84j124J78J067m07o65J38P46k25p11M18L21m5n58K68P94n33j144
$$ -446 -365 762 578 -546 -368 699 292 -373 -235 511 286 -425 -7 314 269 -289 -21 773 240 -904
1314i04Q61R33p57p86L22J398q83n26o0J010m79o79N05O57q99k32N29P35p40r66
$$ -904 -43 890 133 -653 -331 1067 184 -342 -402 608 129 -550 -45 612 -287 -519 10 745 5 -961
1334i61Q32Q77k46j095M27L52k84j69O32J28q31m55J148L01p67m90Q06L22n38
$$ -961 -129 748 502 -593 -166 186 -98 -267 365 493 -338 -793 355 656 -111 -601 205 527 -11
1353a1l73P64M9n12j01N15p2q48L62O00L41j161l62J115Q01j604j98P71M66r24
$$ -11 -384 380 429 -83 -184 331 259 -589 -227 373 714 -447 -809 306 1107 -497 -695 76 542 -382
1373c82J11O47k05n43K72N09J8r75K25R50j99r33m6J158l81j002N99O08k43o11
$$ -382 -271 376 171 -372 -100 409 427 -548 -323 627 428 -505 -551 607 226 -776 -177 431 188 -423
1393d23N8Q37n25m49L81N50k02j161Q40O73o16k30k83J103k77p91M04K34m60o5
$$ -423 -365 472 -53 -502 -121 429 227 -934 -94 579 -37 -267 -550 553 276 -515 -111 123 -337 -402
1413d02K17N45n02k61K69L37k2p63K78O61m32k86N61J88q02K58O84n9r05m32J050
$$ -402 -185 360 -142 -403 -134 203 181 -582 -304 357 -75 -361 200 388 -414 -156 528 469 -436 -868 182
1434A82K36o75n11O69N43q56L7N73K10n81k23P19N5p06n0J029l01q25J18O21q2
$$ 182 418 -257 -768 -99 444 -412 -375 198 408 -173 -396 323 378 -328 -378 651 350 -475 -357 264 182
1455A82n06j07O55j87p4q7P13l51o39L50M62No78lN85l28m87K05R86p77k70J21
$$ 182 -324 -431 224 37 -37 -124 589 238 -401 -51 411 416 -262 -265 320 -8 -495 -290 696 -81 -351 -230
1477b30R62q95l4m6P68p03q8J60M85l83m43M64L45l3p58M24O81m79m97M37M97
$$ -230 732 -163 -197 -243 525 -178 -266 -106 379 -4 -447 17 362 329 -429 -5 676 197 -300 137 634
1498F34q28k94R07m5j63n24K59O91q17j09L36L5j71j08O60n38l82J86K81K21j48
$$ 634 -194 -488 419 374 211 -313 -54 637 -180 -289 47 82 -89 -197 463 -75 -457 -271 10 231 83
1519H3l66K49L70m97l5J78R2l42Q5N7L12m79j16N66J5n10J91P73o09l45J32L03
$$ 83 -283 -34 336 -161 -196 -18 74 -268 -183 -126 186 -293 -409 157 172 -338 -147 626 17 -328 -196 107
1541A07J09p25M57J79Q2n01j4L16L08o61K25K84M0j72k32N35m24l16N79J42l25
$$ 107 216 -509 -52 127 209 -292 -306 10 318 -343 -118 166 206 34 -198 337 -87 -403 176 318 -7
1562gj53P9M56k61l19M29Q5l52j49M45j01j92l99O24J37m37j97N35K30l42n37
$$ -7 -160 -81 375 114 -205 224 309 -43 -192 253 152 -40 -439 185 322 -115 -312 223 453 111 -426
1583d26N55M01o99q4K90J20m4m12K49K07l06k1L19j14m04J17M66K3m01k08O41
$$ -426 129 530 -169 -253 37 157 113 -299 -50 157 -149 -170 149 35 -369 -252 214 237 -164 -372 269
1604B69K61o83o4P4K43l59J18K54J02l95K20O7K60q07K10K60m2J25j95L09j6l90
$$ 269 530 -153 -217 -143 100 -259 -141 113 215 -180 40 107 367 -440 -230 30 -12 113 -82 227 211 -179
1626a79J05L45j61l99KL43j95J84m7q5L26m93K22J3j17j45K22K31l00n1Q8K71
$$ -179 -74 271 110 -289 -287 56 -139 45 -2 -87 239 -254 -32 -19 -136 -281 -59 172 -128 -179 -91 180
1648A80j98j60J63J07j07q6K99J86l14m24K77L08j23k92j7M11l50N7K89j64l64
$$ 180 -18 -178 -15 92 -15 -101 198 384 70 -354 -77 231 108 -184 -201 210 -140 -83 206 42 -322
1669c22M7M45J68l33j59L82j12n37K27j26L39j94J14J98j09l98K96o3L56j99j66
$$ -322 -275 170 338 5 -154 228 116 -421 -194 -320 19 -175 -61 137 28 -370 -74 -137 219 20 -146
1690a46K69Q6m19P8P0M46o40J42N0K83j25k42L9J51p5J53j31j56l6K48L82m87
$$ -146 123 209 -210 -132 -62 384 -256 -114 -64 219 94 -148 -109 42 -33 120 -11 -167 -203 45 427 -60
1712f0K14j91K31j27j99K24Q5l64j30N18j9k13k85K37J73o9n09M38J88l0j94O1
$$ -60 154 -37 194 67 -132 92 177 -187 -317 201 182 -31 -316 -79 94 25 -484 -46 142 112 -82 -21
1734b1R2j84J74k43N13k35k54K85oK01l44K41K26p41K50K53j72J85j94K06j37
$$ -21 71 -113 61 -182 331 96 -158 127 121 322 -22 219 445 -296 -46 207 35 220 26 232 95
1755I5l45J25K46j56j74k6J91j39j71L04k6L17j25r3k18K17k31L13M4j79j61K3
$$ 95 -250 -125 121 -35 -209 -235 -44 -183 -354 -50 -76 241 116 23 -195 22 -209 104 148 -31 -192 -169
1777a69K54M3j97j08L01l9k35K62n4Q3n6q0L62n48J31n8M66m70r7L95n13L13k6
$$ -169 85 128 -69 -177 124 85 -150 112 58 141 85 5 367 -181 -50 -108 358 -112 -209 186 -327 -14 -40
1800d0K34K03j49n54L96l9m1j80J53j81N68m07J93m8l88K19J08M0k89J84K17k13
$$ -40 194 397 248 -306 90 51 10 -170 -17 -198 370 -37 156 108 -280 -61 47 87 -202 -18 199 -14
1822a4m10L65L10l17J47j61K16J85n37L60Oo4k54J58rJ4r0K69m08J25L07no6k36
$$ -14 -424 -59 251 -66 81 -80 136 321 -216 144 150 86 -168 -10 -19 -5 -95 174 -234 -109 198 193 127 -109
1846a09K05m7r7J85j62J80m02K49p4J59j40j7Q4l96K69K6J78j5Q2J78l55J94j26
$$ -109 96 49 -48 137 -25 155 -247 2 -72 87 -53 -70 14 -382 -113 -87 91 76 158 336 -19 175 49
1869D9r4j23K63l13M4l0J41j05K80k09N01o07J8N8J94N5m14K02m4J41PL7j1J52
$$ 49 -45 -168 95 -218 -174 -204 -63 -168 112 -97 404 -203 -185 -127 67 122 -292 -90 -134 7 14 51 40 192
1893A92k09J34k7J18k37qJ5k85M46l32N18k73k98K53j79M54m36L56l61k5R9J65
$$ 192 -17 117 90 208 -29 -37 -22 -307 139 -193 325 52 -246 7 -172 282 -154 202 -159 -184 -85 80
1915H0j19J95k95K31p4j49J34K22l14j11L34l5m19L68j83J45l82M44P9k07j57
$$ 80 -39 156 -139 92 18 -131 3 225 -89 -200 134 99 -320 48 -135 10 -372 72 151 -56 -213
1936b13k1L29%r0r1K64K5J35n05K39M4p7j84K13p1M4k90M6L92l06k19L18J8m4
$$ -213 -234 95 95 5 -86 178 203 338 -167 72 116 39 -145 68 -3 41 -249 -203 189 -117 -336 -18 0 -44
1960d4K43j63p1j00K03J25k71Q2o9J91j74M01k04k89J66k54L40k4J81l23j25J96
$$ -44 199 36 -35 -135 68 193 -78 4 -65 126 -48 353 149 -140 26 -228 112 88 269 -54 -179 17
1982A7J06l8K1j43l02M19J41j42r9R5k98N20j53j29o0M63k18m15K32L63l97k41
$$ 17 123 85 106 -37 -339 80 221 79 -20 75 -223 297 144 15 -45 418 200 -215 17 380 -17 -258
2004b58K43Oo7l25L86M08l92k01R8R9J5j35J39j83L66m9m62N32j21R2k63j75K9
$$ -258 -15 -9 -76 -401 -15 393 1 -200 -102 -3 12 -123 16 -167 199 150 -312 220 99 191 -72 -247 -218
2027b18K33K5K37k56L1m9r6O0J97o8l71O3K00m5L45k47k42K01k2J9P5m5k90M46
$$ -218 15 40 277 21 52 3 -93 -33 164 96 -275 -212 -12 -57 288 41 -201 0 -22 -3 72 27 -263 183
2051A83l09K90r1n3P1P6q9k00K95J73p4n98L07K79j92l07K07L54n86O7K70R1k71
$$ 183 -126 164 73 20 91 167 78 -122 173 346 272 -326 -19 260 68 -239 -32 322 -264 -197 73 164 -107
2074a07l05K45K36n4l8Rj2j5n4K13j25J5Q1m4m4j0j67p9J44o2N8R9P0l7l1J61
$$ -107 -412 -167 69 15 -23 -14 -26 -41 -95 118 -7 8 89 45 1 -9 -176 -255 -111 -173 -115 -16 54 17 -14 147
2100A47j52J03m94K31L50l87M32j46j00n7j65L4J95R0k66O2K90k35O3p5M26k88
$$ 147 -5 98 -396 -165 185 -202 230 84 -16 -73 -238 -204 -9 81 -185 -123 167 -68 -5 -80 346 58
2122E8J98l46L44o54K50q6N54n04K00K34o00L95j43K49j3k34J36j28q9J67J43
$$ 58 256 -90 254 -400 -150 -236 318 -186 14 248 -352 43 -100 149 136 -98 38 -90 -179 -12 131
2143A31p5J03j75k84K83pJ0N7K73j85k22j32J16k0q3k1K95q7l39M40p6p0l60J84
$$ 131 56 159 -16 -300 -17 -24 -14 43 316 131 -91 -223 -107 -127 -210 -231 64 -23 -362 78 2 -68 -428 -244
2167b44O14k45k79M1J92k42l0K07J23p0j27L70J08l33l72L72q0J07r7m6P9k53
$$ -244 370 125 -154 -113 79 -163 -193 14 137 67 -60 310 418 85 -287 85 5 112 15 -31 48 -205
2189b05J80P2J56k98L62j10lj80J27J32k92j64K61L11n61%J60J3J02j39K86k14
$$ -205 -25 47 203 -95 267 157 154 -26 101 233 -59 -223 38 349 -212 -212 -52 -39 63 -76 210 -4
2211dLl7M06m79j3o7Q8L69q2j68J21q0o3O0k65L97K0n35O62j15R4j91M5L8n7k24
$$ -4 -1 -38 368 -111 -124 -191 -103 266 184 16 137 57 -6 54 -211 186 206 -329 333 218 312 121 166 204 147 -77
2237g7j00N21%m70m8mK66m20M52N8q3p1J0J78l75j56K79K41j4k97J19J58m7k56
$$ -77 -177 344 344 -126 -174 -178 88 -332 120 178 95 24 34 212 -163 -319 -40 201 187 -110 9 167 120 -136
2261a36J05K02j87N7l64N47k35j09L54j04k93Q6J60j28J18rk14O6J37k91L86p
$$ -136 -31 171 -16 41 -323 224 -11 -120 234 130 -163 -77 83 -45 73 64 -150 -84 53 -238 148 141
2283A41j24j96L37J2j6l05L01J79n19J13jj79Q7mM68j05l55P4M96l86k71J36J57
$$ 141 17 -179 158 170 154 -151 150 329 -190 -77 -78 -257 -170 -174 294 189 -166 -92 404 18 -253 -117 40
2306D0j6j30o4K17k3j68L8K37Q5k47P3J04N6l13k01N62k41l02R9L91j71j22M9
$$ 40 24 -106 -170 47 24 -144 -106 131 216 -31 42 146 202 -111 -312 250 9 -293 -194 197 26 -96 -47
2329d7J76j20Q0o8J14l19q1L60p8j51J21J75J00k26Q5j49K77j97j75K03J26k42
$$ -47 129 9 89 21 135 -184 -265 95 17 -134 -13 162 262 36 121 -28 249 52 -123 80 206 -36
2351c6j66L69j73j34l33N17LJ33l53L24k80J15K9K84k59k53J33J18J57m95O1M59
$$ -36 -202 167 -6 -140 -473 44 47 180 -173 151 -129 -14 15 299 40 -213 -80 38 195 -300 -239 220
2373B20k54K02J1j99K55l04J3L57l58J39K08k51n2l34L92L93m78J7Q7J71L58p22
$$ 220 -34 168 179 -20 235 -69 -56 301 -57 82 290 39 -13 -347 45 438 -40 -23 64 235 593 -129
2395a29N7J67J8K2o1R6k49j66M40k5l27k6N27j03l11l41N54K4r4l73K66K95m08
$$ -129 -72 95 113 135 74 170 -79 -245 195 170 -157 -183 344 241 -70 -411 143 167 73 -300 -34 261 -147
2418a47l3O3L63k76M7K38q0l63J96J22J04k84J2J28l28L84k77M55m71p9K62M9
$$ -147 -180 -117 246 -30 17 255 175 -188 8 130 234 -50 -38 90 -238 146 -131 324 -147 -226 36 85
2440H5J60k48l04M92P5l38m3M6p0l7K10J1j47o5N6K21j76l54L46J95k02q8J22
$$ 85 245 -3 -307 185 260 -78 -121 -75 -145 -182 28 39 -108 -173 -117 104 -72 -426 -80 115 -87 -175 -53
2463e3M65J58o48N7O9N2k47K25P0J31J03m87N3j53k38L76L74l97j63L36j1k03
$$ -53 412 570 -78 -21 48 100 -147 78 148 279 382 -105 -52 -205 -443 -67 307 -90 -253 83 72 -131
2485a31l0j04O26l10l48K28r6J36kj10L73l9n4Q6j41k42K04J29J53o82l01P49
$$ -131 -161 -265 361 51 -297 -69 -165 -29 -31 -141 232 193 139 225 84 -158 46 175 328 -354 -655 94
2507I4K50l46k68K78J52l97J3J73J70l29O9L09l34K50j22J35l22o3L18l4k19L06
$$ 94 344 -2 -270 8 160 -237 -224 -51 119 -210 -141 168 -166 84 -38 97 -225 -288 30 -4 -223 83
2529H3j40ok61n4Q5K98J11l45J06J07P3l1k26M97o80J69Q9J33J98o12O32l0k99
$$ 83 -57 -63 -324 -378 -293 5 116 -229 -123 -16 57 26 -200 297 -383 -214 -125 8 206 -406 226 196 -103
2552a03j28j7N46m02J10J05J42l2k80q7K79j34n3j2L77m21K21j71K85n34n8N33
$$ -103 -231 -248 298 -104 6 111 253 221 -59 -146 133 -1 -54 -66 311 -110 111 -60 225 -309 -367 166
2574A66P5l66j89M05J94j74k56J32K20n4k72K65j63J15k88K11J45l33K63J28K8
$$ 166 241 -125 -314 91 285 111 -145 -13 207 153 -119 146 -17 98 -190 21 166 -167 96 224 252
2595B52o30J12N25Rl88j79O07j04k00q9K29k01j30J08L21k41j94j25M83k84o1
$$ 252 -378 -266 259 268 -120 -299 308 204 4 -85 144 -57 -187 -79 242 1 -193 -318 165 -119 -180
2616a80J23Q2L38q35K31N54r7k16k80M26p8k25J81M1j7j38j26J7L67k37J28L26
$$ -180 -57 25 363 -472 -241 313 216 0 -280 146 68 -157 24 65 48 -90 -216 -199 168 -69 59 385
2638C85q42J58K57J01o3l10L91K70n03J38j04N42k68l29L77j34K73m82J39L1N
$$ 385 -457 -299 -42 59 -4 -314 77 347 -156 -18 -122 420 152 -177 200 66 339 -143 -4 27 32
2659C2N0J59j28m71L48L56k3o18J39J51L90n94j17M28l0p5j72N9N9o7J99R5q9
$$ 32 82 241 113 -358 -10 346 323 -295 -156 -5 385 -209 -326 102 72 -3 -175 -116 -57 -124 75 170 81
2682H1k61J6M53j52k02K0J36Jl07J40L27j21k81R5J05n9k69K10K16k91j90N9N10
$$ 81 -180 -164 289 137 -65 -45 91 92 -215 -75 252 131 -150 -55 50 -9 -278 -68 148 -143 -333 -274 236
2705B36o0n07L22L51k45n7l90P55n49J43m0P6P8j82j30M01r5l32M21q2K26o11
$$ 236 176 -331 -9 342 97 40 -350 405 -144 -1 -41 35 113 -69 -199 202 107 -225 196 114 340 -271
2727b71M17k92j12j78M65L28l90l82O33J2k72nJ82R7k25j37pJ06L02n55J71J39
$$ -271 146 -146 -258 -436 29 357 -33 -415 218 230 -42 -47 135 232 7 -130 -137 -31 271 -284 -113 26
2749B6j54J06J81j30j04l0K93n1l32k46M39K51k34l15K86J19j06j04q5K81j73
$$ 26 -128 -22 159 29 -75 -105 188 137 -195 -441 -2 249 15 -300 -14 105 -1 -105 -190 91 -82
2770h2p3J09m3K20J03m6m1p53M27N2N82o58N1L93j27k3k34J48J04m26j50N99j69
$$ -82 -155 -46 -89 131 234 188 147 -606 -179 -127 455 -203 -152 241 114 91 -143 5 109 -317 -467 132 -37
2793c7N8J07J93q47L97K95O7j98l07M1N71l07j71QK14k64J50j74M89l05k05L90
$$ -37 21 128 321 -526 -129 166 233 35 -272 -231 340 33 -138 -130 84 -180 -30 -204 285 -20 -225 165
2815A65m23K17k60M59R6o15N1O86m09j9k49L90O8n06R4N9L32p4n7JJ9M3l06J64
$$ 165 -258 -41 -301 158 254 -361 -310 376 -33 -52 -301 89 157 -349 -255 -196 136 62 5 6 25 68 -238 -74
2839g4j70M9J20N7K96m06q0M13k10k5l01L16K79m58j33J93K25j77m1K85K4l74
$$ -74 -244 -195 -75 -18 278 -128 -208 205 -5 -30 -331 -15 264 -194 -327 -134 91 -86 -127 158 182 -192
2861a92J40Q4l71L23p7L16j70J37j82J13k03p9R2j43J30mL3J78o6l83J44N84j60
$$ -192 -52 32 -339 -16 -93 223 53 190 8 121 -82 -161 -69 -212 -82 -86 -53 125 59 -324 -180 404 244
2884B44l15L7K50j85j88K80Mj67J4Q6J88n18J40K75O7K43m91J38p9K47k57K28
$$ 244 -71 -34 216 31 -157 123 127 -40 -26 60 248 -270 -130 145 212 455 -36 102 23 270 13 241
2906B41j00l18O4J22N2K4L5%Q9k74j75K90N73m78n47N07NJ1m13J38O4K71m10K00
$$ 241 141 -177 -113 9 61 85 120 120 209 -65 -240 50 623 145 -402 105 110 121 -292 -154 -90 181 -229 -29
2930b9L2l3J63J87l67j78K03J66k53l07J4N42K1l82j9M84l54r8j6M08l23o1L57
$$ -29 3 -30 133 320 -47 -225 -22 144 -109 -416 -402 140 161 -221 -240 244 -110 -208 -224 184 -139 -200 157
2953A57J20k37k40K26R9N2m15K29J22j18mK94l12J87l74L34j27M1l36K32K27j13
$$ 157 277 40 -200 26 125 177 -238 -9 113 -5 -9 285 -27 160 -214 120 -7 34 -302 -70 157 44
2975D4n6q3J13n3k11N39l05J12l0j47M75q8o74J84N59n16k25L19L90k57l2k40
$$ 44 -12 -95 18 -35 -246 293 -12 100 70 -77 398 310 -364 -180 379 -137 -362 -43 347 90 58 -182
2997a82M65j19j42J15O3m10M6K01J76m50J84J75L3k20j88L75j50J64k91J18j19
$$ -182 283 164 22 137 200 -210 -164 37 213 -237 -53 122 155 -65 -253 122 -28 136 -155 -37 -156
3018a56J46PK81j20m25J55J01j04K10j06L10o70K44K57K45j83n34K79K26j04j45
$$ -156 -10 -3 278 158 -267 -112 -11 -115 95 -11 299 -371 -127 130 375 192 -342 -63 163 59 -86
3039h6K77J0j71j56K52Mp9j74J35R8k10j86J82M14O4l35l91N70m19m0O44l39j47
$$ -86 191 201 30 -126 126 130 51 -123 12 110 -100 -286 -104 310 374 39 -352 218 -201 -241 403 64 -83
3062h3q3K93k9l53J46K99j19k0Q5n9J8k72O6K73j30k10J55J5j01R1L9M1Q0j57
$$ -83 -166 127 98 -255 -109 190 71 51 136 77 95 -177 -111 162 32 -178 -23 -8 -109 -18 21 62 142 -15
3086a5n0K82n14L79p0J15j34l64L77J37m26M03k6L6k1l88K87l6L13l88N3J3j8
$$ -15 -65 217 -297 82 12 127 -7 -371 6 143 -283 120 94 130 109 -279 8 -28 285 -103 -50 -37 -55
3109e5J02k80K56P5j33p1J35Q7r0o5J02K22o01l6O45m19k68j24P10p1r4L8K18
$$ -55 47 -233 23 98 -35 -106 29 116 26 -39 63 285 -316 -352 293 -126 -394 -518 192 121 27 65 283
3132B83l23j41j37K46O1J05r0q4M8j78K24q6J47R1k90J33j2J2l1K87l94j88K82
$$ 283 -40 -181 -318 -72 -11 94 4 -80 -32 -210 14 -72 75 166 -124 9 -3 9 -22 265 -129 -317 -35
3155c5K05m08j85M59j66N3O4M3N4l30o0Q14k69m12J20K69j16k07n8N24l32k73
$$ -35 170 -238 -423 36 -130 -77 -13 30 84 -246 -306 508 239 -173 -53 216 100 -107 -165 359 27 -246
3177b46R5L49k50M1J48l1j42K4j91O61n65J19M4K96j68m55M77m6O4l74J40L35
$$ -246 -151 198 -52 -11 137 106 -36 -12 -203 458 -107 12 56 352 184 -271 206 160 224 -150 -10 325
3199C25m04J24k34L10j41k67K66J59k31K08R0l59K08m4k45N08k42n0J5N7l59J59
$$ 325 -79 45 -189 121 -20 -287 -21 138 -93 115 205 -154 54 10 -235 273 31 -19 -4 53 -306 -147
3221a47J26J38j21ML0K6k49M2M85j61l05O9J12Q3o5L6L4k14K6j62L97j12j24j95
$$ -147 -21 117 -4 0 30 56 -193 -151 334 173 -132 -63 49 132 67 103 137 -77 -51 -213 184 72 -52 -247
3245b47L01K3N1j28L18P8l05r0J89J26m08K6K03j08o1k0O5J32Mk08J28J54k67
$$ -247 54 77 128 0 318 396 91 1 190 316 -92 -66 137 29 -32 -52 13 145 149 -59 69 223 -44
3268d4l0J29k24K10J17j37j4j88P0L21k07k26M10J01j20o8o6k15L21m00J09K50
$$ -44 -74 55 -169 41 158 21 7 -181 -111 210 3 -223 187 288 168 100 34 -181 140 -260 -151 99
3290I9Mm09K19J20k9k17J69M29l24k31M58l2m92m9M94j92j30J25j27M09k04l82
$$ 99 103 -306 -87 33 4 -213 -44 385 61 -170 288 256 -236 -285 209 17 -113 12 -115 294 90 -292
3312b92L23O3j15m4J18J33j71P6q3o9j52K80L32l75l78N23k1j72k29J96l6L3J3
$$ -292 31 94 -21 -65 53 186 15 91 8 -61 -213 67 399 24 -354 169 148 -24 -253 -57 -93 -60 -47
3335d7K26j12j04j15k6K72J44m04j5J10q9j78L93j3L3l5k03l2L66l23J55J42l07
$$ -47 179 67 -37 -152 -178 94 238 -166 -181 -71 -160 -338 55 42 75 40 -163 -195 171 -152 3 145 -162
3358a62p7r2M71k23J25R8j10m6N9lJ88j64p7P6J98k39k56O7O4K5j49L83j19J89
$$ -162 -239 -331 140 -83 42 140 30 -16 43 40 228 64 -13 63 261 22 -234 -167 -103 -78 -227 156 37 226
3382B26l75J63J86j08l07M26j60j36J98k60M43n6m75J39K18O5j77J5J64m33O2
$$ 226 -149 14 200 92 -215 211 51 -85 113 -147 296 240 -235 -96 122 187 10 25 189 -244 -182
3403a82j0M46l01j2L7l9j87J00L47l46Q7K05J21k87J59l11L51j11J06n01N03o4
$$ -182 -192 254 -47 -59 -22 -61 -248 -148 199 -147 -60 145 266 -21 138 -173 178 67 173 -328 175 111
3425A11l90M44N1m7k67R0J90q4p1Q0J62m15r1PL12J37r0k63K25k36r9J67j8K29
$$ 111 -279 165 216 169 -98 -8 182 98 27 107 269 -146 -237 -230 82 219 129 -134 91 -145 -244 -77 -95 134
3449A34l12L19j31J44l14R5j81O3o6K17K86m49N45l49rj77P3Q4K05l50P3N6K27
$$ 134 -178 141 10 154 -160 -65 -246 -183 -249 -32 254 -195 350 1 -8 -185 -112 -28 177 -173 -100 -44 183
3472A83J25n65K29J41j65k63L47R2O5k66L14j91M3j91L09q5k06MK9J19O0nP8l06
$$ 183 308 -257 -28 113 -52 -315 32 124 189 -77 237 46 89 -102 207 122 -84 -80 -51 68 128 123 201 -105
3496a05K75l65R4M43m60R3R7q2J78j23j61L81o68L31K77j24m51K33J62J36k70
$$ -105 170 -195 -101 342 -118 -25 72 -10 168 45 -116 265 -403 -72 205 81 -370 -137 25 161 -109
3517a09J6K55k87J33N9J02p7m19L19J13rr1Q2n1J68l10J54J82j28n04M62J59j25
$$ -109 -93 162 -125 8 67 169 92 -327 -8 105 96 5 87 36 204 -106 48 230 102 -402 60 219 94
3540I4R0j97K36j04j20J49j76l8k45L12L19l27l64O32k83o3o8N1L49j80r0p1K13
$$ 94 184 -13 223 119 -1 148 -28 -66 -311 1 320 -7 -371 261 -22 -85 -153 -102 247 67 -23 -94 119
$$ [...]
8191a55
##END NTUPLES=NMR FID
##END=
