##TITLE=1H_Pr 1_Is-Am
 200.13MHz,CDCl3,
 8 sc
 
 1.7.2025
##JCAMPDX= 6.0         $$ Bruker NMR JCAMP-DX V2.0
##DATA TYPE= NMR FID
##DATA CLASS= NTUPLES
##ORIGIN= UXNMR, Bruker Analytische Messtechnik GmbH
##OWNER= pz
$$ XWIN-NMR		Version 3.5
$$ Tue Jul  1 16:26:42 2025 Russian Standard Time (UT+4h)  she@DPX200
##.OBSERVE FREQUENCY= 200.1313
##.OBSERVE NUCLEUS= ^1H
##.DELAY= (6, 6)
##.ACQUISITION MODE= SIMULTANEOUS
##.ACQUISITION SCHEME= undefined
##.AVERAGES= 8
##.DIGITISER RES= 18
##SPECTROMETER/DATA SYSTEM= spect
##.PULSE SEQUENCE= zg30
##.SOLVENT NAME= CDCl3
##.SHIFT REFERENCE= (INTERNAL, CDCl3, 0, 14.3821)
##AUDIT TRAIL= $$ (NUMBER, WHEN, WHO, WHERE, WHAT)
$$ ##TITLE= Audit trail, XWIN-NMR		Version 3.5
$$ ##JCAMPDX= 5.01
$$ ##ORIGIN= Bruker BioSpin GmbH
$$ ##OWNER= she
$$ F:/spectra/data/she/nmr/H-C/1/audita.txt
$$ ##AUDIT TRAIL=  $$ (NUMBER, WHEN, WHO, WHERE, WHAT)
(   1,<2025-07-01 16:24:59.06 +0400>,<she>,<DPX200>,
      <created by zg, POWCHK disabled, PULCHK disabled
       configuration hash MD5:
       00 E9 B6 7A A2 85 ED C7 34 08 36 98 17 FE 4E 26
       data hash MD5: 16K
       60 39 8F A8 BB EF 05 75 AA B3 C2 05 AD D9 5B B4>)
$$ ##END=
$$ 
$$ hash MD5
$$ D6 05 CC 77 1E DE A5 5A BF 36 3C 5A 81 3C 5E 4F
##$RELAX= 
##$RELAX= 
##$RELAX= 
##$RELAX= 
##$RELAX= 
##$RELAX= 
$$ Bruker specific parameters
$$ --------------------------
##$DU= <F:/spectra>
##$EXPNO= 1
##$NAME= <H-C>
##$PROCNO= 1
##$TYPE= <nmr>
##$USER= <she>
##$AMP= (0..31)
100 100 100 100 100 100 100 100 100 100 100 100 100 100 100 100 100 100 
100 100 100 100 100 100 100 100 100 100 100 100 100 100 
##$AQSEQ= 0
##$AQ_mod= 1
##$AUNM= <au_zg>
##$AUTOPOS= <>
##$BF1= 200.13
##$BF2= 200.13
##$BF3= 200.13
##$BF4= 200.13
##$BF5= 200.13
##$BF6= 200.13
##$BF7= 200.13
##$BF8= 200.13
##$BYTORDA= 1
##$CFDGTYP= 0
##$CFRGTYP= 5
##$CHEMSTR= <none>
##$CNST= (0..31)
1 1 145 1 1 1 1 1 1 1 1 1 1 1 1 1 1 1 1 1 1 1 1 1 1 1 1 1 1 1 1 1 
##$CPDPRG= <>
##$CPDPRG1= <>
##$CPDPRG2= <>
##$CPDPRG3= <>
##$CPDPRG4= <mlev>
##$CPDPRG5= <mlev>
##$CPDPRG6= <mlev>
##$CPDPRG7= <mlev>
##$CPDPRG8= <mlev>
##$CPDPRGB= <>
##$CPDPRGT= <>
##$D= (0..31)
0 0.7 0 0 0 0 0 0 0 0 0 0.03 0 0 0 0 0 0 0 0 0 0 0 0 0 0 0 0 0 0 0 0 
##$DATE= 1751372698
##$DBL= (0..7)
120 120 120 120 120 120 120 120 
##$DBP= (0..7)
150 150 150 150 150 150 150 150 
##$DBP07= 0
##$DBPNAM0= <>
##$DBPNAM1= <>
##$DBPNAM2= <>
##$DBPNAM3= <>
##$DBPNAM4= <>
##$DBPNAM5= <>
##$DBPNAM6= <>
##$DBPNAM7= <>
##$DBPOAL= (0..7)
0.5 0.5 0.5 0.5 0.5 0.5 0.5 0.5 
##$DBPOFFS= (0..7)
0 0 0 0 0 0 0 0 
##$DE= 6
##$DECBNUC= <off>
##$DECIM= 32
##$DECNUC= <off>
##$DECSTAT= 4
##$DIGMOD= 1
##$DIGTYP= 9
##$DL= (0..7)
0 120 120 120 120 120 120 120 
##$DP= (0..7)
150 150 150 150 150 150 150 150 
##$DP07= 0
##$DPNAME0= <>
##$DPNAME1= <>
##$DPNAME2= <>
##$DPNAME3= <>
##$DPNAME4= <>
##$DPNAME5= <>
##$DPNAME6= <>
##$DPNAME7= <>
##$DPOAL= (0..7)
0.5 0.5 0.5 0.5 0.5 0.5 0.5 0.5 
##$DPOFFS= (0..7)
0 0 0 0 0 0 0 0 
##$DQDMODE= 0
##$DR= 18
##$DS= 0
##$DSLIST= <SSSSSSSSSSSSSSS>
$$ [...]
##$SUBNAM0= <"">
##$SUBNAM1= <"">
##$SUBNAM2= <"">
##$SUBNAM3= <"">
##$SUBNAM4= <"">
##$SUBNAM5= <"">
##$SUBNAM6= <"">
##$SUBNAM7= <"">
##$SUBNAM8= <"">
##$SUBNAM9= <"">
##$SW= 18.0517328524113
##$SWIBOX= (0..15)
0 0 2 0 0 0 0 0 0 0 0 0 0 0 0 0 
##$SW_h= 3612.71676300578
##$TD= 16384
##$TD0= 1
##$TE= 0
##$TE2= 300
##$TE3= 300
##$TEG= 300
##$TL= (0..7)
0 120 120 120 120 120 120 120 
##$TP= (0..7)
150 150 150 150 150 150 150 150 
##$TP07= 0
##$TPNAME0= <>
##$TPNAME1= <>
##$TPNAME2= <>
##$TPNAME3= <>
##$TPNAME4= <>
##$TPNAME5= <>
##$TPNAME6= <>
##$TPNAME7= <>
##$TPOAL= (0..7)
0.5 0.5 0.5 0.5 0.5 0.5 0.5 0.5 
##$TPOFFS= (0..7)
0 0 0 0 0 0 0 0 
##$TUNHIN= 0
##$TUNHOUT= 0
##$TUNXOUT= 0
##$USERA1= <user>
##$USERA2= <user>
##$USERA3= <user>
##$USERA4= <user>
##$USERA5= <user>
##$V9= 5
##$VALIST= <valist>
##$VCLIST= <CCCCCCCCCCCCCCC>
##$VD= 0
##$VDLIST= <DDDDDDDDDDDDDDD>
##$VPLIST= <PPPPPPPPPPPPPPP>
##$VTLIST= <TTTTTTTTTTTTTTT>
##$WBST= 1024
##$WBSW= 4
##$XGAIN= (0..3)
0 0 0 0 
##$XL= 0
##$YL= 0
##$YMAX_a= 439336
##$YMIN_a= -479121
##$ZGOPTNS= <>
##$ZL1= 120
##$ZL2= 120
##$ZL3= 120
##$ZL4= 120
##$ABSF1= 10
##$ABSF2= 0
##$ABSG= 5
##$ABSL= 3
##$ALPHA= 0
##$AQORDER= 0
##$ASSFAC= 0
##$ASSFACI= 0
##$ASSFACX= 0
##$ASSWID= 0
##$AUNMP= <proc_1d>
##$AZFE= 0.1
##$AZFW= 0.1
##$BCFW= 1
##$BC_mod= 2
##$BYTORDP= 1
##$COROFFS= 0
##$CY= -3
##$DATMOD= 1
##$DC= 2
##$DFILT= <>
##$DTYPP= 0
##$F1P= 0
##$F2P= 0
##$FCOR= 0.5
##$FTSIZE= 0
##$FT_mod= 4
##$GAMMA= 1
##$GB= 0.15
##$INTBC= 1
##$INTSCL= 1
##$ISEN= 128
##$LB= 0.25
##$LEV0= 0
##$LPBIN= 0
##$MAXI= 10000
##$MC2= 0
##$MEAN= 0
##$ME_mod= 0
##$MI= 1.114404
##$NCOEF= 0
##$NC_proc= 0
##$NLEV= 6
##$NOISF1= 3.799351
##$NOISF2= 2.8
##$NSP= 1
##$NTH_PI= 0
##$NZP= 0
##$OFFSET= 14.38212
##$PC= 1
##$PHC0= -1200.741
##$PHC1= 12.1922
##$PH_mod= 1
##$PKNL= yes
##$PPARMOD= 0
##$PSCAL= 0
##$PSIGN= 0
##$REVERSE= no
##$SF= 200.129724274929
##$SI= 16384
##$SIGF1= 3
##$SIGF2= 2
##$SINO= 400
##$SIOLD= 16384
##$SREGLST= <1H.CDCl3>
##$SSB= 0
##$STSI= 0
##$STSR= 0
##$SW_p= 3205.1282051282
##$SYMM= 0
##$S_DEV= 0
##$TDeff= 0
##$TDoff= 0
##$TI= <>
##$TILT= no
##$TM1= 0
##$TM2= 0
##$TOPLEV= 0
##$USERP1= <user>
##$USERP2= <user>
##$USERP3= <user>
##$USERP4= <user>
##$USERP5= <user>
##$WDW= 1
##$XDIM= 8192
##$YMAX_p= 0
##$YMIN_p= 0
$$ End of Bruker specific parameters
$$ ---------------------------------
##NTUPLES= NMR FID
##VAR_NAME=  TIME,          FID/REAL,        FID/IMAG
##SYMBOL=    X,             R,               I
##VAR_TYPE=  INDEPENDENT,   DEPENDENT,       DEPENDENT
##VAR_FORM=  AFFN,          ASDF,            ASDF
##VAR_DIM=   8192,          8192,            8192
##UNITS=     SECONDS,       ARBITRARY UNITS, ARBITRARY UNITS
##FACTOR=    0.0002768,     1,               1
##FIRST=     0,             0,               0
##LAST=      2.2672688,     0,               0
##MIN=       0,             -479121,         0
##MAX=       2.2672688,     439336,          0
$$ Real data points
##PAGE= N=1
##DATA TABLE= (X++(R..R)), XYDATA
$$ [...]
1971D20j126o12l66o1Q86J148M3J00J2r76k36k67O60M72J55N42K7m07o43M14J79
1992C64N48O92l47l70o51j011r30j54M83O9N32M15L51m8n13R64L59M72M50o0K71
2013A886j123o56o86q13M45L47R9R61j22n36p82M29K61p8O31N69j80o08m41l01
2033f98J75O26O61K87L78k78p30n43m82p4Q1l3L89K2l45o9J06j04P32Q86M2J83
2055A212n2p67m84k79j36K14n1Q52n40k81j86k43J58P6K62O92J53k22k95n93k29
2076g39R47k66r0R10R0n86m15l7K46p9K7L10j96j8n21k70J58K4L69P3M02M42k99
2099D82m45m80L49j38L49N68l85k62J39n73Jj01N25J11K6J63J3n23Q6J80l45J98
2121f2N08j6m45K79j58j58k04R0M34K35k91p8m38K02K86l14j27M21k86Q5k25J74
$$ plain form
1971 420 -706 -1318 -1684 -1745 -859 289 332 432 444 -532 -768 -1035 -375 97 252 794 821 414 -229 185 364
1992 364 912 1604 1257 887 236 -775 -1705 -1859 -1376 -1307 -775 -360 -9 -57 -570 394 753 1225 1675 1615 1886
2013 1886 763 107 -579 -1392 -947 -600 -501 460 338 -198 -980 -551 -290 -368 263 832 652 44 -397 -698
2033 -698 -523 103 764 1051 1429 1151 421 -122 -604 -678 -597 -630 -241 -219 -564 -633 -527 -631 101 987 1029 1212
2055 1212 1160 393 -91 -370 -506 -292 -343 509 -31 -312 -498 -741 -583 -507 -245 447 600 378 83 -510 -739
2076 -739 208 -58 -148 762 852 266 -149 -186 60 -19 8 318 122 104 -417 -687 -529 -505 -136 -63 339 781 482
2099 482 37 -443 -94 -232 117 685 300 38 177 -396 -395 -496 29 140 166 329 342 -181 -95 85 -260 -62
2121 -62 446 430 -15 264 106 -52 -256 -166 268 503 212 134 -304 -102 184 -130 -257 164 -122 -37 -262 -88
2143h8m88K39M03K64m6r7L01l54K1p5R0j73J4q2J16k89J62n35J03L98J46J10P1
2166B11q9k26Q2n7J90j18M1M47k76j26M3M32o14L70j04j72j2j18r3k26k64M22
2188b57J69l02L13J36J00J54j82J79J77j91k92k17J55O8k35J02j78M7K08j85K00
2209c1j69L64k20J53O3m17M92l11N8L73j69k5k15K14k78P3P1m9Q3j92R5j60Q0
2232a17k87j97P33j47K48l17O81l73j36k95J12K58r7O1p3k74l95N58l14L19K53
2253B01r2o4L01l69j71j29J07L05Q9K10pj79p30K25L4L3J38K9K24o1m9j8n83M63
2277i3M01J00n9O9k77o98M04j60N0J52K84k6j23j24k36j34R6l36O86N01k59J02
2299C20k89l44L73M3L42L66j43m34j12m26l07J20K18K53j40K70N7k77k00K94M38
$$ plain form
2143 -88 -576 -337 66 330 284 187 488 134 155 80 170 -3 11 -71 45 -244 -82 -617 -514 -116 30 140 211
2166 211 122 -104 -22 -79 111 -7 34 481 205 79 122 554 -60 310 206 34 22 -96 -189 -415 -679 -257
2188 -257 -88 -390 -77 59 159 313 131 310 487 296 4 -213 -58 10 -225 -123 -301 -254 -46 -231 -31
2209 -31 -200 164 -56 97 160 -257 235 -76 -18 355 186 161 -54 160 -118 -45 26 -23 60 -132 -37 -197 -117
2232 -117 -404 -601 132 -15 233 -84 597 224 88 -207 -95 163 66 127 54 -220 -615 -57 -371 -52 201
2253 201 109 45 346 -23 -194 -323 -216 89 178 388 381 202 -528 -303 -269 -236 -98 -69 155 94 45 27 -556 -93
2277 -93 308 408 349 418 141 -557 -153 -313 -263 -111 173 147 24 -100 -336 -470 -374 -710 -24 477 218 320
2299 320 31 -313 60 103 445 811 668 234 122 -304 -611 -491 -273 -20 -160 110 167 -110 -310 -16 422
2320D22K28K05N8m94k0l64l28j37j00K33J12J58L8m75j52J18L52K90K98K74on46
2342A64k38k22k1J52N79P8j79J95n02n61J76J04k31N09m1m40l7j07J80J19M69
2363A46R18J28j77j76k99m25n17K80n4n0n7k33k94m23K38L67N19M02M94j11l7
2384F39l10l44k01K48K51K73J90k64m12k53n02j83O44K42J45l76m12o7j97K4L69
2405d96Q25L41L71J35j15q2q23J43J1j91K52n05p95L7m54j52M66M45Q09M79Nk55
2427D51k56j4k5L19K92N26n27o56J9m65o43M39N09J34k55q0l13j05k40k3O09M05
2449A01L82N92k79j74k94L33j99M85q3on11p15p87k87Q7L02K98N09L99j9j27k89
2471b82P18p9L56K34O9k14k22o82n15N04l09M11j61J43j56n69j87P2k07P13M54
$$ plain form
2320 422 650 855 913 419 399 35 -293 -430 -530 -297 -185 -27 11 -464 -616 -498 -146 144 442 716 710 164
2342 164 -74 -296 -317 -165 414 492 313 508 6 -555 -379 -275 -506 3 -38 -478 -515 -622 -442 -323 146
2363 146 1064 1192 1015 839 540 115 -402 -122 -176 -226 -283 -516 -810 -1233 -995 -628 -109 293 787 676 639
2384 639 329 -15 -216 32 283 556 746 482 70 -183 -685 -868 -224 18 163 -213 -625 -692 -889 -865 -496
2405 -496 329 670 1041 1176 1061 979 156 299 310 119 371 -134 -929 -892 -1346 -1498 -1032 -587 222 701 706 451
2427 451 195 181 156 475 767 1293 766 110 129 -336 -979 -540 -31 103 -152 -232 -545 -650 -890 -913 -304 101
2449 101 483 1075 796 622 328 661 462 947 864 858 347 -368 -1155 -1442 -1355 -1053 -755 -246 153 134 7 -282
2471 -282 436 357 713 947 1016 802 580 -102 -617 -113 -422 -11 -172 -29 -185 -754 -941 -869 -1076 -363 91
2492I1L99j88J10Mk54n0K77O92k55K18o37n65o27j83j60M73K06m2j64J80J42K1
2514c12J06N68O23J63jn2n50l75m65N5J6N09j04q1n89M5n70j79R78L04K14J78
2536D81q5l29q9J61O8L54L18J42j29p38q8m40j30j07J95l9J78j31j19j72J33J81
2558c85O44N92K95l71k27j72j12m61L60q2R1j3n5n33m22n4K54M60M4K84J73Pj11
2581B06l77n1M75L67K44k4n20Pl19qn23M85K17j44q6k80k9j50j71N57j0P13j85
2604C94J44m42j40Q5K5J00k18N23k71k37l21j00M2r4L15J22J00K45k26j09j09
2625a72L52n3K81mJ65l33l41qOl3J36J39m6l53K7j88k22L28K00J78J64K24m6k19
2649A82k57K02K11j94J57q2m61m23J5L18j84L37L47o8j00P9k14J40k54L75j59
$$ plain form
2492 91 490 302 412 416 162 112 389 1081 826 1044 407 -158 -785 -968 -1128 -655 -449 -491 -655 -475 -333 -312
2514 -312 -206 362 985 1148 1147 1095 545 170 -295 -240 -224 285 181 100 -489 -444 -1014 -1193 -215 89 303 481
2536 481 396 67 -22 139 207 561 879 1021 892 154 66 -374 -504 -611 -416 -455 -277 -408 -527 -699 -566 -385
2558 -385 259 851 1146 775 548 376 264 -197 163 81 172 159 104 -429 -851 -905 -651 -191 -147 137 310 317 206
2581 206 -171 -222 253 620 864 840 320 327 8 0 -523 -38 179 35 -51 -331 -360 -510 -681 -124 -134 579 394
2604 394 538 96 -44 41 66 166 -52 471 200 -37 -358 -458 -416 -510 -195 -73 27 272 46 -63 -172
2625 -172 180 127 408 404 569 236 -105 -113 -107 -140 -4 135 89 -264 -237 -425 -647 -319 -119 59 223 447 401 182
2649 182 -75 127 338 144 301 219 -242 -665 -650 -332 -516 -179 168 100 0 79 -135 5 -249 126 -33
2670c3M13J51k50m08l0j15j65K67J24J60R4j32l73K15l2K7P7M28j10m2q6j15k75
2693b10j82J57L45j89K97l65l51J93j40R7M00L6o0K11lL7j3j30KL50l71L7K31
2716C79k95o06P9K25j12q8M60J54k81k00Q5OJ39J93J18j98L2l5Q3k06J20K13j75
2739I0L8l24o1N5k4j62R1R4J35q1J84PP3m4J09J82q6n%j90j75l3L8k89K14k43
2765d07J10J4Q5J56m0l24L92L86K08l47Jm32J36K74k28J85m3k11j04P5J81k54
2787a87l12K63J90K37k15J49k51K75lJ65j43J74J15k37k7k92J72m17P5K47k44
2808b66J1Rm38O13K12k73L83J3p6q1o5N1K66j24j64L10l34K07j77j96L54k21j89
2831a75J4o4qK40m95M95j6k04J92M97J14j58j39q0k45J76l02J51n7k70K98n63
$$ plain form
2670 -33 380 531 281 -127 -157 -272 -437 -170 -46 114 208 76 -297 -82 -114 -87 -10 418 308 266 180 65 -210
2693 -210 -392 -235 110 -79 218 -147 -498 -305 -445 -348 52 88 28 239 236 273 260 130 132 482 111 148 379
2716 379 84 -522 -443 -218 -330 -418 42 196 -85 -285 -200 -194 -55 138 256 58 90 55 138 -68 52 265 90
2739 90 128 -196 -257 -202 -226 -388 -297 -203 -68 -149 35 42 115 71 180 362 276 271 271 81 -94 -127 -89 -378 -164 -407
2765 -407 -297 -283 -198 -42 -82 -406 -14 372 580 233 234 -198 -62 212 -16 169 126 -85 -189 -114 67 -187
2787 -187 -499 -236 -46 191 -24 125 -126 149 146 311 168 342 457 220 193 -99 73 -344 -269 -22 -266
2808 -266 -255 -246 -684 -71 141 -132 251 264 188 107 42 93 359 235 71 381 47 254 77 -119 235 14 -175
2831 -175 -161 -225 -233 7 -488 7 -9 -213 -21 476 590 432 293 213 -32 144 -158 -7 -64 -334 -36 -599
2853e99M43J83k70M27M9k01q3M8L28l42j01K33J97j78n1OQR8j56J9n02N30m6j58
2877a18k61J64J19l83L78j8K11j79J88J30j79L32k93j43K11l6l52J34M9Ln9J23
2899B1m7m0M0J17l1L46m75J97j22j62L3k32L60j68L58j17j89K53L9l27J97k6l03
2922b78J81K3j43R8O3o9K94k70J82N4j47J45L2l13K4j21N4J52J11q1R6k0o8K8
2946B7j38J7J59j84K24k88Q3jK32k88K76nK7N1o4j9K9m7O7q1k10Q2j11J21n2K29
2972A36p2j16J5m8P9J32J04r7k14J36J2l45M03j79J12k81L60k13N1l33O27m13
2994a44r6J67j27M8L09l4j13j64K05J8k5P0K74j99OLl11K6K81j40m84M79k60k0
3018b31j6K70R4k55L14J0J60n56K42O1J58l5l10Q5ql0Lp1r7J05J5j78k5M8L0n1
$$ plain form
2853 -599 -156 27 -243 184 233 32 -51 -3 325 -17 -118 115 312 134 83 89 97 195 39 58 -444 86 40 -118
2877 -118 -379 -215 -96 -479 -101 -119 92 -87 101 231 52 384 91 -52 159 123 -229 -95 -46 -43 -102 21
2899 21 -26 -66 -26 91 60 406 -69 128 6 -156 -123 -355 5 -163 195 78 -111 142 181 -146 51 25 -278
2922 -278 -97 -74 -217 -119 -56 -125 169 -101 81 135 -12 133 165 -148 -124 -245 -191 -39 72 -9 87 67 -1 27
2946 27 -111 -94 65 -119 105 -183 -100 -101 131 -157 119 114 141 192 128 109 138 91 158 77 -133 -51 -162 -41 -93 136
2972 136 64 -52 -37 -85 -6 126 230 133 -81 55 67 -278 125 -54 58 -223 137 -76 -25 -358 269 -144
2994 -144 -240 -73 -200 -152 157 123 10 -154 51 69 44 114 388 189 195 198 -113 -87 194 54 -430 49 -211 -231
3018 -231 -247 23 117 -138 176 186 346 -210 32 93 251 216 -94 -9 -17 -47 -44 -115 -212 -107 -92 -270 -295 -247 -217 -268
3044b68M95k14L8K15k15k59L36K28k19m1m0j28O0Pr5j08k77K45K92l00J88J02
3066D2l20M80J07l54Q9J51j40j72J02J15k45N4M5J2p4j0k8j07R5n0L44j66k5J07
3090E2L5k07J85K00j31j65L33j49j23K3m33L25m43K81j31J51J44N5j77N22l24
3111B3K65J47j32J8q0k07R3j83O7O5K47n13j38L23k57J7L01k11J76J0l6m%r2J70
3136F9O1r1L89l15j45J74j07j94Q7J21l58J10j44k1NL05J32p3L83r1K32l88K01
3159C42k19K3K9m12L12J73l26k2P2m24L51J21J58k99J62m6P2j91N6J20N2R8L3
3182B35l1J47k92m5K79j53l81K02J75l79P7R4l25L57M6j79M31K0n4K8j60J12k85
3205h1K8j49N3m55N23j32j53K25o5J68L57K8k31J86n22L57j56j6M9P5Q9k39L8
$$ plain form
3044 -268 227 13 51 266 51 -208 128 356 137 96 56 -72 -12 -5 -100 -208 -485 -240 52 -248 -60 42
3066 42 -278 202 309 -45 44 195 55 -117 -15 100 -145 -91 -46 -34 -108 -118 -146 -253 -158 -208 136 -30 -55 52
3090 52 87 -120 65 265 134 -31 302 153 30 53 -380 -55 -498 -217 -348 -197 -53 2 -175 347 23
3111 23 288 435 303 321 241 34 127 -56 11 76 323 -190 -328 -5 -262 -245 56 -155 21 31 -5 -9 -9 -101 69
3136 69 130 39 428 113 -32 142 35 -159 -72 49 -309 -199 -343 -364 -359 -54 78 5 388 297 529 141 342
3159 342 123 146 175 -237 75 248 -78 -100 -28 -452 -101 20 178 -121 41 -5 67 -124 -68 52 104 202 235
3182 235 204 351 59 14 293 140 -241 -39 136 -243 -166 -72 -397 -40 6 -173 258 278 224 252 92 204 -81
3205 -81 -53 -202 -149 -604 -81 -213 -366 -141 -206 -38 319 347 116 302 -220 137 -19 -35 14 89 178 -61 -23
3228b3n9k47N27k35K54l31j15J28J53N2o4k14L35j75q2M85J3k90j80K44m9r1l2
3251DJ34m20J84j0PK26j84m8J95k62J08O4K86j96n6J48m13L2P0J51l47L38M3j49
3275i5N1Q2Q5k30k1j79M71k83R7J31k33J47l15N77j43J76k17o4j4k83K7j39J28
3298b44l4K89N7k4K17k27J2l7J69K67k94o2K45l62j66q1K26J39p3J16k02j47K11
3321er9j62M85jr3nj4K90k76q9K15k66M9J90k08K26k04l8l09J54P6K11k61P0j63
3346b27m7O4N6L39J35l7j36j92r1J90l48R9P2L1j7k5K11k11L6M4J55m2Lk07K37
3371I2k0m0j69l4L38J1M0p1J66j08k75J51m5l63J71r0N7L1J87j7J02J73J04k04
3395A87q6K02k1m93l6J93k3Jl1l9k69K72k11M98l48K94J37l7K6l97Q0o6J64KL18
$$ plain form
3228 -23 -82 -329 198 -37 217 -114 -229 -101 52 104 40 -174 161 -14 -96 389 402 112 -68 176 127 36 4
3251 4 138 -282 -98 -108 -101 125 -59 -107 88 -174 -66 -2 284 88 32 180 -233 -201 -131 20 -327 11 54 -95
3275 -95 -44 38 123 -107 -128 -307 164 -119 -22 109 -124 23 -292 285 142 318 101 37 23 -260 -233 -372 -244
3298 -244 -278 11 68 44 261 34 46 9 178 445 151 89 334 -28 -194 -275 -49 90 17 133 -69 -216 -5
3321 -5 -104 -266 219 218 125 120 106 396 120 31 246 -20 29 219 11 237 33 -5 -314 -160 -84 127 -134 -64 -227
3346 -227 -274 -210 -154 185 320 283 147 -45 -136 54 -294 -195 -123 -92 -109 -134 77 -134 -98 -54 101 59 62 -145 92
3371 92 72 32 -137 -171 167 178 218 147 313 205 -70 81 36 -327 -156 -246 -189 -158 29 12 114 287 391 187
3395 187 101 303 282 -211 -247 -54 -77 -76 -107 -146 -415 -143 -354 144 -204 90 227 190 216 -181 -101 -167 -3 -1 317
3420C17m6k90p4q2K95k36q8L19j43J10j60J84j22k35N05k44K18k16K54m11L47
3441B02r7m7j55M2R4K7j59j14p4J10K11j4K67j37k3j75K08p7l22M33j65J26l02
3464a41k09K66k2J24J37k00K30j03j71L29j70k35M50l30r3M21l38j11M32j26j4
3485A26P8k55R9m7l07j22K05q5K61j26J35M1k78K07r9K14J08j79J85r1j10N4k4
3508a0n0K03l79J27MJ64r2k23J31M2K67j85J97j34l55J13o1R8J83J42j39q1m2
3531h0j46K84j04l6L11l67K84r7k65J06J07J0Pp2J84kn3l06J44J11L04k04jj3
3555A06j55N4J25n56O81l10K33k01k3L0j60L74L2k58P1r1Mk1p1j10Q3j16M98o02
3579c83L32N36l97k57M91l91J0K06j74J20j41k4K23j28M4k29L02l4k14L3j26J35
$$ plain form
3420 317 271 -19 -93 -175 120 -116 -204 115 -28 82 -78 106 -16 -251 254 10 228 12 266 -145 202
3441 202 105 58 -97 -55 39 66 -93 -207 -281 -171 40 26 293 156 133 -42 166 89 -233 200 35 161 -141
3464 -141 -350 -84 -106 18 155 -45 185 82 -89 240 70 -165 285 -45 -138 283 -55 -166 266 140 126
3485 126 204 -51 48 1 -306 -428 -223 -308 -47 -173 -38 3 -275 -68 -167 47 155 -24 161 70 -40 14 -10
3508 -10 -60 143 -236 -109 -105 59 -33 -256 -125 -83 184 -1 196 62 -293 -180 -241 -143 40 182 43 -38 -80
3531 -80 -226 58 -46 -82 229 -138 146 49 -216 -110 -3 7 14 -58 126 124 71 -235 -91 20 324 120 119 106
3555 106 -49 5 130 -426 255 -55 178 -23 -46 -16 -176 198 230 -28 43 -48 -44 -65 -136 -246 -163 -279 219 -383
3579 -383 -51 485 88 -169 322 -69 -59 147 -27 93 -48 -72 151 23 67 -162 140 106 -108 -75 -201 -66
3601f6l37K61l6L83J10k00L1k19J48k60L82p8K4p5l47M79m54L54l12J17L4L95
3623C34m13P9o3J53K3j9j33K8L17j16k76j8J06Lp7K79l4j49L9j11k5j27j98K61
3647a37j8Q4P6j99J09K18k81J86R8k34J64p9j05l9J41k20N50l34J15j57j91j4
3669b67J36K03j82N6j82K29j31P9K07l00J83J89j61j88M08n35o4M05k85J8M02
3690B20k10K8l80K15j1J94O7jr0M2o8j70qJ50J01J10J7l98J16q0n1K92k04Q4Q7
3715E2k06K16k29K49J93l29K53l32L35l42M69k74k28L52k82l0l4Q3K60k27j51
3736b02j26K73J05K4k8k04J83Q0m4j23J52K56p5r9j35m9m6j63J93L16k22j83N7
3759f0L85n74J35m7K3K33n9K97k57j01ml24L76J50k70O3j55R4K36l51j71J26J54
$$ plain form
3601 -66 -403 -142 -178 205 315 115 146 -73 75 -185 197 119 143 68 -279 200 -254 100 -212 -95 -61 334
3623 334 -79 0 -63 90 113 94 -39 -11 306 190 -86 -104 2 5 -72 207 173 24 63 -48 -73 -200 -398 -137
3647 -137 -155 -71 5 -194 -85 133 -148 38 136 -98 66 -13 -118 -157 -16 -236 314 -20 95 -62 -253 -267
3669 -267 -131 72 -110 -54 -236 -7 -138 -59 148 -152 31 220 59 -129 279 -256 -320 85 -200 -182 220
3690 220 10 38 -342 -127 -138 56 123 122 32 74 6 -164 -172 -22 79 189 206 -192 -76 -156 -207 85 -119 -35 52
3715 52 -154 62 -167 82 275 -54 199 -133 202 -140 329 55 -173 179 -103 -133 -167 -84 176 -51 -202
3736 -202 -328 -55 50 74 46 -158 25 105 61 -62 90 346 271 172 37 -12 -58 -221 -28 288 66 -117 -60
3759 -60 325 -249 -114 -161 -138 95 36 333 76 -25 -29 -353 23 173 -97 -34 -189 -95 141 -210 -381 -255 -101
3782a01j44M30j93l97M62j38K36j27O1J53j47j9l0R7j92J12j83L00m35P7J4K53
3804H9k37OL21J1P8o4j57M24q07J99K81K91o68J79P0p0J25m35K82j6r0R2K61J15
3828B80k82r4J22j45Q4J46j15q1J12Ln4j4L76k47K04l64K43n95K02K15l46K60
3850i0O4K63j32j68o4L76p7J47j3j94K6k67j41J98q6J18o0J83o9J25k72K90j70
3873a3J06k2j42P1Q6k43NJ91k81M07K1r1k42J90L01n59M1J67k85O1K85j53M1J3
3897d5J58K36k36J03m2K65m24K28k82N6j13l12L40K28r4j55J66p8P9K0k03K31
3919A26p9l4K7J13l07J55K22j43j35L88l11k9k1j01K86l37O2K81l25K41k67Q8
3941a00K90k10K82k30j26J24J19j99k22K82J99m5j27L6j2j02Jr6L51k22K02j79
$$ plain form
3782 -101 -245 185 -8 -405 57 -81 155 28 89 242 95 76 46 143 -49 63 -120 180 -255 -178 -164 89
3804 89 -148 -142 179 190 268 204 47 471 -336 -137 144 435 -233 -54 16 -54 71 -364 -82 -98 -188 -96 165 280
3828 280 -2 -96 26 -119 -35 111 -4 -85 27 30 -24 -38 338 91 295 -69 174 -421 -219 -4 -350 -90
3850 -90 -26 237 105 -63 -127 249 172 319 306 112 138 -129 -270 -72 -158 -40 -100 83 14 139 -133 157 -13
3873 -13 93 71 -71 0 86 -157 -152 39 -242 165 186 95 -147 43 344 -215 -174 -7 -292 -231 54 -99 -58 -45
3897 -45 113 349 113 216 174 439 15 243 -39 17 -96 -408 -68 160 66 -89 77 -1 78 98 -105 126
3919 126 47 13 40 153 -154 1 223 80 -55 333 22 -7 -28 -129 157 -180 -118 163 -162 79 -188 -100
3941 -100 190 -20 262 32 -94 30 149 -50 -272 10 209 164 37 73 61 -41 -40 -136 215 -7 195 16
3963A6L64m12p9M87m06J70k68M28k75n8R1k6J90j40k8j40J16O3k01K99j99K0N2
3986F4k09J83r6j52M07q1k42N59l36j41J96M3k07j47J12Q6l13M55k24K74l87K01
4008D5j50L08j24K9m5j94L01l38N63m52j9k22N19l25R9P7l15J26K18j05m7J54
4030A03k35l2J53q7O3j6L1j39M7K55k77M43l61J48m19M17q9j52qQM5k5l0J66O2
4055G1q6L75j46k54K39j29%k87K97j84m2j33L11o6j7L02l64J25j33L95M7n18K92
4078I5l84J75k20L84j86K20j95K5N6L06j62q4O4l10K24l48M54m85K24j7K7o3K11
4101A1pM43m98q3L84m31K58j24J27j10m6L05l24j62J96Q1LJ55P2l52L30l64J35
4124aj4K16j59J81l30J94j56p6K14k50M96l69J44k1k44q9o6R6m4L64J2l8J9%K4
$$ plain form
3963 16 380 -32 -111 376 -30 140 -128 300 25 -33 58 32 222 82 54 -86 30 93 -108 191 -8 12 64
3986 64 -145 38 -58 -210 197 116 -126 433 97 -44 152 195 -12 -159 -47 39 -274 181 -43 231 -156 45
4008 45 -105 203 79 108 63 -131 170 -168 395 -57 -76 -298 221 -104 -5 72 -243 -117 101 -4 -51 103
4030 103 -132 -164 -11 -98 -35 -51 -20 -159 -112 143 -134 309 -52 96 -323 94 5 -147 -155 -147 -102 -127 -157 9 71
4055 71 -15 360 214 -40 199 70 70 -217 80 -104 -146 -279 32 -34 -51 251 -113 12 -121 274 321 -197 95
4078 95 -289 -114 -334 50 -136 84 -111 -86 -30 276 114 30 94 -216 8 -340 114 -371 -147 -164 -137 -200 11
4101 11 4 447 -51 -134 250 -181 77 -47 80 -30 -76 229 -95 -257 -61 20 23 178 250 -102 228 -136 -1
4124 -1 -15 201 42 223 -107 87 -69 -145 69 -181 315 -54 90 69 -175 -264 -330 -234 -278 86 98 60 79 79 103
4149A03j23J19K61k97n3p5j49J10k82L65K6j09p8P9k24K49n2Q3K13N6p5N4r1p3
4173C7j67K07K74k2o2l66Q5r0j03o5J57N2J8L63l59k24K66j0J04pK80m0K4o0j65
4198A27j68p6k98K66j5j16K79N2l11J52o3o7M72J74j7r0l66r0J63J97j88q6O44
4221E75o92r3J46N8j55J36k50L25k3K7l18J23J70j91M8L78K03l83j41mJ57j29
4243c3L15l41K62j67l39pJ1J54N9Q5k0J49j98K18p4Q0n9M1j09K9m2k1j27j0K59
4268A15l54p0K28K09j13l29L94k79N8qK82j23J31j31o3J08q3j81o1L59M9j21J48
4291A65l24j19j64L72N3o4n1K27j92J80j77L32m6Q8J64l35j6%j82j80J17q0K19
4314a3J63j26m12K70j07J68L8J95J74j09j25j23M1p7OL18j20J75p6l6j49l97J37
$$ plain form
4149 103 -20 99 360 63 10 -65 -214 -104 -386 -21 5 -104 -182 -103 -327 -78 -130 -47 166 222 147 201 110 37
4173 37 -130 77 351 329 267 -99 -14 -104 -207 -272 -115 -63 -45 318 -41 -265 1 -9 95 88 368 328 352 292 127
4198 127 -41 -117 -415 -149 -164 -280 -1 51 -260 -108 -171 -238 234 408 391 301 -65 -155 8 205 17 -69 575
4221 575 -117 -210 -64 -6 -161 -25 -275 50 27 54 -264 -141 29 -162 -114 264 467 84 -57 -61 96 -33
4243 -33 282 -59 203 36 -303 -310 -299 -145 -86 -1 -21 128 -70 148 74 154 95 136 27 56 14 -7 -134 -144 115
4268 115 -239 -309 -81 128 15 -314 80 -199 -141 -149 133 10 141 10 -53 55 -28 -209 -270 89 138 17 165
4291 165 -159 -278 -442 -70 -17 -81 -132 95 -97 83 -94 238 192 280 444 109 93 93 -89 -269 -152 -232 -13
4314 -13 150 24 -388 -118 -225 -57 -19 176 350 241 116 -7 34 -43 -37 281 161 336 260 224 75 -322 -185
4337a85K07P2k94j02K89o4K87l61J42J8q5L91m4k36L32m41j73L53l11K49j94k57
4359d07M51m35J62J08K62J25j71o5j12J46P2J94j35M7k80L31j59k86K83k84M4
4380a09M1J21j43k1j39J25p4K17K57K29l06R8J4j50l4q3J62k25J87j74j60M7k05
4403c25l9J39M7lO1K55J2l0J06j14N6j00L06k61n3j40M8J27n1l73K82J07k00J66
4427B3k86K14l4MK73k03L74k54k24K40k28K14R3m1l19M28l63j14N3k6N7J45l7
4450a1n6j0o7L6j56J97J86n0J35k34R2Lp1q3M3K2Q7J26j05l56K51j67L64l9J56
4475B93j44K1j96J23j81J4j97L00n2J74o7j07j9j23N7Q9K34n14M07j00p0j83K02
4498c9J69k99K90K5k25J11j6L1j63J93p2p7m4K83l29N1j20L59j58J05j21j52K57
$$ plain form
4337 -185 22 94 -200 -302 -13 -77 210 -151 -9 9 -76 315 271 35 367 -74 -247 106 -205 44 -150 -407
4359 -407 44 -391 -229 -121 141 266 95 30 -82 64 136 330 195 242 -38 293 134 -152 131 -153 -109
4380 -109 -68 53 -90 -111 -250 -125 -199 18 275 504 198 296 310 160 126 43 205 -20 167 -7 -167 -120 -325
4403 -325 -364 -225 -178 -181 -120 135 147 117 223 109 165 65 371 110 57 -83 -35 92 41 -332 -50 57 -143 23
4427 23 -263 -49 -83 -79 194 -9 365 111 -113 127 -101 113 206 165 -154 274 -89 -203 -150 -176 -119 26 -11
4450 -11 -67 -77 -144 -108 -264 -67 119 69 204 -30 62 65 -6 -89 -46 -24 63 189 84 -272 -21 -188 176 137 293
4475 293 149 170 -26 97 -84 -70 -267 33 -19 155 88 -19 -38 -161 -104 -15 219 -295 112 12 -58 -241 -39
4498 -39 130 -169 121 146 -79 32 16 47 -116 77 5 -72 -116 167 -162 -111 -231 128 -30 75 -46 -198 59
4521E9k30N9j19J96j25K63j19P5k02L45l29K05j89L21j05j13k2J23l12J85J21
4542H7l11J40P4n8Q7J20j16pN3m5N9k65M3K64K0k8j57k3K7J23k63J3K18l9k06
4567a90J53j1j11o2N66n60J89j9R9O1m5k49o0K06j68K72M9l62J48L93n89K44k4
4590g0k1j52K09K74j01r3j05K7P9J62j71j34K34l12K9l6p5O4n2K12p7ON3J98l57
4615b09K84J83L1j46j7K7j6p2p5J09q3m8J49O6J7j45l9L7J61m45O0K75J74j97
4639H1k47m1K00J51N8j27J0l08L9J18Q3j33o6J01O6j29j16j04L28P1q9O4O7J64
4663B41k00k4j4J33r2k00K74j38J28k20J10OJ05p0o0j24K03j7J28m54M20j4j56
4686c5J53n9l9Q2m0K3j03j34L43k01j86O3J39k35J46J46M8J2l42K19K34l60K85
$$ plain form
4521 59 -171 -112 -231 -35 -160 103 -16 59 -143 202 -127 78 -111 210 105 -8 -30 93 -219 -34 87
4542 87 -224 -84 -10 -68 19 139 23 16 69 24 83 -182 -139 125 145 117 -40 -63 -36 87 -176 -163 55 16 -190
4567 -190 -37 -48 -159 -221 345 -215 -26 -45 54 115 70 -179 -239 -33 -201 71 120 -242 -94 299 -290 -46 -70
4590 -70 -91 -243 -34 240 139 46 -59 -32 47 209 38 -96 138 -174 -145 -181 -256 -192 -244 -32 -109 -103 -50 148 -209
4615 -209 75 258 289 143 126 153 137 65 -10 99 16 -32 117 183 200 55 16 53 214 -231 -171 104 278 81
4639 81 -166 -207 -7 144 202 75 85 -223 -184 -66 17 -116 -182 -81 -15 -144 -260 -364 -36 35 -54 10 77 241
4663 241 41 17 3 136 44 -156 118 -20 108 -112 -2 4 109 39 -21 -145 58 41 169 -285 135 121 -35
4686 -35 118 59 20 102 62 85 -18 -152 191 -10 -196 -133 6 -229 -83 63 111 123 -219 0 234 -126 159
4709A59j44Q6k45Q1j09m3J04R6L0p0K9pK89l21K52k84k8K16o9J55L5l53J61j41
4733a21K64j21j70j3J55j6l05J47P7q2K44k7j22N1J86J30j16J25j96L9j59J01
4755G1j28k5J06J16k90J04j27j4J87n2K69k56K74o6j4j17j40K62k37J35l1j06
4777g9KL2M4m2N8k63K56j00o7N5j22l0J32K42j56O5L61L8l80J00q0R9n17K38j01
4802b15m2N5K94n28K52K1K97O3l30Q1j9K20j71p9L09k16k03k4K07J82R0m23L15
4825A36j4p6p5L8o8N2K22l80K98j39J50k07K46k59p6K72p1q4j38P9Q3O9Q6j69
4849b5N2R4j79J26J5l8M26n80J03J36J43n56p7M37j58K72k06l05J32k9J51J30
4871F4J73j74J29k57K06j73K03j51RJ5j79J10k03M43l72LJ37j63R2nj9j48J52
$$ plain form
4709 159 15 101 -144 -63 -172 -215 -111 -15 15 -55 -26 -33 256 -65 187 -97 -125 91 22 177 212 -141 20 -121
4733 -121 143 22 -148 -161 -6 -22 -327 -180 -103 -185 59 32 -90 -39 147 277 161 286 90 129 -30 71
4755 71 -57 -82 24 140 -150 -46 -173 -187 0 -52 217 -39 235 169 155 38 -102 160 -77 58 27 -79
4777 -79 -77 -45 -1 -43 15 -248 8 -92 -159 -104 -226 -256 -124 118 -38 27 388 426 46 146 66 165 -352 -114 -215
4802 -215 -257 -202 92 -436 -184 -163 134 197 -133 -52 -71 149 -22 -101 208 -8 -211 -235 -28 154 244 -179 136
4825 136 122 46 -29 9 -59 -7 215 -165 133 -6 144 -63 183 -76 -152 120 49 -35 -173 -94 -11 58 144 -25
4849 -25 27 121 -58 68 83 45 471 -109 -6 130 273 -283 -360 77 -81 191 -15 -320 -188 -217 -66 64
4871 64 237 63 192 -65 141 -32 171 20 29 44 -135 -25 -228 215 -157 -154 -17 -180 -88 -93 -112 -260 -108
4894a08L74j57j24L07k17j15k4j05K30Nj67k28M6K88j68J20N8k34K52K27k28K77
4916C09j92k2j41qJ06j86K07k00K63k26K75l04Q0K57j48J28l09K31m1J02k29j6
4938f4j61L25L43j44j86r8lk74L32Jp4J17q5l9%k8N4J02j0L8N0o5k4Ql4R2j14
4965E9r3j86K59k07k3J32m3J7K17J29q3J37l52K7L7J21j88L8o6L5m3L29n07M24
4989A70j91q4N0m5op1k76M07q6J12J95j84k63L54J07o8J28l37K17j27k2J75K1
5012A76k08j18j19l9J28J34o1K54j26nn4J31J3j28j64K02J3q6j5J41K18k66J51
5035A72p0M1q1j11k10L82k58j13L08M3l15M25R6j13J01j78j7j77M3P6P6qM1j51
5059BJ58j90R4RO2J4J42pk95L38j70j75J0J73m93K06O2k00J94l3q6J23K05k33
$$ plain form
4894 -108 266 109 -15 292 75 -40 -64 -169 61 66 -101 -329 -283 5 -163 -43 15 -219 33 260 32 309
4916 309 117 95 -46 -54 52 -134 73 -127 136 -90 185 -119 -39 218 70 198 -111 120 79 181 -48 -64
4938 -64 -225 100 443 299 113 15 12 -262 70 71 -3 114 29 -10 -10 -38 16 118 108 146 196 131 107 115 81 173 59
4965 59 -34 -220 39 -168 -191 -59 -102 -85 132 261 178 315 -37 -10 27 148 -40 -2 -68 -33 -76 253 -254 170
4989 170 -21 -105 -55 -100 -106 -177 -453 -46 -132 -20 175 -9 -272 82 189 121 249 -88 129 2 -20 155 176
5012 176 -32 -150 -269 -308 -180 -46 -107 147 21 16 -38 93 106 -22 -186 16 29 -57 -72 69 287 21 172
5035 172 102 143 62 -49 -259 123 -135 -248 60 103 -212 213 309 196 297 119 102 -75 -32 44 120 112 153 2
5059 2 160 -30 64 73 135 149 291 284 -11 327 157 -18 -8 165 -328 -122 -60 -260 -66 -99 -185 -62 143 -90
5083i0P7rj32k6J57J13L8k22L52k34J8l12K57oK95j68l77P7J80KL3k17L65j24
5107D7L2K63m46q4K42m6J19j1j52J43m5n1o9j3l4j23O3L83k74L22j16j1j97k28
5131b86Q4J85Q0Q2J50mk08%q6J45k88K20p1k49J87k33L53j69J23j38n2J89%Ln4
5156c7J90K1p2R5p4k51N2L8q2M6J16l8P0o9k27j3L43q5mR6p9K08k77K79j76q5
5182a5J67j25J51l27N6j37L27l00L89l75Q4P2j39L53k42J26J17k82J84m1K2o0
5204EO5k3j34r6J19o0L0J72J80m12j54L38P2O0K6j84k7K6O9k3m5J43p0p2J98l97
5230a94P6J19j29n3Q3p2l19N41r4j19j3N24m1j22L68l65l32J48J15J02j86Q3j94
5253g4P5j61J10M3Ok3K73m43J94l1J51j76J09n0mJ30p6j3j6K08l66J95o0r7J36
$$ plain form
5083 -90 -13 -22 -154 -180 -23 90 128 -94 258 24 42 -270 -13 -19 276 108 -269 -192 -12 -10 23 -194 171 47
5107 47 79 342 -104 -188 54 8 127 116 -36 107 62 11 -58 -71 -105 -228 -165 218 -56 266 150 139 -58 -286
5131 -286 -202 -17 63 145 295 291 83 83 -3 142 -146 74 3 -246 -59 -292 61 -108 15 -123 -175 14 14 17 -37
5156 -37 153 174 102 197 123 -128 -76 -38 -120 -74 42 4 74 5 -222 -235 108 23 19 115 36 244 -33 246 70 -15
5182 -15 152 27 178 -149 -93 -230 97 -203 186 -189 -105 -33 -172 181 -61 65 182 -100 84 43 65 5
5204 5 70 47 -87 -183 -64 -124 -94 78 258 -154 -308 30 102 162 188 4 -23 3 72 49 4 147 77 5 203 -194
5230 -194 -118 1 -128 -181 -98 -170 -489 52 -42 -161 -174 350 309 187 555 190 -142 6 121 223 37 120 -74
5253 -74 1 -160 -50 -7 -1 -24 249 -194 0 -31 120 -56 53 3 -1 129 53 40 24 232 -134 61 1 -96 40
5278D0J09j33l13M57k42L0J2J39MJ0K16l64p8J19m7K26j98R1j36K2j81J16J63
5301F2j99J03l25K88O4m6J52l33L43J2o9j01J47J03J02k36K27j69k8j30j4j95
5323b42J81m1j8Q3j25O2J95l24K61J57P1l01K25j17j52n5K53L2k79j07J91n5k55
5346c60K88J81k16J01P5l04K38k61L12J47k69L12n8K59k81k13J64lp7j66j27J72
5368h6k54K04J57k05M2J16J75J47n3k19O8j49L49k99K70k05k95J16k4K4J06k12
5390b27L4L41r3L5p1J55J01j36l6l12M52J5l0m52K26J42j92O7M3k65k6m4L89j74
5414e8r6K02j85J02o2J98j09k78M44k5J29j74j81K15j27J23m24J67q0J03R9K4
5436Gj41k3J4j6M5J13L23l42q4K21o4j04K1k7j73J30O3N9R0r8J07j49jo9K8K50
$$ plain form
5278 40 149 16 -297 160 -82 -52 -40 99 103 113 329 -35 -113 6 -41 185 -13 78 -58 -36 -217 -101 62
5301 62 -137 -34 -359 -71 -7 -53 99 -234 109 121 52 -49 98 201 303 67 294 125 97 -33 -47 -242
5323 -242 -61 -102 -120 -37 -162 -100 95 -229 32 189 260 -41 184 67 -85 -140 113 145 -134 -241 -50 -105 -360
5346 -360 -72 109 -107 -6 69 -235 3 -258 54 201 -68 244 186 445 164 -49 115 112 35 -131 -258 -86
5368 -86 -340 -136 21 -184 -142 -26 149 296 243 24 92 -57 292 -7 263 58 -237 -121 -145 -121 -15 -227
5390 -227 -193 148 55 90 19 174 275 139 103 -209 243 258 228 -224 2 144 -48 19 62 -203 -229 -273 116 -58
5414 -58 -154 48 -137 -35 -97 101 -8 -286 158 133 262 88 -93 122 -5 118 -306 -139 -219 -116 -17 7
5436 7 -134 -157 -143 -159 -114 -1 322 -20 -104 117 53 -51 -30 -57 -230 -100 -37 22 112 14 121 -28 -29 -98 -70 180
5462A80k69J23N8Q8O1k60j11J61J50j1j00r8Q4k08J79l04J46j50nK34k62L26j83
5485a71P0K09p5k3N6J3j20J83j38K0j9j35O6N6NjJ40k99K88k36O2m3j01J24j42
5510b11L25k23J32m16L93O2n8M8J5n9j39j68L37j41o4k7J17q3m9K1n7J89P7J70
5534A91m8j09q7J62k0M2m0Q0j96K15l7J7j86J81m63O2n5L91r4J72l21m3K80j40
5558d6k20MN09k37P4K1K04l76J16J02j48k7J19r6n4p9lJ24n0j48J73L6j10q8K82
5583H2lL8J65k58Nj29K13l1q9p0j54K98k11j40N3O6J40j41L62k16J01K10m30K04
5607F5RR8J28j21L5j70j44j78J1L75J87l83q1Q5j23K55N0K58m92P2J13j27K28
5630A50j17k23K4PJ49j03r8K83j60J99k04L55j67J10n19J66O61n97K81l37N9K29
$$ plain form
5462 180 -89 34 92 180 241 -19 -130 31 181 170 70 -28 56 -152 27 -277 -131 -281 -286 -52 -314 12 -171
5485 -171 -101 108 33 10 66 79 -41 142 4 24 5 -130 -64 -8 -3 -4 136 -163 125 -111 -49 -92 -193 -69 -211
5510 -211 114 -109 23 -393 0 62 4 52 67 8 -131 -299 38 -103 -167 -194 -77 -160 -209 -188 -245 -56 21 191
5534 191 143 34 -53 109 89 131 91 171 -25 190 153 170 -16 165 -298 -236 -291 100 6 178 -143 -186 94 -46
5558 -46 -266 -262 247 10 84 105 309 -67 49 151 3 -24 95 -1 -55 -134 -137 -13 -63 -211 -38 -2 -112 -200 82
5583 82 79 117 282 24 29 -100 113 82 -7 -77 -231 67 -144 -284 -231 -165 -25 -166 196 -20 81 291 -139 65
5607 65 74 172 300 179 214 44 -100 -278 -267 108 295 -88 -169 -84 -207 48 98 356 -136 -64 49 -78 150
5630 150 33 -190 -166 -159 -10 -113 -211 72 -88 111 -93 262 95 205 -314 -148 513 -84 197 -140 -81 148
5652A48k65L41r1j91J40L17l33j68K4k51L88K3j73K73q6l74L58Mj67m8L67l46
5674a10L87r2p5j54O0M8j31j34J09P4j86L3K14k78K55j30K34l5o7J04k78K03J96
5697B47j40j67j4J56j00p8J50ko2j35K2J06k95L63k53J63k10J33P9mJ81p8j26
5720f4L05j54k24J97j79r3K81k96k30L75j88L16O3j11k49K51j60K34P3O7L3q2
5742A65m5j97k4L4o7m9K90q5l6j31K43m1K5J98k38j33J34k02M20j72k0k22K97
5765A44pj57M9n0o3l5K76R3j9j53l4j77M5p8L15k15m7J17O4Qo1k76K70J9j46n7
5791a75P4j24L34k05QJ41j04k6J5K48n9k34J05J19m1k24k2L71k82J11p9K89p7
5814A63l90J57j15j3Q4J75k32J33P6j07pl9J41M0p3Q1j1J60m33L42j76K20k43
$$ plain form
5652 148 -117 224 133 -58 82 399 66 -102 -78 -329 59 82 -91 182 96 -278 80 84 -83 -131 236 -110
5674 -110 277 185 110 -44 16 64 -67 -201 -92 -18 -204 -171 43 -235 20 -110 124 89 22 126 -152 51 247
5697 247 107 -60 -74 82 -18 -96 54 52 -10 -145 -123 -17 -312 51 -202 -39 -249 -116 -37 -41 140 62 -64
5720 -64 241 87 -137 60 -119 -212 69 -227 -457 -82 -270 46 109 -2 -251 0 -160 74 147 214 247 165
5742 165 120 -77 -101 -67 -134 -183 107 22 -14 -145 98 57 82 280 42 -91 43 -159 261 89 69 -153 144
5765 144 137 -20 29 -21 -84 -119 157 250 231 78 44 -133 -88 -166 149 -66 -113 4 68 76 15 -261 9 28 -118 -175
5791 -175 -101 -225 109 -96 -88 53 -51 -77 -62 186 127 -107 -2 117 76 -148 -170 201 -81 30 -49 240 163
5814 163 -227 -70 -185 -198 -114 61 -171 -38 38 -69 -76 -115 26 66 -7 74 63 223 -210 132 -44 176 -67
5837f7L3J12J54k09o6r1J65o5l9K69j26O1k08J39k4mK4j10l7K30k01K01j78n9
5861i6K23j54J18j67L23J23m04J66l77L79J35k57j53J40k5J53m5l35N4r6N07l72
5883a60M51l83N7J59k33K47k10P0j57L39m82p0J50L02M0j14L1j51j03L40j52M9
5905B0k03Q7J36p8K10k26K7k28M28r0l50K30L11m03K41M0j15J94m01J58JJ21k50
5928a40J51K46k05N1R0o1j91K30k74J28J11j42k2j45J68M2k6K2j97L31k44O4r9
5951a12J30l4J01n0Q2k11O7j85K78k13M6K67Qj96J70O2j75J73k85L12k97J22m06
5974c46K99m5j51M95k18l09J75O9j15K7r4N6O2K39l17M0J53j98q6K89J49l44J23
5997d7J07k00J55k5J16j45J60k90j11O14k79k20K74o5j43O2m6K9L08j58O5m32
$$ plain form
5837 -67 -34 78 232 23 -43 -134 31 -34 -73 196 70 131 -77 62 38 34 58 -52 -89 141 -60 141 -37 -96
5861 -96 127 -27 91 -76 247 370 -34 132 -245 134 269 12 -141 -1 -26 127 82 -253 -199 -295 212 -160
5883 -160 291 -92 -35 124 -109 138 -72 -2 -159 180 -302 -372 -222 80 120 6 37 -114 -217 123 -29 20
5905 20 -183 -96 40 -38 172 -54 -27 -255 173 83 -267 -37 274 -129 112 152 37 231 -170 -12 -11 110 -140
5928 -140 11 257 52 103 193 132 -59 171 -103 25 136 -6 -28 -173 -5 37 11 33 -164 167 -77 -13 -112
5951 -112 18 -16 85 35 117 -94 -27 -212 66 -147 -101 166 174 -22 148 210 35 208 -77 235 -62 60 -346
5974 -346 -47 -92 -243 252 34 -275 -100 -31 -146 -119 -213 -157 -95 144 -173 -133 20 -178 -264 25 174 -170 -47
5997 -47 60 -140 15 -10 106 -39 121 -169 -280 334 55 -165 109 44 -99 -37 -83 -54 254 96 161 -271
6019b71J55j35K14k43J93J9O3J16%p6J60m06M38k83k0K51k62K65j59J45j50k19
6041b05L39j70j46K96m88M21j68j23kL70j90R7j19M40m90O5K10P2k20J58N0j20
6063G7k17n1M12j43O0m9k16J97m8j57K5%N4J47j16QK34l28K98k64N0r2M1j06L9
6088a45k94L29J61J81k5j1k10N6K22n6m38K30JNo6j41L1J94k81K62j48K68k33
6111a08K43q3o2K1l2lN4k15M90m63L08j23J31n0j11j41J73J19j35n6k87K36l39
6134d33N27k1j55K82j56j40J98p6j54L50J49m15J59J72k27l11L27k79L67l28K70
6155A06j92k61O9M07J74Kl14J27k16j47P5M23k06j49K60l66M20j94K9j38p1Q7
6177g5j01K91j55J43J7Rm1L4j78L57j63J15O6o20L35K52k46Rqj58j10K86K8j07
$$ plain form
6019 -271 -116 -251 -37 -280 -87 -68 -5 111 111 35 195 -211 227 -56 -76 175 -87 178 19 164 14 -205
6041 -205 134 -36 -182 114 -374 47 -121 -244 -246 124 -66 31 -88 352 -138 -73 137 209 -11 147 197 77
6063 77 -140 -191 221 78 138 89 -127 70 22 -135 -110 -110 -56 91 -25 -17 217 -111 187 -77 -27 -119 -78 -184 -145
6088 -145 -439 -110 51 232 207 196 -14 42 264 208 -230 0 1 6 -60 -201 -170 24 -257 5 -143 125 -108
6111 -108 135 52 -10 11 -21 -24 30 -185 305 -158 150 27 158 108 -3 -144 29 148 13 -43 -330 -94 -433
6134 -433 94 73 -82 200 44 -96 102 26 -128 222 371 -44 115 287 60 -251 76 -203 164 -164 106
6155 106 -86 -347 -278 129 303 305 -9 118 -98 -245 -170 253 47 -102 158 -208 212 18 47 -91 -162 -75
6177 -75 -176 115 -40 103 120 129 88 122 -56 301 138 253 319 -301 34 286 40 49 41 -117 -227 59 87 -20
6201b0P9j16J97K1j15J69k16J9J13Pj49N67n72J70k40l60O74l59K72r7j35J28
6223C7k15K95k35J87k13J56J04n0J01k63j17M88j37j32l4k43L87j73L8K7Q0j55
6245f7P4j86N37n30NM09k15r7P0K27k25j40L32m90J30Q4j72L92j60m79Q28k97
6267C0l1j34L06r6r8R3k15M37l87J58j91J82Q0L6m38O2K60j13Q2JL42o05P3K53
6291H7L0l5j19J5r4K24o8k42J4L13J58m06L49l41J14L0K1j69L56l15J15j93J80
6314B4j88N7n8J50K24j38q1P7L9J44j47k44K29j35J20n38L70L63m54K21J56k48
6336e7m3J37K5L06o7k43l1k6N4l2L8k2m0K86q3k93J70j18M1n2O8j02J27j14LK3
6362d5J24p2j44K83j58K34m17N3j5K9k0K17n5J7J80j84j97j04K54q0J08L45k08
$$ plain form
6201 -20 59 -57 140 161 46 215 -1 18 131 138 -11 556 -16 154 -86 -446 228 -131 141 44 -91 37
6223 37 -178 117 -118 69 -144 12 116 66 167 -96 -213 275 138 6 -28 -271 116 -57 -19 8 88 -67
6245 -67 7 -179 358 -172 -167 242 27 -70 0 227 2 -138 194 -296 -166 -82 -254 138 -22 -501 327 30
6267 30 -1 -135 171 75 -23 70 -145 292 -95 63 -128 54 134 170 -268 -206 54 -59 23 24 366 -239 -166 87
6291 87 117 82 -37 -22 -116 108 40 -202 -188 125 283 -123 226 -115 -1 29 50 -119 237 -78 37 -156 24
6314 24 -164 -107 -165 -15 209 71 -10 67 106 250 103 -141 88 -47 73 -465 -95 268 -186 35 191 -57
6336 -57 -100 37 62 368 301 58 27 1 55 23 61 39 -1 285 202 -91 79 -39 2 -50 18 -84 43 -71 -68 -45
6362 -45 79 7 -137 146 -12 222 -195 -142 -157 -128 -148 69 14 31 211 27 -170 -274 -20 -100 8 353 145
6385A45m6k47K34J1K6j00q4J28r4j43J65J18j8L5j26J21J6l86J75J13j27l6J05
6408a5jk0l2J36J29r4k19Q9P8J62Rj38J68r7j50j59K34J16r5j27K44j40Nl13J62
6433f8k26m6K97k35J97J31J61m51m8K06R9k18K10j75J57M0k01J4K27j75R9j5M8
6456B8J2j35J47J96j99N1j82J49j94K16j65K96r2l82K34MJ0R5l2j70K42l4K7m57
6480c35L01J60l05J12J18m9r1O9J34N4k91N0J60j32J18k89K91k30r4N07j20k42
6502a04K25l45M6J69O5J03q8L1O5k71kj27J08K72r6J02k74K50j48m4j58L90k98
6525a29K74j07k55K62j28N4J26k23j14J98p7M15k64n8M0j56j77L40j22L60k42
6546A7J03k0j33j12Q4L7l0QJr0K04k06L35k43K33j74J9p9Lj25L51k02J20j51J54
$$ plain form
6385 145 99 -148 86 97 123 23 -61 67 -27 -170 -5 113 95 130 4 125 141 -245 -70 43 -84 -120 -15
6408 -15 -16 -36 -68 68 197 103 -116 -27 51 213 222 84 252 155 5 -154 80 196 101 -26 218 78 83 -230 -68
6433 -68 -294 -340 -43 -278 -81 50 211 -240 -288 -82 17 -201 9 -166 -9 31 -170 -156 71 -104 -5 -20 28
6456 28 40 -95 52 248 49 100 -82 67 -127 89 -76 220 128 -254 -20 -16 -6 89 57 -113 129 95 122 -335
6480 -335 -34 126 -179 -67 51 2 -89 -20 114 168 -123 -73 87 -45 73 -216 75 -155 -249 258 138 -104
6502 -104 121 -224 -178 -9 56 159 71 102 167 -104 -106 -233 -125 147 51 153 -121 129 -19 -63 -221 169 -129
6525 -129 145 38 -217 45 -83 -29 97 -126 -240 -42 -119 296 32 -26 14 -142 -319 21 -101 259 17
6546 17 120 100 -33 -145 -61 -24 -54 -46 -45 -135 69 -137 198 -45 188 14 33 -46 -43 -168 183 -19 101 -50 104
6571A04l18K21N2%j5j24L95m20P6j03J78l8O5j40L16j68J6l8j8j59J94Q7k13l8
6595h8N2O9J52j62k44N62k50q9K7o4j66M17l35j4J21M5J45l86J79q2L2O6j65J37
6619d1J60J14p3l83L36k45O7QQ7j75J73K55k49J76j57k4L6j24mo7m1J61l45L35
6643b0J56j33k4j17J67m4k29K43k73J15j6o1P9J63L7r4Q8O5l43M35j93j64J27
6666c6j09J69M8o0o9j99J68J20m2J63J44l51n8J00o0J46r3J77k26K12k13j30K58
6689E9k13K29j36j85J35J01J72l43K69J15j93J27l2l88J04J40O9KP4N1k12o4O1
6712e8K83m22J34J64j54K31N3j31l13K62k67L08j17l0j1J2K12m01K21n5Q6k16
6734b09K68n18O92k60J52J60k25q5K3K29j65r6J52o3j23Q7J43l27P6Q3m8N1R2
$$ plain form
6571 104 -214 7 59 59 44 -80 315 -105 -29 -132 46 8 73 -67 249 81 97 59 41 -118 76 163 -50 -88
6595 -88 -36 33 185 23 -221 341 91 2 29 -35 -201 216 -119 -133 -12 33 178 -208 -29 -111 -79 -13 -178 -41
6619 -41 119 233 160 -223 113 -132 -65 -57 30 -145 28 283 34 210 53 29 65 -59 -63 -130 -171 -10 -355 -20
6643 -20 136 3 -21 -138 29 -15 -244 -1 -274 -159 -175 -236 -157 6 43 -51 37 102 -241 194 1 -163 -36
6666 -36 -145 24 72 12 -57 -256 -88 32 -10 153 297 -54 -112 -12 -72 74 -19 158 -68 144 -69 -199 59
6689 59 -154 75 -61 -246 -111 -10 162 -181 88 203 10 137 105 -283 -179 -39 30 32 106 157 -55 -119 -58
6712 -58 225 -197 -63 101 -53 178 231 100 -213 49 -218 90 -27 -57 -68 -56 156 -245 -24 -79 7 -209
6734 -209 59 -459 233 -27 125 285 60 -25 -2 227 62 -34 118 55 -68 19 162 -165 -89 -6 -54 -3 89
6757H9j14M3j10J09J08m0L3J82l81q3J70J71K8m10N6M7n1J34J08j32n0J44Mj18
6781f3O3P1j93Q8L17k86k8L43l65M6L20L9k83r9o8k4L1j4j00J99M2k24J40K10
6805A62j62J50J92m14K00%j28J5P9mO5k35j26M03j47J47n0j54M5m0L7l04K65M6
6829D2q6m7j44LM17j4m3l24J03K23n1R9j25jj36O5j85J88J76nJ7j54J19j78L87
6854C46p5l68L57k51k72M16O3k17j15j12Q6j3J11r5J49P4O7M3j36j3K08j1q6j53
6878CJ8l26O38j08j6k79j4P1o4L27l92K65l6l21J85n7K62l04M1K42j49K53k22
6901A7j8P4p2J67r5P7l48L23k0k36J6P9J31l56L14j62L3K98k34M7m1J29J35P6
6925C34k49k23K27l14K15J60P6k39l0J41j33L5j66R6o5J92j03l36L75J48k05J74
$$ plain form
6757 89 -25 18 -92 17 125 85 118 300 -81 -164 6 177 205 -205 -149 -102 -153 -19 89 -43 -93 51 55 -63
6781 -63 0 71 -122 -34 283 -3 -31 312 -53 -7 313 352 69 -30 -98 -122 -91 -105 -205 -6 36 -188 -48 162
6805 162 0 150 342 -72 128 128 0 15 94 90 155 -80 -206 197 50 197 147 -7 38 -2 35 -269 -4 42
6829 42 -44 -91 -235 -232 185 171 128 -196 -93 130 79 178 53 52 -84 -19 -204 -16 160 155 172 18 137 -41 346
6854 346 271 -97 260 9 -263 153 216 -1 -116 -228 -142 -155 -44 -139 10 84 151 194 58 45 253 242 156 3
6878 3 21 -305 333 225 209 -70 -84 -13 -77 250 -142 123 87 -234 -49 -106 156 -148 -107 135 -14 239 17
6901 17 -1 73 1 168 73 150 -198 125 105 -131 -115 -36 95 -261 53 -109 -76 222 -12 35 -6 123 258 334
6925 334 85 -138 89 -225 -10 150 226 -13 -43 98 -35 0 -166 -70 -135 57 -46 -382 -7 141 -64 110
6947A10m5O2o1j77J1K09l7j64J85O5K2k90j65N7K90j60J92p0j36P7M3j65K17j48
6971g8K93j93M3j3j75p8K06r3r6J1K36n8j39L23j72K3k76L37J37l1l26P1J35j96
6995a09q6K61J64j96l46K99J72k23j49J41j48J11J14M4l76L53j51J30m55M00j08
7016a58L39k12J23ml59M45k84K58j17k90M5j09M34l34O0J14j37L58l93K49j27
7037i9J11kk60J69M2J28P7p5j22N2P4J61l10M6N0k36K62l25L12k32J20j14J21
7060e0K7J14K42o78N11jJ6k60m9J47j87LL29J08l03K71k47J2n6K33l32l3P0k03
7084c16R5J34J54Mk15l5J64q1J07J61j12q8r2r9J01K07J60l97L00l07J33K1j27
7107a28P8J4k21l11O47l33P1J35K27o4l09L10m3j57j8k4J49j51l4K59k35K13k65
$$ plain form
6947 110 65 127 66 -111 -100 109 72 -92 93 158 180 -110 -275 -218 72 -88 104 34 -102 -25 18 -147 70 -78
6971 -78 215 22 65 52 -123 -201 5 -88 -184 -173 63 5 -134 189 17 40 -236 101 238 207 -119 -48 87 -109
6995 -109 -195 66 230 34 -312 -13 159 -64 -213 -72 -220 -109 5 49 -327 26 -125 5 -450 -50 -158
7016 -158 181 -31 92 88 -271 174 -110 148 31 -259 -214 -323 111 -223 -163 -49 -186 172 -221 28 -99
7037 -99 12 10 -250 -81 -39 89 166 91 -31 21 95 256 -54 -8 42 -194 68 -257 55 -177 -57 -171 -50
7060 -50 -23 91 333 -345 166 165 181 -79 -128 19 -168 -165 164 272 -31 240 -7 5 -51 182 -150 -183 -113 -316
7084 -316 -221 -87 67 71 -144 -179 -15 -96 11 172 60 -28 -120 -219 -118 89 249 -148 152 -155 -22 -1 -128
7107 -128 -50 -36 -257 -568 79 -254 -183 -48 179 115 -194 116 73 -84 -102 -126 23 -128 -162 97 -138 75 -190
7130a90K22L4M4l35L24K05k65l3m74L98J59k36K7L20k10LQ2N8l30M3Q7m6L0j41
7154b24N8J39J40p2nM6k41M63j40l69J72J66k20L36k61M5O8k65Q2N6m3k36J16
7177a89K76N8j12p4O9k18K25j10j14K91j96o5L5j71M12J58k70j49n3l5J85J4n6
7200h9J39j64K61J50k63r7j09M77k08J4R5j77J52k43J5j7J21l15K99N1j30Q0P
7223D9k01L19j02j5n0n2j2K66l41l7L35j82j54J70M30l59j27Q2m5L49j85k39J22
7246B1J64k42J21n6K16l54L36k52j64J19J67m1k98K62j52J86j62R1k40l1J41J40
7268b8J11K05m61J92J91m3j05j68J55l47K79o0L23j66j13m18M84N8m2O3l16K68
7290F2K09k87O7M7jq5K3L8l28J39K31R3k68M32l47K19j18J60n99K22L0J5j34J54
$$ plain form
7130 -190 32 66 110 -225 99 304 39 6 -468 -70 89 -147 -120 200 -10 -7 75 133 -197 -154 -67 -113 -83 -224
7154 -224 -166 -27 113 41 36 82 -159 304 164 -205 -33 133 -87 249 -12 33 101 -164 -82 -26 -69 -305 -189
7177 -189 87 145 33 -41 28 -190 35 -75 -189 102 -94 -159 -124 -295 117 275 5 -144 -197 -232 -47 -33 -89
7200 -89 50 -114 147 297 34 -63 -172 305 97 111 206 29 181 -62 -47 -64 57 -258 41 92 -38 42 49
7223 49 -152 167 65 50 0 -52 -64 202 -139 -176 159 -23 -177 -7 423 64 -63 19 -26 323 138 -101 21
7246 21 185 -57 64 8 224 -130 206 -46 -210 -91 76 35 -263 -1 -153 33 -129 -38 -278 -309 -168 -28
7268 -28 83 288 -173 19 210 167 62 -106 49 -298 -19 -79 244 78 -35 -453 31 89 47 110 -206 62
7290 62 271 -16 51 98 97 12 35 73 -255 -116 115 208 -60 372 25 244 126 286 -313 -91 -61 -46 -180 -26
7314b6Qj19J91j87K77O0r6K3J39k29K0k4j55O1k92K33M7L53l43K87j20k34r3R5
7338a24N9J55L4k43M24j05Kj38J59j76j64N5J09oK2k04l0j24J21l5K35L7m2K8
7362D9j33L30j07k22K42J74m07j61N30l39%J54l28J53l76O32r3K57k30k98J37
7383c6p1M10l39k19L23J35k22J88k90J28K78l43J57J29k86K2Q9k07J00J46m9j36
7405i3K13L2J54k99O0N7k66O4L39l03j69J02K4Q8J89j54j34k3L16m17M39k40P6
7428E5m8P2j40j02M39j57j36J49k70K53l28M15k73J73J58l14k0q7J44J12n5m3
7450cK12q3l10K21l0p7o7K32l30Q9K95l24j4m0L04L3O9j35J36n65N61k84m3L57
7474B04j38J66k30m1J40pq6K99m89K20L9j31m6J08k18K85j65J15K53l82J75n7
$$ plain form
7314 -26 -18 -137 54 -133 144 204 108 131 270 41 61 37 -118 -57 -349 -116 -69 284 -59 228 108 -126 -219 -124
7338 -124 -65 90 124 -119 305 200 202 64 223 47 -117 -62 47 41 63 -141 -171 -295 -174 -209 26 63 21 49
7362 49 -84 246 139 -83 159 333 -74 -235 295 -44 -44 110 -218 -65 -441 191 98 355 125 -173 -36
7383 -36 -107 303 -36 -255 68 203 -19 169 -121 7 285 -58 99 228 -58 -36 53 -154 -54 92 43 -93
7405 -93 120 152 306 7 67 124 -142 -78 261 -42 -211 -109 -85 3 192 38 -96 -119 197 -220 219 -21 55
7428 55 7 79 -61 -163 276 119 -17 132 -138 115 -213 202 -71 102 260 -54 -74 -161 -17 95 40 -3
7450 -3 209 126 -184 37 7 -70 -137 95 -235 -146 149 -175 -189 -229 75 108 177 42 178 -387 174 -110 -153 204
7474 204 66 232 2 -39 101 94 8 307 -182 38 77 -54 -100 8 -210 75 -90 25 278 -104 71 14
7496A4o2%n7J42j75M31l11JJ34j88j03oK36m9j80Q7oJ73Q7j60J77j78O9j05J51
7521A22r3K7o4N1o6L00k01k12K8L9M5p0Q4M4J80l03o5K46k59K01J82k67kJ40J43
7546B30j29k5j06j74J83k0K89l06N3o6R7P0o4j6K04j05k95J97k11O3L3J10OQ7
7570A05L5k83K05M4q4nk2O0J40k46LK43m5m23L43j03l7K0J93L8j61J33j30J51
7594A74J62l11j84O8K4o7K37R7j96j9j98K18K16j44k34J75nJ01Q9k14p7R3j85
7617a80j6J90j57L63j00Q0K52l75L7k15N3p4J26J60j38j20J16m6K38j65ll0P0
7640F6q8p7k84M31K69l18J58j74J48j91k11n9M01k92l3M66m49K0N23k2m1l26J71
7663H8l3j57Q6L46m52n9L11l12K44K4j27J28J05k41N4J91j24j44K9J12k44K14
$$ plain form
7496 14 -48 -48 -105 37 -138 293 -18 -17 117 -71 -174 -180 56 7 -173 -86 -92 81 168 8 185 7 76 -29 122
7521 122 29 56 -8 43 -23 277 76 -136 -108 -69 -24 -94 -10 34 214 -89 -154 92 -167 34 216 -51 -53 87 230
7546 230 101 76 -30 -204 -21 -41 248 -58 -5 -71 26 96 32 16 220 115 -180 17 -194 -131 -98 12 18 105
7570 105 140 -143 62 106 22 17 -5 55 195 -51 -48 195 150 -273 70 -33 -70 -50 143 181 20 153 23 174
7594 174 336 25 -159 -91 -67 -134 103 200 4 -15 -213 5 221 77 -157 18 13 114 203 -11 -88 5 -180
7617 -180 -196 -6 -163 200 100 180 432 57 94 -121 -68 -142 -16 144 6 -114 2 -44 194 29 26 -4 66
7640 66 -22 -99 -383 48 317 -1 157 -17 131 -60 -271 -330 71 -221 -254 212 -237 -217 306 284 243 -83 88
7663 88 55 -102 -16 330 -122 -181 130 -182 62 86 -41 87 192 -49 5 196 72 -72 -43 69 -175 39
7685C9o5j90L40k16J13L0J43j18J13j12k70L20L7k96K55k32K77j34P3p7K03j49
7707H4k2l21K54j08j52M70j7j81j14J15j63K02J45m96L69J43m79L62j85N9J19
7728H4l3k3j47o5J71O0r6J38j06J14r8j00M2J37l8j16j06j0R3K82k95R0l6J51
7752I3j54J73N9k71J94j67L14k33J57j52n1j44L09j22J54j42K35j15J17Q9l58
7773a5K1L0j13o1J44o4j0l00M30O2Jn17N60k31PJ56j16J13j61n7j13M04j50k65
7797b45K10K02pj73Q9j76j01j0L59l05k65L83j7K61k59j08K25o9J4j06K12j92
7819g8K28P9l17P7J25k66J85O1k2Oj93jJ05J01k19LL02n6l3N3k25j4K41l1j54
7844d3O7K3j07L38m03R7J46n13N20j68j39K34j73j52K03Ml5Q9k35K30R8j61O4
$$ plain form
7685 39 -26 -216 124 -92 21 51 194 76 189 77 -193 127 164 -132 123 -109 168 34 107 30 233 84
7707 84 62 -259 -5 -113 -265 205 188 7 -107 8 -155 47 192 -304 65 208 -271 91 -94 -35 84
7728 84 51 28 -119 -184 -13 47 -49 89 -17 97 -1 -101 -59 78 40 -76 -182 -192 -99 183 -112 -22 -58 93
7752 93 -61 112 171 -100 94 -73 241 8 165 13 -38 -182 127 5 159 17 252 137 254 343 -15
7773 -15 6 36 -77 -138 6 -58 -68 -368 62 124 125 -392 168 -63 -56 100 -16 97 -64 -121 -234 170 20 -245
7797 -245 -35 167 160 -13 76 -100 -201 -211 148 -157 -422 -39 -56 205 -54 -162 63 -6 8 -98 114 -78
7819 -78 150 229 -88 -11 114 -152 33 94 72 78 -115 -116 -11 90 -129 -126 176 120 87 140 -85 -99 142 111 -43
7844 -43 24 47 -60 278 -125 -28 118 -395 125 -43 -182 52 -121 -273 -70 -66 -101 -12 -247 -17 81 -80 -16
7867a6j96K18K03j71R7l09J86J11j64K56R2m70J7K56j97J66j87K6J96L3j90j4
7889e7j42L41j20j16j05K19j30Q6J98k28J24r1J8m8j99L51j6j47K55l41j9K12
7911D5l58M35j3P2m07K50j75P3J49k14J81J33k56J00pj57K49l4j11J10j35j2j98
7934b80K60K89j78O4k7k52K41R7j56j53m6J36J35p6k18KK59j56l1n5O9P9J34k74
7958a37J78J87l67R5J06J63l22K30j55J32j61J70j22k94N14k89J38p2J47j38M0
7979D3j91M9l0K24J46l47L50m06K39k70K10K39k37j03J47n5k14K80k13j07L22
8000G6j61o5K72j15j03j4J6n0J83J61J14l52P1O2j89m0k0J59QL6k24l4K39j36
8024a06L21k21K47l22M5J88r0k64J45J89k94K41k78K18J1JL75k11k45M8L0J33
$$ plain form
7867 -16 -212 6 209 38 135 -174 12 123 -41 215 307 -163 -146 110 -87 79 -108 -82 114 147 -43 -57
7889 -57 -199 142 22 -94 -199 20 -110 -24 174 -54 70 -21 -3 -51 -250 101 85 -62 193 -148 -167 45
7911 45 -313 122 109 181 -226 24 -151 -78 71 -143 38 171 -85 15 8 -149 100 66 -45 65 -70 -82 -280
7934 -280 -20 269 91 155 128 -124 117 214 58 -95 -141 -5 130 54 -164 -162 97 -59 -90 -145 -76 3 137 -137
7958 -137 41 228 -139 -44 62 225 -97 133 -22 110 -51 119 -3 -297 217 -72 66 -6 141 3 43
7979 43 -148 -99 -129 95 241 -106 244 -162 77 -193 17 256 19 -84 63 8 -206 74 -139 -246 76
8000 76 -85 -150 122 7 -96 -110 -94 -144 39 200 314 -38 33 95 -94 -134 -154 5 13 49 -175 -209 30 -106
8024 -106 215 -6 241 -81 -36 152 62 -202 -57 132 -162 79 -199 19 30 31 406 195 -50 -2 28 161
8046A61m16M04l6M0Ok53NJ64k14l1L46k31J41p8lj96K01nJ8K1r5J97j28k15O1
8071a36N2J58r2K40l20n3K65k39L15j40j36K69l3J94j42k79J53j39J40j6jn1k45
8094b36M16m27k2K24J86r7k29L09P0j00m5j16K30j27k5k48K74k75L77j71j98j43
8116c73N31l3l6j0j51%K14k14J85j93j17J52K5Q5n1Q0k04J12l47K36J56J57l55
8139a51J8Q6K51l2k72L68k04j41K21k84K49j84R5k06L61k7k26j11K9M3K26l30
8161b21L2K10q4p2K10j56K40k73PJ93j31L16j13k54M11k29j16l0pj87j21L82j1
8184dJ21k22q1J03O5j12J34
$$ plain form
8046 161 -255 149 113 153 159 -94 -89 75 -139 -170 176 -55 86 8 5 -191 10 5 23 44 -51 146 18 -197 -136
8071 -136 -84 74 -18 222 -98 -151 114 -125 190 50 -86 183 150 344 202 -77 76 -63 77 61 60 9 -236
8094 -236 180 -247 -269 -45 141 44 -185 124 194 94 49 -67 163 36 11 -237 37 -238 139 -32 -230 -373
8116 -373 158 125 89 79 -72 -72 142 -72 113 -80 -197 -45 -20 65 14 94 -110 2 -345 -109 47 204 -151
8139 -151 -133 -47 204 172 -100 268 64 -77 144 -140 109 -75 20 -186 175 148 -78 -189 -160 -117 109 -221
8161 -221 -189 21 -63 -135 75 -81 159 -114 -107 86 -45 271 158 -96 315 86 -30 -60 -67 -254 -375 7 -4
8184 -4 117 -105 -186 -83 -18 -130 4
8191D
$$ Imaginary data points
##PAGE= N=2
##DATA TABLE= (X++(I..I)), XYDATA
0@%%%%%%%%%qJ6j6J7k5L8m6N6p2Q8j04J26j50J76k09K48k90L37l91M50n20N98
31C19o81P75q78R93j121J260j416J585j769J971k190K429k694K983l298L641m016
48b107M427m878N374n918O523p195P945q789R743j0833J2093j3570J5328j7461
62i318K0114k3523K8089l4553M4486o1877J01137l53812K4464N00615l31519k22586
74c18283K17615L35860j23710j89212k180J02157J0561P7834K7190j36875j60130
85a59173J12979J65419q9501k20271M9737J98332O129j60582l1957O7468J7593
96d3827J1998R5521K2230q4533K0654J45326j9396j89314m8896J47313O2867q5084
108C4859l1512M7499k2200m8324K1355m152p8125O471J29644L8387j28180n4381
$$ plain form
0 0 0 0 0 0 0 0 0 0 0 -8 8 -8 9 -16 22 -24 32 -40 48 -56 70 -80 96 -113 135 -155 182 -209 241 -279 319
31 319 -362 413 -465 528 -593 667 -749 836 -933 1038 -1152 1277 -1417 1566 -1732 1909 -2107
48 -2107 2320 -2558 2816 -3102 3421 -3774 4171 -4618 5125 -5708 6385 -7185 8143 -9318
62 -9318 10796 -12727 15362 -19191 25295 -36582 64555 -289257 -264793 235822 -95697 -318283
74 -318283 -100668 235192 111482 -77730 -79910 22247 32808 110642 137832 957 -159173
85 -159173 -46194 119225 29724 -190547 -140810 57522 63651 -96931 -128888 -61420 -43827
96 -43827 -31829 63692 85922 1389 22043 167369 147973 -41341 -90237 57076 119943 34859
108 34859 3347 50846 28646 -19678 1677 -2475 -80600 -74129 55515 93902 -34278 -88659
120h8659J27722P2561r2883k7268J34317M9451j44695q6759Q8107J6073j44540
131i6573l2215J57841P0944j12546o5317P1924K9394o5897j1339N2778P02j7982
143a8286L9828J5422p1701l7810Q4585P8722m4807n9194K9680K8554n6145o3506
155g4658L993K0519m503K8301N7035k3203p8509J5159Q9064k503q2785J2530J07414
168F7854K1851q1040l6321K8107M818j0687J5157K039l5068r024L5596r719o7526
181g3963n339Q5590N4325l5574l2486L2186J9625n1505l6731L6664L1834k0253
193D373o447L6879L475n4157k0936M2800K1627k5190j1200J1292m500j5143m229
206b1356k923j002L3162N0384j793m5516j2641K5185l934m1338j4404M1630L2166
$$ plain form
120 -88659 39063 111624 18741 -8527 125790 175241 30546 -56213 31894 47967 -96573
131 -96573 -128788 29053 99997 -12549 -77866 -5942 23452 -42445 -53784 -1006 -304 -18286
143 -18286 21542 36964 -34737 -72547 12038 90760 45953 -13241 16439 44993 -11152 -74658
155 -74658 -70665 -50146 -54649 -26348 30687 7484 -71025 -55866 33198 30695 -52090 -39560 67854
168 67854 89705 8665 -27656 451 5269 -5418 9739 11778 -23290 -32314 3282 -6437 -73963
181 -73963 -79302 6288 60613 25039 -7447 24739 44364 -7141 -43872 -7208 24626 4373
193 4373 -2074 34805 38280 -15877 -36813 5987 27614 2424 -8776 2516 -1984 -17127 -21356
206 -21356 -24279 -25281 7881 58265 56472 10956 -1685 23500 19566 -21772 -36176 5454 37620
219C7620k1757k7041P072Q335j3551k760K4250J0072k0114k644J4783j6556l0907
232c3198J0602L6156J0507j1104J402K450j9485j3913O510K36n227J7102K4807
245B6845o373l2870j3110J9199R150j9228o637K4734J8560j8774k5119O552J7174
258A03p7L434J4571p19j1588k650l673k0465j0050K4572K2421j0384r599J1292
272G188K183j8341j1169J1333J4328n70j010N936k761j3432m556J1597J1344n227
286F843m545J1000J57k2369j3609R812J0203j71M394J0448k794r908J05l175j2824
301a6433M158J9502L844j3960m184R666o69j4005m55J6624R048o571r946k17K204
316a394p872m591J2142J1066k272j978K446n035j2644p19J0764M45l939R423O697
$$ plain form
219 37620 15863 -11178 -4106 4229 -9322 -12082 12168 22240 2126 -518 14265 -2291 -33198
232 -33198 -22596 13560 24067 12963 14365 16815 -2670 -16583 -10073 -9837 -15064 2038 26845
245 26845 20472 -12398 -25508 -6309 2841 -16387 -23024 1710 20270 1496 -23623 -17071 103
258 103 26 3460 18031 17312 5724 3074 -599 -21064 -31114 -6542 15879 5495 -4104 7188
272 7188 9371 -8970 -20139 -8806 5522 4952 3942 9878 7117 -6315 -10871 726 12070 6843
286 6843 2298 13298 13455 -8914 -22523 -12711 -2508 -2679 1715 12163 9369 -539 -434 -3609 -16433
301 -16433 -12275 7227 11071 -2889 -7073 2593 1924 -12081 -12536 4088 13136 6565 -3381 -3598 -1394
316 -1394 -9266 -13857 -1715 9351 7079 5101 7547 2512 -10132 -10851 -87 358 -3581 5842 12539
331A2539r027p097N128M192k909K023Q384p10r477l915K92q01K33K507N265M168
347A0795m906o574l018p22p62L428O996K389l236K528N094q859q768P970P637
362I992o716p343K378J061q568m856N408K907J150M573K212j116k202k244J061
377b303L105J405P20K17L25l451n417q97K68l187J360N752k562n627J065M087
393e140L70k26L861K139n38M713L103p459m638O156M811l448p169k244K105j8
409c622m106o356j875Q372Q308j0k053J041N332R093K262r484o405P061P338r617
425E279j5616j41Q852R24l947l025N08P398P983P9n260l07P287N982k053n479
441H464l815J160P270r06j1824o177N406N510l172p864k049N631P534M67p082
$$ plain form
331 12539 3512 -3585 1543 5735 2826 4849 13233 12523 3046 -869 -577 -1378 -1145 1362 6627 10795
347 10795 5889 -685 -3703 -4425 -5187 -1759 5237 7626 4390 6918 12012 3153 -5615 2355 9992
362 9992 3276 -4067 -1689 -628 -9196 -14052 -8644 -5737 -4587 -14 2198 1082 -1120 -3364 -2303
377 -2303 802 2207 2927 3144 3469 18 -5399 -6296 -6028 -9215 -7855 -2103 -4665 -10292 -9227 -5140
393 -5140 -4770 -4996 -1135 1004 466 5179 8282 823 -3815 2341 7152 3704 -3465 -5709 -3604 -3622
409 -3622 -7728 -14084 -15959 -7587 721 711 -1342 -301 5031 14124 16386 6902 497 7558 14896 5279
425 5279 -10337 -10478 -1626 -702 -4649 -7674 -7166 232 8215 8294 3034 2727 10014 15996 13943 8464
441 8464 4649 5809 13079 12173 349 -5828 -422 5088 1916 -5948 -7997 -2366 5168 5635 -1447
456a447j188J0136M725m199p84K843k821m399L13j81p311p474K236L503k341n240
472a3629m218K759R223M792j816l31L963O050K889m658j0256o929P959R530j1118
487e790j9279J183J7155O685j2602j1023J1549K0846L725j5702j1424J0435J5093
500A0851n168j1999J132Q398M934N29l282o833l363Q548J0159n791j5385l205
514a0475J2190Q310j1519j4454R016K3809M900j4174m857J1904O753p081n317
527I005J062k311k333J800m165j0390n966O522J0266p80p529J238J0716L799r653
542A281o715J0222Q669p199n033O812N07j2190o858Q877O141r730r623N575Q269
557i95m713j3395k928J3980J0480l262k393N514L671k103K43J360n537m475Q016
$$ plain form
456 -1447 -2635 7501 12226 8027 7243 10086 7265 2866 3179 2998 -4313 -11787 -9551 -6048 -8389 -13629
472 -13629 -17847 -15088 -5865 -1073 -2889 -3220 743 6793 9682 5024 -5232 -12161 -4202 5328 -5790
487 -5790 -25069 -23886 -6731 -46 -12648 -23671 -12122 8724 12449 -3253 -14677 -4242 10851
500 10851 5683 -6316 -5184 3214 8148 8677 5395 -1438 -4801 3747 13906 8115 -7270 -10475
514 -10475 1715 10025 -1494 -15948 -6932 16877 21777 7603 2746 14650 21403 14322 9005
527 9005 10067 7756 5423 7223 3058 -7332 -13298 -6776 3490 2710 -4819 -3581 7135 10934 1281
542 1281 -5434 4788 13457 6258 1225 8037 8544 -3646 -10504 -1627 4514 -5216 -14839 -9264 -995
557 -995 -5708 -19103 -22031 -8051 2429 -833 -3226 2288 5959 3856 4099 5459 -78 -4553 3463
572C463N565j3391j6025J542J2918L817q690l802J1060J2804n03j1976m570J0014
586B226Q430q33m591m354j286M444J512q344q748N509J4742K369j2001p765L523
601e167Q177J356q538l939J0501J0133m292j1687j997P533N356j08j121j974j8
616D215K737k429q455m980M097P434J964n658m390K209N752l24o127J411J0124
631G580L426n871m360j100p5k81O39J618J493J548j074o203k081K602j699k424
647f262M229N173k229o333j851M521K755o06K11M077M958o77q081l654K038M93
663a238m28N51J3j701r26k42l089l430N300Q324K14k957J549J218l092k793K782
680E5L731Qo16M56j239l290m606r68M913L589k484j428K037N78l298k231K352
$$ plain form
572 3463 9028 -4363 -20388 -18846 -5928 -2111 -10801 -14603 -3543 9261 8758 -3218 -7788 2226
586 2226 10656 9823 5232 878 -408 4036 5548 -2796 -11544 -6035 8707 11076 -925 -8690 -5167
601 -5167 3010 4366 -4172 -8111 2390 12523 8231 -3456 -5453 2080 7436 7328 6207 4233 4215
616 4215 6952 4523 -3932 -8912 -4815 2619 4583 -1075 -5465 -3256 2496 2172 -3955 -2544 7580
631 7580 11006 5135 775 -325 -400 -681 -42 1576 3069 4617 3543 -2660 -4741 -2139 -3838 -6262
647 -6262 -2033 3140 911 -5422 -7273 -2752 3 -603 -392 3685 8643 7966 -115 -3769 -1731 -1238
663 -1238 -1666 -1115 -1102 -2803 -3729 -3971 -7060 -10490 -5190 3134 3348 391 1940 3158 66 -2727 55
680 55 3786 3794 3178 3634 2395 -895 -5501 -6469 -1556 2033 -451 -1879 158 736 -2562 -4793 -2441
697b441L954L262K537j892l620K78J227l755j771M423K704k113m284p70n33k620
713e414P48L536K543J405j86j942l97q55n54M23K476K771k17j891k722k751p49
730c776L174m04k112L906L856l885o263K19N124M01j218K824K709j431j944k148
746i68j385J416J561J445Q77n93j391k058l92j39l59K030L835O5k432q27j510
763h25j561R13J770O1l75K621m97n040k408L967K404j204Q83K660N96k426k957
780a418o63O10J352N09k1j00j103k959j218J207j2J145L011J793j906j192J116
797A51l05j804K068M007q45j944q7j146k826j049J9J100J408J399j167k261O34
814b648J479m53M01L618K241N88j172k613m01O91K7j421l58K640r45m390j068
$$ plain form
697 -2441 1513 4775 7312 5420 1800 2078 3305 -450 -2221 2202 4906 2793 -1491 -2261 -2794 -5414
713 -5414 -4666 -1130 1413 2818 2632 690 293 -562 -1116 -693 1783 4554 4337 2446 -276 -3027 -3776
730 -3776 -602 -1006 -3118 788 4644 759 -5504 -5285 -161 240 -978 1846 4555 3124 1180 -968
746 -968 -2353 -937 624 2069 2946 2353 962 -1096 -1488 -1627 -1986 44 3879 3944 1512 685 -825
763 -825 -2386 -1473 297 358 -17 2604 2107 -2933 -5341 -1374 1030 -174 709 3369 3965 1539 -1418
780 -1418 -2081 -1471 -119 390 369 269 -834 -3793 -5011 -3804 -3816 -2671 340 2133 227 -965 151
797 151 -154 -1958 110 4117 3272 1328 1241 95 -2731 -3780 -3761 -2661 -1253 146 -1021 -3282 -2648
814 -2648 -1169 -1622 -1221 2397 4638 5226 4054 1441 1040 1731 1758 337 -21 2619 1674 -2716 -3784
831c784J479o45j9K246J870J087o65k6l39l96J020J119O21J368m35k652r24l60
849E65j639q25J228J883j302k214l11O6l16J500J170L45L342J678j695k084O90
866B081J333r81j069P31o05j612p04k321k182O65J689R22O3K12j03j3J145Q91
884A42j435J390L689r4k390r31j16j353n83m17l95q01J28Q52j966j224Q47J013
902c644J532K889N0n78J278R82n81j421M99J513l33J99j212l028j096K063o4j083
920b035P70J651O51j07K98k17n45J649K434m83j349J19n1Q26r57k248q94K504
938B016J864j049l247l72J571n55k69j61j235J509K483j348k691r62L115K053
954B722p83j168o4r7J603q92l516j150K302J552j192k855l78R92N68n51j311R39
$$ plain form
831 -3784 -2305 -2950 -2969 -723 1147 2234 1569 1543 1204 808 1828 2947 3568 4936 4501 1849 925 565
849 565 -1074 -1899 -671 1212 -90 -2304 -2615 -2549 -2865 -1365 -195 150 3492 5170 3475 1391 2081
866 2081 3414 2433 1364 2095 1490 -122 -826 -3147 -5329 -4664 -2975 -2053 -1990 -1778 -1881 -1894 -749 142
884 142 -1293 97 3786 3692 1302 371 255 -1098 -1681 -2098 -2493 -3294 -3166 -2314 -4280 -5504 -4657 -3644
902 -3644 -2112 777 827 249 1527 2509 1928 507 1006 2519 2186 2385 1173 -1855 -2951 -888 -952 -2035
920 -2035 -1265 386 1037 930 1228 1011 466 2115 4549 4066 2717 2836 2785 3611 2654 406 -488 2016
938 2016 3880 2831 -416 -788 783 228 -41 -202 -1437 72 2555 1207 -1484 -2446 669 2722
954 2722 1939 771 707 610 2213 1321 -2195 -3345 -1043 509 -683 -3538 -3916 -2924 -2356 -2907 -4218 -3279
972c279L127P52j715N88Q70j233M41K474M72l209p57L187n31m656j077K530R02
989a114j058q68J112J040k79n88K296J667m18m60K296J981l370l487K246K324
1005C320k778k088Q08J431j337j328N95K84m07J796J496J70j01j213j47K378N99
1022C478k809q45K901K624m027m541J231L499q05k535j590K423K437k158k075
1037b792J487J785k04L14J899R2l379P53L627j785m840Q89M842J48n373j817L445
1054i09J434k877p01J970K355r34j608J052J534j403n59J943J003j792j118J111
1070E01K47k066m72J580n08j80P34k28j266K09J285p7o17J350J148j264m79J234
1088A131l38j167k70J471O21r32j876M30J478r01j248K56K314K03j762O13Q80
$$ plain form
972 -3279 -152 600 -1115 -527 343 -890 -449 2025 2497 -712 -1469 1718 1187 -3469 -4546 -2016 -1114
989 -1114 -2172 -3040 -1928 -888 -1167 -1755 541 2208 1790 1330 3626 5607 2237 -1250 996 3320
1005 3320 542 -1546 -738 693 -644 -1972 -1377 -1093 -1500 296 1792 1962 1861 648 501 2879 3478
1022 3478 669 -176 2725 5349 1322 -3219 -1988 1511 706 -1829 -3419 -996 1441 -717 -2792
1037 -2792 -1305 480 276 590 2489 2581 -798 -45 3582 1797 -3043 -2154 2688 2836 -2537 -4354 -909
1054 -909 525 -2352 -3053 -1083 1272 338 -1270 -218 1316 -87 -646 1297 2300 508 -610 501
1070 501 748 -1318 -1790 -210 -718 -898 -164 -392 -1658 -1449 -164 -241 -858 492 1640 376 -103 1131
1088 1131 793 -374 -644 827 1448 516 -1360 -930 548 -353 -1601 -1345 969 1172 -590 23 903
1105I03j854N92J746Nj549m76K145j20k660m61K077J70J43l07r06L32J29j3q48
1124i52m94J113J377o15j185k42M10J538j056o53J570M04j340l41R88m31j386
1141a295M07K507j034k049J204J219j334q29J413J001n30l12J43K11r94R9N17
1158C44M31K51m99K27O16j215j228J503M96r25n78R90Q07j843q64K526m33j317
1176g11J425Q10p75p66J68L88r52l54R55n3j034J08P9k83J47r2O21M84J49p01
1196c87J27k6k48j83Q67Q24j616k30J494j015j432O87Q83l89k91O89k3q58K62
1215h65Q60j96O9O31P34m22l80k15m2M1M61m45K22O3m68r89O44L48r53P77J041
1236I16Rp28K05R20n08p98J911K40j523L33L86n75j668J59L49J24J94n01J79k3
$$ plain form
1105 903 -951 -359 1387 1392 -157 -633 1512 1392 -1268 -1729 348 518 661 354 -552 -220 -91 -104 -952
1124 -952 -1446 -333 1044 429 -756 -998 -588 950 -106 -759 811 1215 -125 -466 522 91 -1295
1141 -1295 -888 1619 585 -1464 -260 959 -375 -1204 209 1210 680 368 511 722 -272 -173 344
1158 344 775 1026 527 754 1370 155 -1073 430 926 1 -577 413 1220 -623 -1487 1039 606 -711
1176 -711 714 1524 749 -17 151 539 -413 -767 188 135 -899 -791 -712 -995 -848 -940 -319 165 314 -387
1196 -387 -260 -286 -534 -717 150 974 -642 -872 622 -393 -1825 -1138 -255 -644 -935 -246 -269 -1127 -865
1215 -865 -5 -201 -132 499 1233 811 431 216 174 215 676 231 453 516 48 -941 -297 51 -902 -125 916
1236 916 925 197 402 1322 814 16 1927 2167 644 977 1363 788 -880 -721 -372 -248 -54 -555 -376 -399
1256c99K92n13j18J580L89q03O74M71j069k73P50M26j389qK16j053q29K81l9o28
1276b042Q03J382n60l28O54P22o27j43J046N73r15O1m77o35l53r05J78J062k6
1295e30p23j41R43k73r59J34K067J52o11M64K77q30j70R7J10L53KL37j343j05
1315g49J7m49p6Q67J66j83M46L5k98j09O22O71J40K72J62q50k57L10q18m36J231
1336G14O74j071j83P20k59j028Q5R79j93k47L59m52l04L6L79K80N36M66J8k63
1356A246p6m77r04K35L81q43K84J94q29r02p7M93oL83J033O79m67mJ9m29k85J041
1378F89j67m65l04l28l44o01L97j48K46P51n7p74L38j37m33O92M29M53K78M26
1398I41J69p48m62R61P5o55J86k2m97q63m54j84j5O51J002K42R8K41Q6J28L26
$$ plain form
1256 -399 -107 -620 -738 842 1231 428 1102 1573 504 231 981 1407 18 10 226 -827 -1656 -1375 -1414 -2042
1276 -2042 -1239 143 -417 -745 -91 631 4 -139 907 1480 565 626 149 -486 -839 -1744 -1566 -504 -530
1295 -530 -1253 -1394 -451 -724 -1683 -1549 518 670 59 523 800 -30 -200 -103 7 360 362 699 -644 -749
1315 -749 -732 -1181 -1257 -390 -224 -407 39 74 -224 -333 289 960 1100 1372 1534 684 427 737 -81 -517 714
1336 714 1388 317 134 854 595 -433 -348 631 438 191 550 98 -206 -170 209 489 1025 1491 1509 1246
1356 1246 1170 693 -211 24 405 -438 -154 40 -789 -1691 -1768 -1275 -1281 -898 135 814 347 343 362 -67 -352 689
1378 689 522 57 -247 -575 -919 -1520 -1123 -1271 -1025 -274 -331 -1105 -767 -904 -1337 -645 -216 237 515 941
1398 941 1110 362 -100 861 936 281 467 445 -52 -915 -1369 -1553 -1568 -917 85 327 425 666 752 880 1206
1419A206J54o99Q25L7p80q25l49L55l61j37R36k23l84J44o9q87J91M63K31J38
1439c4O80l9m98J64O38P2j25O91rl59j012j242n78p7N21p7j55N78Q48p21L68R21
1461E55RM1J159j87p95j116j5n6q9l37K04K23O22m9j184m5J160M4p24L69O03n35
1483a43q49M01O56m05M85R70j9n2k52l80p1k25j54q23R7J50k82q66M66P77K49
1504b70K55J306j04j73N6o84j73k74r7j66P8O10l42j087M06J420n21KM80l28o48
1525b54n52J41k95l51N81O67N8K91J73J37K71k1j28k17K08o02o98m70J01m09j43
1546a512J522L1n48M19R36l87n09J74O43l33l70Kj1m49J93L58K58O88j56m83K06
1567F72k6r86k53K28K90r01K07O48l85j79O57N58K03N75L58k36p51o70J94p59
$$ plain form
1419 1206 1360 661 1486 1523 743 -82 -431 -76 -437 -574 362 139 -245 -101 -170 -1057 -866 -403 -172 -34
1439 -34 646 607 109 273 911 983 858 1549 1540 1181 169 -1073 -1651 -1728 -1207 -1284 -1439 -861 -13 -734 -366 555
1461 555 564 605 1764 1577 782 -334 -349 -405 -494 -831 -627 -404 218 169 -1015 -1060 100 144 -580 -211 392 -143
1483 -143 -992 -591 65 -340 145 1115 1096 1044 792 412 341 116 -38 -861 -764 -614 -896 -1762 -1296 -519 -270
1504 -270 -15 1291 1187 1014 1070 386 213 -61 -158 -324 -246 364 22 -1065 -659 761 240 242 722 394 -254
1525 -254 -806 -665 -960 -1311 -730 -63 -5 286 459 596 867 846 718 501 709 107 -591 -1061 -960 -1369 -1512
1546 -1512 10 41 -507 -88 848 461 -48 126 769 436 66 68 57 -392 -199 159 417 1105 949 466 672
1567 672 646 -340 -593 -365 -75 -976 -769 -121 -506 -685 -28 530 733 1308 1666 1430 679 9 203 -556
1587e56r6N74m7o76J50m03J34M59mO42K81J19l30o63L11o3l84M86Q60k90o75L65
1609A94j17q13k05Q62nm51n7N5m25n31M72K99N65R86L98j25m93j64j55k70K3N77
1631F20k49k89j25r62J82lq5P99R50K29p83k90K34K52p68Q07J057j59q50j0j74
1652C83p60k44N57Q66m05o3J69q53l02j79J17J005O04j93j15j86p65k16J55Q95
1672D70j2J1O85n09j482k92M44j23l5J049K59n48o96K64l78L5P89P42N0o5j21
1693E37o04k47o18N16M27M37K38o14l43n00n89L2J556M03l52M43l4n71j057M31
1713e09R68k66J23O37j41r01o63K2O8L11N69K27J60j62q91o05L98P93j42P05P57
1734A458m90n84p58m30J88M78Q70K76p34r6m20j364M44J095M60K75L98J50q15
$$ plain form
1587 -556 -652 -78 -125 -801 -651 -1054 -920 -461 -465 177 458 577 247 -416 -105 -168 -552 -66 794 504 -171 194
1609 194 77 -736 -941 -79 -84 -535 -592 -537 -962 -1493 -1021 -722 -157 829 1227 1102 609 445 290 20 43 620
1631 620 371 82 -43 -1005 -823 -826 -911 -112 838 1067 284 -6 228 480 -288 519 1576 1417 567 557 383
1652 383 -377 -621 -64 802 397 334 503 -350 -652 -831 -714 291 895 702 587 401 -364 -580 -425 470
1672 470 458 469 1154 645 -837 -1129 -685 -808 -843 206 465 -83 -779 -515 -893 -858 -69 673 723 658 537
1693 537 -67 -314 -932 -416 11 448 686 72 -271 -771 -1360 -1328 228 631 279 722 688 117 -940 -509
1713 -509 459 193 316 953 812 -89 -752 -730 -662 -351 218 445 605 443 -448 -1053 -655 138 -4 701 1458
1734 1458 968 384 -374 -804 -616 -138 732 1008 274 178 -242 -1606 -1162 -67 393 668 1066 1216 401
1753D01p62k31O39K75M12K53j11m59r60j107L88P24K77L61R82j11j204p79P66
1772b46N8K13P83J087o41q77m53o13o38N49R55K92l46L33p10j086m52P06P94R14
1792F22M42n3l43r51m63k9P34P74N18k50J1j361j170n7P20m1J78J162L70p06j121
1813a014J9M92M91R03J059k0k29j083j072l31O0M39L08N30j53q64o33k64j80Q01
1833g41J245N33J91N4o41r20m07P88Q7O19M54Q77j148j303m47l60K78L73M45J46
1853A23l82r68n14l1Q70J133R32R28Q01j216r43k33m72j18K12K37l45r41m77p47
1873b151m23P86J181P81P91M21k57r25l96L8O24K09L24R46j196r61p32l3L29K73
1893c71O14J63r8r84p47o38J44N57R68J041J078l29k6l44l5k48L60L90l48m75
$$ plain form
1753 401 -361 -592 47 322 734 987 876 417 -543 -1650 -1262 -538 -261 100 1082 971 -233 -1012 -246
1772 -246 -188 25 808 1895 1254 377 -76 -689 -1327 -778 177 469 123 456 -254 -1340 -1792 -1086 -292 622
1792 622 1064 1011 668 -283 -746 -775 -41 733 1251 1001 1012 -349 -1519 -1576 -856 -897 -719 443 813 107 -1014
1813 -1014 -995 -503 -12 891 1950 1930 1701 618 -454 -785 -725 -286 22 552 399 -465 -1098 -1362 -1542 -741
1833 -741 504 1037 1228 1282 641 -279 -686 102 189 808 1262 2139 991 -312 -759 -1119 -841 -468 -23 123
1853 123 -259 -1227 -1741 -1772 -902 231 1163 2091 2892 1676 733 500 28 -90 122 359 14 -927 -1404 -2151
1873 -2151 -2574 -1788 -607 174 965 1386 1129 204 -192 -154 470 679 1003 1949 753 -208 -940 -973 -644 -371
1893 -371 243 406 308 -676 -1423 -2061 -1917 -1360 -392 649 1727 1398 1372 1028 993 745 1105 1495 1147 672
1913F72j218j260o95q2O32Q91J083Q37o0m11J3r9J6O74O94k70n93n7j398m27N3
1934a005L83L07Q45J14j07j184m52n85J57K51J045M93K92J65n55J25K62O56M14
1953A621N88l72n68j250j374j73q71K01J176O14j26K45K02k56K49N35R57L22l7
1972A683j83r27j328L4m06N00N83M42m1r4o56m28l08M53N15QL54j25j79q22N27
1993c98L16Q38J120N7l85j57p57r09r90p6P53k92L3L9l26k81N60K36Q07J097K98
2014A583j81l96o56m93m87K78M67j9J6J57l30o29j52L78L79J03K67L5n06k37m49
2035h72j70P04R22M88K41m8l68m96n41J18j3L3Q6Q1p34m02n4k24P47N89M46J89
2057G22J67j12k25o21J71K31j04Nl8k50k40l65m36M24N68L13K19k69J23n24m90
$$ plain form
1913 672 -546 -1806 -2501 -2583 -1951 -1060 23 860 800 389 402 303 319 993 1687 1417 824 767 -631 -1058 -1005
1934 -1005 -622 -315 530 644 537 -647 -1099 -1684 -1527 -1276 -231 262 554 719 164 289 551 1207 1621
1953 1621 2209 1837 1269 19 -1355 -1528 -2399 -2198 -1022 -408 -534 -289 -87 -343 -94 441 1398 1720 1683
1972 1683 1500 573 -755 -721 -1127 -627 -44 398 357 263 -393 -821 -1129 -676 -161 -153 201 76 -103 -925 -398
1993 -398 -82 756 1876 1933 1548 1391 634 -275 -1265 -1341 -588 -880 -847 -808 -1134 -1415 -855 -619 188 1285 1583
2014 1583 1402 1006 350 -143 -630 -352 115 96 112 269 -61 -690 -842 -464 -85 18 285 320 -186 -423 -872
2035 -872 -1042 -338 584 1072 1313 1265 897 401 -140 -22 -35 -2 84 165 -569 -971 -1025 -1249 -502 87 533 722
2057 722 889 777 552 -69 102 333 229 234 196 -54 -294 -659 -1095 -671 -103 210 429 160 283 -241 -731
2078g31L40K08L44J22K91j86k41k95M98j19M7J24j06K09m82n06n87R5P9Q10J44
2099E8J76j09k90k43M99j27J37M20k3J10k92k14o52J76n1M06M0J09J8l59k12L58
2121f5p4L0M84o2o7k70p2l36J65J77M87p8K9J0n05lM74n33M16J50q6l37m7j53
2145b66q8j11m2O89j10J06R7j57K01m47K05R3J23k42J82j68k29L35n69j0O26m43
2167b25K35J75j75k35j31J24N1q6J00M23l29L06Q5Qm43M82j03K6l35J0j63l91
2189e91O2L53k51K51l1k12M14K50n6j41M28k12M3k84J10L00l35l10L72m17Q8n8
2211b27R4L1L46l1l48Q2J55k67k2K97j50R6Q1q0n0J72k02J26K93k14l9m34p3K27
2235a37m62K50K71L62k29k49N98k35J2j32K20J0l05K27j71j90M6m03N0O6N83J04
$$ plain form
2078 -731 -391 -183 161 283 574 388 147 -148 350 231 278 402 296 505 23 -483 -1070 -975 -896 -86 58
2099 58 234 125 -165 -408 91 -36 101 521 498 608 316 102 -550 -374 -425 -19 21 130 148 -211 -423 -65
2121 -65 -139 -109 375 313 246 -24 -96 -432 -267 -90 397 319 348 358 -147 -150 324 -209 207 357 271 -66 -113 -266
2145 -266 -354 -465 -507 182 72 178 275 118 319 -128 77 170 293 51 233 65 -164 171 -398 -408 218 -225
2167 -225 10 185 10 -225 -356 -232 -181 -267 -167 256 -73 233 318 326 -117 365 262 288 -47 -37 -200 -591
2189 -591 -529 -176 -427 -176 -207 -419 -5 245 189 48 476 264 307 23 133 433 98 -212 160 -257 -169 -227
2211 -227 -133 -102 244 213 -135 -53 102 -165 -187 110 -40 56 137 57 7 179 -23 103 396 182 143 -291 -364 -137
2235 -137 -599 -349 -78 284 55 -194 404 169 181 49 269 279 -26 201 30 -160 -114 -517 -467 -401 182 286
2257B86q9l22J25K6q2q3K51K29o9K8m29l8k66K0L53K43M1m30J20r9j72J28L0L78
2281A79J04l7k18M23q24L69j11q9L82J53m33O1k29k87K12R0M15k2p3j67k76J51
2303b27J17J85K98L10K12l08m40j22l83J31J02Q0J92l15j74J09m89R2O60o0R93
2324I63j31M1l26m40J56l67J25J87J56o69M21m28l46J58K18l7O23L7J61j93q71
2345e62M22j58J57N24M01Jj1l46l55j20j50K19J27k82o7l69m00m66N74L94O75
2366B08M73P0P4j3j89l38J92j2J94m94k16k58r91R6K56J37O98L76J42j26l80N1
2388e0j10J69M10L12M0l33l8m72Q2r7O8K01K12k42n39k45m40m74K38P92M08M79
2410C71J70k8O4j17J1O34j18N8k91o48m27m35k81j91M68L59N50o13N44k74j20
$$ plain form
2257 286 197 -125 0 26 -56 -139 112 341 272 300 -129 -167 -433 -413 -60 183 224 -206 -86 -185 -357 -229 -199 179
2281 179 283 246 28 451 -373 -4 -115 -204 178 331 -102 -41 -270 -557 -345 -255 160 138 65 -102 -378 -227
2303 -227 -110 75 373 683 895 587 147 25 -358 -227 -125 -45 147 -168 -342 -233 -722 -630 30 -30 963
2324 963 832 873 547 107 263 -104 21 208 364 -305 116 -312 -658 -500 -282 -319 304 341 502 309 -562
2345 -562 -140 -298 -141 383 784 785 774 428 73 -47 -197 22 149 -133 -200 -569 -969 -1435 -861 -467 208
2366 208 681 751 825 812 623 285 477 465 659 165 -51 -309 -1300 -1204 -948 -811 -113 263 405 279 -101 -50
2388 -50 -160 9 419 731 771 438 400 -72 10 -87 -19 182 394 152 -387 -632 -1072 -1546 -1308 -516 -108 371
2410 371 541 513 577 460 471 1105 987 1045 754 106 -321 -756 -1037 -1228 -760 -401 149 -464 80 -194 -314
2431c14l8M08M72K36K22q7n35m03k43L49K98J37J97m10n41m32o20J09K61L51L99
2452a84K10J29j30j44K76M86K47P10j90m72k63p40q11j67K68l6M02J22k89l39
2472i15J0L23L98K84P47L04m20j48m15M1k82M42j81M33j91q9o74o15O2K44j23
2493g65O56k13L43l98j08n2P36L10L62M83L3l17n90l19j45k54k78L05j1j75m96
2514h93m0R2r7L55R02J39M80L8p51k16K86q0K35J7K63m38o19l29J81k80L5K26
2536d94M22p0R0l15j52PL41M65R0O68J98q56l01K73l97N7L4Q5j06n23n74L13j12
2559h57J5M15L04P46j2j73k18K51l22L09J90J15j24o46k16j16l01K44M8l8L77
2580iK12m76k17J8J91M3N83J67K91l38J52k66m41l4K93J73q6Q5n33m59P1J48l18
$$ plain form
2431 -314 -352 56 528 764 986 899 364 -39 -282 67 365 502 699 289 -252 -684 -1304 -1195 -934 -583 -184
2452 -184 26 155 25 -119 157 643 890 1600 1410 938 675 -65 -876 -1043 -775 -811 -409 -287 -576 -915
2472 -915 -905 -582 -184 100 847 1151 731 583 168 209 -73 369 188 621 430 341 -333 -948 -886 -642 -765
2493 -765 -109 -322 21 -377 -485 -537 199 509 871 1354 1387 1070 480 161 16 -238 -516 -211 -222 -397 -893
2514 -893 -933 -841 -938 -583 319 458 938 976 225 9 295 215 450 467 730 292 -327 -656 -475 -755 -720 -494
2536 -494 -72 -142 -52 -367 -519 -512 -171 294 384 1052 1250 394 93 366 -31 26 60 145 39 -484 -1058 -745 -857
2559 -857 -842 -427 -123 623 611 438 220 471 149 458 648 763 639 -7 -223 -339 -640 -396 -348 -386 -9
2580 -9 203 -273 -490 -472 -281 -238 345 512 803 465 617 351 -90 -124 169 342 256 341 -192 -651 -580 -432 -750
2603g50L30M03L22j69k8J13m32L61M2K99q8P8m71k38m3j26o6J02N80l46oQ6m57
2626e04K68k2L73J4M71k9j56j67k42K64n88J51N45l45J25j02l95j14j6L27p3L94
2648A79K9n4m58R5J80rL60P8k13J14P9n87j49L35l44N33Q5k13N3P7n18K95O7J89
2672B03J83O2N3l89k84MK54q0L10k07P2n8l85N7j46K09O8K92L00l76n5l6k0J71
2696B02l63M93o9p2o6k16jj06j99M20m32O28L8l45J5Nj87K48M09J13o3k71j14
2719F7k30r1K9L34l72J73M9j46j83J65k18lL74N9N8P3j04R9j55O9J80o4L60j74
2743C49k32l73p2K15k54M3O6L58k05q0K24l64J99j84M58M22k09L7n06J84O2m68
2765c30J37J84m9j99k23L63k51J19j00K50k02J08L17j66RK56k1m5J38j01K17l09
$$ plain form
2603 -750 -420 -17 305 136 108 221 -211 150 192 491 403 481 10 -228 -271 -397 -463 -361 219 -127 -133 -47 -504
2626 -504 -236 -258 115 129 600 571 415 248 6 270 -318 -167 378 33 158 56 -339 -453 -469 -142 -215 179
2648 179 208 154 -304 -209 -29 -38 322 400 187 301 380 -207 -356 -21 -365 168 253 40 93 170 -348 -53 14 203
2672 203 386 448 501 112 -172 -168 86 6 316 109 181 123 -262 -205 -351 -142 -74 218 518 142 87 51 31 202
2696 202 -161 332 263 191 125 -91 -92 -198 -397 23 -409 219 257 -88 -73 -68 -255 -7 402 515 452 181 67
2719 67 -163 -254 -225 109 -263 -90 -41 -187 -370 -205 -423 -426 -52 7 65 138 34 133 -22 47 227 163 523 349
2743 349 117 -256 -328 -113 -367 -324 -258 100 -105 -185 39 -325 -126 -310 148 570 361 398 -108 76 138 -330
2765 -330 -193 -9 -58 -257 -480 -117 -368 -249 -349 -99 -301 -193 124 -42 -33 223 202 157 295 194 411 102
2787A02l15Q8P2k22J16k84N38k52m33L06N1K29P9J26K34Nj00o5P6m09j8J3Q9k85
2811b59m9Q2j42MK10j93M95k83J20J15n7J31j48P1q4J77P2j94J02j32J7l3J28
2834A50k63L33l55j93K26j05lL4K69J71j65N01n8j96k35K63j66k07K39j16j76
2855e2l06K56l45J98o6L78j40J19N2l6j54K26L1j72J39J05j44M0K7K6j35pl0j11
2879a01J53j5j51l05K76p6m1J17J30J02K19n0J5J3rr6jk95K7p1k88K35r0J77r1
2904b16L16P5l1q7M0kK2k06R7j10K08M6r7M2J71Q0n16N7L14m10J61k6p7J01qk71
2930c27J84k47L67L30k49PK3j49OM87k93m3l49K62j67j14J86k0J49q9J20J03j77
2953@j84J15rJ04nj92L49j43K5k21J79J90p8J87r8k43n8M6j40j84J99j88L15k66
$$ plain form
2787 102 -213 -125 -53 -275 -159 -443 95 -157 -590 -284 -233 -4 75 201 435 440 340 275 351 -58 -76 -63 26 -259
2811 -259 -308 -226 -368 -364 -154 -347 148 -135 -15 100 43 174 26 97 13 190 262 68 170 38 55 22 150
2834 150 -113 220 -135 -328 -102 -207 -210 -176 93 264 99 600 542 346 111 374 208 1 240 124 -52
2855 -52 -358 -102 -447 -249 -315 63 -77 42 94 58 -96 130 161 -11 128 233 89 129 156 182 47 40 10 -101
2879 -101 52 37 -114 -419 -143 -219 -260 -143 -13 89 308 258 273 286 277 181 180 -115 -88 -159 -447 -212 -302 -125 -216
2904 -216 100 175 144 57 97 95 117 -89 8 -102 106 152 55 97 268 348 -168 -111 203 -207 -46 -72 -149 -48 -56 -327
2930 -327 -143 -390 -23 307 58 65 88 -61 -55 432 139 96 -253 9 -158 -272 -86 -106 43 -46 74 177 0
2953 0 -184 -69 -78 26 21 -171 178 35 60 -161 18 208 130 317 219 -24 -82 -36 -176 -360 -161 -349 -34 -300
2977c00K19p2j47K56K34l07O8J25J35k32M3k4K8m4L80l79J72J57l65J00p5j37
2999a65J34q9j35R8J3j51J4M87j95K79k82L0L99n29K64k46K43l13j26J26j38P2
3021b10k51M53j6J9L3j16J91oJ64j08M5l1O7l46j54L56J57l42j26K59j03j69L68
3044A34k62J77l18L0K93ro8j00J64K37M6j86k4M01j44p18K32j0k72K64k1jk16
3067c71J78O1R9O8J96l18M90j20k23j55K64q8J8k10J84l9l3pj21k1K72m37jqJ94
3092a28R7L1J55j07J84J61L1k98M4q4J65l0j75n3j41r1n9j62L19O9J08Kj5K58
3116B81j05j70J70L43l09j03n6P5r9J32l33J75k55L04k35j21j7P0L12m03J20L6
3138a88K10M0K19r3l3J89j04M5k50p2j17K3K76k29l07O0L19l20L50J8J65m0j0
$$ plain form
2977 -300 -81 -153 -300 -44 190 -117 -49 76 211 -21 22 -2 26 -18 362 -17 155 312 -53 47 -28 -165
2999 -165 -31 -120 -255 -157 -144 -295 -281 206 11 290 8 38 437 -92 172 -74 169 -144 -270 -144 -282 -210
3021 -210 -461 -8 -24 -5 28 -88 103 97 261 153 198 167 234 -112 -266 90 247 -95 -221 38 -65 -234 134
3044 134 -128 49 -269 -239 54 45 -23 -123 41 278 324 138 114 515 371 -347 -115 -125 -397 -133 -154 -155 -371
3067 -371 -193 -132 -33 35 231 -87 403 283 60 -95 169 81 99 -111 73 34 1 -6 -127 -148 124 -313 -314 -322 -128
3092 -128 -31 0 155 48 232 393 424 126 170 86 251 221 46 -7 -148 -239 -298 -460 -141 -72 36 38 23 281
3116 281 176 6 176 519 210 107 51 126 27 159 -174 1 -254 50 -185 -306 -323 -253 59 -344 -224 -188
3138 -188 22 62 281 188 155 344 240 285 35 -37 -154 -131 145 -84 -391 -331 -12 -332 18 36 201 161 151
3161A51o2J48k58K07k07K62n27L28j57j45L43k23K36o5r4J06K2j04q4j52J94K5
3183e6Kk2J75M1L1k40J51r9P0j70o7Pj7q4M28k80l4L62j85m8O4j40K47J43k32
3208D7L94M3n81K8k24L34k00K51r2J87j59j24J93K1K9k61L17j1k33P1M1pj56M9
3232d3q8N03j92q4j39k08O4j69l8Q8J62P7L42l31q8P1J78O3j39J90r3k55L6Kk28
3257c19L83J01J05l17K18M9k10Q5m0j72K67Jj85K1O2j71K84j12n1l8J33k51j16
3280b73q6J63j99J13L26J2k95j72J98K39K5K2J18mR8p0k05k51J77k00R8K95j73
3303d4J6J36p9k06LM10K0J54k23q2L4r6J2k2K3j90J47J55k34J71K04m59J55j55
3327a50K30j33O1o7j67l8J84K98J14k14R8j25L0K70l31l29q3K73J14J93l46j37
$$ plain form
3161 151 89 237 -21 186 -21 241 -286 42 -115 -260 83 -140 96 31 -63 43 65 -39 -123 -275 -81 -56
3183 -56 -54 -76 99 140 171 -69 82 -17 53 -117 -184 -177 -194 -278 150 -130 -164 198 13 -35 29 -111 136 279 47
3208 47 441 484 -97 -69 -293 41 -159 92 0 187 28 -96 97 118 147 -114 203 192 -41 30 71 64 -92 -43
3232 -43 -131 372 180 96 -43 -251 -187 -356 -394 -306 -144 -67 275 -56 -144 -73 105 168 29 219 126 -129 -93 -91 -319
3257 -319 64 165 270 -47 171 220 10 95 55 -117 150 151 -34 -13 49 -122 162 50 -1 -39 94 -157 -273
3280 -273 -359 -196 -395 -282 44 56 -239 -411 -213 26 51 73 191 187 285 215 10 -241 -64 -264 -166 129 -44
3303 -44 -28 108 29 -177 -174 236 256 410 187 105 139 43 55 33 56 -134 13 168 -66 105 309 -150 5 -150
3327 -150 80 -53 8 -59 -226 -264 -80 218 332 118 216 91 121 391 60 -269 -352 -79 35 228 -118 -255
3349b55K44r9K61lK78O4l28J0l33R9P6j70j66L40k12J7L40o27M5L12K34j40j03
3372a16j8J33k83K61M3j43K51k4K1j51L22m40j16L43N9k85K09m93K65k53L75N5
3394A5M6J36rk3J16k12J89J23k86j60j24L60o06L01M5N6M6L4j02Q8PJ84j19k67
3418a62P6j25L04j11L40r3o9k67P8p1J42P4k29K63m30k41N59k17M7L89j50K7N0
3441A84l5j42J58J96j97m07N03m80P2j06j03L03J77k6K62m30J11o3j07L58k11
3462A7J10k22P3K0Q7m56L17j80L39L0p3l9j98q1O2J20K51k57P8J0L1j91J71j26
3486a07p5K39O9l09M27k65j16mq5J71K02j27j50J60j55O4r2L04j34Q6j47J21k83
3509b06k6M4J48J26lj84Q4k19K36r4K39j99J58k12J88L1l20L0K19K48k73J43k08
$$ plain form
3349 -255 -11 -110 151 148 426 490 162 172 -161 -62 14 -156 -322 18 -194 -177 163 -464 -419 -107 127 -13 -116
3372 -116 -134 -1 -284 -23 20 -123 128 104 125 -26 296 -144 -260 83 142 -143 66 -427 -162 -415 -40 15
3394 15 61 197 188 165 281 69 258 381 95 -65 -189 171 -435 -134 -89 -33 13 47 -55 33 40 224 105 -162
3418 -162 -86 -211 93 -18 322 229 160 -107 -29 -100 42 116 -113 150 -280 -521 38 -179 -132 257 107 134 184
3441 184 149 7 165 361 164 -243 260 -220 -148 -254 -357 -54 123 97 359 -71 40 -23 -130 228 17
3462 17 127 -95 -22 -2 85 -371 -54 -234 105 135 62 23 -175 -256 -194 -74 177 -80 -2 8 39 -152 19 -107
3486 -107 -182 57 126 -183 244 -21 -137 -141 -226 -55 147 20 -130 30 -125 -61 -153 151 17 103 -44 77 -206
3509 -206 -232 -188 -40 86 83 -101 -17 -236 0 -94 145 -54 104 -108 80 111 -209 -179 40 288 15 158 -50
3532e0Q5j47J21j25q5k4J01J44k8k79J17J37O9N6j13J52R7J5m78K42p1l5L6K33
3556A70K4j84p1J29k43K2n6J57O2q8J95k55K6K08K22m33Q5J26J56r2l45j0J64
3579c1J46l01L83l42l1L07K38n24P0P1O6K0j61l3K72j77n2J52pJ2k10J7L20n98
3603c93%K45Q1R8j24jp9J90o0p4J27j5R1M5J6j15l95M52r9L0K11k37j07Q4J5j03
3629a17j2K68j15j0j65N9K30l35O8L20l07K01P9j38Q4O2k97K07p2J70r8j58j3
3652h9J38k50O5K78R0k37j17M87l06j35j60K37R5P3k64j6p0N9J11l21L57k62N59
3675C22k37j03J98l34J03j59Q5K5N84m29j21j34k46M99r6Q3J59l3k10q1m4N0K03
3698H4J60L6n52L54o5k8R0O0k14J23k70L9L55k08p3N9J9K6L88k10k62J4OK44k59
$$ plain form
3532 -50 35 -112 9 -116 -201 -225 -124 20 -8 -287 -170 -33 36 92 -21 131 228 243 -235 7 -64 -99 -63 170
3556 170 194 10 -61 68 -175 -153 -209 -52 10 -78 117 -138 -112 96 318 -115 -30 96 252 160 -185 -195 -31
3579 -31 115 -186 197 -145 -176 131 369 -155 -85 -14 52 72 -89 -122 150 -27 -79 73 66 78 -132 -115 205 -393
3603 -393 -393 -148 -67 31 -93 -94 -173 17 -43 -117 10 -5 86 131 147 32 -363 89 -10 20 231 -6 -113 -29 -14 -117
3629 -117 -129 139 24 14 -151 -92 138 -197 -129 191 -116 85 164 26 110 172 -125 82 10 180 82 -76 -89
3652 -89 49 -201 -136 142 232 -5 -122 365 59 -76 -236 1 96 169 -95 -111 -181 -122 -11 -332 25 -237 322
3675 322 85 -18 180 -154 -51 -210 -125 -100 484 55 -66 -200 -446 53 -43 40 199 166 -44 -125 -169 -119 84
3698 84 244 280 -272 82 17 -11 79 139 -75 48 -222 -183 172 -36 -109 -50 -31 -5 383 173 -89 -75 -69 175 -84
3723h4r7L01m3j26N8N5j13p9R5r8K12O9q8k07J85nJ84l41J58J34k06K52k16j39
3747a39L40l44J81j65q4M44j07j76K02K2m4J79l6j57J14j13o5K6l03K83J88k71
3769b5J86j97J67J90m49K17K42k44J9j76J88k4k68J93K66k12oj95K01l76K0M01
3791A18j45j28J22K49k36j15K5J32Q8j0OJ71k73l4n2n1j44K19j15j26M59k47J12
3814B5j74R8J52K70j51o1k34K1J4O7j11J40j69L52j27k8O9k05K45q6j23N3J35
3837A72l58K10K8j8m9J36j55K13P8j44l6l39J32K53j64j01K2r2r3K14J66j39L45
3860B81o5N0j4r0l02j32R7r5K33J45k3j95k39J02L02n1K06l54K36j78k12K31K75
3883B08j14l10L77p4k79K40j00p1k3k3J33o4N5J24j51J55j55n1M6K60j97K19J96
$$ plain form
3723 -84 -181 120 77 -49 9 64 -49 -128 -33 -131 81 150 62 -145 40 35 219 -122 36 170 -36 216 0 -139
3747 -139 201 -143 38 -127 -211 233 126 -50 152 174 130 309 273 116 230 117 52 78 -225 58 246 -25
3769 -25 161 -36 131 321 -128 89 331 87 106 -70 118 94 -174 19 285 73 67 -128 73 -303 -283 118
3791 118 -27 -155 -33 216 -20 -135 -110 22 110 100 106 277 4 -30 -82 -133 -277 -58 -173 -299 160 -87 25
3814 25 -149 -51 101 371 220 159 -75 -54 -40 27 -84 56 -113 239 112 84 153 -52 193 107 -16 37 172
3837 172 -186 24 52 34 -15 121 -34 179 257 113 77 -262 -130 123 -41 -142 -120 -212 -305 -91 75 -64 281
3860 281 216 266 252 162 -140 -272 -175 -270 -37 108 85 -110 -349 -247 55 4 210 -144 92 -86 -298 -67 208
3883 208 94 -216 161 87 -192 48 -52 -123 -146 -169 -36 -100 -45 79 -72 83 -72 -123 -77 183 -14 205 401
3906D01l23j23j7M4K03m27J90J26k33J42Qk3j31J95q9K33j82o2L0k99kL00K06
3929A67j32K8p6J93q9r1k58K1M44k42l9J6O2J47j23Q3Q7k29q2R6J50k46J73J67
3953B27j79J54j16q6J14k28J41Pj69K1j19L58l85J44K18k8j75Q1M9l54M25P2j53
3976A9J1K7ql5M9j62K31k78L74k14j00K20j53Q9q9j06J43L48j96J63m41J42L9
3999G3J05j11K07k40l2K09k4k24P9j10k0j04N70m58j73M1K3K18J74j75q2J29r6
4022b1k42M63k13N0o4j73J51K12m39R4L50o9l8j78L11l87M20j95j06Mn0J6M16
4045C12p0n9J0N2m33J30m2L2r3P3L3l18N87Ol22K44J10l3j31k21L90l45J74k61
4069a75J95l6J02j76R3J62Jq2O5r0o5j21K61k31K13L4l03J13J68k12N5N1L43k91
$$ plain form
3906 401 78 -45 -62 -18 185 -242 -52 74 -159 -17 -9 -32 -163 32 -57 176 -6 -68 -38 -337 -339 -39 167
3929 167 35 63 -13 180 91 0 -258 -237 207 -35 -74 -58 4 151 28 111 198 -31 -113 -17 133 -113 60 227
3953 227 48 202 86 0 114 -114 27 34 -135 -114 -233 125 -260 -116 102 74 -101 -20 29 -325 100 172 19
3976 19 30 57 49 14 63 -99 132 -146 228 14 -86 134 -19 70 -19 -125 18 366 170 333 -108 34 73
3999 73 178 67 274 34 2 211 187 -37 42 -68 -88 -192 378 -80 -253 -212 -189 29 203 28 -54 75 -21
4022 -21 -263 200 -13 37 -27 -200 -49 163 -276 -182 168 99 61 -117 194 -193 227 32 -74 -70 -120 -104 312
4045 312 242 183 193 245 -188 -58 -100 -68 -161 -88 -55 -373 214 220 -102 142 252 219 88 -133 257 -88 86 -175
4069 -175 20 -16 86 -90 3 165 166 84 149 59 -6 -127 134 -97 116 150 -153 -40 128 -84 -29 22 365 74
4093G4J57k26K69l27j88J17m3j2L18rJ0n1pk04M8J07j44O8K47l72m4K74j31j71
4117b40P7J93RK74k24l42J4J78j01k66L88N1K66o2o03K34J5J95K69M0j75J4j59
4140D5j13M2r2m4J54O8j09M4J80j25l9J05M6J00p7j35M0J82k09p7j49K25J5J4
4164I1j26k54K33j00l9K17J86l65L83j31j05J89m20J17R8K74J98j39j52j17j46
4185a08k4J19j08O7k33L10l66L12j06J83j14R1J80m8k0n3n7O0o4J68j57J7k47
4208a98J81k27J21J36J1j32J67J46j01r9o3J05p1L25O8j98q1N4j24m9j51J45J74
4231A39J57l00L0m37P2K13J4M24R9jk85j72K16j23n1J07l6O4K6j62l35R1k01L02
4255a49PQ8K19m5l20J29j5K50N3j80L14q8k49j32J22j85O9L33j92kK5m31J52P9
$$ plain form
4093 74 231 5 274 -53 -241 -124 -167 -179 139 130 140 89 82 -122 -74 33 -111 -43 204 -168 -212 62 -69 -240
4117 -240 -163 30 39 313 89 -253 -239 -61 -162 -428 -40 11 277 215 -388 -154 -139 56 325 365 190 204 45
4140 45 -68 -26 -118 -162 -8 60 -49 -5 175 50 11 116 162 262 185 50 90 272 63 -14 -163 62 77 91
4164 91 -35 -289 -56 -156 -195 22 208 -157 226 95 -10 179 -241 -124 -26 248 446 307 155 38 -108
4185 -108 -132 -13 -121 -54 -287 23 -343 -31 -137 46 -68 23 203 155 135 82 25 85 21 189 32 49 -198
4208 -198 -17 -244 -123 13 24 -108 59 205 104 5 -58 47 -24 301 369 171 90 144 20 -29 -180 -35 139
4231 139 296 -4 26 -411 -339 -126 -112 312 411 410 125 -47 169 46 -5 102 66 130 156 -6 -341 -250 -451 -149
4255 -149 -142 -54 165 120 -200 -71 -86 164 217 37 351 263 14 -118 4 -181 -112 221 29 27 52 -379 -227 -148
4279a48J86l0j1rQ9j59m1l2N5J20J85R3m27K73n9k8k38k80N57K62n25n0L7J51
4303b9j30M50j05J9Q8j43k33L36k80nj44L1J30n2Kk21K66l66J83J26O4j2N7K66
4327B98j76l16K83k40K20J52M5K49o72K79k70J74J13k80J58q2j53j59M4J72k9
4348a90K73J89N1pk31r6J30Q1N3l7L5m48PK00j86r5j31K11Q7L35j62l48N10l32
4372a01oJ37N8j59L11J07m12o7j20K33L0J71q2l50K05j05q0K17j8j57K74j45K55
4395A96Q6l07K75L14k04J1k79j9k05J72k1j92l8K86j84J65K13m72k01K60M15j98
4417G3j64K78M9k8j46j41p3J1J11j31j76M72k34k88M05k6Jnq6J05J02j56o9K46
4441A30K39l53L11k39j54l3J3k72K68O2J24j95nN0J65l21J37K60r4j3L7j84K81
$$ plain form
4279 -148 38 8 -3 -12 77 -82 -123 -155 -100 20 205 298 -129 144 85 57 -181 -461 96 358 -167 -217 -180 -29
4303 -29 -159 291 186 205 293 150 -83 253 -27 -32 -176 -145 -15 -67 -65 -286 -20 -386 -203 -77 -13 -25 32 298
4327 298 122 -194 89 -151 69 221 266 515 -157 122 -148 26 139 -141 17 -65 -218 -377 -333 -161 -190
4348 -190 83 272 323 316 85 -11 119 200 253 216 251 -197 -190 10 -176 -271 -402 -191 -104 231 69 -279 231 -101
4372 -101 -107 30 88 -71 240 347 -65 -132 -252 -19 11 182 100 -250 -45 -150 -230 -13 -31 -188 86 -59 196
4395 196 282 -25 250 564 360 371 92 73 -132 40 19 -173 -211 75 -109 56 269 -203 -404 -144 271 73
4417 73 -91 187 236 208 62 -79 -152 -141 -30 -161 -337 135 -99 -387 18 -8 -7 -12 -98 7 109 -47 -116 130
4441 130 369 16 327 88 -66 -99 -86 -358 -90 -28 96 -99 -104 -54 111 -210 -73 187 93 80 117 -67 214
4464B14j82j04K58m5m2j76J20K2rK6j27J07r0j2K61k55Q2l9j21JL65k6J05k57
4488G6Pj42k19P5N28l45n4L04m07J70j54K31j38k23J47P3K10J16m25q7L56K39
4510C38j36j2K3m09L44j47k91L22j04o1L0R1p2q4kK33j34k73O02q3m51K71k3J13
4534H5p8P8K6J3l1k01J95j00j17K40k42J02L62j62j92l8l3J63o3J76k54Q5K9m
4558C9K9J01L50n75J23r2n1q9L9J94j32o7Q7J94o5j86Q0J49r1O3N3k42K85j68
4582B8j7J69j37K05k87K10k25Q7j01k64J35L2R4M23n29j15J29K07J04K4J84m05
4604d9KN0K27l23mo2J24r5N6N9K76m84k0J08J60q6R9P7k87M06n27L57k67J71L3
4629AK14k93J34n8j40j2R1Q0J34k41P6K9j00K26j57J37k45K86j36K73k29n7M8
$$ plain form
4464 214 32 -72 186 141 99 -77 43 65 56 82 -45 62 -28 -40 221 -34 48 9 -112 -111 254 228 333 76
4488 76 83 -59 -278 -203 325 -20 -74 230 -177 -7 -161 70 -68 -291 -144 -71 139 255 -170 -257 99 338
4510 338 202 190 213 -196 148 1 -290 32 -72 -133 -103 -12 -84 -168 -170 63 -71 -344 258 175 -276 -5 -28 85
4534 85 7 85 111 124 93 -108 87 -13 -130 110 -132 -30 332 170 -22 -60 -93 70 7 183 -71 14 43 39
4558 39 68 169 519 -56 67 -25 -76 -165 -126 68 -64 -131 -44 150 85 -101 -21 128 37 100 153 -89 196 28
4582 28 11 180 43 248 -39 171 -54 33 -68 -332 -197 -165 -71 352 -177 -292 -163 44 148 172 356 -49
4604 -49 -47 3 230 -93 -97 -159 -35 -130 -74 -15 261 -223 -243 -135 25 -61 38 115 -172 234 -293 64 -203 -32 1
4629 1 215 -78 56 -2 -142 -154 -63 17 151 -90 -14 15 -85 141 -16 121 -124 162 26 299 70 13 61
4652F1J05q0o9j94K65j99j2J12j68O7L20r1n2J22k50K50j86K3j1J14J40l86k11
4675c30J80O1k5K45m4j77j11L43j76N3Q2J05k97K26n6J07m02L53P7K0j20K9o4
4698G9k22R6L6k99J70J13m5J54K0O2l15L42Jj93L00k30O7m63K32K01m59M15j40
4721g8K35j85P7J9j66L7j45N6K68K05l78J41o1p8J15n5J29j78N6J78l28KP4J37
4745G7k36J49j14L5j37J95J52j0j95j86K70L25k08k9j84k2J02k12L97l18J3Nj17
4768b48K57J60m87K60j91N7O05l06J94m06K82J25J11j84o0j49l9L07r2k16J43
4789A23l05J16J15j05K38m71L85j25J28J05M5j97l0K63l76j75K80J96j20j0k76
4810a96J71r8R0Q6l6K71J20j41k09K5Kj68R7J6q2m2Jl3J22n8R9k12K86m2l39K68
$$ plain form
4652 61 166 86 17 -177 88 -111 -123 -11 -179 -112 208 117 65 187 -63 187 1 24 13 127 267 -119 -330
4675 -330 -150 -89 -114 131 87 -90 -201 142 -34 19 101 206 -91 135 79 186 -216 137 214 234 114 143 79
4698 79 -143 -47 -11 -310 -140 -27 -72 82 102 164 -151 191 192 -1 299 69 136 -327 -95 106 -353 62 -78
4721 -78 157 -28 49 68 -98 -61 -206 -150 118 323 -55 86 25 -53 62 7 136 -42 14 192 -136 -134 -60 77
4745 77 -159 -10 -124 -89 -226 -31 121 111 -84 -270 0 325 117 88 -96 -118 -16 -228 169 -149 -136 -131 -248
4768 -248 9 169 -318 -58 -249 -192 413 107 301 -105 177 302 413 229 169 20 -19 288 196 -20 123
4789 123 -182 -66 49 -56 182 -289 96 -29 99 204 249 52 22 285 -91 -266 14 210 90 80 -196
4810 -196 -25 -123 -33 53 17 288 408 267 58 83 85 -83 14 30 -52 -94 -93 -126 -4 -62 37 -175 111 69 -270 -2
4836bJ03j14q1K89k23P9j5J7r5MJ68k29k7N5J77l8K34p31L49L6j5K37k16k9Q0
4861A3j27J50O4J4n4l7K37l15N0R5J6j65M26k59k22K35r7P1oM7K37j33j56j14
4885c0K11j61J58k87O8J23N6q6k89J39o2j14K52J04o3nK35j46JJ67m40J97j3j14
4909i9p0J35j76l4o6K4p5K90m4J11Q8j86Nn2J60j05R7j03K25l00n8P7M7P5J43
4934A09j95j41J59Q4M1l42J23J4P5P5M8J47n9K09k34k21J9O2ko0p2J13j33J69
4958a2P4j46K26k7j28m9J48r2L15o7q1l23J03K23l57l4K78N2J48k77Q7N5J2p0
4982E8j57M1J08J75j18N7r8Q4l17L58r9l4O1o0j9p7j15J50J72j49j36O1J73k80
5006a61L69l7q6m34K31K50k91K5O1P6k30L67l09N1J30j60J62O2k47K23k95L10
$$ plain form
4836 -2 101 -13 -94 195 -28 51 36 53 -42 -38 130 -99 -126 -71 106 68 302 -429 -80 -44 -59 178 -38 -67 13
4861 13 -114 36 100 114 60 23 260 -55 -5 90 106 -59 367 108 -114 121 24 95 89 136 373 240 84 -30
4885 -30 181 20 178 -109 -41 82 138 52 -237 -98 -160 -274 -22 82 19 14 249 103 104 271 -169 28 15 -99
4909 -99 -169 -34 -210 -244 -310 -286 -361 -71 -115 -4 84 -102 -97 -149 11 -94 3 -100 125 -175 -233 -156 -109 -34 109
4934 109 -86 -227 -68 16 57 -285 -162 -148 -73 2 50 197 138 347 113 -108 -89 -27 -29 -89 -161 -48 -181 -12
4958 -12 62 -84 142 115 -13 -62 86 -6 309 242 161 -162 -59 164 -193 -227 51 103 251 -26 61 116 128 58
4982 58 -99 -58 50 225 107 164 66 150 -167 191 92 58 119 59 40 -37 -152 -2 170 21 -115 -54 119 -161
5006 -161 208 171 85 -349 -118 132 -159 -134 -73 3 -227 140 -169 -118 12 -148 14 76 -171 52 -243 67
5028F7m0J5j86K06M8l76L02J13j78l53N14l04K95l23R2J27m01L60j55K87k0o2
5050B8L40l78J41j31R0k6J28k28J12o6j8J74l85J09J83N8O0m3k47J19r9J46Ol69
5074b96J72L64n7l43L48j93J0J2j10J96J4r5J00j01k9j85K12M6j07j92J38l2K40
5097A12q2k0M5j5j6k36K19k12J36J00m49K31J39K77k20q5lo0K74n1JJ46m0k27
5121c6j66K29K7l14K36K34j16j46j38r3J68P5p8K47j4r8J59q0J30K5l8n9j37M64
5145D81m78j00K55l68O6r7M40j90k49K68J72O9l85K08R6p3m1j56N9j32K70k67
5167a52K43j16j73Q6L1J02j15q2K44j26Q0j02J67k70J59J66J51j89j79J85j00
5188A0K63k43m2k05N0n7o3Q0J50p9J11J85j92K92k21N41m64o7j97L14k1p6k0j31
$$ plain form
5028 67 27 42 -144 62 110 -266 36 149 -29 -382 132 -172 123 -200 -108 19 -382 -22 -177 110 90 28
5050 28 368 -10 131 0 90 64 192 -36 76 10 -8 166 -219 -110 73 131 191 148 -99 20 -79 67 73 -296
5074 -296 -124 240 183 -160 188 -5 5 17 -93 103 117 22 122 21 -8 -193 19 65 -42 -234 -96 -128 112
5097 112 30 10 55 40 24 -212 7 -205 -69 31 -418 -187 -48 229 9 -76 -79 -139 135 84 85 231 191 -36
5121 -36 -202 27 54 -260 -24 210 94 -52 -190 -283 -115 -40 -118 129 115 17 176 96 226 251 213 154 17 481
5145 481 3 -97 158 -210 -144 -241 199 9 -240 28 200 269 -116 92 188 115 74 -82 -23 -155 115 -152
5167 -152 91 -25 -198 -112 -81 21 -94 -176 68 -58 22 -80 87 -183 -24 142 293 104 -75 110 10
5188 10 273 30 -12 -217 -167 -224 -287 -207 -57 -136 -25 160 -32 260 39 580 116 49 -148 166 145 69 49 -82
5212h2J20J54j11k21J93p2N8k05oL40l69K00n2J68p9k8J62j15r8J03j15m8M4K64
5236B05j37k36M3n2O2L7J9j69J20j97L22K00m9r1O2k32M56k22l01K98l12L52p6
5259A02j46n1M3j43L67l09k4Jn0J79j13K58K1J3r6k0j66J18J59k07L29k9k69j31
5283a64P7k17K94q8J64q4J80j49L31j25j56j77L10r1J3j44m8jj22N4K82k17l93
5306d71N60o5K6l10L98l73N64k77j68J1J13J10q2J63K13o83M68k06k15J96M5r1
5328g4p7k4K79k37J44q4J73n0k23J99Ok81J86J15O0Rk51L15l59P5L7j53L22j28
5352b1J1KK11l90N8K71k88L42o4J78k79R7J71k11J19j00k9j2m48L12K4J26j80
5375a00m0Q2J53l13L92K26k90K63j95r9k7K02k71nn2J0J12k8j7K02l03j52M6m9
$$ plain form
5212 -82 38 192 81 -140 53 -19 39 -166 -172 168 -201 -1 -53 115 36 8 170 55 -43 60 -55 -103 -59 205
5236 205 68 -168 -125 -177 -115 -78 -59 -228 -108 -305 17 217 168 77 139 -93 363 141 -160 138 -174 178 102
5259 102 -44 -95 -52 -195 172 -137 -161 -160 -210 -31 -144 114 135 148 52 32 -134 -16 143 -64 265 236 -33 -164
5283 -164 -87 -304 -10 -98 66 -18 162 13 344 219 63 -114 196 105 118 -26 -74 -75 -197 -143 139 -78 -471
5306 -471 89 24 50 -260 138 -235 329 52 -116 -105 8 118 36 199 412 -271 197 -9 -224 -28 17 -74
5328 -74 -151 -175 104 -133 11 -73 100 50 -173 26 32 -249 -63 52 112 121 -130 185 -174 -99 -62 -215 107 -21
5352 -21 -10 -8 203 -187 -129 142 -146 196 132 310 31 128 299 88 207 107 78 66 -382 -70 -46 80 -100
5375 -100 -140 -58 95 -218 174 400 110 373 178 79 52 254 -17 -22 -74 -64 48 20 3 205 -98 -250 -204 -253
5399b53L90j39m4k3j49K85j51l9K23p5P3k4J41k63j06M0j43J87l6m3J17L2k9j44
5423a73J43J88j25O6j92K67j23J1q3j59J94p8j89J28K31m8j55k49K62O3K7N2l3
5446B5l38K70K0L5K9o3q0K03k66M3j02J14J96j94K06R1M5l01J4J08n0j15K12j97
5470i5J87R1k10M5j57J65P2j11K15r9o7P5j9j11k04K65n70L77L60j05k80MJ57
5493a5r1K98k22J93j37j38J49j17P9N4P5N0J48m16J49j4l34M12l93K49j17L5J74
5516G1k18L62n22L63J52l35J59N4j85J83k75J46k8m8N9L13j93J2q5j20j6J46l24
5539c29P9k8K75J98j22J74j0J89k10l09N2K12j35j43j8J54J61j47k87j0J0K56
5561A2j70J70M32n11K48l10R2K5j36N2K69q3p1K07k36l48L83j51M8J19l1L3l71
$$ plain form
5399 -253 137 -2 -46 -69 -218 67 -84 -123 100 25 98 74 215 -48 -154 -114 -257 -70 -106 -149 -32 0 -29 -173
5423 -173 -30 158 33 99 -93 174 51 62 -21 -180 14 -64 -253 -125 106 58 -97 -346 -84 -21 6 58 25
5446 25 -313 -43 -23 12 41 -22 -102 101 -165 -122 -224 -110 86 -108 98 189 234 -67 -53 55 5 -110 102 -95
5470 -95 92 183 -27 18 -139 26 98 -13 202 103 36 111 92 -19 -223 42 -528 -151 209 104 -176 -172 -15
5493 -15 -106 192 -30 163 26 -112 37 -80 -1 53 128 178 326 -90 59 45 -289 123 -270 -21 -138 -103 71
5516 71 -147 215 -307 56 208 -127 32 86 -99 84 -191 -45 -73 -121 -62 251 58 70 -15 -135 -151 -5 -329
5539 -329 -250 -278 -3 195 73 247 237 426 216 -93 -41 171 36 -107 -125 29 190 43 -244 -254 -244 12
5561 12 -158 12 444 -67 181 -129 -37 -12 -148 -96 173 90 19 226 -10 -358 25 -126 -78 41 10 43 -328
5584c28L38M1K9j92K54k9q0K00k72K33l85K64J27j73r1K05k25j52L34j81Q1L62
5606C60k99j37P0m4j17J95K07q4k77L62J11l79P3L5m40K12o7j3Q2J98N6j62P5
5629A7p4r8J80p2L11j61R0j45k24J16Q9J90m00J11r5K68m47L07j20K92k68j22
5651b55O9K51l22N52j92m0j58J27q9r0N45k85o9q2N6o3L6n9K1O1J25j72R0J59
5675B16k72j55K80j23R4K36j63j90J05j15K82k07j02K01k09M04k27k50J46n5L00
5696A96k89J00J34J60l90R6J69o8J6p3q0J5J42k43R0J84r7j33o3J41j10J09P5
5719H1l05J87J40p2K67k62J99k85K8j33J25k25Q2K57m0pm25K87J50j77J66j22
5741h4K04k02J70j17p9N3j13K98j88j15j28K97j9m4J21n3j72O4J27J46k09j61
$$ plain form
5584 -328 10 51 80 -112 142 113 33 233 -39 194 -191 73 200 27 -64 141 -84 -236 98 -83 -2 360
5606 360 61 -76 -6 -50 -167 28 235 151 -126 236 347 -32 41 76 -364 -152 -219 -232 -150 48 104 -58 17
5629 17 -57 -155 25 -47 264 103 193 48 -176 -60 29 219 -181 -70 -165 103 -344 -37 -157 135 -133 -255
5651 -255 -186 65 -257 295 103 63 -95 32 -57 -147 398 113 44 -38 18 -45 -9 -68 -47 14 139 -33 57 216
5675 216 -56 -211 69 -54 40 276 113 -77 28 -87 195 -12 -114 87 -122 282 55 -195 -49 -104 196
5696 196 -93 7 141 301 -89 7 176 108 124 51 -29 -14 128 -115 -25 159 62 -71 -134 7 -103 6 81
5719 81 -224 -37 103 31 298 36 235 -50 -22 -155 -30 -255 -173 84 44 37 -388 -101 49 -128 38 -84
5741 -84 120 -82 88 -29 -108 -55 -168 130 -58 -173 -301 -4 -23 -67 54 1 -171 -107 20 166 -43 -204
5763b04L53J2k75N57o32K35J81l50k83L67N4j2k68K95L48l55l39K96J44N7J62
5784C43l57j01J71j14q0J81K02k97o3P7P2n4p6J73k25M56q8j22k81oP3P8K8N3
5808D3j65J48n3j40J65R1l14P1O3R3m0j44J69J34j24j94M6J70J30j89L20m08k78
5831d06K92Q5p5L7J2j58L97m94L24j27K81j31J65j91J16k91J68l8j47K76j30m2
5853g7K94k34r6r4K32k45K23N21n80L5j49K08j15j11K58qj45L32n01L71j27k18
$$ plain form
5763 -204 149 161 -114 443 -189 46 227 -123 -406 -39 15 3 -265 30 378 23 -316 -20 124 181 343
5784 343 -14 -115 56 -58 -138 43 245 -52 -115 -38 34 -20 -96 77 -148 308 220 98 -183 -189 -116 -38 -10 43
5808 43 -122 26 -27 -167 -2 89 -225 -154 -91 2 -38 -182 -13 121 -3 -197 -151 19 149 -40 280 -128 -406
5831 -406 -114 -29 -104 -67 -55 -213 184 -310 14 -113 168 37 202 11 127 -164 4 -34 -181 95 -35 -77
5853 -77 217 -17 -113 -207 25 -220 3 524 -56 -21 -170 38 -77 -188 70 62 -83 249 -252 119 -8 -226
$$ [...]
8191b10
##END NTUPLES=NMR FID
##END=
