##TITLE=1H_Pr 1Q-Eth
 200.13MHz, CDCl3,
 8 sc
 
 3.2.2025
##JCAMPDX= 6.0         $$ Bruker NMR JCAMP-DX V2.0
##DATA TYPE= NMR FID
##DATA CLASS= NTUPLES
##ORIGIN= UXNMR, Bruker Analytische Messtechnik GmbH
##OWNER= pz
$$ XWIN-NMR		Version 3.5
$$ Mon Feb  3 17:39:18 2025 Russian Standard Time (UT+4h)  she@DPX200
##.OBSERVE FREQUENCY= 200.1313
##.OBSERVE NUCLEUS= ^1H
##.DELAY= (6, 6)
##.ACQUISITION MODE= SIMULTANEOUS
##.ACQUISITION SCHEME= undefined
##.AVERAGES= 8
##.DIGITISER RES= 18
##SPECTROMETER/DATA SYSTEM= spect
##.PULSE SEQUENCE= zg30
##.SOLVENT NAME= CDCl3
##.SHIFT REFERENCE= (INTERNAL, CDCl3, 0, 14.3821)
##AUDIT TRAIL= $$ (NUMBER, WHEN, WHO, WHERE, WHAT)
$$ ##TITLE= Audit trail, XWIN-NMR		Version 3.5
$$ ##JCAMPDX= 5.01
$$ ##ORIGIN= Bruker BioSpin GmbH
$$ ##OWNER= she
$$ F:/spectra/data/she/nmr/H-C/1/audita.txt
$$ ##AUDIT TRAIL=  $$ (NUMBER, WHEN, WHO, WHERE, WHAT)
(   1,<2025-02-03 17:38:05.18 +0400>,<she>,<DPX200>,
      <created by zg, POWCHK disabled, PULCHK disabled
       configuration hash MD5:
       00 E9 B6 7A A2 85 ED C7 34 08 36 98 17 FE 4E 26
       data hash MD5: 16K
       47 75 F4 B4 68 72 E3 E1 52 2D 94 21 62 C3 A7 DC>)
$$ ##END=
$$ 
$$ hash MD5
$$ 3B 20 0F 85 E9 F0 0B F3 9A A2 58 2C 38 E3 03 1C
##$RELAX= 
##$RELAX= 
##$RELAX= 
##$RELAX= 
##$RELAX= 
##$RELAX= 
$$ Bruker specific parameters
$$ --------------------------
##$DU= <F:/spectra>
##$EXPNO= 1
##$NAME= <H-C>
##$PROCNO= 1
##$TYPE= <nmr>
##$USER= <she>
##$AMP= (0..31)
100 100 100 100 100 100 100 100 100 100 100 100 100 100 100 100 100 100 
100 100 100 100 100 100 100 100 100 100 100 100 100 100 
##$AQSEQ= 0
##$AQ_mod= 1
##$AUNM= <au_zg>
##$AUTOPOS= <>
##$BF1= 200.13
##$BF2= 200.13
##$BF3= 200.13
##$BF4= 200.13
##$BF5= 200.13
##$BF6= 200.13
##$BF7= 200.13
##$BF8= 200.13
##$BYTORDA= 1
##$CFDGTYP= 0
##$CFRGTYP= 5
##$CHEMSTR= <none>
##$CNST= (0..31)
1 1 145 1 1 1 1 1 1 1 1 1 1 1 1 1 1 1 1 1 1 1 1 1 1 1 1 1 1 1 1 1 
##$CPDPRG= <>
##$CPDPRG1= <>
##$CPDPRG2= <>
##$CPDPRG3= <>
##$CPDPRG4= <mlev>
##$CPDPRG5= <mlev>
##$CPDPRG6= <mlev>
##$CPDPRG7= <mlev>
##$CPDPRG8= <mlev>
##$CPDPRGB= <>
##$CPDPRGT= <>
##$D= (0..31)
0 0.7 0 0 0 0 0 0 0 0 0 0.03 0 0 0 0 0 0 0 0 0 0 0 0 0 0 0 0 0 0 0 0 
##$DATE= 1738589884
##$DBL= (0..7)
120 120 120 120 120 120 120 120 
##$DBP= (0..7)
150 150 150 150 150 150 150 150 
##$DBP07= 0
##$DBPNAM0= <>
##$DBPNAM1= <>
##$DBPNAM2= <>
##$DBPNAM3= <>
##$DBPNAM4= <>
##$DBPNAM5= <>
##$DBPNAM6= <>
##$DBPNAM7= <>
##$DBPOAL= (0..7)
0.5 0.5 0.5 0.5 0.5 0.5 0.5 0.5 
##$DBPOFFS= (0..7)
0 0 0 0 0 0 0 0 
##$DE= 6
##$DECBNUC= <off>
##$DECIM= 32
##$DECNUC= <off>
##$DECSTAT= 4
##$DIGMOD= 1
##$DIGTYP= 9
##$DL= (0..7)
0 120 120 120 120 120 120 120 
##$DP= (0..7)
150 150 150 150 150 150 150 150 
##$DP07= 0
##$DPNAME0= <>
##$DPNAME1= <>
##$DPNAME2= <>
##$DPNAME3= <>
##$DPNAME4= <>
##$DPNAME5= <>
##$DPNAME6= <>
##$DPNAME7= <>
##$DPOAL= (0..7)
0.5 0.5 0.5 0.5 0.5 0.5 0.5 0.5 
##$DPOFFS= (0..7)
0 0 0 0 0 0 0 0 
##$DQDMODE= 0
##$DR= 18
##$DS= 0
##$DSLIST= <SSSSSSSSSSSSSSS>
$$ [...]
##$SUBNAM0= <"">
##$SUBNAM1= <"">
##$SUBNAM2= <"">
##$SUBNAM3= <"">
##$SUBNAM4= <"">
##$SUBNAM5= <"">
##$SUBNAM6= <"">
##$SUBNAM7= <"">
##$SUBNAM8= <"">
##$SUBNAM9= <"">
##$SW= 18.0517328524113
##$SWIBOX= (0..15)
0 0 2 0 0 0 0 0 0 0 0 0 0 0 0 0 
##$SW_h= 3612.71676300578
##$TD= 16384
##$TD0= 1
##$TE= 0
##$TE2= 300
##$TE3= 300
##$TEG= 300
##$TL= (0..7)
0 120 120 120 120 120 120 120 
##$TP= (0..7)
150 150 150 150 150 150 150 150 
##$TP07= 0
##$TPNAME0= <>
##$TPNAME1= <>
##$TPNAME2= <>
##$TPNAME3= <>
##$TPNAME4= <>
##$TPNAME5= <>
##$TPNAME6= <>
##$TPNAME7= <>
##$TPOAL= (0..7)
0.5 0.5 0.5 0.5 0.5 0.5 0.5 0.5 
##$TPOFFS= (0..7)
0 0 0 0 0 0 0 0 
##$TUNHIN= 0
##$TUNHOUT= 0
##$TUNXOUT= 0
##$USERA1= <user>
##$USERA2= <user>
##$USERA3= <user>
##$USERA4= <user>
##$USERA5= <user>
##$V9= 5
##$VALIST= <valist>
##$VCLIST= <CCCCCCCCCCCCCCC>
##$VD= 0
##$VDLIST= <DDDDDDDDDDDDDDD>
##$VPLIST= <PPPPPPPPPPPPPPP>
##$VTLIST= <TTTTTTTTTTTTTTT>
##$WBST= 1024
##$WBSW= 4
##$XGAIN= (0..3)
0 0 0 0 
##$XL= 0
##$YL= 0
##$YMAX_a= 77019
##$YMIN_a= -61951
##$ZGOPTNS= <>
##$ZL1= 120
##$ZL2= 120
##$ZL3= 120
##$ZL4= 120
##$ABSF1= 10
##$ABSF2= 0
##$ABSG= 5
##$ABSL= 3
##$ALPHA= 0
##$AQORDER= 0
##$ASSFAC= 0
##$ASSFACI= 0
##$ASSFACX= 0
##$ASSWID= 0
##$AUNMP= <proc_1d>
##$AZFE= 0.1
##$AZFW= 0.1
##$BCFW= 1
##$BC_mod= 2
##$BYTORDP= 1
##$COROFFS= 0
##$CY= -3
##$DATMOD= 1
##$DC= 2
##$DFILT= <>
##$DTYPP= 0
##$F1P= 0
##$F2P= 0
##$FCOR= 0.5
##$FTSIZE= 0
##$FT_mod= 4
##$GAMMA= 1
##$GB= 0.15
##$INTBC= 1
##$INTSCL= 1
##$ISEN= 128
##$LB= 0.25
##$LEV0= 0
##$LPBIN= 0
##$MAXI= 10000
##$MC2= 0
##$MEAN= 0
##$ME_mod= 0
##$MI= 1.114404
##$NCOEF= 0
##$NC_proc= 0
##$NLEV= 6
##$NOISF1= 3.799351
##$NOISF2= 2.8
##$NSP= 1
##$NTH_PI= 0
##$NZP= 0
##$OFFSET= 14.38212
##$PC= 1
##$PHC0= 175.8044
##$PHC1= 8.19222
##$PH_mod= 1
##$PKNL= yes
##$PPARMOD= 0
##$PSCAL= 0
##$PSIGN= 0
##$REVERSE= no
##$SF= 200.129724274929
##$SI= 16384
##$SIGF1= 3
##$SIGF2= 2
##$SINO= 400
##$SIOLD= 16384
##$SREGLST= <1H.CDCl3>
##$SSB= 0
##$STSI= 0
##$STSR= 0
##$SW_p= 3205.1282051282
##$SYMM= 0
##$S_DEV= 0
##$TDeff= 0
##$TDoff= 0
##$TI= <>
##$TILT= no
##$TM1= 0
##$TM2= 0
##$TOPLEV= 0
##$USERP1= <user>
##$USERP2= <user>
##$USERP3= <user>
##$USERP4= <user>
##$USERP5= <user>
##$WDW= 1
##$XDIM= 8192
##$YMAX_p= 0
##$YMIN_p= 0
$$ End of Bruker specific parameters
$$ ---------------------------------
##NTUPLES= NMR FID
##VAR_NAME=  TIME,          FID/REAL,        FID/IMAG
##SYMBOL=    X,             R,               I
##VAR_TYPE=  INDEPENDENT,   DEPENDENT,       DEPENDENT
##VAR_FORM=  AFFN,          ASDF,            ASDF
##VAR_DIM=   8192,          8192,            8192
##UNITS=     SECONDS,       ARBITRARY UNITS, ARBITRARY UNITS
##FACTOR=    0.0002768,     1,               1
##FIRST=     0,             0,               0
##LAST=      2.2672688,     0,               0
##MIN=       0,             -61951,          0
##MAX=       2.2672688,     77019,           0
$$ Real data points
##PAGE= N=1
##DATA TABLE= (X++(R..R)), XYDATA
0@%%%%%%%%%%%%%%%%Qj6J6j6J6j6K4l2L2m0M8n6O4p2Q8j01J09j20J41j65J84k01
38a05K25k56K85l17L52l87M27m72N20n73O34p00P72q50R38j034J138j258J395
57G34j555J738j949K202k509K894l391M054m995O443q982J4692m9910J3612J03941
72G7019n8850o3596K6815N0183j7873k0194m619j252P672K8354o108l5392q381
85b6222L6512J9782k8665l5658K1233M2484p880m1270q62K9228N819j5270m058
98d827k239J694J8710J463l1664k323L3922M96k8014O478J9176j3629r090J9762
112I915m161k6272J3507L0149j4196k6155J1241J9423r319j6332N623J3037k064
125D396o408M725L194j1512n852J7138P688k2588o255K8287N529k9398n677K4329
$$ y = [0, 0, 0, 0, 0, 0, 0, 0, 0, 0, 0, 0, 0, 0, 0, 0, 0, 8, -8, 8, -8, 8, -8, 16, -16, 16, -24, 24, -32, 32, -40, 48, -53, 56, -64, 77, -88, 96, -105, 120, -136, 149, -168, 184, -203, 224, -248, 272, -301, 333, -367, 405, -445, 493, -541, 597, -661, 734, -821, 917, -1032, 1170, -1339, 1555, -1836, 2218, -2777, 3666, -5316, 9376, -40534, -26922, 77019, 18169, -45427, -18612, 31571, 13698, -6496, -11115, -12367, -4695, 23659, 17551, -17841, -26222, 10290, 30072, 1407, -34251, -13018, 29466, 21586, -19684, -20546, 8682, 14501, -769, -4827, -7066, -5372, 13338, 14801, -16863, -19186, 14736, 15232, -12782, -6304, 12872, -757, -9847, 9915, 5754, -20518, -7011, 23138, 8942, -17213, -5972, 13451, 4132, -12200, -6577, 6460, 4396, -2012, 2713, 5907, -5605, -11457, 5681, 13369, -9219, -15474, 12813, 18342, -11056, -16733, 7596]
139G596L213j7268J347J0073n254j430P606p001q519J1821Q138j2234o672J0655
153B071M771r062l495O538K491l251j314K057J269l438j877M578L46m849L439
168B74N753n803o227O812M661r600l435J2396L162j1312j757Q128j05n968Q7L748
184H14M13k02R65k503k399L155K137k615j892J479K706j25l060o76J807N49J15
201F68o1j523r25K280K371l127l752L967M289l519l427K315K128j626j297J776
217E37K08k472J740L769l077n366K524O455j646p317J297P733l61o503j228L955
233B48K376j816k690M14K509J283j833k655R10K428j42j099r15j82K060J008k353
250d49j509J686J916p47k002k58J443J633n37l264L57M600r18n028J319M443j414
$$ y = [7596, 10809, -6459, -5112, 4961, -293, -1723, 5883, -1118, -9637, 2184, 10322, -1912, -8584, 2071, 6842, -2220, -5715, 823, 3314, 63, -1251, 806, 2075, -1363, -3240, 1338, 1684, -3165, 274, 6027, 224, -6003, 809, 5470, -4130, -7565, 4831, 7993, -3319, -5076, 3052, 2947, -3021, -2934, 814, 1227, 1025, 1990, -513, -2912, 243, 2380, -235, -2127, -648, 2058, 1933, -1127, -1803, 4, 553, 668, 607, -916, -1841, 439, 2810, -317, -4069, -102, 4187, 668, -2759, -444, 1684, 58, -1239, 537, 745, -1727, 13, 3782, 705, -4661, -2137, 4318, 2672, -4645, -3348, 4385, 4024, -2479, -3707, 248, 2624, 808, -1882, -1468, 1041, 2324, 491, -2164, -1254, 1174, 1032, -67, -982, -1164, 896, 1904, -449, -1958, -272, 1644, 897, -1105, -1363, 80, 1713, 1176, -2088, -1731, 2869, 1951, -3077, -1758, 2685, 1271]
267A271l686J453L027j458k032J248P96o17k24k99N85P71j065k92J357m69j508
284a142R81J560j709j515K732J119l316l09K946l05k019L3J077P21k97j280l14
301a037J937Q55k798j106L409O14l252L7K405j23j345k50N44N19p4p37k80J148
319D66L52j490L58J427j464p12K125k95k256R75K149j206k030J293J695j264j118
336i95O08O53N02p58j308J362J595j777j476J816J217j766q38J663K83j173L44
353d8K28n64N98O0r13N33O87p92j98R88l19j213R17J230j594p94J964K05j611
372f36Q3R06M9m43m35J94P98rj204m1J786k98k274J019K242j470j777J402J320
391A212j014j026N63P56k4l60o76Q7J080l21r94P48M08p77M24N52j175n70J636
$$ y = [1271, -2415, -962, 2065, 607, -1425, -177, 619, 2, -222, -521, 64, 835, -230, -522, 835, 366, -1142, -161, 1399, -310, -1825, 907, 2026, -1290, -1599, 1347, 1042, -977, -944, 133, 854, 557, -723, -1037, 900, 1755, -1043, -2149, 1260, 1874, -1378, -1341, 1064, 941, -404, -654, -110, 409, 335, -402, -682, 466, 818, -672, -314, 1113, -351, -1063, 1062, 767, -1489, -514, 1635, 429, -1601, -308, 1387, 123, -995, -387, 266, 768, 10, -1298, 64, 1659, -118, -1594, 222, 1439, -327, -1165, 498, 781, -392, -48, 180, -384, 214, 274, -639, -106, 581, -211, -409, 579, 260, -953, -36, 1194, -400, -1194, 770, 975, -636, -553, 353, 402, -41, -476, -282, 516, 507, -697, -738, 1048, 750, -1524, -505, 1737, 267, -1510, -108, 1212, 198, -828, -265, 491, 467, 107, -569, -482, 598, 277, -717, 31, 439, -338, 86, 638, -537, -1107, 529]
410E29Q26j809p91J784O72j317q72L12J326N42j656q40J754Q75j652j013J423
427I3Q48j163k37Q85l09m27M02K2k76q7K55N54j72q56q8Q66K23j094j55J536M1
448H61j537R1J032k93p76L29J004L0j103k47R30J82j073l81J502Q40j609q61J273
467A94M34j000l88P37P29l11p09J19L27k19l00L93N00n67l09J085j06j618K04
486h05J552j65j239J87J211oj196m33O55Q00k10j011N55J399j018j609R57J143
504G67q99m50J196L00j195k82N28k46J1M99l8K05K8r16n7R41m67q30J289J151
524A535j671j176J770N40j942m6J680P7p53k35p4L24L22p09m77J189O77j340k13
543e22J356p71j315J311Q83j338o1J367k86j240M6M50k6M98R4q12M85P52j378
$$ y = [529, 1355, -454, -1245, 539, 1211, -106, -978, -666, 660, 1202, -454, -1294, 460, 1335, -317, -1330, 93, 941, -222, -459, 426, 117, -310, 92, 114, -162, -249, 6, 560, 388, -468, -556, 310, 533, -561, -716, 820, 861, -676, -585, 447, 154, -622, -293, 711, 741, -362, -609, 321, 503, -570, -951, 551, 1391, -218, -1079, 194, 628, -372, -760, -23, 706, 395, -314, -195, 132, -87, -387, 6, 506, -61, -370, 715, 609, -1009, -805, 747, 582, -657, -470, 741, 735, -461, -894, -239, 561, 351, -660, -105, 1294, 276, -1333, -376, 767, -132, -582, 614, 914, -281, -563, -35, -281, -270, 229, 191, 396, 424, -492, -549, 392, -75, -905, 384, 1535, -136, -1312, 458, 998, -944, -990, 690, 767, 14, -221, -295, 29, 351, -358, -835, 354, 1031, -309, -522, 834, 63, -1252, 59, 942, -396, -457, 910, 624, -616, -570, -120, -146, 352, 446, -366, 119, 871, -507]
562e07p16J499K42j008P94Q77j487q92J502L34j421L10J267j86m52l77p17O54
580b84J244r08j193J370J202j539r76J197J28p36Q05K96j088L51R43p34q72M31
598c63M78R8K91m69p79R30Q45j678p77J959O46j463q2R06m51o95M87K46l23M18
618B24L18o10l7J44o92K68J127m02r40O89O80r50o13P73K68l49M00O1o88K02M17
639B90m25j48L62o9P8M38m44r09O14J097q79j027J041R22p57o60K34L28P3j55
659Dj90J14M43mo24n4L59j77K8M21k25l52L63J98n30k68N29L66l00j55Q3mN4j47
683f8k76L85M04m26l58M03K55n13k86O06L21n47k09M26K10l43l46K49M21j90l34
704b16J69K46j01k80L9K77j06j70K44J15k97j22K48J55l12j86M46K41m34k59K74
$$ y = [-507, -1223, 276, 518, -490, 304, 1181, -306, -1198, 304, 638, -783, -473, 794, 608, 156, -221, -938, -284, 960, 52, -1141, 229, 1431, -108, -1084, 113, 241, -495, 310, 606, -482, -131, 812, 78, -794, -363, 115, 213, 504, 35, -744, 186, 1031, -647, -1424, 535, 1181, -282, -364, 542, 91, -604, -117, 129, -194, 224, 542, -68, -105, 39, -653, -385, 742, 340, -600, 89, 769, -181, -794, -21, 247, -102, 298, 359, -329, -127, 290, -135, -283, 79, 10, 88, 526, 82, -827, -213, 884, 5, -1022, 19, 941, 184, -476, -242, 86, 159, 4, -186, -72, 371, 367, -257, -311, 48, -129, -101, 320, 95, -257, 106, 304, -226, -494, 35, 401, 101, -54, 29, 25, 79, -68, -344, 41, 445, 19, -339, 64, 319, -194, -480, 126, 447, -100, -309, 117, 327, -16, -362, -113, 308, 118, -216, -47, 199, 98, -182, -143, 134, 28, -142, 102, 217, -80, -202, 46, 201, -111, -297, 149, 390, -44, -303, -29]
725b9K91k04l45K00M13j44m06k7L86J30m92q1N84jn10K5M12o5l44J16L13j46k09
748a33J39R0n9j22m3K31Q6l59k8M08j9m50J2N24m5n50J82M63k10l26J07K24L8
771A60k15j31K15K21k40l29K49M18l47l77M33K59m27j05L06L6j87j1J33mp0k2
793c5J1J04j8k55J58L28l26l04M11K53m31k20M11K12l77j57K75J34j00j90m0L27
815A71P8m26m3M16J8m04J2L75r8l05J69J88j74p4J11M5j3j05l5J98L8k58m8L47
839A83K3m39K5M85j27m28J72L26j26k70L9K55M2k55q1K31J82k48k78L44K51l95
861h9j67L64N3k61j9J85k0j34N5R2m5m2j3N5J22j64j88K97J99l48k06L59J92l41
885f4j82K95J31j85j01N0J32L2k31j5K86k3l02R1L09j46l34J97L39k56k32K14
$$ y = [-29, 262, 58, -287, -87, 326, 182, -224, -251, 135, 265, -227, -308, 276, 275, -235, -210, 202, 137, -207, -91, 222, 76, -133, 6, 96, 37, -85, -128, 103, 189, -170, -198, 210, 191, -259, -247, 277, 232, -318, -136, 327, 117, -209, -102, 122, 160, -55, -186, 29, 250, 10, -319, -70, 348, 1, -376, 57, 316, -111, -216, 90, 126, -61, -72, 61, 57, -13, -35, -24, 80, 62, -193, -35, 293, -33, -337, 74, 327, -104, -324, 87, 299, -78, -235, 40, 174, 74, -116, -156, 171, 249, -177, -220, 196, 214, -190, -178, 197, 99, -206, -37, 151, -23, -97, 14, 59, 46, -59, -94, 104, 142, -116, -164, 183, 206, -233, -208, 277, 150, -278, -106, 220, 94, -176, -137, 118, 160, -95, -176, 55, 237, -11, -289, 55, 306, -89, -256, 108, 161, -100, -119, 66, 46, -88, -33, 59, 14, -28, -41, 14, 136, -28, -216, 81, 280, -68, -274, 85, 277, -64, -246, 49, 180, -5, -106, -56, 76, 108, -123, -138, 148, 125, -177, -86, 223, 77, -257, -60, 279, 23, -209, 5]
907EJ40j42j02M4J01J2j07qJ31j6j85M3K69j08l34K29L32k64l00J90K72j03k64
930a65M8K13O8j75j87J46K36j82k03K44J47k43o2K04j1k34O2K70m2k57K4J81Q
953I0j78r2K29J63k44j32K34O8k59o3L15O7l47J7L26p0k98J0K57Q5k12j14J84
976C6J20j36j61M9J77j8j09O0N5q0k8M9qo1K0J45K4j82q1J34Q7j08j26J47K13
1001B18j41k19O6J34k5j30O6K04o2k05K8J44p0j36J20J93r6j84N4Q8q3k1L0L4
1025GM9Mn1n8K1K2pL8K1p8M3J32j29j83R9J48j3r6oQ9O8j06j99M4K74J8k74R1
1053c2K47j88k29J41J61j13j6J61k0j85pN4k1M7J0lJ01l6j92J0J75n7j25J73J45
1078B01k35j12K18j9j63M9J13NK9p7j27J18J30k02j41K97J82l21j02K74n5k16
$$ y = [5, 145, 3, -99, -55, 46, 58, -49, -57, 74, 58, -127, -84, 185, 77, -257, -28, 304, 40, -260, -70, 202, 99, -165, -117, 96, 164, -11, -198, -52, 184, 2, -201, 43, 190, -53, -115, 89, 78, -156, -94, 176, 134, -123, -99, 82, 90, -88, -180, 49, 212, -32, -164, 70, 138, -121, -184, 131, 198, -149, -132, 194, 124, -174, -164, 93, 178, -34, -148, 36, 156, 20, -141, -92, 85, 67, -42, 18, 73, -7, -35, 14, 6, -55, -35, 110, 134, -48, -129, 5, 92, -16, -142, 5, 218, 77, -142, -76, 58, 33, -97, -31, 173, 111, -94, -66, 78, 8, -128, -8, 185, 89, -95, -41, 47, -36, -57, -27, 7, 56, 60, 9, -49, -28, -6, -13, 25, 46, -32, 11, 143, 14, -169, -70, 78, 65, -31, -37, 52, 120, 14, -185, -141, 133, 151, -123, -32, 215, 27, -202, -61, 100, -13, -29, 132, 112, -73, -80, -26, -47, 0, 10, 7, 108, 72, -120, -110, 65, 8, -117, 56, 201, -34, -146, 72, 53, -110, -61, 52, 57, 86, 9, -118, 0, 130, -72, -213, 84, 266, -55, -157, 117, 62, -154]
1100a54Q8J45k7l6L8j7p0m0j3O3J20p4j19K08K5l29j9L56j2k63J19K33j90k20
1124a88J38J10n7kJ6lQ1p5j84Q4K05r2j59J57J34j83j05J40Oq2O5M4j8kk7m7N4
1151A0jj17P4K10j17k30J70K08l01j55L30J38k32j08J65P4j73p7J01J34pj52l
1174e9J62o1k00J07J79j08q1J00L4j39j1J26ro7L3N2j6l2p6K0J15k0j51N2J76
1199A26o0j98N0J89l5j81N0J47L3j62q6J64P6j50o6J74N6j72l8J41rj50P5J28
1223A02p6q7N1P9o7j06P3J32m0j32J8J54l7j73J8J96k2j61RJ13K0r1m9O1R6m5
1249C6j18M2J31m5j56Q3J38q5r6Q9M6p3m7O7M4q6k6Q7L7r2q6J10J34j59j28K04
1275E1J25k10j23J95J07j72j03J52Q0r6q0M1Q2Oj07j5J37Jj19MJ08l7q3M8P1p6
$$ y = [-154, -66, 79, 52, 16, 54, 37, -33, -73, -86, -23, 97, 23, -96, 112, 137, -192, -211, 145, 133, -130, -11, 222, 32, -188, -50, 60, 3, 1, 17, 14, 95, 20, -164, -80, 125, 33, -126, 31, 165, -18, -123, 17, 23, -59, 6, 50, 32, 30, 3, -44, 10, 9, -108, -34, 176, 59, -171, -1, 207, -94, -249, 81, 219, -13, -121, 44, 118, -55, -132, -31, 103, 96, -56, -59, 103, 42, -158, -51, 128, 20, -61, 39, 73, -66, -77, 49, 40, -27, 6, 58, 42, 10, -66, -46, 69, 49, -102, -50, 126, 66, -132, -82, 107, 72, -109, -59, 88, 121, -41, -127, 37, 113, -37, -103, 71, 127, -45, -83, 58, 49, -101, -26, 102, 26, -61, -10, 69, 2, -104, -31, 101, 61, -71, -53, 101, 64, -109, -91, 105, 83, -78, -69, 44, 64, -27, -76, -15, 81, 36, -82, -40, 91, 46, -110, -27, 111, 26, -70, 19, 65, -8, -55, 12, 56, -30, -56, 31, 68, -24, -110, 0, 134, -25, -153, 51, 176, -34, -157, 38, 145, -27, -130, 22, 102, 6, -74, -33, 49, 55, -52, -67, 70, 71, -48, -44, 64, 27, -56, -8, 63, -13]
1301a3l4Q5j2l7j9K3N5j8j04J9J40k4j72J1K44n4k40P9K07p0j65L6J27J9j28l6
1327h1J11O0j05p2J03P9j34l8J38j2j27N2R6o2o3O2O1n0p2M1N9Rp7o0J36N2j65
1354e9o5J84O2j75o2J66N7j36n7R3P7m3j15J6J39j5j67M6J52n1j40R4R3j25m8
1379g9J35J8j33RJ09j1p9l0Q0Q7r7j05P8J59j09k04J27K03j40j62J30J23r5r4
1403h0M4Q5po4l2P9N5j05o7J38K0j48L6J33m9j28Q2J06r7r2J08O9r1n7L9R1j1
1430E7j34j9J92K4j93l9K13J9k29k0K18Qj38j2P6K0m2o4M3P3j3q0L1P3p2o6R9
1457B5N6j32KJ47l6j43K3J23lj02j2J07L4j13q0R5J26q4j49J09J49j06j58Q9J37
1482A04p9j29P4J29o6r0K0O2%p5K7Q8j8o7MN4l3q9P0J33q3j18O7J20j13j18J03
$$ y = [-13, -47, 38, 26, -11, -30, -7, 48, 30, -74, -55, 85, 61, -111, -100, 144, 90, -150, -71, 136, 66, -99, -63, 64, 83, -45, -81, 30, 90, -15, -87, 16, 95, -39, -77, 61, 49, -78, -26, 70, 8, -55, 7, 68, 18, -54, -13, 46, 55, -22, -82, 54, 106, -59, -124, 60, 122, -53, -115, 51, 108, -28, -85, 8, 85, 42, -73, -57, 82, 67, -100, -54, 98, 47, -93, 1, 94, -31, -79, 56, 74, -59, -50, 59, 48, -31, -61, 19, 106, 9, -96, -18, 141, 32, -172, -45, 158, 18, -144, -14, 109, 14, -80, -36, 49, 42, -22, -54, 25, 80, -25, -92, 46, 66, -82, -46, 87, 38, -90, -8, 98, 1, -91, 17, 86, -5, -62, -23, 68, 57, -77, -96, 96, 120, -73, -112, 101, 120, -109, -129, 89, 97, -41, -53, 23, 43, 1, -63, -20, 53, 40, -40, -9, 64, -8, -74, 25, 81, -51, -49, 98, 62, -81, -58, 65, 62, -40, -52, 55, 89, -24, -104, -9, 117, 33, -116, -7, 142, 36, -122, -33, 104, 25, -104, -30, 99, 33, -57, -37, 25, 25, -50, -23, 65, 47, -20, -16, 38, 5, -84, -14, 119, 36, -82, -15, 105, -8, -126, -23]
1509b3J61p8j54O0J22m5j42K4J42N2j54o0J47M0j31p5J46P0j34j7J08j4j06K0
1533d1O9rm7L3N7j7p0l9P2O0j09m7J77O5k15p6J92M9j90j2J96L4j57p3O8P3l3
1560A0r5M7J66m4j82J3J70p2j28J25J23j43p3J25Mj31L0J16k0m4k4L1M9m2j12
1585a01M1J85m0k21J00K20j48k25J53J63j03j04Q4P7n2p6n5Q2J24q6j19J54P7
1608A30k09n3J97qj52R5J37j29j40J27O3r4j2O4N2jj12o7J50P8j97n8K47N7k53
1633h8n1K44k2j79L9J18On2m2nP8l0r6L5J42m9j40J12Q0j67n2J99Nj55K8J35n4
1660C9j35QJ12M4n8p8O2J35j19j78J33J92j21j71J38J37j50j00R7P4n2l3NM4K9
1685E4q2m5R0K4q9J7J14n0j19Q3R5j08p4J17O4p8p8N0Q1m1j08MJ64K0j78l4J92
$$ y = [-23, 138, 60, -94, -34, 88, 43, -99, -75, 67, 119, -35, -95, 52, 92, -39, -114, 32, 102, -32, -49, 59, 45, -61, -41, 28, 19, -28, 5, 62, 45, -25, -64, 8, 68, -41, -88, 89, 154, -61, -137, 55, 104, -86, -98, 98, 132, -25, -98, -30, 43, 10, -85, -38, 128, 84, -98, -85, 85, 13, -115, 10, 133, -10, -83, 42, 46, -85, -55, 61, 41, -3, -27, 4, 53, 11, -101, -60, 125, 85, -136, -36, 184, 36, -189, -36, 127, 24, -80, 4, 81, 29, -47, -102, -20, 104, 18, -101, 53, 130, -79, -132, 65, 57, -95, 0, 137, 8, -132, -5, 58, -36, -48, 16, 68, 67, -45, -112, 38, 116, -81, -139, 108, 165, -88, -139, 105, 83, -96, -57, 61, 67, 15, -27, -32, 46, 16, -80, -45, 97, 48, -92, 20, 100, -67, -119, 80, 85, -70, -42, 93, 39, -96, -88, 24, 68, 10, -68, -6, 129, 10, -168, -35, 157, 36, -135, 3, 140, -10, -110, -13, 61, 9, -24, -19, 25, 54, -28, -73, 17, 41, -48, -31, 83, 33, -86, -3, 92, -16, -90, 27, 91, 13, -65, -15, 66, 25, -83, -79, 85, 105, -73, -107, 85]
1712H5Oj94KJ84J2j45j8J09J0q4k2O5M1n0m8N6L6q1k6J07Qj03K0R5k2j09QJ15
1740E7Pj10j4J12M7j20q1J26R5j36r0J31R4j08j07Q1J10q3p5N5P6l0r5L2Q0m0
1766A4p7O1O8p9m4O1M9r0m0R9N5r6m9P6O6o7j01O8J32o3j38M3J54n0j45M0J47
1793I4l6j12QP7L7q2m8Q0M1p5m1Q4K7q6lQ6j1j02O1O5m2q0M1P1k9q1J0J00J4j14
1823d6m5J39O3j61o0J61N0j44m2J21M8j02k9N1L4k0o9L0P0k3p1L4P1p0m2P3L6
1850E7r5j0J00jj06OQ9Rp8l5N7R6q8r9O6J38q1j30P9J31p8j21Q5P3m5n7J1N6M
1879C3m6k7O3J8o0pP6k5q2L7R3q8o2R0O6q8o1P1N7m7p2J9R5J1j16m4J58K5j56
1908f9k2J53K6j45nJ03Op6J0K5K3k5l6K4M2m4l7O4L0q1mP9K0j27J6J22l4j02L0
$$ y = [85, 91, -103, -101, 83, 95, -50, -68, 41, 51, -33, -55, 10, 51, 1, -47, 9, 45, -36, -62, 45, 53, -50, -30, 65, 43, -66, -58, 57, 64, -46, -60, 52, 99, -21, -102, 24, 119, -17, -107, 24, 118, 10, -97, -16, 94, 11, -64, -9, 67, 37, -58, -26, 54, 14, -63, -2, 66, -13, -57, 4, 53, -37, -77, 22, 77, -19, -68, 8, 74, 7, -94, -26, 106, 43, -95, -52, 102, 52, -93, -53, 94, 58, -54, -46, 31, 68, -14, -62, 18, 59, -16, -57, 27, 54, -32, -35, 51, 40, -62, -1, 64, 22, -58, -17, 54, 25, -56, -46, 54, 68, -46, -91, 48, 111, -50, -110, 51, 101, -43, -85, 36, 84, -18, -47, 4, 38, 18, -51, -21, 49, 26, -45, -11, 60, -10, -52, 21, 57, -38, -48, 52, 51, -55, -49, 40, 49, -29, -64, -7, 89, 1, -98, -32, 106, 25, -105, -26, 105, 27, -94, -9, 64, 19, -38, -27, 29, 33, -13, -40, 23, 41, -19, -26, 50, 25, -57, -20, 73, -15, -77, 13, 79, -9, -70, 1, 58, 11, -61, -42, 53, 64, -52, -96, 62, 87, -69, -91, 62, 88, -57, -62, 41, 47, -29, -19, 6, 29, 4, -32, -8, 34, -10, -47, 17, 47, -34, -38, 41, 61, -66, -50, 72, 38, -64, -34]
1937c4R0oq1m7Q9P8r2p4P2J11q6j42R8J18r0q7Q3O3p2m0M4L4k1k7K2K4j3l7K3
1966@M5m4n5Q4N2r0p4J10N5j03p9J02Q8p2r7O8Q4m3j02K3J26j3j05j7R9J0j03
1993e1nR8Rq0LN3j3n5J8O2j1o9M4M1m2o9M6Q1j9r1K9R5k8j17qJ40J6j45nJ48L
2024G8j30j7J02L0q0l0O4M3n3n5J3P2j5o2M8O9r1m5Q9Mr4K7J16l2j07L1O3k0n6
2053c8j3Q1O2p2j05P6J03j04j19J26J35j27j03J08O6j03j5M9K3Ll8KRK4o5k1R7
2080D1%r2N2R9j08r5J27N4j17k3J20K7j10k3L1M7lo4j4J44Kj74k8J80kj65M9J45
2108A00o5j03N2L5l8J1J7nL3j6o6L3M2o9j6J22oj46L4J53r4j06Q4J04o0p3K9N1
2136C7qm2n8O3J07p0j26R7J25j48r3J30O2j12qQ6j9o8K6J5lJ8j2kN4l6r2Q5O0
$$ y = [-34, 56, 50, -31, -78, 11, 89, -3, -77, -5, 106, 20, -122, -24, 94, 4, -83, 0, 63, -9, -49, -5, 29, 8, -19, 3, 27, 14, -23, 0, 45, 1, -54, 30, 82, -8, -82, 28, 83, -20, -99, 3, 91, 19, -78, -10, 74, 31, -71, -48, 78, 65, -40, -57, 42, 52, -51, -56, 42, 51, -29, -26, 27, 14, -41, -23, 39, 28, -41, 3, 44, 2, -67, -21, 60, 41, -50, -21, 74, 46, -71, -79, 61, 77, -68, -73, 75, 78, -52, -69, 33, 63, -17, -47, 17, 60, 7, -48, -35, 37, 22, -40, 8, 77, -14, -59, 30, 34, -60, -33, 83, 51, -56, -25, 38, 18, -38, -51, 30, 92, 20, -85, -9, 94, -10, -129, -3, 132, 5, -98, 10, 76, -27, -42, 7, 30, 33, -5, -3, 6, 30, -35, -56, 41, 41, -51, 1, 100, -8, -103, 24, 78, -39, -62, 58, 85, -25, -48, -17, 30, 27, -37, -51, 93, 95, -79, -107, 73, 71, -94, -45, 100, 35, -68, -16, 19, -19, -8, 9, 4, 37, 21, -45, -12, 30, -39, -55, 67, 61, -85, -51, 102, 8, -98, -14, 90, 30, -43, -14, 37, 29, -13, -71, -8, 99, 29, -97, 0, 125, -23, -116, 14, 76, -36, -44, 42, 23, -45, -19, -4, -7, 11, -1, -3, 51, 15, -77, 8, 68]
2165F8j00n8J47N4j71l9J41Qp9j6O8K9m1p1MJ08j3j02J0J41k4j36K7J10n5o7N9
2192BM0n3j8L6Mj6k1J9M5Jo5JR0k9j36P5J32p5j09N5J10o0j08M2R0j2o5j7P9K9
2222F6j11m1J14N0r6k1P4J6q6JN7pk7LK5rl1qO4Lo8j8R2K1r7l4J10J7j00l7J12
2253C4M9r6o1P2P9q1o9N8R8n7r4N0P9n6o9O5M8n0l3L3L1l4l5N7J9n8k9N1N5o9
2283a3o4Q6O9q7o9Q4O0n2p8M5Q5l5r3K6R5qr9j2J20Lj13J6Q3j8n0qO0k1m3J5N5
2314C9k3l6oO4kq8J4R3k8r5K3J12l3j10L8J05l0r1K3O1K2p4m8Q5N6q4n4P5O2p2
2344bn6P1K8m5k6M2Rk9j9L2K6l9k4N4K6o5m2Q0M5j10k5J00L5j09j9Q0N1q6n0O8
2374AN4l8p2L7Q1l1j02M5Q2m2o5M2N5n2l7M3J3j9k3L7J4k3l5J9O2m1p6N4Q7n5
$$ y = [68, -32, -90, 57, 111, -60, -99, 42, 50, -29, -45, 23, 52, 11, -60, -56, 52, 39, -63, -53, 88, 64, -72, -45, 65, 10, -57, 2, 42, -11, -29, 7, 11, -5, -26, -7, 38, 39, -26, -25, 65, 36, -100, -25, 107, 32, -77, -22, 88, 28, -80, -38, 52, 40, -25, -42, 37, 66, -45, -86, 28, 78, -18, -39, 35, 51, -35, -34, 23, 16, -11, -8, 17, 8, -23, -31, 33, 36, -32, -50, 42, 63, -34, -68, 42, 59, -41, -78, 34, 83, -13, -74, -2, 77, -4, -73, -15, 83, 26, -68, -18, 61, 5, -64, 1, 49, -1, -34, -1, 30, -4, -39, 18, 37, -21, -50, 1, 56, -13, -77, 9, 78, -9, -78, 6, 66, 14, -64, -19, 66, 31, -62, -36, 59, 51, -48, -60, 60, 63, -50, -34, 49, 31, -19, -27, 33, 12, -31, -16, 39, 16, -20, -26, 38, 36, -52, -38, 55, 27, -68, -45, 67, 34, -76, -38, 67, 37, -54, -31, 30, 52, -22, -70, 15, 71, -13, -67, 8, 70, -2, -58, 13, 41, -4, -30, 12, 21, -8, -27, 5, 31, -8, -32, 22, 48, -17, -59, 21, 66, -44, -69, 31, 66, -43, -62, 18, 69, -17, -67, 1, 55, 17, -55, -18, 63, 32, -70, -25, 57, 15, -50, -8, 47, -5, -42, 1, 14, -5, -28, 9, 23, 0, -35, -16, 46, 5, -71, -17, 70, 15]
2404A5q7N9Q4o7p6M5Q9m0p5QQ3Mr0rR2Pp4j6Q1Mo8KN7j6l5J5K3lm2J8M1j0n0K
2438b9N1Pp9RQ3Jr0J0R4j1q5j1Q4J2o0l5O1L5n1n0M8N4n0m7O1L6n2l7N0K7m7k8
2470c9N7Kl4j4N1Mm0l3O2K6o4k6O3M0p3m7Q1M3n5o3O3M4l7o3L7O7k1o6K2M9k3
2501A3m7OO7j9m3J8L0k1k6OM2j5m2M0K9m0n0M0O7n2o0L5Q5n2n3OO0po2PP6J3p1
2534b0k2P5Lo6j1P7om6j1K8Ok2rM1%k6kK9%m4mO0No2%O4j4n4lP0Jo7lN2Pm9l3
2571e6M0O6l8n5L7N2m5n3N2L7n0j9M4J2l7LRJ5j1k0J8L4k3n0K8M6l6o8R2M7p6
2602eo6Q4L6n3l7M1M2k6n1OM5J5o2rR0k3o6RO6m3k0K8K8k9nK2kl1JK2%J2m3ON8
2637D0rp0KQ2j3q5K3R1l6o3K3K4Rk5j0K0M1m7n4M9N2m8k4N0J6o9J2N3l0j7K3J9
$$ y = [15, -72, -13, 71, 4, -72, -27, 62, 22, -53, -45, 38, 42, -48, -57, 35, 42, -32, -48, 33, 37, -31, -29, 28, 12, -23, -8, 15, 12, -30, -12, 29, 19, -31, -29, 22, 29, -50, -41, 42, 43, -47, -37, 57, 46, -39, -50, 34, 46, -14, -49, 12, 47, -4, -54, -6, 48, -2, -49, 12, 48, -4, -41, 9, 36, -11, -39, 18, 20, -14, -28, 23, 27, -13, -46, 16, 42, -22, -48, 15, 55, -18, -65, 16, 59, 4, -59, 4, 48, 11, -52, -15, 52, 31, -35, -13, 36, 13, -34, -28, 39, 20, -23, -5, 25, 4, -22, -16, 26, 11, -31, 9, 38, -2, -52, -12, 55, 3, -57, -22, 63, 11, -42, -36, 24, 17, -45, -38, 38, 51, -20, -42, 33, 36, -30, -41, 36, 30, -16, -27, 1, 7, -15, -24, 17, 17, -9, -11, 18, 18, -26, -30, 30, 35, -27, -27, 37, 23, -31, -34, 36, 37, -30, -33, 19, 26, -23, -56, -16, 50, 12, -43, -6, 46, 1, -52, 0, 37, -13, -32, 12, 24, -13, -10, -1, 14, 3, -17, 1, 35, 12, -38, -10, 36, 0, -68, 24, 71, -5, -71, 13, 49, -4, -41, 0, 42, 16, -35, -29, 16, 31, -31, -40, 50, 27, -39, -30, 36, -7, -27, 1, 29, 0, -5, 17, 15, -16, -15, 7, 7, 19, -24, -18, 40, 31, -39, -37, 45, 32, -53, -30, 61, 25, -38, -15, 9, 18, -7, -17, 3, 44, -3, -57, -8, 44, -4, -28, 22, 38, -31, -19, 34, 4, -13, 10, 29]
2669B9k6j4MJ7Lk3j2L7L5p0j6N4K8o8k7P6%n5KL4K3l1k8J4K9J2m6jN5k5m3J9M5
2702C1l1k6L9J5n0ML6Ol1rK4K8l7l2L6L8l1m2K9N4l0q1N2M8l1l7K0L7j1n0J8L4
2734B0Ml1qM4%m3mL7j0k8J7K8j6k4NL5j4l6J6M2ln4jN8j1p2L0N1Kn9KN2ml7j3
2769b5L0J0j5k5J7L5l1j6K9J1k6OPJ4m0kK9Kj8nK8Kk7lL3K6n1l6O4J0m1k8M1L3
2803C8m0m1M0L3k3l8K1M3l7k5J3L6j9k0K0J6j6k8K8K2l2JJ6J2j7k0J9K9l2k7J7
2834a1M4l0m0M1M2k7m1RL2Jm4lM7Lm8OL8Ol7j0L3Ok9QJ5ql3K3L6k3k7K7J2lk9
2869a4jL5Km2OL0Om8MN0%o0PM2kk5rJ4K2j9l0K8K8k4l2M2J9k3k3K7Ol2J2K6qk4
2905a0j3L2J8k9qJ2L1l0k8K6M1m0m8N7L0m3k2L4J5j7j7MJ9pk4J0K1nk5OK5j4r
$$ y = [29, 3, -11, -7, 10, 13, -10, -22, 15, 50, -20, -36, 18, 46, -22, -49, 27, 27, -28, -26, 8, 31, 0, -28, -14, 15, 27, -19, -20, 35, 10, -33, -14, 31, 0, -26, 13, 28, -22, -18, 18, 24, -7, -16, 8, 36, -1, -33, 3, 41, 10, -32, -3, 51, 21, -60, -8, 40, 9, -28, -8, 29, 18, -32, -14, 20, 24, -7, -15, 29, 29, -14, -18, 19, 9, -19, -2, 26, 10, -14, -9, 26, 12, -24, -8, 34, 31, -23, -24, 34, 23, -49, -19, 32, 34, -25, -23, 29, 25, -12, -25, 5, 15, 0, -25, -8, 27, -4, -20, 9, 20, -6, 0, 7, 21, -19, -21, 8, 10, -8, -13, 15, 17, -10, -13, 20, 46, -5, -41, 23, 33, -8, -36, 5, 38, -2, -43, -3, 30, 7, -31, -10, 33, -4, -29, -16, 20, 1, -19, 1, 17, 1, -27, 1, 23, -9, -8, 8, 20, 3, -17, 2, 31, -1, -28, -11, 33, 3, -37, 4, 46, 19, -22, -13, 19, 20, -24, -27, 20, 23, -25, -19, 19, 25, -12, -22, 11, 17, -12, -4, 11, 3, -30, -7, 29, 6, -21, 6, 18, 15, -14, -15, 20, 22, -20, -14, 16, 22, -26, -22, 28, 28, -32, -25, 17, 15, -10, -19, -5, 17, -2, -32, -4, 24, 0, -32, 10, 29, 6, -17, 10, 16, -16, -4, 22, 14, -10, -23, 9, 27, -2, -10, 2, 33, 3, -25, 1, 42, 2, -46, 11, 41, -2, -24, 10, 25, 8, -9, -5, 14, 7, -17, -7, 14, 9, -16, -10, 15, 1, -8]
2938hJ3J9k8oJ2J7k4j1J1K0ll5J0M0kn5K2L2Nn2nM2Km1NM4j4j8oK2Pj4k6L2Mj0
2974Aj3J6Rk5j1L8kl1K5RJl0LJ7J0k9%J9K0k9k2L6K6l4k6L2J8l2k3K0L4j1k4L
3008eK3ok5J0K0j0k6K4Rj7j6K4J5l8qM0Nj3k6K2J0j1l2K2L7j6m2J4L5j5l0J9K0
3041A3jk9oK5J0l4OL3Rl9J8J0Jk0j7L4qj7J3J8k2j3KL8rl1MK3Kl1kL4Ql8qK8K0
3078B4m0%K7Ok1j7K7J8j7j5kK8rl3K7J5k6lK1nqj2K6Pl6nK8Nj7j1K2K0l2k0L1
3113CK7l8k9L3J8j3k2J6J5j0j4NK1j4j1mK5Mk3J4Qmk2J2L2l7oJ4Nqj9K2J1qk9
3148b6LK6K1m8j2M7J4n2PL3Kk9QJ7lj7j3K4J4j4k1J8K1j8j8K6%k4jJ9Mk0J5J2
3182A5nk4PRJ0k4j6K8K1l5k2L3K2k2k3L5J4j7j8MK8j9qmJ5Qj9QRj0j0J8Rj4j8
$$ y = [-8, 5, 24, -4, -10, 2, 19, -5, -16, -5, 15, 12, -23, -13, 27, 25, -30, -8, 24, 29, -23, -28, 14, 16, -25, -20, 24, 10, -8, -14, 8, 15, 1, -25, 7, 11, 1, -12, 4, 13, -12, -23, 15, 13, -18, 7, 16, 17, -13, -10, 7, 17, -12, -12, 7, 27, -2, -24, 12, 38, 4, -22, 10, 28, -4, -27, -7, 27, 16, -8, -5, 18, 12, -13, -3, 17, 7, -19, 5, 14, -3, -19, 5, 20, -18, -26, 14, 19, 6, -20, 2, 12, 1, -31, -9, 28, 12, -30, -16, 19, 4, -26, -7, 13, 12, -17, -23, 2, 12, -22, -16, 17, 26, -13, 5, 15, 16, -4, -21, 13, 5, -12, 1, 19, -3, -16, -14, 24, 15, -16, -12, 11, 13, -18, -20, 14, 22, -16, -24, 4, 24, -16, -16, 11, 17, -4, -21, 6, 24, 7, -8, -10, 18, 9, -24, 3, 18, -8, -11, 10, 5, -3, -15, 11, 18, -18, -23, 5, 10, -7, -18, 4, 24, -8, -28, 3, 30, -8, -37, -4, 14, 1, -21, -5, 10, 0, -14, -9, 12, -2, -13, -17, 8, 12, -11, 3, 11, 7, -15, -3, 29, -8, -14, 0, 5, -3, -22, 0, 11, 3, -26, -23, 3, 24, -24, -36, 11, 25, -27, -20, 13, 15, -14, -6, 11, 8, -9, -22, 2, 16, 2, -19, -1, 20, 2, -16, 10, 10, -14, -15, 4, 8, -12, 3, 15, 10, -14, -7, 2, 12, -12, -28, 0, 21, -14, -36, -3, 19, -3, -26, 9, 23, 6, -12, -8, 20, 1, -7, -11, 4, 12, -7, 1, 10, 0, -10, 8, 17, 3, -15]
3217a5J5J1j9pK1J0k1qK4J3j5k4J5J5jk7oL4mk3j1L0J8m1mK2%j3JJ9%k3NJ6lq
3253dLJ9j9j7J3K8k8j9RL3j0j4j0K2Qj9qK1J1k8j3L0J5k6j3J7J5k1JQJ3mk2OR
3288Fj5oJ7J1j1oQJ7k3j1L1Kk7pK1J3k3k0K4K1k7rJ3K7rl4J8J2nlj5J5Pj4lJ4
3324INj8mK7j1nkK1j5j2%J7j0j9J5J1mrJL6j4k9LK6Jl0rK9J5k9rK4Mk0JOJ1j3
3362@j1NJ5j4nJ8%j0j0L2kk9KJ4nlj0K0Knk5K7J8l1j8K4K8j7l1J9K0k1k5J0L3
3397A5j2j8%K0lj8J0QnrOK1j5lPJ3j6j2J4J4nl2J9K4k8JpK8jl1oL8Jk7mK7kj6
3435dmJ0kj3J1QLpmJLj6RJ8Lj9j5L8j6j8PK0Jk7PJ7Pl1KKK7j3k2K1K4k5j4J8P
3474A4k3kLK7j9j0MRkj4J5Ljj3RJ0mj5J3J3ml4L1Qj9p%K0ok9QK7qj4OK0Ml0kL0
$$ y = [-15, 0, 11, -8, -15, 6, 16, -5, -13, 11, 24, 9, -15, 0, 15, 14, -13, -19, 15, 11, -12, -23, 7, 25, -16, -20, 2, 2, -11, -10, 9, 9, -14, -9, 7, 4, -4, -1, 18, -1, -18, -5, 23, -5, -24, -15, 18, 8, -6, -16, 6, 14, -5, -13, 8, 19, -9, -22, 8, 23, -3, -16, 1, 16, -5, -4, 4, 17, 13, -9, -3, 6, -9, -15, 2, 13, 2, -4, 4, 21, -2, -13, 18, 20, -7, -14, 7, 20, -3, -23, 1, 22, -5, -14, -1, 26, 17, -17, 1, 13, 8, 5, -10, 5, 12, -2, -5, 9, 14, -4, -8, 19, 8, 3, 1, 22, 7, -5, -5, 12, 2, -17, -2, 9, 5, -4, -3, 33, 19, -10, -7, 19, 20, -10, -19, 10, 25, -4, -13, 11, 15, -5, -4, 2, 13, 0, -11, -6, 9, -5, -10, 8, 8, -2, -12, 20, 18, -11, -9, 5, 0, -3, -13, 7, 9, 4, -21, 6, 24, -7, -25, -1, 27, 10, -21, -2, 18, -3, -28, -18, 15, 3, -15, -15, 5, 2, -16, -6, 2, -3, -12, -6, 15, 0, -3, 4, 17, 1, -11, 3, 17, 12, -20, -1, 23, -5, -4, -11, 17, 16, -15, -21, 17, 18, -9, -13, 14, 12, -4, -8, 2, 0, -13, -2, 6, 9, 2, -2, -1, 2, -14, -5, 13, 16, -3, -18, 20, 4, -14, -7, 13, 14, -13, -6, 11, 18, -13, -11, -9, 18, 5, -17, 4, 28, 3, -11, 7, 14, -9, -11, -8, 19, 0, -10, -6, 3, 1, -13, 2, 5, 4, -9, 0, 10, 6, -9, 4, 17, 13, -21, 10, 18, -1, -8, -8, 12, 6, -23, -15, 12, 4, -10, -4, 16, 20, -10, -12, 18]
3514A8oj7PJLj1kJ7nj4J7rPk4J5K1jk8PJ7kj1kK4rk4%K3Mk5j0K8K1l2j9J3K1j0
3552CqQJ4j4pRJNj0NPk0j3K8Mk7mK9jnj8J4K0l1nJ6K3k2j7J4K8k5j5J8J3mk0Q
3590AJ5%l9J4J6%j9J0NOj8OK6k2j1J2Okj9RJ9j2k0J0K3Jk4rL3Qk7pK9Ll9pK4Q
3628Ik2nK9J3k7j2K1%lj9J2J6pk2K5j0j6RK3Ml0LOJ6k6kK2J0k7rK1J7j9j7QL0
3664B1k5j6J6K3j5k7J4K6j7qmK8j0k0OJ8Nk5LK5rk3J2J3j4j7K0J8k2j7J1K1pk6
3698b2RK5Nm2J3K8%l1jL6kk2LQlj6lK4Mk1qK3lj5j2L1Kl0J0K6pk4MK8Ml6LK9l
3737A4k7rK5K2m2kL4Pk6j5J9K4j7k1RJ5j8PLMj3%J2qnpK3Pj5l7L8K0k5j2K5Lk7
3774a5j1K7K1j8k4J5L5k8j3mL1j2j7J2J5nk0J4J7k7NKJ2mj4OQmk5KL8j0k5RL5
$$ y = [18, 12, -5, 2, 3, 6, -5, -7, 10, 5, -9, 8, -1, 6, -18, -3, 18, 17, -11, -4, 13, 11, 0, -2, 22, 13, -11, -11, 12, 16, -9, -19, 9, 30, -2, -21, -8, 13, 3, -5, 3, 17, 3, -4, 5, 6, 11, 1, 6, 13, -7, -20, 8, 12, -15, -19, 10, 9, 4, -14, 0, 20, -11, -16, 0, 23, 1, -16, -2, 26, 1, -14, 4, 17, 13, -7, 1, 16, 16, -23, -9, 7, 7, -12, -2, 3, 9, -9, -3, 23, 1, -10, 2, 8, 6, -13, -4, 15, 3, -17, -7, 16, 17, -7, -16, 17, 25, -2, -9, 20, 23, -16, -23, 1, 9, -13, -18, 11, 24, -3, -15, 6, 6, 3, -16, -4, 12, 5, -17, 8, -2, -18, -9, 14, 18, -12, -9, -3, 13, -13, -15, 7, 17, -10, -19, 2, 19, 0, -17, -9, 21, -4, -20, -4, 19, 4, -23, -9, 17, 0, -8, -12, 16, 6, -14, -8, 10, 15, -10, -7, 18, 9, -14, -2, 11, -3, -20, 0, 18, -4, -21, -10, 11, 4, -22, -13, 12, 17, -25, -12, 16, 16, -15, -16, 20, 18, -4, -1, 7, 4, -12, -15, 9, 13, -8, -16, 7, 4, -11, -23, 8, 10, -20, -10, 16, 9, -15, -11, 17, 21, -15, -12, 17, 14, -13, -22, 3, 25, -17, -19, 15, 22, -4, -19, 0, 24, 7, -14, -5, 10, -8, -1, 2, 6, -7, -7, 5, -3, -8, -15, 8, 15, 0, -37, 1, 21, -4, -16, 9, 12, -15, -26, 1, 22, 4, -20, -5, 30, 2, -11, -15, 16, 4, -13, -1, 14, 9, -11, 3, 20, -7, -2, 0, 12, 8, -6, 0, 8, 4, -21, -19, 19, 9, -16, -7, 28]
3809B8k2k9OL5ql3J9L0j2k8JK7J2k9j4K5Ok4j1K0Rj4j1K5knj5J6J5l8J7J6ok0
3843a4mJ8J8l4oL9%k9qK6Kj3qK4J2j7k8K5J8kl6J1L0j7k0J0J5j2j7QJ7nj1J2J0
3878A4k5NRJ6l1j6L5J6k6l2K8L5j6l1J3K4j7k3QL4j6k0jK8lk8LL1%l1J1K4j5k4
3912b1J8J7mj4qK4Ll1J9J8j0k7lL4lm0J8K6%l5LK1J0k3j6K5J9j5k9K2K3l0j3K1
3946aJ4j5j2J6J0j6qK1kj8mJ4K5l3KJ7J3k4j3K0J1j7k6L1L0m8k6L6J8rj9PK9j8
3980Ej8LK1kk7J5J4lk4OK7j2k3K7Rk1k3J4L6l4j6K4K4ol6J0L4j1l7PM6%l4oK8
4015A7kk6j1L3Nk6KK8j2j8mJ9Jj3MJ1lj3pK4jk1NK7ll4pM1%l8nM1Qk7k8M1K2k0
4053A0l4K7J3j5j9K5Rj8j7J6K6k2olL0k0k4L1Rj7j3J8J3k8rL1J5k5k8J5L8l2j9
$$ y = [28, 6, -23, -17, 18, 10, -23, -4, 26, 14, -14, -13, 14, 26, -3, -17, 8, 14, -10, -21, -1, 8, -6, -17, 8, 6, 1, -14, 2, 17, -21, -4, 12, 6, -14, -18, 0, 18, -16, -22, 17, 17, -12, -20, 6, 8, -5, -13, 11, 23, 6, -22, 3, 21, 19, -17, -6, 24, 7, -13, -3, 12, 0, -17, -9, 8, 3, -8, 4, 14, -11, -6, 3, 19, -12, -28, 7, 23, -3, -35, -7, 28, 12, -19, -6, 18, 1, -22, -14, 20, 4, -16, -17, 11, 8, -20, -17, 14, 14, -17, -6, 18, 3, -21, -3, 14, 10, -4, -12, 12, 15, -16, 3, 21, 11, -16, -19, 15, 12, -28, -10, 16, 16, -19, -16, 5, 15, -8, -24, 1, 20, 5, -24, -2, 21, -9, -22, -1, 13, -2, -14, 2, 12, -4, -12, 9, 7, -11, -15, -1, 24, -9, -7, 10, 23, -1, -14, 6, 17, 0, -26, 5, 35, -13, -39, -3, 15, 6, -13, -6, 23, 5, -13, -10, 11, 9, -18, -3, 11, 8, -16, -10, 17, 5, -18, 9, 18, -3, -26, -12, 24, -10, -26, -2, 22, 16, -20, -10, 24, 13, -24, -17, 29, 29, -5, -11, 17, 15, -11, -22, 11, 16, -10, -8, 20, 8, -10, -14, 5, 6, -7, -3, 8, 5, -8, -15, 9, 8, -13, -8, 19, 16, -18, -25, 16, 16, -22, -27, 14, 22, -5, -33, 8, 30, 10, -24, 3, 16, 1, -18, 7, 16, -2, -19, -3, 23, 1, -5, -8, 22, 2, -22, 9, 18, 1, -12, 6, 19, -9, -18, 13, 28, 3, -25, -10, 28, -4, -23]
4086b3K4K5j3l3K4J1kk8PL4j1m3J6K3mk9J9J3oj1pL3j8j7NL2j4l7J8L2j2k5NK6
4120A4nl7J9K9j1k2KK7Kk6kK6J2m5mK3K9l6k4L7J6k5j4K6j3nmK6lj4qJ0J2j8j4
4155b0K8J8l3nK5J0k9j7K9J4l8%K3J0k6j4J2L5j7k7J0K1ml2J3K2Jj8J1J3k5nK3
4188HKj5j5J7J5qk3J8K4j1l9J9L5k7m5L5L0k3j7J6K6j8j5kK4Lj8j1K0Rk4KK1M
4222A7k9J2J2pk2J1J8lk2jJ9Jj0qK9Ll4PL1ll4lJ9K0k7k2L7Rk6mJ8Nj6pRJ2qk1
4260a8K7j2%pK1oj1KJ6mk1QJ0Pk1j2K8Rj9j8L1J3j7l1K2K8k3j2J0J2rj4lK8kj9
4296gRJ5pl2K0J3kl1J7K6j6j3J1Rj0j3J7Ork4J6K4j8j6J3K4j3l5J8J7Pl2%K7O
4331A7k1j1K7Nk2oJ7K1l5kJ0Mj0jJ8j4llK9ok7lK8jk7kK9J6m0oL0Rk7oK0mqoJ1
$$ y = [-23, 1, 26, 13, -20, 4, 15, 13, -15, -8, 26, 15, -28, -12, 11, 7, -22, -3, 10, 4, -7, -14, 19, 1, -16, -11, 21, 7, -30, -12, 20, 8, -17, -12, 14, 9, -28, -9, 20, 9, -13, -11, 16, 18, -8, -10, 16, 28, -17, -21, 2, 31, -5, -29, 8, 24, -1, -15, 11, -2, -7, -11, 15, 12, -2, -10, 0, 12, -6, -20, 8, 26, -7, -12, 13, 23, -6, -23, 6, 20, -18, -18, 5, 15, -11, -25, -13, 22, 5, -22, -12, 9, 5, -27, -14, 8, 9, -9, 2, 15, -10, -15, 8, 10, -5, -20, -3, 12, 4, -19, -1, 23, 12, -27, -8, 27, 0, -45, -10, 20, -3, -20, -4, 22, 4, -11, -13, 11, 14, -4, -15, 5, 14, -10, -8, 13, 17, -12, 0, 12, 5, -17, -6, 12, 9, -13, -14, 5, 6, -4, -12, 17, 20, -14, -7, 24, 21, -13, -16, 3, 23, -4, -26, 11, 20, -6, -10, 8, 13, -3, -10, -1, 11, 3, -18, 9, -3, -3, -10, 11, 5, -6, -4, 12, 8, -13, -5, 5, 12, -9, -21, 7, 16, -3, -21, 10, 23, 6, -25, -3, 25, 2, -10, 0, 12, 3, -11, -14, 14, 12, -7, 2, 17, 10, -22, -2, 11, 9, -22, -5, 21, 5, -8, 3, 12, 2, -11, 6, 12, 3, -21, -5, 19, 1, -15, -2, 22, 9, -26, -8, 9, 16, -16, -16, 11, 17, -4, -15, 12, 17, -5, -11, 6, 27, -8, -10, 0, 4, -6, -7, 11, -3, -6, -9, 20, 14, -13, -16, 12, 11, -16, -18, 11, 27, -13, -19, 11, 20, -7, -13, 7, 3, -5, -11, 0]
4370@Qkj7J1K1j2j8QJ4mk3J0J9k2mJ5J2k3kOJ6j8oK0J6k5j0RK4k0k3J9K4j6l2
4405b5K0K3j9rmK7jj9JJ1jrNJ5Lk9K2lj4LJQqj1PK1j5j5QK7j4k6J5J9nm0K5K4
4443A8nl3ML1roqK7jj0k1J9Pk3lJ2LqjJ4jj8PJ3pj1QNLk4RJ5Nk0j7L5K0l6j1K8
4483A0oqj5K3J0k1N%J6rj9J9Rj9QkQk0OJ9Qk4lPK0k5j2J7J1j5j0J9Kj6j6K6J5
4520A8j2k8J0L0j7j7RK5j3q%J9kk7K1%Lj3LJ1lnkK2k7oOJ2kj6MRRk8K0MJj3j4
4559a7L1jk4jK3J2k1j5J5jmNj0J7pmONj3OJ1kj3KjJj2nL6ok2KJ4Oj8j2K7Mj2j6
4599a4J8J2j6oRQj2j3J5Lpj5J5J9qk0QRrpK2%j6k0K8Nj3oQJ9j2j1PJ8k7j7K1K0
4637A5qk6J3J7j1olJ5pp%J5lnJ5n%j9KK5Mk7J1Nj2oOOlplK4jj7nK6jm4J8K8ok0
$$ y = [0, 8, 6, -11, 0, 21, 9, -9, -1, 13, 9, -14, -4, 15, -7, -11, 4, 16, -7, -9, -3, 13, -5, -11, 9, 25, 0, -10, -1, 23, 3, -20, -1, 23, 7, -25, -5, 18, -1, -10, -14, 13, 12, -7, -6, 5, 4, -5, 0, 15, 18, -11, 11, 8, -6, -3, -2, 6, -2, -13, -6, 15, 0, -15, -7, 20, 6, -20, -5, 14, 9, -31, -6, 18, 13, -20, -16, 15, 6, 0, -8, 19, 18, 8, -13, 6, 13, -10, -13, -1, 2, -6, -7, 7, 6, -12, -5, 8, 1, -10, -2, 3, 6, -18, -9, 6, 11, -9, -26, 9, 29, -7, -18, 10, 4, -4, -19, 4, 14, -7, -2, -2, 14, 5, -14, 5, 14, -5, 3, 1, 9, -11, -5, 14, 22, -2, -5, 2, 22, -3, -15, 2, 13, -2, -12, 7, 9, -7, -23, 3, 18, 6, -22, -12, 18, 1, -16, -7, 18, 5, -3, -3, 16, 14, -13, 8, 8, 11, -2, 1, 12, 9, 4, 2, 24, -3, -9, -3, 9, 7, -9, -5, 4, 13, -15, 5, 9, 10, -3, -17, 14, 13, -11, -12, 11, 23, 2, -13, 2, 1, -3, 2, -8, 9, 2, -2, 4, 9, -4, 2, 13, 11, -2, 0, -1, 0, -12, -17, 19, 13, -9, -7, 7, 13, -5, -17, 10, 14, 2, -14, 4, 16, 0, -6, 3, 11, -1, -14, 1, 4, -3, -18, -3, 16, 8, -12, -4, 5, -4, -11, 11, 11, -5, -25, 3, 8, -5, -11, -3, 16, 4, -7, 0, 18, -9, -26, -5, 15, 7, -19, -6, 11, 0, -6, -9, 6, -1, -8, -8, 7, 4, -1, 14, 9, 9, -10, -8, 17, 21, -6, 5, 10, -2, -8, -2, 4, 1, -6, -9, 15, 14, -3, -8, 18, 17, -27, -9, 19, 13, -7]
4679glJ4Nj5lJ7Jqj0J0J1j3%KJ1j8%Q%ojJ9Nk6LJ8lk1KJ6J0k1rJ3J2j3j3J3J0
4718A0j4mPJ2jk0J2Prj1J5jpKNMj4qK4Lk0KJ1Pj5oJ9Ok0rJ0J9rk1J7J6j5k0J4
4757bJ6Nl4OQmj3PJ9J0j9oJ0Moj%Rj3%J9k1qK0lj0j2RK0mkrJ9jk4KJ1J5j9KPP
4799A4j9nJ0J5nj6PJ1j2rOjmmJ3Nj3KJ6Lok1K0Jj3jONj6%K2Jk0nJ9JqoKJ4j4p
4841a2LK0j5OlKNj9J3Oj1mpK3prPJ5j5oPRok2K3NMk4KL1ok2kK6j2qOKjj0JlJ8
4884A0j5%RNj8NK0rj2kJ0oj9J2K4rj1jJ9nj4j1L0oj1lJ5Pk6%J6J2k5PJ2l%j7J6
4923FnMj3J0LrLJ7nmj5MJ1j9jJ7Pj6oRK0k1j7J5Rjj9QK2oj1nJ3qNL%%j6NJ1j1
4965flRKmlOqJ3j4J2%lpJRmqoK5j7mKK5j0j7QRKj5LJJ4j5nJ4JmQnk%j1J4J1l3
$$ y = [-7, -10, 4, 9, -6, -9, 8, 9, 1, -9, 1, 12, -1, -1, 1, 12, -6, -6, 2, 2, -4, -5, 14, 19, -7, -4, 14, 11, -10, -8, 8, 18, -3, -12, 1, 13, 0, -13, 0, 10, -4, -8, -1, 11, 10, -10, 2, 9, 0, -11, 4, 3, -4, -2, 3, 7, -7, -15, 9, 12, -8, -6, 5, 12, -3, -9, 10, 16, -4, -13, -3, 16, 7, -14, 3, 19, 4, -16, -2, 14, 19, -15, -9, -1, -5, -18, -11, 8, 18, -1, -7, 3, 7, 1, 0, 0, 9, -4, -4, 15, -6, -14, 6, 3, -7, -19, -10, 10, 6, 4, -5, 14, 13, -11, -9, 2, 17, -2, 0, 7, 14, -5, -10, 0, 15, 10, -6, 1, 12, 0, -9, -3, -4, -8, -12, 1, 6, -7, -5, 11, 14, 8, -13, 7, 8, -5, -6, 0, 5, -11, -11, 11, 12, -8, -13, 6, 7, -1, -7, -5, 9, -5, -12, -9, 11, -4, 2, -1, 1, 6, -13, 0, 6, -5, -9, -16, 7, 0, -9, -2, 13, -2, -8, -1, 8, 2, -20, 3, 8, 12, -12, -10, 21, 15, -7, -9, 17, 5, -3, 3, 5, 4, -6, -5, -8, 10, -5, -5, 4, 9, -9, -4, 16, 7, -5, -7, 3, -3, -22, -10, 14, 5, -6, -7, 12, 7, -7, -18, 12, 6, -5, -8, 7, 14, -12, -12, 4, 16, -9, -2, 10, 7, 7, -10, 6, 1, 5, -8, 2, 5, -4, -1, 16, 11, 7, -8, -4, 7, -12, -13, 4, 11, -5, -11, -2, 18, -3, -20, -5, 4, 3, -16, -8, 14, 8, -3, -8, 5, -3, 2, 5, 5, 5, -11, -6, 5, -6, -9, 0, 2, -2, -5, 1, -7, 6, -8, 4, 4, 1, -6, -5, 4, 0, -8, -14, 11, -6, -10, -8, 17, 7, -10, -2, 7, 9, -6, -3, -2, 12, -3, -8, 6, 7, 3, 11, 6, 4, 4, -7, 7, 18, -15]
5010a5J6%Pj7nL0j5rkJ5Pj2rJ4Lj6mKK6j1k2K2J7j1j0Njoj3RJ7j5jRNj3mJ7%j2
5050bKJNj6JRmPnJ3jkj1NNJj5J1lj1MqQRj0mK5k2j4K5jkjlLkQmRj4nJ6j0kj1M
5096a2J6Kj8POKlnJ5qknJ3Ok1lJ2Rj6JJ3PprMmlOLklj7K7j1qRR%omJPpj6J3Rp
5143@qQQj4k%POkKRk2NmLJ9j1LmK%NqmMqJ4j2PnJ1j1%L%qLqJ1mj1J1NnlJLLkn
5193hQJ0pj7J7lqJ1%pJkJ4omoJ6poLKl%jkJ4lj7J0Njj4J5kjoM%mLPqJ0pKlKj1
5241a0%PNj3J4kLm%k%oQkj2J4mOmpMJ1jj5J0JLMj8PmJjJ3j2R%J1mj0OonJ2jo%
5288@j0J7kj1JNQpjkj3J4nRjLlj6J8KpOKrNrNNkmNJJ2j8Ojj3JJ3j0Mo%lOKOKj0
5337eKJ0qj0J1jPj6K1rj0PkMMj2%kMlPrJ1%MolRqMOkj2J8j0jlKkJ1j5KLpJ2pk
$$ y = [-15, 1, 1, 8, -9, -14, 16, 1, -8, -10, 5, 12, 0, -9, 5, 8, -8, -12, -10, 16, 5, -17, 5, 22, 11, 1, 6, 5, -1, -14, -5, 12, -3, -4, 5, 10, -3, -7, 10, 10, -2, 0, 1, 6, -10, -9, 0, -4, 3, -2, 11, 10, 8, -3, 2, 7, 8, -7, 4, 1, -10, -6, -14, -6, 3, -7, -11, 14, -8, -22, 3, 2, 0, -1, -4, -1, -3, 5, 1, 10, -4, -9, 7, -3, -5, -16, -12, 4, 6, -12, -5, 1, 3, 0, -5, 10, 2, 0, -5, 8, 14, -7, -10, 2, 11, -5, -4, 9, 16, 9, 0, 4, 0, -3, 3, 6, 4, 1, -16, 11, 0, -8, 1, 10, 10, 4, 0, 1, 8, 1, -15, -2, 7, 0, -8, 0, 8, -6, -8, -8, -1, 5, 3, 5, 14, -8, -3, -7, -4, 15, 4, 7, 3, 5, 5, 10, 2, -2, 2, -6, 8, -4, 3, -2, 9, -2, -2, 1, 1, -7, -4, -12, -1, -5, -16, -5, 0, -5, -8, -7, -4, -1, -3, -8, 0, 10, 3, -14, 3, 0, -8, 3, 3, -4, -3, -5, 9, 3, -1, -7, 9, 2, -4, -1, 1, -2, -2, -3, -5, 9, 6, -11, -1, 4, 3, -11, 4, 2, 1, -5, -1, -1, -5, -2, 5, -3, 7, 0, 2, -1, 1, -10, -10, -3, 2, -11, 3, 1, 4, 0, 0, -2, -2, -8, 0, -2, -14, 0, -4, 2, -2, -9, -5, 6, 5, -10, 0, 1, 4, 8, -10, -3, -7, -6, -7, 6, -6, 3, 3, 14, 10, 0, 6, 0, -5, 7, 6, 0, 0, -10, 7, 5, -6, -5, 0, 8, 1, 0, -2, -15, -1, -6, 3, 2, 5, 2, -14, 4, 6, -1, 5, 7, -2, 3, -6, -1, 4, 2, -2, 3, 4, 16, -2, 4, 3, -10, -9, 4, -6, -2, -8, -8, -11, -5, -3, 3, 5, -5, -3, 7, -1, -11, 0, -1, 6, -10, 11, 2, -8, -1, -3, 1, 5, -7, -7, -9, -5, -8, -1, -10, 1, 1, 5, -1, -4, 5, -3, 1, 7, 5, -7, 11, 1, 0, -3, -1, -3, 8, -7, -5, -2, -9, 3, -4, -6]
5384fkKRpKnjJ4j0RMKj2J1olmQmj6QJMRlMJJj8RlQpMKPmj5J6j4OO%lknJKj0J0
5434@PkmRJj5Nj6J0pJ4lpJ4j2QqLjMkOjKlOj0OoJNlLkj4QRoRplJ0%j2J6nrJ5r
5483DPj2O%Mj2oRMLj2J1jknPj4Rj0ROj2J0kJ2j9NJ2nqPrO%pJ0LmNjlJokJ2j4N
5530Aj0J7pLqQ%MqJ4oj7J0KN%j5jJ1LOnmnJ5j0QqOmnNjKQqkJj2MOOpj0J5JnKj2
5579gKQojRJoQmJj6J4lpQmkJ4njKrnONmj3RJ8j2jKJ1j7RNj3MlJ1Mj4lPJ6qj2%
5627bOJljqJ1lkJ4rLjj9J3kqJ1J1k2JkMMpLJ7j2qJ5lqpRJ2j4QOPkj4NNnlm%j0
5674a3K4j1Qj4J2LKjj4LKJ4j0rJOj3J0jJ0qmPMnjlqkOOQj5JJ5j1qJ7lLj0mRrJ
5719eRJqnMkK3k5MJ2LrrjK1k0KJ2krLJ0Lj3j2J2Oj1mJ2KQj6J7qmkjKJj4J9rM%
$$ y = [-6, -8, -6, 3, -4, -2, -7, -8, 6, -4, 5, 9, 11, -1, 10, 4, 1, -3, 5, 1, -15, -7, -6, -2, 7, 4, 8, 9, 10, -8, 1, -2, 6, -1, 3, 5, 12, 8, -7, 9, -5, 1, 7, 7, 4, 2, -3, -2, 0, -10, 0, 7, 5, 1, 10, 11, -4, 1, -15, -5, -12, 2, -1, -8, 6, -6, 2, -6, -3, -4, 0, -2, 4, 3, 5, 2, 8, -2, 4, -2, -1, 4, 1, 4, 2, -12, -4, 5, -1, 8, 1, -2, 8, 8, -4, 12, 7, -2, 13, 4, 11, -1, 5, 5, 9, -3, -9, 0, 4, 7, -5, 6, 5, 3, -2, 5, -9, 0, -10, -1, 5, -7, 3, 1, 13, -6, -1, 11, 6, -2, 5, -4, 2, 2, -5, 5, 8, 4, 9, 8, 5, 6, 0, -2, 10, -4, 1, -9, 8, 1, 4, -4, 4, 4, 8, 0, 14, 8, -9, 1, 3, 8, 8, -7, -8, 3, 6, 12, 7, 3, -2, 13, 3, 11, 3, 9, 5, 0, 5, 4, 6, 14, 6, 4, 5, -7, -3, 3, 9, 2, -8, 7, 8, 3, 5, -7, -5, 3, -3, -4, 5, 6, 0, 8, 4, 5, -11, 3, 0, -7, 1, -3, -5, 9, 4, 3, 5, -4, -9, -3, 2, -2, -15, -6, 12, 0, -1, 1, 12, -5, 4, 9, -4, 0, -3, 8, 12, -2, -5, 2, 18, 10, -2, -2, 4, 5, 2, 1, -7, 4, 1, -1, 13, 4, 7, 6, -13, 0, -2, -10, 1, 12, -10, -9, -11, -7, -3, -10, -7, 10, -2, -10, 5, 2, -6, -13, -4, 8, -6, 2, 8, 15, 13, -1, 4, 9, 4, 1, -3, -3, -13, 11, 0, 8, -6, 6, 9, 11, 10, -4, -1, 1, 15, 5, -4, -3, 3, -10, 0, -1, 9, 1, -3, 4, 8, 3, 2, -1, -9, -11, -5, 1, 9, -6, -5, 10, -1, -9, 8, 5, 8, -2, -6, 3, -6, -5, 4, 5, -3, -8, -4, -6, 17, -8, -4, 8, 11, 2, -7, -8, 13, -7, -5, 7, 5, -4, -1, 9, 12, -1, -13, -1, 5, -6, -10, 2, 4, 12, -4, 13, 5, 1, -1, -2, 0, 1, -13, 6, -3, 1, 1]
5764AjRkj5ROMqjMjj1QJ1j7JMJ2k1J3mK%%JLj0j1K6j0kLLRj9jJ2q%j6J8Nnj5K2
5809HPk0QlJ2kj0nJ2rMoJ%K%LNqONj1J0j9J7JpLPqj3RK0j5j0RjjqkJ4nQpqJ9j7
5856eKoQkmMNlJjJ3j1JMj2lJ1N%j0mPPj3%RLnqPKLlj3J2oj0J5QqnJ0lklMNj8K
5905a0J3MolJJ0nLMmkk0K8jkk7J7%Kj2MK4j5j0QKmjnJLj8RJ4jjoJ9j6jJ2rMj1
5949hLJ2nllPJj4OQjrLJ2knpJ1%qONkmjNonpJ1Jj6J2OknN%mJ2j4J3j1nJ2lPrj
5998bJ2rLj0J4kj2JkOJ2poJ0j0joQlj1OQlJnJ3j0pJ7Nj8oJ8JrrPJ0pj3J3Opj0
6042a4J2J8j4qlJ2jOj6J4opLmJ3j1PKjj2QnNkj0K0jj0jJ0J3k2PLjoJOplqJ4%K
6086Cj6J6qjJNKKkl%L%KjjJMoj0nK9kj5jRj2Rj6J9Pk2MK2Kk0pRJ2Jj3moJ9qMn
$$ y = [1, 0, 9, 7, -8, 1, 7, 11, 3, 2, 6, 5, -6, 2, 13, -4, -3, 1, 13, -8, 5, 1, 3, 3, 3, 4, 7, -3, -14, 12, 2, 0, 3, 6, 15, -4, -5, 7, -1, -1, -17, 1, 6, 1, -14, 8, 15, -5, 3, 0, 12, 10, 0, -5, 7, -2, 2, -4, -3, -3, -1, -1, 2, 7, -1, 5, 10, -1, 9, -10, 7, 8, 1, 4, 11, 3, -10, -1, 19, 4, -6, 3, 2, 1, -7, -9, 5, 0, 8, 1, -7, 12, -5, -3, -9, -1, -3, -7, -3, 2, -1, 0, -1, 12, 1, 2, 6, -6, -9, 2, 7, 7, -3, -7, 0, 7, -6, -6, 3, 6, 1, -7, 0, 2, 5, 2, -11, 1, -5, -15, 0, 8, 0, -5, 5, 2, 0, -3, 1, 6, -12, -10, 3, 7, 1, -2, -1, 9, 4, 7, 11, 7, 5, -15, 13, 12, 10, -17, 0, 0, 2, -10, -6, 18, 3, -7, 1, 3, -1, -2, -7, -6, -3, -21, -12, 2, 1, 0, -6, 13, -3, -4, 8, -1, 3, -8, -5, 7, 2, -1, -4, 3, 4, -10, -4, 4, 3, -6, -3, 9, 7, 2, -5, 6, 6, -2, 4, 9, 7, 3, 2, 7, 1, -4, -11, 0, 1, -15, -3, 3, 1, -4, 1, 1, -3, 9, -5, 8, -3, -8, 4, 1, 8, -1, -2, 10, 1, 4, -6, 8, 6, -6, -5, -7, -1, 11, 4, -2, 8, -2, -3, -9, -1, -4, -15, -9, -1, -4, -3, -8, 5, -5, -12, 5, 10, -8, -14, 4, 5, -4, -13, -6, 4, -3, -16, -3, 3, -4, -14, -2, 16, 2, -6, -9, 3, 2, 8, -8, 6, 0, -7, -4, -8, 5, -6, 1, 3, 2, -10, -2, -7, -2, -4, -14, 6, 5, -5, -6, 4, 17, -5, 2, 5, 4, -2, -1, 5, -2, -5, -13, 1, 1, 3, -13, 3, -5, -6, -5, 0, 2, 4, 2, -1, -1, 2, 2, 4, 3, 2, 3, 7, 1, -9, -14, 15, 13, -2, -3, 6, -6, 3, -13, 6, 13, -9, -5, 17, 19, -1, -8, 1, 13, 14, 1, -3, -9, 10, 2, 6, 1]
6133AnNOJ1j4mJRlrJ0Pj3oJ0Jjj5J0JjlJJ4j2knJ0oOjnK2k1%Qj1N%J7nj6J7qj0
6178dRj6J7lrlJ9j3JjJ1Jj4OLklkJ5j0%oJ2Kj8oK2kooRMj1JNojOKKj5J0qJ3oj
6224bNlmK%J0j0NMlkj6J9J2rj6JjQQj2J6ormRKlMonOlJ1mkLMqj1J7ookQ%Qj9J2
6273B%Qmkkjj1QQ%Kj1Rlj0MJ3j4nJPOlmJ1kj7J8Pqj9J2MqmQJkrQPPj5j1J4JQo
6321CLjj1N%nJ4n%lpJ1Knl%QokMKLpkN%mj3K0JlqKlqJ2J3j1lj6J6NlqJ8j5%MQ
6370Goj%mJKMjQoj2KJ9j6jKJ0%poJ1NrJ2Nj4j1OPkqJ2lj2MjKNmjJ5j6mMLRj0l
6418cOlonK6k2lrJ6Qj2J0NKj0nPPj7NLJ0j2LmJ4j1lJ0LopJ4nnlJ0Nj3KkJ0npL
6463AJ9k4QnQKj5OoRlMK%j3J0Lj5J4jqJPKKj6PNMj1MlQlqNRj4%KJ0om%MMj5MK
$$ y = [1, -4, 1, 7, 18, 4, 0, 1, 10, 7, -2, 8, 15, 2, -4, 6, 7, 6, -9, 1, 2, 1, -2, -1, 13, 1, -1, -6, 4, -2, 4, 3, -2, 20, -1, -1, 7, -4, 1, 1, 18, 13, -3, 14, 6, -4, 5, -11, 6, 3, -6, -9, 10, -3, -2, -3, 8, 9, -5, 1, 4, 2, -1, -3, 12, 2, 2, -4, 8, 10, -8, -14, 8, 6, 0, -6, 3, 7, -4, -3, 2, -4, -5, 1, 3, 5, -10, 0, -8, 5, -1, -2, 3, 0, -4, -2, -2, 8, -2, 3, 7, 4, 2, -14, 5, 17, 8, -8, -7, -8, 0, 8, -4, 12, 6, -3, -7, 2, 4, 1, 5, -1, -6, 0, -3, 8, 4, 2, 5, 9, 1, -10, 7, 1, -5, -7, 1, 1, 9, -10, 2, 2, 10, 6, 4, 2, 1, -10, -2, 6, 6, 8, -3, 6, 3, -7, -3, 10, -4, -9, -8, -1, 5, 2, -2, 9, 7, -10, 8, 15, 7, -12, 0, 4, -4, -8, 0, 1, -1, -10, -2, 5, 12, -3, -14, 0, 1, 9, 3, 6, 5, -6, -1, -1, -6, 8, 3, 3, 0, -7, 4, 6, 1, -2, -2, 6, 0, -2, 2, 4, 7, 0, -2, 3, 3, -1, -14, 6, 7, 4, -4, -2, -5, -13, -1, 12, 1, -2, -18, -2, 3, 0, -8, 10, -5, -5, -1, 7, 1, 0, 0, -4, -3, -1, 3, 2, 10, 4, -8, -6, 13, -3, -4, -2, 8, 8, 1, -5, 6, 11, 2, 14, 19, 5, -6, 0, 7, 5, -3, 9, 6, -6, -2, -3, -1, 4, 0, -1, 14, -2, -6, -2, 1, 10, 0, -3, 3, 0, -6, -11, 15, -7, -10, -19, -3, 5, -7, 3, 8, 10, 0, -5, 2, 9, -8, -3, 0, 10, -2, 1, -3, 11, 0, -3, 7, 10, 4, -3, 11, 6, 1, -2, 8, 13, 0, 2, 0, 10, 5, -2, 1, 20, -4, 4, -1, 7, 9, -6, 0, -6, 3, 0, 4, 6, 6, -7, 3, 6, -9, 5, 4, -4, -3, 4, 6, 8, -8, -1, 4, 8, -3, 1, -2, 6, 3, -5, 0, 9, -5, -5, -3, 7, 1, -3, -3, 1, 5, -10, -6, -4]
6512djQJ%j0NjKRj1KnJ2j1lJ9j1j1QmNoMQmj2J4%JrPpJ1j5NJ3j9J1joJ1oj3J4
6556@mLj1J5Opo%RoK%mK%mKKoJ2mLqJ2pnnK0Mj5oK5rj3jRNqqJ3mrQnjJ1mj0Rk
6606@lkmJ2j4J3pJkpOQmJ2jj0jNOplmJ2%qj1J7pKmPljkOqnPMmnPNOj7NlKj1K2
6656Gjk3NNNOnlJ0%j0LOJmjNpmJ0jOj6J3Nj0Nj2J2mj4jJMKKJ2mj0JQRj8kLQkK
6704D%OJj3J1K%rMrR%ql%LkMNkn%lpJMKj0J3Pj2J4mllJqJ4rJklRkPoQrjPJrlM
6758cMj1MJ7j6JMkkpLQKj0jOkmKJ0Lj4OOJ1k4KKNNmNOj3jJRrj%KpPkjPJj2J6j7
6808hJJP%l%nkL%j%kJ3Qj9RnJ2lqKnQj2J1qNmPOj4kRj4OlPNroMJ5mjrRlkmQql
6861a1LLJNpJ2j0oJ5j1K0k2MJMnlJ2jmkmJ5j8J3Nmj4PlKLPnJonJ4mj5J0j1MMm
$$ y = [-4, -5, 3, 4, 4, -6, -1, -2, 0, 9, -2, 0, -5, 7, -4, -7, 12, 1, -10, -2, -6, -1, -7, -3, 5, 1, -11, 3, 3, 4, -5, 2, -5, 6, -9, -4, 9, -10, 1, 0, -6, 5, -1, -14, 0, -4, -1, -12, 3, 9, 2, -4, -4, 5, -1, 1, 1, -3, -1, -1, -5, -3, -1, -7, 5, 1, 4, -4, 8, 1, -4, -9, 11, 15, 0, -6, 19, 10, -3, -4, 5, 10, 2, -6, 7, 3, -6, 2, -3, -4, 7, 3, -7, 2, 0, -3, -5, -9, 3, -11, 2, -5, -4, -6, -13, -7, 1, -3, 9, 8, -2, -3, 2, 8, 1, -2, -6, 6, 6, -2, -13, 4, -3, -1, -5, 2, -1, -2, -4, 2, -6, -11, -4, 0, -4, -9, -2, 3, 9, -8, -3, -6, -4, -15, 7, 6, -17, -12, -7, -2, 4, -1, -4, 6, 6, -4, -1, 5, 6, 2, 1, 6, -1, -5, 5, 4, 10, -6, 7, 12, 2, 7, -5, 7, 3, -11, -12, -11, -7, -5, -3, 9, 5, -5, -4, 4, 13, -5, -7, -4, 4, 2, 4, 4, 10, 11, -2, 9, 11, 11, 2, 6, -3, 6, 6, -2, -5, -5, -2, -4, 0, 5, 3, -2, -2, -5, -12, -11, -7, -5, -15, -2, 5, -7, 7, 3, 0, -3, -2, -10, 4, -5, -4, -6, -9, 0, -2, 5, -1, 7, -2, -3, 4, 5, -4, -7, -3, 1, -10, -6, 11, -5, -4, 0, -2, -4, -11, -8, 0, 2, -8, -9, -3, -5, -9, -7, 3, 6, -8, -2, 4, 15, -9, -7, -5, 0, 5, 1, 6, 12, -1, -2, -1, 8, -1, -2, -2, 0, -7, 0, -2, -3, 4, 5, -7, 9, -8, -7, -6, 1, 1, -2, -2, -7, -9, -6, -6, -7, -7, -9, 4, 12, -7, 2, -3, 9, 6, -2, 0, -5, 3, -9, 2, -6, -1, -5, 2, 8, -6, -8, 1, -13, -7, -10, -3, 2, -7, -13, -9, 6, 2, 1, -8, 1, -2, -4, -8, 0, -8, -11, -8, -5, -4, 1, -6, 6, -4, -10, 5, -6, 14, -8, -4, -3, 1, -4, -7, 5, 4, 0, -2, -6, 9, -9, 4, 9, 5, -9, -2, -5, -3, 0, 7, 2, 3, -3, -8, 6, 2, -13, -3, -14, -10, -6, -10]
6906a0J1J2j9KoJ1%oLkJ1j0jlJ8k0J2oKqOQmj4J3mmmJJ3omJ4qkLrOlNqRrJ2N%
6952GlJKjj0%MOj0kPOLn%pPNpkj0KJ0rJ0kqQpO%MPoj2QPj0OnjkmJ0j6MJ2KQj0
7002CMmqRj3NMnR%rJ0j3JJQj4NmJ0rLK0jjj1JLj2PRrnLJ6j8J4k%okOLj2PoJoR
7051AJMjJnoJ0pnRnKrQjRkjKnKLj0nJ9Nj6LoLjkJ7r%JqKRjmNkJlJ%MqLlM%j2o
7106a4QK0j6JnjNJ6j6PJqQMqL%JoNjmOkQj8J0j5RLj0MMoNL%LqMmLmjPjlMJqPJ
7158BPjnKpLJjMOmkkJoMrlJ7PqJj3Nj%%M%mmjlJ4%pJ0pJkJJjMmm%koJ4mPLpQ%
7214ImJ0j1j4J1kNrNPjj6MLQpKRnrJNjlknJ2mJ0kmKmmJmoOPNj6J0kJ0%kp%Jjk
7265dmPLNj4J2oJnRJj0PJoJqpJ7lMlJJ%kQmpJQomMM%pQj1OloRqMNOlJn%OlmOP
$$ y = [-10, 1, 13, -6, -4, -10, 1, 1, -5, -2, -4, 7, -3, -4, -7, 11, -9, 3, -3, -1, -9, -3, 5, 1, -13, 0, -4, -8, -12, -11, 2, -4, -8, 6, -2, -4, -1, -10, -4, -7, -2, -10, -1, -10, 2, 7, 7, 4, 5, 7, 6, -4, -4, 0, 6, -4, -6, 1, 7, 10, 5, 5, -2, 5, 10, 3, 1, -9, -7, 3, -6, 4, 2, -6, 2, -5, 1, 1, 5, 12, 6, -6, 2, 9, -1, 5, 0, -1, -3, -7, 3, -13, -9, 3, 5, 13, 3, 7, 3, -5, 4, -9, -4, 0, -5, 4, 4, -5, 5, -8, -7, -6, 2, -12, -7, -11, -1, -10, -7, 13, 12, 11, 0, 1, 4, -8, -1, 8, -1, -6, -3, 13, -5, 9, 7, 7, 1, -1, 5, 8, -4, 3, -3, -2, -8, 1, 2, 6, 5, 6, 1, -5, 5, -2, -7, 2, -3, -1, -10, -2, -3, 6, 4, 3, 5, 0, 2, 5, -5, -10, 9, 14, -2, 1, -5, -2, -3, -5, 12, 3, 3, 4, -4, -2, 7, 6, 2, 7, 5, 6, 3, 4, 4, 8, 0, 3, 0, 4, 4, -8, -14, -6, 14, -2, -1, -6, -7, -2, 14, -2, 5, 6, -2, 6, 10, 2, 5, 5, 6, 0, 5, 4, 0, 6, 4, 12, -6, 4, -11, -2, 1, -9, -5, -1, -7, -2, 1, 1, 4, -4, 0, -4, -1, -5, -6, 1, 0, -3, 1, 2, -6, 1, 2, 9, 8, 3, 5, -2, 1, 2, 1, 5, 11, 7, 5, 3, 4, -2, 2, -7, -10, 7, 14, 6, 7, -6, -1, -2, -2, -2, 2, 2, -2, -6, -7, -10, 4, 4, -3, 7, 0, 1, -1, 0, 1, 0, 4, 0, -4, -4, -6, -12, 2, -2, 5, 8, 1, 9, 9, 5, 15, 4, -10, 1, -1, 4, -5, 0, 7, 6, -10, -6, -3, 5, -2, 0, 9, 4, -5, -4, 1, 0, -3, -5, -10, 2, -2, 8, 6, 2, 4, 0, -4, -3, -7, -13, -7, 0, 5, -11, -1, -3, 7, 7, 5, -2, -2, -1, -2, -4, -8, -1, 2, 7, -7, 5, -1, 0, -5, 4, 5, -5, 2, 3, -3, -2, -10, -17, 0, -3, 1, -2, -1, 0, 0, -2, 6, 2, -5, -4, 4, -2, -6, -2, 2, 2, -5, 3, -8, -2, -5, -11, -2, -10, -6, -1, 5, 2, 3, -2, -2, 4, 1, -3, 3, 10]
7321A0pj4PJ6rjQprLKOnj4J2KjrOKOqQPk1J3nmjONlpKJOjlmPjKj0LOJOlpJ1kn
7373CMkpNko%OknLKRj0J0j2Qj1jJ1p%lmJ2lnmJ5n%KnkmPJ5j6jQ%J0pkjKpJ1j2
7422c%OrONqlJ2KokJ1npllJkKJ8lj4KJRm%LnOqJoJ1Oj0J6j7MKKj3J4nokjPPpj
7473AjOlkJkmjJRojQqLqONj0PKj2J0m%J1ml%jq%kJ5pJ0j7J2Jnj1K0llnJ1jj4J
7522fmQkjkJ4j7LNLJoOjLojjkJQrLJ0mM%KJlpOj0O%kK%jjNjnJj1RjmJJ0JLrN%
7577DjPj7Q%J1Jj7J2plJ3j9J3lLj0NoJKL%MpNnJ0j5J2rJJjNOmqJ3j2%RPnp%J1
7624A1j3%jJ5kmj3MN%lkRpj0J6pqJ1Mj2J7lqKmoRJl%LoOlJ2Jr%J2k0MMRmqj0J3
7672BmJ3jj0Pqn%O%jkJ%JPJj2JQMj5J2kMrj0J6jMlmJ2jonJoMMlJ7j2rJ0qLlJ1
$$ y = [10, 3, -11, -4, 12, 3, 2, 10, 3, -6, -3, -1, 5, 0, -14, -2, 0, -1, -10, -4, -2, 4, -4, 4, 11, -10, 3, -2, -6, -7, -1, 4, 1, -6, -4, -3, 3, 2, -1, -5, 2, 1, 3, -7, -4, 2, 3, 9, 6, -1, 10, 8, 3, 7, 5, -2, 3, 1, -5, -5, 1, -1, -6, -3, -1, 8, -2, 8, -4, 4, -7, -8, 3, -4, -4, -7, -11, 1, -2, -7, -11, 4, -1, -1, 1, -4, -6, -10, -3, 12, -4, -5, 3, 3, 13, 6, 4, 3, 5, -2, 9, -3, -3, 3, -6, 0, 5, -3, -6, 6, 8, 2, 0, 11, 6, -1, -4, -7, -6, -8, -6, 12, 9, -5, -3, -2, 7, 3, 3, 6, 1, 7, -1, 0, -6, 5, 11, 1, 17, 0, 4, 6, 8, -5, 9, 4, -2, -4, -5, 2, 9, 2, 1, 0, 6, 3, 1, 2, 0, -4, -5, -4, 5, -1, -2, 6, -2, 1, -7, -1, 4, -6, 1, 3, -9, 1, -3, -3, 8, 4, 1, 1, 0, -8, -8, -10, 5, -2, 8, -9, 3, 4, -1, -12, 8, 5, 2, -3, 8, 7, -7, -6, -10, -2, -4, -5, -7, 7, -10, -7, -2, 1, 2, -4, 2, 1, 4, -2, -3, -4, -6, -5, 3, -6, -3, 7, 3, 7, 7, 9, 10, 7, 0, 6, -4, 2, 2, 0, 2, 2, 1, 0, 5, 4, -1, 0, -11, -2, -3, -7, -6, 4, 5, 8, -1, 4, 4, 3, 10, -7, 1, 1, 12, 13, -4, 8, 1, -2, 11, -8, 5, 2, 5, -5, 0, -6, -5, -3, 0, 0, 4, -3, 2, -3, 7, -8, 4, -5, -4, -3, -4, 1, 7, 3, -5, 8, -4, -4, 5, 12, 7, 0, 0, 11, -2, -2, -3, 12, 10, 6, -7, -3, 2, 2, -1, -3, 6, -1, -11, 5, -2, -10, 1, 5, -7, 10, 7, -1, 1, -3, -9, 0, 1, -2, -2, 1, -5, 1, -2, 10, 11, 2, 2, 14, -6, -2, 2, 11, 7, -1, -11, 2, -2, 11, 10, 0, 7, -1, -6, -6, 0, 0, -1, -3, -2, -2, -1, 6, 7, -5, -4, 4, 8, -7, 5, 3, 7, -2, -12, 4, 3, 7, 4, 0, 12, 11, 5, 0, 1, -5, -1, 3, 0, 17, 5, -4, 6, -2, 1, -2, 9]
7721IOj1%%Nj3kKrjLJ3J0j2lNjmJ6j5Qkj1JQKpMOnmQMnj6J8mqNlRpKQ%qj2QnJ
7771gRJJmmKQlj0jPRnLokKRj0nLRjMmj1J6rpJ4njlQOj2njNjjJPqOrJ4j4J3j0j
7822cJ2k3NJ0Mr%lOMnJ0lj3KJ5%j5NpJ0JnRMj3rJ4koJ0nKrLLjLpJ0j4RJmJ3j2
7868coJ2%j1KJ5JppJJ3mmpOj0kPJ1j2oJ3JqoJ1oKnOMnNnLlRnNokPJLkoJ0qj0N
7918cNQnj1%Kj0QLjmPo%NL%jj3MJ9pqJKMj6RJ1okLmJ4j1KlKmjPj5J0kJ0JkmKj
7968BnLlOqJ5moQj5JOnJJ2rpOkk%J0k%Pl%qJMoPjl%LnjmJ4j3lNlLjjOqLrJ4kO
8022D%pNnllOnQkMnlJ0%rROqnPpRj4MPJj3K0nJj2%J2prlOPj5J1J3j4MljQlj7J5
8072aj4J1%j2K2rMMjjLKrpNJ0qLpJ7j0Rj4PoKoKJ7j3j1LJ5j1nLPMj5KJ3oOpNj3
$$ y = [9, 15, 4, 4, 4, 9, -4, -6, -4, -13, -14, -11, 2, 12, 0, -3, 2, 1, -3, 13, -2, 6, 4, -7, -6, 2, 4, -3, 1, 7, 2, -2, 6, 10, 5, -11, 7, 3, -5, 0, -3, 6, -1, 1, 9, 9, 1, -11, -3, -8, -7, 2, 3, 4, 0, -4, -2, 6, 3, -7, -8, -1, 8, 3, 6, 0, -2, 0, 9, -1, -6, -3, 6, 5, 9, 5, -6, 10, 1, -6, 8, 3, 2, -1, 7, 13, 1, -4, -5, 0, -1, -2, -1, 6, -2, 4, -5, 9, -5, 8, -2, -3, 9, -14, -9, 1, 5, -4, -4, -7, -1, 3, -2, 8, 5, -8, -6, 9, 9, -6, -1, -8, 2, 3, -2, 7, 11, -2, -11, 3, 1, -5, 5, 0, 2, -7, -4, -1, -2, 1, -6, 4, -10, -1, 0, -4, 9, -3, -9, 3, 3, -8, -6, 9, 10, 3, -4, -3, 10, 6, 2, -5, 1, -9, -11, -4, 7, -5, -11, 2, 3, -5, -11, 0, -6, -4, -9, -3, 1, -4, 1, -4, -1, -4, 5, 0, 5, -1, -3, 4, 5, 8, 6, 0, 10, 2, -8, -3, 2, 10, 5, -6, -6, -4, -14, -6, -3, -4, -8, -1, -7, -7, -2, 1, 1, 0, -13, -9, 10, 3, -5, -4, -2, 2, -14, -5, 6, 0, -2, 1, -3, 11, 0, 2, -1, 1, -3, -4, 3, -12, -2, -4, 6, 7, 5, 1, 3, 2, -3, 0, -3, 3, -5, 10, 6, 0, 8, -7, -6, 0, -5, -4, 8, -1, -8, -2, -4, -6, -6, 4, 2, 2, 9, 6, 6, -2, -1, 3, -3, 4, 3, 0, 0, 3, -2, -3, -7, 7, -6, -9, -4, -7, -4, -5, -6, 0, -8, -5, -14, 0, -2, 4, 4, -3, 2, -3, -6, -9, -3, -8, 0, -2, 2, -3, -6, 4, 4, -5, 4, 10, 2, -3, 4, -3, 6, -8, -4, 3, 4, -9, 11, 6, 7, -5, -5, 7, 0, -9, -12, -6, 1, -14, -3, 10, -4, 0, -3, -4, 4, 1, -16, -1, -15, -4, -4, -16, 6, -3, 1, 5, 4, 3, 6, 8, -1, -8, -3, 7, -1, 2, -5, 12, 2, 11, -3, 4, -2, 0, -6, -4, 13, 0, -11, -8, 7, -4, -9, -6, 1, 5, -10, -8, 5, -1, 5, -2, 3, -10]
8118a0JQJ1qJnJ1mj%qLJ0nnKjl%Rj8J5J0j1ooRj0J5j1QjlKM%Jj1PQj8O%Kj7RN
8165eJ4mnJjKnJ3k0MklQ%nRmKj5K1lj7J3j2PJ0
$$ y = [-10, -9, -1, 10, 2, 3, -2, 9, 5, 4, 4, -4, -1, 9, 4, -1, 1, 0, -3, -3, 6, -12, 3, 13, 2, -4, -10, -1, -11, 4, -7, 1, 0, -3, -1, 3, 3, 4, -7, 0, 8, -10, -4, -4, -2, -19, -10, -5, 9, 5, 0, 1, 0, 2, -3, 10, -10, -6, -8, -11, -3, -3, -8, 1, -3, -1, -16, 5, 2, -15, -2, -14, -7, 3]
8191C
$$ Imaginary data points
##PAGE= N=2
##DATA TABLE= (X++(I..I)), XYDATA
0@%%%%%%%%%%%%%%%%%%%%%%%%%%%%%%%%%%KnPqQj1J5j6J6j8K1k3K4k4K8l4L8m1
52b1M4m8N4n9O3o7P1p7Q2q4Q2p3N1kj16M45j592J1514O6160n7501q0877M4474
74a7477N7971k3932l7331N265J0542R291J7057q214l4588j538L6570J4253l2502
87d633k7730K5258L9969j4825m3107L151L6170M102k2690n586O569K906J0698
100A0252o2k6228k195L4192K118l1502K707K3751j0213j4528J6740K576k2991
113a5383R820K8937j4911k9147J2638K2542j0251j7414P828J5204l364r834K533
126h02L934q071m147J4517P246j9724p164K5651N657k9678n725K7444M894k0794
140f762r96J3769l478n943O614l080q246J0011Q492j2457p505J1498N720r901
$$ y = [0, 0, 0, 0, 0, 0, 0, 0, 0, 0, 0, 0, 0, 0, 0, 0, 0, 0, 0, 0, 0, 0, 0, 0, 0, 0, 0, 0, 0, 0, 0, 0, 0, 0, 0, 2, -3, 4, -4, 4, -7, 8, -8, 8, -10, 11, -12, 12, -12, 16, -18, 20, -21, 23, -25, 29, -30, 33, -34, 37, -40, 42, -42, 40, -33, 18, 16, -100, 345, -1247, 10267, 76427, 18926, -61951, -17477, 40494, 16562, -20769, -15504, -4962, 4329, 21386, 13172, -21416, -22954, 13616, 27869, -4633, -32363, -7105, 32864, 18039, -25068, -21917, 14253, 18355, -4335, -9921, -3352, -446, 10252, 10190, -16038, -18233, 15959, 18077, -13425, -10718, 13033, 2820, -11708, 5032, 7608, -15383, -5563, 23374, 8463, -20684, -8046, 14496, 4245, -13169, -5341, 9863, 6499, -3335, -802, 3132, -4939, -9086, 5431, 12677, -7047, -14211, 11440, 17097, -12581, -18306, 9138, 14032, -6762, -7758, 6011, 2533, -3410, 3204, 124, -8122, 1889, 10381, -2076, -9581, 1917, 7637, -2264]
154b264m043P978K973m828j883K234J067k595j651M177J563m676J532N230m918
169a04o222O270N611p939l848J1305L281j2395k708R673O84o911L29N022L38k056
185C30O8j404j851L063K445k948j864K145K236p84l046l78K610O68q34l70r51
202h65l84J896J585k669l122L629M181l893m005K963K762j834j626J648Q80k042
218h96P25L024k655m584K953N958k035o899J437P627r76p368m10N264J937k748
234C54k588J126K659M00k209k102J381K764n33j814l32L86J509O33k359j301K069
251D3J727j221k029K66J827R08r61k425L33M018n82m957J173M844j394m046J417
268a059L352j489k616J394J382r95l78J54L42O55q51o30J255r6j444P59J540j278
$$ y = [-2264, -6307, 1671, 4644, -184, -2067, 167, 1234, -1361, -3012, 1165, 2728, -1948, -416, 4814, -104, -6326, -56, 5555, -2384, -6232, 5073, 8354, -4041, -6749, 2924, 3608, -3303, -2974, 2048, 2386, 330, 398, -1006, -2857, 206, 2651, -297, -2161, -16, 2220, 1436, -1610, -1988, 622, 1290, 456, 86, -865, -1249, 647, 2232, -437, -3559, 70, 4251, 358, -3647, -684, 2078, 244, -1382, 266, 1146, -896, -171, 2853, 198, -4386, -1433, 4525, 2490, -4409, -2972, 4655, 3679, -3689, -4099, 1165, 3102, 354, -2234, -1108, 1551, 1951, -258, -2360, -979, 1785, 1252, -562, -894, -508, 1001, 1634, -725, -2026, 43, 1770, 549, -1480, -1214, 613, 1521, 560, -1865, -1532, 2486, 1904, -3053, -1880, 2964, 1570, -2476, -1059, 2293, 804, -1812, -418, 964, -31, -409, -255, 87, 742, -109, -739, 516, 420, -1024, -265, 1275, -3]
286cj565K222J364l138p59L222p7k529K63J541L42o64j019mJ572O01k324j068
304b023L195R52l439k45K891j74j877o0Q82M18l09o22j31R21L91j351q3J547r19
323c6j130J891K21k231O96K212j115k105J241J887j333j427J005Q36p4o31r64
340a057J028J528j608j574J830J370j781j044J755O10j480N3P06n34K21L67q45
357d55K60Q46p09m50Q53p0j093O00J286j268j026J869M82j853J4J246o0o14k38
376c80L05O09j13r72q0J471q2k077O43K342j312k044J517J515j220j123P83R11
394F93l03n75l16J71R33j47j110N62P32q51nO62q21n33J457P21j751q36J848O90
414A221j602p11Q45J094J67j509p59J726Q42j715r60J554R71j282n94J024q1o69
$$ y = [-3, -1568, 654, 2018, -1120, -1879, 1343, 1266, -1263, -1000, 541, 883, 219, -800, -804, 768, 1369, -955, -2023, 1172, 2124, -1315, -1560, 1331, 1157, -720, -780, 102, 520, 211, -411, -542, 379, 770, -581, -664, 883, -36, -1166, 725, 946, -1285, -589, 1623, 508, -1597, -356, 1531, 198, -1229, -224, 612, 538, -93, -1057, -29, 1499, -109, -1683, 147, 1517, -264, -1308, 447, 1057, -423, -370, 336, -198, 23, 390, -455, -195, 651, -58, -508, 345, 275, -818, -218, 1068, -200, -1226, 643, 1125, -728, -714, 532, 472, -142, -380, -75, 534, 421, -551, -631, 840, 758, -1319, -676, 1666, 354, -1690, -173, 1342, 122, -1001, -218, 693, 390, -185, -501, -330, 603, 456, -654, -92, 640, -211, -216, 446, -375, -908, 549, 1270, -481, -1317, 531, 1221, -381, -1092, -247, 847, 1014, -495, -1254, 472, 1314, -401, -1361, 193, 1164, -118, -712, 312, 231, -438]
432d38M00K18l30J4K71L02k28p44O1Q49J96r30k17J318Q5j647J5J312k03q08L56
453a48Q38j50j103j91J034K14r25k08J306O05j622r52J456O61j120l35Q78N42
471G80n29p96J50N20j32k44L16M14m36m65P99J12j415K11J661j84j377J53J184
490G22j58j258j99R65O45l57q92K95J185q21j551J041J464q75p43J019L08j281
508d91l43R12O0k09M64n1k69K2o39r1R96j19q30R10R60j548j245J726R10j855
528g30k18J911K2j276j80K64K41K54m65l79R58O07j315n50J346k70j358J146J177
547A185j355m52J332j98j372K06R17J9M8J07p49R2P62r71p46J559N73j251K40
566e4Q87j217r25J548O92j424M8J379l47r58j04j63N61J086p67j258J139J191
$$ y = [-438, -38, 180, -150, -136, 135, 437, 209, -535, -474, 375, 571, -359, -576, 742, 827, -820, -805, 507, 304, -504, -148, 690, 540, -563, -754, 280, 494, -431, -639, 667, 1272, -350, -1302, 154, 815, -305, -640, 238, 780, 251, -545, -395, 125, -7, -251, 65, 479, 43, -422, 377, 489, -926, -715, 946, 762, -615, -462, 722, 564, -694, -893, 72, 717, 360, -532, -237, 948, 127, -1424, -383, 1081, 206, -537, 482, 790, -491, -834, 78, 138, -71, 393, 342, 73, 95, -544, -635, 361, 242, -588, 322, 1282, -266, -1511, 215, 1125, -730, -948, 963, 985, -291, -471, -207, 34, 288, -177, -556, 402, 1009, -306, -856, 490, 220, -1138, 8, 1185, -170, -622, 710, 512, -860, -654, 263, 282, 330, 437, -312, -220, 542, -429, -1175, 384, 957, -294, -54, 833, -384, -1309, 239, 931, -493, -445, 934, 587, -371, -475, -638, -77, 1009, 242, -1016, 123, 1314]
584A314j534j155J411O15r49M20N02j020K1J016o03r15O69P32j59j04l08o06O68
603A5Q34j320q10J926P46j780m01J136k21p74N36N32m05J27L08o16k37M12l05
622b97J09R72l42j078M99P81q71o46R31N03n82R0J90o31Q5N89l35k52M58L7j66
643D4K19k88o98N29J039p27j081J003R64r46q06M83M96l8j95j44J43L14p7n71
663c37n8N37l5j54L16j31m24K85K38m53k02N51L57m39k82J79M7j6l3j62K92L67
685D43m10m03L90K77m36k58N68L15n92k76M76J71l75k56L08M14k26l68J77K66
705B05j30k55O5K77n1k24J76J14k82j16K52J47k58j62L74K23m72k37L56K63k12
726E3l08K03L77j73m34M2L95R4m33j07N40M1n68J9M61l9l65R2L31j35k67J42J62
$$ y = [1314, -220, -1375, 36, 651, -298, 122, 624, -396, -375, 641, 38, -877, -208, 524, 365, 261, -47, -653, 15, 849, -471, -1281, 645, 1391, -389, -790, 346, 125, -649, -113, 419, 14, 141, 449, -167, -404, 8, -297, -188, 784, 442, -636, -137, 644, -227, -873, 58, 561, -21, 69, 259, -372, -287, 302, -33, -285, 173, 210, 44, 263, -25, -723, -194, 845, 118, -963, 40, 1004, 58, -748, -265, 231, 193, -2, -146, -3, 311, 234, -337, -395, 142, 107, -47, 269, 138, -286, -1, 237, -216, -418, 133, 490, 51, -231, -52, -5, -21, -54, -216, 76, 443, 33, -370, 20, 297, -139, -397, 171, 486, -106, -382, 94, 265, -110, -366, -58, 356, 130, -238, -61, 205, 75, -180, -115, 162, 111, -113, 63, 177, -105, -221, 31, 178, -80, -242, 132, 355, -117, -354, 2, 265, 53, -255, -52, 325, 152, -282, -240, 155, 249, -184, -291, 249, 290, -278, -259, 202, 163, -202, -110, 221, 86, -181, -39, 123]
749A23j09q7J2J63O7l00n7L84j2m15LM88l0n47J18N19k08l93J62K82k6k20q7K27
773E7J74k25k58K24L61k97m15L98L21m53j70L68N5k29rJ52J6j03mM4O2pj72O9
797d1K95k41l20L64K75m30k37M19K23l94j93L34J37j95j45L5K40Q1l64n9M21J6
819B21m16PL88o4l48J38K55j82j38J51M9n7o6oJ44M5k31j8K79N8l96j8M91q5m75
844b74J50L86j62k99P4K58Qk49o5K27J36k29k18K84K86l68k16L87R9l07k7K24
866A05j9j52M0J01p2n5K4K7R0j03j78K43K09l17k13L39K00l34j83L14J66k48j23
889a39J24R6nj81j9K64k1l01N8L08r7l32J56L65k29k81K29J80j80r7Q3J04rj12
913c6k5J26j4j46J5K13m2l15J62L38k41l34K39K84j41k58Q7K15K4k03j22J47K08
$$ y = [123, 14, -73, -61, 102, 169, -131, -188, 196, 184, -231, -228, 260, 230, -317, -199, 320, 112, -281, -119, 163, 137, -83, -170, 57, 231, 6, -252, -28, 333, 36, -379, 19, 340, -113, -283, 85, 140, -89, -98, 54, 70, -33, -37, 7, 69, 62, -110, -41, 254, 13, -307, 57, 332, -98, -335, 84, 307, -87, -280, 54, 191, -4, -149, -114, 126, 207, -157, -216, 205, 221, -195, -188, 200, 136, -212, -74, 181, -1, -139, 12, 61, 4, -62, -68, 76, 121, -110, -128, 151, 209, -187, -205, 286, 201, -274, -124, 262, 100, -199, -125, 133, 141, -108, -173, 54, 190, -39, -257, 27, 313, -55, -271, 116, 215, -92, -119, 105, 86, -66, -26, 75, 3, -52, -28, -1, 89, -14, -192, 51, 260, -57, -270, 69, 269, -65, -248, 66, 232, -16, -139, -15, 81, 76, -105, -124, 140, 119, -182, -124, 184, 87, -245, -89, 276, 47, -234, -5, 175, -5, -102, -19, 85, 76, -36, -61, 65, 51, -95, -80, 133, 91, -224, -62, 276, 35, -299, -60, 224, 83, -175, -88, 127, 151, -52, -174, -27, 181]
936A81j53k34K28J71k40j23K24K9j98K2K69n4k65M5J98j7j63n1K21J22k46j60
958a94K27J08k41o8K95O7l25l3L25m7l19O4K84M0k37j08J93J20j67j29Q0J70k1
981H4j35L5N6o8m5P5Ml9J4J15Lj81o6J68Q8j06j14J37J70j50k38R1J94l6j26N3
1007a7J55n6k33N1J83o4j19J05J69r7k29P5J42p5l2N6K1J8k5p2l4M1L4LK2L4o4
1034hpR9r3j55J32J72n8j24JQ7L2j02j34O6K57Lk80K7K51j40k63J90K04j15q1
1059c9J30rj95OJ42k1J3K6l0K1k4j57L1J87l1j28J16J40k22j36K33N0j92N0J52
1084A13l2m5n8o9P5J28j48j37K60J70l20j64K90L1k60R3J99n5r2L1po5JN4M1P7
1110A11p0j36J24P3k90lL72Nl20P0K48j56k64J78K00j04m3L2j5L1l9j39Q3K12
$$ y = [181, 28, -206, 22, 193, -47, -170, 54, 83, -115, -93, 176, 122, -143, -98, 100, 83, -80, -131, 90, 212, -34, -194, 33, 141, -100, -168, 127, 194, -131, -164, 161, 114, -205, -141, 143, 183, -54, -162, 31, 151, -16, -145, -65, 105, 84, -51, -16, 40, -28, -73, 2, 6, -33, -19, 96, 99, -82, -148, 20, 108, 2, -112, 25, 195, 45, -193, -102, 92, 56, -70, -17, 138, 82, -151, -100, 83, 19, -100, 5, 174, 77, -152, -77, 65, -10, -42, 14, 35, 53, 28, -44, -78, -37, -3, 0, 22, 56, -8, -15, 84, -9, -164, -32, 140, 82, -42, -41, 46, 78, -24, -158, -92, 165, 168, -112, -85, 166, 26, -237, -47, 157, 42, -39, 91, 82, -113, -107, 35, 14, 27, 53, 23, 44, 20, -137, -106, 81, 50, -78, 38, 178, -44, -180, 53, 103, -89, -39, 113, 81, 36, -22, -91, -16, 112, -36, -173, 87, 257, -63, -227, 63, 94, -166, -73, 126, 71, -21, 10, 3, -62, -61, -7, 34, 111, 41, -95, 29, 102, -188, -191, 181, 186, -134, -64, 184, 28, -236, -58, 142, 38, -5, 27, 12, 43, 4, -135, -52, 160]
1134A60q4j83J08J48j89j26J77M8j16N7N0n8Pj9k6M1K6n9L8J47j08k15J26K24
1158A74k27j65L14J43k74j35J88Q7j70n8J45J04n3j44j4J51j8j82Q2J97r9j30
1180h4R3M0j13l2J46J4j09L3O1m4k8l4K1J12k7j35N9J40n2k03M8K18n0j75M4J63
1206A06j6j59o1J53R2j56p1J77N0j75n9J65K6j45L9J45p9j13N9P5o3o7O5J13n9
1231D2j24K6J34k9j67L3J97%k09L6J25Kj00n3R6Q4p4j06M9J13j9j56N3J58p6j19
1257h4R3N5p5n7Q0L3o5l2P8L0q7n6R5J01j21j37J83J35k14j24K10J12j96j00J76
1282C3Q1j31p3P0P4rj02j0J31jj25LJ16k4r4K9R1o9m1P9Ln3j5L9M0j6r1K7J17
1311G9k6j55J6K12m4k33O6K29p7j78M6J55j0j31k2J15N4j07p4J05P3j13o3J40
$$ y = [160, 76, -107, 1, 149, -40, -166, 11, 59, -57, 0, 50, -8, -1, -20, -46, -5, 21, -38, 0, 147, 39, -176, -50, 174, -53, -218, 96, 239, -35, -170, 18, 105, -65, -123, 22, 126, 73, -71, -85, 66, 48, -134, -52, 145, 46, -84, 9, 49, -64, -96, 50, 64, -45, -12, 49, 5, -23, -57, -36, 76, 49, -86, -27, 113, 61, -142, -94, 124, 74, -101, -57, 106, 90, -69, -130, 23, 115, -41, -112, 65, 115, -60, -119, 46, 72, -73, -34, 111, 32, -81, -22, 53, -10, -77, -12, 101, 42, -82, -56, 78, 49, -118, -85, 112, 112, -97, -61, 64, 66, -34, -87, 9, 93, 19, -87, -38, 75, 56, -100, -47, 111, 35, -84, 9, 64, -11, -68, 12, 45, -20, -52, 26, 56, -31, -87, 8, 109, -12, -149, 34, 169, -45, -169, 41, 153, -43, -143, 33, 114, -17, -90, -20, 54, 45, -57, -67, 64, 63, -62, -59, 57, 33, -61, -32, 59, -10, -51, 28, 31, -22, -37, 2, 42, 26, -65, -38, 79, 53, -102, -86, 126, 82, -151, -85, 144, 67, -111, -65, 90, 80, -51, -73, 42, 96, -11, -85, 20, 93, -20, -83, 57]
1335E7J3j39L7J00o0p0O1N7n3o3O1M3j6o3l5J11O2j44p3J69N7j74o5J74P2j68
1361d9m8J12O9o2q4K2J24oj70M5J49n7j35P7J16j08q8J35L7j42OJ09j4q6k5R3
1387B0O6r2r4Q0J44q7j94J18J99j22j87J31J49j25j10O6J02k4p9mM7O6r1o5J18
1412C2O0j53PJ32l7j34Q1J14j02q7J00P4j07n9N4P7j2j13oJ62J8j99k1K07K4k05
1438i3k4K21J1j79pJ02J0n3l9M9O3l0q7L7N7l5p2R0O5j13l6J30k1j36K4J33J4
1465H1j37jJ16J6j14o2R0J13q8j28R3J50j08j68J09J43p5j21P1J08n8r5J7Q0P
1490C9n6KP0j7p3j1P7k0o6O4R7q1j24P1J09r1j08J15J55r9j72N7J34l8j17J8J57
1517I2K1j57p0J42O2j34p1J59P3j43m6J26j0j16K3R0j5m7L2M5k5p3j2O5N2p9n2
$$ y = [57, 70, -69, -32, 68, 8, -62, -1, 56, 3, -60, 1, 44, 28, -35, -70, 41, 103, -41, -114, 55, 112, -62, -127, 47, 119, -49, -97, 15, 84, 22, -62, -40, 84, 78, -92, -47, 102, 45, -90, -13, 103, -5, -93, 42, 79, -63, -57, 52, 38, -48, -73, 20, 86, -6, -100, -20, 124, 37, -157, -39, 160, 38, -149, -18, 131, 6, -104, -38, 64, 40, -39, -43, 4, 70, -21, -86, 32, 92, -61, -54, 78, 41, -93, -12, 102, 0, -87, 13, 87, -20, -79, -25, 52, 40, -73, -79, 83, 101, -98, -119, 88, 112, -93, -117, 104, 115, -64, -71, 31, 41, -12, -51, -2, 61, 31, -56, -19, 38, 3, -69, 21, 86, -27, -63, 67, 46, -90, -66, 67, 81, -56, -57, 59, 75, -39, -101, -11, 102, 14, -114, -21, 129, 21, -147, -38, 105, 30, -91, -20, 88, 30, -65, -48, 32, 39, -17, -15, 55, 38, -35, -46, 31, 11, -55, 9, 106, 25, -99, -28, 81, -10, -118, -3, 152, 53, -119, -62, 72, 34, -83, -65, 92, 113, -44, -114, 28, 90, -44, -115, 44, 117, -26, -72, 54, 44, -72, -49, 41, 26, -21, 11, 56, 31, -42, -54, 11, 63, -16, -68]
1544f8J42L7j93p4K12N6j83k1J90K2j95n7J29O0l4p1K5J27m7j80L3J76l7j38R6
1569GJ31j42j10J37K5j18K4J22j4r3qL2L4j6q4L6J67m1k17P0K09j26k15J54K07
1594A71j31j37Q1R1o8p3j0Q1R5p5j21J06R1j87m1K06K7j79O3J47j37j42J35R8
1618I1j04l4Q4K2l6q6l0J34P1j65o8K16P0k72n2K70Nk04K2J49j2r3k3K2M3J1q7
1645e6RJ51n0j56O9J22j38o4J96K3j63lJ48m8j40N1J20Jo0o5M6J07q9j73J32K01
1671A71j20j86J18J44j44j31J45R5o8n3J4L8Qo6k4P5M9r4j8R9j7j15M8J21j00
1696a1p6J07P6j04p2P3P6m3j14M5J35mj61l1J82K5j95j1J88J7j66j8J10K2r2k6
1722f8R9J4n1m0K9O1p7j5R1J8j02%R2k4r4J7J25k1j02lJ00K8j23o1J35Q5j22r7
$$ y = [-68, 74, 111, -82, -156, 56, 112, -71, -92, 98, 120, -75, -132, -3, 57, 23, -48, -23, 104, 57, -123, -90, 86, 49, -89, 7, 138, -4, -114, 23, 48, -70, -46, 76, 62, -31, -39, -7, 27, 11, -73, -37, 130, 89, -128, -58, 151, 25, -190, -36, 171, 40, -97, -16, 75, 7, -66, -76, 5, 100, 25, -96, 10, 101, -86, -127, 79, 106, -73, -10, 137, 0, -142, -7, 91, -13, -47, 37, 59, 23, -63, -93, 41, 112, -53, -121, 95, 165, -107, -159, 111, 116, -88, -66, 83, 71, -22, -45, -23, 20, 31, -56, -47, 104, 54, -102, -33, 89, -49, -113, 83, 106, -57, -60, 88, 40, -100, -49, 71, 72, 12, -53, -7, 100, 11, -162, -30, 171, 51, -135, -17, 127, -17, -148, -3, 92, 24, -29, -15, 23, 31, -35, -59, 16, 65, -29, -47, 52, 35, -80, -32, 89, -11, -87, 20, 96, -8, -80, -7, 69, 26, -88, -43, 92, 88, -73, -104, 78, 103, -92, -103, 85, 102, -64, -82, 28, 50, -42, -68, 31, 45, -6, -46, -17, 44, -33, -48, 43, 61, -41, -41, 51, 27, -67, -50, 75, 54, -48, -51, 49, 77, -46, -107, 28, 113, -9, -106]
1750a06J31Q5j10j09J03J03q3r5P6O8l9p5mJ01k5p3N2O0o6o2P2N4q1n3J18K8q9
1777a9m3P3N4o4r1Q3J10n7j35L4J54n5j42N1J35l5j27L0Q2Oo7l5O9N0p5n6P8M9
1805E7q9j8R5rr6M2R0o7p8N1Q0m0q4L0R6oj01k9J22N6j45o6J72N1j68l7J24O0
1833I3j19m2P4M0m1n3K2P7k6q3M6O7o3o3R1M2r9j8R6Qj11KJ15qp6k5N2Q2q1q5
1863h6O4J31q1j34P0J44q8j23R0Q8n7n9K7N0Jm2l1N4J3n0j7N9J0r5L2R0o5p9R4
1892A0N7q6n5P5N7n6o1M7P1mj01l5J38L8j65lJ39K1j34k3J02K5q7qN1K2k6l5J0
1921a6N5k5n6N0M0p1j4P7Kj00OJ09mj28L5Q8j0q5j6Q0O0p7p0P0J01r2j27J06J19
1950A07q4r6O6Q4p3o7N2N4l5k7J6K6k2l8K4M8l7n1P9M4r2n7R8N9q4q0J05P8r6
$$ y = [-106, 25, 110, 0, -109, -6, 97, 14, -81, -5, 63, 24, -51, -55, 46, 21, -52, 0, 60, -6, -68, 4, 58, -23, -76, 42, 70, -19, -62, 11, 65, 1, -90, -7, 103, 46, -89, -55, 99, 44, -98, -47, 88, 53, -74, -44, 38, 44, -23, -58, 11, 61, -14, -70, 8, 57, -32, -50, 45, 36, -60, -18, 72, 5, -73, -22, 58, 18, -66, -36, 60, 54, -47, -76, 46, 102, -43, -109, 63, 114, -54, -91, 33, 93, -26, -68, 6, 46, 5, -48, -26, 51, 25, -58, -12, 55, -8, -71, 20, 62, -37, -55, 41, 49, -62, -60, 55, 47, -29, -54, -2, 80, -1, -86, -22, 109, 28, -106, -36, 108, 20, -103, -13, 75, 18, -41, -14, 36, 37, -5, -36, 18, 31, -19, -36, 23, 33, -62, -30, 60, -5, -84, 10, 67, -19, -74, 1, 58, 2, -59, -12, 59, 55, -46, -81, 57, 95, -70, -73, 66, 87, -47, -70, 32, 57, -30, -38, 13, 35, 9, -26, -16, 39, 14, -42, 8, 48, -23, -37, 40, 42, -58, -52, 57, 53, -75, -40, 48, 38, -47, -63, 17, 77, 0, -70, 0, 101, 9, -118, -12, 107, 23, -73, -7, 77, 4, -63, -11, 43, 8, -19, -3, 23, 1, -37, -13, 35, -2, -53, 26, 70, -22, -79, 19, 78, -6, -86, 19, 97, 1]
1979Ar0O6R3m9r3L7J03j5j15%J22lj01oJ16j1q7j1O4Nn4J1N5j6n7L1L8m2m8M1
2009a5P7k6q8K1R1k7j00J8J18J2j46pJ45Nj47j2J26K3q9k6P7K9n6o0L0P4k3o4
2037d0L7P1p4n7P7L5r6J4J05k2j08PR6l3n1QO4M1q1q1P6R3r0j02J20J25j31j21
2065a18J25O7j01k3P1L7l2l6nK1J8l4j8O5J6r3J6J02r9p5J13Q2j19m5J25L2j35
2092d3k7O7M2j2o3lR6K6j78j5J89Kj59L0J45n3j37O1P2n7QL3k5J6rl9K3M3m3k7
2122c7R3Jj42J4J51m4j39Q1J20q0j00N4O6k8m5k3M7R2n8j20P9J34j39j01J40Q8
2148A04j22l7Q2mp3J8L7nkJ6k2L3k3o2O3Q2p4p7J20M9j59m6J59K6j35kQ9J8o5
2177a2n4K6P5jr6NJ24j5j33L4J16n3p3M9O4n1k9J5J9k0j6L7K0pn1LO1rj22P4J26
$$ y = [1, -89, -23, 70, 21, -72, -35, 68, 53, -62, -62, 60, 57, -44, -50, 66, 55, -32, -43, 21, 26, -28, -17, 38, 22, -35, -4, 34, -8, -56, -15, 62, 36, -52, -31, 60, 33, -67, -49, 69, 81, -65, -72, 73, 78, -69, -81, 45, 68, -21, -47, 30, 59, 3, -57, -27, 47, 24, -40, -3, 68, -6, -63, 14, 49, -47, -33, 72, 50, -58, -51, 45, 12, -39, -31, 33, 74, -7, -88, -12, 81, -9, -111, 9, 134, 3, -118, 7, 74, -27, -50, 21, 58, 26, -10, -15, 6, 24, -10, -28, 37, 53, -40, -24, 78, -21, -96, 17, 99, -20, -65, 60, 92, -43, -70, -3, 39, 27, -36, -39, 57, 83, -95, -110, 79, 81, -78, -48, 97, 44, -93, -32, 40, -17, -9, 24, -1, 15, 6, -33, -10, 33, -10, -37, 56, 57, -85, -71, 80, 36, -103, -22, 98, 18, -82, -28, 38, 10, -35, -58, -11, 81, 23, -97, -18, 116, -23, -124, 16, 104, -18, -55, 27, 23, -50, -32, 5, 0, -2, 14, -8, 25, 2, -60, 3, 85, 11, -66, 54, 103, -56, -102, 57, 83, -52, -54, 35, 53, -12, -66, -40, 35, 34, -62, -57, 67, 52, -81, -47, 69, 16, -57, -8, 56, 5, -24, -9, 10, -10, -26, 11, 31, 24, -27, -24, 37, 28, -94, -20, 106]
2208A06o7j20N9J11p3j03O1J02l4p7j3O6L9r4k8R3M3j02l2Q8J3p4qP6%m8J0K4
2236A8ok5mL1J8o0j1Q3Mq9k7J18K3j15k1J09K7r6m3P7O3p2o9O5O9n5q8N4Q9n8
2266Ip9O8M4m3m8L7L7l1l0L7M2m7l8M5N2o2n8Q2O1p9o1P6P0p5o8O1P3m9q2K9R5
2297F8j5j06jJ09pr9J8Q6k2o8lP4k1m7J3M5j0l9J6M5np6J3R2k7j00L7R7k8j20
2327h1M7R6l1r4J8P7J4p0k9P6N3q8n2P3N7p8n9P2M1p0oM4Ql8LK5K2l4k8L9K7m7
2359a3l9O9M5q1n3J08M3j20k1Q9L5p2n3O8N3m3o8M1P7m2q6L4R1l9p7M9N3m4m1
2388c7L8J7k4j9K5J2j5l8K3N6k9o9N7P1n9q1N6R0n5r0O3P6n2o5K1P5j1p6rP5K6
2419E2q4k4R2J7q3qP9k8n2K8L0j1l8J4M5k3k3%L6%p3OR2Lj04J3R9j1q5KP7J6q0
$$ y = [106, 39, -81, -22, 89, 16, -87, -26, 76, 42, -35, -48, 18, 57, -37, -65, 28, 71, -31, -63, 25, 38, -36, -44, 32, 32, -16, -6, 18, 12, -13, -17, 14, 32, -28, -39, 44, 48, -41, -68, 50, 73, -42, -63, 46, 73, -23, -66, 11, 74, 2, -67, -2, 67, 12, -76, -22, 67, 9, -70, -2, 42, -1, -49, -12, 25, -6, -36, 1, 43, -4, -42, 3, 55, -7, -65, 17, 78, -1, -62, 14, 84, 9, -59, 2, 75, 26, -56, -27, 68, 53, -53, -54, 55, 48, -51, -33, 53, 31, -37, -40, 34, 13, -34, -21, 24, 14, -25, -9, 36, 31, -45, -32, 60, 33, -67, -30, 67, 39, -81, -34, 62, 31, -63, -45, 32, 46, -24, -53, 23, 76, -12, -64, 9, 66, -12, -71, 1, 42, -28, -34, 10, 18, -20, -17, 8, 30, -4, -32, 7, 34, -13, -52, 17, 62, -19, -72, 36, 79, -41, -62, 27, 62, -10, -63, 5, 58, 15, -53, -12, 65, 23, -63, -29, 62, 23, -54, -5, 48, 4, -37, 1, 18, -6, -25, 0, 12, -3, -41, -18, 38, 9, -60, -3, 68, 9, -72, -16, 74, 19, -71, -8, 68, 16, -49, -28, 47, 36, -40, -49, 26, 52, -32, -56, 36, 53, -30, -38, 41, 13, -39, -11, 19, 8, -30, -16, 29, 6, -17, -17, 19, 19, -54, -48, 44, 47, -57, -44, 55, 44, -41, -39, 38, 54, -26]
2452b6k2P3L4n6m3M5N6n1n4N3L8n5m0M1N0n3j4L7J3m5rL6K6n0j2N5K2o3l0O0L0
2483D6p4m0Q9L9o9m7N3M9m3n8L6O0l0n0J7N7j9n0J8N4j4p4L9M7l1l4J1M3j9l3
2513b7L0K5m2l5L3N7k3o5L7P5m5o0J5O8np6J0P5kq8j4Q1J9p1%N9J0o0rL5Rl6J5
2546eK0Rl3kK1kj2j3N0Jo6qP2j2o1QP5Lp6%O6Mn3j3L0M2l3o4N5O4o0n0M4M8n5
2581fj0K6J5m0kK6j0n%KK2j2l7L2M8m9n0O9M9q0n2O9M3o4j8L9L5l0m6J9M4%n0
2614b3kO5Lq2K3N4k1n6M3L3l1j9K8ol2RJ4%Ok6JM7j1p7K4Q5k7q1L3P4m0n9J9O2
2648C0j1k7j8K9K9n1k5M1M7m5m0N2K3o9mO6nn3L5J6k1j9J5K4lj7j1K5J7n4l6P0
2680A0L5p5k5P3J1o4qM7K0l8k2K7K2Jm3J2N2k7l5K1M8m1k9L7Nl9LL2Ql6kK9Lj8
$$ y = [-26, -48, 25, 59, 3, -40, 5, 61, 10, -44, 9, 47, -8, -48, -7, 43, -10, -24, 13, 26, -19, -28, 8, 34, -16, -28, 27, 49, -14, -44, 16, 46, -28, -68, 21, 60, -9, -56, -3, 46, 3, -55, -19, 41, 11, -39, -22, 35, 16, -34, -16, 38, 24, -50, -11, 36, 5, -29, -18, 25, 6, -27, 3, 28, -14, -49, -16, 41, 18, -47, -10, 65, 20, -40, -25, 43, 38, -38, -28, 47, 45, -43, -57, 24, 43, -28, -28, 31, 41, -19, -28, 7, 16, -20, -5, 15, 24, -9, -11, 10, 8, -4, -17, 33, 34, -32, -40, 32, 20, -41, -33, 42, 45, -31, -31, 35, 39, -14, -27, 3, 45, 12, -52, 3, 67, 7, -43, 1, 49, -6, -16, 10, 25, -15, -17, 9, -1, -6, -6, -4, 18, 6, -31, 1, 49, 0, -50, 19, 68, -12, -64, 5, 48, -16, -34, 5, 40, 10, -36, -17, 27, 27, -23, -25, 40, 43, -39, -16, 38, 17, -39, 4, 37, 6, -13, 15, 9, -23, -14, 0, 0, 6, -20, -19, 28, 17, -60, -36, 49, 22, -59, -26, 48, 8, -51, -32, 30, 19, -8, -26, 3, 32, -19, -44, -3, 44, -1, -41, 11, 34, -35, -39, 27, 22, -31, 4, 20, -1, -20, -5, 19, 16, -1, -12, 13, 30, -24, -60, 10, 45, -30, -55, 18, 29, -35, -43, 4, 24, -14, -36, -9, 13, 14, -29, -17, 35, 8, -27, -6, 42, 1, -28, 9, 14, -25, -22, 10, 18, -18, -20, 9, 12, -6]
2714fk2J9M7k9n7L6N4l7m9M1M5m0m5K4L5j3l0jK8J7l5lK9J4l5KK5%l4J3L8k3j8
2747a0PK4k1l0K3M3l9k9J6M4op0K1N7qn2nN0J2m4j6M5J3l8l1L5K0k7k0L6Oj5j7
2780b6K9Jk0jK6J0k8qM5ol6nM6jm6j5M1K8n8j5N6J4m0k9L0L0k4k5J4L3km5L0K4
2814B7j0l6J6K2k7oJ5J9k6j0J9J2k6j4L3J9l0l1K1O0l5m6L2L9k8n2K9M9j0n3J4
2845a4K5mk7j0M3Jj9rK8J4m5lM2j0l3K2K1j7k2QL2j3k8J6K6ll9kL7Km5KM9jl6
2880a2j8N2kk5k9M0Lqj6K2J5j1l1L8Nk3j3K2J5l6JL1j2j7MJ9Qk2j7K6Qj4k8L7
2914A2L2m1l5L2L5l2l1K0K4k1k7J7K9j3k3LL9ok2j1M1j1k8K0J3j7k6K8K4k3k3
2945b1J7J4j0j9KM4j6l8ON4mn8NM1Nn1J8L5Pm6jK0J7k9j1K3J4j8k0J4K0j8j2K0
$$ y = [-6, -28, -9, 38, 9, -48, -12, 42, 5, -44, -3, 42, 2, -43, -19, 16, 3, -27, -28, 0, 17, -18, -21, 8, 22, -13, -11, 14, 14, -20, -7, 31, 8, -10, -3, 21, 0, -30, -7, 36, -3, -32, -16, 28, 22, -48, -27, 30, 22, -30, -35, 15, 27, -17, -33, 12, 25, -13, -44, -9, 11, -16, -36, 0, 6, -9, -26, 3, 4, -16, -17, 9, 19, -9, -17, 28, 22, -14, -19, 27, 26, -20, -35, 6, 34, -24, -39, 17, 31, -9, -38, -8, 22, -2, -27, -13, 20, 18, -27, 3, 27, 17, -19, -3, 19, -8, -14, 1, 20, -6, -16, 3, 15, -11, -25, 8, 27, -3, -34, -13, 47, 12, -34, -2, 37, 9, -43, -14, 35, 25, -28, -14, 11, 7, -20, -30, 13, 14, -5, -14, 14, 28, -17, -20, 22, 12, -21, 1, 22, 5, -17, -9, 23, 10, -18, -2, 24, 21, -18, -20, 17, 19, -26, -24, 25, 24, -12, -30, 22, 20, -5, -34, 6, 9, 1, -15, 7, 22, 11, -20, 18, 23, 0, -13, 9, 24, -12, -11, 20, 8, -9, -5, 14, 22, 0, -17, 9, 17, 3, -25, 12, 44, 3, -32, 0, 35, 3, -28, -8, 16, -5, -32, -15, 14, 1, -22, -19, 20, 14, -8, -19, 22, 11, -17, 3, 16, -1, -27, 1, 25, 2, -21, -4, 10, 0, -19, -17, 27, 11, -27, -21, 33, 29, -29, -24, 17, 22, -29, -11, 24, 31, -15, -16, 4, 21, -8, -19, 4, 18, 0, -20, -6, 14, -4, -16, 4]
2979DJ5l3lL7j2k9J3L0ll0pK9Kk7qL5L1n5k7M4J8k4l7L6K6j6k4J8K2k1j9RK6j6
3013Dk2J3K4k5k2K9Rj5k0L2J9l5j6K7J4kl3J1L6j7l2J1M7l5l1K6K5ql2oL3mk0
3046a5NK4kk5mK5J5l1OPJj9MJ8nk9J4K9j7j6oL4Lm6J3L3J4n0JM0Nl6j6K8K0j8
3082Dj8K4J0k1k0J6%Kj7K7J3l3nK8ok1KK8Om0JL0Mj9pJ6J6j6m4L2K8k6k7K8K5
3117B0j4k9J8K2j8j5RJ6jrj4K0J0k2JK0ll2J5K5k2l5L6J3j7j2JK8qk6LK9J3l2
3151a0qL6Jm2J2K9Jl3PJ3J3k8jPJ0mj8J8J4k2rK2Pl0nK8Lk9kK7Jk5%K2Jj8j4K6
3189@K4k4l7L3L6k6k6J6K8k6j8K9J2j3j6mK4k1j1J1K0%k6J0K3l7qL3J4l2j1K6
3221CJ4k7j2K3J1j2j7J6K9k5k6RL7j2l3J1J3Jpj0K4kj1j0K3kj9QJ5j1qpK7j1j8
$$ y = [4, 19, -14, -17, 20, 8, -21, -8, 22, 19, -11, -18, 11, 13, -14, -22, 13, 44, -11, -38, 6, 24, 0, -37, -1, 25, 9, -15, 3, 25, 4, -15, -6, 20, 4, -18, -5, 19, -6, -28, 1, 10, -5, -25, 7, 26, -9, -25, 2, 16, 14, -19, -8, 28, 11, -21, -10, 37, 2, -29, -3, 22, 14, -18, -24, 9, 5, -15, -10, 14, 12, -13, -17, 8, 23, -8, -2, 5, 6, -13, -9, 9, 4, -25, -11, 18, 1, -15, -21, 13, 16, -30, -17, 16, 30, -20, -19, 21, 26, -10, -26, 2, 22, 4, -14, 10, 20, -1, -21, -5, -5, -3, -20, 7, 20, -13, -18, 10, 4, -17, -15, 13, 19, -21, -20, 10, 14, -5, -12, 4, 20, 4, -40, -8, 20, -6, -33, -5, 20, 6, -23, -5, 17, -1, -16, -7, 9, 8, -1, -15, 5, 15, -7, -6, 14, 11, -21, -6, 19, -3, -38, -2, 11, -6, -18, -17, 11, 3, -23, -20, 9, 22, -10, -18, 18, 19, -23, -11, 18, 19, -14, -7, 6, 19, -9, -10, -3, 7, 3, -15, 3, 17, -5, -14, 8, 15, -15, -20, 8, 11, -18, -20, 7, 8, -17, -17, 5, 6, -12, -26, 0, 24, 0, -37, -4, 32, 6, -20, -4, 24, -2, -20, 9, 21, 8, -8, -12, 12, -9, -20, -9, 11, 11, -15, -5, 18, -19, -27, 6, 20, -12, -23, 3, 17, -10, -22, 1, 12, 0, -17, -1, 28, 3, -23, -14, 23, 11, -22, -11, 2, 3, -4, -14, 10, 8, -3, -13, 10, 8, -11, -3, 12, 1, -7, -14, 13, 2, -16]
3256a6qK9j2j9K4K0rl8J1J6Pk3MK8pk4rL3J5l1mJ9Oj3k0J2K2k5j0J6OkjkJ6k1
3292a0kJ6Nj4j3K7Ok4j1K4J4j8k4K9Rj6k6J9K3j0l5J3L4j1j3pK4J2k3%K5j2j8
3325gjJ3Qk2oK8rj1LJ7ql1K3J5nqj9L5j2j9pM2Jm0oL6Pl5jK0Mj1j3K1N%j7%K1
3364A1oj9K3kr%PJ5k1j0K6nk6PROj0j0J5J0j6k2J6L3j9j8J1K5rk8KJ8Qk0LJ1p
3401amoJ0Rl8K1J8kk4J5J4rj3NL0k1k5K8J8k4j0JJ7pk2pL5pj0rK9Ol3JK5%k0j
3439a1J8Pj2j6J8Rj5%NRk7rK0J9k4lJ8Nk0j3L5Pk5qK7Ol8j1K9L4l4k8L5J3k7j2
3475a9RK2j3nJ1j1J0j2JJ3lj2J1J6k2j1K2Pj6k6K3K1j5l1L5J1j2k2NJ2J0l7J2
3508a6L4mk7%K8rk1mL1lj3qJ7j4j0J6J3pj4jK1jj8OK6j0k2QJ8j3j9PL1j8j4Mk
$$ y = [-16, -24, 5, -7, -26, -2, 18, 9, -29, -18, -2, 5, -18, -14, 14, 7, -17, -26, 7, 22, -9, -13, 6, 12, -1, -21, -9, 13, -12, -22, -6, 0, -2, -3, -5, 11, -10, -12, 4, 9, -5, -18, 9, 15, -9, -20, 4, 18, 0, -24, 5, 14, -2, -28, -9, 14, 4, -31, -18, 16, 5, -8, -15, 9, 21, -2, -2, 23, 11, -7, -8, 5, 13, -9, -15, 13, 4, -7, -4, 13, 5, -26, -3, 12, 7, -1, -20, 15, 3, -16, -23, 19, 20, -20, -26, 10, 17, -18, -19, 1, 5, -6, -19, 2, 7, 7, -10, -10, 11, 5, -14, 9, 7, -2, -2, 5, 20, -1, -11, 15, 10, -16, -9, 0, 6, -4, -14, 1, 11, -5, -27, -11, 22, 3, -15, -4, 21, 12, -16, -14, 4, 12, -8, -5, 6, -1, -5, -11, -1, 8, -30, -9, 9, 7, -17, -2, 12, 3, -10, -5, 25, 4, -21, 7, 25, 1, -9, -8, 9, 2, -20, -27, 8, 1, -9, -18, 11, 17, -16, -15, 10, 10, -10, -11, 7, 14, 2, -14, 4, 13, -2, -2, 3, 12, -15, -24, -4, 15, -9, -12, 6, 11, -9, -22, 13, 20, -5, -13, 14, 20, -18, -29, 0, 34, 0, -28, 7, 20, -7, -19, -10, 12, -1, -6, 5, -6, 4, -8, -7, 6, 3, -9, 2, 18, -4, -15, 7, 14, -2, -28, -5, 16, 1, -30, 5, 16, 4, -18, -13, -1, 9, -28, -16, 18, 14, -13, -13, 15, 6, -15, -19, 12, 9, -4, -12, 5, -9, -19, -3, 10, 3, -11, -12, 9, 8, -10, -4, 22, 12, -10, -2, 16, 3, -16, -9, 22, 4, -10, -6, -8]
3545hK5k4j9K4J5k1pPJ5pj6J3PplJ0Lj6PMqrkK1Kj7mJ6Kmj0J5J5l4jJ1K1k2j8
3584b4K3J5j4j2MJ5Qm1J8J8pj7jK0Jl4J3J8Lj4oJ5%k4J4K7j6j6J4K3j1k7KK9k
3619A4l1kK6lk1j5K6J9k2%J1J5k8pJ6J3k5jJ0Pj7PjJ7j1lQJ0l0KJ8Qk2j2L4Ok2
3656fj3J8LpnJ2J6j6l0J5K2j3k4K4K6k9k1J6K3k0pPJ2Jj2j0K1j1pJ5Mj5j7K2K4
3691A8k1k6J5K5qk8OK6rk7OM2nk8qL3Qm3KK4opnJ1Kj5lJ4Pk0J2MJ1k6J1J9jk3
3729a3j6L8qk0pL4mk0lJ3J8j7k1J9K0j8k7L9J9l1j2J7J1k1j0J4J8j3j3%J9rj7
3762b1J7K0k7j3L0Pk6j3K5J5k5j7K4L5l6pPK7j0k5%L8j6l9J5K9ok3MJ7jk3J2J5
3796Ij1j6J0J8ok3K3K0l3j3QJ9%l1J5K8rl7LL4lk2rL3J3l4mK8lj7oJ9J5k6oJ5
$$ y = [-8, 17, -7, -26, -2, 13, -8, -15, -8, 7, 0, -16, -3, 4, -3, -6, 4, 7, -9, -2, 2, -6, -15, -17, 4, 6, -11, -15, 1, 3, -1, -11, 4, 19, -15, -16, -5, 16, -6, -24, -1, 14, 0, -12, -8, 7, 15, -26, -8, 10, 3, -14, -15, 5, 6, -28, -15, 3, 6, -8, -14, 1, 1, -23, -9, 18, 2, -14, 0, 23, 12, -15, -13, 16, 14, -17, -19, 7, 4, -17, -32, -6, 13, -9, -9, 2, 17, -11, -18, -2, 11, -14, -15, -5, 2, -15, -8, -9, 8, -3, -6, 2, 12, -18, -16, 2, 10, -12, -24, 10, 16, -6, -19, -1, 2, -5, -10, 2, 18, 2, -28, -13, 9, -4, -28, -4, 22, -7, -28, -12, 11, -9, -16, -9, 3, 4, -8, -18, 3, -8, -15, 0, 4, -11, -28, -6, 18, -3, -29, -14, 11, 3, -25, -19, 7, -2, -29, -23, 19, 14, -14, -22, 11, 19, -24, -22, 2, -4, -11, -16, -5, -3, -18, -21, -7, 0, -20, -8, -4, 7, -19, -8, 11, 10, -13, -29, 9, 1, -19, -26, 8, 4, -16, -19, -6, 12, -5, -26, -7, 13, -5, -32, 7, 26, -5, -17, 0, 11, -10, -20, -6, 12, -1, -14, -14, 5, -4, -21, -4, 16, -11, -24, 6, 13, -13, -26, -1, 14, -11, -28, -4, 31, -5, -12, -5, 22, 12, -13, -13, 25, 9, -30, -15, 14, 8, -15, -11, 6, 5, -18, -6, 9, -2, -18, -8, 10, 4, -19, 4, 24, -9, -22, -14, 5, 5, -26, -11, 17, 8, -29, -26, 8, 5, -17, -26, 7, 20, -14, -18, 10, 7, -10, -16, 3, 18, -8, -14, 1]
3832ANj9jJ7oj3KJ7j0j5jK0J1k9mM0Kl8rM6nj5k1L0J4k5k0J7J6ql1J7K8j6k1K5
3868Am%j1MK1j1j5PK3k6oK1Lj4l2L4K7l1k0J2L5j7l1K3J9j8j6LL2%k9mL8ok6k
3904a6K8jl2KK0Nl0QOJ0j2jJ9lj8PK6k1k8J8K2jk8PK7Jl1rL3Qk6j1K4K1l0k1L3
3941FK3k7k2K9%j1j0J9nlj1J7qj0pL9k0k1lK9jk0j6L5J8l8j0L8J8l9j4J6L0k2
3975aj7J3K1Jm4K0J4kk1MK6ok6J7J8j4j6J3J3j8j2J9J5j9pJK8k1k9J6L1j4k0M
4009a3L4j1l6J2K6Rm0QK5J2l9mK2J4k7kJ1J2k7LK9j0k1NK4kk8KL3nl4LL0nj2j7
4045a9L1Ml2j0L0J4k6k0K8K1k9j4J2K3j7j7J8J7j5j2LJ2Mj5J1Oj3qJ8Rl0j0L5
4078IJ0k6k3K1K3j9k2K5K1k2j7J5L1k2l9K7K5rl3ML4j8j0MJ8qj4J0J0Jj7QJ7p
$$ y = [1, 6, -13, -14, 3, -3, -16, -14, 3, -7, -22, -23, -3, 8, -21, -25, 15, 17, -21, -30, 16, 11, -4, -25, 5, 19, -6, -26, -9, 7, -1, -32, -15, 13, -3, -24, 1, -3, -3, -14, -10, 11, 0, -15, -8, 15, -11, -17, 4, 7, -7, -39, -5, 22, -9, -29, -17, 18, 1, -30, -7, 12, -6, -22, -19, 13, 13, -16, -20, 18, 12, -14, -16, 12, 11, -21, -19, 1, 6, -24, -16, -10, 0, -12, -13, 6, 3, -15, -8, 18, -3, -31, -13, 9, 8, -20, -13, 14, 15, -16, -25, 8, 16, -10, -21, 3, 24, -6, -27, 6, 29, 2, -20, 9, 9, -2, -12, 7, 2, -1, -12, 5, -3, -13, -20, 19, -1, -22, -25, 4, 3, -17, -33, 2, 20, -18, -28, 10, 28, -11, -25, -9, 21, -1, -18, -5, 16, 17, -27, -7, 7, 5, -16, -12, 14, 8, -18, -1, 17, 3, -13, 0, 13, -5, -17, 2, 17, -2, -9, -8, 20, -1, -30, -14, 17, 3, -17, -13, 21, 10, -26, -14, 12, 21, -19, -11, 14, 26, -13, -17, 5, 19, -8, -10, 1, 13, -14, -11, 18, 8, -13, -8, 16, 14, -14, -12, 21, 16, -18, -15, 15, 10, -2, -19, 12, 16, -16, -26, 4, 18, -8, -28, 0, 21, -8, -22, -10, 13, -4, -21, -3, 14, -1, -13, -10, 2, 6, -9, 2, 8, -5, -13, 5, 14, -16, -26, 9, 19, -7, -30, -9, 14, -5, -27, -2, 19, -3, -20, -5, 26, 4, -35, -8, 17, 8, -25, -21, 13, -5, -15, -11, 7, -1, -15, -5, 5, 6, -11, -3, 14, 7]
4112Gk2QJ2Nk5lL4ol4MM0j8j9LL0ll4JK7Rl5qL3J0j9rK0Pk1JJ7Jk0mJ2Qk7NJ6
4151Ckj8nL6ok2LK4J0l2j5L7Ol5qL1Rl1lK3kJl4K2K6j8l1J6K9j4j3J4J1j7lQJ5
4188A5k1JJ4lj7oRK4j6k0J3K3rm2K4L6j8m0K9K7j6k6KK1J4k0j3K4pk4OK3nrnJ9
4224Gqj5J5J4k5%QK1k0j2JJ4J3l6ML8%l7LK6Nl7nK5J7l0lJ5J2pj1KK7k1k3K6J3
4261A6k4KKJ3k0%J1J3k5j1K4Joj1J3K4k8j6K1K2j6l3K4K9k6k2K3J1j4k5K0J4%
4294Fj3JJ5ol1J9K0j1rMJ3j2pPJ0pj9K4Nql0J8L0j4k3J2K0j1k6PL3kk7oL4mk6
4331a4LJ7kj5MJ3Kj9JRJj4J2JJl0RK8rj5LK8qk2rM1Jl4JM0nk7j9K6J4k3j6L2M
4370A0k5mJ3J1j3j2J6J0qpJ2mj3QOJ3j9j4K2Mk8LJK3k0j4K9J1j3k1K6Pj3j7J2
$$ y = [7, -15, -7, 5, 10, -15, -18, 16, 10, -24, -20, 20, 2, -17, -14, 16, 13, -21, -20, 7, 16, -19, -27, 6, 16, -3, -12, 8, 15, -6, -5, 12, 13, -7, -11, 1, 9, -18, -13, 3, 1, -17, -22, 14, 8, -14, -11, 13, 23, -9, -24, 13, 19, -16, -24, 7, 16, -15, -18, 5, 3, 4, -30, -8, 18, 0, -31, -15, 14, 0, -13, 1, 12, -5, -8, 0, 15, -6, -5, 9, 6, -11, -17, -8, 16, 0, -20, -7, 16, 7, -35, -11, 25, 7, -33, -4, 23, 7, -19, -17, 4, 18, -2, -15, 9, 2, -22, -16, 7, 2, -7, -12, 7, -1, -16, -1, 13, -12, -12, -4, 17, -3, -15, -14, 0, 13, -23, -19, 19, 19, -18, -15, 11, 16, -21, -26, -1, 16, -14, -17, -2, 10, 3, -8, -6, 21, 0, -23, 3, 16, -8, -6, -4, 9, -11, -11, 0, 13, -12, -23, 1, 2, -4, -15, -2, 22, -6, -22, -1, 21, 5, -28, -4, 25, -1, -23, 0, 11, -3, -28, -8, 6, 6, -7, -6, 9, 3, -28, -9, 11, 0, -9, -5, 8, -4, -11, -4, 6, -1, -20, 4, 9, 1, -29, -11, 19, 5, -18, -6, 14, 3, -23, -16, 17, 15, -12, -18, 16, 12, -14, -11, 6, 4, -11, -7, 6, 8, -11, -10, -1, 0, -14, -2, -1, 0, -30, -21, 7, -2, -17, -14, 14, 6, -16, -25, 16, 17, -17, -16, 24, 19, -8, -27, -1, 13, -10, -26, 6, 10, -15, -19, -6, 5, -8, -20, -4, 6, -2, -9, 3, -1, -14, -6, 0, 13, -6, -20, 2, 6, -22, -19, -18, 5, -15, -29, 0, 11, -2, -23, 3, 10, -3, -20, -8]
4405hJ8ok4J1L1k7j7RJ2Nk8J0J9%k2J5J2j6j0J8Qj0k2K2J8k0j6ML4l0j3J5K0j6
4439dk1J2K9pk2J0QK1l5mJ8J0k2nK0Lj7kJ7Ok7OJ0pKj3J4rj5J9J7nk1RJ7kl1j
4477b2L7Ol5pK9Nl1nK6Kj2j6J6J8j8j1J3J1qj2NK0j1%KOj0pJ5Qk6oJ6Rk1MkJ7
4515Ej7j5J5K8qk1PJ2nj3J6Qok0MJ2oj8J4J1j3qJ3MrpOK1j3pRRnk6J1J5Kk8kL5
4555A0rk3OK0kk0rL0Oj5jJJ9j4kJ5pj7j0K4Lj1j7K7pk3J2J4%j5nJ3Qj7oK8qj7
4593a9j0L1J5k8j2K0J6k0j7K8Jj0j8J4K4j6j3JPj8K2OQk8J2LQpnjJ9j6pORj9j0
4630b4J8J6j7j5J9J2j6k6K7J1Mk9RJ4LqkQjk0jJ5Mj4MJ3nk2J0J6j2j3J8OorQJ3
4668Hj2j2JK8Om2J5K4j3k2PJ2nj2mK0Kj2mJ7jKj6K3Kk3LJ4qjrK8j3rMJ3mj8lK0
$$ y = [-8, 10, 4, -20, -9, 22, -5, -22, -13, -1, 4, -24, -14, 5, 5, -17, -2, 10, -6, -16, 2, 10, 0, -22, 0, 18, -2, -18, -14, 20, -10, -23, -8, 12, -4, -25, -13, 16, 9, -13, -3, 5, 26, -9, -13, 5, 15, -7, -12, 8, 11, -6, -8, 9, 15, -12, -6, 4, -3, -1, -14, 0, -9, -24, -5, 12, 7, -14, -5, 12, 10, -21, -22, 15, 21, -14, -21, 8, 13, -18, -23, 3, 5, -7, -23, -7, 11, -7, -18, -5, 6, -2, -14, -9, 11, 0, 0, 2, 8, -2, -9, 6, 14, -12, -18, -2, 7, -14, -10, -12, 5, -12, -27, -12, 16, 8, -13, -6, 6, 1, -12, 4, 12, 6, -14, -10, 2, -4, -22, -8, 3, -10, -18, -5, -1, -10, -17, -11, 10, -3, -10, -1, 8, 3, -23, -12, 3, 5, -23, -25, 10, 1, -22, -16, 4, 2, -18, -27, 3, 9, -6, -7, -6, 13, -1, -3, 12, 5, -12, -22, 2, 5, -6, -23, 4, -3, -26, -14, 0, 0, -15, -20, -7, 1, -16, -22, 6, -2, -19, -29, 2, 17, -11, -23, -3, 13, -7, -24, 4, 5, -5, -23, -9, 15, -1, -14, -13, -6, -24, -2, 4, 12, -16, -4, -1, 7, 0, -5, -6, 13, -3, -10, -4, 5, -14, -24, -6, 10, -7, -22, -3, 9, -7, -33, -6, 5, 9, -20, -11, 3, 6, -2, -4, 4, 3, -17, -18, -3, 1, -13, -9, 4, -1, -23, -13, 3, -9, -22, -4, 2, -4, -13, -5, 8, -4, -16, -15, 13, 19, -23, -8, 16, 3, -19, -12, 0, -5, -17, -21, -1, 1, -11, -15, 2, 1, 3, -13, 10, 12, -11, -8, 6, -2, -3, -12, 16, 3, -6, -2, 11, 7, -11, -14, 6]
4708FNk0rJ4J1kj8J0J3j4j4K7%j4j8J8J2k1MjJ6j2lPJ2qj9J6J8j6j0J7Qpj9J2
4744AJ4j3j1J4Jlj8nL5j6j1NJ0j1j1QJ2kj6JJ1Pj2%J6m%pJ9j1j8QJ3mk1J8M%j8
4783a5LK4lj0mJ9lk7J0J0Pj8nMJ5k0L%PQj8J2Qj5oJ1Mj2%J1QrqK0Rk6%J9oj9r
4824b1K3Nk3kJ4J2j3mOJ7j3j5RJ5lk6RK0j9jMOLj5KJ6j4JKQrrQJ4j1j0RJ8j6K
4864a%J0qrKJ5jk7J5J0Rl4MK3qkkJ1kj0pJ1Nj3J4mLj2ORqmpJ4j3jNJ9nj1j4K1
4906CQj4oQJ6k9JK3j0Ok2J1J3j9NJ2%j4lJ3Kj4LkJ3rpJ7Qj8j3K1J3j3k0J1J2o
4944@k0J6K2j8k1J1J8Jj3QR%k1JK0mj3LMm%jJ0nj7J8Mj2rJ3Q%k3J2J0jk6PL3j5
4984Ej4KJ7j1j0kK0oj1PLRj4nJ6nj0PjNjj3J4Jj0pJ9qk0JJ7Qj1qK0mj0lJ4J4k4
$$ y = [6, 11, -9, -18, -4, 7, 5, -13, -3, 10, -4, -18, 9, 9, -5, -23, -5, 7, -14, -10, -11, 5, -7, -10, -3, 9, 1, -18, -2, 16, 0, -10, 7, 15, 8, -11, 1, 15, 2, -9, 5, 6, 3, -15, -20, 15, -1, -12, -7, 3, -8, -19, -11, 1, -1, -17, -16, -5, 2, -10, -10, 6, 2, 2, -5, 14, 3, -15, -7, 6, 2, -19, -1, 3, 3, -15, -12, 12, 9, -1, -5, 14, 11, -16, -6, 4, 11, -7, -12, -8, 7, -13, -10, -10, -3, 5, -13, -1, 7, -8, -14, -3, 1, -11, -11, 0, 8, -1, -9, 11, 20, -6, -6, 13, 7, -12, -21, 2, 7, -16, -18, -4, 8, -5, -9, -3, 14, 1, -14, -5, 10, 7, -19, -10, 10, -9, -10, -6, 0, 3, -12, -10, 6, -8, -7, -5, 3, -6, -15, -7, 7, -4, -14, -5, 13, -3, -1, -1, 9, 1, -8, -6, 9, 8, -19, -4, 6, 15, -19, -15, 8, 0, -2, -4, 7, 5, -5, -12, -1, 4, -9, 5, 1, 4, -8, -2, 7, -1, -5, -12, 2, -11, -12, -7, 12, 7, -4, -18, 3, 11, -3, -9, -1, 15, -14, -13, 10, 0, 6, -16, -5, 8, -11, -6, 6, 6, -8, -11, 2, 4, -10, -7, -9, 4, -5, -12, 5, 13, -5, -18, 3, 16, 3, -17, -6, 6, 0, -20, -4, 18, 0, -21, -10, 8, 9, -4, 4, 13, 13, -8, -7, 13, 9, -4, -1, 3, -1, -1, -2, 8, 3, -14, 4, 8, -4, -13, 0, 8, 8, -15, -3, 7, 6, -20, -13, 20, 5, -9, -7, 10, -1, -11, -13, 7, 1, -10, -3, 0, 9, -5, -10, 6, 1, -9, -2, -3, 2, 1, -12, 2, 3, -7, -14, 5, -3, -23, -22, -5, 3, -8, -16, 4, 0, -10, -13, 1, 15, -9]
5025ipK3jqmLJ2kj7J0Rpj6J2k%nRPj0lkLNNlknpJ3LlmPQj3pKOLj2jJ2Lrj2J8m
5073bj4J7LMj2%J0Qk2LRj4JnJ4mp%J3qj1J4OnqJ3oPlpKJ1j0rJ4Nj5pJ6oKj1LP
5117dJoJ4m%joOjJoJ1pOmjKrPKj3lJ9rj0qJ5K1j9KK0rj2LkMjKmLQj1LNpRLpqk
5167gQJj%MKqmkNoMjR%j0kJ2j2l%J2poJ6n%RlNj1pJ8krkLMJmj1NmLjnO%nLPj2
5219a3RQlj4OJ0Pk4PLQj3Oj1J3jLJrQjQLj1Qj0J4k2J1nOk0J4JOj9OQMj6KLMMj7
5264a8J0J0Kj7J1PpLLKqpJ1j0lkRjNQj1PppQ%LlQ%j3kJ7lqoJ3jqjJPrnO%nJ2m
5313cNnNNj0jlRj2J6j2%OkKpOp%j%%J3knj0J0J%%KmKjOrjJ0pKnmMmJ4j1lJ2j1
5362a0RkjMKj0%J0ojJ9j9nJ2lrRkoJ2j1J4nmlQLm%nRJMpj1MJ1j4J1kj0jMJ6j6
$$ y = [-9, -16, 7, 6, -2, -6, -3, 9, 7, -10, 0, 9, 2, -14, -2, -4, -4, -9, 0, 7, -3, -6, -8, -5, 0, 5, 2, 0, -5, -12, 1, 4, 1, -3, 4, 12, -1, -8, -6, 0, 3, -9, -10, 2, 5, -4, -16, 2, -2, -16, 1, 4, 8, -4, -4, 6, 14, -8, -5, 4, -10, -9, -14, 0, -4, -11, -11, 2, -6, -17, -3, 3, -2, -10, 3, -3, 4, 1, -6, -4, 7, -3, -12, 2, 7, -8, -15, 1, -5, -3, -14, -11, -4, -3, -9, 5, 1, 1, 0, -6, 0, -1, 0, -6, 5, -2, 4, 0, -1, 1, -8, -1, 1, -12, -15, 4, -5, -15, -23, -8, 13, -6, -4, 16, 7, -5, -2, -4, 0, -1, 1, -3, 0, 8, -3, 0, 5, -2, 7, 10, 3, -5, -7, 1, 2, 1, 1, 5, 7, -1, -5, -7, -2, -8, -4, -5, 4, 4, -6, -8, 4, -8, -11, -11, 1, -6, -12, 4, -1, -1, 8, 5, 10, -1, -8, 10, 8, -1, -3, 0, 4, 5, 1, -10, -5, -9, -6, -7, -12, -6, -6, -11, -8, -1, -13, -4, 4, 1, -13, -7, 3, 10, -14, -7, -4, 4, -9, -3, -14, -1, -2, 1, 2, -7, 1, 0, 8, 11, 0, 8, -2, 12, -10, 1, -4, 2, -18, -4, -3, 3, -16, -10, -2, 2, -14, -12, -9, -5, -1, -18, -8, 2, 4, -13, -2, 5, -2, 1, 4, 6, -2, -9, 2, -8, -11, -13, -4, -5, 0, 8, -3, 4, -3, -10, -2, -2, 1, -2, 6, 6, -7, -9, 8, 5, -3, -9, 4, 3, -5, -6, -5, 2, -7, -12, -6, -6, -11, 1, -3, 2, -3, 2, 7, -3, -4, -7, 2, -10, 6, -6, -6, 0, -2, 0, -7, -1, -8, -8, -9, -9, -9, 4, 2, -3, -13, -3, -2, -2, -2, 0, -4, -2, -3, 3, -6, -7, 3, -4, -2, -7, -11, -7, -11, 3, -8, -11, 1, -10, -1, -3, -4, 0, 2, -8, -8, 2, -4, -5, 14, -5, -10, 2, -1, -10, -1, -3, -9, 3, -8, 6, 1, -3, -6, 2, 5, 1, 1, -4, 5, 6, 10, 3, -8, -4, 7, -7, 4, 2, -8, -9, -5, 11, -5]
5407eMnlPmLJ7j4lKMpLJrNqMnJ7mmjLKjj1NJ0%loMJmLoOKooMoJ1njJOoOQprJ5
5461EqpQLMj5MK%Nj2J0qOlNL%jLJ0j5mRPkj3RPnjpLRj4jJOjpmJ2j1%J4qJ6j9J1
5510FllKPqnOjJ2j4J2j3Pj3J%J4j1OPJpqQoRqlJ3j0OnRj6lJ0jLoQqL%jMNmOj0
5559blKJ8pnmjJ6j3nJ1kKrPRj7KKK1j1o%Oj0NKnpkKQqkJOn%%J3j5jMPnOj0J5r
5608ApNNJ9j3nJkmLlJmPnLmJpPkmRJnoK1rmpOoJL%mKMjl%pJ5pkpK0%j3J3j0Oj5
5661a2j3L0oqJ0pMnj3J9jllkJ4nj5J4J1j2j1K2Pj8j%NkpmJ3Oj4Ml%%J4j2JlJN
5704@nJJ3qj3J4olJ1ojKNj5J1pJ4k2J4joNpJ6oljJ3%j0kQj7J0mPmKnJ2Qk0MO%
5749DjmRj0%ONnmnOKj2LJJ1mk0J5Npj5K0kpRQpoLKkPj2J2j0Nn%Rj7pK1molJ3q
$$ y = [-5, -1, -6, -9, -2, -6, -3, 14, 0, -3, -1, 3, -4, -1, 0, -9, -4, -12, -8, -13, 4, 0, -4, -5, -2, 0, -1, -12, -7, 3, 3, 0, -6, -2, -1, -5, -2, -8, -2, 0, -6, -12, -8, -14, -3, -8, -9, -8, -2, -8, -2, 6, -1, -10, 5, -3, -10, -2, 1, 5, -10, -6, -4, -4, 1, -11, -1, -9, -3, -6, -1, 2, 2, 1, 4, 14, -1, -5, 4, 11, 9, -4, 5, 12, 7, 6, -1, 2, 11, -3, -4, -3, 3, 2, -5, -9, 3, -8, -8, 6, -2, 14, -5, 6, 3, 0, 2, 9, 1, -4, 2, 1, 13, -1, 11, -2, 5, -8, -7, -7, 7, -4, 2, 9, 10, 3, -5, 3, -3, 6, -2, -5, 8, -2, 4, -1, 8, -8, -11, -1, -2, 1, -5, 3, -5, -2, -2, -3, 1, 6, 2, 8, -2, -5, -3, 15, 8, 3, -1, -2, 14, 1, -4, 7, 5, 7, -2, 5, 14, -3, -1, 1, 22, 11, 5, 5, 11, 1, 6, 8, 3, -4, -6, -4, 4, -4, -6, -5, 1, -4, -4, -4, 9, -6, -7, -3, 4, -1, 5, -5, 10, 1, -6, -1, 4, 23, 10, 5, 6, 4, 0, 3, 0, 1, -3, 4, -1, 2, -2, -1, -8, -1, -3, -7, 2, 3, -2, -8, 13, 4, 0, -7, -1, -7, -6, -3, -3, -7, -5, -1, -2, -5, -5, -12, 3, -4, -6, -13, 7, 7, -6, 7, -3, 3, -12, -25, 5, -1, -9, 1, -6, -2, -7, -20, -1, -2, -5, -8, -10, 4, -1, -16, -2, 9, -3, -14, 8, 15, -3, -4, -4, 1, -1, -8, -12, 1, 7, -7, -3, -6, -6, -6, 8, -4, -3, -6, -5, 0, -5, -4, 9, 1, -12, 2, -4, -7, 4, -2, -3, -1, 4, -11, 0, -7, 7, -15, -1, -2, -8, -3, -10, 6, 0, -3, -4, 9, 9, -1, -3, 5, -12, -2, -6, 1, -3, -1, -6, 6, 14, -6, -2, 4, 4, 3, -1, 8, -2, -2, 4, 9, 4, 0, -5, 1, 3, -9, -6, -5, 6, 2, -18, -3, 2, -5, -20, 0, -2, -9, 0, 8, 1, -5, -2, 0, -2, 5, -7, 5, -5, 0, -5, -5, 4, -13, -20, 1, -3, -9, -12, 1, -7]
5797gJmJ9klj0LJ3j5rRKPpLMj4lJ2pJJ0lJ5j6lMJ1jj2Pj1RqlJ1omjJ2j1j0J1J4
5841Hj9LJ2Oj1nPPkj5J2Nj3J3j9J2Qj4LNnj9J4Lj0MOJ3Nk0RNmpOkoLqK1rqnQO
5886Cj3JNkKqJ3jPj4NJ5j4kJkKQOoj2lJ6r%pmJ0J3k4K0mnkOKKjNqNp%Nnj0jJ7
5934ENj9%J8pj1OJ2lJoMNkqRj2KnJ0nJm%Lj2nK2joK%Qj4kJ1KpoJ4k%qRknj2J5
5982@kpmROj4MJ6pj0OJ3pMj7J9Lj9lKRpMPnklpJ7%pJ2nrMRj3NNroOj0J6m%%kO
6031Cjj2%RJJjJ4k2PNPJk1J1KpJj1O%mMNlmKMjPK%qqK1qOj4RQkj1pQNj1jMJ1j5
6081hLRjkmJ1mjmmPQj3joLlK1pj8JJ5Pj5LPQj8jJ2J0j0j8J9%rmJMJpMJ1j2Jj1
6127a5NRj0J9Kj5%J2J2j6oN%j0NJM%j3NPqnJ6Jnj2NK2j9mRMLj3KPoj3J1NMk5O
$$ y = [-7, -6, -10, 9, 7, 4, -6, -3, 10, -5, -14, -5, -3, 4, -3, 0, 4, -10, -13, -1, -8, -7, 3, 0, 15, -1, -4, 0, 11, 10, -2, 5, -6, 3, -5, -8, 3, -3, -7, -8, 4, -7, -17, -6, 8, -11, -8, 4, 10, -1, -6, 1, 8, 6, -9, 3, 8, -5, 8, -11, 1, 9, -5, -2, 3, -2, -21, -7, -4, -14, -10, -4, 9, 14, -6, 3, 8, 4, -3, 3, 1, -5, -2, -10, 11, 2, -6, -11, -3, 3, -10, -9, -4, -6, -4, -12, 1, 0, 7, -7, -2, 13, -1, -3, -2, -4, -2, 6, 12, 6, -6, -9, 7, -2, -2, -9, -13, -3, 10, -14, 6, 2, -3, -5, 1, 3, 5, 4, 9, 1, 6, -1, -1, 4, -1, -11, -12, 5, 10, -9, -9, 9, 2, -9, -3, 9, 6, 7, 1, 5, 10, 8, 0, 9, -3, -1, -6, 4, -1, 0, -4, -4, -1, -13, -18, 4, 3, -3, -1, -1, 7, -7, -9, 2, 4, -3, -9, 5, 3, 3, -5, 4, 2, -3, -15, 0, -2, -9, -13, -4, 2, -12, -8, 8, 1, -9, -3, 10, 3, 7, -10, 9, 12, -7, -10, -8, 1, -6, -2, 5, 0, -2, -5, -12, 5, 5, -2, 10, 5, -4, 0, 9, -4, 1, 6, -3, -9, -3, -13, 3, -1, -1, -1, -3, 3, 2, -10, -10, -1, 0, 1, 0, 14, -8, -1, 4, 11, 12, -9, 2, 4, -3, -2, -13, -7, -7, -11, -7, -2, -5, -9, -7, -3, -4, 3, 5, 5, -3, -11, 10, 2, 8, -6, 3, 11, 9, -2, -9, -1, 4, -7, -8, -4, 7, -8, -5, 4, 3, 1, -3, 8, 4, 3, -1, -5, 2, 10, -3, -4, -10, -7, -10, 11, 4, -14, -13, 2, 9, -6, -3, 4, 12, -6, -7, 5, 15, 5, -13, 6, 6, -3, -7, -6, -2, -1, -8, -4, 7, -5, -4, -15, -10, -1, -11, 8, 10, -5, -5, 7, 19, 3, -3, 2, 2, -8, -3, -2, 2, 2, -11, -6, 1, -7, -12, 4, 5, 0, -12, -7, 15, -4, -8, 1, 5, 8, -5, -3, 4, -2, -15, -4, 1, 5, -20, -14]
6171a4J6j0lkJ6j5LPMrOqK0j9%kJ1klLRkk0LOOj4NJ2Kj3NLKrJ3nLKj2J0Nj4jK
6216cJ0j5kLKMj4J9j5kOpJ7oKOLoj3J5J4k4mJ2PorQlKj7J7Rj8PJ0j3QmKLj0PO
6260HjNj5JJ0j2nJ5p%qJJNLpJ7%j8NJ5mj0MjjjK%j0%JJ4j1mRJjlpQJoK0qlooK2
6309A3pj2jJ1Rj9pOMkNOpnJ%J7j3LPMk3J0NMj2OMj2%kLJj2J3%Rj5RQmmnMQnpM
6357@J1j2j3J1J1nj2kOl%J3%qoQP%j9J3JPj6J1JLlkKj0oJ1Pqj1OJ3j3%QOpLlM
6402DKj3MJ2jj0O%lj5J8%k2J8nOlK%%Qk1QJ0KrMPPj6LoNmJPqJ0j2KoRqQPopJ1
6450FnkmK0j1MkLJj0MpLOj4JNlkjJ7qlLjMmJ6j0mQj1Ooj%Rj0lkJ8k0PJ6j0j6J0
6497cKJ3j2nO%oMLljojnJ4rQJ%nLNjj0OJrJ0jJQj1jjMj3NJQrJ1kJk4K2NKj2JJ5
$$ y = [-14, 2, -8, -11, -13, 3, -12, -9, -2, 2, -7, -1, -9, 11, -8, -8, -10, 1, -1, -4, -1, 8, 6, -14, -11, -5, 1, -13, -8, 4, 6, -7, -2, 1, 3, -6, 7, 2, 5, 7, -5, 5, 10, -4, -5, -3, 7, -8, -10, -7, -5, -1, -15, 4, -11, -13, -7, -14, 3, -3, -1, 5, 8, 2, -11, 4, 18, -6, -10, 2, 9, 3, -6, 2, -1, 1, -16, 1, 10, -8, -1, 9, -4, 4, 0, 2, 5, -5, 2, 8, 7, 12, -3, -2, 8, -4, -9, 6, -1, -1, -9, -8, -7, -2, 1, -6, 11, 11, -7, -2, 13, 9, -1, 3, 2, 1, 0, 2, 2, -8, -8, -7, 7, -4, -8, 1, 2, 1, -2, -9, -1, 0, -6, 14, 6, 3, -3, -9, 13, 6, -6, -7, 4, 13, -6, -13, -7, -3, -5, 0, 6, -1, -6, -5, -5, 12, -1, 2, 9, 13, -10, 0, 5, 9, -3, 3, 7, -5, -5, -7, -4, -3, -15, -2, -2, 7, -8, 1, 9, 5, 1, -4, 0, 8, 3, -4, 0, 11, -1, -14, -3, 8, 3, -9, -11, -5, -8, -8, 5, 5, -3, -9, -1, 6, 6, -13, 0, 1, 8, -8, 3, 4, 7, 4, 2, 4, -6, -12, -1, 6, -2, -13, -7, 6, -7, -7, 1, 7, 0, 3, 0, 4, 6, -7, -3, 9, 8, -2, 4, 4, 1, -14, 4, 4, -18, 0, -5, 1, -2, 0, 0, 0, 8, -13, -5, 5, 7, -2, 2, 9, 16, 0, 3, -3, 2, -2, -1, 6, -2, 8, -4, -2, -8, 1, -7, 1, 8, 2, -5, 6, 1, -1, -5, 15, 4, 8, 6, 9, 10, 0, 4, -3, 0, 6, -8, -7, -2, -5, -7, -8, 9, 1, -2, 1, 0, 4, 0, 16, 6, 2, 10, -1, 5, -1, -2, -2, 7, -3, -6, -8, 10, -10, -3, 13, 3, -13, -3, -1, 12, 0, -5, 1, 1, -5, -1, 2, -1, -2, -8, -9, -14, 0, -9, -1, 0, 0, -5, -2, 3, 2, -8, -2, -1, -10, 0, -1, 0, 8, -3, -4, -5, -1, -14, -9, -8, 0, -9, 2, 0, 1, -23, -1, 4, 6, -6, -5, 10]
6547A0nLjJj0jkQPj4jPLj4KJ0j3J2J5j5KoLP%j3NJOrkJ5%j6%J3j3MmKKoJJNj0
6593a0%QLknJ5rj2NlNokKJMJlMJ%LKLj1LLJKoNNj7OMpMjj0J0Jj0OjnJ4j0RlmJ2
6644EJlJjrKkJOqKMj3QLJ0j4KoJ5j3J1kkNj0Q%%j0%kNJ3mpQj2j2J3JkJ3j4J0j1
6690a0OJ3mnqJ4kpnNkLJ%Pj5j3J3nK0j6J2%j4kJ3moJ1J2rmkkLo%J0Nj0nQOrpO
6736dnJ2kj2J4lpRJ6j3rLnNnPJoj2O%J5Lj0%NnNkjkjLPppJkJ0j0J1j1noJ3lNk
6784fJ7Kj5kj0K4j6J0NmoPlJqnJ1njMLj1MpPPjj6J2%nPlLJj4KJ1LMj0J1k6LJ6
6829Aj2J9qkOM%j8J2PlNj7J0nnONj0kOJ0k2J5lpRqqJ3lPMmqJ4pMj4mK0q%KOk1
6875a4J3j5J1MklOk%nJ4jj5J8rllPrJ0lMkj0J0j1J1lrJ1oMjJ3qjN%nJlmrPkkM
$$ y = [10, 5, 8, 7, 8, -2, -3, -5, 3, 10, -4, -5, 2, 5, -9, -7, 3, -10, 2, 17, 2, 4, -2, 1, 8, 8, -5, 0, 1, 7, -2, -4, 11, 11, -5, -5, 8, -5, -1, -5, -3, -1, -7, -6, -5, 0, -10, -10, -2, 1, -1, -6, 9, 0, -12, -7, -10, -5, -11, -13, -11, -10, -6, -5, -8, -4, -3, -3, 0, 2, 5, -6, -3, 0, 1, 3, -3, 2, 7, -10, -4, 0, -7, -3, -4, -14, -4, -3, -13, -7, -8, -13, 1, -9, 0, -3, -7, 5, 6, 3, 4, 3, -6, -4, -6, -5, 1, -7, -5, -1, -14, -6, -3, 7, -7, -5, -11, 4, -9, 2, 0, -2, 3, -7, 1, 1, 1, -9, -9, -11, -6, 7, 3, -4, 4, -8, -20, -7, -6, -8, 5, -9, 1, -10, -4, 9, 5, 0, -8, 6, 4, -3, -8, -3, -5, -2, -1, -1, 6, -9, -22, -9, -14, 6, -10, 2, 2, -12, -14, -1, -5, -11, 0, 12, 3, -1, -3, -5, -2, -8, -8, 2, 7, -3, -8, 0, 6, -3, -10, -4, -9, 3, 1, -11, 3, 0, -7, 2, 18, 5, -4, -1, -6, -1, -6, 1, 2, -4, -16, -10, -10, 5, 8, -2, -2, 3, -2, 3, 1, 0, -2, -3, 0, 7, 0, -7, -6, -8, 2, -8, 3, -8, -13, -19, -6, -9, -4, -6, 11, 13, -2, -4, -14, 10, -6, 4, 9, 5, -1, 6, 3, 4, -4, -9, 2, -3, -4, 0, 3, -8, -4, -11, -4, 3, 2, -14, -2, -2, -7, 0, -3, 0, 1, -13, -11, 0, 3, 7, -3, 8, -18, -15, 1, -11, 8, 0, -2, 4, 8, 8, -10, 2, 9, 6, 11, -6, 4, -1, -6, 0, 5, -5, -7, -1, 9, -13, 2, -1, -8, 1, -7, -15, -2, -5, 2, 6, 2, -6, 8, 1, 5, -9, -13, 7, -1, -1, 1, 7, -14, -1, -16, -5, -1, -3, -6, 0, -2, -2, -7, 7, 6, -9, 9, 0, -3, -6, 1, -8, 2, -1, 3, 1, -9, 1, -10, 1, -2, -11, 0, -6, -2, -3, 10, 2, 1, 6, 6, 1, 2, -1, -5, -14, -7, -9, -11, -7]
6922gkrJ4JJK%%JKKmLj1J0jLpj6J4Mj1MNNpRqmLKORj9OLjOj3OLJppN%LLmmKpO
6975eJ9j5JJjkMmJJkJO%qPmpkNkkJ0j3J0Nj3J0JomMKLKkkj4J7moNJMpKj1J3%m
7025emOJnLK%jkJJlMoRjj1kRljLPjpMlMpJ0rOJj8J5%kqRKj2%MpJ4oJ4%j0PLj0
7077eJJ4rpjJ1j0KjKJLj5NJRkpOMnpJ7j8J5nJ0jj3J1onoONlqNlJQ%%RlnlnNkL
7128alQpkJ2j4oNPKqJ%MJnJ1j3MPrJ3j3%%LjkJKlJ%kL%mJ5rJpQQj5J0n%jOPop
7180c%nkPLJp%lLJnJ8kn%J%%jp%J8j2omJ1pQnNj6NLJMkMrOJ3j7J7pj3LN%NqNp
7232fOqJ0mqJ0j2OjQnPJOj4kNLrKjjJ0r%kjkNJkJ3oqJ0LroJ1nRpj5J8j3%QoKO
7282bjmRomJ1rJ2rkKMOnj2J1rJJjj4J4KKLljJ2k1OJ7j7MjrJ8Rj3lLo%nONJj0K
$$ y = [-7, -9, -18, -4, -3, -2, 0, 0, 0, 1, 3, 5, 1, 4, -7, 3, 2, 5, -2, -18, -4, 0, -11, -7, -2, 3, -4, 5, -3, -7, -4, -2, 4, 13, -6, 0, 3, 2, 8, -5, 1, 4, 5, -2, -9, -4, -4, -1, 2, -2, -6, -4, -11, -5, 14, -1, 0, 1, 0, -2, 2, -2, -1, 0, -2, -1, 5, 5, -3, 4, 0, -7, -9, -4, -6, -8, 2, -11, -1, 4, -9, 1, 2, -4, -8, -4, -2, 1, 3, 1, -1, -15, 2, -2, -8, -3, -2, 2, -5, -3, -14, -1, -1, -5, -9, -3, -2, -7, -4, -2, -2, -3, -5, -4, -3, -6, -2, -8, 1, 0, -11, -13, -4, -7, -8, -5, 2, 1, -6, -2, -5, -1, -8, 2, -7, -1, 0, -18, -3, -3, -5, -13, -4, -2, -14, -14, -10, -17, -3, -9, 5, 5, -5, 2, 5, -5, -4, 10, 1, -6, -7, 4, -6, -4, -5, -3, -2, 1, -14, -9, -8, 1, -1, -8, -2, 2, -3, -10, 7, -11, 4, -1, 9, 8, -5, 6, 0, -5, -11, -5, 0, -3, -11, -6, -9, -8, 0, 0, 0, 9, 6, 1, -2, -7, -2, -4, -1, -4, 4, -3, -5, 7, -7, -13, -8, -1, 1, -7, -6, -6, -2, -1, -6, 5, -8, -4, 3, -6, 7, -6, -6, -6, -3, -4, -6, -5, -3, -6, -5, -5, -7, -4, -4, -8, 7, -2, -1, -8, 0, 8, -7, 3, -2, -2, -3, 3, 10, 4, -3, -3, -8, -10, -3, 0, 1, -6, -6, -9, -6, -5, -10, 8, 6, 1, 1, 2, 2, 2, 1, -6, -6, 12, 0, -6, -10, 1, -6, 2, -3, 2, -14, -9, -6, -5, -1, -3, 1, -8, -2, 11, -6, 11, 4, -9, -6, -1, -1, 4, -4, 1, -6, 0, -8, 2, -2, -10, 0, -12, -6, -7, 1, -4, 3, 4, 10, -4, -6, -1, 2, -7, -5, -6, -7, 3, -6, -6, -8, -9, -11, -6, -5, -7, 6, 0, -8, 2, 5, -4, -10, 1, -4, 5, -2, -17, 1, -12, -12, -4, -10, -8, -2, -3, -7, 2, -4, -8, 3, -6, 6, -3, -5, -3, 1, 7, 2, -10, 1, -8, -7, -6, -7, -21, -7, -5, -3, 0, -3, -4, 8, -13, -7, 10, -7, -3, -4, -13, 5, 14, 1, -2, 1, -5, -5, -10, -4, 1, 2, -8, -6]
7330fqPRoNKnpjOO%qJ5jj%kpLpQlpOrKOjL%pQkjJJlQnkNrLnJ0j2J4j0J0lj1NP
7384AmLoJ1koJ2rQj4lJ3jj4J1pjJ2noQ%nQnpJ0kpPQjj0J2JrjJLj5J2%rnMPj3O
7432iJ3Loj0PJ5j4lJ0j2MkkkPJlQj0qJ3mlLKLnLKk%Lj2MjNlMmMnMLrJ4nlQrLm
7483d%knJ3mLJmlLkkpJ3j0NLj5J4LpJ3Lj5K%MJ2j0JJNj5J0pjLKmJoKJ0j2QoRo
7531cjQmOKmlK%jj0oRkQorNmJ0rJ1o%O%J3j2nnMJ8j4R%pkkNnJoJJ1j3J0Pjj3J1
7581D%jPj5PKmmmNKkjJ5j0Nj5J3Nk0J2Nj4mOKJPk%JpqQjJ1nKkm%LLjlJJmOK%j3
7633hJ9rOlj2Q%qKOkmJOoQLoRokNj0PJmOoNqjjnJ0nlNnRq%QJ1j1%NrJpQk%mlP
7688bLo%JJ5j2lJ2jj1J1lkmJ7j3nJ0%%njqJ2ljj4J7njk%NLN%mlOLkj0lJ3Jj1Q
$$ y = [-6, -14, -7, 2, -4, 1, 3, -2, -9, -10, -4, 2, 2, -6, 9, 8, 7, 7, 5, -2, 1, -6, 2, -1, -8, -2, -11, -9, -3, -4, -1, -1, -8, 0, -2, -3, -2, -1, -4, 4, -1, -3, 2, -7, -4, -9, 1, -11, 3, -7, 3, 0, -11, -6, 1, -3, 0, -6, 5, 3, -3, 9, 0, 8, -6, -9, 4, 3, -11, 0, -7, -8, 4, -1, -7, 1, 1, -4, 4, -1, -8, 2, 0, -7, 0, 8, 7, -3, 9, 10, 1, 0, 1, 4, -11, 1, 1, -8, -13, -9, -2, -15, -9, 4, 7, 1, -9, -2, 13, -1, -4, 6, -6, -2, -4, -6, -8, -1, 0, -3, 5, -5, -13, 0, -4, -7, -4, -2, 1, -4, -1, 1, -1, -1, 2, -10, -6, -7, -2, -5, -1, -5, -1, -6, -2, 1, -8, 6, 1, -2, 6, -3, 0, -4, -4, -6, -11, 2, -2, 1, 2, -2, -5, -2, -4, -6, -13, 0, -10, -5, -2, -17, -3, 0, -7, 6, 9, -6, -4, -4, 0, 12, 2, 3, 4, 9, -6, 4, -3, -4, -1, 1, -3, -2, -8, -6, 4, -8, 0, -6, 3, -3, -4, 4, 0, 6, 8, 4, 1, 3, 3, 2, -8, -14, -5, -7, 1, -5, -14, -9, -13, -3, -12, -1, -7, -7, -1, -1, 12, 0, -5, -10, -6, 12, -2, 7, 7, 0, -2, -4, 1, -4, -3, -9, -8, 3, -10, 0, 7, 6, -7, 4, 4, 3, 10, -5, 2, 4, 0, -4, -8, -3, -1, -3, -4, 11, 1, 6, -9, 4, 9, -11, 1, 6, -8, -12, -6, -4, -3, 4, 2, 2, 3, -4, -12, -4, -5, 6, 1, 3, 1, -3, -3, 0, 3, 2, -1, 0, 1, -3, 3, 5, 5, -8, 11, 2, 8, 5, -7, 1, 1, -7, -5, 1, -1, -5, -4, 2, -4, 4, 7, 1, 10, 4, 2, 7, -3, 4, 5, 1, 7, 1, 6, -2, -3, -4, -9, 1, -4, -7, -2, -7, 2, -6, -6, 2, 13, 2, 2, 7, -2, -1, -8, 0, -2, -2, -6, -9, -2, 1, -5, -5, -4, 11, -1, -4, 8, 7, -4, 7, 4, 2, -2, 15, 2, -3, 7, 7, 7, 2, 1, -7, 5, 2, 1, -13, 4, -1, -2, -4, -4, 1, 4, 9, 9, 5, 2, 8, 11, 9, -1, -4, 9, 10, -1, 7]
7735GLrmJ4j2JPj3OJ2j5JLNmj0J3jp%J0oj5POMj0J7j0Nj5J0j3K8j3jN%%JJnOm
7779EPj1%JnkQoJJ0j4LqJ7nmQokMlP%pmJ5kp%kMj%k%nmJ0%oMQllJpJ1Qj8OKqJ
7832dlPj6J6Oj0lPM%m%%Rj4%OqPj1J2Mj0oOjKPlkmjJ2kpMRmj1QQjj4nRlnmOPq
7883hJJRjlqRJ7j4Lj0MKJJ0j2OpLkj0J5Nj4Mn%mK0j0oJ6j8OOkkkQnoN%%pkN%k
7932dj0J2j1J0kJ4k1QjJ5pj2PQrnK0j1Oj2nJ5Kj0qJ2kljPJlpNOJlnQm%%NlnjO
7979Cj6lJ2Rj0LJQp%QjrMKMjlojnmJ6jkmlJ0pJjKJkNMJj2nRk%PKpRo%jmJ2mrK
8033aMjPjj3J8j4J1mMLnj1lJ0LJjj4KQqlMJkLM%Q%lj0jJ2j2PNp%qkJ7njOmLnL
8083ELJ2k1KK1j7lOknmMJ0klMmpnNLmj1J2LljR%Nj8J5rLknJoQmJ2Nj0Qj1pJ1N
$$ y = [7, 10, 1, -3, 11, -1, 0, 7, -6, 0, 12, -3, -2, 1, 6, 2, -8, 5, 4, -3, -3, 7, 1, -14, -7, -1, 3, -7, 10, 0, 5, -10, 0, -13, 15, 2, 1, 6, 6, 6, 7, 8, 3, 9, 5, 12, 1, 1, 2, -3, -5, 3, -3, -2, 8, -6, -3, -11, 6, 1, -3, 5, -1, -3, 1, -2, 5, 5, -2, -6, 9, 7, 0, 0, -2, 2, 1, 1, -1, -1, -6, -10, 0, 0, -6, -2, 6, 3, 0, 1, -6, 5, 13, -5, 1, 3, -5, -4, -7, 0, -16, 0, 6, -4, -7, 0, 4, 4, 0, 0, 0, 9, -5, -5, 1, -7, 0, -11, 1, 5, -5, -11, -5, -6, -4, 3, 0, -2, -6, -7, 5, 3, -4, 0, 9, 5, -6, 2, 10, 9, -5, -10, -1, -4, -9, -13, -7, 0, -8, -7, -6, 3, 2, -1, -9, 0, 17, 3, 6, -4, 0, 2, 3, 13, 1, 7, 0, 3, 1, -9, 6, 11, -3, 1, -4, -4, -8, 12, 2, -4, 12, -6, 0, 6, 4, 2, 0, 8, 3, -3, 2, 2, 2, -5, -7, -2, -2, -4, -14, -2, -13, -3, -5, 9, -12, -4, -5, 10, 3, -9, -2, 6, -3, -8, 12, 1, 7, -5, -10, 5, 7, -3, -11, 1, -1, -4, -5, 2, 3, 0, -7, -2, 4, 5, 2, -3, 5, 1, 1, 1, 6, 3, -2, -3, 3, -13, -16, -4, 5, -5, -2, -1, 7, 0, 0, 8, 7, -2, 2, 4, 8, 7, 4, -2, -3, -8, -12, 4, 3, 1, -3, -6, 4, -3, -2, -3, -1, 0, -2, 3, 7, 8, -4, -9, 0, -2, -2, 5, 7, 0, 9, 3, 3, 2, -2, 10, 6, -3, -1, 3, 2, 9, 8, -5, 13, -1, 10, 6, 10, 13, 8, -3, -6, 4, 7, 8, 7, -7, -5, 3, -5, -8, -4, -3, -5, -2, 2, 2, 10, 10, 7, -3, -4, 8, -4, 3, 8, 1, 1, -7, -9, 8, 3, 2, 8, 4, 7, 2, 5, 8, 20, -1, 1, 22, 5, 2, 8, 6, 1, -3, 1, 11, 9, 6, 10, 6, -1, -6, -1, 2, -2, -13, -1, 2, -1, -2, 7, 7, 12, -6, 9, 0, 3, 1, -4, -3, -9, -1, -5, 7, 12, 2, 10, -1, -8, 3, 8]
8131HpkjPMOj0kjKOj2NplJMjrkONkJJ1Pk3J2PjojJ1mrJ4rMoljmJ1j5NMJNkJ0p
8182GJjLlnJ0mnp
$$ y = [8, 1, -1, -2, 5, 9, 15, 5, 3, 2, 4, 10, -2, 3, -4, -7, -6, -2, -3, -12, -14, -8, -3, -5, -4, 7, 14, -9, 3, 10, 9, 3, 2, 13, 9, 0, 14, 5, 9, 3, 0, -1, -5, 6, -9, -4, 0, 1, 6, 4, 14, 7, 8, 7, 10, 7, 2, 12, 8, 3, -4]
8191d
##END NTUPLES=NMR FID
##END=
