##TITLE=1H_Pr 1H
 200.13MHz,CDCl3,
 8 sc
 
 22.4.2025
##JCAMPDX= 6.0         $$ Bruker NMR JCAMP-DX V2.0
##DATA TYPE= NMR FID
##DATA CLASS= NTUPLES
##ORIGIN= UXNMR, Bruker Analytische Messtechnik GmbH
##OWNER= pz
$$ XWIN-NMR		Version 3.5
$$ Tue Apr 22 16:06:28 2025 Russian Standard Time (UT+4h)  she@DPX200
##.OBSERVE FREQUENCY= 200.1313
##.OBSERVE NUCLEUS= ^1H
##.DELAY= (6, 6)
##.ACQUISITION MODE= SIMULTANEOUS
##.ACQUISITION SCHEME= undefined
##.AVERAGES= 8
##.DIGITISER RES= 18
##SPECTROMETER/DATA SYSTEM= spect
##.PULSE SEQUENCE= zg30
##.SOLVENT NAME= CDCl3
##.SHIFT REFERENCE= (INTERNAL, CDCl3, 0, 14.3821)
##AUDIT TRAIL= $$ (NUMBER, WHEN, WHO, WHERE, WHAT)
$$ ##TITLE= Audit trail, XWIN-NMR		Version 3.5
$$ ##JCAMPDX= 5.01
$$ ##ORIGIN= Bruker BioSpin GmbH
$$ ##OWNER= she
$$ F:/spectra/data/she/nmr/H-C/1/audita.txt
$$ ##AUDIT TRAIL=  $$ (NUMBER, WHEN, WHO, WHERE, WHAT)
(   1,<2025-04-22 16:05:09.32 +0400>,<she>,<DPX200>,
      <created by zg, POWCHK disabled, PULCHK disabled
       configuration hash MD5:
       00 E9 B6 7A A2 85 ED C7 34 08 36 98 17 FE 4E 26
       data hash MD5: 16K
       D6 59 98 AC E8 82 C4 8D 73 E7 E7 B9 15 95 01 F0>)
$$ ##END=
$$ 
$$ hash MD5
$$ E6 8F 76 8A 88 EB 6B A9 BC 39 9D 83 DE F9 23 46
##$RELAX= 
##$RELAX= 
##$RELAX= 
##$RELAX= 
##$RELAX= 
##$RELAX= 
$$ Bruker specific parameters
$$ --------------------------
##$DU= <F:/spectra>
##$EXPNO= 1
##$NAME= <H-C>
##$PROCNO= 1
##$TYPE= <nmr>
##$USER= <she>
##$AMP= (0..31)
100 100 100 100 100 100 100 100 100 100 100 100 100 100 100 100 100 100 
100 100 100 100 100 100 100 100 100 100 100 100 100 100 
##$AQSEQ= 0
##$AQ_mod= 1
##$AUNM= <au_zg>
##$AUTOPOS= <>
##$BF1= 200.13
##$BF2= 200.13
##$BF3= 200.13
##$BF4= 200.13
##$BF5= 200.13
##$BF6= 200.13
##$BF7= 200.13
##$BF8= 200.13
##$BYTORDA= 1
##$CFDGTYP= 0
##$CFRGTYP= 5
##$CHEMSTR= <none>
##$CNST= (0..31)
1 1 145 1 1 1 1 1 1 1 1 1 1 1 1 1 1 1 1 1 1 1 1 1 1 1 1 1 1 1 1 1 
##$CPDPRG= <>
##$CPDPRG1= <>
##$CPDPRG2= <>
##$CPDPRG3= <>
##$CPDPRG4= <mlev>
##$CPDPRG5= <mlev>
##$CPDPRG6= <mlev>
##$CPDPRG7= <mlev>
##$CPDPRG8= <mlev>
##$CPDPRGB= <>
##$CPDPRGT= <>
##$D= (0..31)
0 0.7 0 0 0 0 0 0 0 0 0 0.03 0 0 0 0 0 0 0 0 0 0 0 0 0 0 0 0 0 0 0 0 
##$DATE= 1745323508
##$DBL= (0..7)
120 120 120 120 120 120 120 120 
##$DBP= (0..7)
150 150 150 150 150 150 150 150 
##$DBP07= 0
##$DBPNAM0= <>
##$DBPNAM1= <>
##$DBPNAM2= <>
##$DBPNAM3= <>
##$DBPNAM4= <>
##$DBPNAM5= <>
##$DBPNAM6= <>
##$DBPNAM7= <>
##$DBPOAL= (0..7)
0.5 0.5 0.5 0.5 0.5 0.5 0.5 0.5 
##$DBPOFFS= (0..7)
0 0 0 0 0 0 0 0 
##$DE= 6
##$DECBNUC= <off>
##$DECIM= 32
##$DECNUC= <off>
##$DECSTAT= 4
##$DIGMOD= 1
##$DIGTYP= 9
##$DL= (0..7)
0 120 120 120 120 120 120 120 
##$DP= (0..7)
150 150 150 150 150 150 150 150 
##$DP07= 0
##$DPNAME0= <>
##$DPNAME1= <>
##$DPNAME2= <>
##$DPNAME3= <>
##$DPNAME4= <>
##$DPNAME5= <>
##$DPNAME6= <>
##$DPNAME7= <>
##$DPOAL= (0..7)
0.5 0.5 0.5 0.5 0.5 0.5 0.5 0.5 
##$DPOFFS= (0..7)
0 0 0 0 0 0 0 0 
##$DQDMODE= 0
##$DR= 18
##$DS= 0
##$DSLIST= <SSSSSSSSSSSSSSS>
$$ [...]
##$SUBNAM0= <"">
##$SUBNAM1= <"">
##$SUBNAM2= <"">
##$SUBNAM3= <"">
##$SUBNAM4= <"">
##$SUBNAM5= <"">
##$SUBNAM6= <"">
##$SUBNAM7= <"">
##$SUBNAM8= <"">
##$SUBNAM9= <"">
##$SW= 18.0517328524113
##$SWIBOX= (0..15)
0 0 2 0 0 0 0 0 0 0 0 0 0 0 0 0 
##$SW_h= 3612.71676300578
##$TD= 16384
##$TD0= 1
##$TE= 0
##$TE2= 300
##$TE3= 300
##$TEG= 300
##$TL= (0..7)
0 120 120 120 120 120 120 120 
##$TP= (0..7)
150 150 150 150 150 150 150 150 
##$TP07= 0
##$TPNAME0= <>
##$TPNAME1= <>
##$TPNAME2= <>
##$TPNAME3= <>
##$TPNAME4= <>
##$TPNAME5= <>
##$TPNAME6= <>
##$TPNAME7= <>
##$TPOAL= (0..7)
0.5 0.5 0.5 0.5 0.5 0.5 0.5 0.5 
##$TPOFFS= (0..7)
0 0 0 0 0 0 0 0 
##$TUNHIN= 0
##$TUNHOUT= 0
##$TUNXOUT= 0
##$USERA1= <user>
##$USERA2= <user>
##$USERA3= <user>
##$USERA4= <user>
##$USERA5= <user>
##$V9= 5
##$VALIST= <valist>
##$VCLIST= <CCCCCCCCCCCCCCC>
##$VD= 0
##$VDLIST= <DDDDDDDDDDDDDDD>
##$VPLIST= <PPPPPPPPPPPPPPP>
##$VTLIST= <TTTTTTTTTTTTTTT>
##$WBST= 1024
##$WBSW= 4
##$XGAIN= (0..3)
0 0 0 0 
##$XL= 0
##$YL= 0
##$YMAX_a= 109718
##$YMIN_a= -120616
##$ZGOPTNS= <>
##$ZL1= 120
##$ZL2= 120
##$ZL3= 120
##$ZL4= 120
##$ABSF1= 10
##$ABSF2= 0
##$ABSG= 5
##$ABSL= 3
##$ALPHA= 0
##$AQORDER= 0
##$ASSFAC= 0
##$ASSFACI= 0
##$ASSFACX= 0
##$ASSWID= 0
##$AUNMP= <proc_1d>
##$AZFE= 0.1
##$AZFW= 0.1
##$BCFW= 1
##$BC_mod= 2
##$BYTORDP= 1
##$COROFFS= 0
##$CY= -3
##$DATMOD= 1
##$DC= 2
##$DFILT= <>
##$DTYPP= 0
##$F1P= 0
##$F2P= 0
##$FCOR= 0.5
##$FTSIZE= 0
##$FT_mod= 4
##$GAMMA= 1
##$GB= 0.15
##$INTBC= 1
##$INTSCL= 1
##$ISEN= 128
##$LB= 0.25
##$LEV0= 0
##$LPBIN= 0
##$MAXI= 10000
##$MC2= 0
##$MEAN= 0
##$ME_mod= 0
##$MI= 1.114404
##$NCOEF= 0
##$NC_proc= 0
##$NLEV= 6
##$NOISF1= 3.799351
##$NOISF2= 2.8
##$NSP= 1
##$NTH_PI= 0
##$NZP= 0
##$OFFSET= 14.38212
##$PC= 1
##$PHC0= -834.9401
##$PHC1= 17.5922
##$PH_mod= 1
##$PKNL= yes
##$PPARMOD= 0
##$PSCAL= 0
##$PSIGN= 0
##$REVERSE= no
##$SF= 200.129724274929
##$SI= 16384
##$SIGF1= 3
##$SIGF2= 2
##$SINO= 400
##$SIOLD= 16384
##$SREGLST= <1H.CDCl3>
##$SSB= 0
##$STSI= 0
##$STSR= 0
##$SW_p= 3205.1282051282
##$SYMM= 0
##$S_DEV= 0
##$TDeff= 0
##$TDoff= 0
##$TI= <>
##$TILT= no
##$TM1= 0
##$TM2= 0
##$TOPLEV= 0
##$USERP1= <user>
##$USERP2= <user>
##$USERP3= <user>
##$USERP4= <user>
##$USERP5= <user>
##$WDW= 1
##$XDIM= 8192
##$YMAX_p= 0
##$YMIN_p= 0
$$ End of Bruker specific parameters
$$ ---------------------------------
##NTUPLES= NMR FID
##VAR_NAME=  TIME,          FID/REAL,        FID/IMAG
##SYMBOL=    X,             R,               I
##VAR_TYPE=  INDEPENDENT,   DEPENDENT,       DEPENDENT
##VAR_FORM=  AFFN,          ASDF,            ASDF
##VAR_DIM=   8192,          8192,            8192
##UNITS=     SECONDS,       ARBITRARY UNITS, ARBITRARY UNITS
##FACTOR=    0.0002768,     1,               1
##FIRST=     0,             0,               0
##LAST=      2.2672688,     0,               0
##MIN=       0,             -120616,         0
##MAX=       2.2672688,     109718,          0
$$ Real data points
##PAGE= N=1
##DATA TABLE= (X++(R..R)), XYDATA
$$ [...]
1628a94J84k6l90K42j6J39j67J4MK76j23k6J07J19j67L20j67O5m15J00J83l7k47
$$ -194 -10 -36 -426 -184 -200 -61 -228 -214 -210 66 -57 -83 24 143 -24 296 129 194 -221 -121 62 25 -222
1651b22J04M8l20M6j2K86j27j19J16M79l43O6K79J04k89j02M23q0l55j75K28r
$$ -222 -118 -70 -390 -344 -356 -70 -197 -316 -200 279 -64 2 281 385 96 -6 417 337 -18 -193 35 26
1673B6j31n9L1K47l67l6L31j15k01K20J07J06lj88N35k86j68R4Q5j57j83j4N2
$$ 26 -105 -164 -133 114 -253 -289 42 -73 -274 -54 53 159 156 -32 503 217 49 143 228 71 -112 -126 -74
1696g4L9k62J77J1j00j75J80N7r1Q5K06K28k95K64L5mj83k00J74p1j81J63K4j56
$$ -74 -35 -297 -120 -109 -209 -384 -204 -147 -238 -153 53 281 -14 250 285 281 98 -102 72 1 -180 -17 7 -149
1720a49k70K70N1k2l3m1K89J27l17K17K66l67n1R6J94p5k85K56l16Ln0j13J58
$$ -149 -419 -149 -98 -120 -153 -194 95 222 -95 122 388 21 -30 66 260 185 -100 156 -160 -157 -207 -320 -162
1743a62j43L6K43J27k67r0J86J62P7P6j2J1n9m7J43Lj26k73J90j47j60j42K67
$$ -162 -305 -269 -26 101 -166 -256 -70 92 169 245 233 244 185 138 281 284 158 -115 75 -72 -232 -374 -107
1766a07O5k37M15k12j35J49J50M8J74k36J40K2n4j05jJ44j70k31J68p2k00J32
$$ -107 -42 -279 136 -76 -211 -62 88 136 310 74 214 236 182 77 76 220 50 -181 -13 -85 -285 -153
1788a53O8k33J32n8M20j0q9j3K12m2j43k3J80l3l34J23L91m00l80J40J48j50j11
$$ -153 -85 -318 -186 -244 176 166 77 64 276 234 91 68 248 215 -119 4 395 -5 -385 -245 -97 -247 -358
1811c58K55R9P6l57J42L38l19K13pO2J9q3k8J92j67j06J75j51j00oO9r0j77k2
$$ -358 -103 -4 72 -285 -143 195 -124 89 82 144 163 80 52 244 77 -29 146 -5 -105 -111 -42 -132 -309 -331
1835c31J00K27k95L80k5K4k18J94K56j52j83K39p7j67j46K52O3j92k13K00J04
$$ -331 -231 -4 -299 81 56 80 -138 56 312 160 -23 216 139 -28 -174 78 141 -51 -264 -64 40
1856D0l25K36k12L76k29L04l00M84k79j74L63o8O8k96J69L3j64M5j4l2k58L6J02
$$ 40 -285 -49 -261 115 -114 190 -110 374 95 -79 284 216 284 -12 157 190 26 71 57 25 -233 -197 -95
1879i5p2k29J62K09J05k68J46N05k51q5J25Q9j30j83J1K38k98k84K98o1k72J6
$$ -95 -167 -396 -234 -25 80 -188 -42 463 212 127 252 341 211 28 39 277 -21 -305 -7 -68 -340 -324
1901c24L46q7k16J50J96j04J42j7O2P9q4N1J3N0m42L17j41N7J29k58K7j24J08
$$ -324 22 -65 -281 -131 65 -39 103 86 148 227 143 194 207 257 -185 132 -9 48 177 -81 -54 -178 -70
1924g0l21K14j33K18M8k21L33J57l53J51J43M3q3q8q7Q2P0m67L49k15J70j97j15
$$ -70 -391 -177 -310 -92 -44 -265 68 225 -128 23 166 209 126 38 -49 33 103 -364 -15 -230 -60 -257 -372
1947c72K18L17j06m0P5l6rj39L99p7q7P2jm6m0k94l7K35p4j52M3K03k06LN6J61
$$ -372 -154 163 57 17 92 56 47 -92 307 230 143 215 214 168 128 -166 -203 32 -42 -194 -151 52 -154 -151 -95 66
1973F6L7J24j68O9k16J67N5q5J50j80q4j05J56k19n%M31m5m19R4K28J1J2j94K81
$$ 66 103 227 59 128 -88 79 134 49 199 19 -65 -170 -14 -233 -238 -238 193 148 -271 -177 51 62 74 -120 161
1998A61O6l88K83J6j5j62N2L74l34P1k40n5N8K7k35L4P0K46k91K82n8K26k14k
$$ 161 227 -161 122 138 123 -39 13 387 53 124 -116 -171 -113 -86 -321 -287 -217 29 -262 20 -38 188 -26 -28
2022b8J54nj4m0J2R0Oj90j24J24K1l78L0K04p1J6J39L7J7M3k33J28L24m82K53
$$ -28 126 121 107 67 79 169 175 -15 -139 -15 6 -372 -342 -138 -209 -193 -54 -17 0 43 -190 -62 262 -220 33
2047C3K52n7j16k81J92L0k41J26j3n9r7J10l5r5K17O6j65K43m6k54M02j39J12
$$ 33 285 228 112 -169 23 53 -188 -62 -75 -134 -231 -121 -156 -251 -34 32 -133 110 64 -190 212 73 185
2070A85j42j0L53j18k91j31n6KJ79k06J22r9J6O7m5K03K16J67n77J58O2K0j06
$$ 185 43 33 386 268 -23 -154 -210 -208 -29 -235 -113 -212 -196 -129 -174 29 245 412 -165 -7 55 75 -31
2093c1J22O4l7j68Q7k45P0q9J84k5k29M10k08L33l42M3J06J99j13p9o9L21k13
$$ -31 91 155 118 -50 37 -208 -138 -227 -43 -68 -297 113 -95 238 -104 -61 45 244 131 52 -17 304 91
2116I1j51P5j9L5j16J59K0k69l1K15j53j95M88n1j47qL2QJ01k7N1M6k06J13J24
$$ 91 -60 15 -4 31 -85 74 94 -175 -206 9 -144 -339 149 98 -49 -57 -25 -17 84 57 108 154 -52 61 185
2141A85N5k81j92R0R5j86j51K96r2r2K5K82o3p0j9L86P0k30j90J94J57m02K81
$$ 185 240 -41 -233 -143 -48 -234 -385 -89 -181 -273 -248 34 -29 -99 -118 268 338 108 -82 112 269 -133 148
2164A48mj8l64J50J46k76K54j62K6R8l02L05K13l15j7j7O02l55k85J99R7j86q3
$$ 148 144 126 -238 -88 58 -218 36 -126 -100 -2 -304 1 214 -101 -118 -135 467 112 -173 26 123 -63 -146
2187a46O2L7k35J32O9j01j0J14r4J35k44L54qN0j38J5J23l8j74J80M6k30j13J68
$$ -146 -84 -47 -282 -150 -81 -182 -192 -78 -172 -37 -281 73 65 115 -23 -8 115 77 -97 83 129 -101 -214 -46
2211d6J93l17o9J30K35l75l5L71j09J00j48O8L69j70%j16J68j51j34J81P8m56
$$ -46 147 -170 -239 -109 126 -249 -284 87 -22 78 -70 -2 367 197 197 81 249 98 -36 145 223 -233
2233b33N5J82l6j24m6K32j53J96k12J65o7r7J91J3J12j14j07J67r8J6j55M1M0
$$ -233 -178 4 -32 -156 -202 30 -123 73 -139 26 -41 -138 53 66 178 64 -43 124 26 42 -113 -72 -32
2256c2j49K89j40k52K17j34J21N7n4P4O6j16J95L6m0Rk21K28j77q6J16J83k66
$$ -32 -181 108 -32 -284 -67 -201 -80 -23 -77 -3 63 -53 142 178 138 147 -74 154 -23 -109 7 190 -76
2279g6j13j50L05k4j21J37M8L9j55J65J43q0l9l3L58l73l8J19m2J16j94K0N8k14
$$ -76 -189 -339 -34 -58 -179 -42 6 45 -110 55 198 118 79 46 404 31 -7 112 70 186 -8 12 70 -144
2303a44j81M9J8J79n1L16k23L3J33k28K17k57K87K7L0m4r2L2K3k86J89l0mj31
$$ -144 -325 -276 -258 -79 -130 186 -37 -4 129 -99 118 -139 148 175 205 161 69 101 124 -162 27 -3 -7 -138
2327a38q0J16R4j34J71Nm3L4Q3K57j51p6J9J87l85Q5M5k53K3J6J27j2m3k07J24
$$ -138 -218 -102 -8 -142 29 34 -9 25 108 365 214 138 157 344 -41 44 89 -164 -141 -125 2 -10 -53 -260 -136
2352a36k4m2K75p5J75k89N2L06Q2l31pK42l01P5p1mn6J03n9j56Q2K09l9K45k91
$$ -136 -160 -202 73 -2 173 -116 -64 242 324 -7 -14 228 -73 2 -69 -73 -129 -26 -85 -241 -159 50 11 256 -35
2377c5K9P3K0r7N2O9K1j64J01j97LJ06m3q8rl3J91j13N3J05o9J33J2K02l91J70
$$ -35 -6 67 87 -10 42 111 132 -32 69 -128 -125 -19 -62 -150 -159 -192 -1 -114 -61 44 -25 108 120 322 -69 101
2403A01O4J84l07j02J58K1l7M9k22l3P5O7l2J1k81J74l6L1J49j42J87K0J16q9
$$ 101 165 349 42 -60 98 119 82 131 -91 -124 -49 18 -14 -3 -284 -110 -146 -115 34 -108 79 99 215 126
2427A26j0l0j81J69p0j9o2J49j02Ln6r0J26j02l6k15J38L09Om0J04o7LJ33n2n6
$$ 126 116 86 -95 74 4 -15 -77 72 -30 -27 -83 -173 -47 -149 -185 -400 -262 47 53 13 117 50 53 186 134 78
2453G8J97j83k92J79n1j66n0J33J42r7N8J33k39J18O1L5Q0k00N6L19k83p5L8K9
$$ 78 275 92 -200 -21 -72 -238 -288 -155 -13 -110 -52 81 -158 -40 21 56 136 -64 -8 311 28 -47 -9 20
2477B0J0j07k18J29J28k84J46k0q0K97k21L20q0J27j58P8L3M5l21K03K22k94N0
$$ 20 30 -77 -295 -166 -38 -322 -176 -196 -276 21 -200 120 40 167 9 87 120 165 -156 47 269 -25 25
2500B5k75J16L15k88l5n9k02L31l1K0J03O7p1J62J4j72J67j16r8J34%Oj0j39M1
$$ 25 -250 -134 181 -107 -142 -201 -403 -72 -103 -83 20 87 16 178 192 20 187 71 -27 107 107 113 103 -36 5
2525Ek19l4J64k25L74J0j05p3M2J4J88p7N0J47N0j74K0j62L9J91j45p7J26l01
$$ 5 -214 -248 -84 -309 65 75 -30 -103 -61 -47 141 64 114 261 311 137 157 -5 34 225 80 3 129 -172
2549a72q4J51K7J21j89P0J12l8J2k8J7N6oQJ02P3j75m6nn6R3l82J86J97k05Q6
$$ -172 -256 -105 -78 43 -146 -76 36 -2 10 -18 -1 55 49 57 159 232 57 11 6 -50 43 -339 -153 44 -161 -75
2575g5J65p1k18K1J03J46N7J0j82L33k32k22K58P0m50J82J15j35o4K84l62J31
$$ -75 90 19 -199 -178 -75 71 128 138 -44 289 57 -165 93 163 -287 -105 10 -125 -189 95 -267 -136
2597a36L6j6J09j07p5J99J9N5N8l6j14m5l5O0J60k48J32O3l43k3N9J40j8J13j87
$$ -136 -100 -116 -7 -114 -189 10 29 84 142 106 -8 -53 -88 -28 132 -116 16 79 -264 -287 -228 -88 -106 7 -180
2622a80J26K19j70J10J72k38K01j2j96q6Q3N0p1Q6j01j47L47m77P9K36N7k18j5
$$ -180 -54 165 -5 105 277 39 240 228 32 -54 29 79 8 94 -7 -154 193 -284 -205 31 88 -130 -145
2645a45J33M7r4q6K28K54k13j24J80k68K32j11J57n38J83Rj77J89j0K56o7N2O3
$$ -145 -12 35 -59 -145 83 337 124 0 180 -88 144 33 190 -348 -165 -156 -333 -144 -154 102 35 87 150
2668A50j76P3J7J33O6j7j78Q1R5k61J6r0K3L6m9j10K57j61J7JK12n3q4j65M16
$$ 150 -26 47 64 197 263 246 68 149 244 -17 -1 -91 -68 -32 -81 -191 66 -95 -78 -77 135 82 -2 -167 249
2693B49j59j30K62k07K9OK05j03l00J51J02j71J23m7j13q2J08j82L19O1K9l20
$$ 249 90 -40 222 15 44 50 255 152 -148 3 105 -66 57 10 -103 -185 -77 -259 60 121 150 -170
2715a70K11K22nk60J37k10J03j09J99j03q9k6K1nj19P6J39P2j98NK40j63J22N9
$$ -170 41 263 258 -2 135 -75 28 -81 118 15 -74 -100 -79 -84 -203 -127 12 84 -114 -109 131 -32 90 149
2739A49j65k4L40J4k92K94l75J23J88m05P2k13K68k22J16R8O8r1p8R9N5k19J68
$$ 149 -16 -40 300 314 22 316 -59 64 252 -153 -81 -294 -26 -248 -132 -34 34 -57 -135 -36 19 -200 -32
2762c2J72j27M3m8j15J49k74J50l6J33q7n2O4n7L8J2%J82j14R7q1L6N3m7J25k64
$$ -32 140 13 56 8 -107 42 -232 -82 -118 15 -72 -124 -60 -117 -79 -67 -67 115 1 98 17 53 106 59 184 -80
2788h0M4J14lJ69l22JO5k94N01m79N4J03J85Q6p2j36j20J89K32j71L9L1J1k35
$$ -80 -36 78 75 244 -78 -77 -12 -306 195 -284 -230 -127 58 144 72 -64 -184 5 237 66 105 136 147 -88
2812h8K0L3J15j69o3k23J43k40M53K6j23j7j69M08j12J20lj76J38J65l0n1j97
$$ -88 -68 -35 80 -89 -152 -375 -232 -472 -19 7 -116 -133 -302 106 -6 114 111 -65 73 238 208 157 -40
2835d0M3J15j06J1K7M7o5m08K84j05K56k26N2K34j06L7R3J5l6j14K00j30J09k58
$$ -40 3 118 12 23 50 97 32 -376 -92 -197 59 -167 -115 119 13 50 143 158 122 8 208 78 187 -71
2859g1k03L79j12J4q8j22r6K2K08N7j41P2K37l6R5j75NK78k17r8j78J73Q2k04
$$ -71 -274 105 -7 7 -81 -203 -299 -277 -69 -12 -153 -81 156 120 215 40 45 323 106 8 -170 3 85 -119
2883a19k9n3K02j5Pr0n9P7M5j75J86L5M4O5o4J83k31lQ1p8l46L15j21J2n2J89
$$ -119 -148 -201 1 -14 -7 -97 -156 -79 -34 -209 -23 12 56 121 57 240 9 6 87 9 -337 -22 -143 -131 -183 6
2909FN6n9j53J57pJ60j27j6j9J68J31l38K25J64k81q7j31J27n9J93r1k16J19J06
$$ 6 62 3 -150 7 0 160 33 17 -2 166 297 -41 184 348 67 -20 -151 -24 -83 110 19 -197 -78 28
2933B8k20l7K4J35J28J10j6j45K94l07N9k8R9j15p0op9J7J99k23L0K16m32L32
$$ 28 -192 -229 -205 -70 58 168 152 7 301 -6 53 25 124 9 -61 -67 -146 -129 70 -153 -123 93 -339 -7
2957gJ11k47J0L66l22j9K31l32L64L3k30l5j75J01J52m8n1k8j19K30q4J60j95
$$ -7 104 -143 -133 233 -89 -108 123 -209 155 188 -42 -77 -252 -151 1 -47 -98 -126 -245 -15 -99 61 -134
2980a34K66k03J01q9J00K28k48n3K12J16k91J34j07O0k38J64M9m0o9r5J7R2j06
$$ -134 132 -71 30 -59 41 269 21 -32 180 296 5 139 32 92 -146 18 67 27 -42 -137 -120 -28 -134
3003a34k5K70L9n1N3j32L6j71J61Lll83L94P3j19p3N6l1mkp8J08j2L0m1j54KK20
$$ -134 -159 111 150 99 152 20 56 -115 46 49 46 -337 57 130 11 -62 -6 -37 -41 -43 -121 -13 -25 5 -36 -190 -188 32
3031C2j69J78j28Q7L5P9j85J46j20J10k45J40k5j60P2K9O0j08L99j90k69L91K26
$$ 32 -137 41 -87 0 35 114 -71 75 -45 65 -180 -40 -65 -225 -153 -124 -64 -172 227 37 -232 159 385
3054C85k37K31l08P9j37P0r5j61J23k3j88K59L0j94N8j00K28j46noL58K4l04L35
$$ 385 148 379 71 150 13 83 -12 -173 -50 -73 -261 -2 28 -166 -108 -208 20 -126 -131 -137 221 245 -59 276
3078B76j17l4j37m9o2k5K1j4J42m0J86k71O7N0j53Q1K63k80K8k3K31M0j43K40
$$ 276 159 125 -12 -61 -123 -148 -127 -141 1 -39 147 -124 -57 -7 -160 -79 184 -96 -68 -91 140 180 37 277
3102B77j85j2k8o8j33K16K7l97J97nJ65j03o6K43j06r3J42j23L07l72J50K9Qj5
$$ 277 92 80 52 -16 -149 67 94 -303 -106 -111 54 -49 -115 128 22 -71 71 -52 255 -117 33 62 70 55
3126E5j65P7R4j1k99J86lL6l8K0J03K46m31J32M4K53q6l32K61j6M8k94M9J35K4
$$ 55 -110 -33 61 50 -249 -63 -66 -30 -68 -48 55 301 -130 2 46 299 213 -119 142 126 174 -120 -71 64 88
3151H8k75J18L7n2m7O0n0L0j30J05L2l3K29K48l46J31j51J09o7Q6j10J26j08n1
$$ 88 -187 -69 -32 -84 -131 -71 -121 -91 -221 -116 -84 -117 112 360 14 145 -6 103 36 122 12 138 30 -21
3175b1J15n6k71nJ42k2O8N4J5L2J1j73O6L71j37k40O7o5pN9o4j5LJ03j44J41J13
$$ -21 94 38 -233 -238 -96 -118 -50 4 19 51 62 -111 -45 326 189 -51 16 -49 -56 3 -61 -76 -73 30 -114 27 140
3202A40j09j06k18J73R9K5L4L36l08jm9k5J49mj72J50l00J15LJ22n6j08J62j4
$$ 140 31 -75 -293 -120 -21 4 38 374 66 65 16 -9 140 136 -36 114 -186 -71 -68 54 -2 -110 52 38
3226C8n1k2j89K65J6k20L94j65R9j12O0O4l07j22J49J79j26j77J89K5K9Q4k36
$$ 38 -13 -35 -224 41 57 -163 231 66 165 53 113 177 -130 -252 -103 76 -50 -227 -38 -13 16 100 -136
3249a36j12M18j64Q6j28J13K5J7R8k13j8J23n55M89j11j7LQ3J40l10K00m1j63
$$ -136 -248 170 6 92 -36 77 102 119 217 4 -14 109 -446 43 -68 -85 -82 1 141 -169 31 -10 -173
3272a73K20l6m1L23j99nk43K75j0j4r5j77l1J76J02l38J54J6N0M7r7M8J38j99
$$ -173 47 11 -30 293 94 89 -154 121 111 97 2 -175 -206 -30 72 -266 -112 -96 -46 1 -96 -48 90 -109
3296a09j5K45q3L0N0q0J35j37J43j92J01MRn0j98K45l62J55K01L3k26J31j4L7
$$ -109 -124 121 38 68 118 38 173 36 179 -13 88 92 101 51 -147 98 -264 -109 92 125 -101 30 16 53
3320E3j58J21J41l68M22j49n4J56j23j5n0R5j79M4L9J7m5n7k3K84j35p0P6K43
$$ 53 -105 16 157 -211 211 62 8 164 41 26 -24 71 -108 -64 -25 -8 -53 -110 -133 151 16 -54 22 265
3344B65l33K37l30n4L01J35l30J30m7P6j24j66K94j78R6pm3r4M36k82O5n5L2R0
$$ 265 -68 169 -161 -215 86 221 -109 21 -26 50 -74 -240 54 -124 -28 -35 -78 -172 264 -18 47 -8 24 114
3368A14j0j29J44k46L36k18q4J72q4j31o2J36j25K02k7j1M2j52K40rJ64j57k85
$$ 114 104 -25 119 -127 209 -9 -93 79 -5 -136 -198 -62 -187 15 -12 -23 19 -133 107 98 262 105 -180
3391a80L34Oj26J89k08J41j26j28j44K70J23k57K51k88K22q6j08J08N6M2pj4j63
$$ -180 154 160 34 223 15 156 30 -98 -242 28 151 -106 145 -143 79 -7 -115 -7 49 91 84 70 -93
3414i3K40j73M5l2K28l93nJ93j01J11j80m7J68K2k8l4p6l6J40O9j50K38k48J77
$$ -93 147 -26 19 -13 215 -178 -183 10 -91 20 -160 -207 -39 -17 -45 -79 -155 -191 -51 18 -132 106 -142 35
3438C5j07K11P7k24j09j9P1j85R4J15P9l1pK9k42K89p6j3J12M7p9N4Mlj33k10
$$ 35 -72 139 216 -8 -117 -136 -65 -250 -156 -41 38 7 0 29 -213 76 0 -13 99 146 67 121 125 122 -11 -221
3464b21J46J71l43L97j18j23p2j16L39k35L07j80n9R2N2M9j58K4Q5l7J04J30k94
$$ -221 -75 96 -247 150 32 -91 -163 -279 60 -175 132 -48 -107 -15 37 86 -72 -48 37 0 104 234 -60
3487f0P3Qj62J17j0L8Q6k76l7K91Lj20r8J85k40L93j05l7J08k29J61k45M6P9r9
$$ -60 13 21 -141 -24 -34 4 90 -186 -223 68 71 -49 -147 38 -202 191 86 49 157 -72 89 -156 -110 -31 -130
3512a30P6J37j88k1M5l6n0O7K69j81j35K61J43k11m5J1J79k45j26L9J91j67M8
$$ -130 -54 83 -105 -126 -81 -117 -167 -100 169 -12 -147 114 257 46 1 12 191 -54 -180 -141 50 -117 -69
3535f9J89j99o1J44p7J40j78J71J11j1k08M5K2k3r4n7J39N4j06L5o2J05p1m4j06
$$ -69 120 -79 -140 4 -73 67 -111 60 171 160 -48 -3 19 -4 -98 -155 -16 38 -68 -33 -95 10 -61 -105 -211
3560b11L7J45k4j72K12o2R1j73JR3R8J34o8j79J56K41l17J79k18K9j14J57l7J5
$$ -211 -174 -29 -53 -225 -13 -75 16 -157 -156 -63 35 169 101 -78 78 319 2 181 -37 -8 -122 35 -2 13
3584A3j8J93j46l4P2J8k46K2J19j88K28J13M9rk05J6Q6l11J99J9j55J49j65L21
$$ 13 -5 188 42 8 80 98 -148 -126 -7 -195 33 146 195 186 -19 -3 83 -228 -29 -10 -165 -16 -181 140
3608A40m74K18K44k90L72k5k87L89j97k26M9K18M5o9l1j57J06j61J76j73Q8J58
$$ 140 -334 -116 128 -162 210 185 -102 287 90 -136 -87 131 176 107 76 -81 25 -136 40 -133 -45 113
3630A13j84J57L8k95kO5J50Rp9K6r3J73j91K30m9k13J03pR6q5L4n7K5J05j69J67
$$ 113 -71 86 124 -171 -173 -108 42 51 -28 -2 -95 78 -113 117 68 -145 -42 -49 47 -38 -4 -61 -36 69 -100 67
3656F7N2K9p2q3K73k73J91m3m8J05l08J93r9R6o6J01j50q1J00Rp5k05K59K6Q2
$$ 67 119 148 76 -7 266 -7 184 141 93 198 -110 83 -16 80 14 115 -35 -116 -16 -7 -82 -287 -28 -2 80
3681H0R7j41O6M3l18L32r3P4l77N2rK06j05J84j34J39Q4m23K33qJ96j61N5l3p9
$$ 80 177 36 102 145 -173 159 66 140 -237 -185 -194 12 -93 91 -43 96 180 -243 -10 -18 178 17 72 39 -40
3706d0N7Q1r0O3q8J06j18k24L26j74j30K04M0k49K14J05n1j7P7j29J04N3k1%k42
$$ -40 17 98 8 71 -17 89 -29 -253 73 -101 -231 -27 13 -236 -22 83 32 15 92 -37 67 120 99 99 -143
3731a43J20J88j29L1m5j72J4K28j65j13J75P8j74J86J12l20Q9J56p7N6j1l0J04
$$ -143 -23 165 36 67 22 -150 -136 92 -73 -186 -11 67 -107 79 191 -129 -40 116 39 95 84 54 158
3754A58j32k0j50J75o4J43r7O5O0k83P6j5L84l12L4M3l26K41J6J35p5j2j93M9
$$ 158 26 6 -144 31 -33 110 13 78 138 -145 -69 -84 300 -12 22 65 -261 -20 -4 131 56 44 -149 -100
3778a00J07j46K18n0j18j29K36J5j30j17K61l27M29l3L1N3k07J16oj23J9R4j55
$$ -100 7 -139 79 29 -89 -218 18 33 -97 -214 47 -280 149 116 147 200 -7 109 103 -20 -1 93 -62
3801f2Pj00K85k33P7o5J03j15J58k80L69j72J8R4k14N4K7J35j47J09N7j56K44
$$ -62 -55 -155 130 -103 -26 -91 12 -103 55 -225 144 -28 -10 84 -130 -76 -49 86 -61 48 105 -51 193
3824A93k02l4j10J67K2j61J92J9k54L36j85o8Q9mO3P9o2J1j37Q9R3j92Q3o5J38
$$ 193 -9 -43 -153 14 36 -125 67 86 -168 168 -17 -85 4 0 63 142 80 91 -46 43 136 -56 27 -38 100
3849A00l12K07K8K8j09K2j29J49L3k4J00j96L49j40N7j70q2J63P0q2q0m8o7L4
$$ 100 -212 -5 23 51 -58 -36 -165 -16 17 -7 93 -103 246 106 163 -7 -89 74 144 62 -18 -66 -133 -99
3873i9K33k13R9k5J48r8O6k45M6P2l9n6J3J66j09J0J34j64J74j1k64n7K02Q4m1
$$ -99 134 -79 20 -5 143 45 111 -134 -88 -16 -55 -111 -98 68 -41 -31 103 -61 113 102 -162 -219 -17 67 26
3898B6Rk03j02L11j61J69P9k47J54k14J96r4r5L57k43j20J56J10k65J6K09j4p
$$ 26 35 -168 -270 41 -120 49 128 -119 35 -179 17 -77 -172 185 -58 -178 -22 88 -177 -161 48 34 27
3921B7Q5j42l6J8q3K85n2q5o1R7K3J41n7j24j02k68M37nk81K78j69j24J56r8R3
$$ 27 112 -30 -66 -48 -131 154 102 17 -44 53 76 217 160 36 -66 -334 103 98 -183 95 -74 -198 -42 -140 -47
3946d7O7m0mj43J65Q9J3j87J75j92J48j37K36J5k91K07r7P7l7j05P6j01J17K0
$$ -47 20 -20 -24 -167 -2 87 100 -87 88 -104 44 -93 143 158 -133 74 -23 54 17 -88 -12 -113 4 24
3970B4O9J67j34j72O1N3k19L7N4r2J67j73K6j1J80Q9j09N9p3J47j00K46k58p7
$$ 24 93 260 126 -46 15 68 -151 -114 -60 -152 15 -158 -132 -143 37 126 17 76 3 150 50 296 38 -39
3994c9k7R2P1j49J32l9J7j87L12J11l20j88K94m2j80J70R5j52R4J12o9j29J38
$$ -39 -66 26 97 -52 80 41 58 -129 183 294 -26 -214 80 38 -142 28 123 -29 65 177 108 -21 117
4017A17j31J90m02L24J09j29J39j61L6k18J29J02O7l36J84j8k06K41J13j41j62
$$ 117 -14 176 -226 98 207 78 217 56 92 -126 3 105 172 -164 20 2 -204 37 150 9 -153
4038a53J79k6m5R3k02K6K44j65j61M75m05J00q1q9K09j24L37j52p1J36K2j51l7
$$ -153 26 0 -45 48 -154 -128 116 -49 -210 265 -140 -40 -121 -210 -1 -125 212 60 -11 125 147 -4 -41
4061d1J20K8q7k45L49j01r5K13l73L75m8k99K05K02j95r1l2K4l3J95k7rOO7j03
$$ -41 79 107 20 -225 124 23 -72 141 -232 143 95 -204 1 203 8 -83 -115 -91 -124 71 44 35 41 108 5
4086Eo0J64NJ89l92J36j7l9K4J73l52K88j18j26j6J36J21j08O4r0M3K13l63L46
$$ 5 -55 109 114 303 -89 47 30 -9 15 188 -164 124 6 -120 -136 0 121 13 77 -13 30 243 -120 226
4110B26Rk19J22j76N7m9q0K2J1LL36l18o3J38J38pR8l20J53n7l8J39R6j13j22
$$ 226 235 16 138 -38 19 -30 -110 -88 -77 -74 262 -56 -119 19 157 150 248 -72 81 24 -14 125 221 108 -14
4135a4L8O9o4K5j93K38nk01p3L13j40J8P7m8K1j66J95j32K12k05P8j89L17k52
$$ -14 24 93 29 54 -139 99 94 -107 -180 133 -7 11 88 40 61 -105 90 -42 170 -35 43 -146 171 -81
4159h1O9J07j83K70k48J10m2p3M3J06j22k6ML49j04O5k40j95K21Q4j23J66k70
$$ -81 -12 95 -88 182 -66 44 2 -71 -28 78 -44 -70 -66 283 179 244 4 -191 30 114 -9 157 -113
4182a13J8J42J43j27j39R4k3j43R8m6P8M2K22j34k55J07P4O9j69n2J07j15P9J59
$$ -113 -95 47 190 63 -76 18 -5 -148 -50 -96 -18 24 246 112 -143 -36 38 107 -62 -114 -7 -122 -43 116
4206A16kj73P7K14l90J56k53L70j77R2j74N2K52l18K25m2j08nL1K21j74J48k19
$$ 116 114 -59 18 232 -158 -2 -255 115 -62 30 -144 -92 160 -158 67 25 -83 -88 -57 164 -10 138 -81
4229h1j0J45k12J48j72J39n7Q2J2l2P8lk04K99k00J22k6K1J08j81k6k06K20r2
$$ -81 -91 54 -158 -10 -182 -43 -100 -18 -6 -38 40 37 -167 132 -68 54 28 49 157 -24 -50 -256 -36 -128
4253a28J36Oj39lJ59j07r2K8J16J05l1O0j62J84o8J25k46J27N6j46R3n9k17J75
$$ -128 8 14 -125 -128 31 -76 -168 -140 -24 81 50 110 -52 132 64 189 -57 70 126 -20 73 14 -203 -28
4277b8O3q3Q3j66J88k4j6j36L92j19l41K92n5J58j75Rj22J50J45l01M0k3O4k85
$$ -28 35 -48 35 -131 57 33 17 -119 273 154 -187 105 50 208 33 42 -80 70 215 -86 -46 -69 -5 -290
4301b90J53p0J53P0O1r3J62m5j51nm5j0r0J53o6K14j18Qm09M60J97m12mK21P5
$$ -290 -137 -207 -54 16 77 -16 146 101 -50 -55 -100 -110 -200 -47 -113 101 -17 -9 -418 42 239 -173 -177 44 119
4326A19k2K7J13j72j11P7J79r5L2k98K14r4J00O6k11K55k18l2Q1Q0n5n1j8J44
$$ 119 97 124 237 65 -46 31 210 115 147 -151 63 -31 69 135 -76 179 -39 -71 10 90 35 -16 -34 110
4350A10q3j2j88L95k02K63k43n0k3K9kj05J17kr0J08J8k12J53J23j65k37R9K60
$$ 110 27 15 -173 222 20 283 40 -10 -33 -4 -6 -111 6 4 -86 22 40 -172 -19 104 -61 -298 -199 61
4374F1m8J25k67J87o8J16l0r8j63J47O2Q2l7k22R7o8K57k25J60r1M0k4K28k04
$$ 61 13 138 -129 58 -10 106 76 -22 -185 -38 24 106 69 -153 -56 -124 133 -92 68 -23 17 -7 221 17
4398A7mQ7j0j84q7o5K53K5j54K7J45p7j50J37J4J30j83k5K11j02P9N5j40n9K13
$$ 17 13 100 90 -94 -181 -246 7 32 -122 -95 50 -27 -177 -40 -26 104 -79 -104 107 5 84 139 -1 -60 153
4423A53m4k7R3m8j21JN0Rn9o4n9R8J46k85K28l0o6M8O7j01j85K4J85n9l0J29j25
$$ 153 109 82 175 127 6 7 57 66 7 -57 -116 -18 128 -157 71 41 -25 23 90 -11 -196 -172 13 -46 -76 53 -72
4450g2o3K87k58L0K02k47Q3P6j17o1R2R9Ll5L1j50K35j52K0N0K3q3p5L03k70J79
$$ -72 -135 152 -106 -76 126 -121 -38 38 -79 -140 -48 51 54 19 50 -100 135 -17 3 53 76 -7 -82 221 -49 130
4476A30j22j46j4o0J59P0J4Pp6mN9j64o2M11N3k79J81j73l9kP7M6j39J95l17K14
$$ 130 8 -138 -152 -212 -53 17 31 38 -38 -42 17 -147 -209 202 255 -24 157 -16 -55 -57 20 66 -73 122 -195 19
4502A9O2k83J96J47J6k2k99J4K18J54r6o8j23J45o0R5l27K59j42k3J60l05K13
$$ 19 81 -202 -6 141 157 135 -164 -150 68 222 126 58 -65 80 20 115 -212 47 -95 -118 42 -263 -50
4525e0%KL6o7J54n6J13k42J11R4j45MK08n9q3m6O2o6k64K09N2J23j56p9O1J38
$$ -50 -50 -48 -12 -79 75 19 132 -110 1 95 -50 -46 162 103 20 -26 36 -30 -294 -85 -33 90 -66 -145 -84 54
4551E4n8J31Rp7J1l0J43o3j18J45k32J41P7%r6J4r3k3L5j37K08q2K51j94n2j03
$$ 54 -4 127 136 59 70 40 183 120 2 147 -85 56 133 133 37 51 -42 -65 -30 -167 41 -41 210 16 -36 -139
4577a39J64J2rK3o5Po3J00j26J77j83p5J72J8o5Q5k02K25J22j75J43k15j32J42
$$ -139 25 37 28 51 -14 -7 -70 30 -96 81 -102 -177 -5 13 -52 33 -169 56 178 3 146 -69 -201 -59
4601e9K58j0l1R3j77k08L0K41k94K6O1q2K42k78R3pM7j9J23M9K9j54l2J99k93
$$ -59 199 189 158 251 74 -134 -104 137 -157 -131 -70 -152 90 -188 -95 -102 -55 -74 49 98 127 -27 -59 140 -153
4626a53J45K38k21K48m37K99j13k9J66k39J66k4n6p0K51l28J81J7j74K46m1k09
$$ -153 -8 230 9 257 -180 119 6 -23 143 -96 70 46 -10 -80 171 -157 24 41 -133 113 72 -137
4648a37J2J62M1J16l04J55o4o3K29k25J45j42J16o2l6o4Q7l3J29K14l43O9j9J5
$$ -137 -125 37 78 194 -110 45 -19 -82 147 -78 67 -75 41 -21 -57 -121 -34 -67 62 276 -67 2 -17 -2
4672bj17M1J87O5l97m1L35k77P7j29L24m8o3J84j72P6K02k00J43k06p8K62k32
$$ -2 -119 -78 109 174 -223 -264 71 -206 -129 -258 66 18 -45 139 -33 43 245 45 188 -18 -96 166 -66
4695f6J63k49K43k82J41KO9J50k68l3J9J1KL3J79l40J07Q4j25K67L8p5j6j72J68
$$ -66 97 -152 91 -191 -50 -48 21 171 -97 -130 -111 -100 -98 -65 114 -226 -119 -35 -160 107 145 70 54 -118 50
4720E0j75r0K97o6o9J44j31j4j7O9n9jJ76J4j84K93k64J40j14R2j78K58j29j76
$$ 50 -125 -215 82 16 -53 91 -40 -54 -71 -2 -61 -62 114 128 -56 237 -27 113 -1 91 -87 171 42 -134
4744a34N1L7LQ8L2r1l4J01m4K4o3q4L56j24q7j98J94j09k3m7K09k04LJ22J59j53
$$ -134 -83 -46 -43 45 77 -14 -48 53 9 33 -30 -114 242 118 31 -167 27 -82 -105 -152 57 -147 -144 -22 137 -16
4770a6Ko0L4M4q8P0P9j41O6k6K60k22p1J12q3o5K05k83J95k97J29L26k2k39k77
$$ -16 -14 -74 -40 4 -84 -14 65 -76 -10 -36 224 2 -69 43 -40 -105 100 -183 12 -285 -156 170 148 -91 -368
4795c68M83l80K44K83p6k27J12j71n4K17p0J50k5j40j02J17j81J61Q9k20K24k91
$$ -368 115 -265 -21 262 186 -41 71 -100 -154 63 -7 143 118 -22 -124 -7 -188 -27 62 -158 66 -225
4817b25J53J75j42O5l3J0J03N1j5K7p7M9k32p0Q5J75j54K00j50o3K10j00k7O1
$$ -225 -72 103 -39 26 -7 3 106 157 142 169 92 141 -91 -161 -76 99 -55 145 -5 -68 142 42 15 76
4841G6o1o3Q2J62k58J01nJ3k13J66l13L37M2j2n1m5J06o8j20R5k2L8J7l31K21
$$ 76 15 -48 34 196 -62 39 34 47 -166 0 -313 24 66 54 3 -42 64 -4 -124 -29 -51 -13 4 -327 -106
4866a06K41jm3j44m7RJ03o4N1N5R7k95J10N4Q1j07L5j11J10r6j13J30P4k2k6J45
$$ -106 135 134 91 -53 -100 -91 12 -52 -1 54 151 -144 -34 20 101 -6 29 -82 28 -68 -181 -51 23 1 -25 120
4892A20m0K4l9j81K70j42j48J03j09j41n8L85j06K8j07J89n3r2K11n4l2J32l1
$$ 120 80 104 65 -116 154 12 -136 -33 -142 -283 -341 44 -62 -34 -141 48 -5 -97 114 60 28 160 129
4915A29j80R4J11m1n6Qj01q8p5K88j93K5J44Q1k85n9K43pj31J30K0Nj17J02J45
$$ 129 -51 43 154 113 57 65 -36 -124 -199 89 -104 -79 65 146 -139 -198 45 38 -93 37 57 62 -55 47 192
4940A92j18k13J11M1p2K43l46K60K5R2k07O4j50j18J19J18l1J19l9m3o7M6O2k39
$$ 192 74 -139 -28 13 -59 184 -162 98 123 215 8 72 -78 -196 -77 41 10 129 90 47 -20 26 88 -151
4964a51P6j0J35j10K7J15j17J35j9l63K77j81Q9j48L44j19M0j6o9J00O2o2j4r0
$$ -151 -75 -85 50 -60 -33 82 -35 100 81 -282 -5 -186 -97 -245 99 -20 20 4 -65 35 97 35 21 -69
4988f9Q7J47j49j72m9J90J48k3l3M4j54M4O1r1J02j01J20k06K70k09J28m7qN6
$$ -69 18 165 16 -156 -205 -15 133 110 77 121 -33 11 72 -19 83 -18 102 -104 166 -43 85 38 30 86
5012H6j68J71j94Q3P5j15K3L7O7j49P8k0J30N5l6k07K60o8j92J02j27oR5M1r4
$$ 86 -82 89 -105 -22 53 -62 -39 -2 65 -84 -6 -26 104 159 123 -84 176 108 -84 18 -109 -115 -20 21 -73
5037g3j4M2K03j97J60k76K18j6j29J75J32k77J30m0L8n9J15l6r1r5Q5K9J03r4
$$ -73 -87 -45 158 -39 121 -155 63 47 -82 93 225 -52 78 38 76 17 132 96 5 -90 -5 24 127 33
5061C3o9n0k00K76j65o0L98l96K07K04l18o2J54J21j06J68j18J19n6j21j14J46
$$ 33 -36 -86 -286 -10 -175 -235 163 -233 -26 178 -140 -202 -48 73 -33 135 17 136 80 -41 -155 -9
5083iK00k15o5J16k42M76k59L2n1n8J98l14K31j5n8K34r9%k1Pn5Q9k76J32j08
$$ -9 191 -24 -89 27 -215 261 2 34 -17 -75 123 -191 40 25 -33 201 102 102 81 88 33 122 -154 -22 -130
5108a30LJ20J16j4j0lj86L85m22K46j38J06Q3k15nM40m70M1K22l88K13r1k11J07
$$ -130 -127 -7 109 95 85 82 -104 281 -141 105 -33 73 156 -59 -64 376 -94 -53 169 -219 -6 -97 -308 -201
5132b01L97l44K46J38l19J42rj90J89j48J18P1j55j12L12Q0k26j05m7J68J60l0
$$ -201 196 -148 98 236 -83 59 50 -140 49 -99 19 90 -65 -177 135 215 -11 -116 -163 5 165 135
5154A35l29L37l39M00k03Q6j28J25K0j89K66k03j40J28J33k70K10J0j9N9j18J70
$$ 135 -194 143 -196 204 1 87 -41 84 104 -85 181 -22 -162 -34 99 -171 39 49 30 89 -29 141
5176A41j32J50mj25mr9J87j40O7J4J5pJ85j30j96p5J27k9m6R3m6J71k81n1L47
$$ 141 9 159 155 30 26 -73 114 -26 41 55 70 63 248 118 -78 -153 -26 -55 -101 -8 -54 117 -164 -215 132
5201A32k42nK40rm8n5J38j68K7O3j67J24o0l3o6l5j28L04j74K22J5r3L8m4K50
$$ 132 -110 -115 125 116 68 13 151 -17 10 73 -94 30 -30 -63 -129 -164 -292 12 -162 60 75 -18 20 -24 226
5226B26j72N9Q5k93J86j19J94j13j73J17J0L9j76j47M22l63J74J38L5j48q4R0
$$ 226 54 113 198 -95 91 -28 166 53 -120 -3 7 46 -130 -277 145 -218 -44 94 129 -19 -103 -13
5248a3j39K81lj82J94P4j0l39K18k82J16m6l2M5J64m4Q2k09J60N3j70j18K67j72
$$ -13 -152 129 126 -56 138 212 202 -137 81 -201 -85 -131 -163 -118 46 2 84 -125 35 88 -82 -200 67 -105
5272a05Q6j02J53o2J4M0k00kl1J52Ko3J7nK03m1n5J7p6J04j02N7J15j52R1j92
$$ -105 -19 -121 32 -30 -16 24 -176 -178 -209 -57 -55 -118 -101 -106 97 56 1 18 -58 46 -56 1 116 -36 55 -137
5298a37P2J95j04j03K97j89n7K3j0pj7J26n9J3l07K49J04po5N8q2O3P7m1j58O0
$$ -137 -65 130 26 -77 220 31 -26 -3 -13 -20 -37 89 30 43 -264 -15 89 82 17 75 -7 56 133 92 -66 -6
5324fO8o4j2J10O8k05O8l05K71J92j69k24Q5P6o8Q6Q4j14K80K9l33O0Q3m2m3P
$$ -6 62 -2 -14 96 164 -41 27 -278 -7 185 16 -208 -123 -47 -115 -29 55 -59 221 250 -83 -23 60 18 -25 -18
5350a8J09j77J13n8j8LJ37j33K6O9J38j55p1J13k42J99k3k15K17j0nJ47k86j2
$$ -18 91 -86 27 -31 -49 -46 91 -42 -16 53 191 36 -35 78 -164 35 12 -203 14 4 -1 146 -140 -152
5374a52J66m1J01j08QJ01l06N11Rk02m6M1Pj99K9J80q1j71JK38N7j52j69L64j78
$$ -152 14 -27 74 -34 -26 75 -231 280 289 87 41 82 89 -110 -81 99 18 -153 -152 86 143 -9 -178 186 8
5399Hj51J82k0j46K47k17O6N2J17k52Q1k01L06j07j2M5J55J10l96J19J3J24k42
$$ 8 -143 39 19 -127 120 -97 -31 21 138 -114 -33 -234 72 -35 -47 -2 153 263 -133 -14 -1 123 -119
5422a19j63J46j70J95R9K38j78j34j50J73n4M07m23K6J7n1K89k55K63j92K72m58
$$ -119 -282 -136 -306 -111 -12 226 48 -86 -236 -63 -117 290 -133 -107 -90 -141 148 -107 156 -36 236 -222
5444b22K89K6k09J0J50p6j53J51O2J01k66J03J0R1J9q8po3O8J53k56J2K7J07k9
$$ -222 67 93 -116 -106 44 -32 -185 -34 28 129 -137 -34 -24 67 86 -2 -9 -72 -4 149 -107 -95 -68 39 10
5469A0j99K26n6l8J19r0J69r3j9J72q0j21n4m6J45M5j23m3K25j93P6j20J34k22
$$ 10 -189 37 -19 -57 62 -28 141 48 29 201 121 0 -54 -100 45 90 -33 -76 149 -44 32 -88 46 -176
5493a76P4N2j03J02K78j04k63J45m1J49J02j90M9q8j06L55m98K13K26k04K0Q9
$$ -176 -102 -50 -153 -51 227 123 -140 5 -36 113 215 25 74 -14 -120 235 -263 -50 176 -28 -8 81
5515H1j27J39j34K53m51K92Plm9j5K62l11j02J40l7K7j21K66o4j96P1J62k01q4
$$ 81 -46 93 -41 212 -239 53 60 57 8 -7 255 -56 -158 -18 -55 -28 -149 117 53 -143 -72 90 -111 -195
5539a95J02K30L2j45J2M8j68j6j3J59L6o7r3K7J35n7R9k85J25J07j95O1O5k62
$$ -195 -93 137 169 24 36 84 -84 -100 -113 46 82 15 -78 -51 84 27 126 -159 -34 73 -122 -61 4 -258
5563b58J86K02j21O4R2k35K13j81j96K26r4K8j25K04pO8N1q8Q6j67J06J1J36k42
$$ -258 -72 130 9 73 165 -70 143 -38 -234 -8 -102 -74 -199 5 -2 66 117 29 115 -52 54 65 201 -41
5587d1J60l8k9k8J72k29l5J75M5j45N1j99j16K11J63j77o4J6J28KP8n0k01K03
$$ -41 119 81 52 24 196 -33 -68 107 152 7 58 -141 -257 -46 117 -60 -124 -108 20 22 100 50 -151 52
5611E2P0nk41Q9R5j16Pjr1J31L7j65K07j26OJ91p5j8Pj5k47L51r3J23k86J44n8
$$ 52 122 117 -124 -35 60 -56 -49 -50 -141 -10 27 -138 69 -57 -51 140 65 47 54 39 -208 143 50 173 -113 31 -27
5638b7q7K19k67J25J56Lj15o0J6j09K46o3p7J36p0k30K65j27M7m5K93k28N4j93
$$ -27 -114 105 -162 -37 119 122 7 -53 -37 -146 100 37 -40 96 26 -204 61 -66 -19 -64 229 1 55 -138
5662a38q9K63q7j56j6J78j27J04lq9R0J88k36R3P1Q6k11K61Kj39K07l89K32k36
$$ -138 -227 36 -51 -207 -223 -45 -172 -68 -71 -160 -70 118 -118 -25 46 132 -79 182 184 45 252 -137 95 -141
5686a41J4J10j93K59l2K18l09L7P0q9J26l2l0O9O6L4k73L4K52k70P0J11L7k69
$$ -141 -127 -17 -210 49 17 235 -74 -37 33 -56 70 38 8 77 143 177 -96 -62 190 -80 -10 101 138 -131
5710a31J72m3R6j19k96K00J04OJ44n9q5mj33P5K43k3k06K0Q6P6R8l70J11J60l20
$$ -131 41 -2 94 -25 -321 -121 -17 -11 133 74 -11 -15 -148 -73 170 147 -59 -39 47 123 221 -149 -38 122 -198
5735a98L28j87J65j56R5m1l5J1M8N1o9o4o6j07J67J21j9Q6j56J81j32qr9nJ55
$$ -198 130 -57 108 -48 47 6 -29 -18 30 81 12 -52 -118 -225 -58 63 44 130 -26 155 23 15 -84 -89 66
5760F6j28M7J09k45J82q7J13K5J3q0J2J05Qj7L4j24L0L9O3j59rJ68j81O6J11j10
$$ 66 -62 -15 94 -151 31 -56 57 82 95 15 27 132 140 123 157 33 63 102 165 6 -3 165 -16 50 161 51
5786E1P2l2j26l2K83j40m2M1j54M4L9j45K84k81L78l77q0L11K1M4j87OK4K26j81
$$ 51 123 91 -35 -67 216 76 34 75 -79 -35 4 -141 143 -138 240 -137 -217 94 115 159 -28 -22 2 228 47
5811D7o8k8K0J04Pl1j12p5J40j20L7K7m6J88J86l21M6J07Q2k03j22N9Q7J1R7j68
$$ 47 -21 -49 -29 75 82 51 -61 -136 4 -116 -79 -52 -98 90 276 -45 1 108 190 -13 -135 -76 11 22 119 -49
5837d9P4j09K32o8p1r8k36K52J58m4O0j27j37K77j21r4j03L18j76j3J05J68j36
$$ -49 25 -84 148 80 9 -89 -325 -73 85 41 101 -26 -163 114 -7 -101 -204 114 -62 -75 30 198 62
5860F2J5j30m6L1m3K3M8R0j15m4jL3n0J9K99j26o8j5n0J3N9j01N1J19j23j14J21
$$ 62 77 -53 -99 -68 -111 -88 -40 50 -65 -109 -110 -77 -127 -108 191 65 -3 -18 -68 -55 4 -97 -46 73 -50 -164 -43
5887d3K15j38K11j26Pj55r0R9o9j16R1O2K97m59K97n6M5j92Q8J03m1N6L4k27j65
$$ -43 172 34 245 119 126 -29 -119 -20 -89 -205 -114 -52 245 -214 83 27 72 -120 -32 71 30 86 120 -107 -272
5912b72J54J19J66j37l9M9j57J31P1k27O7K14k18L3J41j68R1J24j70o%m3rJ32
$$ -272 -118 1 167 30 -9 40 -117 14 85 -142 -75 139 -79 -46 95 -73 18 142 -28 -34 -34 -77 -86 46
5936D6j57J36q2N2K3k2K23m51L03p6j81K54R7j74M7j4L6j69k3J52j26K2O0M3Q3
$$ 46 -111 25 -57 -5 18 -4 219 -232 71 -5 -186 68 165 -9 38 24 60 -109 -132 20 -106 -84 -24 19 102
5961A02M0q3J87l51O1K57j76j04M1J3J61k69J30j52J18O4M2r2J51k47K4Q9Kj0
$$ 102 142 59 246 -105 -44 213 37 -67 -26 -13 148 -121 9 -143 -25 39 81 -11 140 -107 -83 6 8 -2
5985bL9Q7k24O4j06J84j03q8J65J26P7j07J33o7p2k92O5J7J53j02L3j42J79j41
$$ -2 37 124 -100 -36 -142 42 -61 -149 16 142 219 112 245 178 106 -186 -121 -104 49 -53 -20 -162 17 -124
6009a24J48j82N7j4K2J06k0k1K08l19kJ67j89j0Q7J22j20m2J90n3j76p4L35j04
$$ -124 24 -158 -101 -115 -93 13 -7 -28 180 -139 -141 26 -163 -173 -86 36 -84 -126 64 11 -165 -239 96 -8
6033hJ72l9k06j00L11r4q9P5J05k67J43Rj55P9r6K22j39R2l6P9l33k8K27K58k09
$$ -8 164 125 -81 -181 130 36 -53 22 127 -140 3 12 -143 -64 -160 62 -77 15 -21 58 -275 -303 -76 182 -27
6058b7K2J5j8k6j20K03p2j34J27J5J30k53J8j48O0L26l85L21j30J37j57K98L4
$$ -27 -5 10 -8 -34 -154 49 -23 -157 -30 -15 115 -138 -120 -268 -208 118 -267 54 -76 61 -96 202 236
6081B36m09K03p1O3L1l9Q0j87j37J42P0M9J9j55K68j39j11k3M7K88n1p1q9J66
$$ 236 -173 30 -41 22 53 14 94 -93 -230 -88 -18 31 50 -105 163 24 -87 -110 -63 225 174 103 14 180
6105A80l20M6J52n6R8j55J61j18R1j56j23K99j20O2o9j81L29l35L00Mj23K2M00
$$ 180 -140 -94 58 2 100 -55 106 -12 79 -77 -200 99 -21 41 -28 -209 120 -215 85 89 -34 -12 388
6128C88l71N0k85K33r3J12L9j13n8m9O2l5J14j59J77r2L24n8j34J58q9n1qk91
$$ 388 17 67 -218 15 -78 34 73 -40 -98 -147 -85 -120 -6 -165 12 -80 244 186 52 210 121 70 62 -229
6152b29K77M2j63J53j20pj68K56k54L9J88Q0j05K03j16j97j32R3L19j14n8L27
$$ -229 48 90 -73 80 -40 -47 -215 41 -213 -174 14 94 -11 192 76 -121 -253 -160 159 45 -13 314
6174C14m23Q5J80j33m8j46K16l6lr4J34k53J16O6p9K33o4m8J78m06K67J09o0M
$$ 314 -109 -24 156 23 -25 -171 45 9 6 -88 46 -207 -91 -25 -104 129 65 17 195 -211 56 165 105 109
6198A09j58o1Q5K10j77Q2K3j68n5J88r1J87j96P0P4J34l20K06k09J73j72j22J03
$$ 109 -49 -110 -25 185 8 90 113 -55 -110 78 -13 174 -22 48 122 256 -64 142 -67 106 -66 -188 -85
6221h5l6R7m7q4K56k16J16m8J07j8J65j60l9K58m39P9Q3J59j73j9L8Q3o0j51j34
$$ -85 -121 -24 -71 -155 101 -115 1 -47 60 42 207 47 8 266 -173 -94 -11 148 -25 -44 -6 77 17 -134 -268
6246b68K68r3J88N4j13K1r1O9j40J36k8M0K74k81r7J32K99k12n7j39ML2n1J10
$$ -268 0 -93 95 149 36 57 -34 35 -105 31 3 43 317 36 -61 71 370 158 101 -38 -34 -2 -53 57
6270E7k53K21J1k04N8L8M4r5L21J29l98K8O0L7O3J65j65k30j27L27j15Om2J4j9
$$ 57 -196 25 36 -168 -110 -72 -28 -123 198 327 -71 -43 17 54 117 282 117 -113 -240 87 -28 -22 -64 -50 -69
6295f9J99r6J44j88j1L4j54L22j67Q6J04j23j67J49N5j69P7p8J35k40j63L19n9
$$ -69 130 34 178 -10 -21 13 -141 181 14 100 204 81 -86 63 118 -51 26 -52 83 -157 -320 -1 -60
6318f0j82J42J52k41J84J64k16J19n7RJ99j88RN8j59P8k86L65k09P3j9j52M11
$$ -60 -242 -100 52 -189 -5 159 -57 62 5 14 213 25 34 92 -67 11 -275 90 -119 -46 -65 -217 194
6341A94j64k9K7J7j95j3J70lO8n0j40j8J91k05K97k21j1M3L3N1L3m0J52l59j13
$$ 194 30 1 28 45 -150 -163 7 4 72 22 -118 -136 55 -150 147 -74 -85 -42 -9 42 75 35 187 -172 -285
6366b85K68P6P0l28L38%mk13J15j18K05j39l2j0R8r4L2M6mj65K75j16j70J20K13
$$ -285 -17 59 129 -199 139 139 135 -78 37 -81 124 -15 -47 -57 41 -53 -21 25 21 -144 131 15 -155 -35 178
6391A78j36j2p9J55n3j37K63j70K77k99qK3NQ8k85K35Jj81J25k2K3k4M2j23j06
$$ 178 42 30 -49 106 53 -84 179 9 286 -13 -21 2 7 95 -190 45 46 -135 -10 -32 -9 -33 9 -114 -220
6416b20K65k3NnK6Q8k20N4q6J73M5P3k54J21p5JJ02N4p2r3p5K5J86q0m8j11K12
$$ -220 45 22 27 22 48 136 -84 -30 -116 57 102 175 -79 42 -33 -32 70 124 52 -41 -116 -91 95 15 -33 -144 68
6443F8j87J76j3l2n9K09o8n4k57J53k14J80K00k66J83Q0j67M2m5J34M8j4k54J91
$$ 68 -119 57 44 12 -47 162 94 40 -217 -64 -278 -98 102 -164 19 99 -68 -26 -71 63 111 97 -157 34
6467C4k4R8k55O0L09k64L5K0r7l3R5M4K1R5m99M61j29j30K52m8q1k30K85n1N9
$$ 34 10 108 -147 -87 222 -42 -7 13 -84 -117 -22 22 43 138 -361 100 -29 -159 93 45 -36 -266 19 -32 27
6492B7O2j00l0j49NpK1J22j26M04j14k17J69K8k19k6N1Q7K8J0J64j17L6j32k07
$$ 27 89 -11 -41 -190 -185 -192 -171 -49 -175 229 115 -102 67 95 -124 -150 -99 -12 16 26 190 73 109 -23 -230
6517b30J20M4o3j2N2L41j91L6p4Q8p4j5Q1k5l2q9K49k74J56k17K39j50J72k67
$$ -230 -110 -66 -129 -141 -89 252 61 97 23 111 37 22 103 78 46 -43 206 -68 88 -129 110 -40 132 -135
6541a35J13j50J69n3j09K56M7k63J21k7J05J98l16Q4j21J82k35L54j89k2Nj75
$$ -135 -22 -172 -3 -56 -165 91 138 -125 -4 -31 74 272 -44 40 -81 101 -134 220 31 9 14 -161
6563a61R8P3N3pJ9j74O5J07Pk2k75L72J14l02j95R5K92j22j4Q7n2j9j47J09q3
$$ -161 -63 10 63 56 75 -99 -34 73 80 58 -217 155 269 -33 -228 -133 159 37 23 110 58 39 -108 1 -82
6588h2J27q0R9P6l33K51o1j02J66m7n5J08L0k6R4j00l11K47JJ8j65J60J9K8Q3
$$ -82 45 -35 64 140 -193 58 -3 -105 61 14 -41 67 97 71 165 65 -246 1 2 20 -145 15 34 62 145
6613A45n2l37J78J49q8M3j2n3q4P7j97K74oN1m2q7l6p2J74L7k01J81J00j12M7
$$ 145 93 -244 -66 83 -5 38 26 -27 -111 -34 -231 43 37 88 46 -41 -77 -149 25 62 -139 42 142 30 77
6638G7r2qN6O4r4j7m0N8P1k72Q0K29k16K83j52%L5L7q1j99N1M5m1J42k51J73R7
$$ 77 -15 -23 33 97 3 -14 -54 4 75 -197 -117 112 -104 179 27 27 62 99 18 -181 -130 -85 -126 16 -235 -62 35
6665C5j22J44n5L9l0p1J23q7o2K69j13k10K6J17j15K49K6j75k74L97j98Q6n9J90
$$ 35 -87 57 2 41 11 -60 63 -24 -86 183 70 -140 -114 3 -112 137 163 -12 -286 111 -87 -1 -60 130
6689A30k39O8J07J07m9j64o9M9J31k02J45j89J66l0o0j74L09Q8j87o1j3J60q8
$$ 130 -109 -41 66 173 124 -40 -109 -60 71 -131 14 -175 -9 -39 -99 -273 36 124 -63 -124 -137 23 -65
6712f5L3L8k27J98r7K29j28o9j71L11O5j55NM0n2P2q3J00j90K31k5l7q2j14L72
$$ -65 -32 6 -221 -23 -120 109 -19 -88 -259 52 117 -38 -33 7 -45 27 -56 44 -146 85 60 23 -59 -173 199
6737A99j60j04l0R0M3k33Q9k3k8%M5M0Q8qL5j09n1K5K44j82m1k8j01L7L35j63
$$ 199 39 -65 -95 -5 38 -195 -106 -129 -157 -157 -112 -72 16 8 43 -66 -117 -92 152 -30 -71 -99 -200 -163 172 9
6763Ik51P0K21j13L4M7r3J87r7J57l67J17R0l3L4L80k64j59M2j34pJ43o9Q0nk37
$$ 9 -242 -172 49 -64 -30 17 -76 111 14 171 -196 -79 11 -22 12 392 128 -31 11 -123 -130 13 -56 24 19 -218
6789b18K41j5J41j82J10nl6m7l2j8N0J63j29J39j82rJ6J10k28K72k63j5Q8J03
$$ -218 23 8 149 -33 77 72 36 -11 -43 -61 -11 152 23 162 -20 -29 -13 97 -131 141 -122 -137 -49 54
6813E4p0Q4O1p5K5Q3L1j28j97J60k5L9q6R2O1l50J52J29J81k82k13L35k28L51
$$ 54 -16 68 129 54 79 162 193 65 -132 28 3 42 -44 48 109 -241 -89 40 221 -61 -274 61 -167 184
6837A84j34o2j5J2J16j24J04J4n3j85J66Q4M0j21p9j58L83j95P9j92J43J19j45
$$ 184 50 -12 -27 -15 101 -23 81 95 42 -143 23 107 147 26 -53 -211 172 -23 56 -136 7 126 -19
6860a9J60k17M1j19N2R8l3jj13L2R0J21j99K14l9j32M0R9n0r4L35k27o7J7j27
$$ -19 141 -76 -35 -154 -102 -4 -37 -38 -151 -119 -29 92 -107 107 68 -64 -24 75 25 -69 266 39 -28 -11 -138
6885a38J87J39k2j30j8j43K38r2O3j61Q9j77J63K1j93K14q7J03k30K57k24L28
$$ -138 49 188 166 36 18 -125 113 21 84 -77 12 -165 -2 19 -174 40 -47 56 -174 83 -141 187
6907A87l45K78r4p5J73n9pRK4m9k6j27P7j83J48L47l64J77p9l9K73l41L0J27K7
$$ 187 -158 120 26 -49 124 65 58 67 91 42 16 -111 -34 -217 -69 278 -86 91 12 -27 246 -95 -65 62 89
6932H9j74L20m71L25j39L2j2r2J96j50k8l4J56J58k21P4ppm0j53J88J00j24j10
$$ 89 -85 235 -236 89 -50 -18 -30 -122 74 -76 -104 -138 18 176 -45 29 22 15 -25 -178 10 110 -14 -124
6956a24J32q4M5l0m6M0L9J2K64l4o2k63J10j7Q4m2l5r4j05K31J44j3l6j1Q1j41
$$ -124 8 -76 -31 -61 -107 -67 -28 -16 248 214 152 -111 -1 -18 66 24 -11 -105 -210 21 165 152 116 105 186 45
6982D5L5J55l68K30j5n7O9m6j22j34K69K60m68K11K2J32k43K86j2k10J56k88J50
$$ 45 80 235 -133 97 82 25 94 48 -74 -208 61 321 -147 64 86 218 -25 261 249 39 195 -93 57
7005E7j54J55r1M7r6J16q1j10J61nl9N4O0j12l4j9K34p8L6n5p4p3K72j01O0oq5
$$ 57 -97 58 -33 14 -82 34 -47 -157 4 -1 -40 14 74 -38 -72 -91 143 65 101 46 -28 -101 171 70 130 124 39
7032C9k02J49J94k50O0J45n3j74K49j06N1j45K92k35m6J16m4L6nj51J68k60K96
$$ 39 -163 -14 180 -70 -10 135 82 -92 157 51 102 -43 249 14 -32 84 40 76 71 -80 88 -172 124
7055A24m0j0l19K47J11j83K56k86j23J56J82j82J10R0o7J22k12j02N5k17M16J11
$$ 124 84 74 -245 2 113 -70 186 -100 -223 -67 115 -67 43 133 66 188 -24 -126 -71 -288 128 239
7077B39m5j38j11J01j96J42J4k73L04Ln0l1Q9L2k31L12j73Ro0J88j31j56K98k41
$$ 239 194 56 -55 46 -150 -8 6 -267 37 40 -10 -41 48 80 -151 161 -12 -3 -63 125 -6 -162 136 -105
7101a05J34m6j35K12k12P7J82p5O2nK6M4k33J49j45r5pJ25lK7K3L0j19Q0J27m2
$$ -105 29 -17 -152 60 -152 -75 107 32 94 89 115 159 -74 75 -70 -165 -172 -47 -50 -23 0 30 -89 -9 118 76
7127G6J10p7m4j12j5l3J51K17j88mq2P9j24M5N3l64M06p5o9k26K74N7j11J91j40
$$ 76 186 109 65 -47 -62 -95 56 273 85 81 -1 78 -46 -1 52 -312 94 19 -50 -276 -2 55 -56 135 -5
7152ek1nN4M5J47p7J5j08j27n6J58j18J72k22K58k25J08l8J34k16L6J69j40L1
$$ -5 -26 -31 23 68 215 138 153 45 -82 -138 20 -98 74 -148 110 -115 -7 -45 89 -127 -91 78 -62 -31
7176c1K29l46P6J34l02K29j13M9M2J36j52J65k57M8J01J56M0q8j64LJ27r3M0j07
$$ -31 198 -148 -72 62 -240 -11 -124 -75 -33 103 -49 116 -141 -93 8 164 204 116 -48 -45 82 -11 29 -78
7200g8O3m5K62o8j98j9K39k84O8J07Jj04K05k54J11K27k26N3P3k30K43j81K11
$$ -78 -15 -60 202 134 -64 -83 156 -128 -60 47 48 -56 149 -105 6 233 7 60 133 -97 146 -35 176
7223A76n3j31n1Q6j66R7M8k45K11k8O7j34M1O9J77k60K76o7j75j39J20J73j10
$$ 176 123 -8 -59 27 -139 -42 6 -239 -28 -56 11 -123 -82 -13 164 -96 180 113 -62 -201 -81 92 -18
7246a8P9o3o3O6K16l83N3K45j99L5k24J78lM5K6Q2n0j4N5J00J06m19K35P0j56
$$ -18 61 -2 -65 1 217 -166 -113 132 -67 -32 -256 -78 -81 -36 -10 72 22 8 63 163 269 -150 85 155 -1
7271aK13l62J47j35R7j1N2l1J78j26J2j36J78k93J02K15k10K21j06P4pJ85k11
$$ -1 212 -150 -3 -138 -41 -52 0 -31 147 21 33 -103 75 -218 -116 99 -111 110 4 78 71 256 45
7294D5N7O9j68J46j70j9J87l36K00n4J22k13J3J08j93L05P7j19j00OL02k51j07
$$ 45 102 171 3 149 -21 -40 147 -189 11 -43 79 -134 -121 -13 -206 99 176 57 -43 -37 265 14 -93
7317i3L54j53j84O7KJ86n27M33m9K55l79L6p3N9M7N1R2j08q4J22N9l07J42J65
$$ -93 261 108 -76 -9 -7 179 -348 85 36 291 -88 -52 -125 -66 -19 32 124 16 -68 54 113 -194 -52 113
7341A13k60J65Q1q7J51j36P2j32K49l07O4L4k4o5K22j80O0p7q5P5J1n4J06q0L24
$$ 113 -147 18 99 12 163 27 99 -33 216 -91 -27 7 -17 -82 140 -40 20 -57 -142 -67 -56 -110 -4 -84 240
7366B40l55O8J09j29J70k1r4K3o9J4q6O0k3J54k31J51r1Ol2R4J82k76J79o9K11
$$ 240 -115 -47 62 -67 103 82 -12 11 -58 -44 -130 -70 -93 61 -170 -19 -110 -104 -136 -42 140 -136 43 -26 185
7391A85k47J44j29k11K57M6jK3K8k54pL22K8l23L4qJ28q4j7K55j79J25J23k61
$$ 185 -62 82 -47 -258 -1 45 44 67 95 -159 -166 156 184 -139 -105 -113 15 -69 -86 169 -10 115 238 -23
7415b3L7j06m8m6L33o0j43J69j72L63l77L8Q3J33m8J8k12L39k98j76K63j07Q4
$$ -23 14 -92 -140 -186 147 87 -56 113 -59 304 -73 -35 48 181 133 151 -61 278 -20 -196 67 -40 44
7438D4m9P2n6j98K99j00J77l8j58L2j54K66j97J42k03K19j02j35K76k6k07K10
$$ 44 -5 67 11 -187 112 12 189 151 -7 25 -129 137 -60 82 -121 98 -4 -139 137 111 -96 114
7460A14qj61r2j9J03R0J8m8K39j1l3k52jJ25j80KN1K14k65L25j8J6j00j8m8M7
$$ 114 106 -55 -147 -166 -63 27 45 -3 236 225 192 -60 -61 64 -116 -114 -63 151 -114 211 193 209 109 91 43 90
7486I0R1m9j68o2O7L8m8l5J24J32j86j00J31K6O9n4l11J42Ml0K31j51k03J27L79
$$ 90 181 132 -36 -98 -31 7 -41 -76 48 180 -6 -106 25 51 120 66 -245 -103 -99 -129 102 -49 -252 -125 254
7511B54l8k71L3%mj6j21K25J6j01J16q3J4j90K34p6P1q5o3k3J70n9n8J70o0J3
$$ 254 216 -55 -22 -22 -26 -42 -163 62 78 -23 93 10 24 -166 68 -8 63 -22 -85 -108 62 3 -55 115 55 68
7537F8p9oj28M0J93J29k48l3j6K21k79O6R9r2n2J67L7k4N6l2j58Q6J03k83K61
$$ 68 -11 -17 -145 -105 88 217 -31 -64 -80 141 -138 -72 27 -65 -117 50 87 63 119 87 -71 15 118 -165 96
7562I6m2j60L2K91k87P6j9p3J00K7j8j25L05k57l4J24j07J20J31l64J48KO5q0
$$ 96 54 -106 -74 217 -70 6 -13 -86 14 41 23 -102 203 -54 -88 36 -71 49 180 -184 -36 -34 31 -49
7586d9J05o7K3J56l53R0K29r6J03k57K71m6l00J37J44r3L4j21P0K4j3J6k5nn1
$$ -49 56 -11 12 168 -185 -95 134 38 141 -116 155 109 -191 -54 90 -3 31 -90 -20 4 -9 7 -18 -23 -74
7611g4K55j19k28J36J4J39j76j07K54j11j0n8m8M2L34l27L98l24J44k94K64o5
$$ -74 181 62 -166 -30 -16 123 -53 -160 94 -17 -27 -85 -133 -91 243 -84 314 -10 134 -160 104 39
7633C9r6j7L65k01j44rK66r1j36P0o7K24k52j0Q5k7n6J28K7l6n1j3j94L24j31
$$ 39 -57 -74 291 90 -54 -63 203 112 -24 46 -21 203 -49 -59 26 -1 -57 71 98 62 11 -2 -196 128 -3
7658cMj11k3l7L76k35J75j63n8O7K3p9j30J47O6j48R4P5l65M21m9K1n7q5J80j09
$$ -3 1 -110 -133 -170 206 -29 146 -17 -75 -8 15 -64 -194 -47 19 -129 -35 40 -325 96 47 68 11 -74 106 -3
7684cR5m8j50O1L20l56m2N2J86k03m3n0K35j22K02j8J1j60P0N7k07K05l10L96
$$ -3 92 44 -106 -45 275 -81 -123 -71 115 -88 -131 -181 54 -68 134 116 127 -33 37 94 -113 92 -218 178
7708A78n01K35J17j9R3j85K19j45m3J76k48J44oP6n4k26J57R3j50K94K2m30M37
$$ 178 -323 -88 29 10 103 -82 137 -8 -51 125 -123 21 15 91 37 -189 -32 61 -89 205 227 -203 234
7731B34j81j2n1J23j79J05j14K22k4j26l7q0J99j79L4K22j22m7L6J0j38M1L12
$$ 234 53 41 -10 113 -66 39 -75 147 123 -3 -40 -120 79 -100 -66 156 34 -13 23 33 -105 -64 248
7754B48k42n4R6O4r6m1K33j63j27R8l2j12L50l25L29k69j0N1K07l40L14k03K5
$$ 248 6 -48 48 112 16 -25 208 45 -82 16 -16 -128 222 -103 226 -43 -53 -2 205 -135 179 -24 1
7777Al1Q1j98K07k49J49J03N1j71j94J69L36j1l43j9L4K16j56K0Jk44J83Q7O0
$$ 1 -30 51 -147 60 -189 -40 63 114 -57 -251 -82 254 243 -100 -119 -85 131 -25 -5 -4 -248 -65 22 82
7801H2J64K7j77j44l6K26m6Q5l75K89j33P0K31j09k18J31K0j75J59j10LJ4N1j18
$$ 82 246 273 96 -48 -84 142 96 181 -194 95 -38 32 263 154 -64 67 87 -88 71 -39 -36 -22 29 -89
7825h9L3J43k3j29K37j97N6oK8jq7K7k2L1p4L7j39K7M7L12j75Q2L6j23J2N9r3
$$ -89 -56 87 64 -65 172 -25 31 25 53 52 -35 -8 -30 1 -73 -36 -175 -148 -101 211 36 118 154 31 43 102 9
7852IL2L4j75J66j63O9lJ13m4j8rNP7j40J59n4k60K32j8o5l9P6j00J36K8mk10
$$ 9 41 75 -100 66 -97 -28 -31 82 38 20 11 16 93 -47 112 58 -202 30 12 -53 -92 -16 -116 20 48 44 -166
7879a66J98K17l37m1J44j95J42J27k03J72N2k34K05j70J82m6n8M6J36k74J88Q6
$$ -166 32 249 -88 -129 15 -180 -38 89 -114 58 110 -124 81 -89 93 47 -11 35 171 -103 85 171
7901A71k53m7P4l2Pj4k0J8M1r2O6M4k6K05j27j70j9K38k09J09j04K99k95K80K0
$$ 171 -82 -129 -55 -87 -80 -94 -114 -96 -55 -147 -81 -37 -63 142 15 -155 -174 64 -145 -36 -140 159 -136 144 164
7926A64J05l40pK43j83j81J63K2j2K33k20K54j80j31J53l06K27L4J01j86O0j15
$$ 164 269 -71 -78 165 -18 -199 -36 -14 -26 207 -13 241 61 -70 83 -223 4 38 139 -47 13 -102
7948a02J05r7PJ79j28J05n3J7K08l05O4J14j28j0nj00J08L4j54OJ42N6j61q2P3
$$ -102 3 -94 -87 92 -36 69 16 33 241 -64 0 114 -14 -24 -29 -129 -21 13 -141 -135 7 63 -98 -180 -107
7973a07J58j47K8M6j93l0J55lL75k16p6j16K2K12r6J22j13N1o8m5r2J24K33l28
$$ -107 51 -96 -68 -22 -215 -245 -90 -93 282 66 -10 -126 -104 108 12 134 21 72 4 -41 -133 -9 224 -104
7997a04R0J39L2l04P7%K5KJ08o3rK74j00O6k48j15L24j92K30r2o0j09k0q8l5K4
$$ -104 -14 125 157 -147 -70 -70 -45 -43 65 2 -7 267 167 233 -15 -130 194 2 232 140 80 -29 -49 -137 -172 -148
8023a48L13l25N08m60n3J87K86l79PNP1O1j33R2k58L38J61l97J67l40k6M29j38
$$ -148 165 -160 348 -112 -165 22 308 -71 -64 -59 12 73 -60 32 -226 112 273 -124 43 -297 -323 106 -32
8046c2J13p4J27j34j44N1J65l3M6n9o1K12k81J58o1o5N7j33K20n8rjK03o9j25
$$ -32 81 7 134 0 -144 -93 72 39 85 26 -35 177 -104 54 -7 -72 -15 -148 72 14 5 4 207 138 13
8071A3%K27k18J3r3J58n6q3r6K72l11J41M4k2k2l2J84j13N0m5P3k47J74j32K27
$$ 13 13 240 22 35 -58 100 44 -39 -135 137 -174 -33 11 -11 -33 -65 119 6 56 11 84 -163 11 -121 106
8096A06O6p3o5K79j32j25j67K08k37J52k2m0k4m5J37j36O1R5Q9M2k69K50j38Q6
$$ 106 172 99 34 313 181 56 -111 97 -140 12 -10 -50 -74 -119 18 -118 -57 38 127 169 -100 150 12 98
8120I8n8o0Q0Q6ln5j47r3l8J39L3J2j35K14j43J67k38J66k29K03K47m93L26j38
$$ 98 40 -20 60 146 143 88 -59 -152 -190 -51 -18 -6 -141 73 -70 97 -141 25 -204 -1 246 -247 79 -59
8144e9K14r3ln4Mj51K77q8J49k36J31p4k18J82m2J39r0J25r7J56k54N6M7j07J92
$$ -59 155 62 59 5 9 -142 135 47 196 -40 91 17 -201 -19 -61 78 -12 113 16 172 -82 -26 21 -86 106
8169A06l4kJ51j32k33P4K37p2j67k08K77m6j0PK7j63J98O4p8M9K4K1
$$ 106 72 70 221 89 -144 -70 167 95 -72 -280 -3 -49 -59 -52 -25 -188 10 74 -4 45 69 90
8191I0
$$ Imaginary data points
##PAGE= N=2
##DATA TABLE= (X++(I..I)), XYDATA
0@%%%%%%%%%%%%%%Qj6J6j6J6k4L2l2M0m8N6o4P2q8J00j12J30j50J68j88K13k41
$$ 0 0 0 0 0 0 0 0 0 0 0 0 0 0 0 8 -8 8 -8 8 -16 16 -16 24 -24 32 -32 40 -48 52 -60 70 -80 88 -100 113 -128
36a28K72l05L41l81M26m74N24n81O45p12P85q65R54j051J157j276J406j551J712
$$ -128 144 -161 180 -201 225 -249 275 -306 339 -373 412 -453 501 -550 607 -669 737 -814 898
55H98j893K098k333K606k924L302l761M333n065O045p433R560j3267K1574p7352
$$ 898 -995 1103 -1230 1376 -1548 1754 -2007 2326 -2739 3306 -4127 5433 -7834 13740 -63612
70f3612L8132J35198q2159r5115J3430Q7366O649l2215j3705r25j4543L2521L8568
$$ -63612 -25480 109718 27559 -67556 -54126 33240 39889 7674 -6031 -6956 -21499 11022 49590
83D9590k8622p0365O056P5056K3301p2129l9574M5647M2847j7158k7214l423R409
$$ 49590 20968 -49397 -43341 31715 55016 -17113 -56687 -11040 31807 14649 -12565 -15988 -6579
96f579P130J7160L295l3747j7243M0359K6173l3854l1274K3030K6821j7103j8178
$$ -6579 551 17711 21006 -12741 -29984 10375 36548 2694 -28580 -5550 21271 4168 -14010
109a4010J8697L734k5362O442L3009q126m0045K317M4810M189m4781o235M0012
$$ -14010 4687 8421 -16941 -10499 22510 14384 -25661 -23344 21466 25655 -19126 -25361 14651
122A4651L243l2214L760L0943r661l6205J5745M6194j6587n3235R429N2201P00
$$ 14651 17894 -14320 -10560 20383 10722 -25483 -9738 36456 19869 -33366 -23937 28264 28964
135B8964m6823j1857L3688J1467j9984l460Q079q034k139K1034Q566k5911j6463
$$ 28964 -17859 -29716 3972 15439 -4545 -8005 74 -7960 -10099 10935 19501 -6410 -22873
148b2873K8332K4745k2069k5696J1909J9128o297j3072L545J969j0309L175J6724
$$ -22873 5459 30204 8135 -17561 -5652 13476 7179 -5893 -2348 -379 -10688 -7513 9211
161I211n471k1206N443K3612k05j9679J703J8171k816j4340P434J2749j1902j5336
$$ 9211 3740 -17466 -12023 11589 11384 -8295 -6592 11579 8763 -5577 1857 14606 2704 -12632
175a2632J1209J5040j1883j7681Q962J4763q365j0539R618P715j1123m188J7613
$$ -12632 -1423 13617 1734 -15947 -6985 7778 -587 -11126 -1508 6207 -4916 -9104 8509
188H509O185k0534p872K2136J1986k0422j6052J4915J5125r870j2812L286N660
$$ 8509 14694 -5840 -13712 8424 20410 -12 -16064 -1149 13976 4106 -8706 -5420 240
201B40j359J973K444q281o865J2180J4044j1140j8027O904K0982j18j9231m417
$$ 240 -1119 854 3298 -4983 -11848 332 14376 3236 -14791 -7887 13095 12977 -6254 -10671
215a0671J3909N680o343l546k79k175K305Q003j070j4289l687J6182P306j4245
$$ -10671 3238 8918 2575 -971 -1250 -3425 -1120 6883 5813 -8476 -12163 4019 11325 -2920
229b920j0026R344J0945l762p837K413L299j163K826L246n399n798M809R069l989
$$ -2920 -12946 -3602 7343 3581 -4256 -1843 1456 293 3119 6365 966 -4832 -23 9046 5057
244E057j2707J144J1892j175j0110j318O828J842m762k08N667k256k663N606L165
$$ 5057 -7650 -6506 5386 4211 -5899 -7217 -389 1453 -3309 -3517 2150 -106 -2769 2837 6002
259F002m986k814M495L924m989n370M788K162n488j922L667M18l678j497N698
$$ 6002 1016 -1798 2697 6621 1632 -3738 1050 3212 -2276 -4198 -531 -113 -3791 -5288 410
274D10K406o155n74O816J565l912j431L358K144l713r01L043k724l455L232J820
$$ 410 2816 -3339 -3913 2903 4468 556 -875 2483 4627 914 13 3056 332 -3123 109 1929
290A929l465l737K693N132k652n255L517M336j456j651M09K001J64j852K238M29
$$ 1929 -1536 -5273 -2580 2552 -100 -5355 -1838 2498 1042 -609 -200 1801 1965 113 2351 2780
306B780l987L32L797m64m016j855L574K706m676k513L756J133j743K29K30N01
$$ 2780 -1207 -875 2922 2458 -1558 -3413 161 2867 -1809 -4322 -566 567 -1176 -947 -717 -216
322b16k76J022K272k268k468L599K195k590k132M10K981l94m282N49J889j153
$$ -216 -492 530 2802 534 -1934 1665 3860 1270 -862 -452 2529 2135 -2147 -1598 291 -862
338h62q54K72P3K61m74J390J288k062L49L333n0k005l64J617J375k534j769J549
$$ -862 -1716 -1444 -1371 -1110 -1584 -194 1094 -968 -619 2714 2664 659 295 1912 3287 753 -1016 533
356E33J43j907N5m68n30N20n0J192p64j076K573J847r69r98K06J841J320k309
$$ 533 676 -1231 -1176 -1644 -2174 -1654 -1704 -512 -1276 -2352 221 2068 1099 101 307 2148 3468 1159
374A159q41N18r15L92M45j605j649oJ723J403k102j924K090K271O15r74j330O71
$$ 1159 318 836 -79 313 758 -847 -2496 -2502 -779 624 -1478 -3402 -1312 959 1574 600 -730 -59
392e9J993Q65n07k119j049J478J765r08k335j995J310K581n55j856j842Q52K833
$$ -59 1934 2799 2292 173 -876 602 2367 1459 -876 -2871 -1561 1020 465 -1391 -3233 -2381 452
409D52J799k502k271J089L751J560k954k202Q82K318R05j600k545o48J839J697
$$ 452 2251 -251 -2522 -1433 2318 3878 924 -1278 -396 1922 2827 1227 -1318 -1966 -127 1570
425A570n89l288j799K679L354o75l763j497L940L939j602l775k84K871K407p31
$$ 1570 981 -2307 -4106 -1427 1927 1252 -2511 -4008 -68 3871 2269 -1506 -1790 1081 3488 2757
441B757k491j915N05L071J401l312m080J85M513K855l728n204R20N868L213l707
$$ 2757 266 -1649 -1144 1927 3328 16 -4064 -3879 634 3489 -239 -5443 -4523 1345 4558 851
457H51m438J442M624K233k286l414q70K341K550K21l692l653J026M481J900m057
$$ 851 -3587 -2145 2479 4712 2426 -988 -1858 483 3033 3254 -438 -4091 -3065 1416 3316 -741
473g41n334J595O756J860m586l758K435M951O39k841j315l71J261K150L27l087
$$ -741 -6075 -4480 2276 4136 -450 -4208 -1773 3178 3817 976 -339 -710 551 2701 3028 -59
489e9l468O43N195J428n924l930L506N646l12n267j468M458K361o65j775r27K11
$$ -59 -3527 -2884 2311 3739 -2185 -6115 -2609 3037 2725 -2542 -4010 448 2809 2144 369 -558 -347
506c47J189J814L97l552l189L112M410j041n855l291N758N263l184n989l50N469
$$ -347 842 2656 3053 -499 -3688 -576 3834 2793 -3062 -6353 -595 4668 1484 -4505 -4855 614
522F14L474k627m114R79K343J900N34k040k500n94K898M127k070p611j284P086
$$ 614 4088 1461 -2653 -1674 669 2569 3103 1063 -1437 -2031 867 4994 2924 -4687 -5971 1115
538A115M960n203p941J622Q189J500m677l108J534L180J276k14n60l198j159N391
$$ 1115 6075 872 -7069 -5447 2742 4242 -435 -3543 -2009 1171 2447 2233 1673 -1525 -2684 2707
554B707L535m677p064P92Q167K412p811m977M181N355J47m530j912K815K253N45
$$ 2707 6242 1565 -5499 -4707 3460 5872 -1939 -6916 -2735 2620 2767 -1763 -3675 -860 1393 1938
570A938J58k261j372J521L095J140l829m859K868N528n56n703l751M468N616k379
$$ 1938 2096 -165 -1537 -16 3079 4219 390 -4469 -1601 3927 3371 -2332 -6083 -1615 4001 1622
586A622n293l71M149K993j489l434P05J716O38J230l72k617j739K495L848j681
$$ 1622 -3671 -4042 107 3100 1611 -1823 -1118 598 1236 2466 2094 -523 -2262 233 4081 2400
602B400o322k79N849J751l870l947J494M537j3k573k47P29P23Q13O94k85j964
$$ 2400 -3922 -4201 1648 3399 -471 -4418 -2924 1613 1600 -973 -1220 -491 232 1045 1739 1454 -510
619e10j031L361J822l226k918Q52K603R35k640j851R98J096J101p78j029K77O52
$$ -510 -1541 1820 3642 416 -2502 -1650 953 1888 -752 -2603 -1605 -509 592 -186 -1215 -938 -286
636b86Q69R34n16j039l83J296J579o07k991n90K430J164j823k123l02K486P96
$$ -286 583 1517 1001 -38 -421 875 2454 1847 -1144 -1734 696 1860 37 -2086 -2388 98 894
653H94j777r75O69R81O76J81j39r82J12K172N90k064j344J124J879q07k326n06
$$ 894 -883 -1858 -1189 -208 468 649 510 -472 -360 1812 2402 338 -1006 118 1997 1190 -1136 -1642
671a642R79Q83l89p72o18N18P55P16l05q10L20R13J169p10r29o3J278J47j213
$$ -1642 -663 220 -169 -941 -1559 -1041 -286 430 125 -685 -365 548 1717 1007 78 15 1293 1440 227
690B27n48k23K70M46m06r39lL83O25k69j65Q7L12N30L01N7k8k38r0O87q2o24m60
$$ 227 -321 -544 -274 172 -234 -1173 -1176 -793 -168 -437 -602 -515 -203 327 628 685 657 419 329 1016 934 310 -150
713a50M4O32n74p85j52L21J96m4k04q0J47O83O60m76l87P34N95l40k76l26K30
$$ -150 -106 526 -48 -833 -985 -664 -468 -512 -716 -796 -649 34 694 218 -169 565 1160 820 544 218 448
734D48O5k71k90l57r2K11O5p07L9K16K78O09l05o89O08R02J55m46o3L32K66j86
$$ 448 513 242 -48 -405 -497 -286 -221 -928 -889 -673 -395 214 -91 -780 -172 730 885 439 376 708 974 788
756G88n82m09ON45l99o56k01N9M70K77p10k3P87K32J53k69k0O16L36m70o1k5j14
$$ 788 206 -203 -197 348 -51 -707 -908 -849 -379 -102 -812 -835 -48 184 337 68 48 664 1000 530 469 444 330
779C30L40k05r22N9k5K30j55q58N52J47k1L92k25n4J006j64j13L02k03L17L6m16
$$ 330 670 465 -457 -398 -423 -193 -348 -1206 -654 -507 -528 -136 -361 -415 591 427 314 616 413 730 766 350
801C50j01K8m99L26n97m22L66K40m05K27j61K75K63k02P44p7n4M06J89o10L09
$$ 350 249 277 -222 104 -493 -915 -549 -309 -714 -487 -648 -373 -110 -312 432 355 301 707 896 286 595
822E95Ml34K14n71o0J91m38J41l82j84L84kk60O69m60J53O11K47j82L60l11K71
$$ 595 599 265 479 -92 -152 39 -399 -258 -640 -824 -440 -442 -702 -33 -493 -340 271 518 336 696 385 656
844F56O7m21K66o43l01L25J96p53j43J60L34O9m22O2M43J27M39k65j09K30O60
$$ 656 723 302 568 -75 -376 -51 145 -608 -751 -591 -257 -188 -610 -548 -105 22 461 196 87 317 977
865I77j30L9q89k31R20k61n02n18j98O43J93n04k62k56L28R54k21k30j54P82M70
$$ 977 847 886 -3 -234 686 425 -77 -595 -793 -150 43 -461 -723 -979 -651 303 82 -148 -302 480 950
886I50oq08J69N33m32J4k58o96K73M5K05l60q01PJ185L23q20m84Q46J055n73k65
$$ 950 944 136 305 838 406 420 162 -534 -261 -216 -11 -371 -1172 -1165 20 343 -477 -961 -115 940 367 102
908A02L19J13o1O4J15k98q32l8R00J51j351m17N54P56O0j123l6P83N54J56k82
$$ 102 421 534 473 537 652 354 -478 -516 384 535 -816 -1233 -679 77 137 -986 -1022 -239 315 471 189
929A89l34L25P10J38k87q89P9M61J02m12m74p80L32J213k59r89p63J456J529r93
$$ 189 -145 180 890 1028 741 -148 -69 392 494 82 -392 -1172 -840 373 114 -875 -1638 -182 1347 354
949C54j281K72J287M15p76J51Ll12M1Q47j17j338j142J347J413j353j738N21J932
$$ 354 -927 -655 632 1047 271 422 425 113 154 1001 884 -454 -1596 -249 1164 -189 -1927 -1406 526
968E26K64j774J4J220M43n01J13N44n67m39O27Q61o59j252R0J304q4j255r67P83
$$ 526 790 -984 -970 250 693 192 305 849 282 -157 470 1331 672 -580 -490 814 730 -525 -1492 -709
988g09J003r6j066K11N34L93K21o26j44O95j4L84k68j31l29l77P62O55j414j493
$$ -709 294 198 -868 -657 -123 270 491 -135 -279 416 402 786 518 387 58 -319 443 1098 -316 -1809
1008a809J162J404q1k028k97J812Q81j281l68P61L18k92K33Q59o01j628N68K028
$$ -1809 -647 757 676 -1352 -1649 163 1044 -237 -605 156 474 182 415 1274 673 -955 -387 1641
1026A641l88k234o59J794J152j894j273J218P93l92PL4K94k31m0J192Q1j518m
$$ 1641 1253 -981 -1640 154 1306 -588 -1861 -643 150 -242 -235 -201 93 -138 -178 1014 1095 -423 -427
1045d27J177M32j086p25L21Q01k20m73n12j96R19K23q32K1J70O81L6k20K38J10
$$ -427 750 1182 96 -629 -308 493 273 -200 -712 -908 11 234 -598 -577 -407 274 310 90 328 438
1065D38l66L10Q08o69p86Q1N83O65j260j505J385Q81o04j281O28J086l99p38R93
$$ 438 72 382 1190 521 -265 -184 399 1064 -196 -1701 -316 565 -39 -1320 -692 394 -5 -743 250
1084B50O63j218L6J150L70j072j092J081J255j224r51L66O14k53n96J66M90m15
$$ 250 913 -305 -269 881 1251 179 -913 168 1423 199 -752 -386 228 -25 -621 -455 35 -380
1102c80j37O34ln69J2Q47L69m08l95K23L05j23N4j63n62J82M06l54k91n32L92
$$ -380 -517 117 114 -455 -443 404 773 365 -30 193 498 375 429 266 -296 -114 292 -62 -353 -885 -493
1123d93P98o67q2J96L09l23Q1N54m8m62L15Q90k95j184L14O49O1r07l61R61l57
$$ -493 305 -362 -444 -248 61 -262 -181 373 325 -137 178 1068 773 -411 -97 552 613 -294 -655 306 -51
1144e1r37P24K92k06l70L62N83N9r54O43J033q22m76L29N02j42o62P8N24q82k25
$$ -51 -988 -264 28 -178 -548 -186 397 456 -498 145 1178 356 -120 209 711 569 -93 -15 509 -373 -598
1165e98P43n4n91k22N40M46m79k42M53N82n80J16K83O2k39q0M10k22p83J78L57
$$ -598 145 91 -500 -722 -182 264 -215 -457 -4 578 -2 114 397 459 220 140 550 328 -455 -277 80
1186H0No52k6M59J3n44M10M30j80k11M08K86n49m1O24L88o25j70K08Q0m54l99
$$ 80 85 -567 -593 -134 -121 -665 -255 175 -5 -216 192 478 -71 -112 512 900 275 105 313 393 -61 -460
1208d60N37J7p11J04L87O1n68K71N93Q5p61M15M60J48p17J49N06o1m27j01L70
$$ -460 77 94 -617 -513 -126 -65 -633 -362 231 316 -445 -30 430 578 -139 10 516 455 28 -73 297
1229B97j86q75M50L49k52l71J17M13O2m42M40M99l75o5N42R1j99n61K64L86m47
$$ 297 111 -764 -314 35 -217 -588 -471 -58 4 -438 2 501 126 61 603 694 495 -66 198 584 137
1250A37m66N54k01n69J85L10k61k36L16K50j38k63K01O28p5k28l7Q48o72n05N92
$$ 137 -329 225 24 -545 -360 -50 -311 -547 -231 19 -119 -382 -181 447 372 144 107 955 283 -222 370
1271C70J35l84l59J91J94k20m88L24K96m55O0J55L04J18l86M50J29k40k35P68
$$ 370 505 121 -238 -47 147 -73 -561 -237 59 -396 -336 -181 123 241 -145 305 434 194 -41 727
1291G27k68l96j14J08K47m04l80M59Mo64K33L27j10k42K55M07P0l73M70J05r2
$$ 727 459 63 -51 57 304 -100 -480 -21 -17 -681 -448 -121 -231 -473 -218 189 259 -114 356 461 369
1312C69j05J45M1k07j65J6O1m98J18K86k17j17p3L9L46l32J5O25l55O3R2L45k35
$$ 369 264 409 450 243 78 94 155 -343 -225 61 -156 -273 -346 -307 39 -293 -278 347 -8 55 147 492 257
1335B57l4M7K19k51l10L84j06k69l47j5P0J51k59J40K38L9k35M21r4K25k95K69
$$ 257 223 270 489 238 -72 312 206 -63 -410 -425 -355 -204 -463 -323 -85 -46 -281 140 46 271 -24 245
1357B45J87j77k87L19k04p8j6q9j48R3k69M92m37k90N54mJ9L48k79K29K44l69
$$ 245 432 255 -32 287 83 5 -11 -100 -248 -155 -424 68 -369 -659 -105 -109 -90 258 -21 208 452 83
1379H3K16%K7L1j73o3j52r7p9R7k45j10K31k26L55j00j35L18j75L67M5K7j12p3
$$ 83 299 299 326 357 184 121 -31 -128 -207 -110 -355 -465 -234 -460 -105 -205 -340 -22 -197 170 215 242 130 57
1403E7J71%N1l63r2J90j3k08k52J95J42n3k73J37J07K5K87q2J18j9O4M57j35k49
$$ 57 228 228 279 -84 -176 14 1 -207 -459 -264 -122 -175 -448 -311 -204 -179 108 26 144 125 189 646 511 262
1427B62j89J02L3J14l00m63J51M31j46k94r0R4k0K62J41o6p3K17j0K07m7j36m
$$ 262 73 175 208 322 22 -441 -290 141 -5 -299 -389 -295 -315 -53 88 22 -51 166 156 363 316 180 176
1450A76L47k56l60k92J25L30M1o01Q0K51K6j24k0L27j07j3R7K39J20l07R8J79
$$ 176 523 267 -93 -385 -260 70 111 -490 -410 -159 -133 -257 -277 50 -57 -70 27 266 386 79 177 356
1472C56J21n76j42L59K39n47l71M25J10k08j4j1N0L02k04J90K48j8l05L30J2q
$$ 356 477 -99 -241 118 357 -190 -561 -136 -26 -234 -248 -259 -209 93 -111 79 327 309 4 334 346 338
1494C38k93q9M12o8m24j19L7Q8P8l08P6m7N34l50J57j10J50j33K21L16j13k86
$$ 338 45 -44 368 300 -124 -243 -206 -118 -40 -348 -272 -319 215 -135 22 -88 62 -71 150 466 353 67
1516F7P3M7J28k26m49K68K86l94j47j7M40l66J2K7M22M1l88K32L91j42l35o2O85
$$ 67 140 187 315 89 -360 -92 194 -200 -347 -364 76 -290 -278 -251 171 212 -176 56 447 305 -30 -92 593
1539E93k74n49M8L22rk7n08J10N3K1j20J79l6P1K76O3O4k88J03O5J39j06km38
$$ 593 319 -230 -182 140 131 104 -404 -294 -241 -220 -340 -161 -197 -126 150 213 277 -11 92 157 296 190 188 -250
1563b50L42k5j93k5J42j13P3l56J18L8K10j08J02lJ82j27p3N93j88l01K9N03l03
$$ -250 92 67 -126 -151 -9 -122 -49 -405 -287 -249 -39 -147 -45 -48 134 7 -66 527 339 38 67 570 267
1586B67k29j45J33j42k61p4M86j11l88K91J27P6j46j15O93l12j08K1K36J98l39
$$ 267 38 -107 26 -116 -377 -451 35 -76 -464 -173 -46 30 -116 -231 462 150 42 63 299 497 158
1607A58j01P8L4l65P3K25m17L7p9L77J9k51J10K47m8J92l03K12L84l33M1K2j20
$$ 158 57 135 169 -196 -123 102 -315 -278 -357 20 39 -212 -102 145 97 289 -14 198 582 249 290 312 192
1630A92j50K95l86p5P1j61Jj66p8M85k34j82L21R3n8J47l6J65M5k94K99kj05k14
$$ 192 42 337 -49 -124 -53 -214 -213 -379 -457 28 -206 -388 -67 26 -32 115 79 244 289 -5 294 292 187 -27
1654b7J8J11j70l07J57L25m14k10K94N8o7o6K71M37k57n4L43k67n1J86k11K5j01
$$ -27 -9 102 -68 -375 -218 107 -307 -517 -223 -165 -232 -298 -27 410 153 99 442 175 124 310 99 124 23
1677B3n8Q3j15l37J51J67l6l80J48N24o2k34K57K06j66k07L75p9j02q2R2k57R1
$$ 23 -35 48 -67 -404 -253 -86 -122 -502 -354 170 108 -126 131 337 171 -36 339 260 158 76 168 -89 2
1700Bl61L30j75j00Q0K48l9k41j45M61R8k63R1K65j6j88k2J87P0k85L2J24k36
$$ 2 -359 -29 -204 -304 -224 24 -15 -256 -401 60 158 -105 -14 251 235 47 25 212 282 -3 29 153 -83
1723h3k82M60q7k46p7J31J06j44R3J92o4K3J28k3K11j92M2r4K25n89M0L16Q2k90
$$ -83 -365 95 8 -238 -315 -184 -78 -222 -129 63 -1 22 150 127 338 146 188 94 319 -270 -230 86 168 -122
1747a22j49K46pm21K74O6q0J09J49Q5J00j50r2Q2R2Mqj5k67j23J73O9P8n34K01
$$ -122 -271 -25 -32 -453 -179 -113 -193 -84 65 150 250 100 8 90 182 186 178 163 -104 -227 -54 15 93 -441 -240
1772b40O7mj39J96N2k12M83j39J53r1j30J62J59k55K0J28q0m03J02J46j37p0k02
$$ -240 -173 -177 -316 -120 -68 -280 203 64 217 126 -4 158 317 62 82 210 130 -273 -171 -25 -162 -232 -434
1795d34M52Q9m65J96J63p4j55L85J41j77l2L9R6l1l9L2j3r6m30J88K03k67J97
$$ -434 18 107 -358 -162 1 -73 -228 157 298 121 89 128 224 193 154 186 173 77 -353 -165 38 -229 -32
1818c2n1K2o0j3OL56j96j64K58K46l23J21l6J08j78O9j32j71j75K45J78j64n0
$$ -32 -83 -61 -121 -134 -128 228 32 -132 126 372 49 170 134 242 64 133 1 -170 -345 -100 78 -86 -136
1841a36r5K41K37n09K71L26j20L4J18j84j70k39N14k10j99J29J73k27j21l6K03
$$ -136 -231 10 247 -262 9 335 215 249 367 183 13 -226 288 78 -121 8 181 -46 -167 -203 0
1862@q8Nr8J92P6j72J22k6P4L87m26Q5O4k88J30M7k31J30p7j49p2N9J58K45j51
$$ 0 -88 -83 -181 11 87 -85 37 11 85 472 46 131 195 -93 37 84 -147 -17 -94 -243 -315 -256 -98 147 -4
1887dj19J95j34k25N07j00J19k68P1L52k79l27L23r0o8j4j68J40J12q7j55J39
$$ -4 -123 72 -62 -287 220 120 239 -29 42 394 115 -212 111 21 -47 -61 -229 -89 23 -64 -219 -80
1909h0j87J95K75oj7k04J41K98l16j7J23k8r5k11M3K26j80k20J0n2JJ11J93l20
$$ -80 -267 -72 203 197 180 -24 117 415 99 82 205 177 82 -129 -86 140 -40 -260 -250 -302 -301 -190 3 -317
1933c17K25Q9k4J29k51L48J03l41K06R2jm1m82K27L09m51j26j2J07L93m25k2L87
$$ -317 -92 -3 -27 102 -149 199 302 -39 167 259 258 217 -265 -38 271 -180 -306 -318 -211 182 -243 -265 122
1956A22k54Q4K58L4l81L54J27k9j44J12l43K54K7l57j02J93M3j73mk7L4M1J65
$$ 122 -132 -48 210 244 -137 217 344 315 171 283 -60 194 221 -136 -238 -45 -2 -175 -179 -206 -172 -131 34
1979C4N3P9J22k59J99M5k9j05j03Q5l9j60j00N2L7j67M3J27j3r3Q3J14j7RK25
$$ 34 87 166 288 29 228 273 244 139 36 121 82 -78 -178 -126 -89 -256 -213 -86 -99 -192 -109 5 -12 -3 222
2004B22k26L53k25K9K2n8j44J28l11Q4J93j22J41l18o5K01p7J02r7O1J58p2K20
$$ 222 -4 349 124 153 175 117 -27 101 -210 -126 67 -55 86 -232 -297 -96 -173 -71 -168 -107 51 -21 199
2027A99p9r2O5M8j11p6n3K29k7p3j85R2j08j7N6J55o0j77J32L85J39n74J67rK50
$$ 199 120 28 93 141 30 -46 -99 130 103 30 -155 -63 -171 -188 -132 23 -37 -214 -82 303 442 -132 35 26 276
2052B76k59n5p8M07o18K18J59j84m2K5K5K91m68O6P5J09p3K0O4M61l85M0R6m6
$$ 276 17 -38 -116 291 -327 -109 50 -134 -176 -151 -126 165 -303 -237 -162 -53 -126 -106 -42 419 34 74 170 124
2076A24j99K24j19j45J58j53%j38K5M4L0j96L03Q2j86M9L58k86J14m7J31J17j70
$$ 124 -75 149 30 -115 43 -110 -110 -248 -223 -179 -149 -345 -42 40 -146 -97 261 -25 89 42 173 290 120
2099A20j07J36l0j37n4K9P5l46j75M81J51l59J31KJ94m8j27J67J88j65QL9J63
$$ 120 13 149 119 -18 -72 -43 32 -314 -489 -8 143 -216 -85 -83 111 63 -64 103 291 126 134 173 336
2122C36j82k69J80L4n3j71o2q3K11r8PJ87l5R5J48k82Q9J38J01j94L3j96M11k47
$$ 336 154 -115 65 99 46 -125 -187 -270 -59 -157 -150 37 2 97 245 -37 52 190 291 97 130 -66 345 98
2146I8q7jj04j40J15M4j0j79J26J53J12l10K16N2j44K33j95RL20k61j62N30n05
$$ 98 11 10 -94 -234 -119 -75 -85 -264 -138 15 127 -183 33 85 -59 174 -21 -12 308 47 -115 415 -90
2169i0P2j38K9o7O1r8l8J98k5N9j26J33L5r6K62j27rJ11N8j53o9K28j49n0j40
$$ -90 -18 -156 -127 -194 -133 -231 -269 -71 -96 -37 -163 -30 5 -91 171 44 35 146 204 51 -18 210 61 11 -129
2194a29m0J01j31K49k08R5k00M2K84J47k17J94J30N9l76K31J50k71j58O2J37k33
$$ -129 -169 -68 -199 50 -158 -63 -263 -221 63 210 -7 187 317 376 0 231 381 110 -48 14 151 -82
2216h2r6K1K15j05k2O2qp5m0K28K36k60lJ7J74j3l29L24j38j95R2R1J8K2k19j07
$$ -82 -178 -157 58 -47 -69 -7 -15 -90 -130 98 334 74 71 88 262 249 -80 244 106 -89 3 94 112 134 -85 -192
2242a92J9j18J87n9J44k92L65O3qk41R1K30Q0k53M5k63J34m7P8rl13N25l74J93
$$ -192 -173 -291 -104 -163 -19 -311 54 117 109 -132 -41 189 269 16 61 -202 -68 -115 -37 -46 -359 166 -208 -15
2266a5o7J47j79J11J78k62M04l21M8J52J1j28R8J06L7j08k03m3q3j06R6k5o6K00
$$ -15 -82 65 -114 -3 175 -87 317 -4 44 196 207 79 177 283 320 212 9 -34 -117 -223 -127 -152 -218 -18
2290a8j14J90j17J10O8r6NL15l46K62q6k75K5L21k57LL5p9p4j72L8K16J29l37
$$ -18 -132 58 -59 51 119 23 28 343 -3 259 173 -102 -77 244 -13 -10 25 -54 -128 -300 -262 -46 83 -254
2314b54J83L23j89J80j27j5r4J38r3J08j90j88K64k92Q9J9O8Kr2k16J75j1J14
$$ -254 -71 252 63 243 116 101 7 145 52 160 -30 -218 46 -246 -157 -138 -70 -68 -160 -376 -201 -212 -98
2337i8L05j22K0k16O8O0J89L8l19O3p8J93m7j49K24l17n3k9K60P4k85K37mj51
$$ -98 207 85 105 -111 -43 17 206 244 -75 -12 -90 103 56 -93 131 -186 -239 -268 -8 66 -219 18 14 -137
2361a37K69p1o8J69p5K71j58k15J83k26K20l08J74j20q7J71R2j23J10j78M5J35
$$ -137 132 61 -7 162 87 358 200 -15 168 -58 162 -146 28 -92 -179 -8 84 -39 71 -107 -62 73
2383G3j11J64p7R8k10K36k1J67m02K70j57q0q9q1K05k78L41j99J6K8p3J40J11
$$ 73 -38 126 49 147 -63 173 152 319 -83 187 30 -50 -139 -220 -15 -293 48 -151 -135 -107 -180 -40 71
2406G1J1j01N3J70K2j20P0j91k63K15J76j58K2k15P8P1j75n4K52L0q9K76l13%
$$ 71 82 -19 34 204 226 106 176 -15 -278 -63 113 -45 -23 -238 -160 -89 -264 -318 -66 -36 -125 151 -162 -162
2430a62L37K4Oj85R1R4l6j3m16P5p7J40P1j12j63R7j7K57k15J67j07K88j26J32
$$ -162 175 199 205 20 111 205 169 156 -260 -185 -262 -122 -51 -163 -326 -229 -246 11 -204 -37 -144 144 18 150
2454A50J83j52k74m9L13j80q9j9J9P2k6p5q9J65J8j12o6J12K99m18J96K65n6K1
$$ 150 333 181 -93 -142 171 -9 -98 -117 -98 -26 -52 -127 -216 -51 -33 -145 -211 -99 200 -218 -22 243 187 208
2478B08m1M3Q5k41J49k39k15J78p6L0N4K80n09L13JK8j42O8K3J34r3J42m9j20
$$ 208 167 210 295 54 203 -36 -251 -73 -149 -119 -65 215 -294 19 20 48 -94 -26 -3 131 38 180 131 11
2502A1J62k3o6j92j46J49M0j2N8k3l0o6J43KM8omr0J19QJ10m3P4J39j78r7q9j40
$$ 11 173 150 84 -108 -254 -105 -65 -77 -19 -42 -72 -138 5 7 55 49 45 -45 74 82 192 149 223 362 184 87 -2 -142
2530a42J22j93K4J05J62n2l21N7K64j37k8J06K45K1J31j89O2j71k02K7r4J82n3
$$ -142 -20 -213 -189 -84 78 26 -295 -238 26 -111 -139 -33 212 233 364 175 237 66 -136 -109 -203 -21 -74
2553g4j2J42k60o7K30m1m7K04j62K32j01J20j48J75o1l3P8K4m5k9k29j11K56j30
$$ -74 -86 56 -204 -271 -41 -82 -129 75 -87 145 44 164 16 191 130 97 175 199 154 125 -104 -215 41 -89
2577h9k41J96n6N7M9q0J63Mj94M61l54J37Q5M2k35R6k0l7j11K1Q3N4r3Qk05J94
$$ -89 -330 -134 -190 -133 -84 -164 -1 3 -191 270 -84 53 138 180 -55 41 21 -16 -127 -106 -23 31 -62 -54 -259 -65
2603f5k43M32J3J15k31k44L46nK1j85J76j92K30j64j21K28n3j87N9R4p2n0j01
$$ -65 -308 124 137 252 21 -223 123 118 139 -46 130 -62 168 4 -117 111 58 -129 -70 24 -48 -98 -199
2626a99j02M62m15K07O4OL3Q2q5p8K84j46n8r7l6k8j42J28J55m1k41J79r0J31
$$ -199 -301 161 -254 -47 17 23 56 138 53 -25 259 113 55 -42 -78 -106 -248 -120 35 -6 -247 -68 -158 -27
2650b7q3J31K84j44j23J3q9J90J26p4J62k70k02K52K1m86K88P8p4k51K00r5K49
$$ -27 -110 21 305 161 38 51 -38 152 278 204 366 96 -106 146 167 -319 -31 47 -27 -278 -78 -173 76
2673G6k06j4L97n3o2JKj4j81mK38l31O7K8J6Q5J31n18K22J25j76P3J22l52L95
$$ 76 -130 -144 253 200 138 139 141 127 -54 -58 180 -151 -84 -56 -40 45 176 -342 -120 5 -171 -98 24 -328 67
2698F7k80K45R3l5J17J69m36J21MN7m05K61l06L01j51L6q7K52k14O4J46k5L2j54
$$ 67 -213 32 125 90 207 376 -60 61 65 122 -283 -22 -328 -27 -178 -142 -229 23 -191 -127 19 -6 26 -128
2722a28J87J22k2k62J48j1R9j30J24k97K53j72k76N19l17J16p7R6j49P9K49ko3
$$ -128 59 181 159 -103 45 34 133 3 127 -170 83 -89 -365 154 -163 -47 -124 -28 -177 -98 151 149 86
2745H6m2m3j8J8J39p9K21k14kp5j92J99L2j01q5R1K29k44j60K98N3n3j52K22R4
$$ 86 44 1 -17 1 140 61 282 68 66 -9 -201 -2 30 -71 -156 -65 164 -80 -240 58 111 58 -94 128 222
2770B22r4Ok32K30j74n8K72l91L81k80O7R3%k25J44J35p2R9o9J26j50K84k77j9
$$ 222 128 134 -98 132 -42 -100 172 -219 162 -118 -51 42 42 -183 -39 96 24 123 54 180 30 314 37 18
2794A8K82r8k41P9j93L13j79j03l8Q8J7r7j14L09R5K2r8Q4O2k1q8j43K59j80O3
$$ 18 300 202 -39 40 -153 160 -19 -122 -160 -72 -55 -152 -266 43 138 160 62 146 208 187 99 -44 215 35 98
2819I8p8J29l44K71k32J42k71K3J10K03q8K7o4O1J85k78j44N73l80J38P4k19K9
$$ 98 20 149 -195 76 -156 -14 -285 -262 -152 51 -37 -10 -74 -13 172 -106 -250 323 -57 81 155 -64 -35
2842c5j87P5R8j59n5J99j86J30q3K87p9Q5k72L32m1n4Q0P7j95o0K89k32L7m7k49
$$ -35 -222 -147 -49 -208 -263 -64 -250 -120 -203 84 5 90 -182 150 109 55 135 212 17 -43 246 14 51 4 -245
2867b45M22k66J34k41N3Q2J39j21J94r0Q8j13l2j29L10J17l42L01m43J22R2j97
$$ -245 177 -89 45 -196 -143 -61 78 -43 151 61 149 36 4 -125 185 302 -40 261 -182 -60 32 -165
2889a65K03Q0j39Kj62P2J56Rj4n2j21M4K03kq3j66L96O1k40j45J37j51O4l6k4
$$ -165 38 118 -21 -19 -181 -109 47 56 42 -10 -131 -87 116 114 31 -135 261 322 82 -63 74 -77 -13 -49 -73
2914g3Jj63J29j62J33J78r3O2J13Q9l39L03j65K3Q9N1n9j66o5J95nj71k50J50
$$ -73 -72 -235 -106 -268 -135 43 -50 12 125 214 -125 178 13 36 125 176 117 -49 -114 81 76 -95 -345 -195
2938a95J32k3J69k00K10q6Q8J54k16p1K33j03k39R9J34k32O6J07j68J32j40J09
$$ -195 -63 -86 83 -117 93 7 95 249 33 -38 195 92 -147 -48 86 -146 -80 27 -141 -9 -149 -40
2960d0j33N6L4r3p6K71j10J3J29j90L5L41M7k42l15L29P5j33j33P2nq6L61l32
$$ -40 -173 -117 -83 -176 -252 19 -91 -78 51 -139 -104 237 284 42 -273 56 131 -2 -135 -63 -68 -154 207 -125
2984a25p6Q7Q3N4K0r8J72kj57K67n6k50R6j30N2J27m0Q8k88J96k06J60o3r8J99
$$ -125 -201 -114 -31 23 43 -55 117 115 -42 225 169 -81 15 -115 -63 64 24 112 -176 20 -186 -26 -89 -187 12
3009A2N0O2M4j6k17J56%j58L4J96j06j00J55j75K2J80k72J15k6K25k09p0J89j16
$$ 12 62 124 168 152 -65 91 91 -67 -33 163 57 -43 112 -63 -41 139 -133 -18 -44 181 -28 -98 91 -25
3033b5J61k01J44%J88j72J80k67K18m16K11r1Q0j74M2q6l4Q6J01Rj30K8J16K44
$$ -25 136 -65 79 79 267 95 275 8 226 -190 21 -70 10 -164 -122 -208 -242 -156 -55 -46 -176 -148 -32 212
3057B12j49J07r4R2j37J64j51P7r8j1M8k07l7L7N4K4K20m59J50J88R3m03M65k3
$$ 212 63 170 76 168 31 195 44 121 23 12 60 -147 -184 -147 -93 -69 151 -308 -158 30 123 -280 185 162
3081A62r2j3J37j99K01j92j97J54k8j17J0L6rP1J2K84m60L80j38Q8k0M8j50j32
$$ 162 70 57 194 -5 196 4 -193 -39 -67 -184 -174 -138 -147 -76 -64 220 -240 140 2 90 70 118 -32 -164
3105a64M02K5j86K6n3J46j87K0o2j66J48k02j14K55J51o6o0L5J48N0m0o1J92K
$$ -164 238 263 77 103 50 196 9 29 -33 -199 -51 -253 -367 -112 39 -27 -87 -52 96 146 106 45 237 239
3129B39k12k9J37j42N7J07j56k3j74L8K22k22L43k10j45J40J4K65j73j26M6m7
$$ 239 27 -2 135 -7 50 157 1 -22 -196 -158 64 -158 185 -25 -170 -30 -16 249 76 -50 -4 -51
3151e1J23J2lm7j17J53q2n5Q5j27L27k42J64k22N2M5j69N9K75N4j40J68r5M4q
$$ -51 72 84 81 34 -83 70 -12 -67 18 -109 218 -24 140 -82 -30 15 -154 -95 180 234 94 262 167 211 203
3176B03k27J98l9l9k12J72o4J39j69L8N7l38K28J62n2R0r6j05O3%j44J27m6j9
$$ 203 -24 174 135 96 -116 56 -8 131 -38 0 57 -281 -53 109 57 147 51 -54 9 9 -135 -8 -54 -73
3200g3N7j20J78j70J6JJ10M9l10J47r4J36J08j86K46j61K53j34m8P1k3j18K30
$$ -73 -16 -136 42 -128 -112 -111 -1 48 -262 -115 -209 -73 35 -151 95 -66 187 53 5 76 53 -65 165
3223A65j01j82J51j18J22k24j32L81k37J86r8O8o6Q0RJ44k64K52o0J41j32k1%
$$ 165 64 -118 33 -85 37 -187 -319 62 -175 11 -87 -19 -85 -5 4 148 -116 136 76 217 85 64 64
3246F4Kpj28p4Q6K6JP6j98K32l54J79M48k49k13K55k28K29J3l6k07M1M4N5k19
$$ 64 66 59 -69 -143 -57 -31 -30 46 -152 80 -274 -95 353 104 -109 146 -82 147 160 124 -83 -42 2 57 -162
3271a62K02k13J55K2p7QJ48j98O7K16k49N3o2M0P1LJ51k35J24O7j36J69m0j64
$$ -162 40 -173 -18 4 -73 -65 83 -115 -48 168 -81 -28 -90 -50 21 24 175 -60 64 131 -5 164 124 -40
3295d0k2K31k70MN2L7p2J84r9n8o7N42k98J48l64L5K83j30l6r6j12K21o1j5P1
$$ -40 -62 169 -101 -97 -45 -8 -80 104 5 -53 -120 422 124 272 -92 -57 226 96 60 -36 -148 73 12 -3 68
3320F8j24Q1K7o0p6R3n1L2O5rJ37k35Q7l6j43N2J02J00m9l0j51L01k82MJ90l6
$$ 68 -56 25 52 -8 -84 9 -42 -10 55 46 183 -52 35 -1 -144 -92 10 110 61 31 -120 181 -101 -97 93 57
3346E7o4Q3R2j80Q8o7r4J19k02KJ91kn3J4j88J42j91J04O3J06j53J45Q8l25K74
$$ 57 -7 76 168 -12 76 9 -85 34 -168 -166 25 23 -30 -16 -204 -62 -253 -149 -86 20 -133 12 100 -225 49
3371D9k04K22O6j2k4k3m6J99j76j80L0J11M5m9q0j20K49qj65K67l23L09j94J91
$$ 49 -155 67 133 121 97 74 28 227 51 -129 -99 12 57 8 -72 -192 57 49 -116 151 -172 137 -57 134
3395A34J31k70nn7J70K05k81q5k5OO5J00k03J8L0J83k93L9LK92j12m7J71o4p1
$$ 134 265 -5 -10 -67 103 308 27 -58 -83 -77 -12 88 -115 -97 -67 116 -177 -138 -135 157 45 -2 169 105 34
3420C4K2N8q8M2l29J91L07k30j60J04J32oJ5j24J31k99R0K5J45OM6J03k44P8n4
$$ 34 56 114 26 68 -261 -70 237 7 -153 -49 83 77 92 -32 99 -200 -110 -85 60 66 112 215 -29 49 -5
3445eKo8J45k10J40J37l38K13K81j79j22l9L1J60j06j72O4K84k70oJ30j24l7r1
$$ -5 -3 -71 74 -136 4 141 -197 16 297 118 -4 -43 -12 148 42 -130 -66 218 -52 -58 72 -52 -89 -180
3469a80M4K40k9j50K39l28Q7l2j30J36o6J56k08K90j27J48j71J50Pk3o6J51k07
$$ -180 -136 104 75 -75 164 -164 -77 -109 -239 -103 -169 -13 -221 69 -58 90 -81 69 76 53 -13 138 -69
3492f9R1j18j18J45J46r6l9j52J32K16k54m3K51j12J78k38K05Q3l09L07k49j78
$$ -69 22 -96 -214 -69 77 -19 -58 -210 -78 138 -116 -159 92 -20 158 -80 125 208 -101 206 -43 -221
3514b21L26l7k18J40j03r1R4M4L2kMo6L0R9J39k09J67j77Q1J04j55J43k29L87
$$ -221 105 68 -150 -10 -113 -204 -110 -66 -34 -36 -32 -98 -68 31 170 -39 128 -49 32 136 -19 124 -105 282
3538B82k65j37K02j48M7j69R3J56j02P3R0q5o7l7J5R3J43j34Kl7m3j05Q9m5P2
$$ 282 17 -120 82 -66 -19 -188 -95 61 -41 32 122 37 -30 -67 -52 41 184 50 52 15 -28 -133 -44 -89 -17
3563a7Q5j49o7P4r4J41j25Q6O9K20l32k3L04nr3l4R6j97R7j55J53j87P9J3n0J85
$$ -17 68 -81 -148 -74 -168 -27 -152 -66 3 223 -109 -132 172 167 74 40 136 -61 36 -119 34 -153 -74 -61 -111 74
3589G4j21J61j2mq3O7k76L9J89J8K0r8P7q1m1J94k21j04N5K52J31j92k04K75k5
$$ 74 -47 114 102 98 15 82 -194 -155 34 52 72 -26 51 -30 -71 123 -98 -202 -147 105 236 44 -160 115 90
3614I0j36L03l30M7l5O0J50j25J00L4o8o0P9j36j20J54j39J06J40m11K19o8r9
$$ 90 -46 257 -73 -26 -61 -1 149 24 124 158 90 30 109 -27 -147 7 -132 -26 114 -297 -78 -146 -245
3637b45K13J4R9r7J02j26K87o0J82l42j28J23k2M4n2k6r2J03N4j19J07lr9p8K22
$$ -245 -32 -18 81 -16 86 -40 247 187 369 27 -101 22 0 44 -8 -34 -126 -23 31 -88 19 16 -83 -161 61
3662F1P1k4n0J39j97J27j06O7Qk96M46j78q6J02j55J0R9J3j51N4K03J49l78J78
$$ 61 132 108 58 197 0 127 21 88 96 -200 246 68 -18 84 -71 -61 38 51 -100 -46 157 306 -72 106
3686A06Mj02K87j48k06J34l3P5k67K56M4l19J39K76j77j15j02K03K1k00J18L4
$$ 106 110 8 295 147 -59 75 42 117 -150 106 150 -169 -30 246 69 -46 -148 55 76 -124 -6 28
3708B8K40j91L17k57q1j03n3j74M14r3k98K22j48J71k37L67j59J82q5L9k59J14
$$ 28 268 77 394 137 56 -47 -100 -274 140 47 -251 -29 -177 -6 -243 124 -35 147 62 101 -158 -44
3730d4P4P5P2l52J71k3j7L1j7m4Q2j49J93q6o7K9L5j5k2J7k3J68j53J90j17o1
$$ -44 30 105 177 -175 -4 -27 -44 -13 -30 -74 8 -141 52 -34 -101 -72 -37 -52 -74 -57 -80 88 -65 125 8 -53
3756e3P5K2j21pK26l20J40N0R8n9k11K26j02J7j50L4J60n0N9M0O0O6l4m3K6k42
$$ -53 22 44 -77 -84 142 -178 -38 12 110 51 -160 66 -36 -19 -169 -135 25 -25 34 74 134 200 166 123 149 -93
3782i3J59K6j74R3Rq1p1j89K95J0rK15k59J78j29o2O0J33j30Q8K5j60j39K51k39
$$ -93 66 92 -82 11 20 -61 -132 -321 -26 -16 -25 190 -69 109 -20 -82 -22 111 -19 69 94 -66 -205 46 -193
3807a93J61J30k21J37k5n0m0J23j80O9K09k24P9j29J72P0j33J18m9K15l17K07
$$ -193 -32 98 -123 14 -11 -61 -101 22 -158 -89 120 -104 -25 -154 18 88 -45 73 24 239 -78 129
3829A29l01L6O6J43l06K08M6j0k99K02K04J30j10k27J13j46J1L4J75jj47J37j6
$$ 129 -172 -136 -70 73 -233 -25 21 11 -288 -86 118 248 138 -89 24 -122 -111 -77 98 97 -50 87 71
3852G1k2m9p5J93k95J96o8L7K15k23p0K91j97K10j61K8N6j45l2j75J82q8j2R3
$$ 71 49 0 -75 118 -177 19 -49 -12 203 -20 -90 201 4 214 53 81 137 -8 -40 -215 -33 -121 -133 -40
3876d0R2k53K93l58K11k0j9J64j52J9o2K35j68J64j66J58l2j45QJ01j76J20j77
$$ -40 52 -201 92 -266 -55 -75 -94 70 -82 -63 -125 110 -58 106 -60 98 66 -79 -71 30 -146 -26 -203
3899b03K68O4j06k26K36M9n6K5k8M4l10L31o1J38k04K78j38k94J53O9M1m7j4o6
$$ -203 65 129 23 -203 33 82 26 51 23 67 -243 88 27 165 -39 239 101 -193 -40 29 70 23 9 -57
3923e7j01K48l18J80l7l1o2K62J35k59K25k29K4J24j3K9l60J55K36l25J67M5l1
$$ -57 -158 90 -228 -48 -85 -116 -178 84 219 -40 185 -44 -20 104 91 120 -240 -85 151 -174 -7 38 7
3946GJ65J7l01K04j46J73j75P8m2k8J99j17O8K1q4K90l44M3J3q3j38J32J21m0
$$ 7 172 189 -112 92 -54 119 -56 22 -20 -48 151 34 102 123 39 329 -15 28 41 -42 -180 -48 73 33
3970C3K6j38n5j29J86q8P8o6N7p4O8K32r9J59l03J49j43O1l4Pn4p0P5R9k1o3l6
$$ 33 59 -79 -134 -263 -77 -165 -87 -153 -96 -170 -102 130 31 190 -113 36 -107 -46 -80 -73 -127 -197 -122 -23 -44 -107 -143
3997a43J94Kj14J14j45J92q7Q7j29pK19j43k2j08P5J17l87L61K3k53j2J55P3k8
$$ -143 51 53 -61 53 -92 100 13 100 -29 -36 183 40 18 -90 -15 102 -285 76 99 -154 -166 -11 62 34
4021C4L1J2j25MJ67J5k0J47l8m80R7K55k42J46k74M07q0k15j2K17j14J10p1O8
$$ 34 65 77 -48 -44 123 138 118 265 227 -253 -156 99 -143 3 -271 136 56 -159 -171 46 -68 42 -29 39
4045C9k01K54j99R4K7N6m3l8m9k60J68K66j07r0O0j33Q2J04k81K85M4r3q6k3J91
$$ 39 -162 92 -107 -13 14 70 27 -11 -60 -320 -152 114 7 -83 -23 -156 -74 30 -251 34 78 -15 -101 -124 67
4070F7j72K06k65J74k08J69l0p5K74j58j09J16J31Oo1m7Q2p7M3q5kJ37J08j84
$$ 67 -105 101 -164 10 -198 -29 -59 -134 140 -18 -127 -11 120 126 65 18 100 23 66 -19 -21 116 224 40
4094D0j11m8L33j22k03J24k06L5K82k66J46P2j59J6m2J29l5q0R4K29k96J31m2
$$ 40 -71 -119 214 92 -111 13 -193 -158 124 -142 4 76 -83 -67 -109 20 -15 -95 -1 228 -68 63 21
4117B1Jm3o5K48j65k38L56j10J29p7j53J13M6j81K0j05L93k63K05Q7j38j31Q1
$$ 21 22 -21 -86 162 -3 -241 115 5 134 57 -96 17 63 -118 -98 -203 190 -73 132 219 81 -50 31
4140C1j59K67k44k0r6M6J26J41j60k00J71j42J69M4Q6l04K89l7k13J45J45P6k7
$$ 31 -128 139 -105 -125 -221 -175 -49 92 -68 -268 -97 -239 -70 -26 60 -244 45 8 -205 -60 85 161 134
4163A34j31j04J86k09P8L1L8R5j99P9Pl2J49j29k30K41J19J12l16M02l59p7j25
$$ 134 3 -101 85 -124 -46 -15 23 118 -81 -2 5 -27 122 -7 -237 4 123 235 -81 321 -38 -115 -240
4186b40L65r6m7J56k58J03j87J18M4O2p0K18r1j70j84L24M4rpJ16q8m5q2qJ4j83
$$ -240 125 29 -18 138 -120 -17 -204 -86 -42 20 -50 168 77 -93 -277 47 91 82 75 191 103 58 -24 -32 -18 -201
4212b01P5L28l17J74p1m9j26N9L65l29J47j42OL0R8n6K3J00k02J08J49j38k9L7
$$ -201 -126 202 -115 59 -12 -61 -187 -128 237 -92 55 -87 -81 -51 47 -9 14 114 -88 20 169 31 2 39
4236C9k9k39K32j58L7J77J6j54J28J42k22J11m9J02n9q6M7l3lp6K8O8j32O6k26
$$ 39 10 -229 3 -155 -118 59 75 -79 49 191 -31 80 31 133 74 -12 35 2 -1 -77 -49 19 -113 -47 -273
4261b73L17o4J2j16K55P8j74L4r7O8K5l7r0M7J99l28L67j88kq2j9J3O7P9r7k10
$$ -273 44 -20 -8 -124 131 209 35 69 -28 40 65 28 -62 -15 184 -144 223 35 33 -49 -68 -55 12 91 -6 -216
4287b16L00N8n1p5J59j44L6j34pJ60j70K11j07j16OJ3Q9q7P1J94j02l84Q9P6j10
$$ -216 84 142 91 16 175 31 67 -67 -74 86 -84 127 20 -96 -90 -77 12 -75 -4 190 88 -296 -207 -131 -241
4312b41L71L3l26R8J00p4J64k50L21k58K06j12p7J47M5o0R7k61q6J01K9j93M20
$$ -241 130 163 -163 -65 35 -39 125 -125 196 -62 144 32 -45 102 147 87 184 -77 -163 -62 -33 -226 194
4335A94k68R5J85j0k38L2N9J34ll04m0K12N1k22J57k0J01k01J1L00l01J1J92j03
$$ 194 -74 21 206 196 -42 -10 49 183 180 -124 -164 48 99 -123 34 14 115 -86 -75 225 -76 -65 127 24
4359B4M0L0l3j20K66j11M4q0Jq3J06o2R1j64L7j89J90k25J98j16L43J9q1j65K5
$$ 24 64 94 61 -59 207 96 140 60 61 -22 84 22 113 -51 -14 -203 -13 -238 -40 -156 187 206 125 -40 -15
4384a5R9k20j88K86J24j34k86J24K66J36j44j57LL27j20k2L8l63L75k1k83K5J36
$$ -15 84 -136 -324 -38 86 -48 -334 -210 56 192 48 -109 -106 221 101 79 117 -246 129 108 -175 -150 -14
4407a4j4M1o9M1j48K91j36j01O7N8j77K61L8j18j68n6J63j21K77k24k1L03j92
$$ -14 -28 13 -56 -15 -163 128 -8 -109 -42 16 -161 100 138 20 -148 -204 -41 -162 115 -109 -130 173 -19
4430a9q7O1o5M1Q0P2j44k33o0K70J26j52K41l8m2N8k37L69k38m2L5M0N8j58J2
$$ -19 -106 -45 -110 -69 11 83 -61 -294 -354 -84 42 -110 131 93 51 109 -128 241 3 -39 -4 36 94 -64 -52
4455e2P8J81l10P2J20j28j48O8J28j86L30j25p6J58l9k37J30J4J00q6K62k70k64
$$ -52 26 207 -103 -31 89 -39 -187 -119 9 -177 153 28 -48 110 71 -166 -36 -22 78 -8 254 -16 -280
4478b80Q5K23p9J71j41q0rJ75n0j62L64n0j63j54K42p3Q0r1Nm5p3j33K28N6j50
$$ -280 -195 28 -51 120 -21 -101 -110 65 15 -147 217 167 4 -150 92 19 99 8 13 -32 -105 -238 -10 46 -104
4503a04j33J66j7J30J37k62K59k58K21k12J48Q2O2k14L8M0k43L73k04L3m5oM8
$$ -104 -237 -71 -88 42 179 -83 176 -82 139 -73 75 157 219 5 43 83 -160 213 9 42 -3 -9 39
4526C9J2r9J67k5r1J8m7J8j96K78J73j80j59o1J77M5j28J62K6j43k30nK44J74
$$ 39 51 -48 119 94 3 21 -26 -8 -204 74 247 67 -92 -153 24 69 -59 103 129 -14 -244 -249 -5 169
4550A69j90q5K47l76L69p8J51j80rk24K34j11J42j23mM0k30M86k14J73j64k34
$$ 169 -21 -106 141 -235 134 56 207 27 18 -206 28 -83 59 -64 -68 -28 -258 228 14 187 23 -211
4572b11L33j26O1q1j74N0J75k80M49j97J8K7n8J68o9j41j3p0P2k7J1J5Q1o0k52
$$ -211 122 -4 57 -24 -198 -148 27 -253 196 -1 17 44 -14 154 85 -56 -69 -139 -67 -94 -83 -68 13 -47 -299
4597b99J88J22j30J11m1K9n0M6J08R9j86J86j40q0j92K59j56JJ71p1k1J34N3k46
$$ -299 -111 11 -119 -8 -49 -20 -70 -24 84 183 -3 183 43 -37 -229 30 -126 -125 46 -25 -46 88 141 -105
4621a05L39m32J60R3N9k00O7K07k83J73o6k85O30m09N0j04J9j9P9j00m4K30k81
$$ -105 234 -198 -38 55 114 -86 -19 188 -95 78 12 -273 357 -52 -2 -106 -87 -106 -27 -127 -171 59 -222
4644b22K03r9O2k2K57m03J80K19j90J3KrP7j4J17k84m1J40o1l0P5O3j22QQ9L8
$$ -222 -19 -118 -56 -78 179 -224 -44 175 -15 -2 0 -9 68 54 171 -113 -154 -14 -75 -105 -30 33 -89 -81 8 46
4670D6J49m52K24J38J18J9k70R3J5j15j6K1J11k14J18R8j3J38l10K6J80j8o6J73
$$ 46 195 -257 -33 105 223 242 -28 65 80 -35 -51 -30 81 -133 -15 83 70 208 -102 -76 104 86 20 193
4694A93k20K1J01L2k30J28Q9o6k30O0K25j90k3J78r2Q2pk15q5J46K40j61J07m3
$$ 193 -27 -6 95 127 -103 25 114 48 -182 -122 103 -87 -110 68 -24 58 51 -164 -249 -103 137 -24 83 40
4718D0J04j4J6j25L7N7k96J29OO8%J24j43J16j56o9R9K91j54n1l06J96o2N0j71
$$ 40 144 130 146 21 58 115 -181 -52 -46 22 22 146 3 119 -37 -106 -7 284 130 79 -227 -31 -93 -43 -214
4743b14K65l9k54K68j06k00L58j16J13lk09K01k13J3K30j18K0Qj0J15j92j43J47
$$ -214 51 12 -242 26 -80 -280 78 -38 75 72 -137 64 -149 -136 94 -24 -4 4 -6 109 -83 -226 -79
4766g9j7K7Rk30O6J02J47j28k4j02K0J57j83K93j91J38m2J57P7r0m9J18J23k61
$$ -79 -96 -69 -60 -290 -224 -122 25 -103 -127 -229 -209 -52 -235 58 -133 5 -37 120 197 107 58 176 299 38
4790C8r2J3r9R8J87k51m3K09l5K8N4k83L84k19K05j37R9j44Pr6P2k2j01N9R8k68
$$ 38 -54 -41 -140 -42 145 -106 -149 60 25 53 107 -176 208 -11 194 57 156 12 19 -77 -5 -27 -128 -69 29 -239
4816b39P4J76o4J00q8%j39K17j6oo2J13k41J13P8j19J10n4Q2J71j94j03J37M7
$$ -239 -165 11 -53 47 -41 -41 -180 37 21 15 -47 66 -175 -62 16 -103 7 -47 35 206 12 -91 46 93
4840I3j42k1J78o4j13J12p4n0L16k27j60K40q2Q4j44k33M57j12j01K1k48K69k2
$$ 93 -49 -70 108 44 -69 43 -31 -81 235 8 -152 88 6 90 -54 -287 170 58 -43 -22 -270 -1 -23
4863b3n4J13P1r0j05j99L48l1J8p0RJ1K2RM7KJ00k56J05j01kn4J82m1J78q2j23
$$ -23 -77 36 107 17 -88 -287 61 30 48 -22 -13 -2 20 29 76 78 178 -78 27 -74 -76 -130 52 11 189 107 -16
4890a6R5o1P2m9p9J55j33RJ5RJ51m5j65Q8K7p8q2J29l4p7l2L7J19pJ3qJ15q9q2
$$ -16 79 18 90 41 -38 117 -16 -7 8 17 168 123 -42 46 73 -5 -87 42 8 -69 -101 -64 55 48 61 53 168 79 -3
4919cJ21n1j84K61j43J25n6j55j9O6QN3k4J34Q8j12ln1l90M95j32j63L46j98n7
$$ -3 118 67 -117 144 1 126 70 -85 -104 -38 -30 23 -1 133 221 109 106 55 -335 160 28 -135 211 13 -44
4944d4r3L5L2J07m2j32J66J07o8l01J67j70J48J9R4M4p1n9J51L3k66L08q9J9j54
$$ -44 -137 -102 -70 37 -5 -137 29 136 68 -233 -66 -236 -88 -69 25 69 -2 -61 90 123 -143 165 76 95 -59
4969e9J22m1O3l6p2n2J28Q5j42K32n7j19NJ24Lj11j01rj39j23K94nJ29K3j42K7
$$ -59 63 22 85 49 -23 -75 53 138 -4 228 171 52 57 181 184 73 -28 -37 -176 -299 -5 -10 119 142 0 27
4995B7K8j60L5J47j54k5R3r5Q5LJ5J14P3M3j92J12j9m3j71J18j34J92k25J67L5
$$ 27 55 -105 -70 77 -77 -102 -9 -104 -19 -16 -1 113 186 229 37 149 130 87 -84 34 -100 92 -133 34 69
5020F9r6J06j98K14l0J25j24p6K7K26k39O4j02l0J12P2K3j94k8J28o6M8K0j65
$$ 69 -27 79 -119 95 65 190 66 -10 17 243 4 68 -34 -64 48 120 143 -51 -79 49 -17 31 51 -114
5044a14n6K67k8j87MJ55k82L47k5L3q3P5o9K7k42J62K35j60l95M10q4j34J38J2
$$ -114 -170 97 69 -118 -114 41 -241 106 81 114 31 106 37 64 -178 -16 219 59 -336 74 -10 -144 -6 6
5068FL1J11k08J32mj19Q6K38m00J91j87j5J17J53k68j19L47p6J14k51K07k5l24
$$ 6 37 148 -60 72 68 -51 35 273 -127 64 -123 -138 -21 132 -136 -255 92 16 130 -121 86 61 -263
5091b63K22O4K0O3P3q5K8k41J65m5j38J10J26k16N9J78j00K02l53J61O7r5j73
$$ -263 -41 23 43 106 179 94 122 -119 46 1 -137 -27 99 -117 -58 120 20 222 -131 30 97 2 -171
5114a71J95o1r3K54k77J33Q0l42M02r0N9k84K78j40m5O3K04M3j01k10M3L06k87
$$ -171 24 -37 -130 124 -153 -20 60 -282 120 30 89 -195 83 -57 -102 -39 165 208 107 -103 -60 246 -41
5137d1j03j2l4J91m6q7J86J66j91K28j40l4J7R3j24j4l7J0j78K33k40K31q1m7
$$ -41 -144 -156 -190 1 -45 -132 54 220 29 257 117 83 100 193 69 55 18 28 -150 83 -157 74 -7 -54
5161e4P0K53l12K9J38k71J69r6J1J36J06k23j14K57j54j3o4m5P5k5J09n1P0Q6
$$ -54 16 269 -43 -14 124 -147 22 -74 -63 73 179 -44 -158 99 -55 -68 -132 -177 -102 -127 -18 -69 1 87
5185H7j0m6j94L02K5k67J39k4mP3J10J4k41L2j7q3J5j00K47j37j14J95Q2k24J24
$$ 87 77 31 -163 139 164 -103 36 12 8 81 191 205 -36 -4 -21 -104 -89 -189 58 -79 -193 2 84 -140 -16
5210a6O2k8P7Qp2n2M8L1q5j09j34K05K06k9k55R4qJ91j12l2L5k1j41J45N2j65
$$ -16 46 18 95 103 31 -21 27 58 -27 -136 -270 -65 141 112 -143 -49 -57 134 22 -10 25 4 -137 8 60 -105
5236a05K09l03L5K97m6o9J13l30Q2j17J77N2j89K07NJ73j78n1J32k14K01l24K46
$$ -105 104 -199 -164 133 87 18 131 -199 -117 -234 -57 -5 -194 13 18 191 13 -38 94 -120 81 -243 3
5259Cj34K02M4P9j12k9J01p6j42RJ04j93J75m2K2p9J5J72N6k62o4J04J49J0k75
$$ 3 -131 71 115 194 82 53 154 78 -64 -55 49 -144 31 -11 11 -68 -53 119 175 -87 -151 -47 102 112 -163
5284a63K15n0J69l53K19L1M3j44j9l6n5K43k87M4N5J0P0J71n4K24o9k49n3L3J19
$$ -163 52 2 171 -182 37 68 111 -33 -52 -88 -143 100 -187 -143 -88 -78 -8 163 109 333 264 15 -38 -5 114
5309A14j29K37k01m9R8k06L5R2O4j20K05j65PJ52o2k5J55k87p4j09M30j48J06
$$ 114 -15 222 21 -28 70 -136 -101 -9 55 -65 140 -25 -18 134 72 47 202 -85 -159 -268 162 14 120
5332A20Q5j47M9k03L3J74k14k9Q6j3l0J54n8M8J5n6N1o4J67l28J63j73J24K41
$$ 120 205 58 107 -96 -63 111 -103 -132 -46 -59 -89 65 7 55 70 14 65 1 168 -160 3 -170 -46 195
5356A95j57Ol22K36J32j69j52O5K19r9j57J60O2k5J09j44L23m67J84M2K16j85
$$ 195 38 44 -278 -42 90 -79 -231 -166 53 -46 -203 -43 19 -6 103 -41 282 -185 -1 41 257 72
5378G2o1n7J00j10j22O6J4k7J27K52k12M7J89j21k06K54k44j31J98oqm2j3j57
$$ 72 11 -46 54 -56 -178 -112 -98 -125 2 254 42 89 278 157 -49 205 -39 -170 28 22 14 -28 -41 -198
5402a98J43l2n8K08K3j39N0k9p2K34j73m9J10p2J06MO1j86NJ83j35j66N4J56N3
$$ -198 -55 -87 -145 63 86 -53 -3 -32 -104 130 -43 -92 18 -54 52 56 117 -69 -64 119 -16 -182 -128 28 81
5427H1J9K2Kk16J09j07K28p3j3J24j88j19R0R3l4n9K0q4J31k39L05l03J06Q6Q9
$$ 81 100 122 124 -92 17 -90 138 65 52 176 -12 -131 -41 52 18 -41 -21 -105 26 -213 92 -211 -105 -19 70
5452G0j04K76q6j76J55L5j59J79o5k03P4k0J48m56K15Q4P8j29O9MJ11j7j5R8J2
$$ 70 -34 242 156 -20 135 170 11 190 125 -78 -4 -24 124 -332 -117 -33 45 -84 -15 -11 100 83 68 166 178
5477A78l95K04N0O6j09NJ7N7lj09P1j12l0OJ38P5k81R3j9n3J53j1k8J17l06J73
$$ 178 -217 -13 37 103 -6 -1 16 73 70 -39 32 -80 -110 -104 34 109 -172 -79 -98 -151 2 -9 -37 80 -226 -53
5503e3R9j67L6K53j52j5L2j3j3Q3l3n4k06m2J90J8Q4Qk7N5k32P1J42k35K04K07
$$ -53 46 -121 -85 168 16 1 33 20 7 90 57 3 -203 -245 -55 -37 47 55 28 83 -149 -78 64 -171 33 240
5529B40j34n8J8m8M5lL4j13pJ35k44K26k5%J34p4j56p5J80k8k3N9p5l9o1J66J35
$$ 240 106 48 66 18 63 60 94 -19 -26 109 -135 91 66 66 200 126 -30 -105 75 47 24 83 8 -31 -92 74 209
5556B09l08J94%k05p7J48J58j96K8jM2qP9Q1r1M5k4j19J44j91k28K54R9Rj39Q7
$$ 209 -99 95 95 -110 -187 -39 119 -77 -49 -50 -8 -16 63 144 53 98 74 -45 99 -92 -320 -66 33 42 -97 -10
5582a0Q7n5p3P5K25k66J34m7q7K47m50O0P6Q5Q8J2k11j52K95l83M60j12J82j01
$$ -10 77 22 -51 24 249 -17 117 70 -17 230 -220 -160 -84 1 89 101 -110 -262 33 -350 110 -2 180 79
5606G9j64M0K46k53R7q3j69K67%j07J41r5P2r2n4J73j08Q6j13J32l3l7N4m10M75
$$ 79 -85 -45 201 -52 45 -38 -207 60 60 -47 94 -1 71 -21 -75 98 -10 76 -37 95 62 25 79 -331 144
5631A44Kj05p4j56K59L7O1p2j55K2J93k54R9Q8j61p5K94q3pj27j11J24M7j06J67
$$ 144 146 41 -33 -189 70 107 168 96 -59 -37 156 -98 1 89 -72 -147 147 64 57 -70 -181 -57 -10 -116 51
5656E1k35K51M2r5j2l4k8j00mL3P2L5o5J42k4J59q6j96l8K48q3N8k17O1Q0J02
$$ 51 -184 67 109 14 2 -32 -60 -160 -164 -131 -59 -24 -89 53 29 188 102 -94 -132 116 33 91 -126 -65 15 117
5682A17m2j16J07j73K16rJ05k23MO7k7k2p4J30j82J29l7mK13o9j69J36Q1L4j27
$$ 117 75 -41 66 -107 109 100 205 -18 -14 53 26 4 -70 60 -122 7 -30 -34 179 110 -59 77 158 192 65
5707F5J73j11P8j61j15J78q3M6jk09J22k8L8j10k9K34j05L1o9J65M8q2j5j76J41
$$ 65 238 127 205 44 -71 107 24 70 69 -140 -18 -46 -8 -118 -147 87 -18 13 -56 109 157 75 60 -116 25
5732B5Q6j14nJ3J10k39J14O9p8lM6k18K94j35J90n3Mr1N4j14J81p1j07r9J54j42
$$ 25 111 -3 -8 5 115 -124 -10 59 -19 -22 24 -194 100 -35 155 102 106 15 69 -45 136 65 -42 -141 13 -129
5758a29J10m9j7P8j36K00j75k02K85o3j1P7Jr0L17p6k12J05q1P3MJ99k03J7j94
$$ -129 -19 -68 -85 -7 -143 57 -118 -320 -35 -98 -109 -32 -31 -121 196 120 -92 13 -68 5 9 208 5 22 -172
5783a72L26k71j08L51k18J43K4Q5k05P6o1N6K6j68K96j14M7r3K4J4j95J29j36
$$ -172 154 -117 -225 126 -92 51 75 160 -45 31 -30 26 52 -116 180 66 113 20 44 58 -137 -8 -144
5806a44q5L46m5j00m7J84k20P9N1J68k85O1N1R8j83j5J46j6J00j20J24k57R8j46
$$ -144 -229 117 72 -28 -75 109 -111 -32 19 187 -98 -37 14 112 -71 -86 60 44 144 24 148 -109 -11 -157
5830a57N0J95q0j39J43j7N3k61K19J2n5j3J77j79R6J77j49Jk22K74k12r1j7J72
$$ -157 -107 88 8 -131 12 -5 48 -213 6 18 -37 -50 127 -52 44 221 72 73 -149 125 -87 -178 -195 -23
5854b3l3J38k39O2J86j91M11l07p3K00j70Pj85J52J30j65K33k05J39l49J71J98
$$ -23 -56 82 -157 -95 91 -100 311 4 -69 131 -39 -32 -217 -65 65 -100 133 -72 67 -282 -111 87
5876H7L1j29N5m0M4j45k1K93j27j79J08J98j70r1Q0J2k88L82j04pj32Q6j6k1J93
$$ 87 118 -11 44 4 48 -97 -118 175 48 -131 -23 175 5 -86 -6 6 -282 100 -4 -11 -143 -57 -73 -94 99
5901I9j42J7j8PK8N4K9p8J85M4l03J89j73j11NR8k4l4J8O0j02l4M3P8Q2N3O5n8
$$ 99 -43 -26 -44 -37 -9 45 74 -4 181 225 -78 111 -62 -173 -168 -70 -94 -128 -110 -50 -152 -186 -143 -65 17 70 135 77
5929G7J4l3k5j15R3L3N9k16J15J02J18j26r7J8j46oJ02J09j48K8K7J78j95qjJ2
$$ 77 91 58 33 -82 11 44 103 -113 2 104 222 96 -1 17 -129 -135 -33 76 -72 -44 -17 161 -34 -42 -43 -31
5955c1Q1N8j30Qj1J57o9p4q9J96n5J60k35j45J47J21KM2N0j18J63L4k92J32Kl75
$$ -31 50 108 -22 -14 -25 132 63 -11 -100 96 41 201 -34 -179 -32 89 91 133 183 65 228 262 -30 102 104 -271
5981b71L02Ml40K69K5j11Kj0J08K12l6m4o8k19K25k1j52K86J59k23l29K40K41
$$ -271 31 35 -305 -36 -11 -122 -120 -130 -22 190 154 110 42 -177 48 27 -125 161 320 97 -232 8 249
6004B49j48q0mj0K11j20k15J84Q9j15lL3j19J66J7p3R5L1J3m20P3L04j06j75k5
$$ 249 101 21 17 7 218 98 -117 67 156 41 38 71 -48 118 135 62 157 188 201 -219 -146 158 52 -123 -148
6029a48J54Q5j43J51k8O5l04M9n4J98k4o1jJ08r2N6n6n9R7j23K78r9Oj92J06M1
$$ -148 6 91 -52 99 71 136 -168 -119 -173 25 1 -60 -61 47 -45 11 -45 -104 -7 -130 148 49 55 -137 -31 10
6055A0L9o2P2lj73M1kn8J86j62J69n6q5J88n8Lj17N3o2l9m5K50K2k30J39j02J53
$$ 10 49 -13 59 56 -117 -76 -78 -136 50 -112 57 1 -84 104 46 49 -68 -15 -77 -116 -161 89 111 -119 20 -82 71
6082G1n5J0j26J74N9m9m3j9m6J58j19m2q8R1O0p2J6k33L15L4rr4RP8k90L30k11
$$ 71 16 26 -100 74 133 84 41 22 -24 134 15 -27 -115 -24 36 -36 -20 -253 62 96 87 -7 2 80 -210 120 -91
6109i1O8J12j30Q4l25L46P5o0j60L9o3J46m0N1l18K61j13L67k10j13J51m7K11
$$ -91 -23 89 -41 43 -282 64 139 79 -81 -42 -105 41 1 52 -266 -5 -118 249 39 -74 77 30 241
6132B41l42K79k83K21N3l64K75J29k95Q1n1o9L69q6m50K46K4O5j00q5Q6K41j03
$$ 241 -101 178 -105 116 169 -195 80 209 -86 -5 -56 -125 244 158 -292 -46 -22 43 -57 -142 -56 185 82
6155H2j62o5K00j2l1J2n6j26K0J46j08J47Oj4j74K52k66J25p1%L56k32r2Q6J90
$$ 82 -80 -145 55 43 12 24 -32 -158 -138 8 -100 47 53 39 -135 117 -149 -24 -95 -95 261 29 -63 23 213
6180B13j88j8q9J75o8j83K88j21l6j01J19J04l07K16p9J64j00p9K04Lj59j06J93
$$ 213 25 7 -82 93 25 -158 130 9 -27 -128 -9 95 -212 4 -75 89 -11 -90 114 117 -42 -148 45
6203D5kj44K84m85M71k19M6J6N2L0k21J43j7Q2J6k11J01O6j64K32j15j00J02p7
$$ 45 43 -101 183 -302 169 -50 -4 12 64 94 -127 16 -1 81 97 -114 -13 53 -111 121 6 -94 8 -69
6227f9j60K45J42j70j19k8Q9J47l3Pj01n3J24n0l9P8k30L28o4l1J2m8q4PK6J47
$$ -69 -229 16 158 -12 -131 -159 -70 77 44 51 -50 -103 21 -29 -68 10 -220 108 44 13 25 -23 -107 -100 -74 73
6253G3j01k01K98n5j04K56n15L74L36k80J30k54k12K49J51J31k06J24l76L70j92
$$ 73 -28 -229 69 14 -90 166 -349 25 361 81 211 -43 -255 -6 145 276 70 194 -182 188 -4
6274dj32J36k5j07M7J98j87J20O6j88J18Rr9K9j6m3P9R9n4j30P9R0p8K8k19J58
$$ -4 -136 0 -25 -132 -85 113 -74 46 112 -76 42 51 -48 -19 -35 -78 1 100 46 -84 -5 85 7 35 -184 -26
6300b6OJ31J32l58L7R0m5k4M4o2J01K9j52J69n2P1j76P3O8q4J11J8k52J74o1J1
$$ -26 -20 111 243 -115 -78 12 -33 -57 -13 -75 26 55 -97 72 20 91 -85 -12 56 -28 83 101 -151 23 -38 -27
6326b7J53k09L8Q2j66J16J21j29K1J61p0q9J61r0j51O4m8K33q2j38K27k21P1j54
$$ -27 126 -83 -45 37 -129 -13 108 -21 0 161 91 2 163 73 -78 -14 -62 171 89 -49 178 -43 28 -126
6350a26K35n3J54k28l6J02L1q6j32M8J17MJ85k75J39Mk29K45l23L2LJ99J06j89
$$ -126 109 56 210 -18 -54 48 79 -7 -139 -91 26 30 215 -60 79 83 -146 99 -224 -192 -189 10 116 -73
$$ [...]
8191G2
##END NTUPLES=NMR FID
##END=
