##TITLE=1H_Pr 1976
 CDCl3
 8 sc, 
 14.04.2022
##JCAMPDX= 6.0         $$ Bruker NMR JCAMP-DX V2.0
##DATA TYPE= NMR FID
##DATA CLASS= NTUPLES
##ORIGIN= UXNMR, Bruker Analytische Messtechnik GmbH
##OWNER= root
$$ XWIN-NMR		Version 3.5
$$ Thu Apr 14 15:45:43 2022 Russian Standard Time (UT+4h)  she@DPX200
##.OBSERVE FREQUENCY= 200.13135
##.OBSERVE NUCLEUS= ^1H
##.DELAY= (6, 6)
##.ACQUISITION MODE= SIMULTANEOUS
##.ACQUISITION SCHEME= undefined
##.AVERAGES= 8
##.DIGITISER RES= 18
##SPECTROMETER/DATA SYSTEM= spect
##.PULSE SEQUENCE= zg30
##.SOLVENT NAME= CDCl3
##.SHIFT REFERENCE= (INTERNAL, CDCl3, 0, 15.7039)
##AUDIT TRAIL= $$ (NUMBER, WHEN, WHO, WHERE, WHAT)
$$ ##TITLE= Audit trail, XWIN-NMR		Version 3.5
$$ ##JCAMPDX= 5.01
$$ ##ORIGIN= Bruker BioSpin GmbH
$$ ##OWNER= she
$$ F:/spectra/data/she/nmr/H-F/1/audita.txt
$$ ##AUDIT TRAIL=  $$ (NUMBER, WHEN, WHO, WHERE, WHAT)
(   1,<2022-04-14 15:42:55.14 +0400>,<she>,<DPX200>,
      <created by zg, POWCHK disabled, PULCHK disabled
       configuration hash MD5:
       00 E9 B6 7A A2 85 ED C7 34 08 36 98 17 FE 4E 26
       data hash MD5: 16K
       A6 52 86 B6 51 6B 85 53 B9 A1 3F 52 5A 9D FD 93>)
$$ ##END=
$$ 
$$ hash MD5
$$ 30 9B D5 9E 49 FD EF CF C4 C8 C7 D4 7F D1 F9 19
##$RELAX= 
##$RELAX= 
##$RELAX= 
##$RELAX= 
##$RELAX= 
##$RELAX= 
$$ Bruker specific parameters
$$ --------------------------
##$DU= <F:/spectra>
##$EXPNO= 1
##$NAME= <H-F>
##$PROCNO= 1
##$TYPE= <nmr>
##$USER= <she>
##$AMP= (0..31)
100 100 100 100 100 100 100 100 100 100 100 100 100 100 100 100 100 100 
100 100 100 100 100 100 100 100 100 100 100 100 100 100 
##$AQSEQ= 0
##$AQ_mod= 1
##$AUNM= <au_zg>
##$AUTOPOS= <>
##$BF1= 200.13
##$BF2= 200.13
##$BF3= 200.13
##$BF4= 200.13
##$BF5= 200.13
##$BF6= 200.13
##$BF7= 200.13
##$BF8= 200.13
##$BYTORDA= 1
##$CFDGTYP= 0
##$CFRGTYP= 5
##$CHEMSTR= <none>
##$CNST= (0..31)
1 1 145 1 1 1 1 1 1 1 1 1 1 1 1 1 1 1 1 1 1 1 1 1 1 1 1 1 1 1 1 1 
##$CPDPRG= <>
##$CPDPRG1= <>
##$CPDPRG2= <>
##$CPDPRG3= <>
##$CPDPRG4= <mlev>
##$CPDPRG5= <mlev>
##$CPDPRG6= <mlev>
##$CPDPRG7= <mlev>
##$CPDPRG8= <mlev>
##$CPDPRGB= <>
##$CPDPRGT= <>
##$D= (0..31)
0 1.2 0 0 0 0 0 0 0 0.06 0 0.03 0 0 0 0 0.0002 0 0 0 0 0 0 0 0 0 0 0 0 
0 0 0 
##$DATE= 1649936574
##$DBL= (0..7)
120 120 120 120 120 120 120 120 
##$DBP= (0..7)
150 150 150 150 150 150 150 150 
##$DBP07= 0
##$DBPNAM0= <>
##$DBPNAM1= <>
##$DBPNAM2= <>
##$DBPNAM3= <>
##$DBPNAM4= <>
##$DBPNAM5= <>
##$DBPNAM6= <>
##$DBPNAM7= <>
##$DBPOAL= (0..7)
0.5 0.5 0.5 0.5 0.5 0.5 0.5 0.5 
##$DBPOFFS= (0..7)
0 0 0 0 0 0 0 0 
##$DE= 6
##$DECBNUC= <off>
##$DECIM= 32
##$DECNUC= <off>
##$DECSTAT= 4
##$DIGMOD= 1
##$DIGTYP= 9
##$DL= (0..7)
0 120 120 120 120 120 120 120 
##$DP= (0..7)
150 150 150 150 150 150 150 150 
##$DP07= 0
##$DPNAME0= <>
##$DPNAME1= <>
##$DPNAME2= <>
##$DPNAME3= <>
##$DPNAME4= <>
##$DPNAME5= <>
##$DPNAME6= <>
##$DPNAME7= <>
##$DPOAL= (0..7)
0.5 0.5 0.5 0.5 0.5 0.5 0.5 0.5 
##$DPOFFS= (0..7)
0 0 0 0 0 0 0 0 
##$DQDMODE= 0
##$DR= 18
##$DS= 0
##$DSLIST= <SSSSSSSSSSSSSSS>
$$ [...]
##$SUBNAM2= <"">
##$SUBNAM3= <"">
##$SUBNAM4= <"">
##$SUBNAM5= <"">
##$SUBNAM6= <"">
##$SUBNAM7= <"">
##$SUBNAM8= <"">
##$SUBNAM9= <"">
##$SW= 18.05172834244
##$SWIBOX= (0..15)
0 0 2 0 0 0 0 0 0 0 0 0 0 0 0 0 
##$SW_h= 3612.71676300578
##$TD= 16384
##$TD0= 1
##$TE= 0
##$TE2= 300
##$TE3= 300
##$TEG= 300
##$TL= (0..7)
0 120 120 120 120 120 120 120 
##$TP= (0..7)
150 150 150 150 150 150 150 150 
##$TP07= 0
##$TPNAME0= <>
##$TPNAME1= <>
##$TPNAME2= <>
##$TPNAME3= <>
##$TPNAME4= <>
##$TPNAME5= <>
##$TPNAME6= <>
##$TPNAME7= <>
##$TPOAL= (0..7)
0.5 0.5 0.5 0.5 0.5 0.5 0.5 0.5 
##$TPOFFS= (0..7)
0 0 0 0 0 0 0 0 
##$TUNHIN= 0
##$TUNHOUT= 0
##$TUNXOUT= 0
##$USERA1= <user>
##$USERA2= <user>
##$USERA3= <user>
##$USERA4= <user>
##$USERA5= <user>
##$V9= 5
##$VALIST= <valist>
##$VCLIST= <CCCCCCCCCCCCCCC>
##$VD= 0
##$VDLIST= <DDDDDDDDDDDDDDD>
##$VPLIST= <PPPPPPPPPPPPPPP>
##$VTLIST= <TTTTTTTTTTTTTTT>
##$WBST= 1024
##$WBSW= 4
##$XGAIN= (0..3)
0 0 0 0 
##$XL= 0
##$YL= 0
##$YMAX_a= 283126
##$YMIN_a= -288218
##$ZGOPTNS= <>
##$ZL1= 120
##$ZL2= 120
##$ZL3= 120
##$ZL4= 120
##$ABSF1= 10
##$ABSF2= 0
##$ABSG= 5
##$ABSL= 3
##$ALPHA= 0
##$AQORDER= 0
##$ASSFAC= 0
##$ASSFACI= 0
##$ASSFACX= 0
##$ASSWID= 0
##$AUNMP= <proc_1d>
##$AZFE= 0.1
##$AZFW= 0.1
##$BCFW= 1
##$BC_mod= 2
##$BYTORDP= 1
##$COROFFS= 0
##$CY= 11.3945322036743
##$DATMOD= 1
##$DC= 2
##$DFILT= <>
##$DTYPP= 0
##$F1P= 2.36226072786647
##$F2P= -0.459571619588291
##$FCOR= 0.5
##$FTSIZE= 0
##$FT_mod= 4
##$GAMMA= 1
##$GB= 0.15
##$INTBC= 1
##$INTSCL= 1
##$ISEN= 128
##$LB= 0.24
##$LEV0= 0
##$LPBIN= 0
##$MAXI= 10000
##$MC2= 0
##$MEAN= 0
##$ME_mod= 0
##$MI= 1.114404
##$NCOEF= 0
##$NC_proc= 0
##$NLEV= 6
##$NOISF1= 3.799351
##$NOISF2= 2.8
##$NSP= 1
##$NTH_PI= 0
##$NZP= 0
##$OFFSET= 15.70392
##$PC= 1
##$PHC0= -18389.05
##$PHC1= 9.200737
##$PH_mod= 1
##$PKNL= yes
##$PPARMOD= 0
##$PSCAL= 0
##$PSIGN= 0
##$REVERSE= no
##$SF= 200.130013532006
##$SI= 16384
##$SIGF1= 3
##$SIGF2= 2
##$SINO= 400
##$SIOLD= 16384
##$SREGLST= <1H.CDCl3>
##$SSB= 0
##$STSI= 0
##$STSR= 0
##$SW_p= 3612.71676300578
##$SYMM= 0
##$S_DEV= 0
##$TDeff= 0
##$TDoff= 0
##$TI= <>
##$TILT= no
##$TM1= 0
##$TM2= 0
##$TOPLEV= 0
##$USERP1= <user>
##$USERP2= <user>
##$USERP3= <user>
##$USERP4= <user>
##$USERP5= <user>
##$WDW= 1
##$XDIM= 8192
##$YMAX_p= 0
##$YMIN_p= 0
$$ End of Bruker specific parameters
$$ ---------------------------------
##NTUPLES= NMR FID
##VAR_NAME=  TIME,          FID/REAL,        FID/IMAG
##SYMBOL=    X,             R,               I
##VAR_TYPE=  INDEPENDENT,   DEPENDENT,       DEPENDENT
##VAR_FORM=  AFFN,          ASDF,            ASDF
##VAR_DIM=   8192,          8192,            8192
##UNITS=     SECONDS,       ARBITRARY UNITS, ARBITRARY UNITS
##FACTOR=    0.0002768,     1,               1
##FIRST=     0,             0,               0
##LAST=      2.2672688,     0,               0
##MIN=       0,             -288218,         0
##MAX=       2.2672688,     283126,          0
$$ Real data points
##PAGE= N=1
##DATA TABLE= (X++(R..R)), XYDATA
0@%%%%%%%%%%qJ6j6J6j6K4l2M0m8N6p2Q8j04J20j36J60j89K20k55K89l30L78m30
33b29M89n54O22p01P88q80R82j094J218j351J499j660J835k026K234k464K714
50A422k988L294l631M002m419M889n421O028o730P551q528R717j1197J3096j5639
65h554J9248k4804L4577n6908K07079P1129j66351P7190q0406L9694J04054n0410
77A65538j07293N1924r9850j78071j9205J8716j9145J36122L9225j71804o4614
88b48457N5105m0233O2556J46426m651Q102J31086k9595j09184M7091N8948K6141
100A03335J39015M0776j39085m1541J9084q0180O66N6050o4943j3857O8424j00542
112a2798j45457O347j632r498J09165K6297j03786P763M4891n3225K2511P8590
$$ y = [0, 0, 0, 0, 0, 0, 0, 0, 0, 0, 0, -8, 8, -8, 8, -8, 16, -16, 24, -24, 32, -40, 48, -56, 64, -72, 88, -101, 119, -136, 153, -177, 201, -229, 260, -294, 328, -373, 415, -465, 517, -577, 641, -710, 789, -871, 964, -1062, 1172, -1292, 1422, -1566, 1728, -1903, 2099, -2320, 2569, -2852, 3176, -3554, 3997, -4531, 5186, -6011, 7085, -8554, 10694, -14110, 20467, -36441, 170638, 241767, 75416, 152606, 72200, 111894, 215948, 165538, 58245, 110169, 10319, -167752, -186957, -168241, -187386, -51264, -12039, -183843, -248457, -193352, -233585, -171029, -24603, -29254, -21152, 109934, 80339, -28845, 18246, 77194, 103335, 242350, 283126, 144041, 102500, 121584, 41404, 42070, 98120, 33177, 19320, 87744, -12798, -158255, -151908, -153540, -163038, -53873, -27576, -131362, -123599, -78708, -131933, -109422, -30832]
124c0832k692O3177J08618n2983p7793L5190j170L104J01594J0866q1574K1320
136I6825Q625j00224k5391K4775l5698L3901O7407p2979q4466M495k8651r051
148a20432P6973J2804k9608N5187J1760p7303j208L5440n219P1377Q6790m5313
160G1248m9906J4674l2286j6795N8870J4135j2039M3820j4925q9081k5697M80
172c7502j5490O0187N8886m8848l7828L361n0420k3099N4165K0396R760N3602
184D7170q359p1690j8947M606M24O0929N4261k3970j4930l857n2932j8567L9708
197f154J2932J9881M9249j8585o6218k0354o600p373M5816M4710j1809r598j0745
210A5152m8574k1222K2963J4323L0248M1934j8232m7344j6335j7127q487M1910
$$ y = [-30832, -33524, 29653, 138271, 85288, 7495, 42685, 41515, 44619, 146213, 157079, 75505, 96825, 105450, 5226, -20165, 4610, -31088, 2813, 70220, -2759, -87225, -82730, -111381, -120432, -43459, -30655, -60263, -5076, 6684, -70619, -71827, -36387, -41606, 29771, 116561, 71248, 21342, 36016, 3730, -13065, 45805, 59940, 47901, 91721, 76796, -12285, -37982, -37502, -52992, 7195, 66081, 17233, -20595, -17234, -67654, -90753, -36588, -16192, -6432, 47170, 38811, -32879, -51826, -47220, -46796, 14133, 68394, 44424, 29494, 25637, -27295, -45862, -6154, 6778, 26659, 75908, 57323, -8895, -29249, -35849, -43222, 2594, 47304, 35495, 25897, 15152, -33422, -54644, -31681, -17358, 12890, 54824, 36592, -10752, -27087, -44214, -52701, -10791]
222a0791L9371k475K121q052m5148k3497J5517J5344L0526L6724p499k9966j8400
235f225k3002p531L2231K8790Q487J1972r513m3005k2866M508N415K3759L3828
248C6848j093k3107k0166k5283j3544J6104K3924J8716J5740q335l1270k0228
260c1694n395K332K6968L5131P748q960j2772k5644j7867J0042K4041K2722J7140
273D3792k218k3668k7016j7121j540K0182K5856J1857j670j6519l1742k2401K535
286c9673J5519K2510K2013M865j8336k6076j6426k309J5339K8248K3818P072j1684
299B4880k4148j9223m422J1104K5248K4453N628j3491k3712k3340j2123P156K3246
312A256K0917N493r800k2851k5694j3112P293K3340K3075J1346l305j9007k3874
$$ y = [-10791, 28580, 26105, 28226, 20174, -24974, -48471, -32954, -17610, 12916, 49640, 42141, 12175, -6225, -29227, -36758, -4527, 24263, 32750, 44722, 35209, -7796, -30662, -26154, -20739, 3020, 36848, 35755, 12648, -7518, -32801, -46345, -30241, -6317, 12399, 28139, 19804, -11466, -31694, -37089, -34757, -7789, 27342, 35090, 26130, 13358, -12286, -30153, -20111, 3930, 26652, 43792, 41574, 17906, -9110, -26231, -27771, -7589, 18267, 30124, 28454, 11935, -19807, -42208, -39673, -24154, -1644, 20369, 25234, 6898, -19178, -35604, -37913, -22574, 5674, 29492, 36564, 24880, 732, -18491, -22913, -11809, 13439, 37892, 43520, 30029, 6317, -17023, -29146, -21990, 1256, 22173, 27666, 17866, -4985, -30679, -43791, -36498, -13158, 9917, 21263, 17958, -1049, -24923]
325b4923j0962Q551K2746K4810J6342j17j9009k4369j2442L372J6801K3138J5114
338C9052k474j9958k6500j7097k057J2297K0737J6614l59j8966k1965j5406n124
351d1206J3412K6687J8321L571p794j8936j7513j920J4255K2717K1332P666j0616
364B9976j8463j8310j1508R157K1798J3143N276n203k4970k6248p447M808J2007
377a5984K1245J1280j0186j6926j7088j4020O785K2717J8748J5144N619j8860
389H474j9549k496J156J2062K9380J5241q419r810j6524k4058r13J7738J0135
402A2417J0547N993k2141k5437r788j0299M475K7571J2804n852o25j4944k5923
415d1202L775K0453J0244K0864K1228j4427j8687j443j0263L027L1291J4464k359
$$ y = [-24923, -35885, -27334, -4588, 20222, 36564, 36447, 17438, -6931, -19373, -16001, 800, 23938, 39052, 36578, 16620, -9880, -26977, -29034, -16737, 4000, 20614, 20255, 1289, -20676, -36082, -41206, -27794, -1107, 17214, 20785, 12991, -5945, -23458, -25378, -11123, 11594, 32926, 40592, 29976, 11513, -6797, -18305, -9148, 12650, 25793, 31069, 25866, 896, -25352, -32799, -27991, -15984, 5261, 16541, 6355, -10571, -27659, -41679, -34894, -12177, 6571, 21715, 27334, 8474, -11075, -13571, -12415, -353, 29027, 44268, 35849, 26039, 9515, -14543, -15456, 2282, 12417, 22964, 28957, 6816, -18621, -28409, -38708, -34233, -6662, 6142, 290, -335, -15279, -41202, -37427, -16974, -6730, 14134, 35362, 20935, 2248, 805, -9458, -6431, 24860, 39324, 36965]
428C6965M000j8042l2463k270P911k737J9468J7548k3299k1147n969k3633n449
441d9117L0751J1599j498J3769j1022k9264K990R691J590L1194K8461j3718p301
454A8125J209k4597k488L2803N032l91K0925j5408l7596k805l983j3812K5366
467B380K1204k2169r977l784l3076n987K7184j065P052L1857j1123k8728P956
480a8276l103q402L9851K9801j5194L902N376l1859m488K3452p200P566L2124
493E3550j7322l3659o80j9287j8599L2669J5226k2576O886J668l8285m548J9076
506b5881j2249J5328M3505j0476k3341J0608j4526j0405M0972J6203j4912K1875
518C6701O532l6907k088J0086k2063J6657M0929k1474k7015N977k6337k0107L2195
$$ y = [36965, 40965, 22923, -9540, -11810, -3899, -6636, 12832, 30380, 7081, -14066, -20035, -43668, -49117, -18366, -6767, -8265, 5504, -5518, -34782, -31792, -22101, -20511, 10683, 39144, 25426, 18125, 19334, -5263, -7751, 25052, 30084, 29693, 50618, 35210, -2386, -5191, -9174, -22986, 2380, 23584, 1415, -8562, -12346, -45422, -51409, -24225, -25290, -18238, 13619, 2496, -26232, -18276, -21379, -29781, 10070, 39871, 24677, 28579, 33955, 2096, -2392, 21060, 13860, 21426, 53550, 36228, 2569, 1889, -17398, -35997, -3328, 11898, -10678, -3792, -2124, -40409, -44957, -25881, -38130, -22802, 20703, 10227, -13114, -2506, -17032, -27437, 13535, 29738, 14826, 36701, 43233, 6326, 4238, 14324, -7739, 8918, 49847, 28373, 1358, 7335, -19002, -39109, -6914]
531f914L335j9132K6121O153l6860j899M582k0765K8032M4704j6542j3088J5786
544A3513k2739j2209L4535l42j2167L6677Q270l7068l779l246k5709K5368L5222
557C6326k3163j1592J1721k8548j5577K3744j1811q584M2795O009l4652J086n484
570a7730k2970L1183L4433k0488K90J9074k4855j2257J8766j5528j178M6379J634
583C6753l2119J647j3237k4367K9646K2889k4310O971J9222k7989j3889J2010
595f773j9370M133M7102k59k7072M621j2786k0143K8372J4881k0378J7099J9319
608B8746k6849j1340O049k1955Q185M4687m119k3300P914j3802j9597K2955P036
621D610j6906K2882J9095k5295r535J382k2523J2484L9709q525j6425J2469j4753
$$ y = [-6914, -3579, -22711, 3410, 9563, -27297, -29196, -24614, -45379, -17347, 27357, 10815, -2273, 13513, -9226, -21435, 13100, 12758, 591, 37268, 45538, 8470, 4691, 1445, -24264, 1104, 36326, 13163, 1571, 13292, -15256, -30833, -7089, -18900, -27484, 15311, 21320, -13332, -12246, -17730, -40700, -9517, 24916, 4428, 4718, 23792, -1063, -13320, 5446, -10082, -11260, 35119, 36753, 4634, 6281, -6956, -31323, -1677, 21212, -3098, 3873, 23095, -4894, -18783, -6773, -26143, -22010, 25092, 24833, -2239, 2382, -10404, -30547, -2175, 12706, -7672, 9427, 28746, 1897, -9443, -3394, -25349, -17164, 27523, 23404, 104, 8018, -5784, -25381, -2426, 4610, -12296, 10586, 29681, 4386, -5149, -3767, -26290, -13806, 25903, 17378, 953, 13422, -1331]
634a331j9551J8118q30j4314K7411J7264k4667q075k692k1159J3457L2554q866
647G319p514J4859j3494j6699J3541n248q546L1393J5117k1257n316m455j9699
660a9999J0967K3600q444k570J4481j3329j6768N090r492m824K8777J1351j7010
673A830j476n851j8759J0125J7910o514N549J7392j0924j3721K475j0305j073
686a3342K6962R078j1810P10p795j8111N975R313o470R730J4840j2420j3045j709
700h094j2335m90K3512P289o574M185p121j4908L792N381j587J3696J4788q955
714A2579q955l337j2591Q43J8234N412k829N099p646j5538j213O12j399J2733
728B004J1815o935p403n393j1420J92J3653O036K755P405o130j2377j638q14O20
$$ y = [-1331, -20882, -2764, -3594, -17908, 9503, 26767, 2100, -5975, -8667, -29826, -16369, 16185, 7319, -195, 14664, 1170, -15529, -1988, -7236, -15782, 15611, 30728, 9471, 4155, -300, -19999, -9032, 14568, 6124, 3554, 18035, 4706, -12062, -6972, -16464, -21288, 7489, 18840, 1830, 354, -5497, -24256, -14131, 3779, -2735, 2814, 20206, 9282, -4439, -1964, -12269, -13342, 13620, 22698, 10888, 11598, 3803, -14308, -8333, 980, -5490, 4240, 19080, 6660, -6385, -8094, -20429, -20919, 2593, 9882, 3308, 7493, 372, -14536, -10744, -5363, -6950, 6746, 21534, 12579, 3624, 287, -12304, -11461, 6773, 12185, 9356, 14455, 6809, -8729, -9942, -9330, -10729, 2004, 13819, 6884, -519, -5912, -17332, -17140, -3487, 2549, 5304, 12709, 6579, -5798, -7436, -8250, -7630]
743g630J3333J1158k939n059o036j0988k079Q165N400M341N745n840j1411n183
757i023m461K29J1201Q905m55j815n663j0111k999O040O038P249O998j638q204
772B291o061m202Q61Q677Q236K584j03n882r907m948J025M071O719O260j331p062
788A228p108o069j447N950Q119N177J319m365p931n070o25M696Q736P212J751
803A1573l860o436o481k548M596P374O125K642l639p866p573l221K327O550O230
818E793K471k762p107p485l898K150O600O734M635j280o285o217l274J346O540
833b039P926M966l22m974o864m715Q96M775O998N302o89o196o842o081j528M800
849d587P004L673J16l637p792o749J31L835O527O859J571m115m821n452k427N502
$$ y = [-7630, 5703, 16861, 13922, 8863, 2827, -8161, -10240, -2075, 3325, 7666, 13411, 7571, -3840, -9023, -13484, -13255, -2054, 6851, 6396, 4581, -1082, -11193, -14192, -8152, -2114, 5135, 12133, 10495, 2291, -3770, -7972, -7111, 1566, 9802, 12386, 12283, 6401, -3506, -8454, -7429, -3358, 3361, 9621, 8290, 1228, -5880, -11949, -13396, -7446, 673, 5850, 7169, 2804, -5127, -10197, -10822, -6126, 2610, 9822, 11573, 7713, 1277, -5204, -7752, -3156, 4218, 10343, 12985, 9346, 1480, -6093, -9314, -6987, -437, 5793, 8264, 5502, -1605, -9090, -12988, -10838, -4238, 2496, 7131, 5851, -434, -6651, -9925, -8579, -2039, 5887, 10853, 10531, 5557, -1307, -6022, -5126, -351, 6647, 11949, 11260, 5064, -1778, -7859, -9387, -4587, 2417, 6090, 6206, 2569, -5223, -11972, -11841, -8006, -1479, 5380, 6951, 2836, -1985, -7437, -9864, -4362]
865d362P210N086L607j251q069n908r75J457N338P719J149m280m175p142n544
880a0140L130M755L484N312j319q454n466j324q02N311R250J663j363j13o578
895b654o373M076N010M026P682J222q887m337k253l698M270Q395M81q19O52q824
911b031r502L155K572J548R886J609r444k567q01n880M198R580O76K731M663q993
927A400q656M272R45J530J1338J758r250k1k081j0014L120Q015j868L534N830
942I852j0955r437L508j329q7J2939J689p964M149j961j1600M516Q124j656P573
957G361P833j1617q145N122m203q29J3366M1p618N972m119j4246L601N684m356
972f153R371Q145j3740n856N335o762q12J4619l63m860J0420l929j4891N427N259
$$ y = [-4362, 2848, 7934, 11541, 10290, 2221, -3687, -4662, -3205, 2133, 9852, 11001, 6721, 2546, -4596, -10140, -7010, -2255, 1229, 6541, 5222, -3232, -8698, -10022, -10824, -5513, 3737, 5400, 4037, 3924, -2654, -9027, -4951, 59, 4085, 11767, 12989, 4102, -235, -2488, -6186, -1916, 6479, 6960, 6141, 6793, -2031, -11533, -8378, -5806, -4258, 5628, 7237, -2207, -4774, -5575, -11455, -7257, 2323, 2999, 5730, 10393, 1400, -7256, -2984, -2039, -509, 10829, 12587, 3337, 3316, 1235, -8779, -5659, 2356, 488, 4022, 9852, -1103, -10540, -7032, -8361, -8448, 4491, 6180, -1784, 2365, 404, -11196, -6680, 1444, -212, 7361, 15194, 3577, -4568, 554, -3649, -4478, 8888, 8929, 1311, 7283, 3164, -11082, -7481, -1797, -6153, 3218, 11363, -2377, -8233, -2898, -9660, -10472, 4147, 3784, -1076, 9344, 5415, -9476, -4049, 1210]
987A210n180J1992Q385j3846l164N587j1051j792J3788l588l263J1688p032j6016
1001a2282N924J899o623J3527P583j3706O45N786j2814l09J4231l627K15J3916
1015A4365p544j4550Q043j93p192J4268O879j3397L023M224j6380j89J1951o703
1029c395J444J4228j0366j2853Q830l500q240J5468N459j1193P474L224j6868
1042a0288K455J1586p292M800J4740j0396r567R235o902q341J5909L018j0360
1055a403Q854J177j8683L272Q080r684N674J4035j1000o974Q838r395p256J6048
1069A583K440p612J1574O3j6754N324O791j0524Q058J3647j0832l302P915j2446
1083d075o646J5089p03o837J2077k169j5767N939K647j1838Q877J2595r956m61
$$ y = [1210, -3970, 8022, 16407, 2561, -603, 4984, -6067, -7859, 5929, 2341, -922, 10766, 3734, -12282, -6358, -4459, -11082, 2445, 10028, -3678, -3033, 2753, -10061, -10370, 3861, 234, 449, 14365, 6821, -7729, 314, 121, -7071, 7197, 14076, 679, 3702, 7926, -8454, -8643, 3308, -3395, -1951, 12277, 1911, -10942, -2112, -5612, -13852, 1616, 7075, -4118, 3356, 6580, -10288, -7833, 3753, -3539, 1261, 16001, 5605, -3962, 5273, -1629, -9970, 5939, 8957, -1403, 7451, 8628, -10055, -6783, 1297, -8387, -2713, 11322, 322, -6652, 2186, -7209, -14465, 1583, 4023, -3589, 7985, 8048, -8706, -3382, 3409, -7115, 943, 14590, 3758, 456, 8371, -4075, -10721, 4368, 3665, -3172, 8905, 6736, -9031, -3092, -445, -12283, -3406, 9189, -767, -1228]
1097a228P210j3419m447J4728k088m246J3737k217j2687O693M06j1900R477J1357
1111A1376r307J327N131j4593l375J1733m488l227J2977k969j0637O246k333j1338
1125a3477J0295R921p481L468M625j2697j248J0313n812p93J3072k915p749O061
1139E583n368j0486J0127O843p480M454L070j2745o04O839p507N94J1915k852
1153B383m695N379o332q477J0557N168m996O608K951j0574J282M512p838J854
1167b218J0821k788l104L500p921p420Q158J983m270O325J420r099J062J622p855
1182i784L069J0215j904p48M202o973n256P310J635k613P022K019o428J376m72
1197B670p964K895P718k225j50K337p410m425M068p25j912O474J876n025J251
$$ y = [-1228, 5982, -7437, -11884, 2844, 756, -3490, 10247, 8030, -4657, 2036, 2442, -9458, 19, 11376, 2069, 3396, 8527, -6066, -9441, 2292, -2196, -5423, 7554, 4585, -6052, 194, -2139, -13477, -3182, 6739, -742, 2726, 7351, -5346, -6594, 3719, -2093, -2886, 10186, 7271, -478, 5583, 215, -10271, -144, 6699, -781, 3673, 6743, -6002, -6606, 233, -7274, -6680, 5235, 2383, -2312, 3067, -3265, -11742, -1185, 3983, -1013, 5595, 8546, -2028, -746, 3766, -4072, -2218, 8603, 5815, 2711, 6211, -1710, -9130, -972, 1011, -3259, 3066, 4486, -4613, -3551, -1929, -9784, -6715, 3500, 1596, 848, 5050, -1923, -7179, 131, 1766, -847, 6175, 8194, 1766, 3142, 2670, -5294, -2399, 5319, 3094, 2944, 5281, -2129, -6554, -2486, -3211, -5123, 1351, 3227, -1798, -547]
1212e47j557o641L312O911l86J666K831n174k923L118j679p5O441J692l227K06
1228C968k777o103K206M354r51J663J912n020k827P12k259M8N225K113j249K96
1244A311k556m229J698L110M25L382K183l255j963l19k531P01M481J661j24p0
1260C905l307l670L27J108P84K743J892k599j967j421k300L78L533K066Q07L47
1276B626k440l264k43R86J214K863K125j626q64k010k474O67K239K057J586P30
1292D172k256k919j197k39Q91L022K054j016j195j956k869k8J596J715J804P13
1308B292j137k556j558n51Q78K468K625M26r38j239k503r72J428K081J983J293
1324D020p89k082k462p80K74K001K020K60l20j805k707j270N86J104K160J844
$$ y = [-547, -2104, -8745, -5433, 1478, 1092, 2758, 5589, 415, -2508, 610, -1069, -1144, 5297, 6989, 3762, 3968, 1191, -4912, -2706, 1648, 697, 2360, 4272, -748, -3575, -2863, -5122, -5074, 151, 2264, 1015, 1311, -1245, -5474, -3776, -666, -241, 3141, 5324, 2069, 106, -213, -2744, -2043, 2438, 4099, 3975, 3905, 598, -3072, -2745, -1637, -853, 1890, 3782, 1183, -784, -2205, -4505, -4127, -594, 1472, 2279, 2626, 186, -3078, -3321, -2335, -1121, 1742, 3867, 2241, 1377, -633, -3107, -2440, -201, 1856, 3442, 4172, 1916, -1003, -2200, -2439, -1548, 1474, 3528, 2512, 1317, -639, -3508, -3536, -1940, -225, 1579, 2292, 1155, -1401, -2959, -3510, -2632, -164, 2461, 2887, 1949, 710, -1793, -2765, -1337, 744, 2727, 4020, 3231, 1149, -1313, -2093, -1819, 182, 2202, 2462, 2142, 337, -2370, -3640, -3054, -1950, 210, 2054]
1340B054n81j567k040r61K76J671K478J297L78r10k812j121M79P24K300K238o40
1357C263j497j465k367p99J548J520J223Q69j059k992j155m52j5K812K485n09
1373A410j15r18k626m68K131R92J199K626j225k665p78j215m86K641K125j095
1389A533J03j28l710r17J589l63J874L201j255k791j51j292j285L136K563j259
1405H48J011R03l941q82J160j071J903M065j368k634Q1k186j629L640J454k114
1421g60K618J335m583q16J179j913K072N519j976k857J618k370j992L549L05j929
1437a001M013J034n555n6O60l689L122N551l302k298K816l168k116L988n93j946
1453b540O040J544n503M48K62m017M375N218m696p13L435m039k381L466k643k008
$$ y = [2054, 1473, -94, -2134, -3095, -2819, -1148, 1330, 2627, 3005, 2095, -717, -1838, -1359, -635, 1665, 3903, 3263, 1766, 301, -2066, -2865, -1317, 203, 1426, 2295, 1236, -1756, -2911, -3363, -3378, -566, 1919, 1410, 1295, 377, -2249, -2717, -586, 406, 1605, 4231, 3006, 341, -437, -1652, -2138, 503, 2628, 1533, 1636, 1508, -2202, -3119, -1530, -1893, -19, 3182, 1927, -864, -1015, -2307, -3592, -456, 2107, 848, 1859, 2762, -1179, -2061, -901, -1972, -69, 3996, 2628, -6, 75, -2111, -3740, -100, 1354, -760, 1858, 3193, -1390, -2206, -1027, -2940, -868, 4651, 2675, -182, 1436, -934, -2926, 623, 928, -1001, 3012, 4046, -1509, -1565, -905, -4594, -1472, 4079, 777, -1521, 1295, -1873, -3989, -1, -594, -2540, 3500, 5044, -459, -11, 251, -3766, 609, 5827, 1131, 418, 3853, -186, -2567, 899, -1744, -3752]
1469c752O992Q22o604Q85p8m266M643M241n165O77N084m355j951L971l673l79
1485b908Q818j04o522K406k82m636N189K886o342K173N151n662k404K624n081
1500d694l9R117k259o304L228p67m504N762J711o200M489O152n769j307L022n082
1516c444J414R394l249m978M471j208m809N175j36p087N825N323p400j513K217
1531eo069J930Q507m959m291N910j672m201N131j458n287Q146M896p061K36K507
1547B260o123L282P974o324k417P047k753m768M516k731n173Q215K865p865N10
1562a485J669o198L450N782o398j123P923l647m096N007l522l447R466K379p457
1577a697K493K036n864L521M735o880J162P534m751l561L749m557l009Q817j14
$$ y = [-3752, 3240, 4062, -2542, -1657, -1735, -6001, -1358, 2883, -2282, -1605, 3479, -876, -2827, 1144, -2529, -2908, 5910, 5806, -716, 1690, 1408, -3228, 1961, 4847, -1495, 678, 5829, 167, -2237, 387, -4694, -4733, 4384, 2125, -4179, -951, -1718, -6222, -460, 1251, -4949, -460, 5692, -77, -1384, 1638, -3444, -2030, 7364, 4115, -863, 3608, 2400, -2409, 2766, 2630, -4457, 1368, 6691, -709, -2222, -5, -6074, -4144, 4363, -596, -4887, 1023, -649, -4850, 281, -1177, -6464, 1682, 6578, -483, -247, 2260, -3863, -581, 7393, 1069, -1348, 5699, 2946, -1822, 2694, -37, -5210, 3005, 5870, -1995, -1485, 184, -6014, -2564, 3218, -3180, -4303, 3620, -27, -4123, 884, -2638, -6085, 3381, 5760, -1697, 796, 2832, -3032, 489, 5224, -1656, -494, 7040, 2289, -1272, 2477, -2080, -5089, 3728, 3614]
1592C614o955L756N75n987L246L031o351K284P354n072k543M200m498j169Q504
1607C989q29n336N018M82n879L876J516o055M051N731n809j458L364n530q22O759
1623C068k491m236N388m64n402L430K38m656M403N061n303l96L707n020l2N987
1639C282k404k637N753r74m933L267o15m221M403L422m822L88K108n046L1M729
1655A731l087j265N663j989l890L483j201l562M702K785m202J348K334m630J61
1670a619L710k928k28M870k256l075K568j721l033M120J377l299K096J258m286
1685b446O82K650k788R35M078j980j743K175k079j950L650L83j928K233M50l343
1701a021R2J202k007O26L330k110j044J766k306j551L002P7j025K342L47k906
$$ y = [3614, -3341, 415, 990, -4997, -1751, 1280, -5071, -2787, 4567, -505, -3048, 1152, -3346, -4515, 3989, 3160, -2176, 2842, 3324, -2555, 1321, 2837, -3218, 833, 6564, 755, -703, 2661, -2869, -3691, 3068, 577, -3659, 1729, 1265, -4137, -707, -469, -5125, -722, 4339, -964, -1360, 2347, -2673, -2705, 3282, 878, -1759, 3994, 3020, -1913, 1354, 739, -3482, 921, 4343, -479, -91, 2017, -3029, -2998, 1731, -1356, -2621, 3042, 1053, -2837, 646, -555, -4117, 585, 3370, -832, 516, 2850, -1780, -1619, 2091, -837, -1065, 3805, 1549, -1526, 1042, -679, -3712, 408, 1785, -1514, 582, 1840, -2446, -1764, 886, -1902, -967, 3111, 1131, -612, 1563, -516, -2466, 1184, 1567, -361, 1872, 2322, -1021, -929, 273, -1734, -1108, 2222, 112, -932, 834, -1472, -3023, -21, 56, -969, 1373, 1720, -1186]
1717a186O77J026k076J490K571j394m06J414k309j586K483o04n06J794m8k626
1733a286M40L35j856J343J855j189M15P87k210m20J626k13j4J973L08j764L53
1750D83k78j195R59J383o36M52J15j451j116J080n68j00J637k7j330N06o19j285
1768a990J160J175J22K90K26j095m69L30o6K18J352K7n28J2p50r82L38Q58J50
1787C78N7P82j667m18R3o24P28J105K46o7k36q71l53J92M42O33M54L80p47n14
1807gl54k86J49J175J23j12k21n41q38r2L69N56Q62K94o63n59l80l34M48M26M08
1828D23L77R1r60o15k44K5M38J089J43o30l28j99n24j31Q72P26L26L03p13m62
1848Gj11k67N78O63M40m57j48o18r59n6P48P2K09J86q68q97L27n08J23J183M23
$$ y = [-1186, -509, 517, -1559, -69, 2502, 1108, 702, 2116, -193, -1779, 704, 100, -406, 1388, 1340, -1286, -846, -511, -2367, -1024, 831, -358, 57, 844, -1366, -1786, -160, -373, -387, 1586, 1894, 130, 483, 205, -990, -31, 1352, 716, 1168, 1283, -168, -1284, -204, -772, -872, 765, 738, -592, -86, -705, -1990, -830, 345, 467, 757, 983, -112, -581, -251, -317, -99, 1253, 1280, 752, 764, 14, -968, -630, 228, 378, 435, 1217, -450, -868, -775, -1399, -671, 434, 680, 613, 377, -494, -847, -655, -213, 420, 874, 1254, 507, -7, -361, -647, -498, 677, 800, 688, 467, -74, -912, -1004, -635, -79, 783, 1077, 414, -145, -525, -859, -411, 15, 423, 800, 891, -69, -684, -928, -903, -465, 624, 767, 137, -191, -390, -914, -1045, -173, 553, 879, 1182, 469, 7, -104, -371, 207, 870, 1310, 853, 705, 87, -872, -928, -180, -108, 101, 287, -581, -1478, -1151, -1659, -1536, -353, 70]
1869G0j30M39l52p94M47R61K9O53R70o09n78O7r01r8J166k43o15M23q92j500m0
1890a527J65o04Q37Q69q65o85L49p36l2J817J48K13J281j63q16R84k7m26J645
1909B427P43j150m4n8j999j06J384j180n29R79j198j341N87q66j085J608J119
1926g09j299O23N99j635R64K065o17j9K603q75n69J336p54j517K537M77j883O59
1944A986q6k883O54J003k140n18K045j253j403J607j955j067L076L06j557J867
1960c18L47k077K163J901k284O13L128j184n00J556k626j313L597l65k673J500
1976A465p29k587J884K30l582Q34L063k152n96J870k902p32M398m48j998K529
1992E47J53j496K372L20l435K195L267k316k28J276l118j10L789k371k326K589
$$ y = [70, -60, 379, 27, -767, -320, 641, 670, 1323, 2293, 1684, 1106, 1173, 272, 174, 1340, 1097, 482, 905, 13, -1487, -1527, -1362, -1966, -1129, -260, -1125, -1810, -1461, -2197, -2229, -412, -264, -51, 1230, 1067, 251, 1235, 1208, 782, 2427, 3170, 2020, 1976, 1918, -81, -187, 1197, 17, -512, 467, -731, -2072, -1485, -2351, -3436, -1828, -709, -2008, -1385, -786, -2421, -1457, 608, -9, -28, 2575, 1700, 1131, 2467, 1713, 196, 2733, 3210, 1327, 1986, 1900, -983, -329, 674, -1466, -1984, 61, -1192, -2595, -988, -2943, -4010, -934, -628, -2185, -318, 29, -2048, 115, 2016, -268, 345, 3473, 2289, 1789, 3345, 719, -594, 3003, 2638, -35, 1465, 736, -1851, 33, 263, -3319, -2485, 578, -1574, -2170, -300, -3202, -3934, 464, 16, -1982, 547, 700, -796, 1576, 1896, -1539, 656, 3923, 1607, 1379, 2655, -463, -573, 3216, 845, -1481, 1108]
2008A108o28k304K423j092l730K808K542k601K28J275k830J025L911k572j837
2023b274L719j06j633K875j567l795L836K630l223M21J040l169J144K922l797
2038i77j510L759o45j770K305k435k947M354J756l437J108J311k794J853K565
2053B496m107n81M568j003j244K073k615k412M598N71l813J640J052k723K074
2068E74J555m759K72M187j625j240K257k732j499M606k83l595K416J031k073K161
2084A253N07m400J453L938j871j001J748k662q16M468j760l488K772Q86k365K240
2100I02j17m144J926L531k196o74J863k340m27M035j988l045L614P37j934K051
2116A794r03l377K469K612k732m52J930k570M9L449l219j796L215K0j413J865
$$ y = [1108, 480, -1824, 599, -493, -4223, -1415, 1127, -1474, -1246, 29, -2801, -1776, 2135, -437, -2274, 1445, 1339, -294, 2581, 1014, -2781, 1055, 3685, 462, 883, 1923, -1246, -102, 2820, -977, -2487, 1272, 627, -1143, 1162, -1273, -4220, 134, 1890, -1547, -439, 872, -1922, -69, 2496, -1611, -2192, 2376, 1373, 129, 2202, -413, -2825, 1773, 2344, -1469, 171, 1223, -1500, 574, 2129, -2630, -2358, 1829, 204, -1036, 1221, -1511, -3010, 1596, 1313, -2282, 134, 1165, -908, 1253, 1760, -2640, -1187, 2751, 880, -121, 1627, -1035, -1851, 2617, 857, -2631, 141, 1027, -1338, 902, 785, -3359, -1433, 2098, -98, -772, 1091, -1249, -1676, 2359, 371, -2674, 940, 1677, -257, 1794, 891, -2486, -17, 2595, -137, -589, 1341, -1229, -1180, 2269, -950, -2746, 469, 489, -924, 941]
2132I41j219k789K738K171k879P08J813k134N81K305k741r27L139m20j368J854
2148A773j197k402K817P43k899R07J286k072N22J653k776o51L101n60j189J552
2164F08j103j432K651n7k078J149J594j440O71R50k331J52K397q80p86J394j184
2181B75j161J973n40j876J433M87j421P98K52k119O58J964j093m68J515q72r34
2198a129J825o55j113J482Q33j145N90K80j934Q22J422j007m99J320q83p17J379
2215H71r35j134J454J02j082P22n8j354P48O38p22J77J298p73l02P73m75o52J177
2234D73K38p58Q95k05j024O47L28q47K78Q90p92l70N53n76o20R14l7m71R20n98
2254a62n45K76L86n30N80N70n66L1J56n43l35Q46J54j48L67km60p8J94k12K21
$$ y = [941, -278, -3067, -329, 1842, -1037, -329, 1484, -650, -69, 2236, -505, -1432, 1707, 1287, -81, 1773, 576, -1826, 991, 1734, -1165, -258, 1028, -1044, -522, 1131, -1645, -2296, 805, 245, -944, 608, -495, -1927, 724, 667, -1411, -262, 1332, -108, 563, 1513, -818, -666, 1731, 851, 65, 1459, 275, -886, 1087, 547, -1329, 104, 591, -830, -32, 220, -1899, -1241, 723, -370, -838, 677, -195, -1129, 696, 41, -1072, 410, 1243, 98, 688, 968, -966, -144, 1278, 271, -228, 1092, 209, -508, 871, -64, -1198, 256, 358, -724, -2, -60, -1414, -666, -28, -750, -573, 725, -48, -350, 423, -52, -704, 473, 711, -47, 848, 643, -381, 266, 594, -253, 25, 915, 123, -247, 306, -270, -890, 24, -13, -484, 436, -162, -707, -431, -45, -575, 5, 575, 9, 40, 196, -347, -682, 164, 318, 170, 537, 535, 75, -3, 191, -21, 200]
2275B00K67k36k36q9k58j26J88O8j76M25J02m77K19l93r7K72N12r7QK08k79j51
2297a46J40K91j36N02l56qj23m7j59J75J52Q1k49L2n92R2m7j9O2K95K34l86n8
2320b70L2j59K85R6K41J02O7j47k78P3j40L24K47R6m05K6qk89PL27m05N17m65
2343a26j63k02J03l16K46P8N1J8O3J02j49K92J08N2L00L22m98N2j03j73K15P40
2365A012l38j92o9l49q0j30Q5k01L73j29l87J60k3n78N38J50k25J43K15k04l94
2386f23O72k07J29M27J37k68L39j21m29N90j42n02L08J57m01m48N58o27l61Q32
2406B0j77l98N75l10q99R25J75o71O39L95p24K64R05r78L5J059k32m36P45n16
2426C96o49P93n3q14P49K76r16P8M12j102K46Q21n01k57O14l75q85Q66M20j058
$$ y = [200, 467, 231, -5, -94, -352, -478, -290, -222, -398, 27, 129, -348, -129, -522, -619, -347, 165, 68, 76, 284, 5, -146, -6, 285, 149, 651, 295, 287, 164, 117, -42, 133, 285, 366, 117, 149, -443, -351, -398, -417, -355, -60, 174, -212, -270, -238, -397, -112, -16, 225, 327, 394, 247, -31, 42, -98, 226, 473, 569, 164, 190, 182, -107, -100, 227, -178, 339, -126, -289, -491, -388, -704, -458, -380, -329, -311, -248, -146, -295, -3, 105, 157, 457, 779, 281, 333, 230, 57, 272, 1012, 674, 482, 413, 64, -16, -146, -61, -262, 111, -18, -405, -245, -268, -846, -308, -158, -383, -240, -25, -229, -623, 49, -158, -29, 398, 535, 267, 606, 485, 56, 646, 504, 2, 310, 467, 66, -382, 176, -451, -812, 20, -157, -555, 20, -290, -1189, -264, -89, -760, -121, 274, -450, -186, 719, -259, -224, 835, 603, 167, 912, 396, -253, 540, 487, -327, 422, 698, -218, -140, 272, -830, -584, 237, -264, -521, 93, -282, -1167, -301, 119, -939]
2446i39J093N80j124M53P53j012J07J119p25l85J248j032o87J231p3j193R21K0
2464C55p73M98K33j311N82R58r80J38P74r61p95J665o07j053J682Mj269J330K10
2483F80j602Q47J077j072J71J021j223lJ327r57q66R26L94j195J222L2k161J324
2501e8Q82j635M82Q52j182r2J749j613q29J968n16q97J898n82j870J698P87j702
2519f60Q06O91j436O49J436j873n47J739o62n74J578j085j350J586K54j441N85
2536c04O35j402R09J163k034j92J918q39l35J581j191j054K048J83j734R06O60
2553I18j627J317Q97k458K51J750j013m38J228j150q65K000p68j569J307N32j314
2570a002J181O34k154M54J795q11n48J460j208n64K036o92j530J304N40j328J427
$$ y = [-939, 154, 734, -390, 63, 816, -196, -89, 1030, 305, -80, 1168, 136, -551, 680, 607, -586, 335, 355, -418, 80, 313, -998, -416, 542, -438, -300, 474, -487, -1282, 383, -224, -1277, 405, 409, -860, 470, 680, -922, -75, 1002, -70, 101, 1122, -101, -104, 1223, 266, -600, 326, 720, -475, 747, 779, -1382, -58, 824, -811, -329, 523, -659, -751, 998, -615, -1444, 524, 8, -889, 1009, 427, -1443, 255, 1042, -660, 146, 837, -599, 50, 1486, -387, -934, 805, 143, -431, 1147, 62, -1288, 298, 552, -889, -304, 331, -1071, -162, 1001, -1033, -1225, 693, -146, -481, 1100, -91, -1145, 903, 1086, -648, 258, 918, -709, 608, 1505, -953, -702, 1048, 35, -403, 825, -325, -1190, 810, 42, -1527, -220, 312, -1002, 179, 813, -1341, -887, 908, 97, -451, 1009, -199, -763, 1273, 581, -949, 355, 895, -433, 994]
2587I94k85k110J060J080j232J0Q27j363M45J693j122j606J656J54p01J515m92
2604E23j772J145J512j979O86O41r48L28J502j599j092J508j29r78J385m66j707
2621a440J416J114j709p4J061j176P47R79j407n79J864m96k10Q13o78r89J634
2638H70L21j628N08O82j227O44R18j811l05J408o97m23J147n90j026J353J50j317
2656a023N98R06r94Q41P35j519N1J164m71j15P80r27k84J054j28j143M09M40q91
2675e17N37M18j521L13R74r14m6P24m17k18J284m49r29R02M15n82O73M4q04M09
2695B96Q42j088J7O42n73k03P06o54p83Q70j86m71N08j03p89M88O19o19k26O16
2715i1k09j5Q40m88p2L49K63m55M35L2m70L60K60p95L0M99l76j49M10p19k01N46
$$ y = [994, 709, -1401, -341, 739, -493, -483, 344, -1019, -574, 1119, -3, -1609, 47, 201, -500, 1015, 523, -1249, -104, 1408, -571, 115, 756, -192, 136, 1638, 39, -1053, 455, 326, -652, 733, 267, -1440, -24, 1090, -619, -693, 368, -808, -61, 918, -489, -1068, 796, 300, 90, 903, 225, -764, 870, 1191, -437, 71, 753, -474, 170, 1088, -723, -1028, 380, -317, -740, 407, -183, -1209, 144, 294, -1023, -425, 481, -513, 328, 1063, -456, -405, 759, 288, 173, 953, 26, -258, 796, 668, -475, -66, 374, -517, 20, 438, -1083, -770, 204, -710, -756, -32, -449, -667, 617, 168, -761, 141, 556, -26, 647, 691, -113, 296, 1138, 50, 67, 709, 136, -67, 639, -15, -798, 72, -114, -585, -77, -180, -969, -481, 138, -481, -707, -91, -300, -315, 525, 37, -35, 314, 577, 122, 557, 589, 119, 479, 739, -56, -26, 473, 97, -52, 358, -361, -562, -16]
2737a6l62k39J10K77n44N91J78m87J13Q48m34J20K75k54j85N23l80p6M15J4j26
2758C61P1r2l88J09R4n33j5L10k12l53J79p6q3K09K85m5r0L1n8J59L90j74J87
2781B66P6n2j77M48l69q1L19p2l16J35K99p55N8K35r0k55J62p3n0N2j24J21K4
2804b19n5K13J90m6o3j6R5k01K61K41k33q1N01j96r5j0j47q9J43l08j15J6R0j21
2828b45%K7j48J73Q9j68O2R9j54L13J9r4mq0J52Q5P9M0J2J36l48j5o3L33l00m
2854dJ32N4p7J03j78l75J28L53k82O1L49l57q2R0J77l42L93k60M5K20k44L22R8
2877C24J58m09j7k6K5k79K34J2m6J02PJ20k24j54l1J16M5k38J91J45k12J80J20
2900A43m14J09K13j63N2L19m06L35m8j25j38L59n6n42L24P5j28L20K23m45O4J64
$$ y = [-16, -378, -617, -507, -230, -774, -183, -5, -492, -379, 469, 35, 155, 430, 176, -9, 514, 134, 58, 473, 487, 361, 432, 340, -48, 61, 155, -378, -393, -83, -295, -648, -469, -545, -628, -419, -134, -179, -269, -238, -296, -137, 253, 79, 266, 342, 290, 113, 561, 192, 111, 430, 358, 42, 177, 476, -279, -221, 14, -76, -331, -169, -242, -292, -240, -364, -243, -219, -274, -61, 129, 83, 20, 4, 99, -102, 159, 400, 167, 86, 587, 391, 296, 286, 139, 50, 193, -115, -230, -214, -124, -245, -245, -218, -366, -193, -104, -272, -210, -111, -265, 48, 67, -27, -31, -111, 41, 126, 205, 245, 257, 393, 45, 30, -33, 300, 0, -4, 128, 182, 105, 208, 30, -345, -217, 136, -146, -85, 264, -93, -175, -85, 92, -250, 143, -117, -72, 148, -96, 226, 324, 482, 73, 56, 30, 55, -224, 10, 22, -24, 78, 85, 205, -19, -173, -204, -88, -43, -281, -90, 55, -157, 23, 143, -271, -162, 51, -112, -60, 259, -147, 188, 140, 15, -123, 236, 180, -362, -38, 37, -91, 229, 452, 7, 71, 235]
2922B35k25J1K47k16j57K34O6l79J73P3l92K74J72m28L0L76q34M90O04o14K40
2943b0M21k99l24L71q5j58N09r3n14M28K87l84Q7K94q13M4O79l76l37P98q52l78
2965g15R06k1q33O07J40n65L87L36o03M43K38l47p8N55l91m84J188n44n76P01
2985C44J93j046Q68l7r60K47O30o40j80Q06n80j79O45j50n95Q33R5p60O10L4o10
3006d32K01P57o90jO29p37K99P27m94o60Q87l83m94N36k0o47N57J93p78K63O91
3027D04r29J62Q84p21j87Q20l23k52L17n2n43R49J05j134P78J36j046M16Q50q12
3047a78m51J051n15m72Q10j93o05P56K10r25L92O11j076L94R37j101P2R15o72
3066d0j93P36l58n24R28m56o06J065j34q61M73N82r79l0P92n79K22L87n79n79
$$ y = [235, 10, 21, 268, 52, -105, 129, 195, -184, -11, 62, -330, -56, 116, -312, -282, 94, -740, -250, 354, -260, -20, 401, 102, -222, 149, 64, -94, 415, 322, -192, 236, 523, 139, 226, 520, -293, -249, 430, 54, -283, 515, -337, -715, 191, 170, -663, -56, 84, -481, -94, 242, -361, 82, 320, -27, -105, 450, 59, -425, 763, 219, -357, 344, 537, -509, 359, 322, -638, -391, 239, -401, -581, 225, -355, -534, 111, -39, -634, 199, 294, -466, 144, 178, -432, -231, 526, -164, -165, 464, -273, 26, 753, 259, -401, 486, 103, -391, 145, 125, -522, 35, 228, -550, -287, 404, -525, -363, 521, -200, -387, 433, 110, -142, 175, 123, -420, 529, 634, -500, 278, 414, -632, -216, 634, -178, -629, 422, -93, -565, 245, 52, -553, 203, 413, -512, -120, 491, -585, -191, 746, -355, -283, 632, -40, -233, 503, 145, -379, 549, 93, -513, 552, 418, -443, 30, 612, -367, -397, 395, -184, 38, 425, -154, -733]
3086g33J065k57n42Q28k07o04N24O75j388N82M63o71K94P28p91m44O17l18k61
3105d40Q93l34p57P24M07q20L01M93r07O61N46q19l34R60o27l1M02l4p00Q65k04
3126B45p65N66J02p50N36M38q16P0Q68m21m55Q52m35m41O29J39r99P18J95p10
3146d34M02L77o05J0M71n62O3M44j60n03N65J79n78K63Jm63R84M7q50L03O13q40
3168b73K01P27q88R7N72k79o19N41O0k08L4J77o33N46L84l37l59N47n16J43L80
3189B97j52n00M85Q7l26M38k48n11L92M79n92j12K70k59m6M37j43k36K41K75m93
3210b17K88pm88P01k27k29J35P8pL8J6j47l41N98m05J82J35j15m32M25O9k33O3
3233a20K71m90K72L61m79N1J07l00J2M01j05J8r7L94l93K55O7m44L69l7j32ML60
$$ y = [-733, 332, 75, -467, 361, 154, -450, 74, 749, -639, -57, 406, -265, 29, 757, -34, -478, 139, -179, -440, 453, 119, -638, 86, 493, -327, -26, 467, -440, 221, 767, -52, -386, 574, -53, -84, 318, 284, -416, 449, 245, -520, 46, 148, -602, -66, 372, -444, -374, 494, 73, -382, 470, 35, -406, 223, 362, -637, 81, 276, -434, -32, 345, -260, -250, 221, -341, -278, 166, 6, -497, 68, 247, -331, -68, -67, -530, 454, 501, -349, -46, 567, -273, -72, 655, -233, -136, 436, 157, -462, 79, 139, -69, -35, 142, -491, 55, 439, 102, -257, 290, -226, -83, 297, 145, -355, 130, 217, -109, 329, 81, -430, -38, 441, -151, -263, 7, -252, -298, 139, -4, -240, 1, 276, -217, 71, 64, -424, 277, 50, -179, -44, 34, 27, 65, 81, -66, -407, 191, -214, -32, 103, -12, -444, -19, 50, -183, -120, 151, -339, -67, 294, -185, -134, -27, -327, -315, 86, -19, -1, -98, 296, -97, 158, 225, -219, 150, 113, -19, -15, 345]
3256C45m11P0P8k17P0On9j89L17j74p7OL81j95j91N93o48N06k05J18k83K34J40
3279B15j74q2P3M6o6M8j13j21L60l11n8J39N6j17j21J29q2L78n32K68Q4L2k73
3302b22L26j17J15K4M5P5l56L99k2k14p0M1N2l33J44j02J27j8kj58J63J30j33
3325a06o8j56M00k5J5J7j9J23J49j94n7j4K83jj73J4j89J6J28l7k37mN1r7J16
3350f5k05K29R7k0k86J79j07O1R1M1j6j7K59o1l5k61nK63k44K19K34m72K77Rl76
3375b11M51n4k87j05L74k19j28P4K2j17K05J18m9J8J52q3j37p7Q2J01O0k95K9
3398g6K67J63l56j1K85l69L3j1J27j94J65m56O10k93J24k29J78O7qJ88j46k07
3420a49J79m2K78l35Q7j1j07K93j89L0o9L3j25O11m46k43K33Pj91K84J0j96P8
$$ y = [345, -66, 4, 82, -135, -65, -59, -118, -307, 10, -164, -241, -235, 146, -49, -240, 353, -295, 211, 6, 124, -159, 75, 215, 41, -41, 32, 78, 12, 60, -53, -174, 186, -125, -183, -44, 12, -105, -226, -97, -179, 199, -333, -65, 19, 51, -222, 104, -13, 102, 126, 171, 246, -110, 289, 267, 53, -17, 24, 76, -257, -113, -215, -88, -106, -108, -266, -103, 27, -106, -174, -330, 70, 45, 60, 77, 58, 181, 330, 136, 79, 65, 348, 347, 174, 188, -1, 15, 143, 106, -131, -135, -84, -181, -65, -270, -41, 56, 36, -250, -71, -178, -117, -26, 15, -1, -18, 241, 180, 145, -116, -121, 142, -102, 117, 351, -121, 156, 165, -211, 240, 186, -101, -206, 168, -51, -179, -105, -83, -200, 5, 123, 74, 92, 244, 161, 24, -53, 29, 130, 190, -105, -76, 191, 354, -2, -13, 272, -97, -64, -75, 52, -142, 23, -433, 177, -116, 8, -221, -43, 24, 16, 204, 58, -149, 30, -12, 266, -69, 18, 7, -100, 193, 4, 34, -35, -2, -127, 484, 38, -205, 28, 35, -156, 128, 138, -58, 20]
3443B0J56l63QO56m50p5L0r7Q3K96l43j42K40K59n37M40Q0j23k71L36k20l09K54
3466g2J23k43M44j78k77J68m5q9L74J79p95M03L08n28J18L47n29J70O68m80k35
3487a69L30O3k68M32m40l31J02M79l13j06N75l54mM94m14l32L93J45l93K85j41
3508C3l54K57M53o39J57K26m49k0P53q58k7N62M9m86N00p2n58O12k51k04K96K53
3530B33m26M38J2n33M8N64k22j07J05k09k24N79R1q12M86J72n14L46K71p45K86
3551a61L28o28N75K1j13l18N89p3p04P69P4m38K15J60m13j62P33m34o9K86n56
3572c19L8N82m57Q0L2J97l79M91r1n50K15M25k92j05K03k78J14M68l08l65P25
3593D26m47M4J28R8l94J52K76n39LK40j98Q4K70l84m17O17J99n58N00j00l16N46
$$ y = [20, 176, -187, -179, 477, 27, -48, -18, -115, -32, 264, -79, -221, 19, 278, -259, 181, 261, 138, -133, 203, -17, -326, -72, 51, -192, 252, 74, -203, -35, -80, -169, 205, 384, -411, -8, 300, -228, -110, 237, -292, -122, 546, 66, -169, 161, 224, -44, 388, -52, -383, -281, 198, -115, -221, 354, 0, -4, 490, 76, -256, 137, 282, -111, 174, 33, -321, -64, 389, -250, -93, 133, -316, -336, 417, -441, -468, 94, 143, -343, 157, 85, -473, 139, -112, -316, -20, 233, -193, 245, 257, -276, -228, 336, 114, 7, 112, -97, -321, 258, 349, -463, 23, 195, -319, 27, 298, -447, -161, 167, -461, 114, 135, 22, -296, 293, 220, -484, 285, 359, -79, 136, 296, -117, -279, 454, 20, -49, 237, -319, -281, 301, -156, -76, -44, 153, -226, 265, 174, -376, -161, 264, -28, -133, 70, -208, -94, 374, 66, -299, 426, -21, 23, 151, 249, -145, 7, 283, -256, -253, -13, -211, -127, 143, -241, -658, -41, 158, -400, 100, 0, -316, 230]
3615B30K8l06l5N70m49n9M10n84q6N53j91j96J98K4k89J29J70m83L31K88m14r2
3637b53L76l30J41L11k83L8K49j99k46M22j44n15L26L46n25K08J18j09k1M97l60
3658D7k1J52k18j33J95N6l55L15K80p01K85J97j41JL96l63j76M20l0m81K58j23
3680a40n3Q8J72j33Q1L6n1m52P78l05O9k02J44j10K87l45p4K92lj0j5Q5k60p2
3704a93L72j0l13L57k51Q8j20P2p3K58l36M2L38j15l31J95K55l38K10J70m60J46
3726c7K23J45n81J65R0k23K85Lj89J99%k11o7L2L20j92J22q8q3K06k26J34M1P5
3750A43l06K89j35j50J58O2j56j68L39j10J52O1r2RJ30r3o0k09M6J35K58n18N7
3773a58K21J14k51P4K18l80L90n94P49k94j01J34l86O98k41m1M2j67o3o3K78j25
$$ y = [230, 258, -48, -83, 487, 38, -21, 389, -195, -281, 272, 81, -115, 83, 107, -182, -53, 117, -366, -35, 253, -161, -253, 123, -207, -66, 245, -38, 0, 249, 50, -196, 226, 82, -433, -107, 239, -286, -78, 40, -69, -90, 407, 47, 26, 178, -40, -173, 22, 78, -277, 38, 318, -383, -98, 99, -42, -41, 355, -8, -184, 236, 206, -275, -17, -140, -193, -105, 67, -66, 15, 51, 0, -452, 326, 21, 90, -112, 32, -78, 209, -136, -210, 82, 79, 69, 54, 139, -121, -193, 179, 169, -144, 213, -38, 50, -70, 2, -71, 187, -149, -107, 231, 116, -215, -20, 235, -103, 107, 277, -183, -37, 186, 331, -250, -85, 5, -218, 67, 70, -119, 80, 80, -131, -198, -166, 154, -38, 84, -4, -87, 119, -107, 27, 68, 143, -163, 126, -9, -159, -1, 61, -95, -263, 76, -34, 118, 179, 87, 96, 226, 133, 73, -136, -90, 45, 303, -215, -158, 63, 177, -74, 0, 218, -162, 228, -366, 383, 89, -12, 122, -264, 434, 193, 152, 194, 27, -36, -99, 179, 54]
3795E4kj00L0QN1O8Kj4n4k04J9J89J08l90K46j69J82K6j64L3Q6P5j99J89k8L4
3821G6r7k3J1L39k00j56J38J5j43n2J88n2Q3J64k19Rk25j4K09j71R3l5k00L73
3845A11O2k75J5j15J86j05L34l71Q7J09l39Q3J36K07L1k92J53P9oJ30k02Oj3K
3869A3k0k48K07j05o0J10k3O0J26J90l5j78n1J00j02k68L30J36j9m0j48L7N0l2
3893C0j27oJ36r4J07K78j37l13J78k56N2J51L7M3j76K50l09Rk0N6J88l8J12j39
3917A2j08L44j45j01J46r1K57j07j68K04k12r5kJ53j06m5J2L4K5J39l69P9pJ49
3941bK30l23K07j63K69n32Q6J55J1J09L02j06k21j35K89n4P9J17j95jm5r0k51
3964b64L10r9j87M4L60k53j84O44m67j70O06k79j2O4J8k62J49J49j30k7R0k04
$$ y = [54, 52, -48, -18, -10, 41, 109, 111, 97, 43, -161, -142, 47, 155, -235, 11, -158, 24, 50, -114, -81, 5, 80, -119, 70, 42, 76, -21, -44, -33, 306, 106, -50, 88, 103, -40, -92, 96, 44, 127, 291, 72, 81, -144, -158, 51, -120, -27, -62, -262, 111, 173, -102, -87, -202, -16, -121, 213, -158, -71, 38, -301, -218, -82, 125, 156, -136, 17, 96, 90, 220, 18, 24, 11, 13, -7, -255, -48, -153, -213, -103, -126, -66, 60, 250, 215, 37, -14, 86, -16, -284, 46, 182, 163, 123, -25, 12, 62, 30, -97, -103, 33, -61, 46, 324, 187, -126, 52, -204, -152, -1, 36, 79, -97, 153, -156, -147, -167, -111, 77, 39, 151, 12, -96, 248, 103, 2, 148, 57, 314, 207, 39, 243, 31, -64, -66, 87, -19, -64, -52, -18, 7, 146, -223, -144, -151, -2, 228, -95, 112, -51, 218, -314, -228, -73, -62, 47, 349, 243, 22, -113, 176, 122, 201, 318, 123, 122, 77, -13, -264, 46, -53, -240, -196, 164, -89, -273, 371, -96, -266, 340, 61, 49, 113, 131, -131, 18, 167, 37, 10, 100, -104]
3986a04K11l7k07K6p5j3J72J84m75O2J22J42j71M04l58K4L05mk99j82J83L12k39
4009a7K45j64k4pL64n31j6K33n9q7K28l77K05K37j89j11p8M0J36o9K01k03j05
4032a48M7j59L13J42l6l15N66j95l96K57j97P5R5N8k54Mq1K0L67o4k30j12O24
4055C81k52j76j0j80J45L37l18j78L34k64K02J15L0j91K35j44K3j99K10j36p8
4076a14K49l08m3J02J95k90L54k16j45K95n5k15N3Rj08J10J97l15k88O17l8L5
4098H1r7r3N5M19l74j62J33L1j03K26P5l75q8J75oj11K88N9l86L32O0l97J56J83
4122H1j17o8J68m20M09L65n01J8L56k61PJ42Kk95r1J90N6P9j15j96J35J6J25j12
4146b7J90k69J11J8L8J13mp4l51K78n9k53K96K2j86K07J2j88MK76q0l76M81j98
$$ y = [-104, 107, 70, -137, -111, -186, -199, -27, 157, -318, -256, -134, 8, -163, 241, -117, -93, 212, 208, -91, -273, -90, 222, -17, 228, 64, 40, 33, 397, -134, -150, 83, 24, -63, 165, -212, -7, 230, 41, -70, -148, -108, 28, -41, 160, -43, -148, -101, -260, 53, 195, 159, -156, 410, 215, -181, 76, -121, -46, 49, 107, -147, -143, -224, -204, 163, 99, -131, -243, 381, 129, -47, -57, -237, -92, 245, -73, -251, 83, -181, 21, 136, 166, -25, 210, 66, 89, -110, 100, -36, -114, 135, -173, -216, -114, 81, -209, 145, -71, -216, 79, 24, -191, -138, -129, -237, -127, 70, -245, -533, 84, 46, 81, -16, -109, -54, 365, -9, -171, -38, -7, -110, 116, 191, -184, -272, -97, -103, -214, 74, 133, -253, 79, 139, -258, -102, 81, -36, -104, 64, -356, 53, 418, -83, -65, 291, 30, 37, 179, 181, -114, -205, -15, 41, 120, 5, -191, -56, -40, 85, -27, 163, -106, 5, 23, 61, 174, 170, 96, -255, 23, -36, -289, 7, 29, -157, 50, 62, -126, -122, 154, 74, -302, 179, -19]
4170a9j24K15N5k39L56o0k41j22L32j49J92r5k8j50J33O0j89J20Kq1k9J5K16r7
4194G3j47J59l11M06m97P0K07Q7l21K67n5K2K19o3l10K42N3M4j99J48K49n41J11
4217h7qM7J11k77K28j05p2j7J86L2j39J2R0K7J39l5p0P9J06l01R2j19J91k17J09
4242Bq2qJ45M07m21n1R7o7J12j20k2L3j41Q2M7l34K35j77n2K69k4n1L34j68k6
4267A9l0k1R7O6o0Q4k30J65j62M2K21l85J47l2Q0jm6L6Q3j39L4M2k64J18N3J50
4293F7k2M2J34p0k05J49M4J59l74M4J29r1o3J2J18j05L6j97J86M4j37j6J94k11
4317a33K9L93m34l7O1Q2R2P2n0j9J08o8l37K69K23j06l36K24o8j74K51J2k66L86
4341A74k19j59J80O6j36nk6L7J66k03Q7J22r0n0j22M1J5J6K62Lk03J05j5j06r2
$$ y = [-19, -143, 72, 127, -112, 244, 184, -57, -179, 153, 4, 196, 101, 73, -77, 56, 116, -73, 47, 49, -32, -61, -46, 170, 73, -74, 85, -226, 180, -317, -247, -40, 47, -274, -7, -62, -40, 179, 116, -194, 48, 101, 145, -54, 94, 343, -198, -87, -95, -48, 63, -214, 14, -91, -163, -180, 6, 38, -101, -89, 1, 28, 167, 132, 62, 141, 247, -54, 38, -81, 110, -107, 2, -80, -88, 57, 464, 43, -8, 89, 22, 134, 14, -8, 25, -116, -34, 13, -321, -86, -263, -315, -46, -70, -121, 213, 45, 19, -11, -32, 65, 131, 71, 155, -75, 90, -72, -30, 191, -194, -47, -79, 1, 0, -46, -10, 73, -66, -32, 10, -254, -136, -83, 67, 45, 87, 221, 151, -54, 95, 139, 298, -76, -32, 97, 6, -57, -45, 73, -32, 4, -193, -7, 37, -100, -116, 78, -133, -104, 289, -145, -182, -121, -39, 53, 125, 75, 56, 164, 96, -241, 28, 251, 145, -191, 33, -35, -209, 42, 54, -212, 174, -45, -204, -24, 42, -94, -99, -125, -88, 78, -125, -38, 84, -6, -56, -178, -137, -122, -106, 156, 159, -44, 61, 46, -60, -152]
4366a52j7K12j43M1N4L8m8j11k7Q2k5L1j45k4P3m1p9J78K03j5p2J82P9j40k22
4391h8L36K0l22J34Ok92K87J67l84m8pK17k79J48k6l1L80k98k50M94l47L22j60
4414b1j5M3k39K87nN2n4O6k29J89R3o1j06Q3k47K37J29n4j72o9j41M6k9K53J29
4439A65j90j31K22k13j7P2O2O6j77L38o5j38j53K70k68P3J60l62R9J22j03K05
4461C7J2J41k59J70j61j32j1J83k11L36k2M7n8j85K60k19J20m4J87L9k90p0p0
4484b00L65j96L8K17l60J1KJ8Q5J30O9j57l1P9J0J11j47R7k52L22j62L1Lm27L23
4509b1J8J46OK4J23k07j73K03j90N4j1o9o6Q6K3p5K70j20j50M60l16O2j8J3j38
4534f6M13l24qK9Mk04K49N6l12K67k2p7k32L16k04n0N3K6j44N35k82p9j34K47
$$ y = [-152, -169, 43, -100, -59, -5, 33, -15, -126, -153, -71, -96, -65, -210, -234, -161, -202, -281, -103, 100, 85, 13, 195, 274, 134, -88, 248, 268, -54, 80, 86, -206, 81, 248, -136, -184, -191, 26, -253, -105, -131, -162, 218, -80, -330, 164, -183, 139, -21, -36, 7, -232, 55, 50, 102, 48, 114, -115, 74, 167, 106, 0, 83, -164, 73, 202, 148, -24, -93, -234, -188, -217, 36, 165, -25, -156, 66, -147, -164, -92, -30, 36, -141, 197, 132, -6, -159, 111, -157, -84, 76, -286, -187, -65, -168, 37, 49, 190, -69, 101, -60, -192, -203, -20, -231, 105, 83, 130, 72, -113, 147, -72, 48, 4, 191, 230, -60, -130, -200, 165, -31, 7, 224, -136, -125, -123, -105, -20, 110, 179, 22, -9, 70, 80, 191, 44, 141, -111, 211, 49, 80, 83, -344, -21, -3, 143, 149, 173, 296, 89, -84, 119, -71, -17, -28, -97, -163, -77, -54, -129, 141, 21, -129, 331, 15, 77, 59, 72, -66, 347, 23, 15, 44, 48, -156, 93, 149, -163, 104, 82, 5, -227, 89, -115, -165, -112, -86, -230, 305, 23, -56, -190, 57]
4558E7j33j68L19KR5q0M9k65K38M3o5K60l34Q5p1Kl54L42p8O7j3L4n8l3J61MP7
4585A83l22K92l74K27K47l69j04M24Kl49L30j42j05J96Pl87K97J06n14N39q4j08
4607hk29L14k41J48N6j55j18J94K2l62L70Q2k09L50l5l70K55J87r4m2J94l77J57
4630H9j73K15p0N8k30j9P3J93k66K98m0j22QN0l21J18L18m17M21j83j33K43L1
4653A41k21J4K46p2l45K49O6n0k21K04R0j95M4j18p5M66j23j51J51l51K54j9L8
4676B2k31L32j30j34Q0R9k4R1pJ19j38J02J92m67P6L9R9j93L4P6k01L50j26J19
4700A79rj91J78k60J09Q5j82J65k56k3L27L3j99J86J5k32K20j68l8J88j7j49j9
4723e8N6k40K40q5J2K7Nq0j13J44j15M8K00m1j44J97R2k35L36j72j28L67k62M4
$$ y = [57, -76, -244, 75, 77, 172, 92, 141, -124, 114, 157, 92, 352, 18, 103, 32, 34, -320, 22, -56, 11, -2, 32, -26, -59, 102, 106, 183, -139, 153, -221, 6, 253, -116, -220, 204, 206, -143, 187, 45, -60, 136, 143, -244, 53, 159, -355, 184, 100, -8, -237, 77, -164, -16, 40, -115, -233, -39, -17, -379, -9, 73, -136, 214, 179, -191, 64, 251, 157, 115, 309, -68, 89, -84, 131, 61, 119, -111, -130, -57, 136, -130, 168, 128, 6, 14, 64, -257, -139, 179, -238, 183, 0, -133, 110, 141, -80, -66, 180, 108, -237, 12, 78, 28, -193, 11, 101, -94, -50, -168, -243, 223, 100, -51, 100, -251, 3, -16, 22, -209, 123, -7, -141, -61, 38, 14, 105, 98, 217, 79, 181, 373, -94, -18, 21, 120, -73, -39, 37, -164, 186, 60, 179, 170, -21, 157, -103, 6, 91, -91, 74, -182, -205, 122, 155, -44, 142, 157, -75, 145, -23, -61, 127, 110, -39, -58, -2, -242, -2, -87, -75, -48, -43, -123, -236, -92, -207, -159, 41, 0, -144, 53, 145, -90, 246, 74, -54, 313, 51, 95]
4747I5j58K46j95J19m9j13q5N3M4o9J51N4k32p6K66J6j82J26j18J62J28k87K66
4770A62j52k74L31k14M2Q9N2j71K49L1j05o5L60l41J35k53P5o0p5J80J0rJ42j93
4794e4K1o0M95k97q1Q9k94J43R3q7L5K25l55K97p7l8j72J56Q5j20J06j72K19l70
4818b13L29j54K11k10J52o7j45J16j88N2J65K5j44K22n7m7j95J18K9r0J18N1M1
4841A19m0r5J72m1j00L3j16q1J80L4q9K1k09K95J61k21k51O9K11p1p2J38j68K87
4865A66p6m5j66P2K08l93J91j4M8j37R8K28l06J66m3r3J65j39Q5o0R1l1J05j16
4889DR7Pk9r0K25j41l47L08J16j69N6J51n2N4m7n2j90L6J41k04K19J9k31M7j45
4914b17L1K98k30J38J7l7Jj2NJ03k25N3N2J29n49M75r8K30n6R5k40o2J3J92J02
$$ y = [95, -63, 183, -12, 107, 58, -55, -140, -87, -43, -112, 39, 93, -139, -215, 51, 67, -115, 11, -107, 55, 183, -104, 162, 10, -264, 67, -147, -105, -16, 36, -135, 114, 145, 40, -25, 335, -6, 129, -124, -49, -109, -184, -4, 6, -3, 139, -54, -33, -93, 402, 105, 24, 113, -181, -38, 55, -32, 3, 228, -127, 170, 93, 55, -117, 39, 124, 4, 110, -62, 157, -213, 116, -38, 173, -37, 115, 48, -97, 19, -169, -117, 48, 73, -71, 151, 94, 47, -148, -30, -1, -91, 27, 78, 119, 79, -16, 156, 115, 15, 48, -68, -149, 31, 65, -24, -3, -212, 83, 244, 23, -228, -159, 52, -19, -91, 47, -121, 166, 90, 45, -121, -49, 159, -234, -43, -57, -9, -146, -48, 180, -126, 40, -3, -96, 69, -70, 15, -45, 46, 15, 120, 4, 101, 108, 79, -11, 214, 73, -274, 34, 150, -19, 37, 188, 136, 190, 143, 91, -99, -63, 78, -126, 93, 112, -119, -72, -217, -186, 112, -118, 20, 37, 0, 1, -11, -6, 97, -128, -75, -23, 106, -443, 32, -66, 164, 108, 203, -37, -99, -86, 106, 208]
4939B08r7j77J60j05M5P0r5K4p2J18rM0k95K90j41p9QJ92k7j75K62n3j38J1K62
4964B27j78j53J32j5j67J23K38l08p4Q9L49l04J12m7J33j12P4j90l3J42mj4O9
4987H9m1j54L00j50j31jJ7j25K94K3l16J89Q3q9N2l7k34K86J3N5j47j72K97K84
5011C85o07K29J39j79n7O7%l5j2p7O4J43l29l6N51j93j85o7J20J20L54m05R9p3
5035A6K03k01j26P1M1j36K23k39J29j81K58j00L5L00k18j60K9J13P2j11j46J16
5057a2p2L28k40l1j35J33KJ05q1L51k94l2n6J40k82J35Q7r0p9K33k3r7J46j83
5081d7M1j12J63J65j25o6q0K15m6k20Rr0%J76r4k5J09jl6k6K41j51Qq7J31n7j2
5108a7J87n4m9Mm15K68n4J35k03K27Q3k24K91j22o8Q6J3l38M29q2k40K54K6o6
$$ y = [208, 111, -66, 94, -11, 34, 104, 9, 33, -39, 79, 70, 110, -185, 105, -36, -115, -107, 85, 58, -117, 145, 92, -46, -35, 227, 49, -104, 28, 13, -154, -31, 207, -101, -175, -86, 263, -41, 71, 24, 157, 45, 119, -71, -104, 38, 34, 20, 89, 48, -106, 194, 44, -87, -88, -71, -196, 98, 121, -195, -6, 77, -12, 40, 3, -231, 55, 68, 123, -24, -196, 101, 385, -222, 7, 146, -33, -90, -23, -23, -58, -70, -147, -83, 60, -269, -305, 246, 53, -132, -199, -79, 41, 395, -10, 89, 16, 219, 18, -108, -37, 4, -132, 91, -148, -19, -200, 58, -42, -7, 293, 75, -85, -56, 57, 129, 18, -128, -12, -84, 244, 4, -27, -162, -29, -27, 78, -3, 348, 54, 22, -34, 106, -176, -41, 46, -44, -123, 110, 87, -10, 136, -47, -6, -118, 45, 210, 85, 19, -61, 154, 108, -112, -103, -193, -193, -17, -111, -136, -27, -28, -64, -90, 151, 0, 8, -79, 52, -5, -17, 170, 116, 67, 71, -344, -76, -130, 5, -198, 29, 112, -112, 179, 57, -11, 75, 88, -250, 179, 97, -143, 111, 137, 71]
5132G1j19J56k02K76q3k21J83k09J95r6k2J56j65J4J50K6L0n1j25j0J36q5j7j6
5156b8Q4o8pK98k48j36l3K50p1j24Q6J89q3k09K25p7Jj66N7k2L0m8J1O7K9J71
5182A78R7l66N6q5n7J48K0J13p4k79L03j7j57R5j97K24k34J73mJ58m09N00r7N4
5206A43M8l91K86J0l16M18k82K02Mpp7j4R9j36m3r6l5J55M0k7n3L54k63o9j86
5231b36J98J17J3o8K2k6J90j55m6J48j48K32q5k55J10%kl7j6K44j60rp1j3K38
5256A85j63P1J36l65L9L3K7Q1j91Q2J65J49j10k15J90m0O0k81K23j38J11L4k3
5279F0l4J32j64J20j15p2L6j4j34K17o6K37j09L4k53K89k86R0lJ04k75L34K3j60
5303ij01J03R0j19J64p3p5j0K13q3L2j96K77k17l8J94j93j52j39M62j72j44L62
$$ y = [71, -48, 108, -94, 182, 99, -122, 61, -148, 47, -49, -71, 85, -80, -66, 84, 110, 140, 89, -36, -46, 90, 5, -12, -28, 56, -12, -19, 279, 31, -105, -138, 112, 41, -83, 3, 192, 109, -100, 125, 48, 49, -117, -60, -82, -52, -100, -89, -22, 7, 178, 275, -91, -35, -120, -177, -29, -9, 104, 30, -249, 54, 37, -120, -25, -222, 2, -232, -59, -63, 95, -314, 186, 89, 143, 191, -200, 86, 96, -220, 198, -84, 118, 122, 115, 38, 24, 123, -13, -56, -152, -187, -32, 8, -19, -72, 282, 19, -50, -236, -38, 79, 92, 24, 46, 20, 210, 55, 9, 157, 9, 241, 156, -99, 11, 11, 9, -28, -44, 200, 40, 31, -40, -53, 185, 22, 93, 229, -136, -97, -64, -37, 44, -147, -65, 100, 249, 139, -76, 114, 74, 134, -147, 76, -62, 49, 83, 60, 26, 158, -6, 114, -1, -73, -37, -51, -185, 32, -34, 203, 94, 128, -125, 164, -122, -32, -35, 69, -206, 128, 151, -9, -110, -7, 83, -36, 128, 55, -20, -30, 183, 100, 132, -64, 213, -4, -42, 152, -41, -193, -332, 130, -42, -186, 176]
5326A76n00L31mL2N5j97J90j94J08K55k15j64J85k45J79j81K03n2K20j26k13K02
5348D5l38J67L2J24n0K30k75N6N1j14J30J5J35j95M9M1q8M05j08j69l90K71R4
5371A18r3P0q4R1j5j02k76L52k11J88J90l43P0N2k0n4J99M7l12K32j81L17j55
5394H0j54P0l5J81Kj16r8J54j0j66N0j05j4J68O9j10K47n13K55L5J69n8R6k31
5418c4m3J57k75L45k82oj3k17K77L66o4N2k61j20J87j29J27O1j13k08L07k06j27
5441b19J67J19Rk92J70J3l1J02m48K59K41j97J61J1m5Nl9J43j79q4K33J59l61
5464a03J11j96K21J50j09j48N4j03K16J90l75p9J2K68r7l9o0J50M0j43K24j87
5486cm2P0o1j97JL25l16L94j5k62K49Q2j46r8N1q1l0K27j55R4mr8P3qj25J2P5
$$ y = [176, -324, 7, 3, 35, 90, -107, 83, -111, -3, 252, 37, -127, 58, -187, -8, -189, 14, -38, 182, 56, -157, 45, -293, -126, -94, 30, -20, 210, -65, -9, 42, -72, 58, 73, 208, 13, 62, 103, 15, 420, 312, 143, -247, 24, 118, 25, 95, 11, 102, 87, -15, -291, 61, -150, 38, 228, -115, -45, 7, -13, -67, 132, 179, -133, 99, -82, 235, 80, -74, -4, -39, 142, 144, 28, -70, 84, 74, -92, -42, -147, -161, 7, 76, -34, 213, -300, -45, -10, 159, 101, 197, -34, -77, 80, -195, 150, -132, -138, -151, -368, -91, 275, 211, 263, 2, -118, 69, -60, 67, 128, 15, -193, 114, -92, -219, -52, 67, 76, -216, -46, -33, -64, 38, -410, -151, 90, -107, 54, 65, 20, 25, -14, 129, -50, -134, 99, 258, -103, 8, -188, 33, 183, 74, -74, -20, -123, 93, 283, -92, -171, -159, 109, 12, -27, -87, 63, 103, -40, 184, -3, -45, 25, -36, -233, -232, 93, -223, 171, 156, -106, 143, 225, 79, -19, 32, -49, -79, 148, -7, 87, 83, -15, 58, 50, -75, -63, 12]
5513A2l16L21R1k54K19j88J99j12J86j28l1m6Q9k51J95k58K70l3j18J48L9j72
5535a38L03Np6o6nk08L34j10L67l36p1j9j1J7Jl0J03j02L1J34j61Q7O0k6j28L
5561d2K19R1k99q8K6K27K4l90J01P2Q7P8j87o7J1J69k25K63J29Rl99K25j82J69
5585B1J80l73J05K38l54K86j41J68k79J14o8k8L60m93K44l1R4N7J7j87P9j25Q6
5608c0N5j86O4J02Po4%J20o2J19j96J07j21N7R2L0j61Q9K2j93M4J25O0J1j15r2
5634a16J07k16L16j26O8J51j66R4m37M18j66Q3j72J43J36j73J70l16L80k31K23
5655A70j34K6k3K58l03j24J08J24m6j67K59r4r6k55M75k05J6L0k5o0l5J51j09
5678e9k05J47P2j36K08j82K62p3j2pJ8m6J9n6J76j28J77l58K31j01K69J7k84J93
$$ y = [12, -304, 17, 108, -146, 73, -115, 84, -28, 158, 30, -1, -47, 42, -209, -14, -272, -2, -35, -153, -5, 34, -138, 165, 170, 94, 28, 23, -185, 149, 39, 406, 70, -1, -20, -31, -14, -13, -43, 60, -42, -11, 123, -38, 49, 109, 83, -45, -42, 177, 268, -31, -119, -93, 134, 158, -232, -131, -59, 28, 106, -81, -148, -137, 32, -193, 70, 199, 208, -191, 34, -148, 21, 201, -172, -67, 171, -183, 103, -38, 130, -149, -35, -103, -131, 229, -264, -20, -51, 43, 100, 117, -70, 9, -116, -30, 25, -161, -97, 5, 12, -52, -52, 68, 6, 125, -71, 36, -85, -28, 64, 94, -67, 22, 44, -149, -105, 20, 80, 91, -24, -116, -9, -225, 91, -35, 33, 184, 18, 112, -325, 93, -73, 10, -162, -19, 117, -56, 114, -202, 178, -53, 170, 36, 62, 39, 297, -6, -130, -22, 102, 56, -111, 148, 54, -42, -297, 178, -27, -11, 19, -6, -66, -101, 50, -59, -264, -117, -45, -181, 27, -155, 107, 34, 22, 15, 33, -13, 6, -50, 126, -2, 175, -183, 48, -53, 216, 233, -51, 142]
5702A42j47j13K36q3j89R4j73M2J52JJ55j8N5l96J49m2P9J67j21J46j84J88l22
5725a82J08J46j00J54j8k01j70K83J62j97J41j18K12l3k20J90k22L3P6N0j07M2
5747B9n8l0n6J89L1L0M2r3o0Jo8j59K50J46K4l83K21J31j97J1j6N4j3j07J27O8
5773A14j81o3J67q2K23Q5J06m16j49Q1M5P4k8J18l0O1K5o9k04K13k22K59j46P7
5797E8j16K91j87l4J03m8j60J10M1q1K58k90J65k3k6r8K14k09J72j42J3m9j1J50
5821A01j12J2P7J30k45j35L59k23J76j9p6J1J27m61L16J27k78J73J21j65j01K46
5843A61j16N9j29n7J01j3j01K01k9L5Lk05K64j68L9J1l53K71O2k48J47l2J00j70
5867a67L16l07J00OR2Q8k32K20j54J71j31p9K17Q4l33K60j46j97m1L60p4l38M08
$$ y = [142, -5, -118, 118, 35, -154, -60, -233, -191, -39, -38, 117, 99, 154, -242, -93, -135, -56, 111, -10, 136, -48, 140, -182, -74, 72, -28, 126, 108, -93, -263, 20, 182, -15, 126, 8, 220, 187, -33, 157, -65, -32, 44, 94, -13, 29, -29, -59, -115, 74, 105, 135, 177, 84, 24, 25, -43, -202, 48, 194, 218, -165, 56, 187, -10, 1, -15, 39, 26, -81, 46, 114, -67, -130, 37, -45, 178, 263, 369, -47, -196, -115, -70, 4, -24, 94, 64, 125, 150, 81, -123, 90, -132, 127, -19, 58, -58, 233, 46, 12, 115, 67, -93, 17, 58, -23, 235, -55, 110, 87, 61, -37, 177, -32, 140, -2, 11, -38, -49, 101, -11, 1, 78, 208, -37, -172, 187, -36, 140, 121, 45, 56, 183, -278, 38, 165, -113, 60, 181, 16, -85, 161, 45, 104, -25, -82, 19, 6, -95, 106, 77, 112, 115, -90, 174, 6, 45, 56, -297, -26, 36, -212, -65, -97, 3, -167, 149, -158, -58, -52, 40, 128, -104, 116, -38, 133, 2, -77, 140, 224, -109, 151, 5, -192, -233, 127, 53, -285, 123]
5890A23j25R3l64L59mm4J90k27l4J5J63k04J95q7K32k85r0N8O0J70k27l59M77
5913H5j28k2J62m1L7j89K98l97M06k15K06j83j29J51j20N3K29j25j20j56J81K28
5935B11l25P9q9L63j39l44J21R6K47k11J1O1r6j67J07J42r4O0k9K64k53K3J8M6
5959A02j03o7J06P2j9K5l11R0J39qL80n78L24j5p6j4J04l16J81J45j05p9n3J66
5983I0J22l08K32j43K26k27lj19J89m4n3k19K27MJ61q3j77L67k56p5K82j92K4
6006B5o9J15k3k11K88j03q3j31K59Q7j14r1J87j02j55J9k00K54J90K3j01O0k29
6029a05j24K63m5J91k31J12M0j62L8QJ2J12l51R1L16k30n5J65J03k48J14n2L0
6052hM6j84K0R6K83l02Q6J32j86J7K9k2k95K81m7K13Nl76J92j53J96j04P7o8k56
$$ y = [123, -2, 91, -273, 86, 82, 38, 228, 1, -33, -18, 145, -59, 136, 49, 281, -4, -94, -36, 24, 194, -33, -392, 85, -43, -65, 97, 56, 93, -96, 202, -195, 211, -4, 202, 19, -110, 41, -79, -26, 203, 78, -42, -198, -17, 211, -114, -35, -124, 239, 100, -244, -123, -27, 220, 9, 20, 81, -15, -182, -75, 67, -27, 33, 4, 268, 15, 38, 56, 102, -1, -68, 38, 110, 91, 116, -195, -105, 34, 26, 406, -172, 152, 137, 61, 47, 151, -165, 16, 161, 56, -23, -76, 90, 212, -96, 136, -7, 219, -8, -11, -130, 59, 15, -38, -257, -30, -26, 135, 52, -125, 242, -14, -89, 193, 1, 25, -44, 71, 48, -163, 125, 22, -61, -192, 67, 154, 40, -51, 136, 34, -121, -102, -302, -48, 142, 165, 64, 124, -105, -229, 34, -11, 180, -51, 61, 101, -61, -23, -15, -3, 109, -242, -151, 165, -65, -120, 45, 148, -100, 14, -38, -8, 38, -146, -126, -30, 253, -49, 37, 169, -17, 0, 29, 7, -288, -7, -54, 159, 164, -212, -20, -173, 23, -81, -4, -72, -328]
6077c28K50N5K3j22J29k49K21N7n3p6k2J18l1j50L21j01j34L8k11J84o3K46j3
6100H9K18l48J62k01K2J20j57J5L70l47r4J37l60M60Q7p7j48q7J30N0k7n3K26
6123A87k71J29J4R2j46k6R6Q9o8k05J57Q8n5p8L5K7j74Q4J98K4j41or5L4J16m48
6149c43L48K4J7m9O3J40k32L5k63M18j11K67k63l7J58n07M41l62J27l7L69k65
6171f2K80k16M3m0r0N0R8m5k38M05k83L04m31L23k75K68j83j40K42j56L31j01
6193H4k66L87rj35k55K30j78R5JJ32O0l21J97L41l45m6j77Q0J70rj01J78j0Q2
6217A85j62J25l62J73R6l4j95J89O8J4j10j42K20j43K28k68m8K38J7j84%%J57
6240F2j98L40M3k86j8j47J24J13J3l59K00KJ50N9L7j44p6l7K08k21L18l2K4p2
$$ y = [-328, -78, -23, 0, -122, 7, -242, -21, 36, -17, -93, -115, 3, -28, -178, 143, 42, -92, -54, -265, -81, -144, 102, 89, 307, -41, 121, -80, -58, 62, -95, -80, 290, -57, -151, -14, -374, 86, 173, 96, -52, -139, -9, 41, 14, -39, 187, -84, 45, 59, 151, 5, -21, 75, 164, 96, -109, 48, 136, 81, 3, 38, 65, -109, -25, 173, 197, 56, 50, -45, -11, 105, -343, 5, 29, 46, -3, 60, 200, -32, 3, -260, 158, 47, 314, 51, 14, 172, -335, 106, -256, -129, -166, 203, -62, 218, 2, 45, 5, -85, -35, 63, 18, -220, 185, -98, 206, -225, 98, -177, 91, -92, -232, 10, -146, 185, 84, -182, 205, 196, 61, -194, 36, -142, -47, -46, 86, 146, -175, 22, 363, 18, -28, -205, -125, 45, 36, -65, 113, 103, 185, 23, 148, -214, -41, 55, 21, -174, 15, 83, 97, -13, -155, 65, -78, 150, -118, -166, 72, 89, -95, -95, -95, 62, -136, 204, 247, -39, -57, -204, -80, 33, 46, -313, -113, -111, 39, 98, 135, -9, -85, -122, 86, -135, 183, 151, 175, 103]
6264A03o7r0O7q2Q9J81J53J4j47m7j82j5J33nN1n7J09j31k15JJ83j50oQ3k24L57
6290A06j02m4J3J69k31K79l1r2j99j91P7K07K09j76J37j28l3K32k74Q1L6K8K02
6313B75m16K60k45J68n7R0L8q2o2P8J18k23J29L9J5j66j58J12N4q9J43j34J83
6336G0j27j27K60k52J35K15m59J97J13J81l20J56l2o9Q2R9M5l10K87k82Qj1K7
6359a14K00j16j30K50k51K19R9j14R5p4k25N0J32j88J81M7NJ15m57M05K4j4l22
6382a83L59k04k8J36j53k0J51j33M4M9LOj22K21J14j98o8K23k39k4K06P4m65L26
6406G5Np5k28L57k32O4K5J99k72m7J05p2R8j44J08j70L66k58O9L53n07J55n0k35
6430c11K35k44M97m5k15J28j52J72j30R1o3j95j3k0J62M1r8K09n6j57K12k10J91
$$ y = [103, 36, -54, 13, -69, 20, 201, 354, 368, 221, 174, -8, -23, 110, 105, 156, 99, 208, 77, -138, -137, 46, -104, -110, -27, -251, 106, 4, -40, -27, 142, -89, 190, 159, 67, -132, -323, -246, -39, 170, -6, 131, 3, -30, 202, -72, 9, 45, 73, 275, -141, 119, -126, 42, -15, 75, 113, 31, -31, 47, 165, -58, 71, 110, 125, -41, -199, -87, -33, -122, 21, -113, 70, -57, -184, 76, -176, -41, 174, -285, -88, 25, 206, -114, 42, 10, -59, 23, 122, 167, -143, 144, -138, -130, -141, -114, 86, -30, -160, 90, -161, 58, 157, 43, 138, 64, -161, -111, 21, -167, 14, 61, 66, 181, -276, 129, 153, 139, -183, 176, -28, -56, 80, -73, -93, 58, -75, -31, 18, 21, 27, -95, 126, 240, 42, -26, 197, -42, -66, 140, 214, -251, 75, 80, 5, -223, 134, -98, -34, -9, 190, -82, -129, -24, -96, 2, -142, -34, -204, 162, -96, -27, 326, -181, -26, -76, -311, -76, -320, 177, 132, -83, 45, -107, 65, -65, 26, -37, -232, -245, -265, -103, -62, -160, 49, -7, -164, 48, -162, 29]
6453B9l7j30J53J96k34l1l1K73l1m06K6J29L32l65O2j25J36l1M5qJ48oj00J27
6477A21L2k20J62j23K48j49j77L07j87j87P6K25m6K10l7l87J26m9K02j14J3j57
6499a11J40M1k9N4k08J59k9l0J24mk08L2j66J97j10L5J05K96k25k60J14K41l0
6522A28L1l75J49M5o5Q9L0k2K21L1n07J06J05J70k22q9K05l7j25R5J86j89K04
6545A64j10P0j06K40j89k32L79j23k89N11k58r4L01k49p0J58J41j15j36O6pj13
6567f1R4J31j36M9m3LN1j09L68j21j15l5K7o4l4j08J9O9k6J7J43J9J0j94j0L63
6593C07k61j9K99l99%K31J11o2j67j0J13k79K72j73O2J33k63m6K77Q8j50n9j74
6616a69J14N5k4k18J8L15K8k51M41n45K15P3Mk05J54j87R2j9J92k92K25j26j18
$$ y = [29, -8, -138, 15, 211, -23, -54, -85, 188, 157, -249, -223, -94, 238, -127, -65, -190, -54, -85, -40, -48, 100, 94, -6, 121, 153, -67, 95, -28, 220, 71, -106, 201, 14, -173, -97, 128, 82, 292, 255, -132, -6, -55, 147, 33, 46, -111, 29, 70, 41, 95, -113, 46, 17, -13, 111, 107, -101, -69, -235, -38, -148, -113, -8, 288, 63, -197, -83, 158, 128, 159, -216, -67, -22, -87, 2, 32, 10, 231, 262, -245, -139, -34, 136, -86, -175, 30, -7, -132, -37, 149, -40, 164, 54, 124, 18, 258, 69, -163, 216, 93, -196, 315, 57, -37, 264, 15, -55, 103, 244, 129, -7, 59, 52, -61, 33, 164, 28, 77, 34, 37, 88, -21, 347, 226, 111, 76, 103, 39, 5, -103, -84, -15, -41, -24, 119, 138, 148, -46, -56, 307, 46, 27, 326, -73, -73, 158, 269, 207, 40, 30, 143, -136, 136, -37, 25, 158, -105, -151, 126, 214, 64, 5, -169, -55, 0, -24, -242, -224, 91, 119, -132, 309, -236, -21, 52, 56, -149, 5, -182, -90, -109, 83, -209, 16, -110, -228]
6639b28K03p8J79M9J16k20j50K72k82P9pJ98k08J63J06l12L2J39k47L58J9l21
6661a40K26k02J06O4n2n8pM1J42k49L16j69J11r9R5j54kL2j22J56J2r2l12K18
6685a39J86M4k45LJ62p0M4q5Q3L3L00k38O0n7j97P0O1%k33J74J77mq8J78n28J73
6711a36K53j39p4K07p4j80J24R7O0j57k1J52j95K71k39K5mj8p6P3P1j16j0N0R8
6736D2l1J33j81P8n36M99j16M39l26j31K33K7M9l43N41p15M93k25k5M7J62N0k12
6759d8J16L2l5o0lq8J03P1k31P6O0j43N3l03R4J08K33J78k69J35J2j29P4j18Q8
6784Fj6L7j78K2L2K34k25K64j1j36j16j65J99k28J61k06K96j38Qk1J64j15J19
6807a3k50J30J08j05N0J93m4n1rJ78k03K5J4J27m8Q9j37nj29l8J14nl8P3k81p
$$ y = [-228, -25, -103, 76, 125, 241, 21, -129, 143, -139, -60, -67, 131, -77, 86, 192, -120, -88, 51, -196, 162, 181, -140, 86, -116, -10, 54, 2, -56, -63, -22, 120, -129, 187, 18, 129, 30, 125, -29, -31, 1, -121, 35, 47, -45, -357, -139, 47, 91, -154, -151, 11, -59, -15, -100, -17, 16, 316, 78, 138, 81, -116, -46, 15, 15, -218, -44, 133, 129, 41, 219, -309, -136, 117, -22, -96, 111, 37, -143, -19, 78, 138, -19, -40, 112, -83, 188, -51, -26, -30, -48, -124, -51, 20, -96, -106, -56, 42, 11, 144, -37, 41, -495, 4, -112, 327, 1, -130, 103, 130, 179, -164, 377, -338, 155, -70, -95, -48, 114, 164, -48, 68, 100, 65, 5, 2, -86, 17, 88, -143, -67, -7, -150, -97, -400, -306, -198, 35, 213, -56, 79, 91, -38, 36, -82, 6, -10, 27, -151, -129, -97, 137, -88, 176, 165, 29, -87, -252, -53, -281, -120, -326, -30, -168, -160, -181, -17, -132, -13, -263, -133, -25, -130, -80, 113, 69, 18, 9, 187, -16, 9, 23, 150, 102, 191, 54, 49, -80, -118, -4, -9, -47, 26, -255, -262]
6833b62K45J30o0j75J04qJ05L5j60j19J3K88j10k3l4l0J15P3O7k99J31J9k04J90
6857C1q6Q8j12nK73l01J77q4Q3O7j77J6L1j40P9J78l10L98m27J88K15k86J92p3
6881A5P2j20K02l46o6N6J79nK3L0j43J43O7j60L3R6j87k7J71j44J41k20P4L03
6905A87j92K35j89k03J09L4PL00o8m6r4N5OK9k15j95J31K00j40N7k1P8j23J7k80
6930c21L84q2L25j86k18J10n6O9p6k04L56m8j17M17k93L3NR1l06K55q7k06K27
6953G2p7RJ83j90o5j0L5p3J43k6R5j78J19R3O9J06l62Q0K38k87J91r8j62J51j19
6978f3N1J94j07j37L94l13q7J71P8m4r9k17K24J98j53j09n9K52l22J70MN6k54
7001a72L37k58Nq5L39K4k68R7r0N5MJ62n4o2K9J4j23Nl4j50J18J39J4j5Q0p3q5
$$ y = [-262, -17, 113, 53, -122, -18, -26, 79, 114, -46, -165, -152, 136, 26, 3, -31, -61, 54, 127, 194, -105, 26, 45, -159, 31, -55, 33, -79, -84, 189, -112, 65, -19, 64, 131, -46, -30, 1, -139, -60, 118, -192, 206, -221, -33, 182, -104, 88, 15, 87, -33, 169, -177, -243, -187, -8, -13, 10, 40, -103, 40, 107, -53, -20, 76, -111, -138, 33, -111, 30, -190, -116, 187, -5, 230, 41, -162, -53, -19, -12, 288, 220, 174, 80, 135, 141, 170, -45, -240, -109, 91, -49, 8, -13, 65, -58, -41, -321, 63, -19, 306, 120, -98, 12, -44, 25, -51, -255, 101, 53, -64, 353, 60, 93, 98, 189, -117, 138, 51, -155, 72, -5, 4, 187, -3, -68, -78, -43, -116, 27, 1, 96, -82, 37, 130, 199, 305, -57, 23, 261, -26, 165, 67, -95, 56, -63, -12, 182, 75, -62, 332, 19, -68, 103, 181, 137, 38, -179, 45, 243, 90, -19, -78, 174, -148, 22, 26, 82, -172, 165, -93, -88, -173, 166, 190, -78, 19, -71, -16, -12, 150, 96, 34, 63, 77, -46, -41, -75, -225, -107, 32, 46, 31, 111, 38, -47]
7028d7N2p7K89j69J71l96K78k13J05J3o4J97q5o5j1K5j97K57j04j5J36Jj45l0
7052i4J98j73j19L90k01J08p1m0M7j33n7J34J84J27l99oQ2O0j77QJ76J25k4O6
7076B11n2k01o5OK7M4J12Pj29l9K55p3l53M10l27J8K16K25m23J68p1J66k78K32
7100H6p4j99J96l4K56j92j47K13j80J75j52J84j27K25j99J9k60L46n8j49n7L44
7122B16n23K13K54N0j33j48K27Ql67K27J11q2j87o6K01j16j25K92P1j13K6lJ88
7145B21k32N0j22M8Ro5j25J73K12k20J73j24N5j71L8K0J38jk69K07L2O8jk80o6
7170b32L27j10k08L80l48L73k4k91K15k82K81J66j16k57K22j62j4k5L24r1k03
7191g5K5l7Q7r3J91j09j6L7Oj17O5J11P6N1k81k9K74l24K38j65J1j9O8n6K61r1
$$ y = [-47, 5, -72, 217, 48, 219, -177, 101, -112, -7, 6, -58, 139, 54, -11, -22, 3, -194, 63, -41, -56, 80, 81, -64, -94, 104, -69, -188, 202, 1, 109, 38, -2, 45, -88, -145, -11, 173, 300, -99, -105, -23, 37, -140, -132, 44, 169, 145, 211, 159, -42, -107, -101, -74, -30, 82, 89, -40, -79, 176, 103, -250, 160, -167, -149, 67, 292, -131, 37, -34, 132, -146, 86, 12, -187, 9, -25, 231, 39, -108, 105, -75, 100, -52, 132, 5, 230, 31, 50, -210, 136, 78, -71, -128, 216, -307, -94, 160, 210, 77, -71, 156, 164, -203, 24, 135, 53, -134, -200, 1, -115, -240, 52, 123, 10, 36, 33, 221, -11, 39, -83, -35, -26, -91, -216, -43, 169, -51, 122, -2, 53, -118, -80, -60, 78, 77, -192, 15, 47, 115, 114, -166, -232, 95, -15, -223, 157, -191, 182, 158, -133, 82, -200, 81, 247, 131, -126, 96, -66, -80, -105, 219, 128, -75, -50, -87, 0, -93, 98, -11, -27, 10, 16, -101, -36, 75, 151, 202, -79, -108, 166, -158, 80, -85, -74, -93, -25, -81, 180, 89]
7217H9o3j7J10L7k16J58n7M0l12L61j93J79j06L0k66L70k04J67j21J38q3j25J35
7240E1j69J49m8K16l54J85p0O9K36j88k05J36mK28q0j71kP6j59K30J33l75K84
7263A68j87k86J96J6K0K19j31j97K25J39Rl64L79k78L0J54j18K68k59K18l69j8
7285a66K37j52J9Q3O3j11J91l1k16O4K04m95L84k74n1L58L4q1NJ46k97J12j48
7308a22K34j52j5O0K5J44n1j16r8O5n7K49p8Oj82j1kJ11j71J69j61J29J01m1l56
7333c20N89k40J58l17Q3o1l4K27k28J40k7J12k60L27j53K08k10q0J04JJ29j48
7355@L18l05n4o1K36j51N3j1j87R7L00j76o1kk58K73J82n1k03j67K62M3k21K06
7379F2j22J55J75m4k41j76J15J40m49M49J51q9l9j35j12J58j4j68K82r4n3q0K61
$$ y = [89, 26, 9, 119, 156, -60, 98, 41, 81, -231, 130, -63, 116, 10, 40, -226, 144, -60, 107, -14, 124, 41, -84, 51, -118, 31, -17, 199, -155, 30, -40, 29, 265, 77, -128, 8, 4, 232, 152, -19, -21, 55, -104, 126, 259, -116, 168, -19, -305, -109, -93, -73, 146, 15, -182, 43, 182, 191, -173, 206, -72, -42, 112, -6, 262, 3, 221, -148, -166, 71, -81, -62, 21, 84, -27, 164, 133, -83, -19, 185, -310, 74, -200, -251, 107, 141, 60, 65, 211, -86, 26, -122, 112, -40, -55, 5, 30, 174, 123, 7, -91, -26, -83, 166, 88, 94, -88, -99, -101, 10, -161, 8, -153, -24, 77, 36, -320, 269, 29, 187, -130, -47, -108, -142, 85, -143, -3, -30, 82, -178, 149, -4, 204, -6, -86, 18, 19, 148, 0, 318, 13, -41, -102, 134, -17, 36, 25, -162, -65, 235, 59, -2, -4, -262, 11, 193, 142, -61, -228, 34, 77, -144, 62, -60, 95, 270, 226, -15, -191, -76, 64, -385, 64, 215, 126, 87, -48, -160, -2, -16, -184, 98, 4, -49, -129, 132]
7402A32k99K97k88K97j09q5K10k9j6j1j08M8r4J38k96J38k05J76L0R3k02lJ43
7425d3mj8P5j05J25Q7k21M3k5P1J93J06m50L46k13O3l26M37k1R7j62m3p9J8P9
7450C0j23J44r8O7l01L67K8n0o3K73m36K69o9j72R7n9L22j89q4k62J12J94M9j80
7474a34L19k7r9p1J35j57q2n7K76l18J77K46j48l45Q4M07j55n0j77K74q3Q1l34
7497b38J97j5L0M0O4l13J35mK24N3j74K77l66l0o8Q2L23k07OO0kj74J59k50K03
7522A2k63L38j08p4J45k19l5J73K47n0k65OR6q8J68k78L63j77n5nJJ00J34j84
7546a8j42K76p3j48L1LK08r6j05L11l44j11J89L2j77J89Jj05L00l34J24m4M9M9
7570F5M4q2L1mj8P0j22L69l50Q5M1j74K11j29K13l83L27n2J30k79k05J65J50j47
$$ y = [132, -167, 130, -158, 139, 30, -55, 155, 126, 110, 99, -9, 39, -55, 83, -213, -75, -280, -104, -74, 19, -183, -186, -43, -47, -65, 10, -95, 30, 117, -104, -61, -86, -15, 178, 284, -166, 180, -33, 30, -296, 141, 120, 217, 55, 12, -67, -49, 30, -93, 51, -47, 20, -281, 86, 114, 64, 1, 274, -162, 107, 38, -134, -37, -96, 226, 37, -47, -309, -197, -3, 46, -134, 185, 158, 59, -12, 123, -34, -116, -173, 103, -215, -38, 208, 60, -285, -201, 206, 51, 1, -176, 98, 15, 96, -238, -41, -56, -26, 14, 78, -235, -100, -104, 120, 173, -1, 276, -90, -120, -188, -106, 217, 10, 16, 76, 74, -100, 59, -191, 12, -251, 87, -21, -95, 50, -169, -204, -31, 216, 166, -99, -93, 3, -85, 83, -195, 168, -9, -64, -69, -68, 32, 166, -18, -160, 116, 43, -105, -74, -71, 137, 41, -64, 247, -97, -208, -19, 13, -164, 25, 26, -79, 221, -113, 11, -33, 16, 65, 109, 27, 58, 54, 36, 106, -16, 353, 3, 88, 129, -45, 166, 37, 250, -133, 194, 142, 272, -7, -212, -47, 103, -44]
7594d4k9Ko5J36K87l90N0n4K7K20k14j05L14m6k72J42j83J51O9J2J54pl95J59
7618h1l32K12L32j68J13N6j69J8J91l22O3J05n8J80M7k38M0p0L06m1j13j14j46
7641a89J61P7j37l5K25k00j00K01j55k5L19j32ML9l21M03k19N8r3L00k31R6o5
7664a9P3j51k83K62J11p2J0R9J35k20J77m9N2J2j02n8J56j01Rl5O8J79j94j14
7688e5p8L4j77j3K00p9K00L3qN0j35K8J14q5r0K5n1J41k43k4J45L06j52p6l4O8
7714D4k12J31m1p4K12J01m2l5J5k14Q9k01K50j32Q0L1p7J92j68RL6K5pkK02j47
7740F5J80k74QJ02k08L3M0J20l14J83oPp0R1J2q3J7J79L2j63k3M4j21P1J91K6
7766A39j51nJ11J52j20j12Lk05L70o8k53n9J98M1j74K52rl20L7L07j96J10j20
$$ y = [-44, -73, -71, -136, 0, 287, -103, -53, -107, -80, 140, -74, -179, 135, 89, -183, -41, -224, -73, -4, 8, 162, 155, -240, -81, -413, -201, 131, -37, 76, 132, -37, -19, 172, -150, -87, 18, -40, 140, 187, -51, -11, -81, 225, 184, 71, -43, -189, -28, 49, -88, -123, 102, -98, -198, 3, -152, -177, 142, 10, 14, 53, -268, 135, -84, -26, -119, 181, -50, 46, -19, 54, -97, -380, -118, -7, -79, -69, 30, 165, -55, 122, 73, 125, 137, 35, -23, 133, 32, 41, 6, 74, 253, 59, -55, -133, -99, -276, -289, -89, -168, 32, 65, 57, 107, -28, 0, 114, 29, -61, -36, -87, 54, -189, -213, -68, 238, 86, 10, -24, 44, -168, -37, -78, -152, 60, 161, 119, 84, 99, -115, -26, -227, 23, -109, -29, 2, -75, 117, -51, -42, -6, 19, 12, 10, 212, 65, 245, -29, -21, 81, -127, -94, -54, 66, -248, -65, -71, -64, -134, -43, -31, -114, -97, 82, 114, -49, -72, -28, -149, -78, 113, 139, -12, -17, 94, 246, 126, 14, 17, -188, 182, 114, -139, -198, 0, 41, -133, 119, 110, -210, -173, 134, -62, 48, -72]
7789g2n0J83j54L8J51k11n5K36k13K77j49J80j20l0k7K01l51K83k01K48l57K90
7811I7rO0J20k50M8k01p2P8l8K33J49l49K15J29m53J19J54q8J49k64K08j48Om2
7835a49K31q8j30K47O8j38J63k81L1J15o0M7j76P3Q5Q4J29j62j22Nk59L46M3l22
7859b20K30J12q7q5j84L40k80K48k01J70j24JOM9ll8m0M21n87L31j37K50m14K01
7883d1K41k95N6Q9j86L1O3r4J29k4P6k39M72m11K68j95K27k57K27k96J16l3j29
7906b05Q5K17j85l3k85O10j03q5k6L09j29k67K11o5R7k66j45K83k65L96j26J8
7928D1j80J12L8J50k30N0j00n3J06J16j38J35k21P8R7j39K20p5P2k07O7J58k23
7951a26Q4r4K3J56J37j99m7L3m1j39M01Rl10L05l41m8J93j91N30m90R5J19N4j24
$$ y = [-72, -122, 61, -93, -55, 96, -115, -170, 66, -147, 130, -19, 161, 41, 11, -16, 185, -166, 117, -84, 164, -193, 97, 88, 148, 268, 18, 66, -135, -207, -129, -167, 66, 215, -134, 81, 210, -243, -124, 30, -58, 91, -173, 35, -113, -107, -149, 82, -6, -136, 111, 179, 41, 204, -77, -46, 69, 9, 56, -120, -47, 38, 122, 251, 89, -33, -28, -287, 59, 102, -220, 10, 122, 35, -50, -234, 106, -174, 74, -127, 43, -81, -80, -74, -25, -28, -66, -106, 315, -272, 59, -78, 172, -242, -41, 200, -95, -39, 50, -136, -105, -42, -136, -7, -31, 45, -194, 278, -133, 135, -60, 167, -90, 137, -159, -43, -76, -205, -120, 97, -88, -121, -406, 204, 101, 16, -10, 299, 170, -97, 114, 49, 146, -120, -265, 18, -247, 149, 23, 41, -139, -27, 11, 161, -69, -19, -119, -172, -66, 50, -88, 47, -174, -96, 1, -138, 82, 7, 79, -128, -61, 97, -126, -42, -136, -113, 43, 180, -19, -66, -33, -74, -213, 188, 197, -113, 192, -149, -197, -4, -195, 335, -155, -60, 59, 113, -11]
7975a1r8K37j37j0J65j53o0j2J10j81J95K39k81K1O0j85J64k5k76J44K18r6j82
7998a54N12k37l08K72j40N4J5j34m9K13K69m87L1N6L0J58r2j46L75m97J84R0r5
8021h0j0Q0m0K08P1k49R6j21J85j27o5j8K02J34l14J50k79J10M2j46J37r1L2K17
8045A24l05L68k54J32n9j42O6j53L43p7N2on6j1j37K45J39k91k2Q2j50K1O9k92
8069c14L86n4p1KJ99K6j27J15l14P7o5J05k2j22M73l01k10L03j52J26Nj24m0O0
8093c9J04qk34K70j75J79J3J27k81N5RO7j82j3K9J54k16K1r3Q5J40l8k1j41K77
8118H9N4J51l10Q2M1K5Q3k11j8n0j55L52p3o6J20q5j48J03p1J7K51j41J22k89
8142a27P4J1K65k75j46L96m90K94oK68k52q5j04K03o7J06o3j79J59l2m1K8p6K06
$$ y = [-11, -109, 128, -9, -19, 146, -7, -67, -79, 31, -150, 45, 284, 3, 24, 84, -101, 63, 38, -238, -94, 124, 28, -154, 358, 121, -187, 85, -55, -1, 14, -120, -169, 44, 313, -174, -143, -87, -57, 101, 9, -137, 238, -259, -75, 15, -80, -90, -10, -50, 158, 229, -20, 76, -45, 140, 13, -52, -70, 132, 266, -48, 102, -177, -67, -25, -171, -34, -125, -93, 124, -181, 187, -67, 65, 6, -136, -70, -223, 120, 43, 95, 89, 33, 22, -115, 130, 269, -22, -44, 38, -112, -91, -22, -314, 72, 18, -53, -51, 148, 174, 47, 162, -152, -75, -140, -35, -57, -179, 294, -7, -217, 86, -66, 60, 65, -59, -99, -39, 65, 57, -177, 93, -82, 97, 110, 237, -44, 11, 20, 87, -95, -108, -79, 75, -141, -120, -213, -128, 12, -26, -47, -188, 89, 143, 294, -16, 66, 107, 132, 215, 4, -14, -64, -219, 133, 60, -6, 114, 29, -119, -16, -87, -70, 181, 40, 162, -127, -53, -42, 223, -52, -198, 198, -292, 2, -4, 264, 12, -73, -177, 26, -41, 65, 2, -177, -18, -50, -91, -63, -139, 67]
8166F7j05k14K00r5L42l98J83K1j34N3J90k1j3J2j17j81J12p8K31j9n2J64Ol08
8190a54J86
$$ y = [67, -38, -252, -52, -147, 195, -203, -20, 1, -133, -80, 110, 89, 76, 88, -29, -210, -98, -176, 55, 36, -16, 148, 154, -154, 32]
8191C2
$$ Imaginary data points
##PAGE= N=2
##DATA TABLE= (X++(I..I)), XYDATA
0@%%%%%%%%%%%%%qJ6j6J6j6J6k4L2l2M0m8N6o7P5q8J04j20J36j52J74k00K24k51
36a33K82l17L55l95M40m89N41o00O64p34Q10q91R82j083J192j313J448j597J766
55I28j954K168k417K706l046L454l954M587n414O541q181J0796j5613K7335j07200
70h9264j44295J89811P7069O3064J44733l728j05630O1935p751j25002L8898J06101
82B05941j9432L2855k0105k25015j17172P6804k2252j6112Q1180n6543j00552
93a80403N1308l4471j24652O4883J27721K8842Q2697L8616j24477j8526J17634
104B9172J6893L0500J08565j3441l2608O4104o3202j32899M2663O4545k4779L5952
116A25465j3949j55577n0997M6245n7055k3536O7817j6843j2219N6423o5001r5657
$$ y = [0, 0, 0, 0, 0, 0, 0, 0, 0, 0, 0, 0, 0, 0, -8, 8, -8, 8, -8, 8, -16, 16, -16, 24, -24, 32, -35, 40, -48, 56, -64, 72, -80, 94, -106, 118, -133, 149, -168, 187, -208, 232, -257, 284, -316, 348, -386, 424, -467, 515, -568, 624, -689, 759, -838, 928, -1026, 1142, -1275, 1431, -1615, 1839, -2115, 2472, -2942, 3599, -4582, 6214, -9399, 17936, -89264, -233559, -43748, 33321, 96385, 241118, 237390, 131760, 193695, 185944, 60942, 99840, 205941, 186509, 219364, 199259, -25756, -142928, -66124, -88376, -104488, -23308, -79851, -180403, -129095, -163566, -288218, -223335, -95614, -66772, 15925, 54541, -69936, -88462, 29172, 46065, 76565, 185130, 171689, 139081, 203185, 139983, 7084, 49747, 114292, 89513, 125465, 111516, -44061, -95058, -48813, -105868, -129404, -61587, -78430, -90649, -34226, -99227, -194884]
128a94884O3641O6892J4651Q7170K9742q0418J7877N9704n2424r84Q4453O021
140A01441Q441M9074p4469j01284K4839J6519j6197M8957q1p6107R26N52q6573
153a03962j2561O4049N086K7223N3356o3978p4639L6186J9897J210P0813L4345
165E7025k8326J8655m020p3373l087N6370J4856L8389L8910o9484o7162J4037
177g210j5548j5000N9877K4797k7183Q736k3460p8992r608M5225J9218L9864L4173
190E4889m8233m4002N253k0496r20O1622K8338m867J8168k7894o9198l284L5627
203a4997J5070L7703L2219l5113l7638p642k6305l892M6565K6147O950J3026l4069
216A8024n7165m800J7213J0389L9135K9906k6325k7577j1544l1386q387L8624
$$ y = [-194884, -131243, -64351, -49700, 37470, 67212, -13206, 4671, 64375, 11951, 10967, 95420, 101441, 109882, 158956, 84487, -16797, 8042, 24561, 8364, 57321, 57240, -18867, -17941, -17389, -103962, -116523, -52474, -47388, -20165, 33191, -30787, -105426, -69240, -49343, -48133, 22680, 57025, 28699, 47354, 43334, -30039, -33126, 23244, 38100, 76489, 115399, 45915, -21247, -7210, -22758, -37758, 22119, 46916, 19733, 28469, 5009, -73983, -83591, -38366, -19148, 20716, 54889, 6656, -37346, -32093, -52589, -53509, 8113, 36451, 31584, 49752, 21858, -47340, -50624, -14997, 73, 37776, 69995, 34882, -2756, -10398, -36703, -40595, 5970, 32117, 39067, 52093, 18024, -39141, -43941, -26728, -16339, 22796, 52702, 26377, -1200, -12744, -44130, -52517, -13893]
228a3893K7914J2976J1413k6168m3841j0326M264J1800L8730K6684j0133j2601
240A6819j5015l3716p051L1301K3890J6978J7693j7232l7371j6587m423N732K7506
253H524K4523J548r356k3032l3525j1236J4507J6702K2709J9490j2682k9373j7175
266b8376j1936L70K6881L0254J2607k063j6655k6206j5312O570K0446K7767K0520
279D4867m058j9908k2300k1710m048K1357K4691J3694J234j6322l0599k3746k125
292c8973J4565K2276K0734M868j5114k4711k1401l806J5912K4124K3939J1397
304C3810j0778k3478j9236n117J0897K3265K5592J0341j2001k2940k2751j2688
316b5084N171K0839K2756Q530j0501k2272k4595j5842L996K1301K3703J1963l985
$$ y = [-13893, 14021, 26997, 38410, 12242, -31599, -41925, -37661, -25861, 12869, 39553, 29420, 16819, 1804, -31912, -38963, -7662, 16228, 33206, 50899, 33667, -3704, -20291, -24714, -18982, 8524, 33047, 34595, 25239, 2207, -31318, -42554, -28047, -11345, 11364, 30854, 18172, -11201, -28376, -40312, -39942, -13061, 17193, 29800, 27737, 11082, -15124, -30436, -23866, -3420, 24347, 44867, 40809, 20901, -1399, -23109, -27157, -5800, 18891, 32585, 33819, 17497, -13102, -36848, -38973, -24408, -2132, 18602, 23470, 8356, -16355, -37756, -41562, -25650, -1526, 22413, 33810, 23032, -446, -19682, -24799, -13902, 9363, 34955, 45296, 33295, 10355, -12396, -25084, -19913, 926, 23682, 32212, 21711, -561, -25156, -40998, -37002, -15701, 8002, 19965, 15980]
329A5980j7039k3294j4424O736K2003K4702J7320J202j5709k2499j5448K890J7970
342C90K1861J6341J123j6898k6857j8659j495R431J8358J8847O47j8040k1473
355a6424j8366p280J2513K2948J8550O879q260j9611j6089k417R618K2574K5637
368C0272P141q574j3469k0008j3346J1186K0035J3508R119m713k4132k3910j0272
381b7163p90J3644K2198P198p725j2264k3968j6857J0192J7309J4900K1295N014
394B2983k0193j5310l864l589J5232L0768J2477k115m103k2084k1315M841R324
407C052R559K0725J196k4824j5908j3688j8541Q381K6690M905o11L236k3816k4952
421d4596P549Q970J0029L1013J2301j5192n181p754j7234J3748K9219P001R845
$$ y = [15980, -1059, -24353, -38777, -32041, -10038, 14664, 31984, 33186, 17477, -5022, -20470, -17580, 390, 22251, 38592, 39715, 22817, -4040, -22699, -24194, -14763, 3595, 22442, 23089, 5049, -16424, -34790, -42070, -29557, -6609, 11941, 18820, 10560, -9051, -25140, -27557, -17939, 4635, 30272, 37413, 28839, 15370, -4638, -17984, -6798, 13237, 26745, 35864, 31151, 7019, -16891, -27163, -27953, -14309, 7889, 15087, 7362, -4902, -28870, -45727, -35535, -18226, -3326, 17969, 22983, 2790, -12520, -16384, -19973, -4741, 26027, 38504, 36389, 32286, 10202, -11113, -6272, 3052, 12611, 33336, 34532, 9708, -6200, -19888, -38429, -30048, -3358, 1547, 936, 4172, -19644, -44596, -37047, -28077, -18048, 12965, 25266, 10074, 4893, -2861, -20095, -6347, 22872, 29873, 39718]
434C9718J0465k7146k6888M599l561J76K9268O589k3248p593j4995l0652L874
447c9394K1227Q97J3149J4223k6827k1807Q141n550N453M0566J2714j1930J1265
460B2127p036l0020R998K4020K59K0072J9527k9038k3578K895j7701m097L0921
473A8349P07j5818J0206j8736m1581N502J3015o702K6351K2979k8876j4912J1427
486a8089j6517J340L9319Q620j171K6018j2037l5766J0458J0205n361L1872J9179
499E8070l3607j1082N482l2405q496K8681n980m630K5081k1017m3514O992L207
512c3218q846L4672J9175k6859M419J2089k9690j12L2900k080J1132L8719j9484
525C2817l7849J3096jj3009L3870J3393k9891O964N829m1712j0107J9682j0686
$$ y = [39718, 50183, 23037, -3851, 748, -2813, -2637, 26631, 33220, 9972, 2379, -12616, -43268, -39394, -18167, -17270, -4121, 10102, -16725, -38532, -30391, -35941, -30488, 10078, 22792, 10862, 22127, 15091, -14929, -4931, 19089, 19348, 39420, 58947, 29909, 6331, 9226, -8475, -12572, 18349, 19056, 3238, 13444, -5292, -46873, -41371, -28356, -35058, -8707, 14272, -14604, -29516, -18089, -34606, -33266, 6053, 14673, 13502, 39520, 27483, -8283, 2175, 12380, 7019, 38891, 58070, 24463, 13381, 18863, -13542, -22038, 6643, 663, -3967, 21114, 97, -43417, -36425, -33218, -42064, -7392, 11783, -15076, -10657, 1432, -28258, -28370, 4530, 2450, 13582, 52301, 32817, -5032, 8064, 8063, -4946, 28924, 42317, 12426, 19390, 25219, -16493, -26600, -6918, -17604]
538a7604J1899L4080k7386l6111J3810o503j3330L6078J2315k0217K2476J1635
550B1142l9729m772K1973o240K1466L6930k5112k7499J5134j2061j6216K9235
562A4251L235j7699K6875K382m7701p269J2939j2958K1924L2782k7726k0452J8658
575g59j5430j6851K7696L394o691L5874K027m4363j214J0627j1930K7181K8519
588C8080k8364r945J9744k2717j9905K2089j560k096L6543m174m3960q55N703
601a1417j2818K5369K2192k4354N87J9300k6769j8090J9648l018M041L8477p263
614B5885l9399M148K631j5104K2004J7161k0125Q809J7099k9178j7183J4676m874
627a3450R233L6327j0447l1337Q364q61j7262J9667J3202j5479J5719J5348l1631
$$ y = [-17604, -5705, 28375, 989, -35122, -21312, -27815, -41145, -5067, 7248, -12969, 9507, 21142, -18587, -23359, -1386, -7626, 13840, 50770, 25658, -1841, 13293, 1232, -14984, 14251, 17486, -213, 26662, 29044, -18657, -25926, -12987, -25945, -4021, 28761, 1035, -19417, -759, -16189, -33040, -5344, -1950, -8641, 27233, 29260, -15103, -16317, -5690, -17620, 9561, 38080, 9716, -229, 19515, -3202, -23107, -1018, -2578, -4674, 31869, 27695, -16265, -17120, -11417, -24235, 1134, 23326, -1028, -441, 18859, -7910, -26000, -6352, -9370, -5329, 33148, 25885, -13514, -9366, -6735, -21839, 165, 17326, -2799, 6010, 23109, -6069, -23252, -8576, -13450, -4217, 32110, 21663, -9674, -1310, -2171, -19433, 234, 13436, -2043, 13676, 29024, -2607]
640b607j6770J0407n975J0267L0564j1577k3815R905o312j8444J5978Q454q779
653h704K0923J3013l0143j2387Q781o638J1693K7134q356j3892J0887q376j8519
666a4584J0454N225l662K1774P748k8092j0317L298j0675R857K0900p628o553
679b255J0788j1442j8762P600M454J275K3152O955k1110n745P70r874R575J7894
693A3275m303J260J0408j4576j8067M318O98J817K0558M069j8120m989l203j2831
707a9686O548J3225o82O016Q004j3828j4254K427m90N170K0159N058j0929j121
721E617m707j2112L862J0789J677P819O643j2868j3539k173l160L806J5118L990
735A0762o530r53p543j2793K166Q169L565J0194O901r636j0077k413k777L793
$$ y = [-2607, -19377, -8970, -14945, -4678, 25886, 14309, -9506, 399, -5913, -24357, -8379, 75, -8704, 12219, 25232, -4911, -17298, -8517, -15155, -3462, 23672, 15316, 1424, 12311, 3935, -14584, -4130, 1095, -2567, 19207, 26955, -1137, -11454, -8156, -18831, -8974, 11926, 4298, -2255, 8533, -2909, -21671, -14071, -9617, -8342, 14810, 21765, 655, -5090, -4320, -14194, -4619, 13275, 8972, 10232, 20640, 6064, -12003, -7685, -6987, -5170, 15388, 19457, 1337, -3652, -6855, -19686, -13138, 87, -595, 5421, 13425, -403, -14657, -12230, -12720, -7550, 12609, 17667, 6738, 5617, 910, -11202, -7340, 3449, 5126, 12945, 19588, 6720, -6819, -8992, -12152, -8346, 6772, 10762, 4232, 3279, -4264, -17057, -14891, -6722, -3157, 7037, 13938, 4302, -5775, -8188, -10965, -7172]
749g172J3617O376q18o54p558j1124q98M626M284R624N347q204q972n584n698
764a2808J363R680O398J511j97o737r957k930L109N565R836O309k953n379n767
779b957o039J824P632P071M895R25o109q920n685Q5M048P579N657j095n236p801
795d126p215j099M661O879O331J882m682p362n562j436L773Q126P966K305l128
810G313o044o651k368L562P535O984K776k900o848p548l861J639O337O179K991
825I096j814p017q604l864J372N386P139M611n98n918o447m383J041O162P892
840D054N013R94m660p493l901P50M067P532O083r28m491o756o494k183M596O294
856B477M198J368m047q911n397j257K140P225O929O37k528m569p228k092N367
$$ y = [-7172, 6445, 12821, 12003, 11349, 3791, -7333, -8231, -3605, 679, 10303, 15650, 7446, -1526, -7110, -12808, -11445, -1765, 4633, 6144, 5947, -790, -10747, -13677, -10568, -5003, 4833, 11142, 8189, 2810, -2957, -8996, -7172, 460, 7531, 12426, 13351, 7242, -1678, -7363, -7278, -3230, 4349, 10006, 8911, 3675, -4126, -11341, -12440, -7779, -900, 5431, 7313, 2631, -4731, -10293, -11729, -7956, 170, 8136, 10441, 7313, 1269, -5382, -7750, -4188, 3347, 10331, 13107, 10207, 3359, -4189, -8050, -6411, -74, 6105, 9096, 7282, 265, -8339, -12203, -10831, -5445, 1694, 6305, 5707, -211, -6658, -11041, -10000, -3838, 4054, 9067, 10061, 5401, -2092, -5993, -5243, -1176, 6356, 12439, 11511, 7020, 264, -6230, -8413, -3817, 2477, 6675, 8043, 3996, -4915, -10312, -11569, -9429, -2204, 4725, 5362, 2834, -1735, -8963, -11055, -5688]
871e688O501N447M884k157p708l568k090JO846P109Q73j296m245r536m259L615
887e271K986M186N648k727p801k881l586l360O927Q052J453J919j951r668l080
902i154M554K121N549Q360j310n591j275n459n519O798P103J51L302j383j2650
917d403m195L427j973L655R319j811m452N31p127p382P754P265N25P195M41j2161
933c392j416M053m462M451J1407j689k844K736r773r606P748M742j350P672l6
948H241j2925o22K012q471L820J2027k440J50M458j0965q971R289L941j047J1459
963I956J106j1632K309J057j0807M256J2539l804J886N217j4166r117R081q65
977b984k734J2537j00j1290M401r55j4339O386J2208m422N069P313j4072o541
$$ y = [-5688, 813, 6260, 11144, 8987, 1279, -2289, -4379, -4378, 2468, 9577, 10450, 9154, 4909, -4627, -8886, -5271, -2285, 1901, 7549, 4822, -2979, -5860, -9446, -12806, -5879, 2173, 3626, 5545, 3594, -6074, -9154, -4600, -2479, 3070, 11430, 10120, 4529, 3254, -2205, -7724, -926, 6177, 6328, 9630, 8247, -4403, -8598, -5171, -7144, -3489, 5830, 4019, -433, 98, -7029, -14411, -6657, 608, 1133, 8328, 8769, -3392, -4808, -755, -5217, -766, 10641, 8952, 6108, 8844, -929, -10535, -2787, 1955, 605, 8277, 8241, -4684, -5306, -3294, -11765, -7945, 4082, 1642, 1792, 6250, -4715, -13686, -4397, -456, -1503, 9956, 11062, -570, 1739, 2796, -8011, -3755, 8784, 4980, 6866, 12083, -2083, -11200, -2119, -2984, -5718, 6819, 6719, -4571, -170, -1125, -15464, -9078, 3130, -1292, 3777, 11090, -2982, -9523]
991i523J0325l409j899J4939n2r267O793k891j5970O685J0517o391O027O787j6077
1006c406n918R427p833k872J5558j242p547Q591m756j5858Q963R156o716R745
1020E292Q269j5360j983Q928j0354j344J6405k177n919J0063p422j6209R169N271
1034B629q702J0440P406j5945k98O725j4077j17J6547m527k958J2268q663j3922
1048a3194J0754K506p906J3807P446j4364K966N385j5388J429J5449o311j345
1061A234J2471j0344j2762R312j927q582J4210N837j3316L934L246j6173K694
1074a0166J3535p164J995J3662j0131r857R682m091p136J6428M494j1455O204
1087F000J856j6174L700J0240r245L757J3244j1222q730Q571q154o422J5833K122
$$ y = [-9523, 802, -2607, -4506, 10433, 10381, 1114, 7907, 5016, -10954, -4269, 6248, -143, 5884, 12671, -3406, -9324, 103, -7730, -10602, 4956, 3714, -3833, 4758, 2, -15856, -6893, 2263, -4453, 5292, 13561, -1799, -3782, 5146, -5208, -6552, 9853, 7676, 1757, 11820, 4398, -11811, -2642, 2629, -6073, 4367, 11773, -4172, -4470, 2255, -11822, -11939, 4608, 81, -2877, 9391, 728, -13194, -2440, 66, -7840, 5967, 13413, -951, 2015, 7400, -7988, -6559, 8890, 2579, 1234, 13705, 3361, -9401, -89, -2016, -10598, 3612, 9449, -3867, 67, 3313, -12860, -10166, 3369, -3795, -1800, 11862, 1731, -8126, 1556, -2535, -9671, 6757, 11251, -204, 6000, 7856, -8318, -4618, 5622, -3623, 134, 13378, 2156, -6574, 1997, -6157, -12579, 3254, 5376]
1101E376j0050Q490L21j4869M895P861q938O354J3528j0029n299P145r025m401
1115h641J5146J42p669R096r57j4133M276L934r707P497J1457r833l845M974r753
1130h016l106J3373j516m886J0907j231j1719M525J885q149R617J0765q971j636
1144A842M766j0678k112J0853l660k977J0318k764j0479K832j446p588R570Q087
1158F564q088R65L462r979o76Q808m087L88J1306k078p880L427k681o030R678
1173C099N818o469K073K389r688j415N517n318J007R755l402o589K064m428m705
1188a0292P892M531m303L679K491p714l15L887m164L439R277k277l776J750m627
1203e22m078O500K359l334M089J086p414j675J111m601K869P326k178k654J026
$$ y = [5376, -4674, 3816, 4137, -10732, -5837, 2024, -6914, -560, 12968, 2939, -2360, 4785, -4240, -8641, 6505, 6647, -1022, 8074, 7117, -7016, -2740, 1194, -8513, -1016, 10441, 608, -3237, 1737, -8016, -11122, 2251, 735, -4151, 6756, 5525, -6194, -1669, 216, -7933, 1684, 12449, 3478, 1842, 6608, -4070, -6182, 4671, 1011, -1966, 8352, 5588, -4891, -2059, -3505, -11093, -1523, 6564, -1524, -559, 2903, -7076, -7752, 1056, -3031, -2643, 8663, 6585, -1295, 2132, -549, -6579, 3099, 8917, 2448, 4521, 6910, -2778, -4193, 1324, -3994, -2987, 6768, 3366, -3223, -1159, -5587, -10292, -2400, 2131, -2172, 1507, 3998, -3716, -4031, -144, -4308, -869, 8408, 6131, 2355, 4105, -522, -4600, 1900, 4259, 925, 5014, 6100, -1314, -2989, -1878, -6479, -3610, 3716, 1538, -1116, -90]
1218i0m787k866N095J620p61N119J638n675m18K46l001L596O292p51j689J091
1234D659m790l089K761J14M65M077L15m218j987j653k771K579M667k77K66N79
1250A697l928k564J714J87J491M664J014k653j234j693k250K199L556N44J298
1265D042M2l399k333l48n84J664L987M41j915j049k427k539J026K573J692J475
1281B348L58k796k440q49l98K122L451J099l90j306k258k222P71K035J821J931
1297C277P39j833k528j419o76J172K684J578K32j126k687k342l49J288J455K405
1313A870Q83j660k307j433j068P14K789K136N16m69k009j735r12R32K049K279
1329B575J216n63k044j589j657J48K048K117M93k4j905k740j090j56J158K482
$$ y = [-90, -4877, -7743, -2648, -1028, -1789, 3330, 4968, -707, -1125, -879, -3880, -284, 6008, 5257, 3568, 4659, -131, -3220, -459, -345, 120, 4197, 4512, 294, -1693, -3346, -6117, -3538, 1129, 852, 1118, 1697, -2231, -4795, -3081, -2894, -1403, 3261, 4275, 1622, 388, -1305, -3555, -1356, 2200, 2744, 4042, 4084, 685, -1648, -1996, -2580, -916, 3071, 3512, 1597, 548, -1879, -4418, -3392, -819, 873, 2348, 2706, -90, -2530, -3379, -3777, -1655, 1796, 2895, 2505, 1199, -1059, -3281, -2510, -475, 1346, 3277, 4016, 2183, -345, -1764, -2440, -1268, 1416, 2994, 3226, 2100, -587, -2929, -3278, -1990, -535, 1870, 2753, 1093, -1214, -2647, -3715, -3001, -212, 1924, 2440, 1971, -38, -1773, -2685, -1753, 296, 2575, 3791, 3228, 1184, -405, -2062, -1914, 134, 2251, 2744, 2720, 815, -1925, -3015, -3171, -2013, 469]
1345D69J369o46j175j847j635L09J659J930J813J117j672k082q29m94Q19K768
1361A873J459j6o80k202k359n76J382R57J939J102k199k093n95j861N77L118J350
1378A176p3J029j747k910j12J145R58K397K069j908j749k33k306q4L194O36K09
1395A691J557j733m309L71P38k72K567K637k499j021O36k784q51L086M32N04L466
1412D216k394m256R57L48o80L221K270l257P2J185l959j450L372k30N79M219k711
1429A502m445J847j15j454L826J725l032K234J456n389j095L175r92J570M753
1444E566l787m670K868j077k931M166R40k813L164J467o317r32L602j946K918
1459B18N291m550l349M662k117k803M154N65k576N084J197p932l46L134k976K866
$$ y = [469, 1838, 1192, 17, -1830, -3465, -3156, -1497, 433, 2246, 3363, 1691, -391, -1220, -1714, -895, 1873, 3332, 3316, 2636, 434, -1925, -2501, -1119, -162, 1777, 2879, 680, -1413, -2008, -3869, -3292, -174, 1176, 1103, 2132, 385, -2525, -2637, -1492, -534, 1863, 3932, 2024, 275, 42, -2264, -2348, 846, 1482, 1691, 3248, 1515, -2794, -2423, -1685, -1957, 610, 3247, 748, -273, 363, -2421, -3272, -186, 246, 750, 4216, 1822, -2434, -1477, -1129, -1809, 1412, 3682, 425, 497, 1682, -2277, -3727, -355, -585, -6, 4213, 1502, -2943, -1096, -1211, -2665, 1161, 2886, -146, 2088, 3544, -1845, -2940, 235, -757, 813, 5566, 1779, -2891, -23, -1100, -4031, 135, 1075, -1738, 1426, 2893, -3424, -4356, -754, -2700, 218, 5509, 959, -2390, 2272, 155, -2648, 1506, 2071, -505, 4579, 5776, -2156, -2502, 632, -2344, 522]
1475E22M626n794k400M579l231l861M622m72j991O849M43q649J447L355k975L256
1491C26N374n842n25O231m236m612N108j169j668P900j521q899K101K502m802
1506c732L294L709p046J411O474o282m474N083j600j69Q280j983p850M370K157
1521A642m726M154L046n527L337O405p455l775N092k644j41P974l845p810N218
1536I45Q00o300L401J847n766N055N224q393k905N270l044J137P845m335n447
1551d666P291m1o201M445J481m474O287M671r274j848N072m214R29O772n786m006
1567c562P180k342o687M158J68m010O856K908r161J61M876m406J320O096m773
1582a218j585P984k892o438M940L18l357P317J516q483J721L711n505J110N277
$$ y = [522, 5148, -646, -3046, 1533, -1698, -5559, -937, -1409, -3400, 3449, 3892, -4757, -3310, 45, -2930, 326, 5700, -142, -667, 5564, 1328, -3284, 1824, 655, -1013, 6887, 5366, -3533, -1432, 1070, -3732, -438, 3271, -3775, -2364, 4110, -2172, -6646, -1563, -3163, -3332, 4948, 2965, -4885, -515, 1642, -3084, 1070, 4116, -1411, 1926, 8331, 876, -2899, 2193, -451, -592, 7382, 3537, -4273, 945, 1745, -4555, -1154, 693, -5073, -18, 5206, -3187, -6092, -822, -3866, -2729, 5116, 781, -4666, 2625, 2584, -3617, 828, 2309, -2165, 4122, 8793, -481, -2329, 2743, -1471, -542, 6230, 444, -3562, 3618, 1276, -5411, -1253, -1085, -5095, 1761, 4669, -4492, -4331, 545, -3861, -2541, 3555, -1218, -2803, 5181, 2289, -4149, 791, 1109, -2248, 5069, 6585, -1898, -177, 3534, -1971, -861, 4416]
1597D416n499p54P151m701n994M731j425k518P128q2o928L325K271m957K250M017
1613B431m610J620O803n250m050N013j823k204O927p86o038L784J206o179K107
1628a049L060m538K135N145n943k957M576k990j576O848j425m580M707O73n847
1643c761K786K676l531L098M276n089k042L480k816j282N278j471l183M277r64
1658A732n114K379J403l489L295L301m918k15K798l588o27N209j672j651M176
1673C019j163m526K791P94l059L545K209l963J44K029l699o14L814j843q44L776
1689B410j939l313K444j53k094L337J928l129P18J504l120k87L229j600K53L116
1705C304j972k802J851r39j820K899J208k493J038L27k954M49J833j184P63K602
$$ y = [4416, -1083, -1837, 5314, 613, -5381, -650, -2075, -4593, 2535, 2453, -4475, -1150, 1121, -3836, -1586, 2431, -2179, -559, 6244, 994, -3056, 1957, 134, -2070, 4857, 4071, -1967, 1817, 3023, -3156, -1049, 2011, -2527, -392, 4753, -1190, -4147, 429, -2561, -4137, 2711, 1286, -3294, 1413, 2086, -3761, -975, 1701, -1830, 1268, 5544, 455, -1587, 1893, -923, -2205, 3073, 1602, -1581, 2696, 1732, -3382, -1003, 400, -3089, 206, 3507, -1411, -1626, 1172, -2416, -3043, 2166, 494, -1157, 3019, 1856, -2670, 121, 915, -2144, 1401, 3610, -353, -209, 1820, -1879, -2493, 1321, -522, -1366, 2410, 471, -2842, -398, -551, -2645, 692, 2620, -509, 209, 1713, -1407, -1694, 1535, -65, 188, 3304, 1332, -1470, 381, -558, -2378, 521, 1729, -764, 274, 601, -2353, -1904, -71, -1255, -492, 2110]
1721B110j892j275J577j057j409K704R93j279J137J01k280M7J178j165O65J885
1737B040j249j427J017j373j262J887M26p38J260J55k422L78P96n58Q44J674k09
1754A239r76O89j202r16J879K31l71J238m95j616n74K49q16J102J467m96p15J52
1772F9j151n96Q07P65OR08K52j174o6l47l23R48J235j55l85K04j126o40N49P1
1792a49K04J054j26r44o97k57j39M52J048L5O8j08j039j82k61P37M93R37j23m73
1812E30p47m9p85O36P48K77K82j60m12r27j71L98L25O85P4j44r8q32k55J82K39
1833b04L39O18L8j119n49l4j60P35N85J37l44j41m45p89O70L79M05R98o6m63l61
1854B29k59l39O43J014p6k28M55j064j087K55K42j01O04L3j159k20l00j006R39
$$ y = [2110, 218, -1057, 520, -537, -1946, 758, 1751, 472, 1609, 1710, -570, -523, 655, -510, 155, 2040, 791, -636, 381, -992, -2254, -367, 59, -679, 581, 736, -1686, -1308, -512, -1070, -226, 1448, 1239, 263, 952, -250, -1166, 713, 944, 573, 1811, 1316, -300, -874, -625, -1441, -339, 1128, 632, -83, 69, -1082, -1678, -871, -106, -100, 808, 1060, -114, -180, -527, -850, 98, 1333, 1178, 793, 997, -129, -769, -220, -149, 55, 1109, 983, 39, -658, -915, -1054, -602, 446, 481, 549, 441, -598, -780, -1041, -304, 189, 1126, 1003, 530, -217, -266, -1051, -415, 333, 610, 892, 732, 320, -607, -778, -380, -55, 630, 704, 560, 462, -370, -625, -443, -204, 135, 753, 791, -328, -877, -911, -1071, -336, 249, 386, 42, -99, -544, -1333, -663, -284, 121, 1119, 1053, 590, 229, -30, -369, 274, 1288, 1212, 984, 1439, 375, -712, -457, -215, -316, 288, 321, -838, -1058, -1358, -2364, -1425]
1873a425R82k42M24K85o51n26O87M72Q4J501N59n99l0k3j184P53O84o51L03K22
1893A625j503r40Q2r15j50J516n09j206O58n02j061Q29R75l7Q09J760j097m56
1911a22P52j18J80K230l36q59R61n52j791P80M05j932J201P46k189q39K00j557
1929b840J27J726p27q02J587m00j411J603J60q52K691J694j967M19J296j742N40
1946A102K374j270j201K484j289k090Q57p67j855K338O10l325L48O00k470P17
1962b837K582k302k29L252r20j720J958p19o52L776Q91k586J043J250k044J051
1978A794J492k775j18L286k155k412J733j893j525L442j61l879J759Q53k252R90
1994a821J250k741J228M202k224j230K203j442l44M068p65l195K902R89l291J557
$$ y = [-1425, -443, -685, -261, 24, -627, -1153, -466, 6, 90, 1591, 2150, 1551, 1521, 1498, 314, 1067, 1751, 1100, 1403, 1625, 122, -818, -736, -1651, -1801, -285, -794, -2000, -1342, -1844, -2905, -2076, -1101, -1138, -329, 1431, 334, -122, 630, 512, 692, 2922, 2586, 1727, 2688, 2136, 345, 1125, 1530, -402, 799, 1545, -644, -1483, -1283, -2840, -2713, -987, -1714, -2516, -929, -1329, -2740, -1137, -977, -1829, 862, 2556, 589, 1008, 2304, 562, 1102, 3476, 2206, 1005, 3489, 2200, 110, 967, 200, -1655, 683, 1293, -2032, -1684, -1084, -3554, -2837, -255, -2557, -2786, 466, -454, -2174, -216, -935, -1587, 2189, 3080, 494, 1537, 2787, 743, 1794, 3286, 511, 393, 3679, 1524, -888, 845, -1048, -2573, 869, 708, -3171, -1412, -559, -2811, -1821, -571, -3312, -2084, 2118, -106, -1336, 867, -575, -919, 3149, 2384, -811, 2091, 3080, -211, 1346]
2010A346M84l471J664L628k955k067J737j945m82L767k241l046L342R59k892J605
2026e67M26l222K966L373l312o80K443j797PL731k645k682M050L75l051J369l53
2043D31l047L649K334m405n70K354k457K19L291l326j725M803j94k966J912p34
2059d31k424M086J889m428N03K714k344N32K423m007n51M976j047l019J471r73
2075f30j926L987P20m501J431K325k517O84J511l506L72M829j727k530K447j122
2091a53j644L891J39m411K251K259k814M77J161l538R93M325k406k412K091r18
2107g09q84L411j388l295K815J939k831J049M63k837J835L490k398j818K422j009
2123B55q08K432j409k676L389J009k986R03K03k960K165K838l277p58K275j565
$$ y = [1346, 1830, -1641, 23, 3651, 696, -1371, 366, -1579, -2061, 1706, -535, -3581, -239, 720, -2172, -567, -141, -3363, -397, 2976, -336, -1016, 1427, -370, -363, 3368, 723, -1959, 2091, 2466, -585, 784, 431, -2616, 1033, 3367, -1038, -1608, 746, -1711, -1492, 1799, -1527, -3252, 1551, 1357, -1609, 303, -431, -2855, 1231, 3120, -1308, -805, 1909, -435, 97, 2520, -1487, -2038, 2938, 1891, -1128, 343, -630, -2556, 1431, 2151, -2350, -919, 1406, -1111, -427, 1084, -2422, -2050, 2779, 1052, -1478, 969, -153, -1797, 2094, 2233, -2178, 73, 2332, -482, -5, 1156, -2382, -1389, 2936, 530, -1882, 209, -709, -1593, 1818, 430, -2865, -50, 1889, -942, 107, 570, -2267, -432, 3058, 660, -1158, 1264, 255, -553, 1879, 470, -2206, 1183, 2192, -794, 109, 312, -2648, -483, 2355, -922, -1680, 595, -970]
2139i70l49K306k019j637L780P55k529J006Qj918K133J993k885M2K121j879j82
2156b24J982k346j005L162o5k573J017l5k172K191J047k485P06J745j664k69J522
2173E34j851l21L289o60j668J491m33j272J743O49k277J026J506j476k15R13j907
2190i29k6K151j073r03J116j68j641J487J44j561J293R83j633L43N68j177L21
2207g05J817p38o57J048l55j044J165M8r70R41P49j318J31N82j348J10J354q79
2225f9n18J129n78q53O21J20p07P12O55q58J04L95r18M16P65k86p5J158q27p24
2245c38Q00l53l62P82N46r04J15J83r95J78P24o47O4N05k80n75K19k26m8O83K1
2266I2l47M82J01q90P3M57j16L20L75k61j83L05l20m23Q76k99j59L34k72n33J4
$$ y = [-970, -1319, 987, -1032, -2669, 1111, 1866, -663, 343, 351, -1567, 566, 2559, -326, -284, 1837, -42, -224, 1758, -588, -1593, 1569, 1504, -1069, -52, -87, -2259, -68, 979, -1506, -800, 945, -719, -988, 534, -1317, -1638, 1651, 991, -677, 814, 381, -891, 852, 1501, -776, 250, 1756, 280, 65, 978, -929, -955, 1196, 123, -780, 336, 168, -1473, 14, 158, -1403, -110, 873, -760, -417, 151, -1026, -705, 1112, 374, -283, 765, 410, -634, 531, 579, -391, 550, 1299, -19, 112, 694, -654, -544, 810, -69, -587, 542, -36, -889, -268, -148, -855, -143, 512, -346, -242, 153, -765, -349, 416, 130, 55, 1213, 386, -338, 462, 109, -253, 529, 1075, 171, 286, 469, -526, -348, 376, -271, -207, 298, 18, -557, -338, -564, -612, 71, 92, -255, 227, 328, -562, -489, -32, -148, 172, 547, 286, 103, 408, 88, -335, 541, 242, 83, 417, 145, -388, -374]
2287c74L38l84K92M61l94m88L82n02J74L43j0K38J35Jm68N7M48j20K49K94l66
2308C06J51j18l61J92K3Q9K08r5k97m81J65j85l7K40Ok2m1N0j51k58K98K35k1
2331a04L68p5k45M5J61r5Q0M99k43J2m8k46k8m4q7K65J80k32l46j81K11k65n3
2354d71M05j04j83K62l32J38m0L01P3K22Q5o3k2j91j3K92J96j28O6K36o72L1K07
2377B95m79K69P7o5n64L67o47o6N66j81l37P41j33k62L37J79p36P33M73l95K11
2398C83N43o56m25P01k89M1N03j7r52L01Mn22K36N14q56L3N94q27m7O54m42l39
2420h65R86m1o48N73J96q43P28P88r63K92Q55r58J77N83o51l26J149o44n25O86
2440E49l87r91Q92K41j154P47M48j271J06R85r12k15J476l21r22J197n02p15J175
$$ y = [-374, -36, -420, -128, 333, -61, -549, -167, -669, -495, -152, -162, 76, 211, 212, -256, -199, 249, 129, 378, 672, 306, 457, 339, -22, 170, 193, 282, 490, 395, 98, -383, -218, -403, -440, -200, -194, -216, -257, -207, -358, -616, -318, -83, -104, 264, 189, -56, -11, 150, 55, 135, 634, 391, 403, 355, 109, 81, 37, -50, 215, 395, 163, -183, -364, -153, -418, -471, -66, -170, -353, -91, -423, -285, -325, -24, 49, 271, 356, 293, 271, 80, 67, 359, 555, 427, 493, 729, 57, 88, 295, -184, 85, 162, 97, -467, -100, -747, -813, -247, -428, -765, -24, -157, -419, -82, 97, -639, 94, 567, 172, 383, 926, 270, -155, 546, 257, 298, 801, 784, -168, 133, 137, -385, -149, 365, -491, -458, 136, -691, -738, -84, -526, -865, 121, 80, -568, 5, 201, -642, 86, 874, -89, 203, 1058, 100, 277, 860, 209, -117, 1032, 388, -137, 549, 162, -829, 63, 304, -850, -103, 345, -926, -820, 165, -747, -962, 514, 193, -729, 468, -34, -749, 426]
2459D26K03q55O97O71j470M31Q05j390L91J137n06q86R40k63j460J395N6j301
2477i79J035L49j418P33O22j409L38J581r79m19J094r49l48J607l69j443J609
2494F55N48j398O90K93j676Q17J517j433m42J420j147m54J672j021j414J825K19
2511F71j424Q32J38j576J089J206j734K85J272j250M9J541j232j049K063j22j059
$$ y = [426, 629, -226, 471, 1142, -328, 103, 908, -482, -91, 1046, 540, -346, 594, 331, -1129, 266, 322, -979, 56, 405, -1013, -280, 342, -1067, -729, 852, -127, -546, 548, -401, -749, 858, 489, -954, 655, 1203, -195, 495, 788, -888, -71, 1446, 13, -429, 991, -156, -610, 1062, 41, -1373, 452, 671, -753, 79, 217, -1359, -270, 936, -798, -513, 759, -491, -442, 1099, -133, -1182, 881, 759, -300]
$$ [...]
8191B52
##END NTUPLES=NMR FID
##END=
