##TITLE=1H_Pr 1913
 CDCl3,8 sc, 
 3.03.2021
##JCAMPDX= 6.0         $$ Bruker NMR JCAMP-DX V2.0
##DATA TYPE= NMR FID
##DATA CLASS= NTUPLES
##ORIGIN= UXNMR, Bruker Analytische Messtechnik GmbH
##OWNER= root
$$ XWIN-NMR		Version 3.5
$$ Wed Mar  3 13:43:56 2021 Russian Standard Time (UT+4h)  she@DPX200
##.OBSERVE FREQUENCY= 200.1315066352
##.OBSERVE NUCLEUS= ^1H
##.DELAY= (6, 6)
##.ACQUISITION MODE= SIMULTANEOUS
##.ACQUISITION SCHEME= undefined
##.AVERAGES= 8
##.DIGITISER RES= 18
##SPECTROMETER/DATA SYSTEM= spect
##.PULSE SEQUENCE= zg30
##.SOLVENT NAME= D2O
##.SHIFT REFERENCE= (INTERNAL, D2O, 0, 15.7039)
##AUDIT TRAIL= $$ (NUMBER, WHEN, WHO, WHERE, WHAT)
$$ ##TITLE= Audit trail, XWIN-NMR		Version 3.5
$$ ##JCAMPDX= 5.01
$$ ##ORIGIN= Bruker BioSpin GmbH
$$ ##OWNER= she
$$ F:/spectra/data/she/nmr/H-F/1/audita.txt
$$ ##AUDIT TRAIL=  $$ (NUMBER, WHEN, WHO, WHERE, WHAT)
(   1,<2021-03-03 13:42:20.46 +0400>,<she>,<DPX200>,
      <created by zg, POWCHK disabled, PULCHK disabled
       configuration hash MD5:
       00 E9 B6 7A A2 85 ED C7 34 08 36 98 17 FE 4E 26
       data hash MD5: 16K
       05 A6 51 D7 60 20 F7 F1 A0 88 01 4C 95 D2 B1 B6>)
$$ ##END=
$$ 
$$ hash MD5
$$ 02 49 D8 F1 43 F8 9B 6B D9 6D 7C 45 20 B7 78 16
##$RELAX= 
##$RELAX= 
##$RELAX= 
##$RELAX= 
##$RELAX= 
##$RELAX= 
$$ Bruker specific parameters
$$ --------------------------
##$DU= <F:/spectra>
##$EXPNO= 1
##$NAME= <H-F>
##$PROCNO= 1
##$TYPE= <nmr>
##$USER= <she>
##$AMP= (0..31)
100 100 100 100 100 100 100 100 100 100 100 100 100 100 100 100 100 100 
100 100 100 100 100 100 100 100 100 100 100 100 100 100 
##$AQSEQ= 0
##$AQ_mod= 1
##$AUNM= <au_zg>
##$AUTOPOS= <>
##$BF1= 200.13
##$BF2= 200.13
##$BF3= 200.13
##$BF4= 200.13
##$BF5= 200.13
##$BF6= 200.13
##$BF7= 200.13
##$BF8= 200.13
##$BYTORDA= 1
##$CFDGTYP= 0
##$CFRGTYP= 5
##$CHEMSTR= <none>
##$CNST= (0..31)
1 1 145 1 1 1 1 1 1 1 1 1 1 1 1 1 1 1 1 1 1 1 1 1 1 1 1 1 1 1 1 1 
##$CPDPRG= <>
##$CPDPRG1= <>
##$CPDPRG2= <>
##$CPDPRG3= <>
##$CPDPRG4= <mlev>
##$CPDPRG5= <mlev>
##$CPDPRG6= <mlev>
##$CPDPRG7= <mlev>
##$CPDPRG8= <mlev>
##$CPDPRGB= <>
##$CPDPRGT= <>
##$D= (0..31)
0 1.2 0 0 0 0 0 0 0 0.06 0 0.03 0 0 0 0 0.0002 0 0 0 0 0 0 0 0 0 0 0 0 
0 0 0 
##$DATE= 1614764539
##$DBL= (0..7)
120 120 120 120 120 120 120 120 
##$DBP= (0..7)
150 150 150 150 150 150 150 150 
##$DBP07= 0
##$DBPNAM0= <>
##$DBPNAM1= <>
##$DBPNAM2= <>
##$DBPNAM3= <>
##$DBPNAM4= <>
##$DBPNAM5= <>
##$DBPNAM6= <>
##$DBPNAM7= <>
##$DBPOAL= (0..7)
0.5 0.5 0.5 0.5 0.5 0.5 0.5 0.5 
##$DBPOFFS= (0..7)
0 0 0 0 0 0 0 0 
##$DE= 6
##$DECBNUC= <off>
##$DECIM= 32
##$DECNUC= <off>
##$DECSTAT= 4
##$DIGMOD= 1
##$DIGTYP= 9
##$DL= (0..7)
0 120 120 120 120 120 120 120 
##$DP= (0..7)
150 150 150 150 150 150 150 150 
##$DP07= 0
##$DPNAME0= <>
##$DPNAME1= <>
##$DPNAME2= <>
##$DPNAME3= <>
##$DPNAME4= <>
##$DPNAME5= <>
##$DPNAME6= <>
##$DPNAME7= <>
##$DPOAL= (0..7)
0.5 0.5 0.5 0.5 0.5 0.5 0.5 0.5 
##$DPOFFS= (0..7)
0 0 0 0 0 0 0 0 
##$DQDMODE= 0
##$DR= 18
##$DS= 0
##$DSLIST= <SSSSSSSSSSSSSSS>
$$ [...]
##$SUBNAM2= <"">
##$SUBNAM3= <"">
##$SUBNAM4= <"">
##$SUBNAM5= <"">
##$SUBNAM6= <"">
##$SUBNAM7= <"">
##$SUBNAM8= <"">
##$SUBNAM9= <"">
##$SW= 16.9725356469052
##$SWIBOX= (0..15)
0 0 2 0 0 0 0 0 0 0 0 0 0 0 0 0 
##$SW_h= 3396.73913043478
##$TD= 16384
##$TD0= 1
##$TE= 0
##$TE2= 300
##$TE3= 300
##$TEG= 300
##$TL= (0..7)
0 120 120 120 120 120 120 120 
##$TP= (0..7)
150 150 150 150 150 150 150 150 
##$TP07= 0
##$TPNAME0= <>
##$TPNAME1= <>
##$TPNAME2= <>
##$TPNAME3= <>
##$TPNAME4= <>
##$TPNAME5= <>
##$TPNAME6= <>
##$TPNAME7= <>
##$TPOAL= (0..7)
0.5 0.5 0.5 0.5 0.5 0.5 0.5 0.5 
##$TPOFFS= (0..7)
0 0 0 0 0 0 0 0 
##$TUNHIN= 0
##$TUNHOUT= 0
##$TUNXOUT= 0
##$USERA1= <user>
##$USERA2= <user>
##$USERA3= <user>
##$USERA4= <user>
##$USERA5= <user>
##$V9= 5
##$VALIST= <valist>
##$VCLIST= <CCCCCCCCCCCCCCC>
##$VD= 0
##$VDLIST= <DDDDDDDDDDDDDDD>
##$VPLIST= <PPPPPPPPPPPPPPP>
##$VTLIST= <TTTTTTTTTTTTTTT>
##$WBST= 1024
##$WBSW= 4
##$XGAIN= (0..3)
0 0 0 0 
##$XL= 0
##$YL= 0
##$YMAX_a= 841442
##$YMIN_a= -608985
##$ZGOPTNS= <>
##$ZL1= 120
##$ZL2= 120
##$ZL3= 120
##$ZL4= 120
##$ABSF1= 10
##$ABSF2= 0
##$ABSG= 5
##$ABSL= 3
##$ALPHA= 0
##$AQORDER= 0
##$ASSFAC= 0
##$ASSFACI= 0
##$ASSFACX= 0
##$ASSWID= 0
##$AUNMP= <proc_1d>
##$AZFE= 0.1
##$AZFW= 0.1
##$BCFW= 1
##$BC_mod= 2
##$BYTORDP= 1
##$COROFFS= 0
##$CY= 11.3945322036743
##$DATMOD= 1
##$DC= 2
##$DFILT= <>
##$DTYPP= 0
##$F1P= 15.9154993809931
##$F2P= -4.1035820241983
##$FCOR= 0.5
##$FTSIZE= 0
##$FT_mod= 4
##$GAMMA= 1
##$GB= 0.15
##$INTBC= 1
##$INTSCL= 1
##$ISEN= 128
##$LB= 0.24
##$LEV0= 0
##$LPBIN= 0
##$MAXI= 10000
##$MC2= 0
##$MEAN= 0
##$ME_mod= 0
##$MI= 1.114404
##$NCOEF= 0
##$NC_proc= 0
##$NLEV= 6
##$NOISF1= 3.799351
##$NOISF2= 2.8
##$NSP= 1
##$NTH_PI= 0
##$NZP= 0
##$OFFSET= 15.70392
##$PC= 1
##$PHC0= -10755.19
##$PHC1= 0.8009372
##$PH_mod= 1
##$PKNL= yes
##$PPARMOD= 0
##$PSCAL= 0
##$PSIGN= 0
##$REVERSE= no
##$SF= 200.130013532006
##$SI= 16384
##$SIGF1= 3
##$SIGF2= 2
##$SINO= 400
##$SIOLD= 16384
##$SREGLST= <1H.CDCl3>
##$SSB= 0
##$STSI= 0
##$STSR= 0
##$SW_p= 3612.71676300578
##$SYMM= 0
##$S_DEV= 0
##$TDeff= 0
##$TDoff= 0
##$TI= <>
##$TILT= no
##$TM1= 0
##$TM2= 0
##$TOPLEV= 0
##$USERP1= <user>
##$USERP2= <user>
##$USERP3= <user>
##$USERP4= <user>
##$USERP5= <user>
##$WDW= 1
##$XDIM= 8192
##$YMAX_p= 0
##$YMIN_p= 0
$$ End of Bruker specific parameters
$$ ---------------------------------
##NTUPLES= NMR FID
##VAR_NAME=  TIME,          FID/REAL,        FID/IMAG
##SYMBOL=    X,             R,               I
##VAR_TYPE=  INDEPENDENT,   DEPENDENT,       DEPENDENT
##VAR_FORM=  AFFN,          ASDF,            ASDF
##VAR_DIM=   8192,          8192,            8192
##UNITS=     SECONDS,       ARBITRARY UNITS, ARBITRARY UNITS
##FACTOR=    0.0002944,     1,               1
##FIRST=     0,             0,               0
##LAST=      2.4114304,     0,               0
##MIN=       0,             -608985,         0
##MAX=       2.4114304,     841442,          0
$$ Real data points
##PAGE= N=1
##DATA TABLE= (X++(R..R)), XYDATA
0 0 0 0 0 0 0 0 -8 0 -8 8 -8 8 -16 17 -24 29 -40 48 -56 64 -80 96 -112 132 -157 181 -210 244 -278 319 -366
31 -366 418 -472 536 -604 681 -762 853 -954 1064 -1183 1314 -1456 1614 -1781 1970 -2173
47 -2173 2394 -2640 2908 -3200 3528 -3890 4294 -4745 5258 -5840 6511 -7293 8221 -9340
61 -9340 10718 -12468 14774 -17959 22664 -30333 44978 -83107 401162 841442 100910 -28154
73 -28154 198574 400644 234528 -74757 -217715 275052 574369 218306 -66061 319783
83 319783 656568 502034 178204 19551 197549 390028 44457 -463528 -377839 -26985
93 -26985 -160145 -489827 -556404 -288589 -17637 -46387 -333545 -263511 174856 250145 -89215
104 -89215 -236337 -38274 97662 -12979 -316017 -413126 -135515 21802 -215811 -387845
114 -387845 -129234 139344 139066 -13659 -31662 178295 360185 200418 -72787 1468 181776
125 181776 105967 -141704 -226013 -118012 9395 -46858 -228333 -177880 57625 128517 -28887
136 -28887 -68353 50875 147349 102462 -56723 -111061 -6171 43506 -117228 -215454 -136500
147 -136500 -38611 -53338 -119661 -115380 -22205 81177 28155 -48785 -4810 78146 42890 -42587
159 -42587 -70512 -56184 -22651 -58116 -116627 -113111 -34709 -21052 -55376 -36695 1676 31031
171 31031 29906 21545 5214 30018 29904 -1824 -7619 2291 752 -8853 21955 29716 35341 45989
185 45989 66525 83958 91668 74652 46710 74005 75935 33595 -13052 -220 22949 10797
197 10797 -23300 -43016 7606 50059 27180 -28852 238 59071 50603 -16518 -61211 -22317
209 -22317 11943 -27162 -117039 -107075 -23044 1816 -62263 -93801 -14093 68955 63163 -20875
221 -20875 -18882 72748 109762 15399 -71013 -25399 46083 22047 -89489 -110060 -14631 62093
233 62093 -868 -81608 -19511 98544 111003 1928 -38475 40085 113825 34882 -94157
244 -94157 -88417 13595 30766 -90872 -149972 -63438 51730 21547 -81888 -67822 67449
255 67449 130329 23490 -61504 -2205 106598 64955 -76173 -116575 -11041 58643 -39902
266 -39902 -141565 -86196 59635 68656 -41698 -78639 38977 141284 66042 -56324 -43038
277 -43038 81770 88823 -43538 -127735 -44923 58094 6446 -112178 -109123 32222 88897
288 88897 -3135 -82973 -4332 115282 88505 -36191 -71810 36348 90027 -2852 -115568
299 -115568 -73551 41974 40706 -68693 -111083 -1357 87434 35077 -69754 -41112 75225
310 75225 96040 -11373 -83330 -6938 75568 32101 -83761 -84705 21334 66081 -17691 -89428
322 -89428 -21897 76478 66247 -36076 -52188 37824 92305 21204 -65674 -32312 52639 53954
334 53954 -41104 -74161 -3176 63088 18645 -59840 -40669 41002 62163 -15445 -59557 -12144
346 -12144 50962 20851 -55078 -59308 6261 39080 -19415 -63907 -29998 36487 28796 -31509
358 -31509 -45335 7829 46203 3740 -43608 -30983 25234 27548 -20933 -41849 -1754 41958
370 41958 21431 -14547 -8943 40673 53797 21172 -4751 16770 49821 35448 1823 -7637
382 -7637 23500 37047 18842 -2227 11772 40926 42510 26707 17486 38270 48171 39139 18771
395 18771 16380 25444 21872 9495 -4112 1114 4452 7163 1078 1889 7426 12644 17966 14591 14344
410 14344 8268 12198 11547 5717 -7531 -13027 -5083 -2543 -7929 -20809 -9581 8150 16063 3888
424 3888 -227 19808 36439 30252 5188 7618 26109 33559 6696 -13290 1752 25352 21832
437 21832 -8501 -7724 22577 45578 23928 -814 13836 47178 46666 5483 -9768 13894 39117
450 39117 11941 -27054 -22006 17874 27670 -11397 -30681 -232 41352 24018 -17683 -19615 23947
463 23947 40703 -3804 -40193 -20012 24384 10495 -39120 -50984 -2899 28404 -6354 -44621
475 -44621 -24536 32075 32027 -17175 -39390 4157 40328 8153 -42253 -35864 20199 29576 -16348
488 -16348 -45824 -2292 47715 32049 -15989 -14097 44870 66104 23809 -18802 11064 58950
500 58950 46146 -11198 -25840 25671 54224 18467 -28371 -3547 51510 54396 1466 -20659
512 -20659 25805 60504 28715 -29511 -22543 26044 32465 -22831 -56787 -18895 24192 7063
524 7063 -46340 -40000 14408 39313 -2743 -37932 -6076 40340 30659 -25398 -35313 7864 35488
537 35488 -2349 -43327 -21466 28068 33231 -12087 -22634 19954 58875 34399 -6734 3031
549 3031 46905 53469 6451 -20323 4976 38762 16838 -26381 -26868 14931 32718 -1591 -25379
562 -25379 -1688 38860 29603 -8311 -17575 15770 33481 541 -32506 -24537 8733 3234 -31510
575 -31510 -45630 -15711 9787 -7432 -32472 -24549 11466 15967 -8987 -26467 -6971 14303
587 14303 -71 -28403 -32848 -7901 -2249 -21348 -39223 -23222 259 -1109 -17413 -18973 5147
600 5147 17468 8327 -7295 886 16610 16013 -626 -10081 2333 9938 3933 -10006 -5591 6763
614 6763 11900 4854 -624 8647 16148 15717 5408 4274 6988 7701 315 -8333 -9503 -10052 -10603 -16632
630 -16632 -18048 -18715 -15515 -14377 -13753 -12994 -13824 -9122 -7132 -5254 -10217 -11019 -8131 -4706 -7217 -14911
646 -14911 -12717 -6644 -685 -7563 -10462 -4092 8313 9776 810 1021 11859 22102 12725 2565
660 2565 4908 17997 17399 845 -7323 1745 14765 4087 -11676 -11602 7101 12629 -3171 -14000
674 -14000 -2976 16074 9176 -9886 -14624 5311 14291 -3368 -21060 -13549 8322 5494 -15421
687 -15421 -23998 -1704 14321 2153 -17533 -10772 15819 19108 -1434 -15762 3241 22299 11752
700 11752 -14011 -14849 10240 17585 -3379 -23449 -7375 16132 11872 -14354 -18374 7398 21733
713 21733 4502 -19721 -7636 17220 17716 -10614 -21611 717 18585 3895 -22977 -16264 10364
726 10364 17958 -7758 -22092 -1633 21489 12860 -14825 -13453 11836 23448 378 -18990 -5642
739 -5642 18277 14161 -13840 -18496 3551 19891 1592 -19395 -10566 14899 16874 -7807 -16932
752 -16932 2022 21574 7472 -14641 -11904 11792 17362 -4986 -18401 -4503 16719 7555 -14473
765 -14473 -15857 6606 16757 -1162 -16457 -5840 16040 12121 -7687 -13741 4843 17371 3488
778 3488 -13756 -9407 11014 10834 -6628 -16409 -1017 12924 4461 -11548 -9996 9335 13343 124
792 124 -11283 59 13389 8760 -7011 -10343 4562 9634 -919 -13982 -6735 5805 5138 -7571
806 -7571 -11217 1432 9423 3937 -7697 -3115 7657 9537 -1207 -7189 602 7267 3758 -7357
820 -7357 -5693 2506 6779 -226 -5046 1052 8498 8780 1075 924 6418 10656 5052 -819 456 3903
836 3903 3846 -3165 -5096 -2925 1038 -1724 -4970 -4332 -988 1414 -1928 -2316 -2391 582 -462 -2237 -3937
853 -3937 -3475 -2212 -3423 -3247 -4503 -2079 -1005 1206 1192 1488 3635 6221 8157 6086 5793 6309 9548
870 9548 7926 4332 3097 4906 7144 3490 610 60 5402 5424 1240 -1903 838 5715 2135 -3170
886 -3170 -5747 267 695 -4510 -10388 -8475 -1818 -3825 -9621 -12693 -4629 132 -2974 -9297 -6383
901 -6383 2441 4114 -2421 -7095 922 7592 5432 -3624 -2917 6879 10359 3171 -3486 3523 11836
916 11836 11072 347 -994 8431 13867 6520 -3774 1036 10057 10427 -1789 -6543 2125 9607 3305
931 3305 -8940 -6490 3770 6970 -4817 -11543 -3950 5934 1698 -10852 -10538 483 6772 -3576
945 -3576 -12095 -6533 5707 4422 -7851 -10736 -182 8503 -272 -10076 -6595 6105 7568 -3969
959 -3969 -8968 215 10933 4518 -5983 -5450 7545 10723 125 -7734 -893 10856 6611 -4654
973 -4654 -7059 5112 10677 2047 -6934 -1924 10276 8712 -2189 -6863 3403 10525 3064 -7353
987 -7353 -5692 6053 6595 -3285 -10304 -1752 6603 2567 -7689 -7778 3057 6270 -1515 -9616 -3434
1002 -3434 4845 3410 -6806 -9256 -293 4500 -1353 -9284 -4789 3842 4975 -3219 -6207 1415 7246
1017 7246 3983 -4529 -2618 4720 7206 -399 -4932 195 5841 4046 -3582 -2760 3138 6684 1190
1032 1190 -3280 -47 5525 4928 -1937 -3297 739 4476 74 -4515 -3545 1261 2407 -2889 -4073
1047 -4073 -1568 3315 738 -2541 -2847 1428 2961 -730 -2758 -1931 1851 467 -1828 -2886 -56
1062 -56 1761 304 -890 -539 2548 2134 1080 -179 1205 2082 1338 261 -1233 599 305 282 -1090
1079 -1090 -106 512 1054 1244 275 479 913 1837 762 234 -644 365 703 -505 -1103 -1837 414 555
1097 555 -426 -1556 -215 1874 1532 -80 -1347 1092 1717 555 -2452 -1725 591 1051 -1474 -3621
1113 -3621 -592 2004 1391 -2298 -1679 1799 3536 404 -2821 -494 2614 2477 -2722 -3212 231 3227
1129 3227 362 -3831 -1692 2426 3944 -1212 -2550 994 4709 2173 -2956 -2246 2371 4035 -1402
1144 -1402 -4265 -1467 3385 2277 -3268 -3221 1694 5093 388 -3227 -1288 4188 3602 -2419 -4146 192
1160 192 4579 140 -4656 -3679 3130 3889 -1674 -4611 100 5261 2453 -3251 -3451 3016 4245 -956
1176 -956 -5411 -2036 4022 1753 -3802 -5311 1414 4490 684 -4444 -1951 4500 3717 -1995 -4890
1191 -4890 812 4362 875 -5183 -3946 2261 3238 -1481 -5373 134 4831 3088 -2739 -2563 3310
1206 3310 5467 618 -4338 -852 3422 2923 -3116 -4202 744 4439 996 -4101 -1253 3953 4689
1221 4689 -699 -2833 1297 4717 2187 -3496 -2654 1567 3254 -1630 -4574 -1315 2866 1914 -2945
1236 -2945 -2752 1519 4224 66 -2912 -1395 2699 1893 -2545 -3934 -1120 2223 -755 -3514 -2736 1390
1252 1390 2498 -697 -2460 -61 3437 1655 -983 -2057 1244 2253 -444 -2809 -1456 1560 883
1267 883 -1440 -2313 291 1996 534 -1379 -1026 1392 1221 -291 -2248 -741 357 -367 -2186 -2728
1283 -2728 -769 -146 -882 -2353 -1510 -181 414 -898 -1677 -674 219 12 -1499 -1223 -717 5 -765 -1314
1301 -1314 -813 -195 767 -60 0 -349 935 839 -211 -401 -613 299 36 -764 -1614 -157 189 64 -769
1320 -769 -1274 269 558 200 -1581 -726 4 -26 -1408 -2697 -1226 -395 -446 -2378 -1780 -141 1196 -90
1338 -90 -1366 -150 1408 1844 -607 -1025 87 1810 329 -1974 -1319 702 1738 -266 -1077 202
1354 202 3092 2777 508 449 2431 3800 1451 -835 -242 2125 1514 -970 -2405 -61 2049 315
1370 315 -1238 -771 2225 2942 851 -957 876 3143 1071 -1614 -2305 570 972 -1316 -3659 -1918
1386 -1918 1075 931 -1293 -2029 1555 3336 1719 -903 128 2839 2510 -484 -2472 -60 1775 459
1402 459 -2818 -1923 1287 2479 340 -1383 1080 3700 3367 343 -309 2370 3361 701 -2248 -1191
1418 -1191 1193 1241 -2273 -2868 -321 2171 655 -2026 -548 2059 3270 -28 -1377 213 2375 935
1434 935 -2375 -2324 18 1332 -1310 -2546 -1106 1672 1908 -556 -571 1814 3718 1611 -112 451 2756
1451 2756 2533 138 -1223 498 2325 629 -1149 -1027 1848 2646 659 -258 1196 3149 2446 543
1467 543 -425 1701 2278 468 -1329 -718 1455 772 -947 -1521 531 1559 808 -832 -237 1863 2000
1484 2000 856 -693 864 1819 1267 -423 -699 1077 1394 367 -738 231 1328 1833 366 68 1182
1501 1182 2006 1738 425 680 1766 2044 685 377 877 1475 1250 -49 -24 724 1270 434 -334 182 877
1520 877 1259 117 344 432 1050 641 44 -94 119 767 -14 -368 -612 13 104 -256 -632 -457 287 251 121
1541 121 -294 493 465 751 -42 -299 65 691 267 -719 -406 -15 252 -335 -890 -487 222 472 -347 -207
1561 -207 355 1243 722 -139 -200 561 701 -575 -1008 -793 426 -316 -1065 -1392 70 886 428 -519 -110
1580 -110 1380 1336 315 -688 542 1383 109 -934 -1328 305 398 -477 -1471 -494 895 824 -392 -711
1598 -711 986 1584 696 -940 -385 1103 856 -791 -1686 -250 689 88 -1575 -1002 687 1064 -143
1615 -143 -948 256 1460 1529 -512 -713 412 1158 -67 -1598 -785 331 487 -1275 -1551 -410 949
1632 949 510 -1152 -655 1034 1623 -396 -898 -218 1169 366 -1391 -1141 -111 626 -555 -1428 -838 1000
1650 1000 904 -532 -964 463 1507 529 -821 -534 1058 776 -349 -1366 -461 987 143 -795 -1008
1667 -1008 546 894 -26 -684 115 1364 1160 -172 -508 619 1278 419 -786 -562 834 657 -350
1684 -350 -1267 187 930 514 -672 -322 861 953 319 -191 161 595 892 -280 -837 10 336 20 -1293
1703 -1293 -375 66 350 -537 -676 202 647 547 -611 -95 309 808 -99 -403 -419 436 229 -428 -585 -36
1723 -36 405 -156 -419 -135 481 638 128 -88 8 551 27 -1 -13 -186 159 -428 -325 -813 -434 -331 -470
1744 -470 -778 31 -127 13 -219 -88 75 149 221 -378 -387 -264 -75 -682 -758 -352 -291 -188 -726 -379 -185 255
1766 255 27 -403 78 -5 528 -337 -215 -357 30 -64 -485 -533 -312 262 -215 -469 -468 -32 554 -231 -425 -130
1788 -130 432 149 -65 -385 213 433 100 -178 -302 308 425 155 -330 605 756 761 -18 54 737 828 627
1809 627 -39 351 1052 902 290 281 818 816 908 85 315 1075 1136 438 332 866 1069 1441 74 258 817 1313
1831 1313 543 184 455 1256 1206 398 370 833 1509 746 230 386 1338 1383 308 134 609 1302 916 211
1851 211 490 952 1293 443 141 434 1275 886 99 -43 749 1387 743 30 101 1123 913 459 194 548
1871 548 1280 986 577 115 1093 986 807 53 347 1037 681 325 241 905 767 895 -72 366 878 979
1891 979 328 -146 608 666 681 36 -19 690 697 232 -100 428 647 806 143 -110 756 877 625 -246 303 513
1913 513 673 160 -146 188 201 135 -176 -229 189 740 70 92 191 629 480 -170 12 305 782 173 -63 -119
1935 -119 478 370 306 -110 -27 445 265 31 -32 468 443 413 131 519 647 406 163 -149 279 387 57 -341
1957 -341 17 435 30 156 -239 -43 269 450 28 335 66 311 299 -257 252 25 244 -135 -232 99 352
1978 352 301 105 328 179 691 434 279 2 447 590 -73 27 0 217 -6 -95 -413 -237 -33 -157 120
1999 120 -178 216 15 32 43 5 205 212 -111 -418 132 213 -79 -414 -101 252 32 -205 -172 281 170 51
2021 51 107 308 528 422 318 19 -26 393 136 -535 -350 207 101 -154 -257 -84 159 375 -95 85 158
2042 158 494 565 -259 -168 1 264 -255 -391 -240 58 -154 -119 -172 -14 519 119 258 364 598 414 319 17
2064 17 162 305 -111 -188 -501 18 62 26 -580 -271 423 369 7 -178 330 257 -51 -116 82 167 -94 -25 -490
2087 -490 -23 -150 -102 -555 -516 191 205 197 -47 78 132 333 -5 -150 244 211 36 -581 -119 -366 -23 -452
2109 -452 -596 -135 90 81 -82 68 544 549 142 110 230 296 97 -311 -96 -372 105 -124 -444 -321 28 159
2131 159 -79 20 41 479 32 27 160 232 189 -334 -224 -331 -81 -279 -397 -593 -252 90 -209 -211 -69 439 -30
2154 -30 70 22 -105 42 19 -248 -241 -31 -12 -25 -461 -271 25 66 4 -304 351 201 254 -15 233 267 136 -293
2178 -293 -256 -24 187 116 -609 -40 -57 295 182 42 346 359 445 -14 145 172 197 219 -7 -140 32 143 -495
2201 -495 -189 -186 172 -6 -47 -231 113 315 -129 8 -79 18 -57 27 -91 -310 -62 -185 -36 -559 79 167 -75
2224 -75 148 109 98 389 304 113 535 291 262 137 140 568 424 359 -140 210 210 293 102 141 153 -127 207 247 41
2249 41 -136 19 -34 36 62 -30 393 -128 -64 -131 199 192 -88 -61 114 211 -120 74 159 539 489 316 178 349
2273 349 354 95 298 38 529 135 0 119 147 330 203 134 180 363 457 368 63 385 487 396 -24 1 309
2296 309 -70 -17 -422 65 104 336 443 206 339 199 422 235 227 348 441 95 112 247 246 277 -147 367 270
2319 270 191 466 142 539 344 441 254 475 361 264 105 90 -51 92 145 -107 7 66 146 130 -73 58 197
2342 197 671 588 345 179 386 599 152 218 74 314 3 47 -82 407 262 244 261 324 381 336 331 130 283
2365 283 417 257 115 -140 -154 83 110 -168 -86 -24 -76 -30 -180 210 124 137 194 314 220 111 49 91 5 159
2389 159 -94 -176 35 -213 -3 -89 -4 139 62 161 -94 244 -66 108 26 32 -7 14 222 -163 -58 -191 60
2412 60 131 76 72 34 9 115 246 111 30 -37 -82 -85 31 234 -74 -36 -61 78 69 152 187 197 225 173 53 -242 -90
2439 -90 -95 37 -206 12 104 171 -108 -279 -78 -53 -212 -108 85 -11 128 -120 -33 -139 135 183 -185 163 2
2462 2 12 -72 22 152 45 -158 -30 -57 186 -130 161 -213 3 36 65 55 -121 198 76 303 -211 -13 -28
2485 -28 110 334 43 -28 27 143 203 102 -47 218 38 34 352 427 18 41 94 20 52 -35 109 -88 -373 -125
2509 -125 66 -18 125 -72 -4 160 -189 -51 126 26 -32 -16 21 -93 31 -26 -182 -37 67 9 -72 84 -18
2532 -18 93 -44 90 27 223 36 -118 -207 20 60 -28 127 -22 119 -242 20 136 43 43 -210 -21 -40 4
2555 4 99 -96 -193 -31 117 46 -76 -138 123 143 -26 -14 104 2 32 -36 -80 260 -131 151 116 -87 -106 -33 -190
2580 -190 -11 171 143 -64 -134 -123 65 70 -36 12 -26 50 65 5 78 211 40 16 -13 -117 142 188 -116 1 -152
2605 -152 -109 -29 -24 39 -45 62 -29 -141 34 207 120 -128 -184 -44 -51 -82 -94 -100 212 -1 14 -401 -130 -37 -144 -96
2631 -96 -39 81 -107 -190 -77 -5 -39 136 38 -233 218 211 -237 12 9 -188 -121 146 46 -164 244 211 -135 -3
2655 -3 256 269 294 87 26 47 -7 -135 -68 -248 -51 303 -19 49 -174 111 29 -160 -237 -182 -271 -410 -27 80
2679 80 -223 -20 -183 -195 -139 -265 -319 109 -107 -206 104 -205 267 12 -350 126 286 -154 127 60 127 44 8
2702 8 322 96 162 75 468 126 -74 289 192 192 140 162 205 -48 134 -100 109 54 -4 -90 91 148 99 -134 -173
2727 -173 97 -118 70 -110 181 -105 -18 93 -104 -120 37 35 16 225 73 -34 91 44 47 -43 -33 186 78
2750 78 -61 169 -3 -40 -89 -7 -107 -19 96 184 225 231 177 -191 103 -5 -119 175 -90 -213 103 270 -169
2773 -169 -12 -429 71 -150 -162 111 -12 136 64 -4 -47 -24 151 81 -84 -10 -29 -47 52 -62 40 -235 -170 -274
2797 -274 70 -123 -209 -74 -182 135 -56 12 182 179 -62 -181 237 -92 222 108 40 200 -200 100 -41 85
2819 85 -172 123 -175 10 -210 6 -156 32 17 -202 113 -107 -59 -208 -171 -59 271 -148 -35 91 -66
2840 -66 -52 -316 84 71 -170 -137 101 -46 -78 -16 123 99 -4 10 -188 35 -18 100 -11 64 143 170 -40 225
2864 225 28 -114 157 18 -146 193 114 122 51 -47 58 -26 6 36 6 -92 -20 -47 45 102 70 -13 -185 153 20
2889 20 234 -134 -242 -175 -114 196 22 227 -397 268 50 81 -110 172 -127 83 81 -140 138 -59 198 62
2911 62 127 -70 54 -45 -294 130 12 97 -103 107 118 -54 -122 -210 -21 -25 -29 -43 -14 26 -158 100 -7 -60 44
2936 44 -22 -153 62 103 -40 39 -114 -107 -26 26 -108 75 -185 84 254 -323 150 -3 -37 -157 102 136 -121
2959 -121 -52 -83 251 -64 103 -174 51 -92 -4 257 -142 23 -8 -38 14 105 -160 23 -162 70 23 102 190
2982 190 143 -36 -108 -355 -79 -41 -183 104 -205 70 -44 109 17 -116 -155 -180 -58 -80 100 62 50 100 283
3005 283 136 36 -55 130 72 160 7 -49 66 -153 -67 99 64 99 57 123 103 -84 75 24 43 54 272 171
3029 171 -68 -59 -148 -218 -67 -232 -165 45 58 -120 -13 -58 -161 24 -126 -88 -260 54 -242 83 -262 108 -276
3052 -276 0 55 34 13 296 56 109 88 57 318 34 126 -183 -15 49 21 180 66 -20 23 60 -100 105 91
3076 91 -189 -185 -44 40 84 -110 -311 -165 -120 34 111 -39 12 -55 -34 66 -2 -34 -82 6 -216 108 12 123 13
3101 13 -154 -159 -239 -32 -67 114 102 328 -136 224 68 14 -6 26 191 -177 180 -342 46 -2 247 135 -36
3124 -36 98 37 -98 130 -72 70 39 -276 -94 -61 70 28 104 73 -102 -192 -79 137 58 -141 7 -23 -72 98
3148 98 -13 200 63 84 114 -112 54 186 140 96 -65 48 -113 -3 -135 -121 252 84 -185 11 -26 -85 24
3171 24 -246 -71 0 -96 28 185 279 151 35 23 -5 -239 -4 235 -187 -145 -10 -53 -135 -29 -66 228 2
3194 2 -26 113 -193 41 -139 168 91 3 -129 -60 19 15 -79 -94 22 -26 -13 -214 -153 -66 22 72 31 -206 203 128
3220 128 1 -157 -97 -34 263 -208 97 43 -46 -81 -35 -55 -26 26 -145 99 -8 124 168 59 273 -323 -43
3243 -43 -106 22 148 -79 337 -46 -8 -82 -58 -1 29 30 -77 48 -74 106 113 -59 -183 -57 -7 -4 -247 -64 33
3268 33 -3 81 -50 64 -221 173 -146 -120 -44 -38 11 -155 4 -258 -54 59 -230 7 -36 -18 39 -130 -78 -65
3292 -65 -52 -322 -163 -199 35 211 153 94 40 114 -145 20 103 2 -264 24 -97 96 -28 78 -37 -18 -27 -284
3316 -284 124 -139 59 125 -123 69 19 204 -39 252 116 -77 -168 7 163 -220 103 188 -124 27 123 -89
3338 -89 -150 -98 271 134 -263 51 131 -444 -11 -90 250 -30 -53 92 -154 6 -15 -84 47 32 -101 -176 64
3361 64 68 22 -15 -19 -188 -247 123 -19 -135 -117 -246 -197 47 -80 -83 90 -28 -157 -50 94 103 -6 -76 -52 -34 49
3387 49 -8 45 -40 31 -38 -12 171 225 -107 8 154 -65 40 -42 173 41 -123 129 52 -32 60 47 55 212 -225
3412 -225 -53 103 52 -166 204 169 -130 -192 -87 -118 -56 52 -6 47 -31 -174 88 -66 130 104 94 -22 -10 167
3436 167 -95 -186 44 200 -72 66 -55 -223 -58 144 36 -104 74 -41 -137 -7 153 263 26 -172 142
3457 142 87 -133 43 -36 53 -142 128 -192 122 83 88 -23 -84 46 -62 -116 92 -43 -120 -46 101 -103 -142 -69
3481 -69 56 120 63 112 185 81 -94 -152 -70 54 -57 113 -135 -185 -47 140 -14 -40 164 -151 -210 243 127
3504 127 194 -119 103 115 -56 115 153 83 -217 -188 -336 -79 -99 15 -119 65 -47 33 19 1 -51 276 219 -192
3528 -192 116 14 16 90 165 149 -74 61 142 122 -26 130 123 107 69 87 169 175 152 1 136 -44 5 160 -62 -22
3554 -22 469 177 43 33 -113 164 92 -150 52 -85 168 -39 182 7 82 -177 -39 -167 -119 151 -119 -39
3576 -39 -61 12 30 147 -70 -62 -115 54 -4 -98 -9 -94 210 140 -8 146 -18 -36 -55 -376 -85 -14 -35 -136 -179 209
3602 209 284 82 -106 -131 2 78 90 -177 134 -76 -44 -221 -31 -24 -314 -89 -94 -85 110 -55 -64 -85 89 -265 77
3627 77 433 -103 19 -114 75 -213 70 110 -22 -29 92 29 -232 -126 -82 -65 84 -89 -41 112 -25 -210 -342
3650 -342 -128 -12 -62 -16 -128 46 -28 6 -63 -20 -30 -83 231 -44 73 -35 -125 -90 -223 -273 -123 184 386 -7
3674 -7 133 38 66 11 -32 104 83 -59 -27 -28 380 -112 -101 -33 -90 -67 109 -66 -88 63 -106 278 12 187 97
3699 97 -11 -143 -171 114 -31 47 173 -333 -2 96 306 -114 96 183 203 2 -176 -140 23 -28 171 -121 -73
3722 -73 -90 34 45 31 190 -67 19 -135 88 28 104 5 -3 20 -160 -54 -26 -31 -61 -55 -22 19 -88 52 116 -26 -22
3749 -22 99 20 81 123 237 -38 59 -73 -200 26 -104 22 -46 7 182 86 307 -109 69 29 64 -156 -146 31
3773 31 -124 45 -103 190 -11 -133 92 80 94 -132 -28 -107 -365 62 157 95 -44 -90 29 93 -162 95 158
3796 158 204 110 320 142 -15 -55 33 138 52 194 55 -98 -186 89 -19 -15 54 -90 -33 50 137 -170 26 64
3820 64 226 -226 272 60 14 173 -149 -150 -69 90 -22 96 117 37 -43 6 175 -150 72 15 110 -54 -9 120
3844 120 107 -59 -90 24 3 -37 93 -142 -23 41 -237 15 -115 91 161 -204 181 -36 -115 -120 -109 -142 -128 -91
3868 -91 43 -17 -17 77 47 -130 131 187 102 66 102 41 51 -82 77 171 -91 -118 -55 167 56 61 206 -43 -31 -55
3894 -55 3 98 -233 -50 17 -233 61 193 -145 -91 -13 200 -54 -140 123 -191 -5 67 211 44 91 -142 -37
3917 -37 80 32 200 -40 75 35 -202 -62 -84 26 -340 144 -165 -96 118 -146 -73 -11 -378 -141 -156 -18 -86
3940 -86 82 26 53 15 -169 226 -51 -33 -84 -160 -39 -50 12 96 3 48 -97 38 184 252 -109 -11 150 150 46
3965 46 -100 -40 249 177 41 67 35 -268 -150 -116 161 171 46 15 -24 82 2 -143 70 -29 -10 -97 30 294
3989 294 69 -74 -37 -154 -7 60 56 -131 184 -76 51 -70 -33 97 46 100 -10 -23 -120 57 95 65 66 -86
4013 -86 173 -59 -72 -70 -21 -227 118 42 82 125 73 291 97 -78 8 -60 60 215 27 -5 20 160 64 179 -34
4038 -34 116 -100 53 -7 -180 -90 -26 94 -7 190 72 -277 32 22 1 43 93 -83 -47 -96 49 145 69 -107
4062 -107 191 -75 -176 -44 -283 114 -71 -86 112 0 -57 75 -107 125 55 -186 -177 -18 1 -109 181 165
4084 165 -191 14 -67 254 -153 64 -56 75 64 -225 101 32 8 -125 54 38 -93 -139 -41 -62 -228 -136 -49
4107 -49 230 -39 128 19 0 -66 -17 -76 -236 79 -44 -140 82 258 -39 -53 -189 -51 16 -172 51 264 -96
4130 -96 84 -55 -54 98 -157 26 -56 -63 -69 -25 -137 -72 122 -78 196 -18 -133 -47 -100 -62 -29 81 -128 -162 31
4155 31 -3 135 0 69 -100 -71 -200 -56 -9 115 -109 102 132 -26 81 -335 -95 14 268 18 -124 47
4177 47 97 110 35 -49 74 20 67 -41 70 98 97 66 -72 -70 95 57 -196 252 -4 -33 241 112 -110 -96 157
4202 157 -384 106 -98 94 -71 202 -88 -48 -55 176 64 -56 -213 1 -53 -7 189 -26 -2 60 61 -216 60
4225 60 -102 -39 30 -36 218 205 -224 -45 250 -280 27 -66 17 140 57 -175 59 9 -210 130 -21 37 17 -125
4249 -125 10 111 -218 272 108 -86 70 -62 -157 -95 -282 9 -184 -124 -30 -30 -151 6 28 -40 -32 155 135 19
4273 19 29 -93 -256 129 85 -189 -35 147 26 -42 28 -95 169 -73 6 25 15 9 -87 -105 46 58 164 52
4297 52 128 219 13 -2 -5 -273 98 -116 -260 98 -148 186 207 -49 75 121 -144 -58 67 -96 98 155 -77
4320 -77 9 183 -47 -152 358 177 106 -8 124 -180 10 -205 84 -63 259 -30 -58 -68 -18 -157 -17 37
4342 37 81 152 152 175 11 334 2 -91 -20 -247 5 71 140 135 -5 136 30 -65 94 -63 -188 -122 -29 -97 40
4367 40 -138 52 135 82 -46 5 204 -155 25 143 -52 60 427 258 -26 34 -20 -9 76 45 -85 -9 -111
4390 -111 109 -200 -282 -189 -1 -124 -103 -117 52 151 107 57 21 -144 -206 238 11 -76 131 331 226 -302 11
4413 11 -184 53 65 -331 1 98 78 82 -61 15 3 -173 38 -111 148 -30 -287 16 -55 42 -141 -63 98 5
4437 5 -99 -70 107 125 -33 79 107 20 57 -18 -126 -1 278 -60 338 178 -73 59 127 -88 -224 96 -21
4460 -21 -59 -24 -46 22 -90 85 -46 236 -35 -21 87 181 -99 7 257 -118 34 -43 174 76 36 82 -97 -81
4484 -81 -14 -87 -4 -11 144 56 -77 -17 6 -112 -381 30 260 118 -58 310 18 -36 -26 -38 -137 80 195 -38
4508 -38 43 49 131 -206 -3 -81 6 -16 28 84 40 10 -263 -48 221 -107 202 -136 11 -194 -57 285 -62 -36
4532 -36 -223 -50 -204 -57 -56 89 0 36 26 -69 40 -76 94 -6 -276 -263 88 -17 27 -107 152 -103 176
4555 176 101 -28 171 -67 128 30 64 -89 -159 24 -90 1 -49 49 139 294 263 -45 -78 63 -54 -36 7 -89
4579 -89 100 166 -71 148 13 -130 -149 0 -202 75 -73 -112 93 40 108 60 -146 15 -269 135 66 -175 -20
4602 -20 155 -54 17 -7 -82 -15 -36 -129 -29 119 157 -21 13 151 -30 -59 54 -56 187 30 -97 -97 -112 4
4626 4 -188 -203 9 -178 -162 -203 -128 75 -60 -180 118 83 216 179 318 208 193 161 -52 144 -111 -107 9 128
4650 128 124 -40 -57 -17 127 88 -28 13 -57 -6 66 73 51 57 -194 95 137 78 62 -222 78 -37 80 193 116 -99
4676 -99 8 -203 6 46 56 79 59 -159 -104 -237 -65 -134 -42 222 -231 51 80 9 -85 176 76 -86 45 178
4700 178 148 -158 -116 -110 194 -190 10 -161 10 -15 112 -31 68 -44 -66 215 211 55 -4 -137 14 209 144 67
4724 67 -91 282 -1 -83 -18 -78 -62 -85 -188 46 69 19 -72 -69 -9 -109 4 -154 -48 18 37 -176 131 4 -24
4749 -24 -131 229 -110 -16 -42 -16 21 34 166 104 -99 56 -61 -72 -166 57 -185 -44 37 -46 174 145 -32 -188
4773 -188 259 -166 165 13 -228 -8 -217 160 238 -141 137 -35 105 -146 120 31 -1 -14 -24 -5 82 104 -65
4796 -65 -144 119 296 -118 -109 169 -3 253 82 -215 -48 143 84 62 -264 5 26 -15 -67 35 182 207 -12
4819 -12 -143 9 -15 58 142 105 4 190 -32 -269 17 -72 29 73 185 114 173 -52 -191 -153 -176 -133 115 115 -147
4844 -147 100 -128 -151 241 57 -134 65 113 -23 -42 100 -14 -212 78 -156 59 -66 -37 6 47 52 -356 -53
4867 -53 117 159 236 113 285 -49 126 83 152 -19 309 92 -23 16 -5 79 146 -170 -203 87 -28 33 44 -13
4891 -13 162 -54 -358 102 54 47 -77 -267 -1 -50 -271 -194 -105 -171 -58 -108 129 -110 -155 -57 56 -64 13 -88
4915 -88 -120 -52 -14 -121 115 -34 124 176 -187 -183 16 51 -122 186 28 -45 120 248 140 -66 154 131 174 27
4939 27 -157 -135 175 -200 -13 -50 136 231 96 -8 77 158 103 12 -162 127 143 -146 -99 -122 -44 -37 -172 125 69
4964 69 -14 7 59 -164 265 -142 50 -91 1 88 26 -34 169 232 239 -178 50 171 -92 -161 -125 -99 21 149 -46
4989 -46 3 32 41 -74 -17 111 210 -1 114 -80 -35 146 -36 0 103 -32 -221 97 188 -3 112 200 28 139
5013 139 147 -9 51 -162 -181 -39 117 17 -219 -196 -41 -28 -10 -71 23 29 -81 -45 145 -73 22 94 -291 -76 35
5038 35 267 99 106 -77 -37 227 23 -188 -250 -142 -33 -137 -170 -64 -52 -212 175 -163 46 97 9 -126 32
5061 32 176 -31 47 -77 19 28 129 165 -151 43 -66 -24 264 -48 92 137 -85 -146 -113 177 -92 254 9
5084 9 -317 -55 93 -76 268 -102 144 -47 -19 -95 -97 -30 -239 4 168 40 170 -104 -176 129 -91 -3 167
5107 167 144 -152 -270 -71 -90 147 128 0 244 227 -19 32 -88 43 251 59 37 -163 -38 46 -353 274
5129 274 40 -313 212 -190 229 -4 100 16 140 87 -180 -55 -265 -121 151 -21 2 179 -113 -98 46
5150 46 -46 -167 -11 -90 178 373 -106 -119 -70 18 294 -177 278 2 -100 -123 33 88 24 23 101 96 23 -181 -91
5175 -91 5 -36 207 43 -44 19 -35 340 -12 -52 21 20 123 75 -159 82 -9 57 -146 -29 62 20 105 -173 -218 -151
5201 -151 148 -74 -129 -67 -32 -11 -141 -26 7 167 5 50 155 138 -31 -67 115 108 -75 239 108 21 71 100
5225 100 -26 137 127 39 76 -13 -76 147 -53 92 38 108 16 -264 92 118 -36 -70 -118 -138 -108 -57 -54 15 -73 219
5251 219 222 139 -130 8 246 -231 13 -10 -1 74 -111 -257 -246 -136 44 -223 -87 260 -6 63 -41 58 188
5274 188 84 -56 150 11 -176 -24 -25 -29 42 -68 23 169 -160 -98 114 -219 21 -96 40 159 -14 -103 -101
5297 -101 145 -116 -16 268 45 185 -26 -19 25 -12 70 -200 -89 67 112 186 -149 -90 123 -52 26 -19 -16 92
5321 92 47 59 -138 -72 3 -46 -30 -1 64 237 -76 -107 -35 -129 -136 -216 -70 -38 -38 56 233 -86 -137 -2 170 102 265
5348 265 -86 22 63 -79 88 43 -9 184 -220 -3 -115 -73 100 75 247 157 -212 -24 -107 247 34 143
5370 143 50 -56 -42 -13 45 -128 83 -421 48 -23 55 197 28 -61 56 -53 53 10 153 85 -85 -13 19 -47
5394 -47 58 188 -159 -96 64 96 -119 72 31 58 218 -26 -14 174 -116 15 11 -84 11 -3 87 -96 40 120
5418 120 -78 -4 41 -9 32 93 5 -301 33 -257 -94 74 -42 12 104 68 -4 182 95 -105 -5 -105 -35 38
5442 38 -189 -87 117 -271 -171 122 167 -120 -54 -46 -7 -71 111 48 0 41 -86 47 251 -11 87 20 77 -242
5466 -242 -78 15 25 6 -72 -165 99 4 191 -197 0 -1 -109 107 79 213 99 78 -2 -53 -161 97 -178 -150
5490 -150 12 -73 -2 15 51 -179 8 -22 261 253 78 -201 50 148 36 -103 125 -83 -115 -119 -117 88 -20 -23 -60
5515 -60 172 -225 8 -145 -154 -163 -95 -117 198 -32 -222 -29 43 127 -73 49 -112 -66 13 -99 235 -32 158 183
5539 183 -118 -36 -23 117 93 -95 -86 22 21 163 63 -172 -53 -64 -70 33 -218 -57 0 -91 -40 -25 -70 171 -319
5564 -319 -133 -104 256 -97 -7 13 116 -81 -24 48 -54 -28 -134 29 112 57 -8 -95 -102 45 -57 -165 -301 -87
5588 -87 -105 165 154 -122 -70 -5 -20 -137 -49 22 19 -45 27 -116 -109 -26 -24 63 -251 42 45 -3 111 6 -48 -135 101 -31
5616 -31 54 32 75 134 -74 -86 -259 -34 148 16 54 -137 225 -68 -197 -13 -197 -71 96 51 -217 -1 15
5639 15 83 152 -45 -9 -106 96 155 150 -103 215 -112 33 -87 109 60 -97 -108 67 30 -18 295 31 187 -133
5663 -133 105 -1 80 129 -19 220 26 188 82 138 285 -103 -121 -81 -58 13 -86 2 -97 207 173 -29 -37 -158
5687 -158 -152 -41 -108 -2 -9 -84 8 115 -134 -273 59 54 26 -154 -148 -101 15 74 -40 51 21 -26 103 41 66 58 -247
5714 -247 -23 132 123 61 100 -20 -137 78 -185 -152 -216 6 -85 46 -116 -165 98 -111 -151 -251 -145 -79 50
5737 50 66 8 -29 -211 215 -16 -231 16 -12 -91 -87 21 178 -42 -105 -4 55 -232 87 37 -73 67 169 23
5761 23 89 27 24 169 -76 -78 -23 76 -126 -143 63 -93 -136 -28 129 54 -11 -76 267 124 200 -13 157 -144 -88
5786 -88 65 137 43 -121 84 150 -67 254 216 -186 127 0 -3 -173 -32 56 163 -230 8 -35 213 230 254 -332
5810 -332 61 -33 -42 13 -320 143 179 -163 28 -95 91 -130 -72 -17 24 -119 56 0 96 69 194 107 -1 74
5834 74 -70 272 -56 142 -62 37 5 -69 -189 82 -38 44 -156 128 -100 111 -51 14 194 -98 107 -104
5856 -104 59 7 31 -371 -31 5 164 -60 -273 40 37 -187 141 -106 134 -67 -94 110 77 -142 -88 22 75
5879 75 -52 -40 -19 30 -147 199 -143 108 45 179 40 52 64 100 36 -42 -49 -100 48 -155 90 134 72 -101 35
5904 35 -27 186 167 -98 -167 -229 -217 156 131 52 33 -41 -56 4 23 -46 202 -86 8 50 -250 124 133 -4 -264 71
5930 71 -31 46 -101 0 -206 -136 22 -151 -275 24 -208 151 -49 -75 201 86 31 57 53 30 -17 -210 -11
5953 -11 -98 -22 -121 177 -118 -69 60 24 -22 108 -78 30 125 -11 -14 181 22 -62 70 -68 -79 -71 117 14 -44
5978 -44 62 -81 186 139 60 138 146 134 -21 -55 -210 89 11 226 -21 -210 133 -166 47 1 171 -111 -129 -6
6002 -6 154 129 145 8 73 -58 -53 0 92 16 59 -236 148 178 4 -72 -190 34 -12 245 -47 73 -123 -212 -13
6027 -13 -46 72 -70 -60 -58 193 -149 -146 -83 -10 135 -60 -17 -23 -195 71 94 -197 -200 -141 135 -59 -229 -11 28 -26
6053 -26 -95 72 90 -135 122 129 -29 -48 27 -119 150 -105 -83 -76 -67 -122 -250 -36 -96 -7 40 -90 54 -57 -115 35
6079 35 -18 -2 86 -157 -20 -115 138 -148 -63 -22 131 46 -132 -69 -1 -262 47 -62 -179 120 -94 53 267
6102 267 16 307 91 -24 -45 -87 50 99 77 -206 -114 185 -100 76 -32 106 142 -52 -5 63 34 -104 37
6125 37 -148 10 -183 -176 117 269 -2 68 -96 54 91 89 112 145 37 20 79 -84 217 135 102 -153 46 -88
6149 -88 -76 -114 56 -1 109 -163 -85 -17 -26 272 -158 217 -76 -128 109 136 -67 -94 -3 -10 46 -86 110 89 -96
6174 -96 -253 -134 69 -1 -33 240 -32 96 -172 79 -160 95 -2 154 -10 -87 21 188 221 152 -230 26
6196 26 51 -100 30 -204 6 7 -225 127 -146 -144 94 -7 103 53 46 -86 18 164 30 -207 85 99 163 49
6220 49 66 22 11 265 184 -135 -8 -2 -96 56 -135 90 53 163 27 -91 111 101 9 3 27 151 -90 220 170
6245 170 21 122 -10 -9 -71 -11 71 134 138 57 -74 -33 60 -87 21 -132 72 -99 17 -19 -11 172 41 -136 8
6270 8 -84 342 146 -249 129 -192 -117 -142 -3 -66 -104 193 -195 72 28 154 60 -41 -93 -110 -85 -187 111 -4
6294 -4 -38 198 -181 -261 -67 61 14 146 -97 -107 -223 -31 -45 100 190 -109 25 75 -103 52 112 -46 96
6317 96 -34 248 -197 -50 59 -227 -118 188 121 -1 92 314 -11 251 -285 -183 -289 -3 134 123 -188
6338 -188 -14 -44 102 28 84 11 -41 -134 -17 -128 -96 10 0 2 1 119 108 79 89 -211 133 -160 71 62 -263 139
6364 139 28 -72 46 105 147 78 -122 184 215 -9 70 -30 -22 32 -77 179 125 100 98 59 -22 -97 -183 -71 -152 38
6390 38 260 16 148 -124 -77 -57 -8 -55 -52 -222 285 -24 -41 -86 -92 74 132 -201 -24 94 -108 92 -54 80
6414 80 26 153 252 260 32 -92 89 2 -27 -43 81 195 45 -72 -217 112 172 12 240 -34 260 97 -49
6437 -49 -63 -42 -35 36 -17 -39 -127 -19 14 110 -77 -89 -48 -6 59 18 -124 21 -15 32 -14 -8 -61 -3 184 -46 28 -55
6465 -55 -176 -42 149 129 56 -61 -189 -117 142 -149 0 258 40 -142 -39 -125 23 116 -280 259 159 31
6487 31 -252 -188 -194 -11 -92 68 96 -63 -50 -157 48 -114 -189 93 135 -207 -52 -82 -75 43 264 108 83 261
6511 261 31 27 -75 88 85 -18 -88 -57 54 178 100 -101 -146 -146 71 -12 -74 -72 46 -348 -51 -163 67 -144 7
6536 7 -8 -41 150 -125 -223 49 -152 10 -213 -115 -23 104 -9 136 14 -89 87 -47 85 -40 59 -249 -32
6559 -32 -189 173 -42 -57 -230 -72 -93 -200 27 -28 -72 77 -108 -33 6 86 -198 168 53 -104 262 -183 -298
6582 -298 -21 137 72 16 -82 104 24 87 -56 102 -48 59 125 -56 -239 -95 -2 37 -59 -94 160 -144 47
6605 47 -74 -280 -120 -224 53 -12 -25 -109 -155 40 21 99 -13 -76 -40 241 138 88 116 -34 -108 -86 160 -42
6629 -42 -25 1 -144 -163 -99 21 -88 -17 -143 118 95 -260 -88 220 -1 80 -25 -30 41 15 31 -232 138 134 144
6654 144 -149 -41 254 90 -133 75 -191 113 -35 18 110 101 20 -137 -91 -28 82 331 -28 -11 69 -61 0
6677 0 -124 165 55 14 -60 -56 -55 157 311 -128 78 -62 -103 -120 94 -109 -38 56 -69 152 135 36 16 -130 -248
6702 -248 181 -103 5 52 30 -101 69 -61 -10 70 -144 89 79 30 -34 -209 -2 58 -56 -35 43 66 -116 92
6726 92 -207 101 143 -41 -72 -56 -59 -57 170 109 70 -76 -29 33 42 49 104 63 269 -23 41 124 -198 -91 -13 121 -137
6753 -137 45 8 45 142 130 90 46 70 -118 -198 75 129 -87 -203 37 137 -101 -112 135 71 229 6 -179 57
6777 57 -55 -122 -160 -31 246 -151 -63 195 172 -142 -95 -71 55 -46 15 136 -127 -155 161 64 -29 151 123 -21
6801 -21 -134 107 108 91 -103 -58 -102 -128 -68 60 -42 -179 -183 -70 123 60 -58 3 -187 -19 -68 -41 215 48 94
6826 94 -32 -115 105 36 -31 142 57 -42 -152 -35 68 84 -18 -36 -92 -92 29 -150 -135 -222 7 -131 -260 62
6850 62 149 -82 -51 115 177 123 99 73 115 36 33 -156 -125 -32 -12 101 208 -32 -96 213 56 -67 -176 3 -258
6875 -258 57 -1 25 25 -42 -112 -31 -8 224 126 23 -116 7 -24 -55 -122 11 -82 -238 111 89 2 -22 -17 -181 17
6901 17 -13 -233 207 -30 134 -82 113 1 165 -34 124 233 263 17 -134 -89 -180 -35 6 33 3 -20 -277
6924 -277 -4 21 45 -84 22 -93 112 -64 -104 37 -100 131 -185 109 -49 -54 137 211 -74 28 115 120 60
6947 60 -124 -35 -345 6 -18 54 14 189 43 41 -175 314 107 -61 130 -104 10 -54 168 -26 18 -151 -56
6970 -56 -8 -84 108 131 -251 44 110 -18 -86 20 -20 258 -7 269 242 -94 -314 55 117 -31 94 90 42 -102
6994 -102 -25 -210 -2 -115 48 -119 161 -20 -161 158 -101 -206 -161 -17 -18 -88 -10 121 -260 -20 60 -15 67
7017 67 5 162 -101 -121 -64 72 -127 110 -45 31 65 260 152 -32 44 -154 -106 165 74 -61 -5 165 244 -65
7041 -65 93 -73 24 -73 -70 -112 77 2 -11 -13 -80 -167 17 43 151 63 37 -119 192 -21 223 164 -103 21 77 -193
7067 -193 49 -54 -171 110 145 82 20 -162 53 56 -278 90 243 86 9 -29 -49 -56 4 18 86 -63 -16 -49 138
7092 138 -247 53 137 -9 122 -77 70 149 -91 231 51 10 -62 32 -46 -251 -96 92 -123 249 87 70
7114 70 379 45 123 -119 -201 -38 -85 165 -38 116 -144 -28 -248 -11 -71 51 -47 -43 -79 -35 59 -45 -204 79
7138 79 -40 -133 183 80 -131 94 -81 -11 31 63 -140 292 65 -77 -139 -6 -252 90 116 -174 0 72 -107
7161 -107 -108 -158 -311 232 72 40 12 102 59 56 -8 -116 -125 -120 20 1 119 19 -6 70 -49 160 -114 98 48 -255
7187 -255 47 193 126 5 281 150 29 9 22 51 33 6 94 -58 -6 -130 -242 -47 -33 -1 -101 -205 169
7210 169 102 -133 -280 -18 42 -9 -40 105 -78 -264 -215 155 -223 143 -38 -53 37 -30 -63 24 129 -45 16 176
7234 176 94 132 -29 68 117 37 -14 -49 168 -111 5 -42 -29 -193 35 -167 -4 -135 -75 -107 74 54 115 -101
7258 -101 126 -236 -199 32 1 -90 -27 -115 21 -231 36 144 85 74 -110 -193 -12 105 -58 2 79 -208 59
7281 59 -83 -23 103 3 -71 38 54 237 -58 10 6 64 74 53 -94 -9 -11 97 98 27 -82 -178 18 83 -59 10
7307 10 -27 22 -47 -67 -20 -179 218 205 303 -25 1 88 -240 -5 73 -100 -190 -151 -21 134 -256 47 217 -173
7331 -173 146 256 -41 6 153 -65 -97 20 22 101 1 46 -153 191 -3 -229 136 -121 281 -153 -20 -207
7353 -207 2 -105 -205 -262 70 97 24 74 -80 -145 -100 -279 -174 -86 -65 -21 57 -25 -107 -16 85 -101 -209 -162 67
7378 67 175 8 -57 213 240 -120 44 251 180 -183 59 -131 -137 -91 -86 -113 209 -83 102 104 201 -44 -75 -132 -153
7403 -153 22 -48 266 236 -34 81 0 52 23 -121 117 -63 -126 291 31 -134 130 33 -50 67 14 51 55 67
7427 67 -187 -82 -42 54 105 120 -85 133 -69 -221 201 268 -81 160 -95 55 129 88 -207 76 -121 -167 25
7450 25 -25 -102 -276 -98 -155 96 3 -45 -112 -147 14 -72 -93 -31 -97 33 -124 -169 -204 86 164 -48 16 -66 -165 111
7476 111 -38 140 174 -250 -103 -118 103 175 -18 104 125 -155 -4 82 21 -198 -149 327 -211 96 -99 38
7498 38 49 -153 146 -60 48 36 85 -97 -55 -44 -47 133 116 -61 -141 21 167 -104 195 36 253 -182 -44
7521 -44 -41 -148 68 147 -131 42 113 -69 -120 -23 -9 141 98 203 -48 -136 -161 -266 124 125 -40 -180 227 201 30
7546 30 50 179 75 54 -117 3 24 -25 101 17 192 7 -102 81 -318 -10 191 -18 -133 29 86 -22
7568 -22 -13 -47 -9 192 28 -147 113 16 60 101 -116 -30 -158 -25 223 -165 1 -19 -239 -45 42 40 -262 14
7592 14 -60 9 111 -52 -10 230 247 47 74 -146 152 45 233 102 0 -117 62 98 -184 -269 -111 -235 133
7615 133 168 -90 -151 271 -38 -89 10 32 -21 174 51 -132 -63 90 8 -60 213 -202 26 -210 -79 157 -55
7638 -55 -154 5 83 175 298 15 -54 -42 126 105 -91 -270 31 -142 -214 -34 59 -73 -118 -25 -2 -111 -35 258
7662 258 -45 -35 -79 -26 -51 -145 -35 85 -246 7 -3 -88 45 -131 268 -2 -267 -13 37 76 186 -216 51
7685 51 102 -138 139 34 -15 373 -134 -2 149 67 -117 -124 -69 -80 -24 -176 86 20 383 97 -195 43 -81
7708 -81 -8 26 262 -34 -24 -77 -372 -258 84 -258 -7 139 -223 80 -128 102 89 232 -160 -135 -359 -46
7730 -46 26 103 -4 -31 4 160 189 -138 -183 -9 -64 -5 12 -58 -156 -81 123 -25 -54 266 185 -200 82 -96 -53
7755 -53 5 -41 -14 -22 -302 -5 27 -214 176 -172 92 132 36 -140 29 -55 -89 -329 112 63 -81 171 -126 -43
7779 -43 158 -216 -127 48 -109 -11 -73 7 131 313 -46 97 51 25 79 -240 -183 164 0 123 31 -261 -135
7802 -135 -238 -52 195 17 -230 -42 -39 29 208 59 35 -68 22 -109 -54 -62 -90 23 54 92 -141 -55 -111 14
7826 14 -58 78 -60 198 -100 -42 -218 13 -11 -100 -106 203 -32 -82 -36 172 -23 -61 -75 -206 -14 -20 105 -155
7850 -155 -235 199 117 191 -159 -239 -64 233 -70 -30 116 75 -87 144 64 138 -29 -119 -27 54 -24 165 159 123 -28
7875 -28 50 -230 110 -108 21 29 -224 -26 129 35 -44 142 -108 -71 0 -65 -12 -25 6 32 5 -63 -4 -101 110 -117
7901 -117 25 52 14 2 24 49 194 121 -242 -2 60 -174 140 -80 -1 0 -122 61 -35 77 25 -167 -13 114
7925 114 -215 -161 10 145 211 291 165 -26 -54 62 4 36 29 150 -109 109 -60 -26 44 203 -67 272 -211
7948 -211 100 128 -155 47 98 -24 -91 -124 253 -248 -124 50 24 -74 13 -21 4 -32 -203 35 185 183 50 37
7972 37 -207 46 328 -109 -105 -10 12 -14 -3 -106 -37 152 91 293 -94 -224 -97 160 -103 100 -65 -42 35 -11
7996 -11 -78 -83 -39 -98 -124 -22 -24 203 -135 -87 -35 61 -124 -7 -141 -115 -9 -25 122 263 361 106 -96 -2 147
8021 147 -40 -147 -94 -100 -179 -77 -150 -283 -109 116 -91 18 -173 -106 -72 -62 -100 41 159 -137 -15 178 -146
8044 -146 -221 -51 186 -120 -113 31 -149 103 -33 110 -64 143 50 -173 157 -2 127 -56 -88 -84 92 32 -75
8067 -75 181 -31 53 56 -131 5 -135 -129 33 36 33 132 -173 -109 -89 -67 64 -233 -65 3 288 109 -87 158 165 52
8093 52 -215 103 -67 -190 56 268 -186 79 -59 97 142 137 -106 181 -50 52 -88 -31 -254 -17 -131 -156
8115 -156 -58 -21 -170 -113 -34 180 25 156 143 36 -26 -187 25 39 94 138 -80 -148 -5 185 -63 0 364 115
8139 115 -31 -148 36 -73 9 270 -34 3 -304 73 -125 -101 -195 -153 84 108 40 -47 231 108 178 161 -173
8162 -173 57 -18 -117 -151 -49 -173 -265 -113 -49 -249 -80 8 -91 229 -43 -117 -52 24 -186 -111 -22 -6 10 117 79
8187 79 25 173 -124 242
8191B42
$$ Imaginary data points
##PAGE= N=2
##DATA TABLE= (X++(I..I)), XYDATA
0 0 0 0 0 0 0 0 0 0 -8 6 -8 8 -16 16 -24 32 -35 48 -56 70 -81 99 -118 137 -163 191 -222 255 -297 339 -386
31 -386 442 -505 571 -645 728 -816 915 -1024 1143 -1272 1414 -1570 1737 -1921 2124 -2347
47 -2347 2585 -2851 3140 -3460 3810 -4201 4635 -5121 5665 -6288 6998 -7825 8793 -9956
61 -9956 11376 -13158 15474 -18620 23161 -30344 43528 -75980 341827 364813 140964 642562
73 642562 679439 398182 -24883 -140870 106466 248489 -291373 -608985 -243637 135243
83 135243 -88462 -311004 -221145 130675 387359 175357 -171991 30626 427546 240588
93 240588 -188568 -232489 -6196 118641 -55740 -321818 -240824 214081 303456 12257 -2192
104 -2192 365157 571783 452903 240012 210664 458372 511861 167551 -91182 90739 256860
115 256860 86980 -130673 -130065 93513 241072 115091 -73407 90851 347164 272949 40141
126 40141 -4066 128023 168429 29269 -193574 -185542 -4506 -4839 -198325 -232822 -49123
137 -49123 58795 29854 -62119 -32742 117897 177808 29531 -74144 17409 73181 -8135
148 -8135 -129159 -138466 -73277 -17304 -77520 -148890 -66994 43395 36745 -29854 -5885 45084
160 45084 75762 38061 -28312 -28482 18663 12480 -60564 -54891 -16435 5662 3828 7524 21161
173 21161 55614 83428 57214 58295 68044 60967 31601 31239 22124 -6382 -9691 -7555 3271 914
187 914 -260 -8500 27691 49877 15611 -9606 7144 32043 -2815 -45403 -68863 -35427 -11710
200 -11710 -49144 -91033 -52960 27733 24541 -13988 -16213 54477 100553 62544 -5994 5585
212 5585 81226 67884 -20433 -64948 4846 60309 24886 -46397 -25334 87746 123070 49725
224 49725 -4264 75655 149780 104710 -7674 -29678 52825 75299 -22986 -121256 -60236 39678
236 39678 25991 -74925 -81414 36792 113226 52103 -44672 4908 114205 109660 -24300 -83939
248 -83939 741 67536 -4968 -128752 -103771 21422 63124 -43776 -95636 11211 127941
259 127941 92690 -30189 -26734 87912 132475 6626 -100981 -44216 63429 28019 -111137
270 -111137 -130462 -9586 78493 -4952 -98628 -36023 105551 113520 -15022 -61168 37204
281 37204 122795 35127 -92404 -82269 38249 57973 -64986 -129160 -36612 80403 39240
292 39240 -67154 -59540 71381 123736 22444 -64381 -5848 102588 64291 -60704 -94750
303 -94750 9768 71645 -11041 -105001 -57471 67888 72298 -27981 -68828 32572 113150
314 113150 51490 -53239 -39855 66951 78601 -23886 -92726 -18166 65423 27106 -71680
325 -71680 -71061 34150 73462 -1204 -73169 -16920 67676 49000 -48187 -72653 6785 49986
337 49986 -10472 -89891 -56202 24478 29888 -48186 -77919 -10030 46381 10834 -62634 -47901
349 -47901 19911 38044 -29130 -70907 -24792 30582 12744 -51550 -48436 11216 44459 -1548
361 -1548 -41711 -12179 40405 35197 -22339 -35295 3467 35689 1002 -39879 -26869 18557
373 18557 26697 -12764 -26403 3094 38321 19806 -12808 -13323 15686 23441 -8944 -30920 -21795
386 -21795 1758 -8453 -30131 -35565 -13357 1833 -9469 -18743 -13318 6234 4752 -5739 -15339
399 -15339 -10047 -6134 -13167 -21458 -27507 -21038 -19581 -14520 -15637 -10996 -5178 4732 15062 13950 12919
414 12919 12669 25144 24823 14707 2056 6654 18808 13653 -223 -6392 15753 29208 22808 6778
428 6778 16816 42958 46851 25120 7286 26755 41509 27142 -7544 -10464 15689 23980 -2660
441 -2660 -27509 -4411 26966 24820 -10307 -13390 21077 41500 14667 -22620 -8970 24200 22726
454 22726 -23979 -41253 -8992 21928 -605 -41038 -27734 18644 34255 -8414 -31186 1956
466 1956 42692 23703 -27834 -29444 15020 35459 -10817 -45826 -18105 33349 26181 -23199 -28371
479 -28371 22557 58592 21786 -19485 -1212 52799 50560 -5427 -28282 12087 51185 17398
491 17398 -31336 -22750 35335 47716 -262 -28922 9794 58039 34328 -19389 -25874 25589
503 25589 41414 -8886 -53192 -27395 22352 8737 -44353 -56903 -1199 30905 -3256 -46218
515 -46218 -23089 34598 33595 -18654 -42691 3271 38055 7365 -44188 -33488 22459 33683
527 33683 -9950 -36654 9225 56430 42880 -4207 -183 52702 71238 28912 -11108 15793
539 15793 55330 43282 -10503 -21028 21753 47218 15676 -23071 -192 45478 48918 4188
551 4188 -10964 24887 53534 26503 -19195 -13156 22824 28186 -16064 -39529 -11475 22259 8608
564 8608 -28483 -22426 17469 37297 6184 -16452 4408 37511 28637 -10422 -18481 8437 25858
577 25858 -2546 -28598 -17079 15943 17632 -9777 -15723 10935 36916 21836 276 5644 33077
590 33077 36275 10859 -4055 8903 27248 14651 -6450 -8423 14188 22865 8410 -2105 9700
603 9700 29767 26557 12567 7068 20921 26317 13735 -1726 -2209 7320 2341 -10320 -19093 -10864
617 -10864 -5399 -8601 -16323 -15114 -5270 -3387 -5577 -11149 -6760 -4431 -4551 -9490 -12632 -11269 -11705
632 -11705 -10137 -12868 -11407 -11207 -6107 -1669 486 1016 2629 10779 14555 14399 8296 11325 16702 17539
648 17539 8612 1710 7118 11976 8974 -3786 -3253 5954 11968 2156 -7009 443 12019 11565 -5018
663 -5018 -8250 2271 11599 -907 -17714 -13717 845 3171 -16235 -23880 -10164 7057 -1007
676 -1007 -18479 -14455 6994 16611 -1770 -13408 -1331 19888 13361 -9073 -13253 6763 19219
689 19219 -407 -17994 -9776 15211 13646 -8872 -16777 4652 23150 8099 -13153 -9292 17361
702 17361 19740 -4217 -19934 -2626 18480 6135 -19181 -20650 6914 15858 -4680 -23418 -7331
715 -7331 19389 14129 -11280 -17225 9906 23938 5287 -18971 -8518 17732 16815 -9742 -22217
728 -22217 1875 19879 6108 -19546 -13580 13818 19969 -3724 -19802 -13 21356 13054 -14690
741 -14690 -14879 9678 19652 -1453 -21840 -7410 15074 12377 -14459 -19222 3252 18731 2785
754 2785 -18382 -8533 14178 17098 -7229 -16279 1682 19147 6869 -15698 -11713 9041 16002
767 16002 -5902 -18173 -4499 15153 7946 -13155 -13482 6306 17158 144 -13760 -4589 15196
780 15196 11979 -7709 -12569 2829 15240 1111 -13946 -9980 8140 9024 -7256 -14369 -1468
793 -1468 12516 4298 -8859 -8241 7959 11972 -766 -10447 -2766 10077 4495 -8156 -11570 1837
807 1837 7370 -880 -10685 -4613 8250 7692 -1408 -5479 5485 11645 6253 -3472 -1715 7178 6988
822 6988 -1619 -7921 -1286 3724 1023 -7051 -6622 884 3460 -432 -5676 -1060 3042 2860 -3542 -5345
838 -5345 -1628 55 -2795 -7937 -6100 -3667 -1640 -4703 -4849 -2093 1376 2680 1166 2762 3970
853 3970 6789 5652 5115 4155 4403 5358 3992 3432 1076 3159 3505 4402 2002 1610 3495 5114 4342
870 4342 24 432 1577 3027 -1878 -5743 -5158 -2686 -3176 -9007 -10139 -7289 -2331 -5334 -9151 -7886
886 -7886 -1280 1561 -3858 -6032 -2401 4865 2436 -3432 -4292 3019 7424 1676 -3138 584 9976
901 9976 9457 2708 -211 7805 14163 8627 1246 2023 11579 11451 2665 -3804 2475 9805 5056 -5439
917 -5439 -6606 3976 6351 -1898 -10659 -4377 4969 2473 -8470 -11639 -813 4581 -2359 -12798
931 -12798 -7976 2924 3389 -7382 -12545 -1552 6400 1536 -10105 -6970 4719 8568 -1930 -9157
945 -9157 38 10065 7460 -5294 -4986 6144 12268 2721 -6927 -406 10343 9974 -3385 -5936
959 -5936 4004 12401 4136 -6912 -2965 8794 10935 -1670 -6585 1779 11882 5370 -6396 -5964
973 -5964 5251 9424 -2385 -9625 -3624 7859 4083 -7321 -9003 2025 8394 -758 -9012 -5533
987 -5533 6430 5374 -5713 -10293 -1256 6463 -539 -9450 -8003 3477 5012 -3648 -8718 -1082
1001 -1082 8074 3969 -4812 -5193 5039 8371 1072 -6175 -1163 7478 5102 -3098 -5566 3314 7620
1016 7620 2617 -4640 -1649 6901 6684 -442 -4679 2014 6109 2738 -5257 -4388 2277 3469 -2388
1031 -2388 -6979 -2142 3112 1866 -4869 -4426 895 3866 -475 -5041 -1922 2058 2233 -3550 -4316 -909
1047 -909 2297 -3 -4029 -1917 1524 3455 -637 -1331 788 3824 2370 -975 -837 1122 2723 -287
1063 -287 -1769 -1236 1353 1041 -779 -1081 171 2440 979 346 -259 1242 1360 120 -859 -1387 -153
1080 -153 -654 -538 -1504 -1067 -523 482 317 -616 21 531 1655 -1 -534 -762 579 655 -1307 -2035 -1612
1099 -1612 1037 -249 -1205 -1800 1158 1837 227 -1157 -701 2662 2026 -520 -2550 406 1956 103
1115 103 -2650 -2532 2067 2426 -503 -2799 477 3648 2491 -1441 -2083 2306 3454 276 -3986 -1140
1131 -1140 2512 2360 -2725 -3958 1101 3484 1192 -3692 -1278 3203 4097 -1318 -3611 236 3609
1146 3609 1556 -4485 -3375 1331 3700 -1367 -5020 -922 3944 3329 -3253 -2885 1690 5195 53
1161 53 -4707 -2375 2980 3096 -3469 -5059 -386 4453 410 -4582 -2829 3470 4675 -1308 -4124 -360
1177 -360 5333 1691 -4108 -4058 1738 4105 -1798 -5351 -2028 4427 2735 -2816 -3719 2463 5742 997
1193 997 -3773 -1950 4526 3291 -2157 -4952 -83 4388 898 -4179 -3378 3274 4400 -325 -3791
1208 -3791 632 4999 2971 -2440 -3534 2461 3542 -743 -5357 -2382 2763 1989 -2944 -4320 1075
1223 1075 3925 1439 -3474 -1654 3170 3252 -1424 -4290 -189 2607 405 -4146 -3417 965 2860 -866
1239 -866 -3626 -184 3500 3116 -1443 -1635 1638 4058 853 -2736 -892 2278 2292 -1726 -2600 30
1255 30 3319 1240 -1476 -597 2396 3526 280 -1260 66 2821 1315 -1816 -2281 -149 1572 -969
1271 -969 -2275 -1433 1228 1010 -717 -1533 124 1990 621 -907 -1436 748 856 -717 -1852 -1056 838
1288 838 273 -638 -1172 760 1109 834 -314 -164 1112 791 240 -1109 -211 -280 119 -1205 -1442 -739 -198
1307 -198 237 -1193 -795 -734 134 -280 -1249 -1667 -1605 -861 -1714 -2313 -2843 -1464 -1020 -1488 -2381 -1530 238 -209
1327 -209 -1114 -1904 -539 306 -406 -2382 -2177 -463 -221 -1439 -2511 -1163 536 698 -958 -1176 730
1344 730 1967 990 -1671 -539 769 927 -1585 -2960 -1203 220 -431 -2852 -2175 12 1574 -775
1360 -775 -1925 -629 1727 1094 -2020 -2319 -767 952 -1781 -3853 -3209 -634 -159 -2753 -3256 -1022
1376 -1022 1903 260 -1722 -1401 1612 2285 -727 -2083 -867 1752 -191 -3049 -3192 -230 1276 -920
1392 -920 -2278 -859 2700 2208 -160 -1004 1968 3456 969 -1627 -1516 1190 763 -2164 -3838 -1438
1408 -1438 982 -356 -2748 -2198 1238 2039 -99 -2452 -252 2257 1196 -2249 -2927 -355 282 -1698
1424 -1698 -4246 -2710 154 327 -2138 -2758 282 2256 1170 -1445 -502 2018 2201 -549 -2509 -728
1440 -728 1193 375 -2870 -2118 12 1399 -694 -2239 -397 1961 1648 -698 -1271 415 2141 -148
1456 -148 -2456 -1880 24 187 -2473 -3227 -1783 459 -855 -2239 -1667 334 1386 -666 -1464 -644 1264
1473 1264 417 -1480 -2020 -574 727 -995 -2093 -1575 845 783 -707 -1063 630 1805 1047 -137 -21
1490 -21 1770 1646 732 -482 125 1303 964 -513 -790 711 1114 450 -464 190 1115 1119 463 -618 741
1509 741 1097 1014 -522 -218 440 747 226 -904 -118 -71 374 -331 -655 -87 503 456 116 153 433 1083 447
1530 447 310 245 848 980 238 -75 -138 657 358 -46 -301 62 680 527 348 -100 1192 727 1024 -1
1550 -1 396 851 965 161 -604 -165 77 157 -1076 -752 -16 459 280 -650 107 757 1269 -151 -167 159 1028
1571 1028 417 -762 -582 78 685 -515 -1110 -880 661 890 -703 -384 598 1726 686 -119 31 1252
1589 1252 1164 -271 -1159 -397 848 -138 -1494 -1352 240 988 -19 -967 -267 1538 1142 -5 -859 615
1607 615 1353 79 -1279 -1196 401 310 -711 -1703 -166 1034 483 -1095 -643 852 1427 416 -895
1624 -895 82 1383 1250 -891 -1303 -266 574 -307 -1810 -1103 419 767 -631 -1126 331 1219 669 -1035
1642 -1035 -424 940 1169 -595 -1497 -492 614 390 -1714 -1453 -219 956 -270 -1126 -257 772 1273
1659 1273 -156 -584 310 1326 85 -938 -873 435 444 -785 -1223 -872 611 59 -1082 -928 318 974
1677 974 -30 -736 -418 946 394 -746 -1126 -229 594 -358 -1295 -1347 78 30 -609 -1139 -260 454 73
1696 73 -556 -466 695 646 -108 -888 -111 384 154 -485 -964 -88 423 -124 -815 -285 518 778 142 -307 440
1717 440 933 627 -96 79 379 394 55 -691 -224 232 375 -352 -508 -386 392 270 -241 -344 118 410
1737 410 -200 -413 -281 113 -89 -313 -762 -401 -150 -589 -496 -443 -48 -185 -124 -333 -272 173 -127 -47 -660 -407
1759 -407 -84 -218 -783 -517 -636 -389 -535 -804 -625 -360 -211 -570 -840 -405 -207 -521 -934 -654 -551 -433
1779 -433 -851 -1235 -1037 -643 -452 -1164 -928 -910 -439 -337 -832 -918 -201 -411 -800 -950 -1212 -421 -642 -827 -1060
1800 -1060 -779 -257 -929 -1176 -958 -253 -438 -869 -976 -802 12 -493 -998 -1280 -413 -318 -550 -1239 -839 -255
1820 -255 -169 -1094 -1255 -324 -336 -349 -887 -678 -270 95 -542 -1109 -617 -255 -16 -1124 -966 -97 61 -465 -1053
1841 -1053 -659 -78 122 -582 -728 -184 356 -24 -1071 -574 -48 399 -613 -377 -162 450 468 -401 -227
1860 -227 63 431 -124 -470 -210 311 291 -359 -538 189 711 33 -229 -353 425 582 -92 -239 97 673
1880 673 138 -378 -329 427 618 101 -397 -268 761 372 8 -294 381 867 364 -78 -173 755 598 156
1900 156 -422 200 546 238 -335 -197 584 577 132 -344 -31 465 426 -55 -159 426 533 214 -464 -170 58
1921 58 198 -139 -136 28 192 378 -91 -66 437 649 249 58 220 367 472 126 201 87 262 230 -7 115
1943 115 249 261 -162 13 154 324 392 -1 -54 250 500 0 -130 158 143 13 -155 -128 -93 210 194 5
1965 5 89 274 395 327 121 361 591 330 203 -53 163 107 242 -99 -154 142 190 -100 -13 174 226 367 97
1988 97 -86 301 227 414 -285 -131 -110 306 -283 -421 -168 60 77 16 -121 45 288 214 459 109 280 221
2010 221 217 311 185 584 133 7 -196 -44 98 -145 -162 -34 476 197 46 -250 241 368 222 -3 -235
2031 -235 166 -53 -15 -475 -316 -128 -233 -470 -482 226 81 55 265 -3 369 291 99 -267 52 490 148
2052 148 -378 -216 -359 13 -114 -406 -89 100 180 -282 80 190 594 107 -67 192 199 352 -297 -192 -333
2073 -333 113 -525 -455 -430 -225 171 -335 -125 -117 578 464 240 -116 351 379 21 -341 -12 296 -75 -260 -699
2095 -699 -274 176 24 58 90 444 438 236 59 345 332 262 -101 -404 205 -265 -119 -430 -231 217 -72 139
2117 139 90 254 468 279 -17 120 444 265 31 -423 -15 -508 -71 -316 -494 -131 -82 -352 -412 -262 260
2138 260 245 -312 -159 138 153 -155 -270 5 -256 -220 -358 -553 -279 -157 -7 -218 61 60 313 -188 -111 -111 140
2161 140 0 -171 -323 -422 71 -408 -471 -552 -148 -69 -261 -173 -21 151 121 140 -168 182 268 45 -356 -278 -67
2184 -67 -105 -229 -399 -228 -290 -146 -260 -289 32 25 127 -351 -194 -294 -328 -200 -620 -379 -603 -363 -597 -416
2206 -416 -605 -394 -444 -480 -201 -64 -135 -484 -62 -262 146 93 -132 -218 -9 34 -181 -97 -188 279 -101 -15 -272
2229 -272 -123 18 -268 -265 -339 96 -41 -427 -243 -398 -33 -8 -489 -655 -301 -405 -431 -561 -541 -138 -326 -372
2251 -372 -496 -548 -94 -111 -426 -111 -214 85 181 -200 10 -199 244 -426 -127 -100 -207 -190 -365 144 -127 17
2273 17 147 21 -98 -11 -28 -445 -135 -343 -270 -598 -405 -469 -389 -134 -389 -180 -178 90 -173 -311 -335 178 -134
2296 -134 -171 -374 -116 52 -169 -85 -291 185 -244 -323 -174 -15 179 83 -63 -138 210 76 -50 56 -272 -129
2318 -129 -160 -10 -51 -50 -21 -61 -21 -301 138 280 -5 -87 77 1 36 -26 -35 9 6 52 -28 51 -93 192 -48 -157
2344 -157 -38 283 394 -78 271 62 294 295 -12 -146 -4 54 -381 -206 -313 127 -110 -115 -332 136 291 141
2366 141 11 76 143 -99 -1 37 280 157 -148 -182 -122 193 -175 -33 23 58 95 239 4 -33 232 109 122 -93
2390 -93 68 102 -103 117 29 113 82 242 -108 66 137 32 229 307 165 118 259 13 56 -12 -122 195 -233
2413 -233 217 115 93 -22 93 90 81 48 205 227 -106 308 4 294 9 106 -19 -213 -341 -172 -152 -298 100
2436 100 -285 -157 359 -20 -209 38 244 117 -119 -16 54 -118 21 -122 -116 231 -22 -112 -93 98 -12 -37
2458 -37 10 238 54 21 -44 85 164 103 156 -164 123 48 61 117 -194 -59 36 219 15 61 224 107 203 -154
2482 -154 35 125 200 -49 -44 -180 62 42 -9 -285 -189 89 -44 -48 -98 -22 -28 -255 -84 -51 -111 1 -50 -166 46
2507 46 -123 -266 118 -117 15 -18 -128 44 -212 -3 -16 79 -153 -13 -75 135 -107 -182 63 -17 -27 -111 143
2530 143 112 172 13 -97 204 225 144 11 -118 -20 -281 -206 62 168 35 7 -65 -74 47 138 -146 -150 -159 174 16
2555 16 48 58 -136 -3 -288 -262 -177 70 118 65 -24 -381 41 -153 -62 -23 -147 79 -49 122 -443 24 -123
2578 -123 -88 -120 77 -55 -47 106 111 145 -1 -156 -65 106 74 -133 -180 -25 -127 96 -183 -269 76 -193 -75 111
2602 111 -155 17 -63 -6 185 50 -21 -87 -287 -188 -229 -42 -222 -47 98 -151 -52 -21 30 115 -65 -43 -113 197
2626 197 -272 -65 -11 -79 -131 23 36 -59 45 -249 84 -82 -102 96 85 -22 170 -272 -76 343 -279 -126
2648 -126 49 -65 -50 103 -52 -39 117 29 33 -187 5 141 -123 -119 -294 1 -87 -45 -235 -67 -357 -172 -336
2671 -336 -398 141 -262 -58 -117 -95 -250 137 14 -9 50 2 -4 -101 -86 -33 15 166 -100 230 66 40 58 149 301
2696 301 25 259 222 11 -277 54 -203 -55 71 -59 -71 -177 97 -385 55 -47 -134 -157 -179 -269 -216 -155 -171
2719 -171 32 -167 -95 -169 136 87 -139 -97 -223 70 20 117 85 -8 247 -83 36 44 200 -146 261 57 -117
2742 -117 59 12 -156 81 -222 -165 -97 -123 26 8 215 41 -253 -11 -75 88 -42 -26 -172 -31 -113 -187 76
2765 76 35 77 -5 -38 -26 149 -14 -119 -18 -141 26 106 -263 -107 140 -236 100 157 -293 21 -50 -131 134
2788 134 -263 -125 27 -79 -91 116 -27 -117 -130 22 55 -114 -29 -117 -26 115 -94 44 71 -1 -114 -215 -10
2811 -10 92 -60 126 -45 146 -96 135 -216 -255 -151 -47 -75 -317 -161 -300 -195 -183 -32 56 -32 -130 151
2833 151 -72 -1 -18 90 85 282 53 -29 -52 217 27 73 -98 76 72 104 83 137 -160 0 -91 -71 45 24 -103
2858 -103 18 -156 63 -111 -142 13 4 56 78 17 -155 -40 -76 -7 86 141 57 -91 205 -72 360 -142 -121 -28
2882 -28 67 60 -9 56 55 188 36 75 -190 -16 -54 110 -21 52 -202 47 -335 -59 49 -249 75 -93 57 89
2906 89 50 -143 17 72 218 -106 -154 155 40 -15 11 -16 213 -88 -27 -148 339 -87 -33 -11 -64 95 -40 54
2930 54 -35 154 -43 47 -69 176 184 -221 52 -113 85 -151 -49 148 233 -59 -19 254 147 411 -99 329
2952 329 54 219 -50 68 184 -29 -51 -141 254 -10 265 -61 -231 204 -10 -56 -120 -12 -58 270 -122 -128
2974 -128 -80 -151 -21 9 -3 -152 18 -91 24 -127 -59 120 -116 58 -79 -72 -79 12 20 85 230 85 195 -167
2998 -167 -208 81 56 -5 -95 -88 74 -168 124 189 -182 95 54 -71 119 -152 116 6 -84 -15 87 -112 49
3021 49 -87 -103 219 121 -33 -87 -239 -117 -105 -239 180 -53 -138 -166 -199 -65 -11 -16 -44 -246 58 -133 -36 118
3045 118 -58 -5 -20 -22 111 45 -16 245 132 106 -32 127 318 60 101 200 11 319 -24 -97 -73 -155 79 -1
3069 -1 -6 41 -120 -12 138 26 -47 106 -109 167 -39 179 327 -24 86 1 62 -168 15 -158 -83 192 -154
3092 -154 40 -24 221 200 -85 -65 -59 229 81 179 -129 24 53 94 236 198 -257 0 32 -105 -13 -11 94 -145
3116 -145 -132 7 96 2 1 24 -47 202 145 -155 -55 247 103 58 -113 200 -25 17 87 -6 -71 -6 42 56 95 42
3142 42 163 0 -62 -29 262 66 63 8 76 1 182 85 195 230 -96 254 -220 -37 111 401 234 -20 180
3165 180 129 -29 -81 -20 -175 67 -16 171 52 36 271 13 48 -152 165 -67 -145 116 261 154 -3 7 -176
3188 -176 35 43 -137 199 85 -4 -32 -134 -55 -25 -93 147 126 -63 120 29 13 94 157 -64 77 -29 6 -25 56
3213 56 -22 39 29 163 99 -35 35 88 -44 -82 116 -178 -108 -39 -55 -42 -148 166 167 -29 73 -250 96 150 19
3238 19 30 -35 56 -193 19 -7 12 -128 -50 106 -220 -73 74 168 73 22 -69 55 50 121 -49 22 -92 102 -144
3263 -144 -170 357 -106 -38 -206 107 136 77 -278 -240 327 17 -4 102 -96 29 -146 -113 -222 49 -248 -148
3285 -148 51 -186 -162 -287 -87 138 144 -121 20 -163 271 -61 -27 -27 -201 273 135 -144 -68 -12 -140 141 -91
3308 -91 106 403 -4 -106 -283 57 -30 -174 0 -288 99 -193 -157 -206 -246 -388 78 97 -37 20 -49 -248 80
3331 80 -25 -26 25 143 162 -23 34 -79 -16 314 -63 56 64 130 180 -20 -67 -104 -135 -404 -99 2 20 -124 2
3356 2 195 -117 45 31 26 94 113 51 91 -64 -15 -65 224 -53 -118 -57 91 -86 -193 27 -9 -43 133 -67 -81
3381 -81 0 119 60 33 42 -26 211 90 224 34 113 -40 -171 -125 49 60 46 70 -29 -491 70 104 -106 111 -67
3406 -67 -127 -100 -11 99 -132 -94 106 174 62 197 182 -220 117 140 -160 47 165 -156 -112 53 104 63 209 -269
3430 -269 -24 -32 198 233 166 218 -138 -49 110 86 111 16 -82 -25 -252 103 93 126 -54 -32 -55 -154 6 87 -141 -11
3456 -11 11 155 148 17 -141 -61 -78 -148 -275 -112 72 176 -10 -38 26 35 161 254 25 169 131 -199 61 -41
3480 -41 -96 163 -48 95 38 -142 73 -101 -38 98 -122 -118 46 125 335 -164 -151 -21 41 -341 11 -78 -153 49
3504 49 29 -224 -51 336 43 -4 -165 1 -287 147 104 -36 71 49 -124 -42 -130 27 83 -57 171 -187 128
3527 128 -104 -38 -54 -49 -71 220 35 237 6 -28 122 35 34 -266 -111 -10 -107 40 104 128 -69 180 64 -28
3551 -28 -140 -137 -17 -141 -128 216 -80 -60 108 138 -15 85 207 -13 4 -126 -181 29 41 18 -23 -77 -61 222
3575 222 -45 200 156 98 177 111 164 289 -6 -43 -116 68 -1 165 -105 28 188 236 196 116 120 -112 131 -133
3599 -133 77 89 66 4 -29 -86 34 102 32 71 154 46 -22 61 -161 198 -80 135 162 15 225 -20 -136 -66
3623 -66 200 240 52 117 86 100 95 64 109 295 -68 -5 95 -108 3 189 -34 -15 140 29 -102 -31 118 87
3647 87 -145 -215 -137 58 27 91 169 -3 -48 -10 -147 158 99 184 195 -175 71 14 221 127 -57 61 330 31
3671 31 -26 74 327 -123 189 -24 296 0 18 175 353 155 -88 -111 -57 42 -77 115 -181 17 20 -31 10
3694 10 269 -122 32 -285 188 131 125 96 37 33 1 17 -123 -57 -34 -340 -24 5 -145 66 10 -53 48 -213 46
3719 46 -223 -13 -98 197 1 -219 -27 -396 -60 60 -203 -128 174 173 263 49 137 -19 -122 -145 261 -179 -220
3742 -220 -164 -286 45 105 -28 68 113 -67 47 54 -14 -165 116 10 -164 355 52 17 5 35 -61 181 -83 9
3766 9 112 84 10 20 12 148 -51 6 128 -150 25 14 226 -94 249 -273 -145 -7 -193 169 10 -219 -91
3789 -91 256 -57 118 -247 12 29 35 -102 196 -146 181 64 87 -139 -102 -74 -129 291 61 200 30 -180 -167
3812 -167 260 -11 137 82 -142 -73 39 -82 93 116 110 12 207 -65 -22 68 36 -182 86 19 -11 25 166 -246
3836 -246 -74 14 69 35 -10 -108 -34 -122 169 43 48 -83 -329 220 -36 -299 -154 97 35 -77 121 109 -67 23
3860 23 -43 230 22 59 -165 221 133 -20 214 73 -123 207 51 -6 -350 -74 -84 234 24 -114 211 149
3882 149 128 -52 -13 -56 87 -244 -39 10 -6 135 -172 -11 30 -27 36 -115 -255 193 -17 102 101 -40 -223
3905 -223 92 -21 32 79 10 81 -190 22 96 133 -4 -164 -127 -84 22 24 -24 123 -116 43 -113 89 -288 59
3929 59 -211 -88 -10 -159 89 83 97 121 -137 -58 -58 37 15 74 34 110 130 15 -145 299 -20 -290 -47 169 -56
3954 -56 -114 -46 53 -215 77 -47 -198 198 -75 -79 -50 176 185 79 -257 -238 -33 63 -218 -59 -135 80 60 -10 186
3979 186 -75 150 -62 -96 -60 108 9 40 184 131 138 -107 40 -93 -39 96 -154 154 -96 235 100 90 -41
4002 -41 -24 38 -90 112 -252 111 -85 -195 -53 -59 -237 101 52 -42 76 41 -22 163 19 -5 72 64 358 214
4026 214 4 -62 121 234 -33 22 -25 43 21 -173 -186 -84 220 276 -32 -223 335 62 -70 -28 -157 -79 -204
4049 -204 -38 40 -39 23 -142 235 170 -18 -60 -3 -103 -227 120 -32 118 -29 291 76 25 200 -17 -125
4071 -125 -236 -49 11 -217 -60 -52 117 214 102 9 33 -107 125 9 -44 -77 277 -78 -26 73 30 -29 148 -13
4095 -13 131 -2 213 -257 -190 137 82 13 -60 279 16 236 -102 -49 -88 -141 -133 -71 -123 14 16 10 31 -20 -11 154 43
4122 43 312 -148 23 111 61 129 121 -71 -22 -94 -296 -62 -263 1 106 32 -1 83 161 272 218 -23 -109 138 132
4147 132 -54 -60 -159 -153 121 -79 12 270 79 92 4 55 -33 128 80 97 -59 144 79 90 28 -20 67 193 147 60
4173 60 180 -128 60 102 -43 20 -42 -33 57 73 -1 -37 -149 89 -173 7 58 78 10 -183 27 -111 -183 -61 102
4198 102 -54 -150 51 -57 -52 -10 167 14 9 -21 -134 240 -364 -61 -198 -155 101 -94 16 -19 29 13 -65 -197
4222 -197 100 -115 -35 -88 127 -105 164 111 131 80 -111 -25 55 132 -99 -34 -5 -72 -104 19 86 -7 -161 225 21
4247 21 -71 -257 -148 2 97 65 37 319 4 -107 -104 -116 43 -268 155 -27 19 -8 -57 -149 -124 8 -33 -1 81
4272 81 168 59 -321 -24 92 129 -167 -223 181 -109 -113 -66 40 -61 -222 4 73 187 -106 -238 -38 130 10
4295 10 153 43 -83 281 -75 -294 74 63 -83 29 101 17 -280 -111 60 5 58 -7 -30 34 -19 110 49 92
4319 92 -141 62 55 -13 -214 -10 66 -210 -108 28 88 29 -17 126 183 32 -53 -387 -27 170 7 -44 -47 90
4343 90 -29 91 47 202 125 -172 -219 171 -79 15 115 -35 83 -254 20 -7 -23 -78 -32 -17 50 -21 56 -137
4367 -137 -128 129 -25 107 140 35 -18 -20 109 25 95 -42 64 93 35 -13 -60 42 49 163 -45 149 -38 9 49
4392 49 35 84 149 60 28 -208 93 -18 -87 -75 -180 60 13 -197 -64 -76 -75 198 60 -51 -82 0 -7 -31 168 -29
4418 -29 18 8 85 94 -96 92 -98 97 175 48 -22 19 -2 254 2 -294 -94 -59 83 50 -276 -25 -37 29 89
4443 89 -196 37 -146 -59 -137 43 -52 -193 -157 -9 56 111 19 107 29 -133 116 -18 149 34 25 -13 239 107
4467 107 -42 -421 58 118 38 -111 116 -62 -160 68 -117 99 78 -116 -78 60 -56 43 -148 -165 98 219
4489 219 -169 -36 8 -194 32 120 -251 -56 44 117 14 -137 105 -124 14 47 111 143 -3 -189 126 63
4511 63 45 -150 -189 -17 110 -108 99 2 -249 -163 -148 -60 -161 36 132 -106 116 -155 -43 86 -73 8 -51
4534 -51 75 192 203 -104 114 49 -63 197 11 -105 129 -85 31 70 -67 -33 60 11 -88 146 149 -59 -106 -24
4558 -24 11 76 2 79 -335 -207 -81 181 83 -123 76 67 107 122 78 -79 -56 30 -206 211 87 23 -25 97 -58
4583 -58 -122 -137 -128 -38 -63 -65 -54 79 -84 -30 -115 -1 -182 29 122 41 -47 -117 74 -142 18 -154 -214 147 97 -14
4609 -14 23 -133 -27 -67 32 260 -194 -226 161 -222 90 -55 -106 -16 138 86 49 379 -44 282 87 38 -10 -78
4633 -78 95 -34 67 174 -84 87 -49 -4 52 25 49 -101 -203 -206 -127 -242 16 -113 -188 6 -23 89 2 -124
4657 -124 199 -135 115 -109 -114 190 15 77 159 236 55 -139 0 50 44 0 -129 28 34 58 19 -388 10 17 -10
4682 -10 158 144 -45 -45 51 -148 39 -64 61 99 32 67 95 -3 -173 49 -297 37 4 -122 -16 -12 75 -239 231
4707 231 -61 38 -142 -58 124 -91 106 112 79 184 -154 -53 -119 241 -32 -219 106 11 23 -76 196 68 -51
4730 -51 2 -159 65 84 -47 299 1 -88 164 176 -163 9 -154 47 82 9 -7 79 103 28 -68 -70 202 -45 130
4755 130 56 -101 7 -59 -3 196 -77 -164 -133 185 310 89 54 81 -60 -27 47 -130 -35 135 -108 17 -72 -153
4779 -153 -3 129 -118 -5 -177 -179 -154 53 20 67 -109 -119 67 -146 329 -3 100 -42 53 129 4 -153 -242
4802 -242 226 58 45 3 82 98 -87 279 32 -75 -63 -154 276 84 -46 -124 16 38 62 0 -178 -56 84
4825 84 -56 172 32 88 269 21 -184 -49 -45 -166 30 152 -179 -180 -178 17 72 97 44 20 26 -67 175 82 15 -52
4851 -52 -47 89 27 136 118 -87 130 -43 -23 -43 31 -45 -278 -137 17 -10 156 -78 37 -144 228 65 50 -30
4875 -30 66 -72 70 -97 -50 26 -80 -196 -57 -137 -137 -127 -178 -151 -39 -18 -110 -57 -183 15 53 128 -265 76 207
4900 207 58 8 213 26 208 9 70 -63 -10 28 36 -87 12 206 90 47 72 -13 -125 -274 111 -80 98
4923 98 183 40 -216 -38 -67 94 -116 -34 -82 -53 45 -225 49 -17 110 -64 -178 -163 -6 4 -31 47 130 66 261
4948 261 12 35 -33 43 -177 105 -143 -191 192 63 24 -36 -79 209 48 -20 62 -19 -105 304 86 -24 -63 45
4972 45 -286 -99 120 -129 -19 54 -263 66 -64 329 37 -153 106 113 171 74 -163 254 -50 82 100 87 67
4995 67 266 -17 73 69 47 -183 -5 -36 -96 -165 -254 -20 -112 -149 156 -50 227 253 -20 -40 44 63 -115 81 -168
5020 -168 68 93 117 23 -126 106 42 35 75 204 -64 -102 53 -171 42 46 43 -54 130 -108 -109 159 -62 -332 85
5045 85 111 161 58 75 92 -339 144 -8 -99 80 132 -39 -55 -48 52 165 -113 96 -144 -136 -88 141 -16 203
5069 203 31 90 105 -33 18 20 -5 60 -100 124 -153 -261 -75 -84 -18 -46 197 -12 13 -224 -222 89 -23 -79 169
5094 169 -46 57 89 -279 -156 4 -136 -119 -180 139 -235 111 30 -172 177 140 -130 10 -128 -29 -48 -196
5116 -196 -172 -52 -135 149 -86 -90 41 -187 5 246 98 -45 -22 -97 -176 -37 147 -108 -113 -107 87 -76 53 99
5140 99 -371 -64 126 6 114 -2 171 -34 124 75 112 -70 -137 29 88 15 21 -89 118 -8 210 53 49
5163 49 59 -52 -25 51 -212 -2 -107 -123 27 27 -255 -123 141 -16 -191 -20 36 -31 307 -222 69 -150 91
5186 91 -204 153 39 -8 -96 61 -137 -19 -87 65 -1 53 -55 162 -169 -275 8 141 -126 -62 145 -257
5208 -257 -69 -51 15 6 -217 96 58 -71 52 66 -101 33 -4 81 182 -61 -47 -37 -52 137 154 114 44 -88 227
5233 227 -197 101 125 -149 18 54 -62 -116 213 -116 -35 139 -163 -133 -65 -91 39 -235 -96 176 138 167 -128
5256 -128 175 195 -87 74 -7 78 57 -33 -66 128 -24 72 5 -24 7 343 -59 -10 117 -115 -69 59 -42 -166
5280 -166 -83 200 -65 -110 -278 -87 83 143 86 94 -74 -92 -14 -37 0 -32 -23 80 143 -8 152 5 -5 -42 65
5305 65 18 23 48 -33 -194 -29 -125 80 -9 -61 47 132 -296 350 68 24 -49 180 -24 16 38 -114 -9 18 175
5330 175 -58 -111 -16 78 -84 143 12 144 1 41 174 -39 -28 -210 11 84 -202 -53 -150 -33 -36 31 131
5353 131 -253 -108 -19 -77 34 46 -159 -195 -114 199 -6 96 258 53 -150 105 127 -236 -252 88 -54 2 157
5376 157 112 165 2 212 -64 84 -81 140 -95 15 -148 -101 6 147 227 -35 -259 210 -182 -55 -50 102
5398 102 -142 -134 -172 -69 -36 -32 25 -159 -89 -104 95 6 -119 41 -268 76 107 -23 25 -279 20 -106 -35 -160
5422 -160 143 -79 -106 192 -46 -144 -30 -41 213 -47 211 -133 13 -32 134 63 -177 -4 -156 189 102 -60
5444 -60 -52 -115 -238 90 104 69 48 191 -90 130 -6 -189 -163 6 -161 -245 31 139 -100 -251 -13 207 60
5467 60 -355 -5 108 -15 26 -193 18 6 -93 -9 -240 52 -58 74 -156 -5 -34 -64 -168 230 245 1 327
5490 327 112 123 90 -178 89 100 189 -61 -59 -214 4 -44 -35 -123 -80 -90 145 62 -78 282 248 -9 240 103 96
5515 96 -47 -118 -57 277 146 -6 -226 65 -165 -145 -110 47 65 70 -48 -8 -128 38 -63 63 -24 257 75
5538 75 -18 -198 -39 69 -2 16 -91 23 -26 64 -131 88 -82 -72 -110 34 94 -162 -311 121 76 43 -33 -164
5562 -164 -39 -39 405 -157 9 158 -9 105 33 124 -200 94 231 99 -59 -74 -71 -93 195 106 -93 -187 112
5585 112 -80 69 88 -120 90 -156 -26 -120 33 -86 -163 81 -56 51 -170 -124 179 -251 22 8 164 -39
5607 -39 179 80 144 -146 3 120 -55 236 -180 50 -134 244 88 -64 13 -31 -150 -3 23 28 -212 -205 46
5630 46 -239 135 55 18 33 110 13 -206 16 100 -243 -57 -105 106 -142 134 -2 23 6 -237 107 -200 34
5653 34 115 -131 -188 -79 -323 -19 -80 244 161 -34 -103 6 131 -152 -31 -77 -120 -68 261 -122 199 -254 -152
5676 -152 -44 171 -265 104 -15 -286 84 43 185 -87 242 293 22 -54 18 -84 -34 70 -106 -64 -31 -142
5698 -142 -256 -122 -91 -103 26 82 -185 -150 -221 -44 -5 -163 -94 -64 126 -81 -162 -328 -151 -53 -41 11 -130 -135 98
5723 98 -85 -343 -7 -95 -79 -64 -29 -28 -78 64 179 127 -38 -39 -25 50 -35 -157 -74 -119 155 51 29 57 -8 21 -43
5750 -43 195 106 81 56 66 -98 -119 12 -27 86 118 -173 -1 24 73 139 22 -5 -15 -88 27 63 12 -235 -143 139
5776 139 -233 164 26 -95 89 -10 68 -104 -54 -111 -18 -239 118 67 307 -66 51 -141 -127 -57 -67 -196 -30
5799 -30 -12 -90 202 -70 -47 -114 -69 45 181 130 208 -85 -9 -107 -7 -69 47 105 223 -30 119 -154 -111 -117 97
5824 97 -67 27 26 -60 70 -87 -97 -293 -247 -9 26 -37 -53 158 17 53 -129 -30 -133 -124 -197 -216 -141 -124 54 100
5850 100 -47 77 -123 137 63 -93 22 -183 78 -50 -197 96 48 28 136 -185 -38 4 -133 126 144 31
5872 31 -205 113 138 -99 105 157 -47 -45 -145 128 -86 70 93 124 180 -45 301 220 -107 79 -58 -35 -5 -22
5896 -22 47 100 115 -72 -17 -76 -175 62 -31 59 -142 -45 -16 -61 17 81 -11 -136 -150 -64 -162 -57 -13 128 51 -82 140
5923 140 84 -226 142 30 89 -50 13 69 103 88 59 -18 13 2 -25 -14 182 128 -104 139 28 62 -36 156 39
5948 39 -127 113 -165 -89 80 -88 247 63 -340 194 62 -3 -194 206 -122 162 -75 101 -11 7 35 85
5970 85 19 14 25 -71 30 -69 99 128 103 76 253 -23 28 -216 42 -311 -60 1 100 91 23 78 188 -214 -82 -316
5996 -316 57 225 -2 -291 -68 202 10 -162 -87 -40 73 -58 140 128 -118 -21 -72 -149 -305 -33 -29 -162 10
6019 10 89 2 -19 -165 65 29 -62 2 178 146 -162 12 -125 -172 -226 38 157 104 26 227 33 206 1 228
6043 228 -148 26 -148 -178 126 -130 -179 -14 -104 -36 -63 -147 180 -19 -43 -40 112 -75 190 -61 35 -104 -142 107
6067 107 -258 -196 58 62 -23 59 7 28 -104 -256 -1 25 -229 128 -20 -90 -137 -50 3 157 -139 -228 -38 -50 -115
6092 -115 -1 -81 135 -43 -272 162 50 177 271 -71 -139 49 -118 -52 101 213 155 89 -127 -148 68 -108
6114 -108 101 228 -205 255 66 -56 -60 100 52 -62 200 -156 -261 141 -54 -63 92 27 51 26 -146 -24 -163
6137 -163 -13 -68 51 83 -70 142 -129 8 -220 -150 63 -10 -42 -89 175 -124 -230 -56 -96 -58 -16 -7 -170 -18
6161 -18 55 -133 -72 -24 -3 158 30 98 -11 -154 12 92 14 -170 -55 -129 -74 115 137 -118 80 -38 76 129
6185 129 -141 -71 -85 212 131 95 -6 -32 42 16 21 -147 -105 -36 -45 -149 -47 56 -190 116 -17 144 -97 78
6209 78 180 162 -75 64 89 -63 51 -25 -165 -47 19 2 -170 -13 163 82 -49 -38 -193 -107 -59 186 -49
6232 -49 -85 183 68 93 -6 -16 93 17 -5 -125 -14 -100 -98 39 -102 -39 -112 32 -74 157 209 -154 93 277
6256 277 150 -107 -332 204 9 -42 121 111 81 -110 -34 -430 45 125 -188 35 135 -171 -93 -14 -102 -83 197
6279 197 -77 -176 -35 -225 -187 -127 -12 101 -68 -7 54 59 -116 -47 5 106 0 -105 99 -90 -235 -121 191
6302 191 17 -104 178 -7 262 96 -140 51 301 220 -8 179 -240 54 -64 -93 -213 -127 -214 -93 106
6323 106 -210 -66 191 77 -27 -165 376 -112 -116 180 -72 46 79 139 -48 -159 -189 -338 96 55 -81 28
6345 28 -25 38 -231 124 -15 -150 -45 148 -7 -155 -45 169 123 -162 94 -140 -71 147 69 82 42 141 248
6368 248 41 -44 -50 57 -2 -173 27 74 -27 142 -241 -197 130 104 -135 -113 -77 -135 18 9 -21 -59 -35 71 98
6393 98 -38 -67 -112 162 34 -11 75 -80 2 163 83 -174 119 -166 216 164 -31 -58 -119 -334 120 73 171 -52
6417 -52 134 -45 -174 76 -155 19 330 -80 9 -67 3 -175 -24 6 -20 -83 -226 -49 22 -18 30 -43 -71 -133
6441 -133 -120 -114 197 90 -37 -49 -202 -55 54 -110 -109 63 42 233 16 47 -192 -28 72 -59 138 -68 -33
6464 -33 63 -32 -52 323 -8 330 -60 -33 -7 119 164 121 -117 -88 -16 41 73 -81 103 15 -179 -185 -128 75 -328
6489 -328 79 -36 -12 -14 84 -106 54 148 -14 -26 -12 19 66 18 57 31 6 5 276 79 -5 -64 -3 320 -175 -57
6515 -57 91 83 -272 156 -27 195 60 24 -145 123 -11 36 -241 -18 -48 22 -8 -139 113 -38 -12 120 221
6538 221 65 6 106 146 10 -73 -136 94 30 -17 14 151 -21 49 -49 47 29 315 -242 -38 -1 -24 -281 -86
6562 -86 130 -51 91 13 51 -21 68 113 -105 99 159 -70 131 108 133 95 -176 89 29 6 -81 -92 -221 32 -241
6587 -241 -79 27 -97 101 143 240 238 -33 -199 7 155 168 -63 -166 -178 9 -50 34 -31 188 -324 -128 -256
6610 -256 -56 104 -167 -235 174 -158 27 -112 -97 -49 277 82 50 8 -52 160 -165 185 92 -35 -104 0 -84
6633 -84 -9 77 81 -101 -261 0 71 107 -15 46 170 106 26 250 -83 -58 74 4 -4 -70 201 35 266 42 -130
6658 -130 -54 -4 -159 -72 165 165 -3 -36 23 -79 -232 17 22 18 -228 96 254 -33 -137 -9 139 54 125 -161
6682 -161 42 -308 186 140 -35 -30 -10 47 8 -6 -161 -44 58 -164 -344 97 -11 2 -85 -111 261 -207 -32
6705 -32 -113 1 75 14 89 132 -161 193 -39 216 75 -113 -65 -75 -72 66 188 -78 46 161 65 -119 -132 110
6729 110 -153 -244 -129 52 179 122 -12 40 58 19 317 190 185 -90 -55 143 -81 16 -60 31 -13 194 -133 -46
6753 -46 111 -24 -128 -77 -54 77 95 51 -137 22 -28 -182 -111 47 -28 30 -99 -26 -47 200 -67 194 96 48
6777 48 -121 -46 -32 37 -233 -35 147 186 297 116 78 62 -41 -25 69 31 -127 -205 -68 28 11 -194 -3 -147
6801 -147 130 -110 -359 7 -38 83 58 -6 -111 -42 -102 -59 -2 -52 -98 -2 163 -160 -9 -49 11 227 -42 -85
6825 -85 -81 88 -41 128 -119 -117 -148 -179 -9 -25 15 248 179 41 9 -82 41 -10 -59 -140 -93 -97 39 82 9 -167 150
6852 150 -109 123 -10 -247 18 -60 42 94 165 182 146 -98 140 43 -168 110 -160 -26 -57 77 22 35 -24
6875 -24 -103 -248 -153 147 -29 -66 111 230 -56 125 57 124 -48 47 -30 -80 -277 -42 72 -111 -79 68 187
6898 187 78 -59 -43 100 -204 -42 28 65 143 294 -87 120 160 14 -129 68 -140 -41 -88 65 43 -5 99
6921 99 187 149 -108 8 -75 352 -31 -85 -107 -24 162 276 -93 -69 95 207 228 -4 6 -124 -2 136 -110
6944 -110 -20 -1 197 -53 -23 153 117 -244 140 79 -68 -90 68 -91 250 -123 -75 -64 164 -132 62 -46 -21
6967 -21 -68 -4 -35 148 7 -110 -9 -249 224 -73 -31 206 72 -42 102 70 -53 -27 -195 -103 -59 28 56 41
6991 41 -61 7 178 -77 -10 -139 -111 -281 -374 -267 121 -74 27 -21 150 90 194 -111 34 258 192 135 -29
7014 -29 78 212 119 -154 244 -157 -39 -50 163 31 -127 -110 -246 260 44 -2 -188 -77 93 91 -223 -91
7036 -91 94 -6 186 74 23 5 130 -28 -138 -125 -48 84 114 -19 139 81 189 -36 -105 -83 4 76 13 17 -65
7061 -65 -54 179 198 -169 -236 -79 25 -110 85 56 -64 43 -194 291 120 -205 -56 68 -30 14 -259 -72
7083 -72 -50 -65 -147 -146 -162 -7 57 -134 75 -32 91 -50 -91 33 -348 -18 37 -12 -78 -323 -169 14 -111 33
7107 33 -29 69 -74 -104 39 -77 -18 -5 115 -128 186 -243 89 62 117 276 107 -211 -73 -281 -3 -120 88
7130 88 -51 -199 -65 -4 -172 123 -35 88 41 -167 -42 -60 28 54 114 -277 49 18 98 224 62 186 -70
7153 -70 67 -107 42 43 -69 188 318 -69 -374 61 -231 213 95 -83 95 159 -232 6 -3 76 178 123 -57
7176 -57 -12 89 64 -300 32 12 -172 -70 65 170 -72 -3 -77 -193 120 -19 31 97 -1 60 111 183 -22 -337
7200 -337 -14 107 -31 2 27 119 44 96 161 -88 96 42 -16 -186 -124 -53 -107 -123 0 -10 -26 -170 206 87 239
7225 239 53 151 -122 -56 98 -251 46 52 4 -4 122 -260 76 140 -13 21 76 -102 11 83 -60 162 56 57
7249 57 59 -30 86 -59 69 -141 -77 -116 -164 156 176 -286 136 -354 113 -22 0 -9 33 110 64 107 -41 109 42
7274 42 -48 183 36 -295 92 71 9 -64 -210 -153 -244 -99 -90 27 152 -46 -91 -307 -43 -148 -114 -87 -172 138
7298 138 -61 180 134 -7 101 40 -97 184 52 56 39 134 -173 -13 176 -59 167 -71 22 -144 50 -16 85
7321 85 135 -15 27 45 -40 170 -140 79 90 30 28 5 253 -217 103 -176 173 -184 110 94 17 -97 -28 5 -52
7346 -52 92 84 -84 -139 -25 -95 179 157 -185 -7 179 -36 -128 -239 29 127 -7 -65 -2 12 50 137 102 113 -21
7371 -21 -67 -161 70 -57 20 -39 92 -336 -101 -168 -5 -16 75 106 4 133 142 -79 -113 -148 -2 -30 -90 83 31
7396 31 -107 44 83 117 -75 -242 130 48 -62 -96 195 25 -18 -48 99 110 -53 -26 27 53 -118 -49 -42 96 116
7421 116 233 306 -114 -276 37 4 152 65 -69 -28 154 27 118 -66 -23 111 -63 -10 201 90 45 -86 -68
7444 -68 283 -33 -129 220 -154 69 75 42 76 -27 -163 -121 141 154 154 43 -104 174 -205 181 -175 -150 201 53
7468 53 85 217 7 -97 -93 65 -227 -90 -78 -85 260 -49 115 240 -47 -84 -100 47 -43 69 105 -15 -166 -10
7492 -10 226 -9 -220 148 19 -66 68 96 -146 -245 -37 4 152 -198 -191 -31 -5 -93 184 13 57 239 -75
7515 -75 82 -97 -56 -99 79 -128 181 14 -231 -141 -96 -232 59 106 27 -162 35 37 63 -123 -246 53 -36 -164
7539 -164 119 -117 -199 -81 205 65 -83 -20 126 11 -219 -119 56 23 -117 -99 51 29 100 0 -128 -163
7561 -163 -118 32 -146 134 -45 15 -19 -14 86 159 30 -5 157 9 -37 101 105 224 -1 55 62 279 -74 -154 161
7586 161 6 -99 -80 160 -160 8 195 63 143 -27 -109 132 258 54 73 -37 -13 -37 -44 -47 -77 -54 -172 -92
7610 -92 167 -35 150 100 179 -4 -112 -22 -73 -22 -190 25 9 -125 -127 -388 31 -23 40 -7 7 -38 -80 -126 50
7635 50 190 -220 141 -184 -27 41 39 82 45 -70 -62 149 96 137 46 50 -81 44 68 -54 60 -21 -154 149 75
7660 75 174 148 -137 32 74 108 181 -87 83 -224 261 -123 -269 27 -76 -27 -121 -95 -268 -41 209 218 -54 23
7684 23 -8 144 27 38 -16 -77 -99 -59 251 -157 -6 -162 -20 -138 -44 -8 -78 16 -61 -55 21 184 10 15 -86 -99
7710 -99 -124 -36 216 -189 -137 192 94 207 -39 150 -146 143 229 97 111 -165 167 233 143 -8 -68 89 454
7733 454 119 -94 72 50 139 46 -55 47 52 -167 31 150 -135 135 -56 -36 94 35 -182 26 -6 -137 145
7756 145 -29 -21 -243 -53 163 -19 -55 -80 72 -71 -92 -239 -139 161 65 64 -28 -28 -79 190 -68 -194 31 -309
7780 -309 -215 178 116 -60 41 316 25 -146 92 29 -33 0 -178 67 263 -115 -74 -51 24 -294 206 171 -135
7803 -135 2 7 4 -107 140 -290 -305 -93 -127 102 -81 -95 -231 -189 39 61 -26 117 -63 186 -99 289 -144
7826 -144 -218 -221 -195 -205 -94 160 -227 -205 -268 -28 103 -72 140 -22 -114 -79 240 -136 -71 110 -134 178 -87
7849 -87 38 -38 -59 -76 -54 -189 20 46 -35 -14 -14 9 172 -23 64 -59 131 -45 90 -101 -105 -90 -16 -126 6
7874 6 15 -145 -223 -187 -25 -19 -116 -33 67 -60 101 34 209 67 -14 -65 50 -131 89 161 -41 -109 -16 -193 180
7899 180 -121 6 81 85 -131 -76 73 -33 -66 -61 92 178 -291 150 -1 30 121 45 -19 -93 -155 47 203 -17 -34
7924 -34 -143 161 6 47 -43 -52 -84 15 -10 -225 -50 15 1 -88 -265 85 131 -104 -115 26 -63 227 -107 -105 106
7949 106 -140 -7 -6 -177 72 7 28 -165 29 -9 -135 -61 -2 30 -109 132 11 -150 320 -20 108 -137 -2
7972 -2 -124 64 81 35 144 322 -31 86 -3 -298 -30 282 -52 -47 177 -86 -28 -9 -67 31 -9 17 89 -177 65
7997 65 -80 -19 257 -58 89 -231 -23 60 -157 7 -43 -214 -99 43 56 -36 -31 26 63 -144 100 -218 -136 52
8021 52 51 15 104 50 264 -16 14 54 344 1 -33 62 -116 -17 278 108 91 -139 263 54 35 107 -27 238 -96
8046 -96 74 -83 -152 -97 190 36 236 233 -64 -20 309 75 139 -148 -239 129 -212 -128 41 -62 6 18 -54 -32
8070 -32 -95 -38 -51 162 -140 -98 -129 32 -49 206 -34 -192 -317 -223 147 -114 218 53 -74 142 178 -16 67
8093 67 -107 -66 94 -160 -26 -77 -71 93 10 108 84 57 -115 -69 -124 -105 -77 -273 -89 -147 220 -7 6 -74 100
8118 100 14 -57 -187 -79 -48 -41 85 -5 82 93 -50 -21 49 40 10 -176 153 76 19 -10 1 -149 -97 196 -58 83
8144 83 -157 76 211 -142 -91 -15 -169 27 64 3 86 103 -180 48 109 143 160 67 -209 97 78 71 -35 -36 -19 66
8170 66 49 -168 -67 -127 -52 -94 -84 107 -212 98 170 24 3 -49 -113 29 209 25 188 -138 -66
8191f6
##END NTUPLES=NMR FID
##END=
