##TITLE=1H_Pr 1847
 CDCl3,8 sc, 
 3.03.2021
##JCAMPDX= 6.0         $$ Bruker NMR JCAMP-DX V2.0
##DATA TYPE= NMR FID
##DATA CLASS= NTUPLES
##ORIGIN= UXNMR, Bruker Analytische Messtechnik GmbH
##OWNER= root
$$ XWIN-NMR		Version 3.5
$$ Wed Mar  3 13:23:17 2021 Russian Standard Time (UT+4h)  she@DPX200
##.OBSERVE FREQUENCY= 200.1315066352
##.OBSERVE NUCLEUS= ^1H
##.DELAY= (6, 6)
##.ACQUISITION MODE= SIMULTANEOUS
##.ACQUISITION SCHEME= undefined
##.AVERAGES= 8
##.DIGITISER RES= 18
##SPECTROMETER/DATA SYSTEM= spect
##.PULSE SEQUENCE= zg30
##.SOLVENT NAME= D2O
##.SHIFT REFERENCE= (INTERNAL, D2O, 0, 15.7039)
##AUDIT TRAIL= $$ (NUMBER, WHEN, WHO, WHERE, WHAT)
$$ ##TITLE= Audit trail, XWIN-NMR		Version 3.5
$$ ##JCAMPDX= 5.01
$$ ##ORIGIN= Bruker BioSpin GmbH
$$ ##OWNER= she
$$ F:/spectra/data/she/nmr/H-F/1/audita.txt
$$ ##AUDIT TRAIL=  $$ (NUMBER, WHEN, WHO, WHERE, WHAT)
(   1,<2021-03-03 13:22:01.65 +0400>,<she>,<DPX200>,
      <created by zg, POWCHK disabled, PULCHK disabled
       configuration hash MD5:
       00 E9 B6 7A A2 85 ED C7 34 08 36 98 17 FE 4E 26
       data hash MD5: 16K
       51 D7 2C F5 25 F9 05 86 58 CC 23 5A 5E D7 71 8D>)
$$ ##END=
$$ 
$$ hash MD5
$$ 80 1A 82 A4 C9 3B 98 42 4D 85 FD 3E 0B 2A 53 47
##$RELAX= 
##$RELAX= 
##$RELAX= 
##$RELAX= 
##$RELAX= 
##$RELAX= 
$$ Bruker specific parameters
$$ --------------------------
##$DU= <F:/spectra>
##$EXPNO= 1
##$NAME= <H-F>
##$PROCNO= 1
##$TYPE= <nmr>
##$USER= <she>
##$AMP= (0..31)
100 100 100 100 100 100 100 100 100 100 100 100 100 100 100 100 100 100 
100 100 100 100 100 100 100 100 100 100 100 100 100 100 
##$AQSEQ= 0
##$AQ_mod= 1
##$AUNM= <au_zg>
##$AUTOPOS= <>
##$BF1= 200.13
##$BF2= 200.13
##$BF3= 200.13
##$BF4= 200.13
##$BF5= 200.13
##$BF6= 200.13
##$BF7= 200.13
##$BF8= 200.13
##$BYTORDA= 1
##$CFDGTYP= 0
##$CFRGTYP= 5
##$CHEMSTR= <none>
##$CNST= (0..31)
1 1 145 1 1 1 1 1 1 1 1 1 1 1 1 1 1 1 1 1 1 1 1 1 1 1 1 1 1 1 1 1 
##$CPDPRG= <>
##$CPDPRG1= <>
##$CPDPRG2= <>
##$CPDPRG3= <>
##$CPDPRG4= <mlev>
##$CPDPRG5= <mlev>
##$CPDPRG6= <mlev>
##$CPDPRG7= <mlev>
##$CPDPRG8= <mlev>
##$CPDPRGB= <>
##$CPDPRGT= <>
##$D= (0..31)
0 1.2 0 0 0 0 0 0 0 0.06 0 0.03 0 0 0 0 0.0002 0 0 0 0 0 0 0 0 0 0 0 0 
0 0 0 
##$DATE= 1614763321
##$DBL= (0..7)
120 120 120 120 120 120 120 120 
##$DBP= (0..7)
150 150 150 150 150 150 150 150 
##$DBP07= 0
##$DBPNAM0= <>
##$DBPNAM1= <>
##$DBPNAM2= <>
##$DBPNAM3= <>
##$DBPNAM4= <>
##$DBPNAM5= <>
##$DBPNAM6= <>
##$DBPNAM7= <>
##$DBPOAL= (0..7)
0.5 0.5 0.5 0.5 0.5 0.5 0.5 0.5 
##$DBPOFFS= (0..7)
0 0 0 0 0 0 0 0 
##$DE= 6
##$DECBNUC= <off>
##$DECIM= 32
##$DECNUC= <off>
##$DECSTAT= 4
##$DIGMOD= 1
##$DIGTYP= 9
##$DL= (0..7)
0 120 120 120 120 120 120 120 
##$DP= (0..7)
150 150 150 150 150 150 150 150 
##$DP07= 0
##$DPNAME0= <>
##$DPNAME1= <>
##$DPNAME2= <>
##$DPNAME3= <>
##$DPNAME4= <>
##$DPNAME5= <>
##$DPNAME6= <>
##$DPNAME7= <>
##$DPOAL= (0..7)
0.5 0.5 0.5 0.5 0.5 0.5 0.5 0.5 
##$DPOFFS= (0..7)
0 0 0 0 0 0 0 0 
##$DQDMODE= 0
##$DR= 18
##$DS= 0
##$DSLIST= <SSSSSSSSSSSSSSS>
$$ [...]
##$SUBNAM2= <"">
##$SUBNAM3= <"">
##$SUBNAM4= <"">
##$SUBNAM5= <"">
##$SUBNAM6= <"">
##$SUBNAM7= <"">
##$SUBNAM8= <"">
##$SUBNAM9= <"">
##$SW= 16.9725356469052
##$SWIBOX= (0..15)
0 0 2 0 0 0 0 0 0 0 0 0 0 0 0 0 
##$SW_h= 3396.73913043478
##$TD= 16384
##$TD0= 1
##$TE= 0
##$TE2= 300
##$TE3= 300
##$TEG= 300
##$TL= (0..7)
0 120 120 120 120 120 120 120 
##$TP= (0..7)
150 150 150 150 150 150 150 150 
##$TP07= 0
##$TPNAME0= <>
##$TPNAME1= <>
##$TPNAME2= <>
##$TPNAME3= <>
##$TPNAME4= <>
##$TPNAME5= <>
##$TPNAME6= <>
##$TPNAME7= <>
##$TPOAL= (0..7)
0.5 0.5 0.5 0.5 0.5 0.5 0.5 0.5 
##$TPOFFS= (0..7)
0 0 0 0 0 0 0 0 
##$TUNHIN= 0
##$TUNHOUT= 0
##$TUNXOUT= 0
##$USERA1= <user>
##$USERA2= <user>
##$USERA3= <user>
##$USERA4= <user>
##$USERA5= <user>
##$V9= 5
##$VALIST= <valist>
##$VCLIST= <CCCCCCCCCCCCCCC>
##$VD= 0
##$VDLIST= <DDDDDDDDDDDDDDD>
##$VPLIST= <PPPPPPPPPPPPPPP>
##$VTLIST= <TTTTTTTTTTTTTTT>
##$WBST= 1024
##$WBSW= 4
##$XGAIN= (0..3)
0 0 0 0 
##$XL= 0
##$YL= 0
##$YMAX_a= 722457
##$YMIN_a= -432959
##$ZGOPTNS= <>
##$ZL1= 120
##$ZL2= 120
##$ZL3= 120
##$ZL4= 120
##$ABSF1= 10
##$ABSF2= 0
##$ABSG= 5
##$ABSL= 3
##$ALPHA= 0
##$AQORDER= 0
##$ASSFAC= 0
##$ASSFACI= 0
##$ASSFACX= 0
##$ASSWID= 0
##$AUNMP= <proc_1d>
##$AZFE= 0.1
##$AZFW= 0.1
##$BCFW= 1
##$BC_mod= 2
##$BYTORDP= 1
##$COROFFS= 0
##$CY= 11.3945322036743
##$DATMOD= 1
##$DC= 2
##$DFILT= <>
##$DTYPP= 0
##$F1P= 15.9154993809931
##$F2P= -4.1035820241983
##$FCOR= 0.5
##$FTSIZE= 0
##$FT_mod= 4
##$GAMMA= 1
##$GB= 0.15
##$INTBC= 1
##$INTSCL= 1
##$ISEN= 128
##$LB= 0.24
##$LEV0= 0
##$LPBIN= 0
##$MAXI= 10000
##$MC2= 0
##$MEAN= 0
##$ME_mod= 0
##$MI= 1.114404
##$NCOEF= 0
##$NC_proc= 0
##$NLEV= 6
##$NOISF1= 3.799351
##$NOISF2= 2.8
##$NSP= 1
##$NTH_PI= 0
##$NZP= 0
##$OFFSET= 15.70392
##$PC= 1
##$PHC0= -10760.57
##$PHC1= 10.20094
##$PH_mod= 1
##$PKNL= yes
##$PPARMOD= 0
##$PSCAL= 0
##$PSIGN= 0
##$REVERSE= no
##$SF= 200.130013532006
##$SI= 16384
##$SIGF1= 3
##$SIGF2= 2
##$SINO= 400
##$SIOLD= 16384
##$SREGLST= <1H.CDCl3>
##$SSB= 0
##$STSI= 0
##$STSR= 0
##$SW_p= 3612.71676300578
##$SYMM= 0
##$S_DEV= 0
##$TDeff= 0
##$TDoff= 0
##$TI= <>
##$TILT= no
##$TM1= 0
##$TM2= 0
##$TOPLEV= 0
##$USERP1= <user>
##$USERP2= <user>
##$USERP3= <user>
##$USERP4= <user>
##$USERP5= <user>
##$WDW= 1
##$XDIM= 8192
##$YMAX_p= 0
##$YMIN_p= 0
$$ End of Bruker specific parameters
$$ ---------------------------------
##NTUPLES= NMR FID
##VAR_NAME=  TIME,          FID/REAL,        FID/IMAG
##SYMBOL=    X,             R,               I
##VAR_TYPE=  INDEPENDENT,   DEPENDENT,       DEPENDENT
##VAR_FORM=  AFFN,          ASDF,            ASDF
##VAR_DIM=   8192,          8192,            8192
##UNITS=     SECONDS,       ARBITRARY UNITS, ARBITRARY UNITS
##FACTOR=    0.0002944,     1,               1
##FIRST=     0,             0,               0
##LAST=      2.4114304,     0,               0
##MIN=       0,             -432959,         0
##MAX=       2.4114304,     722457,          0
$$ Real data points
##PAGE= N=1
##DATA TABLE= (X++(R..R)), XYDATA
$$ [...]
1721C32p39J60R42n9q61P26m13K01O12l51j130O58J443j412l88N02M63l86K31
1740E31m70K9J15L71j2r30L46O21J53j052M41O6J77M04m50k50k1J081n13j062
1760d25N70O68j30m56k33J15N29n1k55m58K00R46k83o62O4Q28l60l08k80K52K98
1781E69K30j60j110P19O46Rp49j32O57K33l79m71K32M86K22l97n75J94Q38j35
1801I27j019J27M87J22k25m06J66J33J50j81l29k67J057k17m44l27M75L87J9o22
1821A3j54N21N2l75k89o2O06J58n09p48J085J07q5p52j01P18L6j57q10K67L03
1842a76L95m16m98K91L93L23j065L52J27P35q07k87j03N93N81r07j24K24M90m43
1862c22k44k79M04N97o91K84l72K98M97o38p5L7M02k47j09o79Q84K31m05l33K35
$$ y = [332, -407, -247, 695, 636, -225, 501, 88, 289, 901, 550, -580, 78, 1521, 109, -279, 223, 686, 300, 531, 61, 90, 205, 576, 564, -366, -20, 601, 754, -298, 143, 209, 386, 790, 340, 90, 69, 1150, 637, -425, 145, 813, 683, 227, -6, 109, 638, 587, 332, -126, 74, 1020, 737, 75, 139, 967, 607, 299, 19, 271, 569, 799, 639, -471, 248, 894, 903, 154, 22, 679, 912, 533, 62, 294, 780, 1002, 605, 30, 224, 1062, 927, -92, 35, 522, 644, 419, 13, 179, 312, 462, 281, -48, -315, 742, 525, 81, -246, 229, 616, 635, 13, -141, 380, 432, 57, -232, -294, 312, 470, -39, -787, 298, 405, 320, -432, -533, 185, 221, 64, -746, -479, -176, 219, -197, -695, -404, -11, 312, -753, -401, -274, 461, -346, -633, -736, -143, 438, -469, -593, -369, 121, -322, -566, -845, -441, 156, -535, -251, -623, -325, 172, -466, -541, -504, -102, -349, -458, -1137, -253, -22, -427, -760, -525]
1883e25J90L11j42r79P55K30j8J4o42L14M66l77l53M75j30K50J10p84L38J53K96
1904d8o17n7K76N39n15k19j73J18P44l12o27L47K23J0J91o02K10O97o09j31L96
1925a59k33L14K18n52m91J209k89j19k84J63M25P1o77J72L11k62N50m22j84K89
1945E0K68l31m99K64L22L1m33K72p9J36K39o86L56K67o8j12j6o53R22k6q01O23
1967D6j98J96K60n22p30J131L91r57L48J19L38j79k28k94L57j3m9K64j109J070
1987B41J72k74o87O33L19k62k92P8l4J15N36j019J25M65m6K9p08M75M32k28o30
2008e60P77k19J29N9l46k89P50P90j312m9M88K47L3m45p6M65k65n1J23o90L97
2029d4O73p62k33K90l5n3L79l7l88J09J56L2l73q6L27L54m57Q0r8Q9K70j90l18
$$ y = [-525, -335, -24, -166, -1145, -390, -160, -178, -164, -806, -492, -26, -403, -756, -281, -411, -161, -51, -835, -497, -344, -48, -665, -722, -446, 93, -422, -641, -814, -696, 48, -264, -891, -544, -321, -311, -120, -722, -512, 185, -424, -555, -159, -392, -78, 140, -412, -903, 306, 17, -102, -386, -223, 202, 273, -404, -232, 79, -183, 367, -55, -239, 50, 318, -13, -512, -248, 74, 105, -328, -56, -135, 1, 240, -446, -90, 177, 109, -3, -19, -672, 250, 224, -577, 46, -152, 44, 304, -218, -948, 183, 574, -383, -35, 84, 422, 243, 15, -279, 78, 65, 16, 280, -829, 241, 413, 139, -548, 85, 404, 142, -150, -72, -106, 9, 545, -474, -349, 116, 70, 99, -609, -134, 298, 70, -560, 217, -2, 127, 186, -160, -449, 301, 1091, -221, -270, 218, 465, 498, 53, -23, 442, 177, 126, 249, -441, -44, 629, -133, -366, -76, -111, -164, 215, 178, -210, -101, 55, 87, -286, -372, -45, 309, -148, -68, -166, -77, 193, 3, -315]
2052c15k49J165k75m16j45L58J54k27j47l61N89J50m03m06p5Q98L86q55m85J027
2072C68R4o52j61j00O56M29q41n70O63N80j10o65n28J077M13n74n40M91J69L81
2092E80o37l15L21N81k76q16M09L13J05l99j80M55K49k42j15j26J33K79j99k47
2112a27j67O20j79l33M1Q7K01j05k25o1J14L78m41J78k03N55k33k20j44J52R4
2133a8j65P5l06L94K17k57k62K93J30n8j7j33M3K45nm84J35L14p6j4l02j97O27
2156A79k3l66M02k56L8L74k62k11N66k31m36K07J11k34L49l35j16L03J89j97j03
2177e2J74p9PJ13l30K79j5j12Q6j73l72O99k19j38K69p9k22K80J21l10K21j60
2199a2%L36l28j20KK57l01L0j36K90K83j93m22M56K17o58N52j42j39R7o1j01l7
$$ y = [-315, -564, 601, 326, -90, -235, 123, 277, 50, -97, -458, 131, 281, -122, -528, -603, 295, 681, -174, -659, 368, 462, -190, -351, -451, 205, 634, -207, -777, -114, 466, 356, -309, -837, 240, 653, 79, -461, 30, 199, 580, -57, -372, -51, 530, 254, -562, -153, 160, 265, -134, -314, 141, 390, 148, 33, -93, 40, 319, 120, -127, -294, 326, 147, -186, -145, -58, 143, 38, -187, -248, -134, 244, -197, -19, -222, 333, 100, -120, -264, -112, -18, -183, -108, -414, -20, 197, -60, -322, -29, 101, 43, 26, -107, -64, 181, 176, -308, -173, 141, 65, 51, -251, -448, 179, 156, -210, 192, -64, -26, 348, 86, -125, 441, 210, -226, -19, 92, -142, 207, -128, -244, 59, 248, 51, -52, 122, 43, 50, 163, -167, 112, 97, -15, 71, -102, -474, 225, 6, -132, 137, 58, -164, 116, 237, -73, 148, -12, -12, 324, -4, -124, -122, 135, -166, -136, -272, 18, 301, 108, -314, 142, 359, -299, 253, 111, -28, 69, 8, -93, -130]
2222a30M16k23R9k15J42L76k04n90O14N0k88Q7L77m55K96K0l23Q2K15P1k99j10
2244HK55L06l43j16j7L45k13J75k45j85M01k3m09n6N09k72P2J10j73l3L98n35
2266d1R6Q4k75P43m51o19O19K22l51J43N2l34M84M1l34j62L76R3k47l21M94k56
2288E6J33J9m82M18m28N19P3n14J80L61l53j04L15j91P9J77j80m73N82k20J5K30
2310B12k25M56k20m41N11J78n25K18K27p09M47K64m86m5O9K47k63M0k9K29k56
2331a01N18m70k0q6K89k51kR6K09k38k62K77j37j55L02j59k33L86l7l0j16J19
2353a01Q9K51n05M35nn25j2K39k73P5L64j14j65Q2K29j99k57N62k31j31p9L18
2375D7l60r9N24L4m38P2K40m23M86k53J06l13L13K05m30K64J19J07m26L21p6k30
$$ y = [-130, 286, 63, 162, -53, 89, 465, 261, -329, 285, 335, 47, 134, 511, 56, 352, 372, 49, 131, 346, 417, 118, 8, 263, 569, 226, 110, 93, 438, 225, 400, 155, -30, 371, 348, -61, -117, 392, 120, 192, 302, 129, 96, 494, -41, 55, 139, -136, 607, 156, -463, 156, 378, 27, 170, 222, -112, 372, 413, 79, -83, 293, 386, 139, -182, 312, 56, 189, 208, -274, 144, -284, 235, 308, -206, -26, 335, -18, -122, 193, 2, 81, 258, 78, -395, 187, -33, -18, 212, -13, 443, 223, -218, 293, 471, -54, 164, 391, -318, 129, 393, -93, -138, -69, 178, -85, -45, -74, 155, -101, 417, -53, -73, -159, 130, -121, -123, -27, 182, -56, -318, -41, -178, -333, -31, -190, -423, -37, -74, -104, -220, -101, -12, 239, -266, 169, 164, -361, -373, -134, -407, -332, 32, -82, -247, -165, 64, -135, -392, 170, -61, -192, -271, 47, -313, -412, 112, 146, -292, -220, 20, -403, 83, -170, -64, -377, -64, 141, -289, -25, 94, 201, -225, 96, 20, -210]
2397b10K57q2K30j73r4L36k18k22L68k35k17K69n5J72k56j05J29m6L35K8k91k45
2419c25N26k52j02k3L30k62j34M79k45r2l5M35n66J18M43m08j39L58k6l3L8k00
2441a15J47l9j16J31o6j51M54o1n10L32L02m41L01k77K03j89J71r2l89J63K13
2462b9J70m12K6N68r0j20Q7k55O5M3J23o6k85K18r4K2L3L15l94k30N36m10J90
2485A1M2j4k82J63O8j79J16LJ9o8o2K45j83l8l4K99j37j09K05p2l10L47p7k5J19
2510D7J20l50J45K22j64L4m28L61J11j59J1K9J20n0K38n10M4M49L0l42k50N30
2532B38op9k04K5K83l00J22j99O7J47J73n12J28M71m07L6J09j08K1J26j87j1j01
2555a68K94k76j78K99K95k01m68O77j15k72J27j04K89k19N7j01Ok20O34k57l75
$$ y = [-210, 47, -35, 195, 22, -72, 264, 46, -176, 192, -43, -260, 9, -46, 126, -130, -235, -106, -152, 183, 211, -80, -325, 201, -51, -153, -176, 154, -108, -242, 237, -8, -100, -135, 300, -266, -148, 295, -113, -252, 106, 80, 47, 85, -115, 32, -7, -123, 8, -58, -209, 245, 184, -326, 6, 308, -133, 168, -109, 94, -95, 76, -16, -405, -242, -29, 141, -271, -245, 323, 233, 113, 200, -55, 10, 53, 176, 110, -175, 43, -51, -29, 4, 319, -75, -305, 231, -179, 11, 53, 39, -243, -80, -12, -191, -75, -72, -53, -121, -183, 62, -121, -159, -193, 106, -31, -140, 65, -7, -317, 30, -47, -72, 47, 167, -183, -38, 184, 20, 54, -374, -13, 98, -61, -50, -21, 99, 49, 287, -223, -179, 270, 300, -42, -292, 238, 232, 153, -51, -26, 257, -43, 79, -120, -53, 94, 267, -245, -117, 354, -53, -17, 92, -16, 5, 131, -56, -67, -168, 126, -150, -328, -29, 266, 65, -403, 274, 159, -113, 14, -90, 199, -20, 37, -64, -58, -278, 356, 99, -276]
2576b76K33R2j34R4n6M2j57L77r5k07J27l5j32k24N50k78j23J26L86l80N7k4Q6
2599D9j6K25k5j46j87K30O2k74J80R9l14q0O6K15m88O01j92p7k5K35j09j82J91
2622C8l73K92k99L96J21k89j81L98j58j41K75J18o50N04J3r6j78J93k54J00m0
2643b11L10k43P3J44n6J48l97L88p7m5m8J75l31P9K22l65J44P4M0j92M44k03r9
2666b6j33R7K34q4M7j40j4j27K86j8m1j7L35l71j86L62J28n89N33k02R0k15L37
2689B86o3m74K24J41L4m18M70j08k12j33L15j28P1N8l84J2L23N3j35p3J24J02
2711H5j04j96L21j62p7J91J74l90K70K12m96K10L8j6k98N2K80j98R8J08r9O9k57
2734a85R3J24k36L12j57k80N58M7j02M7j56j6O4J15m17L04j41K53j97J83k16L51
$$ y = [-276, -43, 49, -85, 9, -47, -5, -162, 215, 120, -87, 40, 5, -127, -351, 199, -79, -202, -76, 310, -70, -13, -37, 49, 33, 258, 233, 87, -100, 130, 192, -82, 98, 197, -117, -197, -131, 84, -404, 197, 5, -72, -97, 138, 29, -153, 38, -335, -43, -342, 54, 175, -114, -295, 103, -55, -196, 79, 197, -453, 51, 64, -32, -210, -17, -271, -171, -211, 99, -144, -71, 73, 17, 165, -232, 156, 79, 34, -14, 161, -170, -91, 131, -234, -90, -16, 24, -168, 276, 73, -26, -159, -62, 172, 88, 135, -5, -19, -146, 140, 122, 81, 64, 399, 28, -158, 204, 332, -257, 276, 74, 164, -51, 286, 223, -251, -27, 114, 148, -270, 200, 92, -120, -253, 62, -66, 5, 63, -321, -309, 14, 67, -68, -141, -17, 85, -19, -215, 106, -56, -133, 58, 232, -158, 112, 324, -172, 38, 76, 60, -238, -186, 94, -104, -6, 102, 3, 72, -185, -92, 32, -204, 108, -49, -329, 229, 276, 174, 221, 65, 49, 113, 228, -189, 115, -26, 227, 30, 213, -3, 348]
2756C48l12K0J46q7k78J37L18k87Nl10M74k13j9J82l51N50m62K89j31qJ62k07
2778c4k67M41M3m10k4K04l11L12J6M8m66L47K4K9m1j5J37k52L08nj02L1R0p2k68
2803b37J86K47m66K52K72l33J88K6kq0o0p5J41jj53J54k16j8M97n24L7K6L61l31
2827a09J61L32l80k8K4p5P1K13j12J91j33k70M28l90k58M44m6l51M87J15n88J68
2849a06K49j12qR4k84L34m0L6k58R5l38L03N4j32K36l37J10K47k42Q0j25K02j57
2872i9O0J90k53q0K29RK6J02m2L2j77j56O0m5j9J71J20j89j19K62k3j62M3K65
2896B05m00J73J9J57k33J77l29J96k5m6L22l10K36j26o1l7O0L18m18Q9L6J04q8
2919A9r9M0M3J50j54K18m45O17l65O6q2P0j73K2J90q4k13K43Mm07L56L34l73Q9
$$ y = [348, 36, 56, 202, 115, -163, -26, 292, 5, 10, -300, 174, -39, -58, 124, -227, 323, -139, 150, 19, 11, 173, -34, -301, 140, 183, -227, -251, -47, -358, -46, -30, 18, -448, -101, -77, -48, -89, -104, 33, -219, 89, 84, -18, 13, 103, 31, -237, -51, 196, -270, -18, 254, -79, 109, 135, 133, 53, -7, -82, 59, 58, -95, 59, -157, -175, 322, -202, -165, -139, 222, -109, 52, 384, 4, -24, 0, -75, -4, 209, 97, 288, 155, -115, 313, -77, -335, 109, 63, -288, 199, 314, -274, -106, 143, 31, 23, 117, -167, 167, 127, 163, -95, 0, -338, -35, 19, -113, 123, -214, -104, 143, -99, -19, -144, 58, -99, -39, 151, -102, -182, 47, 56, 82, 184, 142, 174, -3, -159, -99, -144, -163, 8, 128, -61, -180, 82, 59, -103, -60, 205, -195, -22, -3, 154, -79, 98, -231, -35, -60, -106, 216, -94, 142, 16, -45, -82, -22, 296, -122, -33, 3, 107, 19, -80, -40, 3, 153, -1, 217, -228, 389, 24, 90, 8, 78, -95, -73, 117, 33, -180, 63, 67, -340, 16, 350, -23, 66]
2943F6m2q0K15j37o6R7J82m24L42l66K90J88l63q2L85l38J5L28k45l5p4P6J44
2966G6pk37L28j79P1M5n5j93l9L63o9k46K31k69L3N7K54k4J1q6M2k26j53L13k
2991C9J2j38J60Q1j71l4L3o0R1R5l84K59K5p3%rl6K40p4m58N58k25j8P1k3M4O2
3018F7L3k09J07M3N9J13l77J77P6N9l34K09j28J46k3j11J60p1M2j86K9l27M96
3041E0M2j6MP6j8j19m3oK06k66J0K03j35j59P6R7P4r7P9j15J55j51q3J99j21Q8
3067C0L5J7J13j32K5J5l7n8j39K48j8J02J1k18P7k84J90M9J78k05J54j81rP0P5
3092A08m6p1j22rO9j33J02J01j04J19j1J50l11K53mk85QJ26O0J43j97k04N21k61
3116Bj2L3P2l0L7j46Qj23r6M77n4k24P0J78k07j3j0l1k28L09k04L01m6l3J6j18
$$ y = [66, 24, -56, 159, 22, -44, 53, 235, -189, 153, -213, 77, 265, -98, -180, 205, -133, -118, 210, -35, -70, -144, -68, 76, 69, -168, 160, -19, 52, 97, 42, -151, -190, 173, 104, -142, 89, -180, -147, -90, 164, 140, 151, 65, 107, -119, -272, 41, 39, 51, -87, 73, 154, -17, -51, -18, -78, 13, 108, -276, -17, 8, -65, -65, -74, -110, 130, 56, -402, 156, -69, -87, -16, -39, 5, 67, 100, -109, -2, 41, 100, 213, -164, 13, 89, 148, -186, 23, -105, 41, 18, -93, 67, -4, 38, -148, -119, -446, 50, 92, 76, 80, 156, 138, 19, -24, -30, 176, -90, -80, 123, -12, -171, -95, 2, 76, -21, 58, -57, 98, -53, -136, 63, -58, 30, 65, 82, 195, 63, 88, 103, 66, 8, -131, 117, 99, 201, 212, -6, 71, -213, -23, 26, 204, -1, 153, -28, -37, 33, 108, 62, -9, -131, -140, -71, -204, -102, -1, -105, 14, 3, 153, -158, 95, 91, -194, -186, -60, 0, 143, -54, -258, 263, 2, -10, 23, 95, 65, 102, -44, -36, -159, -255, 222, 168, -56, 14, 192, -15, -28, -38, -69, -297, 12, -192, 109, 63, 30, 46, -72]
3142g2K14j12J9l59M16l25M43l80J28N6j59M15j57n9k4p4k30M09K6q8k58J35M9
3165A3k7j7J09lj33l13M81l26K32r3j1k7q4L46l45PP2K91k96q2L4j18L40k46K64
3190F8j66Q9J97l11j27K89n7j39J80j48K09j76j81K37K68n01K50j47N1K36l60
3211b39J95k9o2qJ0R8J0%n0J85k67P5K4J95k73l3L25l46K1L2K07r5K20l33J47
3236IJ00j85K64m16K31Oj00K5J48p5l5J14j17P0p6P8n0j57M6N7J52R4j06N9j05
3261C1L03n46L02J1j48l0n5K05n5l6J79J13j10k8k56K77l41J39K98l21K62k35
3283d1Rj90J01L7P1Q5k77L75k07J0K14j59k6r5N9p4j10L42J06l80M2Q7J53j55
3307b3O9O3P0l7Lk9k75M14m66K39j9j51O2J7QJ66j27l0n8K59l17K56J8M2k17K24
$$ y = [-72, 142, 30, 49, -310, 106, -219, 224, -156, -28, 28, -131, 284, 127, 68, 44, -30, -260, 149, 175, 87, -171, -36, 13, -14, -31, 78, 75, -58, -371, 110, -216, 16, -77, -88, -115, -199, 147, -198, -191, -119, 172, -124, -206, -172, -290, 50, -196, 68, -98, -9, 188, -123, -250, 39, -18, -157, 23, -125, 84, -92, -273, -36, 232, -269, -19, -166, -115, 121, -239, -44, -73, -135, -143, -133, -35, -25, -25, -75, 110, -157, -82, -58, 137, -136, -169, 156, -190, -169, -137, 70, -25, 195, -138, 9, 109, -76, 188, -228, 3, 9, -91, -66, 82, 7, -28, 86, -31, 39, -37, 41, -9, -166, -120, -63, 89, 183, 77, 136, 31, 334, -212, 90, 101, -47, -77, -132, 73, 18, -18, 161, 274, 164, 136, -120, 157, -184, -45, 253, -68, 194, -41, -32, -222, -121, -84, -13, 72, -205, 170, -37, -27, 187, 28, 2, -93, -34, -108, -218, 124, 230, -150, -108, -21, 132, -23, 46, 109, 179, 142, 145, 116, -159, 255, -211, 28, 9, -142, -80, -63, -55, 111, -16, -46, -104, 155, -162, 94, 112, 154, -63, 161]
3333A61l43J5K87o7j30j51J84K73k09p8K00k07N7J75k18j06L33k78O8J56j42R7
3355G7ll2R8j59K07k70j04K25k04J9N4K35j69pNL06j24k99J59Q7M5k29L16j47
3379H6n2P1jk39o9O4N1J19Qj09L6J29n5j61J86q9J21j86n2K21k11l4M2k0J35J04
3405I5j22j39J14J29n6j53K45k62K98p6j60N2J48j40j0j17PrK89p8p0J85j55P9
3429I4j90n5K15P8p4q9J08j91J84M7j99L84r7j29k75L28m6m0o6j26L76m41K17
3452A3k40J33L3O9J32m18N25l7n3l60K39J57j28k00O0P1MM2j88O5%j28J38J37
3476F6K88l85no3J60r7J6M6o9j28j09K26J52j36j24J07J09J2n1J04k04K34j31
3499A8l2O7K34k56l5m4J54M3l16L5L30j65j7J98k17J61K39k85M1j77L4l9J05j8
$$ y = [161, -182, -167, 120, 53, -77, -228, -44, 229, 20, -58, 142, -65, -8, 167, -51, -157, 176, -102, -34, 122, -20, 77, 74, 42, 140, -19, 188, -82, -186, 39, -165, -146, -92, 143, -26, -33, -28, 278, 154, -145, 14, 101, 146, -83, 233, 86, 34, 105, 104, -135, -204, -140, -89, 30, 38, -71, -35, 94, 39, -122, 64, -25, 96, -90, -142, 79, -132, -166, -124, -144, -9, 95, -27, -166, -52, 77, 21, -132, 113, -149, 149, 73, -87, -35, 113, -27, -37, -154, -147, -156, 133, 55, -15, 170, 15, 94, -96, -151, 64, 142, 68, -21, 87, -104, 80, 127, -72, 312, 215, 86, -189, 139, 93, 53, -13, -139, 237, -204, 13, -227, -94, -61, 8, 140, -278, 247, 210, 157, -203, 36, 193, 65, -135, -75, -4, 0, 42, -146, -81, -81, -209, -71, 66, 354, -31, -36, -99, 61, -36, -20, 26, -43, -171, -280, -54, 98, -38, -162, -55, 54, 66, 15, 119, -85, 149, 18, -14, 53, 287, 31, -4, -48, 106, 149, -167, -132, 198, 33, 16, 214, -3, 158, 397, 112, 153, -24, 10, -29, 76, 58]
3523E8J0j09K81l83P8K49l67M54l23J11O3j9k08K18k23J28L5m6o0O0P0J21k13
3546a5R8k3J93n03L99j86j12J41r7L51j84j37M6j68K44J11m22L37r6J02k58O8
3568a11K12j88J92l6K9j87%J25r6K3j42L04p1n2n2Q9q8j8K27k44J49M3j98p6J84
3593A8M8j4j40L21l31J40P3q7O1j23kJ61l2n6o1k8j99J85Q1k27L46k46lO8j10
3618a57p7K59j0k7k47L20k2j70J89j5J2k36j12N4K68k1K58l29P6N7j41J61Q9p7
3642A02q2lJ26p0j51j1K89k58n9J54j26L09l6l85nP1J1J42k30Q9K02K08m66o1
3666b40M00j52j21j58J51J61r1K27k93n1L87k09k78P3K97m5j55K72j59P6j06J81
3688A67n22M19l4m3j67K11k29P9p5J67J77k34j26J95N0L20m22J54j46j92L64p7
$$ y = [58, 68, -41, 240, -143, -65, 184, -183, 271, -52, 59, 122, 103, -105, 113, -110, 18, 53, 7, -53, 7, 77, 198, -15, 83, 60, 253, -250, 149, -37, -149, -8, -105, 246, 62, -75, -29, -197, 47, 158, -264, 73, -23, 79, -179, -111, 101, -87, 105, 69, 98, -89, -89, 36, -60, -37, -179, 125, 54, 2, -50, 39, -49, -67, 160, -84, 65, 108, -90, -166, 18, 66, 52, -88, 233, -98, 42, 115, 28, 89, -34, -36, 125, 93, 37, -24, -52, -251, -66, 15, -212, 134, -112, -115, -47, -157, -234, 25, 15, -12, -259, 61, 39, -131, 58, 43, 55, -181, -293, -239, 29, 8, 266, -63, 13, 70, -71, 90, 179, 102, 20, 17, 143, 73, -78, -89, 200, -58, -117, 37, -89, 220, 184, -201, -206, -135, -124, 18, -212, -123, 79, 287, -179, -240, 160, 8, -113, -271, -120, 41, -50, 177, -116, -167, 220, 11, -267, -194, 103, 58, -97, 175, 16, 92, -14, 167, -355, 64, 30, -13, -180, 31, -198, -119, -194, -27, 150, -84, -210, -15, 35, 355, -67, 87, -59, -251, 113, 36]
3710C6PO5k5j43J34k09N7M5L6q1P0N1qp5R3J40j43L8k72J34J14j96J63J58k20
3735c1J44J26k44J03J52L5k56O7j20l2l1M4J84k87K19p4o6k0k2J32j10M33l22
3758B4n6J0n2j14K33m0r5k1k27L19r5k30L15J91k57J35r3j70L04K2k44L5J69m8
3782A5J45Nj74L3P3l07L58k78M5J0M4K29k57J13nkL6l52J76j12K39J44j99m4j35
3807b00K67j81n6M61M9l39P4k07K49p7p1K11j54j50p2L07j33k1k7J74k85L00k42
3830a23j04J60k13M00j47N4L7j4jj4l5L11j44q6n8k55M14J37k40K6q9J64k41J01
3854D0k66N37j42j50J32l35K83j68J04r3N2l4K15l77J50K93j89J97l5j06j56l0
3876g8J14j00K36J11k13o5j82M26r0m87L77k3R7J4j07K60j73k51J4L36j97j15
$$ y = [36, 43, 108, 83, -60, 74, -135, -78, -33, 3, -78, -8, 43, 35, -40, 53, 193, 50, 88, -184, -50, 64, -132, 31, 189, -31, 113, 239, -5, 98, 250, 285, 29, 96, -24, -56, -87, -43, 141, -146, 73, -1, -67, -87, -109, 23, -87, 346, 24, -32, -22, -74, -188, 45, 5, -90, -111, -338, -19, -114, -344, -29, 162, -95, 40, -53, -223, 81, 103, -141, -106, 63, 15, 160, 165, -9, 24, 97, -210, 148, -130, -85, -75, -31, 198, -59, 54, 49, 47, 83, -269, -93, -205, 34, 178, -21, -65, -200, 67, -114, -170, 291, 340, 1, 75, -132, 117, 40, -31, 180, 26, -124, -196, 111, -22, -43, -70, 104, -181, 119, -123, -227, -67, -280, 120, -27, 27, 64, 50, 49, 35, 0, 311, 167, 81, 23, -232, 182, 319, 79, 105, 16, 180, -61, 40, -226, 311, 169, 19, 151, -184, 99, -69, 35, -58, -6, -40, 175, -202, -52, 241, 52, 249, 214, 108, -48, -78, 36, -64, 172, 283, 70, 5, -177, 249, 159, -328, 49, 26, 123, 137, 30, 290, 117, -134, -120, 216, 19, -96]
3898i6J07k32L74K4j90j02K25r1K26j38j36R2m7O1j22J49j88J29j92q6N40l18
3920a1J17Q2m38J34L16l43J21o1J14j18J62j53J81Q6k58R0pk40O2J90l02K12J01
3943C7k6oJ2l2J00j56J60j32K9O2k06J99m9j5k7P2J25k57l0k5M17l02k0M03k98
3968C5n8m6K84l68L83q3r1j96K56j47J59P2j36K2j31J78o9q8J30n8l07K14n1K21
3992A25j95K41M5K5m27L02j28J7J71k07j98K90n7M7j5k76L05o4l1J57j45M4J36
4015A62j61j01J70j62R1m1L60l07L6j38l9L38j46J10k06K00k6k44J50j59P1J69
4037A27l1L5j51R7P9l39J78j56R4J35o6o4j03K99q9J1q7O1j44K05j19Q8j25J92
4061A27j75N3j52n3Lk2J30J31lj87M0R8k05R0J09P1j13j61J35J81j96M3Q9M3k9
$$ y = [-96, 11, -221, 153, 177, -13, -115, 110, 19, 245, 107, -29, 63, 16, 77, -45, 104, -84, 45, -147, -233, 307, -11, 106, 188, -250, -116, 200, -143, -22, -83, 31, -87, 75, -78, 103, 189, -69, 21, 14, -226, -164, 26, -276, -64, 37, 11, 5, 17, -15, 85, -71, 89, -43, -14, 48, -158, 41, -8, -23, -50, 22, 147, -110, -140, -165, 252, -50, -70, 333, 35, -23, -69, 215, -153, 230, 147, 56, -140, 116, -31, 128, 200, 64, 86, -45, 133, 64, -24, 106, 48, -259, -45, -96, 125, -70, 171, 216, 241, -186, 116, -12, 5, 176, -31, -229, 61, 4, 51, 36, -240, 65, 1, -30, 127, -18, 26, 162, 1, -100, 70, -92, -1, -42, 318, 11, 47, -91, -130, 208, 62, 172, -34, 166, 140, -104, 46, -113, -42, 127, 96, 131, -20, 77, 156, -183, -5, -161, -67, 68, 2, -62, -165, 134, 45, 56, -31, 30, -114, 91, -28, 60, -65, 127, -48, 5, -147, -200, -197, -219, -89, 42, 39, -148, -108, -10, -215, -125, -16, 55, -58, -219, -84, 97, -99, -56, 33, 76, 47]
4086D7K7J8j6j49O8K02k57J37m5N7J07j74r9j58L69l11J19K55n7R3k04j5l3O6
4110D7J69k54M2O7k7P2k2N5l11J59m7J22L6O1Mk23P2J57l46K90k9l16M74j26J1
4135A37l46R2N5m1j45L4J22O1K8J07K38l89J1k5MJ93l93K65j79L7K38o9M0k05
4159a30K67NK7k3j53q7J58J38k55qL5L47m98N7Q5J60J8K3k84p3K40j89K8J94J41
4184B23j29k59J54rJ71k33Q2K1j02L10m05J92L1n7k1j1P1M6k13J81k6K01l69J01
4208e0L31l80M80m80L91j70L0n8l21L56j40O6O4r2k00K74R0j37k69L69J52l44
4230c8Q1k8K6j58M2K0j43J10K59k76J41m5J07j42J3J81j08K3k09Q1J06j21L8J48
4254A08j03J48j85M9j26J14j1N2p8j1j11K18Q3m11J15L16J6N4k96J02j48O4j87
$$ y = [47, 74, 92, 76, -73, -5, 197, -60, 77, 32, 89, 196, 22, -77, -235, 134, -177, -58, 197, 140, 233, 29, 14, -19, 47, 216, -38, 4, 71, 44, 116, 94, 149, -162, -3, -50, 72, 108, 169, 173, -50, 22, 179, -167, 123, 94, -222, 252, 126, 137, -209, -117, -62, -103, -248, -214, -92, -31, -3, 104, 342, -47, -36, -61, -57, 136, -257, 8, -171, -134, 104, 35, 75, -130, 137, 142, 169, 146, -7, -94, 64, 202, -53, -61, -26, 321, -177, -120, -35, 125, 143, 166, -118, -191, 49, -140, -112, 82, 223, 94, -165, -11, -20, 151, -82, 0, 21, -81, 229, -176, 16, 47, -10, -31, -42, 29, 75, -138, 43, 17, 218, -151, -50, 281, -99, 381, -99, 292, 122, 152, 94, -227, 129, -11, 55, 119, 27, -173, 101, 191, 54, -215, 154, 306, -38, 43, 15, 41, -117, -75, -55, -198, -88, 171, -105, 36, -9, 98, -44, -31, 150, 42, 65, -144, -63, 43, -78, -40, 108, 5, 153, -32, 17, -109, 5, -6, 46, -32, -43, -154, 64, 147, -264, -149, 167, 183, 237, -59, 43, -105, -41, -228]
4277b28M21k96m5Q2L2J61j44J50m64K50J48j46J29q9k1O0j02J54N2k43L81l35
4299i3J04k2o4J39j03R9N6k41q1N0J25J86j85J08j85N5K35k37K00k67J32O8K10
4322B89m34P4R5J43Kk00K6J2kj40L29j01K03k52oK59l40j2L4J23k05p6K10J66
4346A97l04J75j9k10K0J48Q2l5k50K04k23M4oJ70J54l46L46j32R0k23R5L04j24
4369A57j33K11k60J73o0j25J3j76K05j66K6J93j63J19J22j9M5r8nq5J89l38J19
4392e6M9%L4J02j63n0j24L90op2N4J9j75j4P7k2OrP7J72m27L36k09o6j13K68O1
4419A39l78J13K79J70o6m80L26j90L28n00J29J01m5J84j36Q6j02J66j60J93k17
4440f0J85k19R6k6k05J73l0J94j1J54j76j55J71k32P3J62p5K5M3o5j21J29k94
$$ y = [-228, 193, -103, -148, -66, -34, 127, -17, 133, -331, -81, 67, -79, 50, -39, -60, 0, -102, 52, 104, -139, 242, -93, 11, -11, -75, 64, -39, 60, 116, -125, -206, -156, -31, 155, -30, 78, -107, -52, 183, -54, 146, -121, 11, 79, 289, -145, -71, 24, 167, 169, -31, -5, 7, 5, -135, 194, 93, 296, 44, 38, 297, -43, -55, -21, 102, -103, -179, 31, 197, -107, 68, 49, -161, -141, 7, 89, 54, -196, 8, -215, -171, -177, -7, 147, -199, 147, 15, 105, -118, -23, 281, 157, 24, 235, -25, 148, 88, -37, -24, -200, 5, -161, -135, 58, -105, 14, 136, 117, 162, 64, 59, -26, 163, -175, -56, -7, -7, 27, 129, -34, -84, -208, 182, 176, 104, 158, 177, 2, -12, 65, 43, 49, 40, 117, 289, -138, 198, -11, -77, -190, 78, 139, -239, -126, 153, 323, 257, -223, 103, -87, 241, -259, -130, -29, -74, 110, -26, 60, -42, 124, -36, 157, -60, 125, -94, 2, -24, -229, -56, -86, 108, 97, 251, 75, -80, 91, -141, -68, 94, 19, 44, 87, 22, -99, 30, -264]
4463b64L33N9j12R0m0K2n0q7j30K53k70J45J40Jk7o8j60N8K71k52J86j69J25K03
4487B57m38L33j47k3j34K08J09j97j68L21k13qJ35o3n0j0k6K37m4j8N1n4j18l8
4511i8L49q4j29j23J74k4o8j22K28p9n6J5j9jK90k29K8N6l16K92J9j55J27l74
4535b99M10j96j1p3J4K55j57L28o8m07K27j44l6K20k53J75P5l2j38J88n9J27l70
4558b24J67j9L37k05J54j17RL7j76N7P7j79J00j76PK81J0nl0k80J09K27k37P1
4582eq8R3K13m95L41P8j10k13K13K6j12K0K4m5R0l8Q7r2j42M9l0K53n3q0k64R6
4608a84O46l65j15k26J40J24k04L19j69m4j4J04n5J80k55j60L15j48J70J8o7J3
4630B3j88J77J11j36p1kL27j15j07Q6j36k33J23j54L20j20J02j13j18K09J4n0
$$ y = [-264, 69, 128, 16, 106, 66, 88, 38, -49, -179, 74, -196, -51, 89, 90, 63, -5, -165, -107, 164, -88, 98, -71, 54, 257, -181, 152, 5, -18, -152, 56, 165, -32, -200, 121, -92, -100, 35, -28, -78, -88, -114, 123, 79, 61, 112, 58, -60, -98, 251, 167, 38, -85, 89, 65, -3, -125, 103, 24, -32, -17, -36, -37, 253, 24, 52, 108, -208, 84, 103, -52, 75, -299, 111, -85, -96, -169, -155, 100, -57, 271, 203, -204, 23, -121, -157, 63, -190, -15, 60, 28, -110, 78, 19, 146, -224, -57, -76, 261, 56, 210, 93, 102, 139, -37, 20, 97, -82, 18, -158, -151, 130, 140, 135, 105, -175, -66, 161, -76, -5, -93, 0, 213, -282, 59, 137, 27, -186, 27, 53, -59, -39, -15, -60, 30, -8, 79, -13, -155, -106, -136, 117, 64, -16, -280, -184, 462, 97, -18, -244, -104, 20, -184, 135, -34, -78, -92, 12, -43, 137, -118, -278, 37, -111, 59, 77, 10, 23, -165, 12, 123, -13, -84, -86, 241, 126, 19, 105, -31, -264, -141, -295, 25, -95, 7, -106, -224, -15, -1, -51]
4652e1J8l5Q4K5L9J3R0j96q2q0K23j24j7Q2r3J28j28K87j15O2k79R1r0L91j56
4677H7k06K11j5j00L0j76K81j88o4P9O8M1m5j12J30o4PJ14k01K44n5j87K93Q2
4701B54j50lj84Q8j01J58j05rK4k24L07o9J26l70K23j14J81k7l8M9p3j35J78p1
4725h5J83L1j99K00p8k08K4K0N7nj00J13p1K58j32km1m1P4J65j37M7l46L60j05
4750a8M5n1O3P1k91J17L6m9J60q2j55J62J46k4j14j22j52M88p2j62l8J93j34j26
4774a09K46k25Q3p4J10r3r6K43n9p1J25j16K95j76j19l0M8J57k75O5N9M7K7j76
4798a14O8k52L24k74K51j59L51m40K24J24J4r4k31K95N0r4J49k25MJ46j29j8k13
4821b43J97J91M2k62J27k08L46l17K46l42J28M8Q9K7J4l0K9r1j64N5j10L71M1
$$ y = [-51, -33, -68, 16, 41, 80, 93, 183, -13, -95, -175, 48, -76, -93, -11, -104, 24, -104, 183, 68, 130, -149, -58, -148, 243, 87, -119, 92, 77, -23, 7, -169, 112, -76, -140, -61, 7, 48, 3, -109, 21, -43, -36, 78, -123, 121, 66, -121, 172, 254, 104, 101, -83, 5, -96, 62, -43, -52, -28, -252, 55, -14, 112, -258, -35, -149, 32, 5, -33, 16, -57, -192, -14, -85, 98, 129, -70, 130, 52, -156, -132, -112, -55, -60, -160, -47, -118, 140, 8, 6, -35, -76, -2, 163, 26, 73, -273, 87, -18, 27, -24, 39, 110, -181, -64, -28, -77, 83, 1, -154, 8, 154, 130, 16, -106, -258, 230, 158, -4, -42, 151, 17, -109, 137, -88, -5, -79, 31, -62, -158, 85, 26, -45, 80, -36, 259, 83, -36, -66, -18, 139, -136, -71, -12, 35, 62, -114, -46, -298, 26, -248, 3, -156, 195, -245, -21, 103, 117, 23, -208, 87, 137, 43, 192, -33, -29, 117, -12, -30, -243, -46, 145, 187, -75, 52, -156, 190, -127, 119, -223, -95, -47, 42, 69, 83, 53, 82, -9, -173, -118, -228, 143, 184]
4844A84j04qq5j04L11j93k00J32j41M6J3J25O8j06N1K12l8l2j97k6N9K50j69j20
4868g2J81k37K30j39j3J71j03kO5l00L76k69Q8J84l47K19p5j60K54n4ll9R7j12
4892f0%k46N18j09n8m7J13k16J42j11p6K91k31J09q2M5K82L4l10k8k7L16j58M5
4916A36j65j9Q1J42K7j76q2J12R1j38r6K17j12r0K30k63J51m30L34J53l44L03
4938F2j49M2l2J17o1j15r1P9L8Q4N6o3J94k36M0P3J20j09Rj15P5op7J60k43J99
4964E1P9l00P1R9J30j29l4n2Q9M9K11m39J6k4j9K38mk45K23r1L0K18j43M6r0j3
4990c3J7o1N3j87J90l4K05j53j35R3R0%n8J83l08mJ52o9Q5k66J03K59p6k76K07
5015b3o5NJ23k14J46K89k58O2k8j67J01J6N5k64J98J59j52J1j65R8J4J68j40J10
$$ y = [184, 80, 72, -13, -117, 194, 1, -199, -67, -208, -162, -149, -24, 44, -62, -11, 201, 163, 131, -66, -92, -33, 217, 48, -72, 109, -128, 102, -37, -50, 121, 18, 16, 81, -219, 157, -112, -24, 160, -187, 32, -43, -203, 51, -3, -6, -45, 52, -60, -60, -306, 212, 103, 45, -2, 111, -105, 37, -74, -150, 141, -90, 19, -63, -18, 264, 298, -12, -40, -67, 249, 91, 136, -29, -48, 33, 175, 202, 26, -56, 56, 147, 9, -87, 130, 18, -72, 158, -105, 46, -384, -50, 103, -241, 62, -87, -45, -77, 40, -21, -136, -227, -148, -110, -26, 30, -33, 161, -75, -35, 38, 158, 49, 58, -57, 18, 12, -65, 95, -148, 51, 130, -170, -99, 0, 130, 1, -33, -85, 4, 53, 264, -175, -159, -183, -202, 36, 32, -213, 10, -81, -51, 167, 24, 70, -20, -33, -16, -77, -24, -211, -21, -55, 150, -3, -138, -45, 45, 45, -13, 170, -138, -142, 10, -59, 26, -240, -137, 122, 46, -230, -23, -88, -83, 40, -174, -28, 261, 3, 65, 37, -130, -29, -13, 42, -222, -24, 135, -17, -6, -171, -73, -59, 109, -31, 79]
5039G9n3j22K24k35R3L8k71J88j6J70j7L1p1j27N5l2N0k24O5K13j20L6nj00J86
5064C5K05j14j47J53j41J30k15R0j72K44L0J62l7l55O4K08n6O5r7J39mj44n9J87
5088A71j31J15j61Q7j53J77k4m4K1L0j00RO7j54J26j82rK78j79J01j6K18n42J3
5112b82J78N2K68j53o9r3JO8J12j86j9J25o5J03MJ0l8J13m01J63J26O9L2l08J70
5137b0j34J36P4k55K53q9o7j47K0l4M6L13Nq4o6Q3j87J49l3j65K19o2L16k54o1
5162d4Q3k89J17l4K36l17L34j01m9RR1k56K97j23L56l21K4J09j24p9mM33k07k27
5186h6K25p4l01K4J56k10K29j56l8j0L0M42j79p6qj0J16r4L43l33k04L47j61j2
5210d0j62J61J87k44K47j07j86J69o4m1P0j00J72j9N6K8j63r4K07l24K39L6m%
$$ y = [79, 26, -96, 128, -107, -14, 24, -247, -59, -75, 95, 78, 109, 38, -89, -34, -66, -16, -240, -175, 38, -82, -46, -51, -151, 35, 240, 126, -21, 132, -9, 121, -94, -4, -176, 68, 98, 260, 223, -132, -68, 140, 84, 149, 52, 191, 187, 43, -16, 171, 40, 155, -6, 81, -72, 105, 81, 37, 58, 88, -12, -3, 64, -90, 36, -146, -155, 123, -56, 45, 29, 247, -295, -282, -104, -52, 216, 63, -6, -99, -98, -30, 82, -104, -123, 2, -63, 40, 44, 54, 16, 129, -272, -109, 17, 86, 118, -190, -20, -154, -18, 56, -199, 54, -35, -102, -249, -229, -263, -217, 96, 101, 17, -49, 34, -153, -4, -37, -202, 17, -45, 271, 17, -44, 39, -250, -133, -167, 69, -248, 86, -15, -64, -55, 36, -220, 77, -46, 310, -11, 13, 122, -2, -81, -85, 348, 141, -86, 139, 65, -236, -212, -56, -266, -37, -193, -231, -241, -211, 231, 52, -24, -32, -42, 74, -20, 323, -10, -214, 133, -28, -40, -202, -41, 146, -98, 149, 42, -144, 25, -39, -80, -10, -110, 62, 43, 99, 127, -36, -130, 77, -247, -8, 28, 24, 24]
5234B4j70L05k48MK1o9K61J37j56j09J61j25k4o1J3K2p8K1J17m1j28k3n1K46J04
5259A53j55q7o9N0r5K92%j17P7%jm7K25k21P3o7j72K95k52M57l55o1J05j01M9
5284b4J18j16O4R7j08k00M67k52J47k20k0J25K5j41r4K44n10L15j08L85l60K14
5306D8j3k2MQ4k3k59L47j08J42lp9j56J14p4l0j26K40j49r9J25o0k22L45j37n1
5331a62R4K06l14R6j3L6K1J62j26M7J11k19k3nk6O5r6J77j4N2p3o4J06P3J55j24
5357A42r8k30J86j57J52J09l40K37j24J89j58P9L8l75M23j29J7R9J14m06M40l35
5379a27KR8kJ47j29J61k54m1J73J04N3k44M7r6J24J17j67J99l18j19J07K0Rp3
5403b09J62l3n3K10Q4k66J70J2j67J63k19J66k36J93L3j00q7L49j87j9J34n2O9
$$ y = [24, -146, 159, -89, -85, -64, -133, 128, 265, 109, 0, 161, 36, 12, -49, -36, -14, -92, -71, 46, 5, -123, -146, -197, 49, 153, -2, -89, -158, -108, -203, 89, 89, -28, 49, 49, 48, 1, 226, 5, 78, 11, -161, 134, -118, 339, -16, -77, 28, -73, -24, 94, -22, 42, 139, 31, -169, 298, 46, 193, -27, -47, 78, 103, -38, -132, 112, -398, -83, -191, 194, -166, 48, 35, 13, 17, 101, 78, -181, 166, 58, 200, 197, 118, -38, 76, 2, -28, -154, 86, -63, -162, -37, -97, -319, 26, -111, -162, -68, 138, -176, -80, -93, -57, -36, 126, 0, 47, 158, -61, -84, -89, -115, -50, -146, 31, 17, 69, -4, -68, 38, 111, 266, 142, 44, -186, 0, -157, -5, 104, -236, 1, -123, 66, -92, -13, 25, -350, 73, -56, -39, 60, 174, -232, 208, -127, -125, -27, -29, 118, -11, 150, -104, -145, 28, 132, 185, -59, -12, -108, 16, 133, -34, 165, -153, -272, -165, -145, -136, -209, -47, -80, -133, 77, 161, -105, 65, 77, -90, 73, -146, 20, -216, -23, 10, -90, -177, 172, -15, -34, 100, 48, 117]
5426A17j64q0M10k05j51Q3K1P9r7J47k11K38m6l22O1P9O6Qk47Q4J01j08N7Q2k4
5451b2J61j16l13K87J75j50M2l7K8p7M3j60k4K17j95L76l34J47J54k52r8J14k2
5474e6K33p4j51J14j2K69l53m3o7k5k5J01J90n1k21j1J17K20J26k77Q5r8M01j05
5498B87k30j43P0lk46M17k75J17J40j74J58k84K98r2k09J28M2r6K32p7q8J20o1
5521C1p7O8k4j15n7J56j30K03Kp9o1n3K25j9k27Q2oJ63N7j99P7j54J90k58L10
5546A05k48J3J45j01j11K64j57K4K68k14J03m0k13J00j02J35j1Q0k54L55l74L85
5568A52l31P4O2k37M02j35nJ04j42p8K55q0M4j59R1k6K24l11j1O7OJ60j36J6m8
5593d2O9j7k45K54j5k25K54l0j37P6L2j42M11k20j0R8o9o3K47l83K29r2o3Q0m9
$$ y = [117, -47, -127, 283, 78, -73, 10, 31, 110, 13, 160, -51, 187, 141, -181, -120, -41, 25, 33, -214, -130, -29, -137, -80, 2, -22, 139, 23, -290, -3, 172, 22, 64, 27, 55, -22, 21, -139, -163, 54, -141, 235, -99, 48, 202, -50, -148, -34, -56, 177, 103, -48, 66, 54, 323, -30, -73, -140, -165, -190, -89, 101, 50, -171, -182, -65, 155, 281, 4, 89, -9, 392, 287, 57, -86, -16, -19, -265, 152, -123, -6, 134, -40, 118, -166, 132, 40, -169, -41, 1, -95, 137, 60, -28, 92, 31, -46, 22, -2, -117, -174, -18, -148, 55, 57, -22, -83, -136, 89, 70, -157, -75, -81, 82, 139, -60, 17, -137, 53, -205, 105, -143, -130, 15, -86, -197, 67, -90, -66, 202, -12, 91, 51, -162, -62, -164, -29, -40, 40, -214, 141, -233, 152, -179, -105, -43, -280, 122, -13, -18, 86, -56, -134, 121, 41, 85, -74, 17, -9, 215, -96, -107, -40, -34, 126, -10, 6, -42, 27, 10, -235, 19, 4, -221, 33, 3, -134, -58, -26, -168, 243, 23, 13, 111, 42, -21, 226, -157, 72, -20, -83, -3, -52]
5618e2R4J27K4k81R1M8R8k02j41J44J29k4L2k7O0n6J2j37k1R6MJ33r3m3K7P9r8
5645B3j45K67l08K18l29J81J21qN2po4Mj25J55K02j99J01j51j33q0R4K1J45k5
5669A0K51j93P4q5l54J66K40l91N5N18l26p6K73k18J16j1k32K81k94M4K58L7J
5692A44k24N2j52R9J12M7Mj28K74k61Q0M0J61l28J99k7Qj22L37j79j69K22j14
5715G5k57J47jJ86k76K58K5Pk84o1K30j41LJ79j76j07L49j07Oj33k9K30k39L55
5739B39M9l04j09J48J55j49m9k9q4n6J85n0N1M1j8j13M4Q7l18K70J31j94q5J72
5763A4n9M0K5J58l49K15p7M9m2J90l7j22l1J26q0j5n6l8J40r9J8l7K39r4j17L06
5789B67k4k70Q2J7l6o7J65q4j50K08k3M6jo0p7Q4j22R7q7k87K44J23J18j50k1
$$ y = [-52, 42, 169, 193, -88, 3, 51, 149, -53, -194, -50, 79, 55, 87, 60, 120, 64, 76, -61, -82, 14, 18, 151, 58, 15, 42, 121, 23, -122, 145, -163, 55, -274, -93, 28, 20, 72, 65, 1, 5, -120, 35, 237, 38, 139, -12, -145, -225, -131, -110, 35, 10, 261, 68, 142, 57, -297, -131, 109, -282, -227, 291, -35, -111, 162, -56, 60, 49, -183, 98, -196, -152, 106, 143, 144, -80, -28, -180, -81, 31, 78, 82, -46, 228, -33, 47, 87, 248, -80, 119, 92, 100, -22, 315, 136, -33, 189, 75, -182, -35, -36, 150, -126, 132, 157, 164, -120, -181, 49, -92, -89, 90, -86, -193, 156, 49, 55, -78, -107, 123, -116, 239, 288, -16, -125, 23, 178, 29, -20, -49, -133, -189, -4, -54, -3, 38, 20, -93, -49, 38, -280, -10, 121, -73, -158, 14, -45, -5, 20, 178, -171, 44, -33, 16, -26, 164, 127, 5, -26, 100, 20, 5, -51, -89, 51, -48, -30, -67, 172, 78, -39, 267, 243, -27, 55, 72, 36, -31, 134, 50, -100, 108, 85, 131, 130, 70, -7, 77, -45, 52, -35, -322, -78, 45, 163, 13, -8]
5814hJ92l80N3M6K36k45J68j74J3k8k5kJ02P1r6J37j06o9K48j66m3L11l54kN1
5839g0N2n4Q6o8J49m6j66j9J6K38q4p6K41l3k47r6J51j76q8K27J70j37q8K8J59
5864F9k29j2J13O3n3jL0P9J1q6p3o9R6o9K29r0q9J44j16L29k26Kn8L8O2j26r7
5891a29K09Po1n8j91K47q6P5R2k22J24KJ48k00o1Q2r2j68M50j53j26K31l3J00
5915A87j51l11L58K7j60J5r6K96k62K21L1k96j18J34M9K25rj07P5k79J78j02K6
5938f9J42p6k04K40j36L02j28r4J34k27K31R4Q9j88l02L52k81K1J38P9l75O6K89
5961I7o0j29K8L09l59J56k09J17J77l57K66J21j67J38pj7R4j83L7k11O3j02K02
5984Dm8j26M63k21J32k99q2J45l9J77k27J5K65k70KJ91n3k64K57j92l4J42L1J43
$$ y = [-8, 184, -196, -143, -97, 139, -106, 62, -112, -99, -127, -152, -154, -52, 19, -77, 60, -46, -115, 133, -33, -76, 235, -119, -121, -70, -18, -72, 14, -54, 95, 49, -117, -136, -120, 118, 34, -42, 199, 166, -81, -177, -26, -202, -290, -63, 107, -30, -118, -90, 69, -160, -172, -59, 4, -49, -50, -20, 59, 70, -16, -89, -158, -62, -131, 98, 8, -81, 63, -53, 276, 50, 52, -6, 32, 94, -32, -129, 80, 87, 26, -32, -223, 24, -62, 13, 105, -117, 7, 9, 157, -43, -104, -22, -114, -282, 168, 15, -111, 120, 87, 187, 36, -275, 83, 110, -50, -35, -131, 165, -97, 124, 155, -141, -259, -125, -76, 149, 140, 33, 108, -171, 7, -95, -69, 73, -3, -207, 33, -103, 199, 71, -23, 111, -116, 115, 209, 298, 110, -192, 160, -121, -100, 38, 117, -258, -192, 97, 37, -92, -64, 245, -114, 42, -167, -50, 127, -230, 36, 157, -10, 128, 121, 104, 198, 15, 52, -159, -96, -198, 4, -44, -170, 293, 72, 204, -95, -177, -32, -71, 106, -121, -106, 159, -111, -109, 82, 29, -235, 22, -170, -204, -62, -31, 112]
6008A12J59m48K69j82K2J35l0k81J03J36N8k28J92K14m3j54P7k28%K51O0j56J6
6031E4k14L44J87l74L0K5j05J0q0J88O4j65pO3J00n4k8j08P8J61j30pq2N0J0J23
6057A33k6O3j03kK09m08o0J91p5K1j44K31jk6K2j23L12k18R9j56Q2l3Mo8K37j32
6083B9N3K6k64K45j15m7J30O3j13pk24J09K19l4j23l2K05j37r4J59J42k20Q0J31
6107A81m64M08o9r3J33o2J57k66M0k6J32r3p3J30m0p5L8qJ27k35J27J69j6k41
6131a19J25M6k28R4M4L05k14j04J07Q8m7o9o7M8m8J57j43r3J36j09j43J1K52J2
6155D1j54K16m5M5k91K76k7j12J07j42j12J54L1J24k43q0K33K2m2K4n3j5J66j0
6179A13l6M0j32J6j65J44J54k54j3J08K10j4j43j73N3J48J73k17pk5k10L25J86
$$ y = [112, 271, -177, 92, -90, -68, 67, 37, -244, -141, -5, 53, -175, 17, 231, 188, 34, 111, -117, -117, 134, 194, 38, 54, -160, 184, 371, -3, 27, 52, -53, -43, -123, 65, 129, -36, -43, 20, 120, 66, 38, -70, 8, 169, 39, 32, -50, 0, 10, 133, 107, 170, 67, 65, 274, -134, -194, -3, -78, -57, -201, 30, 29, 3, 25, -98, 214, -4, 95, -61, 21, -12, -8, -76, 161, 29, 82, 108, -156, 89, -26, -73, 57, 120, 7, 0, -224, -115, 104, 70, -53, -85, 120, -17, -111, 48, 190, -30, 50, 181, -283, 125, 56, -37, 96, 34, 191, -75, -35, -61, 71, -22, -95, 35, -5, -80, -42, -50, 77, -158, -31, 138, 122, -119, 6, 52, -176, -82, -38, 267, 53, -51, 56, 144, 97, 28, -39, 9, -39, 118, -25, -118, 18, -91, -234, -223, 29, 41, -113, 103, 58, 103, -188, 88, 61, -51, 56, -86, -198, -44, -13, 111, -132, -212, 21, 43, 1, 25, -28, -43, 123, 113, 77, 117, -15, 1, -164, -20, 134, -120, -133, -25, 185, 171, 28, -145, -92, 56, 229, 12, 5, -20, -230, 95, 281]
6202B81l05j0R8k83L56k04r8K00pL66k24j17J26q0Rj69q2O5J3J18o1l23N00j03
6226F6r2j88N4J33O0m0M8l4j03j7J55j98M5O9j03J94q7K03j95j24J14lJ67n2J46
6251B18j91l41J99M1O5Nk48K05ok05K53K31l21jJ30J07O6j73r3p9L14M5j00j33
6275a2N2j18J23L6j60J78o6r9j7M5m7J41o2J22j59J84k30o2L01k13n4j07K31J60
6299A67k21q1K14k26R7O6r6j83M68k24l6L7L4N5K12j85M0p4l7j23J40k62K38j0
6323A0p9J51j38J53j87K11j47J50j73Pj2Q7J3j70J60L1l22K83m9J56k64l5J12
6346e2J53m77M11K4R9j26J20m2r9l39L74J3p3m7J56o2J07q1qj80J44j74K82k27
6370a04O3N7q7J71J6k9Q7n1o8O5k89J86l51L25N3j76K24j09O1j98J42r4L31j91
$$ y = [281, -24, -34, 64, -219, 137, -67, -165, 35, 28, 394, 170, 53, 179, 99, 108, -61, -143, -78, -65, 53, -8, -331, 169, 66, -26, -214, -160, -27, 33, -7, 41, 7, -96, -113, 42, -156, -111, -42, -145, 49, -38, 165, -30, -154, -40, -43, 124, 72, 218, 27, -314, -115, -74, -9, -4, -252, -47, -53, -258, -5, 226, -95, -96, 34, 141, 207, 34, -59, -138, 176, 221, 121, -12, 40, -78, 45, 81, -79, 99, 33, -66, -83, -38, -85, 56, -6, 116, -43, 141, -89, -151, 150, -63, -117, -224, 7, 167, -54, -135, 79, -147, -50, 16, -80, -263, 205, -19, -55, -18, 16, 71, 283, 98, 138, 64, 27, -96, 44, -218, 20, 10, -69, 82, -56, 97, -90, 121, -26, 124, -49, -42, -54, 33, 46, -124, 36, 67, -255, 28, -21, 135, -129, -164, -52, 101, -376, 35, 59, 158, 32, 152, 110, 11, -328, 46, 59, -14, -61, 95, 33, 140, 59, 51, -129, 15, -159, 123, -104, -41, 16, -71, 100, 116, 87, 174, 123, 55, 120, -169, 17, -334, -9, 44, -132, 92, -17, 44, -154, -12, -106, 225, 34]
6394C4k69J76R4j03J22K4j59K17j99QK30K9N7m57J29J59l12L58r4J11L2k17j4
6417d4m6P3j89L15l3r1Q7r9QK36q9k14M1N9n9mJ66k9J13r6p4J16j36K52k90J29
6443A02j90L7m9L2oJ87M3j82J29q7k05J37k80L99j98M24k38k25L77k19k8K6n0
6466f4nK26j70J14j44N0R9J4j70O0n9J24Kl5k17M63k50N3J21k57O4j3K11j6l92
6491a91K21M2j51K12l8L2j18K5Q8n3J71k16J01P5o6p5p0j43j9L27j51k40K04K45
6515B12k97n8L58j96K64n54l8Q8O0J15R2j93J6O3M0j67K13l0L9LN9J8J82l27j17
6540a55L10l21M45k44k33r7L72j46N7m2j17P6J12p3L34k36J7j17k72L26k54J05
6562a53K83J33k07q0j94K37j12j2Q6Lj21q9J50J02j07J97r7o8J24j13J11jnJ13
$$ y = [34, -235, -59, 35, -68, 54, 78, -81, 136, -63, -55, 175, 204, 261, -196, -67, 92, -220, 138, 44, 155, 187, -30, -44, -90, -17, -206, 109, 76, -15, 72, -27, -19, 217, 128, -86, -45, 14, -45, -49, 117, 88, 201, 105, 31, 147, 11, 263, -27, 102, -88, -51, -100, -68, -74, 113, 156, -26, 103, 16, -189, -52, -332, 67, -131, 293, 55, -170, 207, -12, -40, -14, -64, -69, 157, -13, 101, -43, 7, 106, 120, -50, 10, -49, 75, 77, 42, -175, 288, 38, 91, 212, -45, 19, 6, 217, 201, -191, 30, 72, -79, 133, 95, 127, 9, 34, 122, 69, 240, 24, 125, 200, 134, 59, -11, -154, -173, 154, 3, -237, -33, 212, -85, -143, 215, 19, 283, -271, -309, -221, -161, -46, 46, -147, -131, -68, -28, -195, 18, -12, 27, 30, 89, 107, 289, -38, -155, 155, -166, 279, 35, -198, -295, 77, -69, -12, -54, -171, -95, 17, -56, 278, 42, 59, -58, -330, -4, -258, -153, 130, 263, 56, -24, -218, 19, -93, -105, -19, -16, -137, -226, -76, 26, -81, 116, 19, -49, 75, -38, 73, 72, 67, 180]
6586A80m5l3k58N9j6J15q1J09J23k43R6l2m5k89L52j5q3K02n1q8p1J09J22r4j44
6611a21J67k2MJ66k53j60K60l3j21N1L59l76n2K62j30l6nJ08n9q5J46J2J43j26
6635I9l66L57k26M1N1jJ61k08R9j39p5J68O4M1J06rk44j6J76J20k29k9K0K9p6
6660h6L11l71j0L64j82K68k7l06K04j25K04m74L08k89L45j21J17k48j1L13j02
6681H2p1J44l15j16P0K20k34J51j20R2k2J84j85oK09j62J01N0l1j2O0m7J45L3
6705B20q6j43j61K5K96l21MP7P4j65O3L92j95j58l1K48l86K79Q1q8l6L42l40J99
6729A90l11M7P6J5j41J7J67o4P6p2O0k99J92J10m8M3r5l0M1kK4J04P2l04K01j22
6755e3k48K26R9k70M77l94O5J33m6J69j62N7k12P8J77l0J88k43j9l7K90m12P9
$$ y = [180, 135, 102, -156, -97, -113, 2, -79, 30, 153, -90, 6, -26, -71, -360, -8, -23, -106, 96, 45, -43, -114, -5, 117, 23, -121, 46, 24, 28, 194, -59, -219, 41, 8, -113, -62, 297, -79, -131, 131, 1, -35, -40, 68, 9, -76, 70, 82, 225, 99, -267, 90, -136, -95, -44, -45, 116, -92, 7, -132, -207, -39, 25, 66, 172, 163, -81, -97, 79, 199, -30, -59, -39, -10, -86, 225, -146, -156, 208, 26, 294, 267, -39, 165, 40, 244, -230, 78, -211, 134, 13, 130, -118, -129, 184, 82, 11, 155, -160, -276, -206, 14, -220, -69, -189, -97, -119, 65, -120, -126, 83, -79, 22, 72, 41, 29, 89, 42, 187, 220, 134, -9, -170, -145, 151, -170, -166, -89, -15, -180, -117, 275, 80, -78, -109, 139, -247, 32, 113, 25, -11, 331, -9, 190, -121, -74, 2, 17, -124, -107, 60, -4, 72, 0, 60, -239, -47, 63, 15, 58, -37, -67, -26, -28, -4, 100, 172, -132, 69, -53, -301, -75, 24, -246, 231, -163, -98, 35, -11, 158, -4, 53, -159, -81, 96, 66, 254, 11, -8, -45, 245, -167, -88]
6778h8K6j12J59M3j29J83q3k33J73J44n6j20K3J48o2j34N8K7J6p0q2K14J04O2
6802B11Lj58n6NQ2j25J82j67l09M26k5o6M5k95J37lJ3L11j37P8m05L40r0k70L23
6827E0k71K39k9MJ72j33%K2J74k59j04J63L3M2o4k68J66J85q4l06J12J48Jn7L0
6852c4ook8J35j6j2k09P2K1J86j56M4q3L6J72r0o7j28K31J49q1n7j30J23j07j05
6878a46K16M6j34o5J65J26k90J29M8n7j86J01K57j91Mm3M9N5M6k01J38q1qK83
6902B61K4j34n5p3K9j40J96l78L28L6rj61J61j63P1j22J42J33j48j14pK08R6j44
6926C7j04O7j3nJ19k07K50j17N2k55L18m4j93K86k44k53K99P3j09J93k67K36j94
6949g5q5L24k52r1J87K66m04L38q3j83K02k15J8j90L14N4l23RK36k3K2J27j85
$$ y = [-88, -62, -174, -15, 28, -101, 82, -1, -234, -61, 83, 27, -93, -70, 78, 16, -118, -60, -33, -17, -87, -169, 45, 149, 211, 214, 56, 0, 5, 87, -38, 144, -23, -332, 94, 69, 3, 48, -247, -110, -113, -100, 211, 74, 152, -253, 87, -3, -273, 50, -221, 18, -11, -7, 165, 32, 32, 54, 228, -31, -135, 28, 61, 103, 39, -229, -63, 122, 38, -268, -156, -8, -7, -64, -34, -40, -46, -74, 61, 45, 33, -176, -104, -83, 103, -53, -9, -92, -56, 116, 26, -41, -169, 62, 211, 130, 73, -57, 66, -41, -146, 70, 116, -18, -83, 82, 208, -82, 47, 95, 38, -148, -47, 210, 19, 23, -20, 29, 84, 130, -71, 67, -14, -22, 261, 285, 151, 96, 23, 52, -88, 108, -270, 58, 94, 85, -76, 85, -78, -7, -129, 13, 146, -2, -116, -123, 85, 181, 37, -67, 0, -13, -18, 101, -106, 144, 27, 79, -176, 142, 98, -95, 191, -53, -306, -7, 66, -43, 150, -117, 119, -75, -160, 164, -88, -179, 8, 274, -130, 208, 125, -58, 144, -71, -53, -243, 71, 125, -198, -189, 47, 24, 46, 173, -12]
6972a2m3R6j86K44k17j30K21Q5j03J8Q6J04j53j38j91J52o0K91J84m61J82j09
6994a40L02k22m5o9J14J64O5j99p2Mo9K06P7k3J47j80J87n48K94k78j5K55J10
7017F5R8k53J5j12K02p8rN7N0m0M4j41J91k39K48j47n2J12L8o5m39K91J13n4J21
7042A6J3J38k60K59j65K0O5k08K58k13j16K53j97K68k04j85M16k6n3j27J95j89
7064d2j40J31o8J01k25L75l4k7J69l16j9J55n3NJ03k97J26n5jL60l50K61l18m
7088a63J23p9J20M2J21l23M6M3J06n0J9O2j67RR8j3k82J35J43J22j94L71k49j76
7112a36K9K69o7L3j60j35J66N3K26j93RQ7k44OR3K17m00R3M2o6Q8K9j33PJ22R2
7138A27j45j02Kj59J45J25j10J14Q4l11L86j92N5J45j40j83L72k49j50J63q4K3
$$ y = [-12, -55, 41, -145, 99, -118, -248, -27, 58, -45, -27, 59, 163, 10, -128, -319, -167, -227, 64, 248, -213, -31, -140, 162, -60, -105, -174, -60, 104, 169, -30, -102, -98, -167, 39, 116, 93, 240, 60, 247, -301, -7, -285, -300, -45, 65, 163, -90, -75, -187, 15, -63, -72, -15, 35, -5, 39, -102, 89, -150, 98, -49, -101, 11, 49, -16, -455, -164, -51, -105, 16, 29, 167, -93, 166, 1, 21, 86, -122, 136, -77, -193, 60, -137, 131, -73, -258, 158, 132, 79, -48, 147, -42, -182, -51, -119, -18, -243, 132, 98, 71, 240, -76, -95, 60, 7, 12, 115, -182, -56, -111, -112, 248, -102, 159, -159, -163, -40, -119, 1, 43, 164, -159, -113, -70, 36, -14, 5, 67, -100, -91, 7, -6, -288, -153, -10, 112, -82, 289, 40, -136, -107, 162, 95, 128, -32, -167, -1, 52, 278, 85, 94, 181, -63, -57, 36, 253, -147, -54, -12, -78, 10, 39, -94, -87, 35, 127, -18, -120, -118, -277, -132, -7, -117, -3, 81, -230, 156, -36, 19, 164, 24, -159, 213, -36, -186, -23, -107, -84]
7160h4L1K71k71J13J2J17k30K65j85l77K89R3k2l6Mm7J55L4k01N7p9R3l00J17
7184a81O9M0K28l82L69k61K56j96N7K4j56K34j9j66j21J33J22k4j02o5P9jN0j08
7208a21K70P1k32m5M4k45K81m4J52j86kq1O1K43j1k21j01K56k6J97n08J83k11
7231b76L12J4n9N8J38j13j03o0R6j67J67j94P8P7K57k12j4j10R5K09k44o7k9J74
7255B7J60j97l9k4L6J54j67M3Ok89L94O0k35m4K1J50k06K5K11k9m7q1j24K8J24
7280d3Pj56o0L44rm8l55L95k37O4J98m05M17k16J57Pk5Q0k46P3K45j32P3j2k73
7305a57m9L75j8j93J31k52J46J00j95N9j3K39n6k69K0J52J9q1L9Q8o4K8l02J75
7329g8K46P3j93%j7j0l5j2q0J99j09l46L47r0J26n2l2n1K07J4lp3k87K78j05l1
$$ y = [-84, -53, 218, -53, 60, 72, 189, -41, 224, 39, -338, -49, 44, 22, -14, -10, -57, 98, 132, -69, -12, -91, 2, -298, -181, -112, -72, 156, -226, 143, -118, 138, -58, -1, 23, -133, 101, 82, -84, -205, -72, 50, 26, -76, -141, -62, -63, -13, -121, 149, 220, -12, -57, -13, -258, 23, -21, 131, -55, -57, -138, -77, 166, 155, -66, -167, 89, 63, 260, -248, -65, -276, 36, 50, -9, 49, 187, 74, -29, -89, 7, -160, 7, -187, -109, -32, 225, 13, -1, -111, -16, 193, -51, -118, -147, 27, 187, -10, -49, -73, -37, 117, -50, -7, -1, -290, 104, 164, -71, -115, -94, 56, -150, -125, 86, 57, 10, -71, -195, -167, -43, -36, -192, -252, 92, 83, 35, -320, 75, -162, -98, 100, -305, 112, -104, 53, 60, 35, 115, -131, -58, 187, 55, 128, 116, -157, -206, 169, 151, -42, 89, -163, -17, 83, -112, -53, -66, 173, 117, -152, -132, 20, 39, -42, -3, 85, 21, 49, -253, -78, 168, 241, 48, 48, 31, 21, -14, -26, -106, 93, -16, -362, -15, -105, 21, -31, -63, -114, 93, 107, 104, 31, -256, 22, -83, -114]
7355a14L33j41l58Q6K42j68J57j75O1k2l4K51R6j53k6j39J37K9j36J71RJ9k36
7378a11M3J39k5n1k47N35n24L17j4q4j26J93j2m58O16j70N7J06k18k1p6ML72k00
7402D5j76P4K44m61J1K27K44p0j33j17K11r7J6j22%J45M2nJ92j73p8k7K9OJ0K2
7428E9j17J33m7j5L45n27P5K02p5J45j62j89L34k11l5Q2j91L19l70L10j50M3R9
7451E7N4k78M38k68r2K3k9j92L85qk75L03J6M1m37L04L3j41L2J96j18O5l18L03
7475I4j26r9P3Q8K70j67k20K3M7k0J02l07L67r4n9J09j0o0j85R4j9MjK25k25K58
7501A62j83J15Lj67O1m2K9J13j96J05k40L69l14K18j07j7P5J2j6j0J81k46K59
7524A64k23q2K85j68j67J85J17J0j20J80m58K31K1J06j97K2J59l26N0K79j31Q2
$$ y = [-114, 219, 78, -280, -194, 48, -120, 37, -138, -77, -99, -133, 118, 214, 61, 35, -104, 33, 62, -74, 97, 106, 125, -111, -68, 71, 46, -5, -252, 283, -241, 76, 62, -22, -148, 45, 33, -425, 191, 21, 78, 184, -34, -55, -131, -127, 245, 45, -131, -57, 187, -274, -263, -36, 208, 138, 5, -112, 99, 2, 18, -104, -104, 41, 83, 78, 270, 97, 19, -8, 21, 27, 37, 59, -58, 75, 28, 13, 358, -169, -94, 108, 33, 178, 16, -173, 161, -50, -85, -3, -194, 125, -245, 65, -85, -42, 57, 111, -167, 271, 3, -89, -66, -95, -287, 98, 90, -185, 118, 134, 175, -262, 42, 75, -66, -34, 162, 44, 109, -209, 94, -32, -131, -58, 30, 300, 133, -87, -64, -17, -37, 65, -242, 125, 31, -28, 81, 71, 11, -174, -80, -99, -95, -96, 129, -96, 162, -21, 94, 97, -70, -9, -51, -22, 91, -105, 0, -240, 129, -185, 33, -74, -91, -16, -4, -20, -30, 151, -95, 164, -59, -141, 144, -24, -191, -6, 111, 121, 1, 181, -277, -46, -25, 81, -116, -94, 65, -261, -211, 68, -63, 19]
7546A9k54L90Mj82RJ9P6J48r9r3o9k29L48l17P1KJ88q7L14k11M5n7J62l56K5K27
7572I3J4q2L1j89L37Q6m53J78o3K0M4p7R9m0J06Q1k27j8j4j08J13J61j67J14j23
7597h4J98k54J65j52K60k17J17j45J01j60K44Lj19J12k08K22Q5k7j04k21K61r4
7619a7M2k75J40NJ4Q8j41L95l44L1J13n7k38K45K7q4J35LJ41l85j74L66O3j17
7643b4O3q5O5J1J06j43k46J23LJ75j07J11J21jo3Mj03k0j66L68j89n8J75j46R5
7668F9j30J48J1k09K73k66R7J57l64L01o7K3J39k48K87n6j02k27M42k44n1n5o4
7691a36K83o2j06K08j90k16K65j16j6J06L8M5q5j82J57o1k4Q7j04J64k31L59j59
7714B4Q4l4k08P6L5K32l20K07l42K67J41k08K56l05P6j83K28mR3p8J60l17J43
$$ y = [19, -235, 155, 159, -23, -14, 5, 81, 229, 130, 37, -32, -261, 87, -230, -159, -157, 31, -56, 258, 47, 92, 35, 197, -159, -134, 93, 107, 25, 56, -133, 204, 290, -163, 15, -48, -28, 16, -61, 38, -2, 104, 185, -42, -60, -74, -182, -69, 92, -75, 39, -84, 114, -140, 25, -127, 133, -84, 33, -112, -11, -171, 73, 76, -43, 69, -139, 83, 168, 141, 37, -184, 77, -17, 25, -250, -110, -105, -91, -3, -144, 251, -93, -62, 51, -6, -244, 1, 28, -56, 79, 82, 223, -162, -336, 30, 93, -24, 39, -46, 19, 30, 136, -7, -253, -130, -127, 48, -59, 52, 173, 172, 109, 113, 10, -10, -176, 192, 3, -55, 120, -26, 69, -61, 87, 98, -111, 162, -104, -7, 150, -214, 87, 20, 43, 182, -66, 221, 165, 63, -164, 278, 34, -17, -72, -136, 147, 85, -21, 187, -3, -219, 46, -70, -86, 20, 58, 103, 18, -164, -7, -68, -92, -5, -109, 55, -176, 183, 24, 108, 74, -134, -58, -23, 209, -111, 96, -246, 21, 162, -46, 210, -95, -19, -202, 26, 22, 115, 37, 197, -120, 23]
7737B3j16m3J25m7J48j68N4R8O9N3k34j20R9Q7P3j69J26j17j47J17O7L58l76N5
7761A5KP0j44P7P0k6l90L23j01lj1J20J66o5j83J28M5J08k68QR4p8J80l91L88
7786A34k91j7J35n8J67j78P1J23j62J08O4q3Q2j90J79j81RJ20k40K16m1jr9k9
7810a62J36k8J18j56l7J34J76j60J44k26j74J60m1J94k16J68k61M03p4k31L10
7831A77o2O4J47l66m1o0K75k91N0K33j39J39n8k52J48J22q5j72L53j92l8M6j01
7854a03J84p0M8k64L58m3Q6r6j48q7L09rk00J40o9k13N7J33p7j31K41O5j3j97
7878i9lP4p1J50j09m8j8p0k5J23K89k01M8k6j9p1N8K86k94J15j42mj14JK49P6
7904A55j13j34R6o8K09q5j41L3N0lJ08j79K03l03K86jl16K54r7J16j03K84m33
$$ y = [23, -93, -136, -11, -58, 90, -78, -24, 74, 143, 196, -38, -158, -59, 28, 101, -68, 58, -59, -206, -89, -22, 336, -40, 15, 17, 87, -57, 20, 90, 64, -326, -3, -104, -107, -118, 2, 168, 103, -80, 48, 93, 201, -67, -59, 35, -43, 137, -254, 134, -157, -174, -39, -97, 70, -108, -37, 86, -76, 32, 96, 13, 95, -95, 84, -97, -88, 32, -208, 8, -33, -34, -133, -162, -26, -54, 64, -92, -129, 5, 181, 21, 165, -61, -235, -75, -116, 78, -138, 30, -231, 172, 98, -133, 177, 115, 179, 326, -40, -81, -141, 134, -157, -107, 126, -13, 126, 68, -184, -36, 86, 1, -171, 182, -10, -48, -2, -103, 81, 11, 59, -205, 153, 110, 196, 100, -48, -135, 174, 165, -35, 105, 36, -177, -120, 13, -64, -195, 46, 111, 98, -99, -102, -28, -99, 51, -58, -106, -124, -194, -219, -96, 193, -8, 40, 14, -5, -76, -18, 268, -26, 89, -53, -57, -171, -170, 79, 155, 42, -92, 4, -64, 145, 60, -81, -48, 2, -1, 107, -72, 131, -172, 114, 113, -203, 51, -46, 70, -33, 251, -182]
7927a82P3j95L33j71P4K63j76j41l4j6K7J68j69j19M08j20j60J55N2j2j11Lm4
7950i4j0L3n9R8K07m7n43M24qK1J2J87k95K43M1l55oL22j44k57J75O4N1m24L65
7975Ak70J77J54j43M7J08j53M6Oj9J76l17N3j96K83K58o9j81k33J79K81k39K20
7998A69m0k20n2R3P7O5M4J00k12J9k68K6J02K13m5k24K12o7Q5j86r0J45j78L25
8022I3K05j13k91J53m6q0R3j85J92J84k56K8K6J30l81J85K08k59J2J57n8ql3J42
8046I8j12l2M3mj43J08j72J02lP1K08m6l0pj55p7P4K24l12O8J05Q0j25m9p1J7
8072a40J98m6N6j99J94k28J47L28q0j82j52O6O2k03J57qN8p1K7j81L73l30K08
8095E4o7K8r8%K9P0j89MK22M3r2k1K88l01p4K59k6k12qn2L33l40L57p1l19N3R8
$$ y = [-182, -109, -304, 29, -142, -68, 195, 19, -122, -156, -172, -145, 23, -146, -265, 143, 23, -137, 18, 70, 58, -53, -50, -94, -104, -71, -130, -32, 175, 128, -415, 9, 1, 22, 34, 221, -74, 169, 210, -145, -151, 171, 27, -230, -55, 9, 60, -364, 1, -269, -92, 62, -81, -34, 74, -79, -33, -27, -46, 130, -187, -134, -330, -47, 211, 142, -39, -272, -93, 188, -51, 169, 129, -91, -143, -50, 27, 92, 136, 236, 24, 43, -225, -199, -97, 116, 71, -153, 59, -8, 77, -109, -199, -54, -232, 93, 298, 185, -106, 47, 1, -79, 14, -171, 21, 205, -51, -23, 3, 133, -248, -63, 145, -114, -102, 55, -3, -11, -44, 98, -14, -46, -3, -7, -150, -42, -214, -112, -115, -44, 164, 118, 88, 81, -74, -151, -77, 147, -165, -97, 8, 88, -37, -86, -157, -140, 58, 12, 68, -131, 63, -165, -18, 310, 230, 48, -104, -38, 24, -179, -22, -30, 28, -43, -16, -197, 176, -154, 54, -13, 15, -83, -83, -54, 16, -173, -169, 53, 96, 4, -17, 271, -30, -104, 155, 129, -83, -91, -143, 190, -150, 207, 136, -183, -130, -32]
8122c2J04N3r2l5j31K03q4Lk03P7J36K5k37J21K19k4o5l1P1k26k9K46k55L93k14
8147gJ8J68k42L32k13L6J8j16M5j61Q0J96k25L5K5P0j23K35j4oj32m1J0j0J60
8172A38m90L25P9l4R9k32K05j94L01j83R0n9k43L00j96O7n5K96k47
$$ y = [-32, 72, 125, 33, -2, -133, 70, -14, -11, -214, -137, -1, 24, -213, -92, 127, 103, 38, 7, 78, -148, -177, 69, -186, 207, -7, 11, 179, -63, 269, 56, 92, 110, -6, 39, -122, -42, 154, -71, -36, -11, 59, -64, 171, 157, 151, 19, -22, -12, -22, 138, -352, -27, 52, 18, 117, -115, 90, -104, 197, 14, 104, 45, -198, 102, -94, -27, -82, 214, -33]
8191c3
$$ Imaginary data points
##PAGE= N=2
##DATA TABLE= (X++(I..I)), XYDATA
0@%%%%%%%%qJ6j6J6k4L9m7N6p2R1j15J39j66K03k43K83l33L92m57N32o16P08q11
31d33R30j064J208j365J542j739J953k187K446k728L034l371L740m142M581n060
47b655N583o156O784p474Q234r070R998j1034J2194j3501J4986j6697J8686k1032
61a1154K3851k7317L1697l7430M5318n6950P6083j15053L35013n33932P6925P89846
73E96897m54596L5345r0775m06161M09569L14919n82662q0552J25560J81338K16901
84B65783l73269l25473N97412J82637m63858J4719J45000q2238J43587J8255l58067
95b35512K4830L91004q8553k66636M6986J95876O4541n8303j01366J17898O6219
106A56984j08929J29448n5474k64502K29243J61952l99222M1694K54726k26837
$$ y = [0, 0, 0, 0, 0, 0, 0, 0, 0, -8, 8, -8, 8, -16, 23, -24, 32, -40, 51, -64, 75, -91, 112, -131, 152, -181, 211, -246, 286, -330, 378, -433, 497, -567, 641, -724, 818, -921, 1032, -1155, 1291, -1437, 1597, -1774, 1966, -2176, 2405, -2655, 2928, -3228, 3556, -3918, 4316, -4754, 5244, -5790, 6404, -7097, 7889, -8808, 9878, -11154, 12697, -14620, 17077, -20353, 24965, -31985, 44098, -70955, 264058, -269874, -192949, 596897, 142301, 177646, 86871, -319290, 90279, 405198, -177464, -258016, -132456, 48882, 265783, -107486, -432959, 164453, 347090, -116768, -102049, 42951, -39287, 104300, 122555, -235512, -210682, 180322, 91769, -174867, -127881, 67995, 132536, 74233, -27133, 90765, 156984, 48055, 177503, 122029, -142473, 86770, 248722, -150500, -108806, 145920, -80917]
116h0917L2919J54687j60380J9274J32186n0926M9501r0215p5287K59480j16172
127G4150k28936K14836N833j95754J95407P243k25765J85037J52231j46748n8068
138b0534J25587P2059m4249q2712L1070N7195o9839K847k419q9569J7378J29667
150A26481q2206j52542J36588J25182j24463q3470J14876Q965n4930P297l9882
161a8104m7042K8204N0768q3279j02538P1261J42464j07054j16816J50855N2927
172B1646p1119L3922J2006p0667Q1395N8667j10237o3457O3521Q8817o6503r9188
184a21197N4083R7263m0606j2919L8119n0799M3734R9669o5069j30328Q1615J02036
196I5601q4582r0911K3973M7598r448P201l5085l4990N9225R5011l9763j18695
$$ y = [-80917, -47998, 106689, -53691, -34417, 97769, 46843, 96344, 6129, -69158, 190322, 74150, -154786, 60050, 65883, -129871, 65536, 72779, -152986, 32051, 184282, 37534, -20534, 105053, 177112, 132863, 50151, 81221, 138416, 68577, 71424, 69005, -20564, -3186, 126481, 44275, -108267, 28321, 153503, 29040, -54430, 60446, 69411, 14481, 21778, -18104, -65146, -36942, 13826, -69453, -171991, -100730, 41734, -65320, -182136, -31281, 21646, -49473, -15551, -3545, -74212, 7183, 65850, -44387, -107844, -44323, 44494, -22009, -121197, -67114, 30149, -10457, -23376, 14743, -36056, 7678, 107347, 42278, -88050, -6435, 95601, 11019, -79892, -55919, -8321, -17769, -10568, -45653, -80643, -21418, 73593, 33830, -84865]
208h4865N5246J27277k5896j22960J4428N7228p12n9m1341n8508M8115J20947
220H8900n7099j18420N2585J33960j1651j01756k26M9196L2222j7866m7224o0276
232e7655L3435R2512m1921j23526J4817J40781j3197r3389K788N1234K3407R525
244C8811l5398p0310M7594P2546l3929j05932J139J00862J3036q1281k4251O5895
256a1218K0339J2156j3930n0617K0357R0443j1737j14002Q889Q0265Q321o6198
268b6932k6023K4407L3838J9012l1717l1765J1676P9078R292q6227k2043Q4639
280C7235K5161p3167j9639Q993K1442K1132j9902n6933J4082P8088L160o0622
292b0970k7705O9545L8600m2200m2138J2011K8784J0362j0481o0382q17O6738
$$ y = [-84865, -29619, 97658, 71762, -51198, -36770, 20458, 19746, 19687, -21654, -80162, -32047, 88900, 31801, -86619, -34034, 99926, 88275, -13481, -13707, 35489, 67711, 49845, 2621, -57655, -24220, 68292, 26371, -97155, -82338, 58443, 45246, -48143, -45355, 5879, 29286, 38811, 3413, -66897, -19303, 53243, 19314, -86618, -85479, 15383, 28419, -52862, -77113, -11218, 9121, 21277, 7347, -43270, -22913, 67530, 55793, -58209, -49320, 30945, 39266, -26932, -52955, -28548, 5290, 24302, -7415, -39180, -27504, 51574, 60866, -25361, -47404, 37235, 62396, -10771, -30410, -21417, 25, 21157, 1255, -55678, -41596, 36492, 39652, -20970, -48675, 20870, 59470, 17270, -24868, -12857, 15927, 26289, 15808, -44574, -45391, 21347]
304B1347K0704p1190k8352O3674L7106k0970m2578M501L0999L2994k3508n2334
316b7607l80M9946K9071o2749m2144M4281N6365k7685m0459L731K5387M1558j5050
329C4265n0377q085N8934J8659m8168m3168K1726N7332j7070m7814j1790L7358
341A802K7284p819m0317j6453N4068K6722l6895m9508K3700M6016k410m7461k2971
354d4242L6682K6225p278m2204q067L6829L5137k5207m9294J5869M8645R757n2707
367a9855j8348K7847L0612q551l8544j1786K8229L8125k3466l9851P09N0172J7759
380C3052m6000k4001K7550L3614j3569k2558k0214K1254L7984j2789m0811n762
392c2250M6433J8414k9803l5555K7593L3426j0258j6405j7907R394L3172Q327
$$ y = [21347, 42051, -29139, -57491, 6183, 43289, 22319, -20259, -15758, 15241, 48235, 24727, -27607, -27987, 21959, 51030, -11719, -53863, -9582, 46783, 19098, -21361, -17630, 7757, 49315, 34265, -16112, -24197, 34737, 53396, 5228, -37940, -16214, 41118, 24048, -23766, -35556, 1802, 29086, 21267, -19050, -35503, 18565, 45287, 8392, -41116, -17416, 28600, 26190, -21271, -44242, -7560, 18665, 11387, -30817, -38884, -2055, 33082, 7875, -41419, -25550, 23095, 32852, -19855, -38203, -10356, 20256, 11705, -26839, -38625, -10396, 27729, 4263, -35588, -34879, 15293, 33052, -12948, -36949, -9399, 24215, 10646, -11912, -32126, -10872, 27112, 14323, -26488, -32250, 14183, 32597, 2794, -32761, -5168, 28258, 18000, 1595, -16312, -6918, 26254, 34581]
404C4581n0189j2010M0472K4376k5432m0735J9504L1492O72k4147j3818j594L2963
417A6135J8016m9420k3626L5615L7883l0789l9221R339L4825M601k3847j7353
429b7842p974L9373J6557m2669l3615L5860M0823k4329m2937L742M4287k422j7034
442a8180j5416j1969L3798K7878m4191l7433M3017K8054j1888l7017m543M4761
454c129O370k3519l859k744O829M6952k9888n1499M2453L5144k2542k1074J439
467a9067J1307K7016j2841j7393K928N199L1384m64m7411k41N9880j1778m0337
480a1818Q486Q059K700J4491j0288m1470K4528M2367j5214l8313k104L6993K1363
493C9780l1715l7635L5695J6264j2738K869l4063r323P2108j431q8215K4691N6886
$$ y = [34581, -15608, -27618, 12854, 37230, 11798, -28937, -9433, 22059, 22731, -1416, -15234, -16828, 16135, 34151, -15269, -38895, -3280, 34603, 3814, -35407, -26068, 8757, 13358, -10489, -27842, -35816, 3557, 20114, -22555, -56170, -20310, 20513, -3816, -46753, -43011, 1276, -1146, -18180, -33596, -45565, -11767, 16111, -28080, -65513, -22496, 5558, -6330, -43347, -47890, -3129, 3241, -20278, -24137, -26881, -20052, 26900, -2988, -54487, -12034, 23110, 568, -20506, -19067, -7760, 19256, 6415, -10978, -8050, -2851, 28533, 28069, -19342, -19583, 40297, 28519, -11818, -3332, 4727, 7427, 21918, 11630, -29840, -5312, 37055, 21841, -16472, -18576, 18417, 39780, 8065, -29570, 6125, 22389, 9651, 12520, -21543, -30866, 41242, 39811, -48404, -23713, 33173]
506C3173o963k0038k6744O886N0875m725n0618K312P628L1999J3150p8817j3082
519e4964R2829M32p8598J0332K9536J3532R254l8474k6751M7160L5450m0126l6709
532c7097K557N5605J8583p2397j9348P1020J3446l9604O905j1773J4336N4172
544E6405l0395n8424L7529M7941k0538k9901j8689L7551K9346m1253j2545K1700
556A8727o959J8842J9422o2358N956O4132k3335l8900J3140O383o5N948k3093
569b160j481K924L653K2402k1756l4037M0057L2477m8573nK3822k0300J0214K4343
583C1580m0062k3102M9182P073k6737j6986N508L5470N208m1642L415K8890j6273
596A524K2947p218o2371M0270N9812o6131l5700M6527j728M983m270l8807K2848
$$ y = [33173, 26210, 6172, -20572, -13686, 37189, 32464, -18154, -15842, -8214, 23785, 36935, -41882, -54964, 37865, 38297, -40301, -29969, -433, 13099, 22353, -16121, -42872, 4288, 39738, -388, -37097, -34540, 21065, 39648, -32749, -52097, 18923, 32369, -7235, -330, -12103, 2233, 56405, 26010, -32414, 5115, 53056, 32518, 2617, -16072, 21479, 50825, 9572, -2973, 18727, 11768, 30610, 50032, -12326, -6370, 57762, 34427, -4473, 8667, 15050, 14985, 20933, -2160, -3641, -717, 2936, 25338, 3582, -30455, 9602, 42079, -6494, -6499, 17323, -2977, 7237, 31580, -8482, -31584, 17598, 24671, -2066, -19052, -13544, 21926, 27134, -14508, -11093, 17797, 1524, 24471, 17253, -45118, -4848, 54964, -11167, -46867, -340, -2068, 2915, -1355, -40162, -17314]
609a7314L6986j8857j0966r931o246O2305j6125p5599L8823M6488l8347n387R921
622d249k5384L5875K3794m3008j1496L4486J8406r413k5435o873M2783p00l6507
635g721N698R843j0481J8300J795m8370K3064M5636l1346k7672K6222O964m651
648G281L878k1934L635J4438m561m998j2231r760L3653O763m9134J6637L4339
661A8006j8481n202J2393j5815P723K4988k3346j6490J1193J7009k592k2827p038
674b0479K7676P318k5362N872N526k362J5027L58l0584N182L5156j4088k7968
687a8728J670J9741J390j0689r771K038J3972M948k275j7968K060K7491N975l4590
701a4736n454L1632j285j4799n093J40M750J6473p706k2721R722K3294M243k4052
$$ y = [-17314, 19672, 815, -10151, -20082, -26328, 35977, 19852, -55747, -16924, 29564, -8783, -14170, -4249, -29633, 6242, 30036, -12972, -24468, 10018, 28424, 19011, -6424, -13297, 29486, 28786, -7721, -2023, 7820, -2661, 15639, 17434, -30936, -7872, 37764, 6418, -21254, 4968, 11932, 7281, 11159, -10775, -7140, 7298, 2737, -2261, -14492, -24252, 9401, 16164, -32970, -16333, 18006, -475, -5677, 6716, -9099, -1376, 23612, 266, -16224, -5031, 11978, 9386, -13441, -20479, 7197, 14515, -10847, -4975, 551, -1811, 13216, 13574, -17010, -11828, 23328, 9240, -18728, -17058, 2683, 4073, -6616, -16387, -14349, -377, 4571, 2296, -15672, -13612, 13879, 19854, -14736, -20190, 11442, 10157, -4642, -9735, -9595, -4845, 11628, 3922, -18799, -9077, 14217, 18460, -5592]
715e592p258K0082J5163j8018j3203P982N11Q570J62k1635o685L2751M149k8201
729a1222j299J6151J0363o479r024n402J0719O589l075j2182j2316K0056J5044
742A7923k1945j7708K3241R543r516J08o089J085J4913M603k1804n822J5616J1057
756A5205j1871k0705J0464J5514k990j2093J305j62R214J2795j7120j5692J8295
769B159K0139k0284j4944P861J0874P02r783p585J471J4379K995r671j4819J1319
783e187K4305j2708k3208R467J8063q740m134n995n386J4185Q154j5558j2948
796a9690J4632J4960k807k1186L299K0967k049r240k752k78M248J4356j2796j7192
810a5528J2244J7722n204j8756M352J3555M385q494l622j457N732J2018j0228
$$ y = [-5592, -12850, 7232, 22395, 4377, -8826, -844, -333, 8237, 8399, -13236, -19921, 12830, 16979, -11222, -12521, 3630, 13993, 7514, -1510, -6912, 3807, 10396, 7321, -4861, -17177, 2879, 17923, -4022, -21730, 1511, 11054, 1538, 1646, -4443, -3358, 11555, 16158, -5646, -11468, 4148, 15205, 3334, -17371, -6907, 8607, 5617, -6476, -5171, -5333, 3881, 16676, -444, -16136, 2159, 22298, 2014, -12930, -5069, 5805, 6507, -3276, -10861, -9390, 4989, 7984, -1687, -16506, -5187, 19118, 6410, -16798, -7331, 10732, 1992, -2142, -8137, -13523, 662, 8816, -6742, -19690, -5058, 9902, 7095, -14091, -10792, 10175, 8126, -1114, -3866, -4144, 104, 14460, 1664, -15528, -3284, 14438, 9234, -9522, -5170, 8385, 12770, 4276, 654, -803, 4929, 16947, 6719]
823F719j5999L610K0553l992j9911j134J5703K255q449m3p026O547J3903o640
837F096j8990M935J8868j667j6119p219J6702L845q195k073k860K121J3819j77
851I086k1889M666J8657J223j6464n870J2820M732n836o498n81j455J3347j26
865E812j9399l05J8445M925j8285m538J0970P105p904k737k253k705J4204P27
879D062j6876l756J9821M868j3763p117J0866J0554q635l29j388k510J0625P068
893A3490j8185o065K0476L135j1339q819R490P953n115l833k72k543N785J0638
907A4796j7240r095J6255P921j4383q598R577M361k742l622J45n319Q464Q716
921I236j3414q656J1809J1618j1241r548O370R286o023j164K829j0281Q507J3387
$$ y = [6719, -9280, -5670, 14883, 10891, -9020, -10154, 5549, 7804, -645, -688, -7714, -1167, 12736, 6096, -12894, -7959, 10909, 9242, -6877, -14096, 2606, 6451, -1744, -3817, -6677, -4556, 9263, 9086, -12803, -8137, 10520, 11743, -4721, -10591, 2229, 6961, 1125, -5373, -5954, -7409, 5938, 5812, -13587, -13892, 4553, 9478, -8807, -13345, -2375, 4730, -3174, -5911, -8164, -10869, 3335, 4062, -12814, -16570, 3251, 8119, -5644, -12761, -1895, 8659, 24, -305, -1693, -4203, 6422, 13490, -4695, -10760, 9716, 12851, 1512, -7307, 2183, 10136, 5021, 1188, 916, -1627, 4158, 14796, -2444, -11539, 4716, 12637, -1746, -10344, -767, 3594, 852, -2770, -2625, -7944, 520, 9236, -4178, -12834, -1025, 10593, -648, -10196, -3826, 5460, -563, -1727, 1102, -9179, -672, 12715]
935A2715j3851j3454J6731P827r153o013m92R654k93n004q19m171J024J6368q667
950B402k2382J7032J4599j2313r576N937L277L460j24q502k147P241J2076r973
964A007j5289R165J8556o617j7588O677J1233j003l847j60r163Q683J7592j6833
978B413j5892J5692J3242j0542q250k379J1534N536j2257n36l23R7J2868l872
992G331k4639J4269J9898j8274p064O847J443K916J89r529K035N248K513J110
1006D293j4070K097J6993m434j5216Q867N165p311N845J00q958K138J2960o421
1020B048q943L590N883J217n659k323L099K771l258N027n288r571J6860M405j8944
1035i086J087J4789p496K77J963r104P126O636n168m909m03M039J1858j2364j2335
$$ y = [12715, -1136, -14590, 2141, 9968, 815, -5198, -5690, 3964, 3671, -1333, -2152, -6323, -5299, 11069, 2402, -19980, -2948, 11651, -662, -10238, -4301, -1024, 2436, 2312, -6190, -8337, -1096, 10980, 1007, -14282, -5117, 13439, 6822, -10766, -4089, 7144, 6141, 2294, 2134, -7029, 1654, 19246, 2413, -13479, 2213, 15455, 4913, -3337, -5716, 5818, 11354, -903, -1439, -1762, -1665, 11203, 7331, -17308, -3039, 16859, -1415, -8479, -1632, -189, 2727, 2916, -6613, -4578, 670, 3183, 4293, -9777, -7680, 9313, 4879, -10337, -1470, 3695, -3616, 2229, 2329, -6629, -4491, 8469, 2048, -6895, -3305, 2578, 3795, -1864, -4187, -1088, 1683, -1575, 3452, -1836, -11407, 5453, 9858, -9086, -7999, 6790, -706, -429, 1534, -7570, -444, 6192, 1024, -3885, -4288, -249, 11609, -755, -13090]
1050a3090J8006L279j0832K790M21o372J3592N33j7162L918J1793J56r040m028
1064f036M567J0406n757r586N556K343M79L042p742q598J8018M214j8811M54J0810
1079C359l1k635k299n252Q891L449o452k350k079P089P231j1724r207J6604K397
1094F991j0492J432M19J46N834q72j0268L154P761R30p024m762P968M933n724
1109D26n166N094L61L68K827o256l183Q549M821j1688m22O297Q69j806k043p80
1125a732J742K533j196m46n661M264Q012p650n694P289J473l924L354m237j733
1140c606O461J16l859l140K432N797o09r326L848N287l380J140j716l789M376
1155C2O818q239m296M866N106j250o702P29M200K683l709k025j506L632N397n599
$$ y = [-13090, 4916, 8195, -2637, 153, 574, -5798, 7794, 8327, -8835, -4917, 6876, 7032, -2008, -6036, -1469, 8937, 3180, -6406, -850, 1493, 1972, 5014, -2728, -11326, 6692, 10906, -7905, -7451, 3359, 3328, 693, -1606, -6858, 2033, 5482, -970, -3320, -5399, 1690, 8921, -2803, -12010, 4594, 6991, -3501, -2069, -1650, -1504, 4330, 3458, -6810, -3656, 4105, 5035, -1989, -6751, 1217, 6150, 426, -4740, 354, 715, 1083, 3910, -2346, -5529, 3020, 7841, -3847, -4269, 2028, 2897, 1091, -952, -1732, 10, 2543, 1347, 901, -4760, -496, 7516, -134, -5828, 1461, 2934, -990, 2364, -1873, -3606, 2855, 2971, -888, -4028, -1596, 4201, 3592, -5734, -1886, 3401, 21, 1161, -555, -4344, 32, 6850, -1389, -5685, -819, 4287, 3037, -3665, -2936, 1264, 3947, 238, -1787, -3293, 339, 5736, 137]
1171A37n886L139R168m306o205J772L394J544m81m406k145P466J219m405m311
1186d306K284O565j159o613p39O767j141j63k350l270N297M649n808n227N256
1201D2K253N96m462k431L883L154j694l861l32K085N324l292o102K494N636l69
1217B924n171j94L39M843J59n887j917N297L726l934l558l11O305J425n382k804
1233d140L475L896r22l645m201O050M429m552n066K385M775K32k237m950L136
1248a335N654j104n520o69M272K129j456o178K010M883K34m194j313J422L090
1263A925K164o500o62N059J686l656j233m24J890L116m087k821K060L126o34k376
1279a367j880K418M176l132j995P14J325J040J96l904j083N580l33l510j165K372
$$ y = [137, -5749, -2610, 6558, 2252, -3953, -2181, 1213, 2757, 2276, -2130, -4275, 3191, 4410, 5, -4306, -2022, 4543, 3384, -3229, -3968, 2799, 1658, 1495, -855, -4125, 1172, 5821, 13, -5214, 42, 2295, 2891, -1571, -4002, -119, 3035, 1341, -2520, -2852, -767, 4557, 1265, -4837, -2343, 3293, 2924, -2247, -2441, -2102, 2741, 2900, -2987, -4904, 393, 4119, 185, -3373, -3684, 2621, 4046, -1336, -4140, -665, 3231, 2309, -1336, -5537, 513, 4942, 390, -4676, -2291, 2484, 2716, 479, -4471, -1335, 4319, 3215, -2305, -2974, 1298, 3427, 1971, -4207, -2197, 2686, 2920, -1274, -2587, -1165, 1925, 4089, -2411, -3073, 1986, 3672, 16, -1217, -1641, 249, 3365, -722, -3543, -1483, 1643, 1009, -1367, -3247, -829, 3347, 215, -1780, -1066, 259, 1299, 1495, -2409, -3492, 2088, 1755, -1755, -2920, -548]
1295e48J298P12k156j804K714J918K38l848j035L606K634l829l157L335J219j02
1311A195j862j064K15M253L96n248o8M025K372m193j640J062K916R5l067m82J67
1328i28L132O01l102k883N926K152m666q48J661J197K34n02l434J486K590J83
1344B799k562k830M075K299l030k446L348P9K32R86l251j47K518J824m212k204
1360b522L085K533k579k182K041M54P87K57j801j163K589K828l587l185K791M093
1376D439m287j570J719k77J100R37k343j957M629R52k013l029K230L713k694l014
1392a465J861N92j235K834k694k951M089K736l247l294L325K625j684k735J518
1407B75M34o01K252k496k535K243L579l030l383K447L373j526l041K654n05k62
$$ y = [-548, 750, 1462, -694, -2498, 216, 2134, 2372, -1476, -2511, 1095, 3729, -100, -3257, 78, 1297, 1195, -667, -1731, -1516, 2737, 3133, -2115, -2183, 1842, 4214, 21, -1619, -557, 2359, 2454, -613, -1095, -928, 2204, 2805, -297, -3180, 2746, 4898, 232, -616, 1045, 2242, 2476, 1974, -1460, 26, 2616, 2799, 237, -2593, 1482, 3781, 751, -1695, 1653, 1732, 1964, 2950, -301, -448, 2070, 3894, -318, -2522, 563, 3096, 517, -1665, 376, 830, 1617, 1874, 73, -1090, 1499, 4327, 740, -2445, 346, 4439, 152, -1418, 301, 24, 1124, 2061, -282, -2239, 2390, 3342, 1329, -1700, 530, 4243, 1549, -1465, 396, 988, -247, 2587, -107, -3058, 1031, 3767, 520, -2774, 551, 3176, 1492, -1243, 275, 709, 108, 2360, -136, -2671, -428, 3151, 121, -3262, -815, 2558, 1032, -2009, 645, 140, -122]
1423a22K316j672l858L307L405l890k430J230L465j497k625J443P17n64J748O8
1439A041m597K801L810l184l627K323K732j956j710J089O06j366K512j52l904
1454c582K141L931j926m146K632K289j394k161J108L02j539K783m65l416J287
1469b156M609k380k959J593K515o90k535J677P4j493K287L28m554J360M951k706
1485g9k790J457K386m80j129K7L08m68J157J790n432K92N588j421m788J662K892
1502I72j387J76l65o81J63K744k15m085J55M179O47n242M15L191p6j523L02k77
1520i07j173M312J12n452M52N563p68l746M07Q88J681j134j274l14L78J884J290
1537B199m175k179O839J13n080R14K719j162M04N9k873J706J717m4k645o55L066
$$ y = [-122, 2194, 522, -3336, -29, 3376, -514, -2944, -1714, 1751, 254, -2371, -928, -211, -775, 973, 1041, -3556, -755, 3055, -129, -3756, -1433, 1299, -657, -2367, -1278, -672, -2038, 474, 322, -3582, -1441, 2490, 564, -3582, -950, 1339, -55, -2216, -1108, -806, -2345, 438, -27, -3443, -2156, 2453, 73, -2886, -1293, 1222, 532, -2003, -326, -252, -1745, 542, 870, -3684, -2324, 2627, -79, -2869, -1412, 974, 494, -635, -608, -300, -768, 389, 2179, -3253, -2961, 2627, 1206, -3582, -1920, 972, -415, -239, -604, -1285, -1122, 1622, 1407, -2678, -2523, 1656, 2303, -2939, -2524, 667, 591, -932, -630, -907, -2080, 2232, 2344, -3108, -2656, 2907, 2139, -1607, -1200, -312, 1369, 235, -1039, -1353, -975, 909, 2199, -1976, -4155, 2684, 2797, -2283, -1369, 1350, 188, 592, 651, -2222, -516, 1201, 1157, -1488, -2143, 923]
1554I23J805l698q68L484r93q81J453j166j753L085Q61l864M57K332l58j720Q88
1571a3L6j1K66Q9M81j841M63K419j429k675K842P22k973J743K50k070J106K478
1589A883k643j073J885O31J28j944L20J841m11j547J135p94r33L415j546k953
1605b606J951K958k894p80J204N28M72q71o86J16J112O3m77j681P74K957j825
1622C15k736K216K205k067k3L61q52J390O35j983p18K309J96j372j243P06K287
1639A626r11j930Q98J093j047J240m87k279K780J242k689j359K593p3m70p78l91
1656i42R08L32K3q92o39Q01K305j458k266J705J426j402n55N55o88Q90J024j848
1674g21p51J754J048j447j202M31K043n19j422L85L54J54M70l83k084J628J826
$$ y = [923, 2728, -970, -1838, 1646, 653, -228, 1225, 59, -1694, 1391, 2252, -1612, -1155, 1177, 819, -901, -13, 23, 12, 278, 367, 848, -993, -530, 1889, 460, -2215, 627, 1349, -1624, 119, 369, -1701, -595, 1883, -760, -1833, 52, 683, 811, -1133, -813, 1028, 617, -930, 205, -589, -1522, 1893, 347, -2606, -655, 2303, -591, -1371, -167, 361, 833, -38, -724, -608, 504, 567, 90, -1591, -817, 2140, 315, -2421, -205, 2000, -67, -90, 271, -581, 809, 1444, -539, -1257, 1052, 1248, -124, -1367, -661, 1626, 715, -1215, -317, 776, -271, 969, 482, -1797, 983, 2225, -464, -1823, 770, 697, 227, -551, -942, -34, 298, 321, -571, -1210, -409, 1896, 438, -1828, -123, 1303, -99, -654, -99, -787, 103, 1127, -721, -1472, 282, 1330, -117, -1319, -888, 1155, 636, -786, -401, -47, 107, 577, 194, -1890, -262, 1564]
1691A564j933j250J314J007n83l20p10M27J168k4r11j021J040J335o09k160J309
1708c57J140o37r59O42QJ28R29j797l26J244O81p70j064R27N32j8j224N09K43
1727a69o5L49k13r32O21J313j078p35R57J55l30j7k89l28N74J65q0q29L49Q27
1747B45k17j009N63Q60o46K21j66l82K74P05k33j045J88J042n9o97J41j41Q03
1766D47N5r37M09p0P84n28j68o06J273j26p52J03K70L45j35k43m51P32K79j08
1786E73m71j33P45Q8o52m11N51L96j43j94p57Q03M05M8q93R7M66K08j29o58L67
1807C06M84J50o55p3l7L08N37p60j44M53O47o96l20M2M70L19n68k69pP06q1o66
1829A46j21N68L70n88j11k51P65l9j75m03M55L75k52l17m39O63M32k7q01o0P16
$$ y = [1564, -369, -1619, -305, 702, 119, -201, -911, -484, 684, 660, -251, -1272, -232, 1103, 494, -1666, -357, 783, 146, -813, -171, -163, -35, 894, -903, -1229, 15, 696, -74, -1138, -211, 321, 303, -921, -412, -169, -234, 115, -98, -1030, -409, 904, -174, -909, 48, 203, -127, -144, -433, -761, -187, -22, -102, -931, -582, 245, 28, -981, -418, 442, -204, 17, -149, -531, -257, 448, 215, -830, -642, 400, 341, -356, -215, -356, 447, 502, -435, -26, -96, 688, 160, -8, -614, 659, 533, -219, -116, 154, 499, 364, 121, -330, 402, 681, 573, 102, -31, 714, 802, 150, -261, 290, 686, 543, 349, -408, 395, 800, 848, -45, 52, 518, 726, 597, -61, 306, 790, 940, 285, 212, 175, 483, 1020, 260, 116, 569, 1216, 520, 200, 242, 712, 1031, 463, 194, 187, 893, 812, 146, 25, 593, 963, 375, 264, 13, 778, 739, 564, 161, 616, 991, 739, 422, -17, 646, 1078, 1051, 250, 190, 906]
1850I06q1j74n13K61L62Q3n80k64O37J88j22n01j15N26K64q55qJ61J71J67l71
1871A42l82K36O34m22k18k72O59M60q95q7L28K31m2j20o76N58M71n38k7p30P57
1892F7L84m64m42M14l9K1K69m02k57N44K01o26m41P03K09n24M0K33m29N67J25
1913A53q03L96K34K14m61j91p3Q55l79p08Q44o9L8Nn52j83R08M3m55j30m0N09
1935A55k70l54j91P48J46m45j25k84M34QL0p50O12J61n0k32j12J30K40L49p41
1956e41n5O58k58k19q8J03L72L56j066P08Q7l43L81j31n61M36O97r87J49J65J2
1977a25Q4n14J17M15N8l32P4m43L31P79o02l50N32M84n41l35j14P44m49M27m19
1998a79k64Q04j70k69m53N66M16o9p91N21N38q06K11l12K55J46L86o85k34Q48
$$ y = [906, 825, 651, 138, 399, 761, 844, 264, 0, 637, 825, 703, 202, 87, 613, 877, 22, 14, 175, 346, 513, 142, -240, -4, 630, 208, -10, -282, 377, 837, -58, -145, 183, 414, 372, 252, -424, 134, 605, 67, 40, -690, 67, 451, -13, -455, -41, -80, -59, 210, -192, -449, 95, 296, -330, -771, -68, 141, -383, -343, -110, -539, 28, 153, -650, -254, -20, 194, -267, -458, -531, 324, -55, -763, 81, 12, 50, 55, -497, -680, 228, 271, -184, -314, -354, 155, -115, -469, -660, 88, 234, -211, -336, -620, -186, -178, -148, -898, -286, -125, -175, -407, -519, -389, -149, 200, -541, -596, 62, -196, -415, -503, -400, -28, 328, -738, -30, 57, -286, 95, -36, -597, -161, 536, -451, -302, -137, -125, -41, -555, -438, -23, 35, -297, -223, -666, -335, 444, -158, -508, 24, 508, -33, -368, -482, 262, -187, 240, -179, -443, 361, 191, -78, -531, 35, 451, 382, -409, 112, 650, -156, 55, -257, -2, 144, 530, -155, -389, 459]
2018D59m09J35m25j5L65k67J15O2k24l08R48n08l96P41k50q8K47Jo58N36j37L14
2040B38o79K24N78n0k32n41N44j76M10k86m83Q3Q43j1j122L31O94K21l85m58p8
2061c35Q24q1o62j42NP03P5q08k33R13K19p54k58M27O30k0m15n39P50M06p30j31
2083a56j16O85J69p42n84Q61M51n00l9l44M39R8Q6o67K84P08l16o26l43N94l6
2104i4J32m49K61Q5J75J68o72L29J23J6m46J62J56Q8P8k83j36J11L47m80p2L03
2126i8N5L61m12l01J83N70n64J04J4k8L71k96m95L22M28o39L47j08J49K44k68
2147f1k2P8M33n20L40m01n9M18r6m06LK78nj2k94J41K90K8j76j21L14j32k33q1
2171b96j54K89L91l98l74P18k58O1j5k80M00J48k50n41N69m52K58J27m13M31n5
$$ y = [459, 50, 185, -240, -255, 110, -157, -42, 20, -204, -512, 436, -72, -468, 273, 23, -65, 182, 183, -475, 61, -76, 238, -441, -217, 361, 311, 79, -462, 82, -94, 316, 30, -453, -370, 473, 462, -660, -329, 365, 586, 201, -257, -335, 489, 408, -254, -396, -391, 312, 387, -421, -654, 259, 478, -276, -534, -107, 523, 503, 88, -451, 299, 705, -25, -156, -272, 413, 582, -160, -744, 117, 568, 68, 29, -315, 124, 222, 308, -359, -75, 633, 317, -309, -652, -58, -94, 38, -411, -150, -65, 110, 278, -394, -65, 58, 74, -372, -210, -54, 34, 112, -171, -307, -196, 151, -329, -401, -98, -43, 318, -94, -395, -212, 358, -206, -102, -88, -116, 255, -41, -536, -214, 214, -425, -78, -186, -37, 207, -61, -83, -5, 428, -92, 248, -153, -212, 206, 110, -296, -293, -15, -20, -32, -326, -185, 105, 133, -43, -164, 150, 18, -215, -296, -450, -161, 230, -168, -542, 176, -82, -21, -36, -316, 84, 232, -18, -559, 10, -442, -184, -57, -470, -39, -94]
2192i4j32k6M85j62k60M5j82J50N8k56M8M74n44O4J82j44J50j12j15P8N71m96
2214b18K43k41Q4K04k76K9K1L06l30JJ33r7L85m17l15N72L06m24J58l56K37Q6
2236I1K58n77L2M01l25j86k49L93j2j78J62j98M00k53M92n67J37k2N02n60k68
2257e27P20j92j22r9N0j45P14n96p2J87rK25k13M4L32O9n04k6M96m27O6q3l9J06
2281d5J75K08m16K35m0K47l59N4o3J91j76J64P7k32J75J25l16k14N38K58o44N32
2303D74l11k80P56m08J9k6n4K01J26p99N10K78l41l20Q43n29O3M23o13J95L9N2
2325B98k34K06l59M1J91k31M7o6L6M86k34j33N7M8l2k33J22K48k63R9l0Q6m0K44
2349C54m75M4J89J7P9l01J74R4l71K51K14m06M5K19n6k03K80j19N2j2J01j89K25
$$ y = [-94, -226, -252, 233, 71, -189, -144, -326, -176, -118, -374, -326, 148, -396, -332, -150, -294, -144, -256, -371, -293, 278, -218, 25, -216, -132, 72, -204, -175, -154, 152, -178, -177, -44, -141, 244, -173, -488, 84, 390, -34, 124, -232, 5, 91, 349, -228, -196, 205, -120, -306, -555, -162, -174, -352, -190, -388, 12, -241, 251, -316, -179, -201, 301, -259, -527, 193, 1, -121, -220, -170, -315, 399, -197, -269, -82, -91, 134, -79, -35, 297, 366, -138, -164, 332, -95, -29, -112, -151, -45, 130, 338, -78, 157, 117, 364, 5, 59, -4, 187, 11, 175, 252, 20, 195, 320, 4, -210, 328, 586, -58, 474, 163, -117, 639, 231, 250, 224, 170, 371, 497, -302, 208, 486, 145, -175, 668, 139, 202, 625, 12, 207, 246, 298, 64, 270, -89, -48, 143, -88, -41, -107, -71, 415, 181, 48, 105, 153, 121, -112, 10, 258, -5, 94, 64, 150, 110, 354, -121, -77, 112, 129, 208, -93, 81, 175, -196, 55, 269, -137, -92, 127, 71, -132, 148, 29, 81, 69, 170, -19, 206]
2372B06k18K28n7n13O65l66j27R8M73k79k06K12J56J20m94L42m50M53r4R8n74
2393c27M16L07m85M2j49L35n30L44L4N7l06O86k62p78P73m0j44m4l4N0j23K72
2415I4k91j23o1P48m52k2j00J60J17J7q7k26J1j40K75j18j46M69P8l45OJ87p7
2438b6K7j57J90j3k99N72l66O7M71j06p29L9P32n65N1P0J7P7J5J80l65J15M32
2461D29m98m54M88P1j84p7K55J85l21J34q5n6QL05j22k49P9N1j38j90N98k84r
2484f4q9J91j43J82j30J97J05m42L28p0j05J29L3k04J19J8k53M6K66K9k97L18
2506A64M1kr1k1Q2j76N6J43p3k26J28L73m23j66L43j17j00K99m08JL34k24k87
2529c50J83J66J63l84l9K92J71l36L32k11k16M24k28j71l3N68l30l22J29K96k70
$$ y = [206, -12, 216, 159, -354, 311, -55, -182, -84, 389, 110, -96, 116, 272, 392, -102, 240, -210, 243, 149, 247, -327, 89, 396, -89, -47, -196, 139, -391, -47, -13, 44, -262, 424, 162, -616, 157, 117, -27, -71, -105, -55, -178, 94, -197, -320, -381, 367, -85, -107, -207, -47, 70, 87, 0, -226, -215, -355, -80, -198, -344, 125, 203, -142, -136, 51, -26, 1, -156, 34, 21, -278, 294, -72, -5, 466, 360, -369, -330, 402, -163, -112, -42, -25, 52, 67, 247, -118, -3, 429, -69, -523, -35, 36, -148, -225, 30, 215, -106, 28, -57, -113, -105, 200, 78, -171, -92, -41, -179, -369, 229, -55, -64, -153, 38, -105, 77, -53, 144, 249, -193, 135, 65, -40, 89, 122, -82, 37, 55, -198, -152, 114, 143, -154, 164, 205, 203, 112, 91, 173, -3, 53, 196, 123, -103, 25, 398, -25, -191, 152, 35, -65, 234, -174, -173, 161, -63, -350, -167, -1, 162, -222, -261, 31, 202, -134, 198, -13, -229, 195, -33, -204, -237, 331, 1, -321, -192, 104, -166]
2550a66j10K57l5N1K7m8QrK91l3l51o7L80j78l90L27j27j27M57k21K4K08Q4l71
2574a19L10j04m0J18k60L05P5l27K07m3o7k60M28j88j61K93j75q9J07o4J04k5
2596B5J17m6L5j69P9Q6l16L74J00k54j82L43l46q7K37Q2l14J06L65n62K20O3K63
2619B19l70O0l3J90k68L7K95k59J04k0R5j05K9J43j28k7J0jj62O20k96k99L36
2642A70j18mn5J35J1l59j03N30j84k30l0J58j95J38L86k59k31M72L5l75j46L24
2664G0j13K66k18J95j75j21J28O5j82M5K19l13L8J14J6m66L66J46k57j15M1l1
2686b82K04K24j19k94K15L0J0j52MO6j32P8J61K7k56K28j80r0K05J49k4j31K82
2709B23j52l8mJ32o0k03N6K98l93J36K93k47k12L26N4k55k4N73n17j55J56K33
$$ y = [-166, -276, -19, -54, -3, 24, -24, -16, -25, 266, 233, -118, -185, 195, 17, -373, -46, -173, -300, 157, -64, -40, 168, 252, -119, 191, 87, 47, 165, -95, 210, 285, -42, 165, 122, 55, -205, 223, 35, -126, 167, -8, -97, 10, -54, 50, 25, 142, 96, 131, -38, 41, 127, -189, 185, 285, 31, -151, 192, -154, -241, -4, 78, -236, -130, 235, -327, -107, -44, 219, -151, -91, -124, 66, -202, -165, 130, -129, -25, -45, 50, -55, -26, 117, -11, -38, -28, -29, -191, 429, 133, -166, 170, 52, 48, -7, 128, 139, -220, -323, 207, 23, -207, -237, -79, -274, -136, 250, -9, -240, 232, 267, -108, -254, 70, -43, 223, 5, 200, 25, -96, 32, 97, -85, -40, 179, -134, -96, 18, 34, -432, -66, 80, -177, -292, -251, -282, -78, 146, 27, -267, -52, -22, -12, -164, -160, -94, -226, -148, 13, 40, -216, 12, -168, -258, -53, 96, 72, -59, 223, 71, 33, 29, 161, 101, -102, -46, 252, -141, -5, 288, 41, -171, 155, 209, -46, -70, 503, -14, -169, -13, 220]
2731B20m11K49o8L4Q5q0J75l86K49K3k0j21RJ52o0m9L41k20l02J25K69k54MQj37
2756a65n3K23j05P5J45Q0o9k57K10r9O4j25J14j23r6K49ol01q2M89j22j72m4L25
2780A55k59K9N01m74m5J88j77k12N70j63l21L42j99J61J45j55j04K00k51p0N99
2801D60q66N74J49m44k17M63p1k29J91j40J68k8jL10q3j16j93K13j87K40j61k89
2823b57M29J23n72Q1M66m81J87n0K98l37rr6O53j31k23K13k76m2J29k00J6K4L79
2846C24l40J9J50j31m97O48k02Mj28L22n3k38J42K4Rj72J45p1J15j0J44j15O6
2869A55l1j82j88J76K48n1l88L33l6m6m12L77KrR3J00l90L72n6l33M3K87j27j04
2893a67J63J7r5J32K59k84L8l71M85j84lp7J22j54Q3M8p4J96j19j7k44L66N9l73
$$ y = [220, -191, 58, -10, 24, 109, 29, 204, -182, 67, 90, 70, -51, -42, 110, 50, 1, 342, 122, -180, -55, 214, -40, -36, -28, -165, -218, 5, -100, -25, 120, 200, 131, -126, 84, -15, 49, -76, 38, -85, -181, 68, 62, -239, -321, 168, 46, -126, -170, 155, -104, -75, 426, -48, -93, 95, -82, -294, 276, 113, -208, 134, -65, 96, 241, 86, -18, 182, -69, -139, 460, -406, 168, 317, -127, -344, 119, 48, -181, 10, -130, 38, 10, 9, 319, 236, 120, -73, 140, -47, 193, 32, -257, 172, 295, -277, -196, 270, -211, -24, -74, 224, -113, -122, -218, 435, 304, 81, 294, 18, -24, 105, -95, -79, -55, 324, -16, 3, 153, 22, -475, 173, -29, -25, -153, 169, 116, -122, 20, 44, 53, -119, 26, -45, 70, 60, 204, 89, 155, 124, -58, -246, -70, 178, 127, -261, 72, 36, -10, -422, -45, -43, -52, 41, 141, -249, 123, 67, -266, -223, 64, -63, -167, -4, 13, -82, 50, 309, 25, 63, -308, 177, -7, -10, -87, 35, -119, -36, 12, -62, 134, 15, -2, -246, 120, 179, -194]
2917a94J89J5k11K10Oj88K04j48K98l23o0r8M10M2k84L1J94k67K02J4n3J76J3
2940A78k65n1o1K34J01j58o0mJ3J44k02Q1N5K32j91k49K65J55l73K28J58m09L50
2963A71j81R5j37J56K6K12m58q9J65J54o6J18j65j86J62k3J02p5M4q7j22K13p9
2986e0j74J3K84J51l12L5K23q2j93M4m8L55l48J24j74K79q2p0J76k05J65j15o0
3009f4j43M19j61n0l5p5R5J0M0Q0r7J79l53K3J11k9q8K05M0M9j34j52K07j65J04
3034A6j12p8K8Q7kJ06m9Pj0j19J04n8j6L60k70Q5Q9j22l67N34k26K11j86r3J48
3059F7J49n4k87R0p4J80j17R3n9m3m0p6K09O0l64J21N6J79n2j95K37j29o1J67
3083E7J67m74K22l2K18m32M19j02j89J0J07k9K36j06m7Oj42J66J9P5r5nq8R5j76
$$ y = [-194, -5, 10, -201, 9, 15, -173, 31, -117, 181, -142, -202, -300, 110, 152, -132, -101, 93, -174, 28, 42, -11, 165, 178, -87, -138, -199, 35, 136, -22, -82, -86, -73, 71, -131, -50, 5, 237, 46, -203, 62, 217, -156, 72, 230, -179, 171, -10, 85, -52, 104, 130, 342, -116, -205, -40, 114, 48, 166, 1, -185, -23, -46, 56, -19, 25, -62, -184, 29, -50, -224, -211, 73, 224, -88, -53, 170, 88, -105, -61, -109, 246, -102, 22, -152, 127, 45, -25, 151, -54, 111, -4, -64, -207, 212, 51, 1, -34, -109, -14, -4, 36, 116, 19, 198, -155, -132, -21, -50, -138, 67, 107, 156, 22, -130, 77, -88, 16, -96, -174, -146, -59, -61, 45, -4, 3, -7, -126, -22, -80, -96, 264, -6, 79, 168, 46, -321, 213, -13, 198, 12, -81, 67, 216, 162, -125, -35, -109, 71, -46, 47, -12, -55, -95, -171, 38, 98, -266, -145, -89, 90, 38, -157, 80, -49, -110, 57, 224, -250, -28, -60, 158, -274, 145, 43, -146, -136, -29, -58, 178, 72, 25, 31, -111, 55, 74, 149, 54, 49, -39, 56, -120]
3108a20j6PK51P2o6p4k2j3R4j85M9o7k2J36j66K06r2J37l77J57L51l41K93j9j2
3133A61O7m21L34k7j36J77k94O9O2K64l38j11L71j14k8J80l78M06l14K11m0k12
3155a11n5L53m1j70J28o4m7j32J21j6r8J29K51j41j69J89l75L07j24o0J79L1J67
3178B52k78p9J49M3j41N2J69kj92l1q5j8K03P8O0k68J67j48L6o9J73J40k94J38
3202E5j85Q3J5q6K23j66K91l15Q4o3K73k02r1J38J07j84j74J47r7M14%l34r7K08
3226D4M9l8q9k5j05j40L16L7j84O6j03P7J47j4l53K82L9j44K00j13J5L05l04O1
3250B6J76m09O1L44j80q1R6J16l9m66K26R0j0oM0QJ37j98N1M8j44J04K23j30j20
3275c7j55J89j0R6q1j11K07K44m85J28L4k95M7K11J50n3j08O6J12J4l39L11k13
$$ y = [-120, -136, -129, 122, 194, 128, 54, 32, 19, 113, -72, -23, -90, -112, 24, -142, 64, -28, 109, -268, -111, 240, -101, 192, 173, 161, 228, -193, 141, 114, -22, 155, -139, -70, -8, 256, -82, -193, 178, 64, 36, 216, -162, 244, -70, 141, 101, -111, -166, 187, 146, -24, 104, 40, -7, -139, -18, -34, -132, -3, 248, 107, -62, 127, -248, 59, -65, -125, 54, 85, 252, -26, -105, 44, 87, -54, -2, 167, 165, -27, -58, -143, -161, 42, 120, 180, -88, 79, -69, -33, -102, 71, 211, -83, 55, -130, -47, -32, -118, 105, -61, 230, -85, -1, -64, 209, 7, -84, 54, 161, -23, -197, -50, -147, 267, 267, -67, -164, 44, 93, 55, -34, -59, -164, -304, 12, 49, -135, -69, -172, -95, 52, 38, -315, -33, 6, -138, 62, -51, -36, 269, -35, 26, 202, -207, -146, 198, 18, -63, 33, 149, 110, -356, -130, -40, -50, -56, -16, -8, 129, -69, -18, 30, -114, -10, 213, 83, -37, -192, -3, -13, 83, 2, -109, 98, 342, -143, -15, 19, -276, -229, -18, 132, 79, -29, 37, 149, 163, -176, 135, -78]
3298g8L3J50l32K21M4Q5j28n6o0J61j29L7J45l3j01p6M5rk1k45L37m7J49k32j67
3323c07k6J32M33m91J16K32Q6j98j43J67j09L34j51k27K22j33j0j2J5J91j82J63
3345A02K43l19J66l35K58n5j2K32n74L39k3j99L43J72n77K12Q9j41m2O8K81j63
3367F5q6%j24Q6J07p4J27k56K61k75K40j69N9M3q7j09K3j03M71m13K18J8l19L86
3391H9j20L8o6j2J91k37L01j96M5k0K77n34J70J98j36l6n4K45JJ05k34M2N3j84
3415g4J55o6J76k48q2J04n8N6k15K48j19J07J3R0J05r6j74J31q8J8j39J25k2j49
3439b02K82j44N5P1j92J01j24J28P6M8R4j54j69N1O3J0J21k13J79o2k06L38j06
3462D5K9k84K72K5j32K64l76L65l69J08j08K73k37J12J90o3j57j33J18p0M3L23
$$ y = [-78, -45, 105, -227, -6, 38, 123, -5, -61, -121, 40, -89, -52, 93, 60, -41, -117, -72, -81, -102, -347, -10, -57, 92, -140, -307, -333, -201, 232, -259, -143, 89, 175, -23, -166, 1, -108, 226, 75, -152, 70, -63, -73, -85, -70, 121, -61, 102, 345, 26, 192, -143, 115, 60, 48, 280, -294, 45, 22, -177, 166, 338, -239, -27, 62, -79, -121, -53, 228, 65, -21, -21, -145, -59, 48, -26, 101, -155, 106, -169, 71, -98, -39, 4, -83, -192, -169, -272, 199, -214, 4, 22, -297, 89, -31, 7, -59, -71, 120, -117, 184, -12, 33, 13, 290, -244, -74, 124, -12, -48, -102, 143, 144, 249, 15, 57, 110, -74, 81, 15, 191, -57, -139, -35, -93, -37, -252, -4, -123, -16, -3, 87, 192, 96, -78, 53, -35, -17, -156, -31, -53, -202, 80, -64, -9, 62, -130, -29, -153, -25, 51, 99, 193, 39, -130, -79, -16, -6, 115, -98, 81, 19, -187, 151, 45, 74, -210, 62, 87, -45, 219, -157, 208, -161, -53, -161, 112, -125, -13, 177, 114, -43, -176, -58, -128, -85, 238]
3484B38j11m01K68K43j66j74o7J65o5J94q0j50J5O4M9J75j12n0O3J29l13K39l72
3507b19Q6K13l55K90J73l25O1J09k8k51J28K90l08K60j58%p0J43j31lR3l9lj02
3531a46K2K83L1k41J05K34k66O0j39j57K5J69j76J97M7r7P3j28K78k86J82j3j55
3554i8J02m8J08j00L4j47K04L2N9J02l80j41L13jqJ27L9l78J66lL67m35J27J20
3578A61j33j78J94R3j17j88J62Q8k57M67K8k44k04K34J9j97mJ11n9k09K61R8k2
3601A04J19j69o4j30L32k05M7J11l03J68k27J52p5K64k76J63J33k39J06j60J18
3622c1J23p8k1l0J3P3l41K61j44J27J91j01j88J2J78J07k12J43J22k81K6L3OJ56
3646A44n4j8o1N8l6q2M20j78j67m5L3J09J61k76P7k49K55N9l18J23K3j54K02M2
$$ y = [238, 127, -274, -6, 237, 71, -103, -170, -5, -70, 124, 44, -106, -91, -27, 22, 197, 85, 35, 98, 227, -86, 153, -219, -133, 80, -275, 15, 188, -137, -76, 33, 5, -246, -118, 172, -136, 124, -34, -34, -104, 39, -92, -95, -2, -41, -44, -146, -124, 159, 190, -51, 54, 288, 22, 82, -57, -214, -189, -20, -196, 1, 48, -49, 24, -104, 174, -112, 70, 57, -98, 4, -44, 64, -36, -2, -149, 55, 87, 146, 248, -132, -273, 40, 39, 31, 158, 197, -181, -15, -18, 349, -86, 41, 161, 28, -150, 44, 137, 20, -168, -6, 82, -175, 292, 320, 76, -128, 106, 125, -72, -76, 35, -24, -233, 28, 126, 104, 223, 54, -10, -140, 192, -13, 34, 145, -158, 10, -217, -65, -140, 124, -152, 11, 144, -95, 11, -149, -31, 92, 14, -7, -37, -24, 49, -292, -31, -175, -48, 143, 42, -146, -134, 44, 151, -61, 82, 204, -77, -51, -18, -12, 144, 90, 72, 11, 69, 33, -49, 371, 193, 26, -19, 14, 123, 284, 8, 85, -164, 91, 150, -168, -45, -22, -176, 26, 68]
3670F8l00J86L4J14p2j70J49L43n79K38l78K85Q7j27K0N7J81j07l4j42J99j74
3692a22j4L01r7J46q6j90M7j61K87k29J34n3P8j31K43j30J28j49K31j43k31K3
3714a18L5J76N3k70K61j79q3K5K14k27J15K56m03K17N0k6Q9j27k50J5J59o6J85
3737A01L3j74k43K50r4K82k60L6jJ9R4r8J79k42j36L77R2j53j50P5O2p2j4O8j2
3762A9l24L84k4o2O1J3k04M8J72q7j35K56j83m0O2O1K6J78j04j63L3J07j26j5
3786d7j33K42p0P5j59K46P4k50k09J86J46L4J8j50N6l27L80j31O9Q1l6j27J84
3809A52j89oR8J60j82j51q2M29k12j18J27L5k32j10K90J60j26p1r2J9L15M1k55
3832@J4M3J22k31oj83K50j99m5J74K95k53j4j14M6K80k09%R6j59K55j72k41L85
$$ y = [68, -232, -46, -12, 102, 30, -140, 9, 352, -227, 11, -367, -82, 5, -122, -102, -45, 136, 29, -5, -147, 52, -122, -136, 165, 68, 214, 128, -62, -15, -176, 111, -118, 16, -37, 41, -90, 153, 23, 151, 2, 233, 90, -141, -118, -83, 93, 146, -124, 137, -42, -125, -100, 114, -113, 2, 258, -145, 72, 122, 96, 185, 58, -192, -177, -18, -84, 101, 134, -40, -283, -33, -127, 155, -105, -69, -70, -51, 43, -55, 124, -118, -254, 123, 215, 62, -88, -13, 49, -23, -37, 31, 19, -305, 79, 55, -7, 54, 67, -137, -89, 83, -4, -139, 117, -66, -106, -44, 17, 43, 221, 117, -46, -13, 94, -32, -47, -180, 62, -8, 67, -92, 154, 228, -22, -231, -45, 101, 135, 153, 3, 59, -268, 112, -19, 50, 131, 95, -32, 152, -37, -43, 55, 215, 33, -118, -200, 229, 17, -101, 26, 61, -171, -281, 9, 169, 43, -28, -120, -101, 214, 255, 0, 14, 57, 179, -52, -58, -241, 9, -190, -235, -61, 234, -19, -33, -147, -101, 179, -30, -30, 66, -93, 162, -10, -251, 134]
3856A34j1j67K20k06l2Pp8J73o9J62l9k34K14nJ36m24L95k00J01J1r3J84k48N
3880f4j0P7p0l8R1l6N7l2K17J03m25K31P1N6k11j7Q3j56J57j07Q3j88J50J15r0
3905D7M9J6j25n3J16K0l3J53L0j34j70O3J6l4K0o4P9J58j03K01m58m5L65p6j05
3930f7J2L17k83P3k4k1J39l03K61N2q3j44J08k69N26l45J17j42L15j05j02K32
3952B64l09J76k57l9K35l1K7j4j06L7N5o5o6J83L4j10lJ39k67J60l3l8J02j11
3976c7m7K8m7J11J9j67l0P3j25K66J78l96O5P7p3Q2PK48r9k65R8k7K72j90J09
4001A30j49J51k03R1l8p9M1J03o9K7q0N5K0ol6q6K35j86K2k8J93k83L71L4k72
4026d2l3J62j04p7K76m1%j38R4k22p3L16k72k9K10j69O9j0J13o7J52j31p2J41
$$ y = [134, 123, -44, 176, -30, -62, -55, -133, 40, -29, 133, 94, -140, 74, 69, 205, -219, 176, -24, 77, 88, -5, 179, -69, -64, -74, 3, -67, -105, -14, -50, 7, -25, 192, 295, -130, 101, 172, 228, 17, 0, 83, -73, 84, -23, 60, -128, 22, 137, 47, 96, 112, -13, -66, 50, 70, 37, 190, 220, 86, -84, -21, -5, -39, -19, -83, -4, 154, 51, 252, -206, -251, 114, 38, -67, -55, 262, -21, 52, 28, 7, 146, -157, 104, 156, 73, -71, 37, -232, 294, -51, 66, -76, 239, 134, 32, 264, -45, 131, -126, -165, 70, 39, 66, 52, -54, -17, 38, -27, -93, 90, 124, 14, 11, 150, -117, 43, 10, -28, 74, -37, -84, -56, -103, 8, 27, -140, -170, -97, -222, 44, 222, -174, -109, -32, -105, -23, -16, 232, 133, -132, -34, -61, 211, 21, 130, -19, 132, -71, 20, -18, -97, -56, 47, -22, 5, -75, -20, 0, -6, -42, -128, 107, -79, -57, -85, 108, -175, 196, 230, -42, -75, 87, -17, -94, 182, 141, 141, 3, 97, -125, -198, 118, -154, -183, 27, -142, -73, -83, 30, -37, 115, -16, -88, 53]
4050E3R1l72L50k78j39J7K61M8J37Oq5P4k79J56k6j4n6M4O3N5r4Kj74L44q8j27
4076c1N1q0Q1p8J51k00J89l06Q8OL25r3J6PJ04p7j34q9O9k31K28k3J5R9p5j9J9
4103A2j66oL17j79j30L53j37k09P2j33M09j01J47j75n6m5J47l44L12k56J93n8
4125c3O1j33j9J03R3j92LK19j00j66J59K11l12J39k93J19pJ53QJ2m4n5p3R6j10
4150a61J92l0K9k24Q2k9K5j37J71O1J18N8j72K69k37rm6J0K0K2j07q8K0M26l33
4175g0J12j7j09J52j31J84j20p3J63o9k13MN5J46j65N1K48m2j46J82M2r2k6j98
4199a32M2pK30j98j48M01j86k3Q1L14j74p9k67J53J72j96P2p1O1J24j39ln7N2
4223B2j7J16p4m0J76k07Qk03K84L8p3J7j64J12j02n2K03m00K69M8J8j74L69l95
$$ y = [53, 144, -228, 122, -156, -295, -278, -17, 31, 168, 174, 89, 163, -116, 40, 14, 0, -56, -12, 51, 106, 12, 14, -160, 184, 96, -31, 20, -60, 21, -57, 94, -106, 83, -223, -135, -129, 196, 103, 119, 126, 230, 153, 19, -70, -1, -232, -4, -27, -12, 87, 12, -7, 12, -154, -160, 157, -22, -152, 201, 64, -145, -73, -206, 203, 102, 249, 74, 18, -27, 120, -224, 88, -168, 25, -33, 28, -105, -124, -21, 72, -120, -117, 102, 2, -164, -5, 206, -106, 33, -260, -141, -148, 5, 13, 25, -19, -74, -147, -51, -161, 31, 1, 30, -194, -112, -141, -116, -253, -82, -21, 97, 155, -17, 252, 15, 6, -40, -30, -10, 12, -95, -183, -163, 263, -70, 42, 25, -84, 68, -63, 121, 1, -72, 91, 22, -191, -187, -132, 14, -151, -100, 148, 106, -40, 142, 184, 92, 66, -132, -90, -97, 133, -65, -213, 188, 2, -21, 60, 374, 200, 121, -146, 7, 179, -17, 55, -16, 45, 169, 30, 27, -30, 22, 5, 121, 47, 7, 183, -24, -16, -219, 65, 103, 30, 47, -117, -5, -107, -159, 44, -356, -87, -39, -21, -195, 174, -221]
4247b21J03p7J26J32j47O9r4k9m2L79j14n5j22M9j3k41L81k95K49r4J22j17n8
4270a09J09l6J60Mk1j19L4J31j78k3K67q6k23J15p1L9p4K14r6j37L9lJ34j63k
4295i5r2J20j4n4j6N6K66j32J5N9k17K44O3j28p9K59q9j16m7J2Rj64K46Nj35J77
4321A53l96J48j11l5L54j82O2l0M9J16k18J84r7K72l18o7l3K40Ok16L22J2j78
4344C7k4J0p3Q2K10l57O1L15j81l03N8J76j99L35j35K4j90K26m1p0R6j21J28p2
4368hO4R2j35n1J4J45j60K74j05j32p2L04l32Q1N7j42K24n5j02J17j13J78k58
4391a15J16J2j15L01j48K05l71P8r8J78J07m53N15k73J7n3L17j8k38K4k45L41
4413H4q8p2q4J39L29k60j32J16K8rK69l13p0K69k62j9j09K92j12Q3Pj51O2j14
$$ y = [-221, -118, -195, -69, 63, -84, -15, -109, -138, -180, 199, 85, 30, -92, -43, -56, -297, 84, -211, 38, -56, 66, -51, -109, 0, -36, 124, 128, 107, -12, 22, 153, -25, -48, 219, 133, -90, 25, -46, -7, -81, 133, 37, -100, -61, -64, 70, -93, -95, -187, -67, -81, -135, -151, -95, 171, 39, 54, 113, -104, 140, 203, 75, -4, 255, 166, 50, 3, 15, 24, -140, 106, 111, -24, 153, -243, -95, -206, -241, 113, -69, -7, -37, 12, 128, -90, 94, -3, 269, -49, -116, -149, 91, 97, -119, 203, 215, 37, 13, 23, -50, 32, 242, -115, -54, 261, 80, -223, -165, 11, -188, 147, 12, 36, -154, 72, 31, -39, 57, -64, 64, -8, 56, 148, 13, -38, -24, 121, -39, 235, 130, -2, -74, 230, -102, -21, 36, -106, 118, 63, -39, 78, -35, 143, -115, 1, 13, -102, 199, 51, 256, -115, -37, -135, 43, 150, -303, 212, -61, -44, -97, 220, 202, -36, -12, -257, 84, -4, -76, -160, -21, 308, 48, -84, 32, 60, 51, 320, 7, -63, 206, -56, -75, -184, 108, -4, 79, 86, -65, -3, -117]
4437a17L71j99j35N9J09k27L48j91K10k40P9j07n9L06o9k83J69m9J23k9q3k7N8
4460A7L0p5P4O7J9j20O8j21K2j44J93J65k37l6K5J76j37J17Lm5P1j38q6K0M2k10
4486b40J78j60L33r1Ml3M4j81K50R3m8k21J1P1rMJ61k87R4R1j92J7l1K58K1o8
4512F9r7m9J82o4j61J88j15J43Q3j68j99K71k95P6L51j43Oj91P9q4K3M06j65l31
4536a85j61L47m1K83l33J08l2j21L20j16l13J46K49k97J08P9O8o7o4j42L67j56
4558D7p3J65j76J48l64J85L77k62k23J14K67j44k48J78l5R2L0N6N4k83J25J25
4580A55j31Q1P8k61J39R2k70J97m4k8l62K57Q3O0J26k51K36k93J11J26k37nJ29
4603a2O4k90L84o0j02j7Jq0P1lj47J41k9J62j44r4J88J20j19K24Ln34K65J34k09
$$ y = [-117, 254, 55, -80, -21, 88, -139, 209, 18, 228, -12, 67, -40, -99, 207, 138, -145, 24, -25, 98, 69, -14, -41, 17, 47, -28, 46, 113, 132, 12, 80, -41, -19, -163, 30, 195, -42, -78, -53, 123, -14, 103, 106, 61, 132, -6, -92, -72, -30, -240, -62, -222, 111, 20, 24, -9, 35, -146, 104, 197, 149, -72, -61, 10, 1, 5, 166, -121, -27, 64, -128, -111, -142, 116, 137, 69, -28, -77, 105, 41, -120, 68, -47, 96, 179, 11, -188, 83, -212, -136, 215, 72, 78, -113, -34, -118, -95, 311, 146, -185, -346, 1, -40, 243, -90, 18, -14, -135, 185, 69, -244, -98, 151, -146, -38, 41, 109, 42, -22, -164, 203, 47, -26, 139, -37, 111, -253, -68, 309, 47, -176, -62, 205, 61, -187, -9, -44, 48, 78, 134, 188, -95, 30, 155, 24, 105, 183, -78, 61, 153, -117, 80, 36, 8, -354, -97, -14, 46, 172, -79, 157, -136, -25, 101, -136, -141, -12, 52, -238, 146, 86, -16, -33, -32, -112, -41, -44, -191, -50, -79, 83, -61, -155, 33, 153, 34, 258, 261, -273, -8, 126, -83]
4628h3j56L45L2o6Jj92MJ13K1o0L48j77l12Q4J67k99M08m6rm43J64L2n5po1L64
4654A17k72j5K20N4j34O4jJ85k26m23L79J61Oj84Oj00J9J41K2j44J31K8j29P7
4678a8J68k27L15n8l82J17J28Qp7O3K9RJ66m39K48J7M8j01J27P3j62J4k2q9j47
4703a92K06J28O0l57J20K55l01K53j16k5j85J67l32J50n0L14K0j45k2k3k5K31
4725A31k86J57m1j22J93l0k65L21j88jL40j55l76K06J56n1J51K4l94J36j79M54
4747A81J8k40J03k65J29m0K63j72j64K17K5j20J67k00k15K34M3q1RMP2J45o2L0
4771H1L3j02J80k91K64l00L7l1L03k62l6J0R8K6j6j78J99L1P8Qk15K11q6QQ7l09
4797a72K38n5p3J08k20Q7J54j84P2n6J58p3j76K11k16M10j63r1J1O5pJ06j78n
$$ y = [-83, -239, 106, 138, 72, 73, -119, -115, -2, 19, -41, 307, 130, -182, -98, 69, -230, 178, 132, 123, -320, -156, -124, -179, -186, -247, 117, -155, -170, 50, 104, -30, 34, 33, 218, -8, -431, -52, 109, 115, -69, -63, -163, -144, -3, 19, -125, 6, 34, -95, -18, 150, -77, 238, 180, -202, -85, 43, 51, -26, 37, 66, 75, 241, -198, 50, 67, 115, 14, 141, 214, 52, 66, 44, -45, -192, 14, 142, 202, -155, -35, 220, -81, 172, 56, 31, -154, 13, -319, -169, -219, 95, 115, -30, -52, -75, -100, 131, -155, 2, -39, -161, 32, 2, -263, 58, -130, -131, 209, 54, -322, -116, 40, -11, 140, 164, -230, -94, -273, 181, 199, -41, 62, -203, -74, -114, 149, -23, -187, 30, 55, -65, 102, -98, -313, -79, -36, -117, -108, -104, -32, 113, 51, 81, 114, 12, 192, -99, 165, -135, -98, -129, 174, -88, -124, -114, -16, 10, -6, -184, 15, 46, 124, 132, -83, 128, 42, 50, 137, -172, 66, 11, -62, 46, -174, -87, 67, -117, -45, -101, 57, -16, -192, 19, -197, 213, 50, -41, -30, 35, 28, 134, -44, -49]
4821d9j61L82k84L99k38J26k51J7J77n1p7O5Q7k79Q8k39K78P7m2Lj93K04rj30
4845a00K82k91P3M8k90K68o4K88J5k80M1mj9MN0K0Q5j49l7K15p8q6Kj4P0j08j9
4872g8l9K6K11k48J43M4j61K63m25L74k07J40O3r8P5k0l70N16n9o1p3m7k05K69
4896C3J23K3J35k84O4q7J26j10q0J60j53L2K67j62N4j07J11k56j59L17J6j06j92
4919b35J07J79j55J59l7q6r1q7R2M8J40l23M14k13J6j3J6j65L71L8P2l21M6lJ02
4944G1r6L00k35P2J56j19m28K41p4J18j99L28l25J84O7pK26l42J85l2j29Q6L13
4967C61j73l83K06m8O1j2r5K59m57L36k87L69R8k66J60p6k3n4j38R2J16k05j5
4990a74K49j96K77l3j1j16M9P8L9k29K32j37J58q5L7J91m57m4K97k56J83j34L5
$$ y = [-49, -210, 172, -112, 287, 49, 175, -76, -59, 118, 67, -10, 55, 142, -137, -49, -288, -10, 67, 25, 28, -165, 39, 30, -100, 182, -109, -36, 12, -278, -10, -74, 214, 229, -51, -10, -14, -33, -29, 21, 41, 126, -23, -60, 155, 77, -9, -7, -21, 49, -59, -78, -117, -91, 120, -128, 15, 59, -102, 161, -264, 110, -97, 43, 106, 8, 83, 63, -307, 209, 150, 89, 16, -31, -236, 33, 156, 179, 314, 30, 94, 7, 133, 23, -57, 103, -50, -18, 249, 87, 141, 34, 145, -111, -270, 47, 63, -43, -235, -128, 51, -104, 55, 18, -68, -159, -246, -154, -106, 34, -289, 125, -88, -72, -85, -69, -234, 137, 175, 247, -74, -28, -31, 71, -25, 275, 40, 112, 268, 149, -279, -38, -112, 6, -193, 135, -190, -6, 61, 54, 280, -62, 123, 91, -38, 48, 361, 188, -195, 11, -37, 24, 12, -83, 176, -281, 55, -232, 137, 235, -31, 129, 53, 30, -24, -162, -70, 46, -159, -174, 75, -121, 156, 123, 112, -4, 45, 123, 162, -67, 165, 28, 186, 101, 138, 329, -128, -172, 125, -131, 52, -82, -47]
5013d7j53K40Q4M8j84p3J52j83QK08k4N9k75Q3K11j81PJ3J27rj14n4L8Rj14J69
5039D5M8k57J92r7K91j58j22J25R5k47J4J43p5j19J95l1P1k9k55M9J54J98k16
5062A4K1K1J67k18j69O8J95j93m8J53r2j88J55K76k87J90r2K0j26K10l8n2P8k2
5086D3K14k79L0K1O7j15P7j74J04J8m2j56J10K17n4o3J66j52n8ko5M7k8M07k83
5111E0M1j2M4j82J23l91L08R7k20M5m9K49j87R9J32M7k18j4q8J09j27j12K62J11
5135A17p0j28K74m8j43q3K75l98J16R5j41N4O7O3k91N18j95RL6rPk05l9lO1M05
5161C44k24k18J55m4J90k71J00N6O9k80K14p6J79J6o0j43r1r7Q7K04j30J9l52
5184c53K86j5K29l06K89R1l14K33l9j23PJ93j81K6k34K54R8Q4o4k76J38R8q6j23
$$ y = [-47, -200, 40, 124, 172, -12, -85, 67, -116, -108, 100, 76, 135, -140, -57, 154, -27, -20, -7, 120, 111, -3, -57, -19, -10, -124, 45, 93, -164, 28, -69, 222, 64, -58, 67, 162, -85, -71, 72, -3, -122, 73, 42, 113, 84, -171, -122, 32, 230, 14, 35, 56, 223, 5, -164, -96, 99, -94, -142, 11, -81, -269, -114, 162, -125, 65, -27, -7, -133, 77, 39, -13, 65, 43, 257, -22, 8, 29, 96, -19, 58, -116, -12, 6, -36, -192, -82, 135, 81, 18, 184, 32, -26, -28, -93, -46, -74, 333, 50, 91, 79, 123, -59, 64, -327, -19, 78, -142, -97, -146, 103, -84, 15, 147, 194, -24, -38, -126, -17, -144, -256, 6, 117, 47, -81, 193, 145, 2, -81, 194, -204, -88, 7, -134, -80, -13, 50, -241, 277, 82, 91, 127, 118, 125, -80, -119, -122, -61, 344, 120, -98, 57, 13, 203, -68, 32, 88, 157, -123, 91, 15, 194, 210, 150, 7, -84, -181, -94, 110, -20, -1, -353, -67, -82, 147, -159, 130, 221, -93, 140, 101, -22, -15, 178, -3, 23, -211, 43, 141, 225, 161, -115, 23, 121, 35, -88]
5208h8J11q1J02n3M9P9j52P2K42k46OJ63j81K13j21O2p4k09J5J12j3r9K85j72
5232B2n9N6n5K0Q9PR1m23K48Rnj1N5m6J4J4j81J90m6j5l5K8J53m4j36J18r3q0
5260a15M5J89k37L11l02J75j4K1j56J26R3o6j86j21J91L7j49Q7J79j94L50k76
5282a2P7k78L53Q4l22m4M97k88j20J49j02J19o7o1j51j1J76k10n9L85rj21J8l0
5306b7j8N7J90l15l02P63k97k21K61j37J31M0j93J22p2J17nk91p9M32j75J23m12
5329c08L17M6p4k29M16Rk0l3l90L64j6M8k27J94j7p8j59J37Q5o3n6l4R9j22R7
5354a4p7R5l1RQ0J2M7j71j43J56J35o9Q0j3r7J33j5p6j6Jj06Q9j17J8L50k91q9
5381a20J37o5N3k8J37j39K74n28J18O08n85p9K64p3nK04j42j36K89k25N1J13k7
$$ y = [-88, 23, -58, 44, -9, 40, 119, -33, 39, 281, 35, 41, 204, 23, 236, 115, 177, 103, -106, -91, 21, 8, -91, 194, 22, -37, 19, -36, -16, 73, 80, 171, -252, -4, 5, 0, -11, 44, -2, 12, 26, -155, 35, -11, -26, -61, -33, 120, 76, -60, 58, -35, -115, -70, 119, -118, 193, -109, 66, 52, 73, -83, 43, 136, 70, -116, -237, -46, -9, -158, -71, 108, -86, 264, -12, 65, -213, 140, 224, -98, -142, 355, 67, -53, 96, -6, 113, 46, -15, -166, -177, -1, -211, -270, 115, 106, -15, 3, -27, -45, 12, 202, -113, -415, 348, 51, -170, 91, -46, 85, 125, -68, 54, -18, 99, 94, -197, -276, 156, -19, 104, -308, 9, 55, -19, -248, 168, 177, 157, 124, -266, 98, 82, 130, -97, 97, 80, 2, -157, -20, 65, 2, -54, -88, 11, -111, -14, -91, 4, -27, -18, 62, 74, 121, -50, -193, -37, 98, 29, 109, 96, -1, 132, 117, 41, 25, 26, -80, 9, -108, -90, 260, -31, -120, 17, -48, 5, -23, 114, -25, 249, -279, -161, 447, -138, -217, 47, -26, -31, 173, 31, -105, 184, -41, 10, 123, 96]
5404I6j29R1n4n3K0Po7MJ9N9J70j21l5Oj35J43r8Om2K06j25j24K59M6k74J18o3
5431g0k04L19OJ23j59K45l73L82k63j8k6k0j71K39Nj91J94p2K79n1j75j04L14
5454B09p5l18J15nj69K47j43K26j4N6j21L3j00O2P1J1l57J52RJ45l8k3l0K27l4
5479A36j06o7k68M70l76K21r1N4p0K28k55J26j43J90J07j53L1k25L63j77k67L13
5501D1PM8q9j2L8j26J46N4j02J09m7j53M0K33r0j95j3P0j72K88j26n4l3K22Qk83
5527a91Q1J36j69J5L51j12J5j53J88j23K8o2O8m1k5j01K5J55j66J0J02j6l05K02
5551h8J26j71J15O4J9k61M03k84k37J96K36k38J36m6m3J6J30P0j84J42m4o7J14
5574A04j84l3Q4J10o0M7k07J75J11l4j48K9Q7l04L38k46J95j89K7J17k8M2l86
$$ y = [96, -33, 58, 4, -49, -29, -22, -89, -85, -66, -7, 163, 42, 7, 13, -122, 21, -77, -71, -113, 93, -32, -156, 103, 149, -125, -7, -70, -274, 45, 51, 174, 15, 260, -113, 269, 6, -12, -38, -58, -229, 10, 15, -176, 18, -54, 225, 174, -1, -105, 209, 134, -184, -69, -74, -243, 4, -139, 87, 73, 129, 8, 41, -59, 3, 74, 85, -272, -120, -111, 34, -4, -27, -57, 170, 136, 30, -37, -305, 165, -211, 10, -81, -27, -97, 131, -124, 2, -141, 49, 156, 3, 34, -191, 172, -5, -272, 41, 48, 96, 7, -5, 33, -93, 53, 107, 5, 114, 67, -86, -46, 187, 97, -98, -111, -41, -213, 75, -51, -105, -138, 84, 92, -191, -110, 26, -143, -128, 223, 111, 126, -27, 161, 38, 66, 4, 72, 31, 6, -95, -70, 85, -81, -71, 31, 15, -290, -88, 38, -133, -18, 46, 65, -196, 207, -77, -314, -118, 118, -120, 16, -30, -73, -57, 73, 143, -41, 101, 57, -10, 104, -80, -113, -29, 81, 21, 68, -139, 36, 147, 113, -35, -6, 81, -223, 115, -131, 64, -125, -98, 19, -9, 33, -353]
$$ [...]
8191A7
##END NTUPLES=NMR FID
##END=
