##TITLE=1H_Pr 1822
 CDCl3,8 sc, 
 1.03.2021
##JCAMPDX= 6.0         $$ Bruker NMR JCAMP-DX V2.0
##DATA TYPE= NMR FID
##DATA CLASS= NTUPLES
##ORIGIN= UXNMR, Bruker Analytische Messtechnik GmbH
##OWNER= root
$$ XWIN-NMR		Version 3.5
$$ Mon Mar  1 12:40:23 2021 Russian Standard Time (UT+4h)  she@DPX200
##.OBSERVE FREQUENCY= 200.1315066352
##.OBSERVE NUCLEUS= ^1H
##.DELAY= (6, 6)
##.ACQUISITION MODE= SIMULTANEOUS
##.ACQUISITION SCHEME= undefined
##.AVERAGES= 8
##.DIGITISER RES= 18
##SPECTROMETER/DATA SYSTEM= spect
##.PULSE SEQUENCE= zg30
##.SOLVENT NAME= CDCl3
##.SHIFT REFERENCE= (INTERNAL, CDCl3, 0, 15.7039)
##AUDIT TRAIL= $$ (NUMBER, WHEN, WHO, WHERE, WHAT)
$$ ##TITLE= Audit trail, XWIN-NMR		Version 3.5
$$ ##JCAMPDX= 5.01
$$ ##ORIGIN= Bruker BioSpin GmbH
$$ ##OWNER= she
$$ F:/spectra/data/she/nmr/H-F/1/audita.txt
$$ ##AUDIT TRAIL=  $$ (NUMBER, WHEN, WHO, WHERE, WHAT)
(   1,<2021-03-01 12:39:12.28 +0400>,<she>,<DPX200>,
      <created by zg, POWCHK disabled, PULCHK disabled
       configuration hash MD5:
       00 E9 B6 7A A2 85 ED C7 34 08 36 98 17 FE 4E 26
       data hash MD5: 16K
       93 66 4E 8B 90 68 FB 9D 61 AA 74 10 99 E5 2E 36>)
$$ ##END=
$$ 
$$ hash MD5
$$ 50 5B 1B DC 48 E3 89 F1 D8 AA 2B 40 4A 4C 4B 58
##$RELAX= 
##$RELAX= 
##$RELAX= 
##$RELAX= 
##$RELAX= 
##$RELAX= 
$$ Bruker specific parameters
$$ --------------------------
##$DU= <F:/spectra>
##$EXPNO= 1
##$NAME= <H-F>
##$PROCNO= 1
##$TYPE= <nmr>
##$USER= <she>
##$AMP= (0..31)
100 100 100 100 100 100 100 100 100 100 100 100 100 100 100 100 100 100 
100 100 100 100 100 100 100 100 100 100 100 100 100 100 
##$AQSEQ= 0
##$AQ_mod= 1
##$AUNM= <au_zg>
##$AUTOPOS= <>
##$BF1= 200.13
##$BF2= 200.13
##$BF3= 200.13
##$BF4= 200.13
##$BF5= 200.13
##$BF6= 200.13
##$BF7= 200.13
##$BF8= 200.13
##$BYTORDA= 1
##$CFDGTYP= 0
##$CFRGTYP= 5
##$CHEMSTR= <none>
##$CNST= (0..31)
1 1 145 1 1 1 1 1 1 1 1 1 1 1 1 1 1 1 1 1 1 1 1 1 1 1 1 1 1 1 1 1 
##$CPDPRG= <>
##$CPDPRG1= <>
##$CPDPRG2= <>
##$CPDPRG3= <>
##$CPDPRG4= <mlev>
##$CPDPRG5= <mlev>
##$CPDPRG6= <mlev>
##$CPDPRG7= <mlev>
##$CPDPRG8= <mlev>
##$CPDPRGB= <>
##$CPDPRGT= <>
##$D= (0..31)
0 1.2 0 0 0 0 0 0 0 0.06 0 0.03 0 0 0 0 0.0002 0 0 0 0 0 0 0 0 0 0 0 0 
0 0 0 
##$DATE= 1614587951
##$DBL= (0..7)
120 120 120 120 120 120 120 120 
##$DBP= (0..7)
150 150 150 150 150 150 150 150 
##$DBP07= 0
##$DBPNAM0= <>
##$DBPNAM1= <>
##$DBPNAM2= <>
##$DBPNAM3= <>
##$DBPNAM4= <>
##$DBPNAM5= <>
##$DBPNAM6= <>
##$DBPNAM7= <>
##$DBPOAL= (0..7)
0.5 0.5 0.5 0.5 0.5 0.5 0.5 0.5 
##$DBPOFFS= (0..7)
0 0 0 0 0 0 0 0 
##$DE= 6
##$DECBNUC= <off>
##$DECIM= 32
##$DECNUC= <off>
##$DECSTAT= 4
##$DIGMOD= 1
##$DIGTYP= 9
##$DL= (0..7)
0 120 120 120 120 120 120 120 
##$DP= (0..7)
150 150 150 150 150 150 150 150 
##$DP07= 0
##$DPNAME0= <>
##$DPNAME1= <>
##$DPNAME2= <>
##$DPNAME3= <>
##$DPNAME4= <>
##$DPNAME5= <>
##$DPNAME6= <>
##$DPNAME7= <>
##$DPOAL= (0..7)
0.5 0.5 0.5 0.5 0.5 0.5 0.5 0.5 
##$DPOFFS= (0..7)
0 0 0 0 0 0 0 0 
##$DQDMODE= 0
##$DR= 18
##$DS= 0
##$DSLIST= <SSSSSSSSSSSSSSS>
$$ [...]
##$SUBNAM2= <"">
##$SUBNAM3= <"">
##$SUBNAM4= <"">
##$SUBNAM5= <"">
##$SUBNAM6= <"">
##$SUBNAM7= <"">
##$SUBNAM8= <"">
##$SUBNAM9= <"">
##$SW= 16.9725356469052
##$SWIBOX= (0..15)
0 0 2 0 0 0 0 0 0 0 0 0 0 0 0 0 
##$SW_h= 3396.73913043478
##$TD= 16384
##$TD0= 1
##$TE= 0
##$TE2= 300
##$TE3= 300
##$TEG= 300
##$TL= (0..7)
0 120 120 120 120 120 120 120 
##$TP= (0..7)
150 150 150 150 150 150 150 150 
##$TP07= 0
##$TPNAME0= <>
##$TPNAME1= <>
##$TPNAME2= <>
##$TPNAME3= <>
##$TPNAME4= <>
##$TPNAME5= <>
##$TPNAME6= <>
##$TPNAME7= <>
##$TPOAL= (0..7)
0.5 0.5 0.5 0.5 0.5 0.5 0.5 0.5 
##$TPOFFS= (0..7)
0 0 0 0 0 0 0 0 
##$TUNHIN= 0
##$TUNHOUT= 0
##$TUNXOUT= 0
##$USERA1= <user>
##$USERA2= <user>
##$USERA3= <user>
##$USERA4= <user>
##$USERA5= <user>
##$V9= 5
##$VALIST= <valist>
##$VCLIST= <CCCCCCCCCCCCCCC>
##$VD= 0
##$VDLIST= <DDDDDDDDDDDDDDD>
##$VPLIST= <PPPPPPPPPPPPPPP>
##$VTLIST= <TTTTTTTTTTTTTTT>
##$WBST= 1024
##$WBSW= 4
##$XGAIN= (0..3)
0 0 0 0 
##$XL= 0
##$YL= 0
##$YMAX_a= 33559
##$YMIN_a= -25121
##$ZGOPTNS= <>
##$ZL1= 120
##$ZL2= 120
##$ZL3= 120
##$ZL4= 120
##$ABSF1= 10
##$ABSF2= 0
##$ABSG= 5
##$ABSL= 3
##$ALPHA= 0
##$AQORDER= 0
##$ASSFAC= 0
##$ASSFACI= 0
##$ASSFACX= 0
##$ASSWID= 0
##$AUNMP= <proc_1d>
##$AZFE= 0.1
##$AZFW= 0.1
##$BCFW= 1
##$BC_mod= 2
##$BYTORDP= 1
##$COROFFS= 0
##$CY= 11.3945322036743
##$DATMOD= 1
##$DC= 2
##$DFILT= <>
##$DTYPP= 0
##$F1P= 15.9154993809931
##$F2P= -4.1035820241983
##$FCOR= 0.5
##$FTSIZE= 0
##$FT_mod= 4
##$GAMMA= 1
##$GB= 0.15
##$INTBC= 1
##$INTSCL= 1
##$ISEN= 128
##$LB= 0.24
##$LEV0= 0
##$LPBIN= 0
##$MAXI= 10000
##$MC2= 0
##$MEAN= 0
##$ME_mod= 0
##$MI= 1.114404
##$NCOEF= 0
##$NC_proc= 0
##$NLEV= 6
##$NOISF1= 3.799351
##$NOISF2= 2.8
##$NSP= 1
##$NTH_PI= 0
##$NZP= 0
##$OFFSET= 15.70392
##$PC= 1
##$PHC0= -10759.83
##$PHC1= 7.600939
##$PH_mod= 1
##$PKNL= yes
##$PPARMOD= 0
##$PSCAL= 0
##$PSIGN= 0
##$REVERSE= no
##$SF= 200.130013532006
##$SI= 16384
##$SIGF1= 3
##$SIGF2= 2
##$SINO= 400
##$SIOLD= 16384
##$SREGLST= <1H.CDCl3>
##$SSB= 0
##$STSI= 0
##$STSR= 0
##$SW_p= 3612.71676300578
##$SYMM= 0
##$S_DEV= 0
##$TDeff= 0
##$TDoff= 0
##$TI= <>
##$TILT= no
##$TM1= 0
##$TM2= 0
##$TOPLEV= 0
##$USERP1= <user>
##$USERP2= <user>
##$USERP3= <user>
##$USERP4= <user>
##$USERP5= <user>
##$WDW= 1
##$XDIM= 8192
##$YMAX_p= 0
##$YMIN_p= 0
$$ End of Bruker specific parameters
$$ ---------------------------------
##NTUPLES= NMR FID
##VAR_NAME=  TIME,          FID/REAL,        FID/IMAG
##SYMBOL=    X,             R,               I
##VAR_TYPE=  INDEPENDENT,   DEPENDENT,       DEPENDENT
##VAR_FORM=  AFFN,          ASDF,            ASDF
##VAR_DIM=   8192,          8192,            8192
##UNITS=     SECONDS,       ARBITRARY UNITS, ARBITRARY UNITS
##FACTOR=    0.0002944,     1,               1
##FIRST=     0,             0,               0
##LAST=      2.4114304,     0,               0
##MIN=       0,             -25121,          0
##MAX=       2.4114304,     33559,           0
$$ Real data points
##PAGE= N=1
##DATA TABLE= (X++(R..R)), XYDATA
0 0 0 0 0 0 0 0 0 0 0 0 0 0 0 0 0 0 -1 8 -8 8 -8 8 -9 16 -16 16 -24 24 -30 32 -40 41 -48 56 -63 69 -78 87 -97
39 -97 106 -120 130 -145 160 -178 198 -217 241 -263 290 -319 353 -387 428 -471 522 -580 648 -724
59 -724 816 -923 1059 -1230 1450 -1754 2192 -2885 4151 -7226 31652 30676 -7067 30925 22369
74 22369 14989 7984 33559 -574 4873 17013 14150 3038 7427 30436 -6379 13875 23694
87 23694 9397 3425 18677 14994 -14276 16704 1488 -5767 -6546 8851 -5925 -15052 15564
100 15564 -5936 -6085 1102 10907 -14678 -2363 10231 -19383 -6613 -4267 -5550 -25121 1133
113 1133 -4564 -21078 1173 -655 -5387 -12225 14407 -8821 -9880 6488 -3928 -11215 -7085 9051
127 9051 -21511 -1794 4667 -8104 -5333 6172 7433 -12044 14695 4194 -2912 66 9303
140 9303 -3115 -11949 14079 -8332 -5797 3185 6340 -8857 3380 13773 -8917 5671 5819
153 5819 4143 -9675 6904 2137 -15172 2885 -1627 -7777 -10137 10368 -9282 -6971 8843
166 8843 -4405 -4539 -1876 7382 -15422 -2152 1227 -12065 -9685 -2073 -2580 -19196 6130 -3410
180 -3410 -9596 35 3879 -4517 -8437 10480 -9396 -5969 -654 -851 -11966 -3699 5919 -14203
194 -14203 1515 3163 327 -5578 9315 4008 -8162 9939 1257 -2503 -3922 8524 -6564
207 -6564 -5135 8719 -3339 -1223 3028 10502 -6698 6677 9783 -3803 2427 5329 2269 -10003
221 -10003 8419 -2246 -7183 2099 2427 -2875 -4627 11797 -5246 -540 5417 1814 -6261 347
235 347 5753 -13545 878 -858 -5839 -7578 3021 -1282 -10029 7108 -1396 -2930 -2217 6397 -6757
250 -6757 -5629 5981 -8584 -5156 -2243 1147 -11432 1403 3133 -7562 1417 3022 1613 -6671
264 -6671 8254 -1275 -6137 3251 -172 -4584 -5088 7754 -7789 -1485 5503 25 -1831 4191 8012
279 8012 -7143 6306 3765 -1934 -2245 4342 -128 -8114 7592 -1669 -2203 1151 6638 -2796 78
294 78 10342 -3754 1582 2832 3459 -7060 2101 3146 -7798 1802 1155 -394 -5227 7698 -302
309 -302 -3797 6264 684 -1761 -2362 6374 -7589 -2025 1942 -4724 -4508 -82 3065 -8080 4151
324 4151 2487 -2858 -636 3371 -463 -7198 6131 -4395 -5263 -1406 417 -6575 -3451 5695 -6565
339 -6565 84 2419 1483 -5593 3352 3499 -7844 1496 -312 -2984 -5302 4120 -3023 -5224 4547
354 4547 -813 -1148 -438 7195 -4520 1043 4824 -2471 -2050 347 2070 -8043 3200 567 -4316
369 -4316 237 2862 195 -3942 7793 -1842 -1873 2355 1350 -4228 -2458 4507 -7535 -1002 620
384 620 -1257 -4411 2172 2802 -6317 4028 711 -1869 -3311 4013 -3431 -5840 3404 -4291 -3680 -2097
400 -2097 3072 -5888 -526 4185 -3805 262 1635 2585 -6285 4200 219 -4355 334 1133 -1629
415 -1629 -5107 5818 -2451 -870 4245 2284 -1098 1084 7121 -4103 2137 2729 -225 -2004 3553
430 3553 1932 -5339 5509 1742 428 1570 6356 309 -1202 7477 -1480 -4 916 3536 -4325
445 -4325 493 4014 -4270 1222 2066 1987 -3990 5350 1392 -3198 2963 590 -1309 -4068 3789 -4799
461 -4799 -3353 1490 -1610 -3095 -844 3895 -5834 1507 1736 -2458 -1958 1012 -24 -7078 2446 -2645
477 -2645 -3705 -2235 1674 -3536 -4005 4844 -3217 -890 1325 1981 -3060 416 2403 -5226 284 -185
493 -185 -596 -4588 2942 657 -3653 4055 1156 102 -760 6120 -2201 -554 4086 -1075 -1062 448
509 448 3914 -4435 2757 3280 -870 1390 3670 3118 -2375 6489 1103 -595 1827 3212 -872 -1114
525 -1114 5608 -2613 1321 2743 2822 -780 2964 5403 -2421 3537 2492 1117 -1924 4016 682 -3578
541 -3578 4270 79 -321 325 4891 -1530 717 5207 -636 701 559 3561 -4286 1863 1327 -2881
557 -2881 512 1553 164 -4184 4514 -667 -1463 1863 1512 -1217 -1904 3896 -4236 -1276 557 -1217
573 -1217 -3652 -165 1883 -4958 2186 -15 -1191 -1701 2110 -438 -3957 2633 -1955 -1921 -1620 2053
589 2053 -3567 -1860 2863 -2590 142 463 2276 -3532 2471 1883 -3203 1202 579 -426 -3502 3508
605 3508 -1419 -1633 2360 899 -310 -526 5083 -2419 994 2607 -55 -1027 1210 2038 -4027 2530
621 2530 387 -489 -366 2327 882 -2369 4434 -663 19 607 2481 -2600 -666 3027 -3762 112
637 112 -28 501 -3122 1503 1149 -2691 1715 550 27 -2859 3084 -2182 -2996 1657 -1512 -1513 -1638 2835
655 2835 -3756 383 1497 -1027 -609 829 2126 -3800 2518 -125 -1707 -581 1181 -519 -2850
670 -2850 3555 -1491 -169 1120 2021 -1032 330 3791 -2497 1459 977 872 -2157 1512 1266 -2648
686 -2648 2477 625 271 -1040 3879 -627 -862 3444 -902 -195 -539 2568 -3076 419 1373 -1917
702 -1917 -452 599 1746 -3352 3122 453 -1811 896 683 -783 -2615 2447 -2623 -1336 -254
717 -254 13 -2110 -1142 2565 -3660 896 655 -459 -1793 1134 22 -3373 1609 -1419 -854 -1827 1980
734 1980 -1512 -1798 3185 -1108 87 186 2331 -2311 950 1774 -1816 776 308 1259 -2476 2775 398
751 398 -697 1854 1426 578 -837 4033 -1283 234 1543 322 -882 -58 2547 -2788 1757 1021
767 1021 61 -307 1768 1178 -2170 2876 -495 -226 -485 1538 -1375 -1550 2078 -2153 -266 17 1248
784 1248 -2470 607 1307 -2386 583 -529 184 -3083 1428 -1002 -2544 413 -708 -961 -2076 2375
800 2375 -2432 -449 1201 -1145 -938 -626 1498 -3199 666 -76 -1241 -1167 539 338 -2559 2783 -896
817 -896 -454 -10 1358 -580 -806 2620 -1961 379 84 1060 -1646 793 1858 -1991 1762 627 1126
834 1126 -1466 2515 20 -1068 1947 -132 89 -770 2469 -1733 327 1814 -667 365 506 1875
850 1875 -2429 1990 559 -840 160 312 318 -2405 2501 -1450 -383 536 823 -709 -608 2625 -1820
867 -1820 607 336 562 -1467 561 1109 -2668 1483 -530 98 -1174 1977 -47 -1207 2291 -453
883 -453 297 -450 2348 -1466 225 1522 -1259 360 240 1645 -2055 1745 817 -626 707 658 818
900 818 -1544 2538 -803 -418 600 288 -566 -654 2200 -2277 786 619 128 -759 453 995 -2568 1392
918 1392 -473 -553 -1489 547 -982 -2111 1443 -1859 -516 -896 749 -2079 -592 778 -2114 -396
934 -396 -978 337 -2695 706 -596 -2039 -13 -1175 -88 -2149 1743 -1432 -634 -26 -425 -660 -1191
951 -1191 1964 -2351 920 232 -310 -293 629 1524 -1508 2301 11 442 272 1546 514 -821 2461
968 2461 -816 735 705 1570 -808 1095 2275 -459 2169 753 1417 -587 2067 1147 -718 1782
984 1782 143 793 -701 2377 -426 -202 2111 6 645 -155 1578 -1247 1292 603 -448 -572 144
1001 144 556 -1736 1453 -912 -431 -383 407 -647 -1607 1507 -1840 -505 -662 2 -1931 -766 654
1018 654 -2488 330 -894 -71 -1724 511 -231 -2148 929 -838 -209 -1641 979 -1645 -668 754
1034 754 -1306 170 -519 1496 -1839 975 529 -402 536 10 953 -1743 2002 -376 -146 566 415
1051 415 261 -765 2148 -902 865 540 889 -86 134 1547 -1396 1606 -143 516 -589 1039 427
1068 427 -1120 1504 -833 519 -628 1402 -842 -453 1119 -1429 169 -611 739 -1891 685 -99
1084 -99 -1224 38 -478 411 -1775 1223 -1056 -853 223 -415 -208 -1325 1166 -1724 -55 -199 -326
1101 -326 -653 -402 1009 -1727 1084 -291 -131 -419 485 165 -1077 1434 -729 538 -592 1094 -325
1118 -325 -169 1641 -702 657 132 998 -1012 1030 813 -522 950 -233 853 -933 1543 -56
1134 -56 -110 841 -173 582 -534 1811 -944 878 496 -175 44 -370 1065 -1605 1092 -260 -300 -139
1152 -139 260 -31 -1333 1331 -1474 3 -575 189 -1033 -923 737 -1757 180 -855 215 -1575
1168 -1575 149 -183 -1258 652 -831 10 -1593 753 -879 -863 786 -619 10 -758 1184 -1053
1184 -1053 549 455 -568 478 -205 1311 -1201 1510 56 75 255 607 501 -680 1698 -593 838
1201 838 348 637 186 -41 1663 -975 1052 272 954 -425 695 865 -889 1231 -375 659 -431
1218 -431 1018 -236 -200 1015 -1086 373 -1136 891 -1462 366 426 -1034 94 -537 816 -1406
1234 -1406 573 -769 -503 -87 -572 -106 -1343 558 -1545 -125 -720 -398 14 -410 1015 -1753 32
1251 32 -780 -381 -933 138 -148 -1266 716 -732 417 -575 492 -375 -578 795 -681 370 -420
1268 -420 984 -661 777 436 -583 799 -387 813 -849 1285 50 253 679 60 828 -472
1284 -472 1453 -532 766 596 -26 550 -9 1324 -889 989 -15 334 -75 -117 813 -791 1432
1301 1432 -601 224 -281 491 -207 -658 842 -903 713 -503 660 -674 46 373 -818 634 -670
1318 -670 215 -1132 690 -328 -662 322 -536 181 -878 995 -936 339 461 -313 414 -381 766
1335 766 -955 861 -434 221 93 69 521 -838 1147 -339 532 102 403 261 -133 1000 -924 750
1353 750 -613 645 -54 139 493 -888 616 -488 489 -748 509 -225 -566 337 -942 406 -757
1370 -757 342 -781 -228 124 -801 85 -540 495 -1163 382 -481 -715 -279 -977 137 -930 318
1387 318 -1056 -69 -622 -479 -634 -834 447 -739 618 -852 198 -344 -83 299 -939 873 -363
1404 -363 510 -409 323 131 -260 833 -243 820 -249 751 -148 447 855 -93 799 -72 1098 -184
1422 -184 901 354 310 661 243 899 -253 1297 -38 551 657 177 459 -231 996 -381 849 -30
1440 -30 370 553 -517 224 -666 639 -650 356 -594 127 62 -901 667 -924 217 -921 51 -502
1458 -502 -244 70 -1045 24 -915 291 -1223 -4 -464 -799 -50 -775 51 -902 328 -739 -136 -410
1476 -410 -404 12 -690 506 -929 266 -174 -130 121 -281 542 -533 728 -353 391 160 407 442 -465
1495 -465 734 -315 749 -125 672 -94 -132 549 -55 797 -316 741 -102 647 262 -25 670 -272 582
1514 582 -129 639 -261 -96 170 -284 564 -696 419 -545 318 -418 -66 147 -355 347 -735 379 -728
1533 -728 -83 -375 -290 -72 -521 373 -803 151 -688 216 -119 -600 395 -779 417 -734 241 -337 306
1552 306 48 -220 495 -667 589 -440 426 -79 -207 363 -232 595 -372 735 -247 401 78 -27 473
1571 473 -195 750 -285 775 -134 489 293 -78 570 -264 652 -218 570 -42 234 292 -234 297 -427 508
1591 508 -580 263 -297 117 -105 -677 460 -391 466 -686 -163 119 -430 -19 -297 154 -522 678 -767
1610 -767 -282 46 -293 97 -825 578 -1195 27 -186 218 91 -499 7 -873 479 -967 146 -172
1628 -172 489 750 -524 923 -342 104 193 512 -173 -325 763 -434 391 -107 757 -437 386 26
1646 26 -322 467 15 616 214 343 382 -79 -148 254 686 -394 926 -915 241 -499 598 183 -334
1665 -334 570 -567 375 112 490 -250 80 -545 -654 345 -385 103 -511 -261 -76 -569 637 -686 167
1684 167 -258 211 -982 -345 -451 -318 308 -613 282 -1020 85 -1535 260 -117 -610 618 -412 737
1702 737 -681 -588 -529 64 -1136 -640 502 -1095 589 -231 138 60 -106 525 -193 469 -419 599 -122
1721 -122 373 -59 -33 858 -359 589 -202 664 -265 261 297 -31 436 58 536 -175 586 -4 141 -12
1741 -12 -102 770 -234 465 -250 -3 -17 -56 280 -370 600 -558 558 -96 -40 114 -68 310 -496 394 -311
1762 -311 205 -361 233 -217 -434 431 -599 59 -223 241 -145 -329 128 -206 202 -335 536 -394 517 -74
1782 -74 -410 733 -384 511 -395 600 -288 420 1592 -120 -60 -159 712 -473 270 -157 10 6 -281 498
1802 498 -286 292 -212 -22 -55 270 161 -347 381 -467 226 -370 133 -321 -194 136 -571 160 -458 203
1822 203 -429 165 191 -423 209 -277 370 -282 333 -446 10 -253 -261 238 -474 320 -586 356 124 -425 -155
1843 -155 54 341 -421 320 -497 -94 -187 -1 -22 -469 577 -463 1 -137 321 1 -5 507 -518 687
1863 687 -231 480 -238 309 319 22 475 -276 469 -234 618 -267 -89 512 105 297 -154 705 -493 361
1883 361 -51 -47 199 -16 435 -572 457 -82 267 57 92 92 -221 535 -549 -13 -166 -89 -225 -93 129
1904 129 -639 374 -204 185 -490 -106 -56 -400 576 -398 181 -614 100 -473 -133 279 -716 189 -372 373
1924 373 -311 293 -125 -296 39 -151 56 -541 543 -143 -196 -91 -18 200 -276 618 -428 307 137 236
1944 236 -77 -55 538 -493 458 -24 140 38 353 321 -256 572 -187 201 -138 283 -69 -69 500 -147 208
1965 208 41 406 -295 281 18 -322 551 -133 130 -459 346 -237 -725 371 -459 -80 -324 115 -554 -267
1985 -267 -67 -135 -440 -47 266 -742 425 288 187 -50 239 -251 -341 -56 -555 159 246 198 -1105 -988
2005 -988 747 -503 278 -874 198 2 -305 199 -402 488 -75 249 -202 516 -27 297 390 -66 290
2024 290 -406 484 -361 396 282 -25 477 51 282 -352 663 -257 -189 218 144 159 -404 598 -323 98
2044 98 -18 155 -58 -10 381 -356 250 -167 166 -166 -165 -356 -389 348 -609 174 -339 61 -308 -204 151 -177
2066 -177 202 -316 265 -708 -76 -89 -272 135 -151 254 -294 286 -192 -44 54 -252 176 -421 475 -559
2086 -559 78 -170 -49 -35 -81 437 -456 494 -110 58 39 302 547 -211 653 -53 180 -180 442 -170 -136
2107 -136 523 -229 285 -194 413 -45 63 379 -317 152 -194 -119 -409 300 -116 -122 68 -286 34 -538 389
2128 389 -848 114 -242 -463 -250 -205 27 -779 -135 -439 -249 -100 -65 -78 -635 396 -446 -77 -347 109
2148 109 -394 -496 124 -379 181 -131 -2 -466 -166 102 -386 301 -220 112 -140 258 -107 -254 59 -162
2168 -162 486 -268 476 -126 530 246 100 352 97 466 -155 526 254 107 124 10 253 -484 389 -53
2188 -53 240 122 166 56 45 426 -498 223 85 -88 -193 34 317 -561 135 -265 195 -413 79 -346 -300
2209 -300 234 -405 211 -259 105 -400 -78 -109 -332 84 -353 304 -582 290 -472 -230 -249 98 -414 -429 -42
2230 -42 -330 611 22 -156 149 305 -62 -589 453 27 229 139 84 -620 -531 227 -69 200 -670 554 -270
2251 -270 -281 592 -375 -307 -360 307 38 384 131 -418 4 20 144 -392 165 -51 -200 -341 -136 -376 -504
2272 -504 400 -150 -636 60 247 174 -253 -92 -978 124 -34 -559 264 333 -909 -360 -267 535 227 44
2292 44 1164 -16 -494 60 39 148 -687 535 -568 -240 -141 -19 269 -300 472 -230 456 143 -565 200
2312 200 -6 348 -417 661 -73 269 250 67 295 -82 270 -104 522 321 159 129 250 480 -115 378
2332 378 -109 66 197 183 120 24 211 -327 171 16 136 -269 -181 177 -103 198 -190 -105 -397 153 17 -504
2354 -504 182 -218 52 -298 131 -414 -106 259 -336 -34 -221 405 -355 406 80 -243 -107 -391 55 -324
2374 -324 206 -142 -76 -31 -121 124 3 354 -157 14 376 -60 61 -118 168 -71 271 -90 33 -66 583
2395 583 774 -106 712 -311 564 -1028 387 191 771 731 -374 95 -563 352 -479 255 -218 -128 -24
2414 -24 -235 150 -690 234 -352 -265 461 -560 301 -59 -531 -75 -214 409 -84 -83 -212 191 -522 200 -85
2435 -85 -92 -51 195 350 -100 323 -258 -137 -191 269 -144 -190 283 17 -204 87 146 -128 220 -78 -317 109
2457 109 -95 227 -271 453 -105 20 196 -38 131 -132 577 -240 298 238 47 23 257 299 -105 319 74
2478 74 108 187 200 70 -153 271 -147 17 19 344 -193 -117 231 -286 327 101 -51 -300 107 -272 -484 281
2500 281 55 143 -195 138 -247 -127 280 130 -67 -292 293 -440 170 -76 -255 -93 62 250 -414 263
2520 263 -65 34 108 264 -82 -19 409 -269 7 -132 295 -255 -8 265 -307 453 9 -84 -252 318 273 -42
2542 -42 353 89 25 -300 328 -322 -111 0 -134 -23 -191 381 -144 365 341 -127 104 -25 456 -136 87
2563 87 -112 -178 -29 -4 107 -191 287 -345 73 -284 -6 -75 -72 83 -395 -76 -235 -289 -160 -119 -47 -299 -36
2586 -36 -190 -231 -163 139 22 -179 -109 -230 59 -151 170 -483 -24 45 -275 -35 -37 241 -126 202 -176 -22
2608 -22 329 16 56 -163 140 15 215 147 229 156 -122 277 -23 273 268 352 -190 187 61 -146 -1 -37 298
2631 298 -628 620 -357 198 222 -289 24 353 -439 -370 0 -111 246 -440 410 -132 -323 -76 272 204 -83
2652 -83 -297 542 101 46 -268 -218 171 -389 154 71 -376 -120 271 274 -256 -337 38 125 -476 169 -189 0 -175
2675 -175 227 -487 -191 215 -199 182 -36 116 -161 247 41 25 319 -27 137 12 338 -186 -63 304
2695 304 -178 129 -33 92 -224 143 98 -228 -25 44 6 -134 161 -43 -99 214 62 -120 -226 303 -289
2716 -289 -212 -34 335 -198 -109 36 -717 -161 -264 -301 -205 79 26 -271 38 -257 -223 -217 26 21 3 147 -110 -261
2740 -261 -178 160 -267 40 44 -84 60 108 35 -292 166 -271 26 103 125 33 -29 209 -148 -95 8 112 -63
2763 -63 80 289 -12 156 142 86 -177 -18 84 -105 230 7 -60 -118 242 -203 -2 49 35 218 37 21 -119
2786 -119 -351 -47 -117 -163 157 175 -119 216 -97 -94 21 18 -104 -153 426 -308 -129 141 8 443 -400 -345 -303
2809 -303 382 -309 330 864 223 -406 -752 -357 265 202 -307 553 16 247 186 -387 -1 268 472 110 62
2830 62 159 -378 310 -236 135 -77 199 38 124 80 166 -50 -44 244 -152 134 78 75 221 120 84 -159 112 -18
2854 -18 95 98 -23 8 -260 280 -214 58 -154 -102 -106 -378 158 -14 -34 -213 198 -26 209 241 -75 66 114
2877 114 -7 -274 78 -145 -275 -26 -261 -158 -481 199 -164 63 -44 -73 92 -73 30 -245 163 -294
2897 -294 96 284 19 90 -44 274 20 93 56 195 257 -196 114 -69 158 42 52 267 213 203 -195 226
2919 226 259 177 -391 185 50 -47 436 106 -18 -250 272 -91 294 199 -325 -2 -46 78 -359 -30 -115 -193
2941 -193 -119 39 -161 27 9 -134 -39 -150 26 -71 -339 190 -314 12 -56 172 -264 72 251 1 187 -184
2963 -184 88 -151 225 76 -197 41 -157 187 -38 260 -252 415 90 -109 36 -35 8 -62 221 -110 105
2984 105 189 83 -51 -68 196 -134 189 -26 261 -13 -28 245 -93 201 113 15 -349 45 126 -46 82 72
3006 72 -179 235 -23 -179 -27 73 -235 12 -71 173 -179 128 -34 -302 133 -92 86 -401 64 -287 -94
3027 -94 55 -94 96 -143 13 -144 92 32 -61 54 -132 31 -440 5 -94 -335 8 169 82 -13 143 -261
3049 -261 -102 -136 100 13 -85 296 -233 79 -131 132 -122 262 281 -205 265 131 -129 -50 415 22 -60 176
3071 176 2 79 25 134 -135 53 163 12 135 11 16 -34 198 123 9 28 -181 39 -262 268 127 -15
3093 -15 -15 41 81 59 166 -254 230 -42 -89 -297 77 -94 15 -5 7 95 41 202 -9 -66 245 103 112 20 185
3118 185 -215 34 -37 -82 44 -121 13 -246 235 -81 133 108 -113 163 -223 240 2 63 -230 23 127
3139 127 204 311 -43 180 27 35 -104 -21 25 83 196 -70 90 100 254 -13 -314 174 -73 271 89 -281
3161 -281 -43 46 200 66 116 28 -82 -83 220 102 -132 161 -123 147 -110 7 -32 6 95 -65 -108 -129 146
3184 146 -15 -111 1 -99 -147 4 35 -310 -3 4 -127 -27 -508 -40 -127 327 478 90 -298 -275 282 -165
3206 -165 86 259 259 -994 288 461 290 120 -27 -127 -97 -631 294 -79 -333 262 377 182 270 -348 624
3227 624 22 162 299 -392 -109 30 23 -1073 471 28 -136 -137 18 -365 55 135 191 -120 -289 -246 -285 -182
3249 -182 340 -428 19 -430 375 -186 -148 95 -208 69 19 355 -234 129 -87 -460 272 -305 58 -427 471
3270 471 -166 50 406 194 340 -194 219 75 786 -349 -719 -717 610 -9 -643 444 -162 -314 23 301
3290 301 -241 -772 -16 -330 -209 -345 -62 -672 -111 -225 -562 198 464 2 202 -153 -188 190 463 49
3310 49 7 -390 -123 -49 183 -136 -179 -176 -31 164 -236 167 -249 -226 75 18 -247 -234 -140 10 208 -197 459
3333 459 56 374 350 -387 -109 201 -355 -153 -75 504 37 227 -314 88 63 307 119 -170 96 -312 -9
3354 -9 -5 263 11 184 54 59 328 65 172 -61 262 -144 53 -158 48 290 -124 138 -75 172 -61 337
3376 337 -145 55 54 -172 98 97 251 -20 -70 128 -105 79 -28 -179 174 101 -145 -80 168 -223 11 -202
3398 -202 -96 53 -158 -24 -224 49 -303 130 -528 -42 -95 19 354 -58 178 179 447 -116 418 388 53
3419 53 -458 -159 402 -262 -10 -122 272 -422 133 147 -336 310 519 -2 -18 224 13 37 67 -582 -104 -915
3441 -915 616 125 1012 -137 321 494 174 62 -405 404 -773 -522 57 359 4 -665 420 -75 -290
3460 -290 -582 -230 284 18 111 -657 14 -667 -538 -102 403 -610 -304 -248 -175 -233 288 127 -388 120 -556
3481 -556 -247 144 53 -168 -7 -449 -386 -319 -665 -145 -16 -339 108 -290 121 9 -34 -61 -375 -102 275 23
3503 23 404 93 57 648 646 178 -74 -342 -63 212 -233 -338 -138 -84 66 93 155 163 25 280 173 -204 252
3526 252 -3 54 164 161 -73 -189 -16 12 212 -89 -21 -93 64 15 -126 492 -108 16 -172 25 -10 -224 -238
3549 -238 -203 182 -109 -6 -65 28 66 115 85 36 31 -105 -46 -281 -20 19 52 -5 20 64 65 174 -169 51 67 -44
3575 -44 140 -91 174 -135 -56 7 -10 258 -115 142 -31 320 -10 183 -69 -34 101 -27 -4 -444 142 -199
3597 -199 19 158 -204 -177 282 1 60 220 -126 -93 195 163 53 -252 -57 242 960 394 -230 -347 -426 -126
3619 -126 313 46 609 -438 827 132 -701 -343 -68 -192 314 557 -886 -610 436 -422 -601 -205 -240
3638 -240 524 -168 -165 79 174 -188 64 -57 -560 3 -152 -185 193 314 71 -337 151 -42 -62 -288 -5 12
3660 12 195 -78 -327 -252 215 283 116 -421 83 63 108 -139 -205 812 -70 -140 -11 -294 -549 20 140 453
3682 453 -47 66 -116 -86 590 -685 -268 -171 -938 -327 155 15 -351 192 67 274 -192 187 -133 81
3702 81 301 -53 157 -249 97 -390 64 -73 -37 361 171 -305 -54 -463 -224 -536 7 68 49 387 174
3723 174 249 -391 368 -279 45 -379 305 -131 191 75 604 -173 -129 663 -718 188 88 659 -363 -113
3743 -113 104 -206 184 74 -209 -149 39 51 143 31 -132 226 -35 103 -188 148 -91 -326 128 -98 44
3764 44 166 -166 -260 42 -447 141 114 -101 15 -403 41 327 345 492 144 -718 119 111 -321 233 -45 -108
3786 -108 -296 -240 130 136 -95 -196 278 -90 -153 84 -69 48 -207 200 -76 87 -34 48 265 -109 118 50
3808 50 62 117 90 200 46 84 -466 160 -144 181 6 -18 132 -27 0 -18 57 -52 242 86 33 93 6 112
3832 112 -147 -75 102 26 -127 -138 50 -93 -87 -363 125 -54 -183 -63 -76 289 -38 -42 -220 -122 -190 -11 103
3855 103 87 16 70 144 -61 -50 2 118 13 -287 211 -75 15 -54 30 -31 223 49 -80 114 -99 164 221 70
3879 70 6 -63 90 265 15 -320 -19 164 247 16 17 304 -141 73 -294 -151 146 131 -3 -215 326 -68
3901 -68 68 7 -43 108 -60 17 35 126 -96 -123 116 142 96 67 90 -21 237 -25 150 -49 -70 418 -27 160
3925 160 22 -163 170 45 -212 -243 -114 -84 29 -9 127 -87 -293 193 293 12 -211 101 126 107 -187 -74
3947 -74 263 -81 106 -19 -239 -52 -109 -31 240 -124 22 263 56 -130 -37 8 174 130 -22 25 115 184 100
3970 100 -61 70 2 -114 94 -54 -91 -71 -54 -26 -37 137 28 -75 48 48 186 218 -31 48 21 -212 202 36
3994 36 -15 17 31 -85 115 -157 -157 54 -230 44 -26 -157 -174 -81 -236 -412 252 -81 -196 198 -165 239 -297
4017 -297 140 -51 224 -52 174 363 2 -254 -130 -61 -363 -94 -403 176 -309 32 -273 133 -41 43 478
4038 478 -77 133 -124 -99 606 77 308 68 -101 -97 36 -50 295 198 353 744 472 109 -4 -48 -268 94
4060 94 274 -273 151 -148 -320 -223 386 -33 -646 -66 175 -119 -350 84 351 -295 404 157 -37 -115 -69
4081 -69 -120 24 430 56 176 -182 338 -221 113 -54 -113 -280 -43 92 -42 123 -156 88 -71 -161 -49
4102 -49 -105 94 39 -15 -229 -32 -136 80 70 -74 27 28 101 22 29 33 82 -35 -36 50 -278 4 17 -51 -54 -52 -146 41
4130 41 68 -162 -114 -254 -99 -168 -147 -54 -180 -123 72 70 155 -104 72 12 111 -204 38 -101 -262 -290 -99 -116 43
4155 43 -26 -141 109 120 -143 -86 -61 -189 -132 265 -151 70 -39 -171 99 -134 201 58 90 -258 -22 18 -6
4178 -6 -10 -81 -91 264 189 -43 -67 32 49 -129 -175 138 -169 4 106 -126 106 -81 -4 7 -15 -67 52 -92 82
4203 82 178 218 145 -59 125 -49 156 -97 -19 -51 -152 -73 187 191 55 145 -40 -18 -134 -192 32 -196 -109 -6
4227 -6 34 97 49 193 50 148 89 17 -204 -27 101 -69 151 61 -32 -76 27 -94 354 -11 -147 -14 117 -214
4251 -214 -90 184 129 -248 -77 -240 -58 -21 243 130 19 30 98 22 109 -131 -195 269 -106 -33 -30 -57 65 -168
4275 -168 169 -67 89 16 87 63 -159 281 -295 56 -33 54 58 -48 57 118 -162 -100 -131 26 43 -24 -114 28
4299 28 20 85 -231 -96 44 7 -218 -165 231 -118 72 -273 249 85 -16 -49 49 -227 6 133 -131 182 64
4322 64 -128 249 36 38 218 -32 -169 40 117 75 178 207 169 -78 -147 2 121 -137 -108 -3 114 69 185
4345 185 291 -120 -102 143 -57 88 -122 95 23 27 -143 37 160 215 -159 153 92 -53 -9 103 -301 18
4367 18 -112 19 79 -130 48 62 -118 162 0 165 27 88 -214 203 29 -15 49 -188 -146 21 -214 18
4389 18 -72 -177 35 74 206 -69 -242 252 303 147 24 -16 73 -253 -116 -132 -287 -388 207 18 322 179
4411 179 342 184 221 206 -278 -139 489 -336 -174 646 222 -62 13 343 122 -269 -377 329 -389 1268 794
4432 794 58 273 -75 654 1102 -343 115 285 565 156 96 -163 -48 148 405 389 54 -193 -387 589
4452 589 -140 -469 69 -134 265 -3 -333 -295 312 596 -314 207 -55 245 408 96 224 45 291 39
4472 39 202 -9 20 309 -485 110 -136 119 -124 -193 311 -112 182 -216 416 311 178 -99 172 20 -7
4493 -7 20 -92 -47 -254 237 -134 210 -84 -245 -16 200 85 75 126 -39 97 -84 181 -309 -140 -115 -259
4515 -259 97 68 -6 -126 -234 -149 116 274 -75 185 170 -77 -54 -31 -238 -259 -56 -205 43 16 -381 -61 40
4538 40 63 218 292 -4 -41 189 164 -204 -222 288 260 -84 -198 -275 134 -72 386 -370 -77 -668 55 330 -258
4561 -258 121 -95 88 91 -228 -40 -64 -97 96 161 -556 17 334 -50 -451 -270 192 535 84 -166 -65 -165
4583 -165 115 325 225 -243 -159 23 -87 201 -230 337 -229 -415 106 239 554 151 282 -385 -164 -355
4603 -355 -55 171 840 371 157 -124 -598 14 104 -527 674 21 -428 597 788 225 -192 516 -100 715
4623 715 1 -272 145 424 50 -209 5 -130 -288 141 -155 -635 -182 241 -157 -71 -92 53 -53 240 171
4644 171 153 -184 -28 -101 77 205 -190 99 141 8 -95 75 0 246 -25 75 85 -152 -37 -90 -31 57 -104
4667 -104 85 -94 7 -216 131 92 174 -104 117 -175 -97 58 -82 -59 113 -11 -29 111 129 4 58 141 33
4690 33 -13 -177 16 21 83 66 -151 -159 -41 57 -140 26 -48 -68 121 22 -31 131 225 43 70 -97 -20 108 38 -46
4716 -46 183 72 -62 97 44 157 48 301 119 -89 58 -23 -140 -127 -24 -113 27 73 -163 1 -118 57
4738 57 -18 -45 37 33 -59 -100 194 -37 18 105 56 -36 -34 81 -41 211 -25 128 22 -135 139 33 -70 107 197
4763 197 -36 -124 -100 -123 179 -201 89 75 -121 39 164 123 9 -32 -208 51 34 -109 131 152 -56 44 -90
4786 -90 70 159 143 -87 -130 126 56 18 -231 -263 3 18 85 -119 32 162 -54 -50 22 266 -13 129 -101 -3
4810 -3 128 51 5 -45 21 -64 -188 -9 -134 21 -153 -10 -83 30 -58 119 22 39 137 136 78 355 100 113 -134
4835 -134 -77 81 -82 136 -17 6 -122 204 -186 -168 -274 -18 -115 294 49 129 124 -158 -30 -207 -45 303
4857 303 -91 41 193 -43 -32 119 -154 -123 1 -123 -74 112 72 -231 64 193 -60 40 -21 -149 146 -40
4879 -40 -204 17 -74 106 -1 -72 -27 38 -119 -204 83 -153 82 -35 -204 71 -140 -90 79 84 90 102 -8 67
4903 67 59 67 -21 60 29 -139 28 236 333 33 -143 -61 135 -47 -37 -58 255 -239 70 31 -139 -140 -53 -21 -48 -65
4929 -65 -162 -72 -61 -52 -59 143 95 -265 -160 64 15 -189 82 -57 276 -83 -189 -61 -218 109 24 117 -119 31
4953 31 -21 -103 186 -47 -28 29 101 -306 -7 -76 -124 -28 134 -119 21 -86 -321 -44 -24 -119 174 89 -80 -83 -55
4978 -55 30 -263 -217 -232 230 23 22 -260 128 -182 -129 105 165 102 101 -60 43 265 -47 -18 209 -28 -93 -78 82
5003 82 -325 -327 180 -239 -380 -240 -71 -5 -95 185 17 -834 -676 -62 -260 -459 -299 -316 -545 -50 -80 17 170
5026 170 -44 -114 -223 216 191 49 83 149 124 -2 106 -135 -193 -87 -1 -200 -67 170 102 40 -6 -113 59
5049 59 222 -134 -5 -114 -16 25 -18 54 78 -114 298 -72 -44 -33 -84 -137 -37 59 -147 103 -239 56 287 234
5073 234 -56 -21 -139 -11 -90 -274 -42 141 -64 -76 179 68 -167 309 -480 8 44 43 2 -106 110 149 51
5096 51 210 -143 200 -6 0 320 -156 -100 -49 -276 -271 -59 -147 204 -284 -54 -287 -223 321 -309 55 -281 287
5119 287 90 -9 260 180 -155 -280 21 127 117 415 -99 164 -244 -72 391 -123 259 296 -132 51 5 82
5141 82 -599 396 602 -225 228 484 312 -85 93 66 -177 401 215 448 -478 -162 40 -669 120 432 -58
5162 -58 -45 308 -496 106 475 -592 457 -577 -160 -388 -78 -99 144 -138 750 642 -467 652 195
5181 195 -25 355 107 112 -40 -49 -81 -274 49 330 492 599 -279 15 -126 -445 -821 853 -404 -199 -239
5202 -239 -391 -92 -413 295 44 193 75 134 50 -120 68 -12 16 -54 106 210 -94 300 -65 69 -161 122
5224 122 -99 -84 -43 115 16 -8 7 222 45 103 -57 -12 7 -292 113 -125 -146 -99 234 292 66 55 276 220
5248 220 125 152 -29 -73 -135 -146 -254 26 45 -89 168 162 -210 107 83 -262 -110 102 -215 -112 216 138 -125
5271 -125 -163 -137 265 138 -93 168 60 59 11 -48 -128 -106 -82 3 -117 -38 115 233 130 -18 -50 -16 122 -15
5295 -15 -96 17 -87 -51 63 -198 189 152 39 6 -79 -11 -15 -15 -63 -213 -79 202 70 -32 -7 -100 -178 -34 2
5320 2 104 -162 -74 136 -82 130 51 81 93 -37 39 -105 -10 -47 72 -110 113 35 -3 -51 -3 -201 51 178
5344 178 97 -153 37 -66 -6 214 59 77 33 204 139 -140 268 154 -42 34 -264 -71 19 269 -221 85
5366 85 151 79 64 -278 -72 187 -59 21 161 -64 65 -132 -155 90 42 -155 234 -93 212 278 -85 94 -112
5389 -112 -175 80 -50 -1 111 -44 197 -260 30 72 155 -164 63 169 31 -81 69 -87 -208 -75 194
5410 194 89 13 -76 19 -124 9 -94 201 229 -58 77 -38 -40 136 -343 -162 -43 -33 -28 69 170 52 -107
5433 -107 -190 -49 51 232 191 81 43 -96 -221 -414 60 -38 -16 -55 121 49 -36 53 -108 129 80 -140 -73 -9
5457 -9 -115 -210 71 261 41 -174 155 193 173 35 213 -144 -85 -116 -32 38 219 247 106 -134 -34 -63 86 151
5481 151 91 -163 -178 -9 88 -56 313 153 48 19 90 147 -113 79 -219 38 201 -25 -51 -38 44 147 94
5504 94 6 3 69 -110 -90 81 155 -2 -57 19 56 -33 108 72 -184 -76 58 6 -127 134 198 -99 -34 -80 -101 33
5530 33 -112 -139 26 -7 -108 107 73 60 -223 174 -2 261 -78 44 -9 87 -359 -110 -148 38 56 7 95 -122
5554 -122 8 167 -92 31 150 -240 32 -39 -134 52 -43 -55 -36 -149 -35 -9 197 205 95 -305 -213 -64 47
5577 47 -38 -44 126 145 246 123 -19 -92 169 -41 -24 111 -92 -50 74 -83 -98 126 147 -38 52 -39 -31 117 -68
5602 -68 163 8 256 -122 191 -19 120 -104 -40 -57 -82 15 -136 111 47 87 108 146 -160 -16 11 126 -123
5625 -123 -53 -219 0 -39 163 142 191 144 131 -8 141 -112 154 -10 -124 -83 -70 -222 -11 -19 41 72 78 47 -15
5650 -15 209 -234 -43 164 -109 -108 -366 -88 -253 115 25 -38 361 -122 -200 33 34 352 -58 -215 46 -89 107
5673 107 -153 57 140 168 170 -6 104 -6 -131 -47 -183 3 108 13 -52 -225 -58 -54 51 -9 41 224 -58 132
5697 132 57 -53 76 -1 -235 49 54 -118 -234 15 171 51 33 49 -149 38 42 -83 24 -30 12 165 -7
5720 -7 -20 60 -151 174 96 125 -70 39 -34 -9 -259 47 -92 -68 63 13 124 108 17 73 183 3 -26 14 73
5745 73 27 -31 -114 16 48 -1 48 149 105 -81 2 59 177 85 82 21 -106 -129 -112 -21 146 16 63 37 -117 105
5771 105 30 126 50 70 -277 74 -163 202 181 101 -7 -50 11 -88 -116 -296 149 -17 -137 228 18 -79 51 -238
5795 -238 1 137 70 -211 84 -101 76 -115 -104 -140 -202 -18 -40 -232 -114 -100 -113 -1 83 -36 -7 299 132
5818 132 100 -134 127 133 9 277 -130 311 373 54 61 54 106 285 16 -246 -199 -52 190 -135 102 168 178 15
5842 15 164 14 102 -136 -50 51 24 -90 -59 101 168 -4 -250 91 -203 76 -110 37 -106 -21 108 -156
5864 -156 -8 37 288 -141 38 -215 -106 -165 42 209 -102 23 -134 122 103 10 -63 -30 -102 127 130 -223 -146
5887 -146 -22 -42 46 -22 -79 -86 54 -32 -106 -153 -14 -182 -105 -70 30 -17 -14 -13 17 40 70 182 -103 50 -136 -147 -50
5914 -50 44 -60 -215 -88 -31 46 57 -135 160 -110 74 6 -69 123 265 -113 -137 52 30 -11 234 -158 5
5937 5 109 50 176 25 31 -98 -42 16 -93 -117 18 219 27 -269 -57 -359 23 173 30 -128 155 -51 -367
5960 -367 493 -415 -79 -169 -287 202 -291 -432 52 712 39 171 -182 9 -40 -198 -186 -304 -2 75 159 4
5982 4 -74 47 186 -60 3 29 79 -117 -145 157 73 179 40 -87 119 103 -121 -90 38 93 4 -112 -6 257
6006 257 -50 -249 66 -122 139 -46 105 269 -90 239 -14 96 -171 141 -106 196 121 -31 431 203
6026 203 100 73 22 -37 -53 -52 -57 -206 -14 -131 -202 172 199 97 34 37 99 108 95 -54 -7 12 -263 27 -145 -153 -7
6053 -7 -204 120 -221 -66 -153 -113 -32 -94 28 -51 233 69 29 -57 -284 295 33 -50 -146 120 -98 10 -228 214
6077 214 -325 -350 45 4 -115 74 228 106 363 89 -369 246 -32 28 63 -8 28 -274 -110 -57 -285 -155
6099 -155 -217 10 -189 36 135 -61 206 380 187 301 -87 -62 -172 110 3 -101 104 66 -53 -179 117
6120 117 91 -7 320 99 -358 254 225 106 264 -267 -466 67 -570 -61 536 -479 46 -304 21 104 -220
6141 -220 -50 113 44 -24 54 11 -96 11 -12 69 174 -178 100 -251 126 281 164 148 -49 -211 35 -61 -145
6164 -145 -61 -107 -58 -27 169 5 -85 70 109 -98 1 68 18 -52 152 83 73 -35 -63 58 -84 -65 -31 279 78
6189 78 241 -172 -168 -124 -60 16 3 139 61 -282 -212 -76 53 -27 53 -180 18 108 43 -57 -145 -133 42 181 -23
6214 -23 -41 -11 182 -39 136 -141 23 -97 213 -107 -20 32 -113 -49 -157 -194 66 -29 -112 23 133 61 -217
6237 -217 20 -114 103 -40 -100 291 -148 -149 -37 5 -142 -25 202 186 96 -41 68 17 -318 37 21 52 43 125
6261 125 83 11 -2 -215 122 105 167 31 71 -145 -92 -32 -26 -227 -73 128 72 190 -88 12 -258 280 -149 -62
6285 -62 80 -260 -5 -19 -11 103 -120 -31 57 60 179 9 229 -19 -10 7 78 -44 -31 -101 163 -102 -108 -80 -74 83
6311 83 86 -146 -126 -196 54 50 69 175 -101 -62 9 91 -50 -176 27 70 -92 -89 -87 -123 -278 -112 -83 172 60 -244
6337 -244 -37 112 315 -103 4 114 21 -65 137 26 148 42 180 -55 128 48 105 152 -128 -212 -43 -77
6359 -77 -36 27 -72 67 -91 82 -44 179 -131 -296 -12 -11 162 -48 -164 14 -101 -166 -55 -4 -129 13 53
6382 53 5 -52 2 -33 79 91 -96 210 121 -50 21 29 -114 -9 -113 -55 119 -107 -16 -185 -209 -150 -186 -64 -32
6407 -32 14 68 211 55 -78 190 10 10 -183 -133 -179 51 85 86 -58 143 -3 -199 118 12 287 87 249
6430 249 -111 94 -87 -151 -62 37 39 183 -183 98 -43 -103 12 -300 119 -229 36 141 287 -153 302 -17
6452 -17 180 154 472 500 -237 53 -571 140 151 999 -16 18 -469 -168 688 -675 -479 271 -157 27 606
6473 606 149 450 -176 57 -538 0 195 -103 184 209 171 180 -22 164 -22 -61 86 151 -73 110 -93 12
6495 12 -27 -41 61 -29 -195 -17 4 -106 -202 -10 -78 60 61 -19 -77 109 220 -52 109 206 42 8 -174 -232 188
6520 188 -160 -115 -94 25 69 9 -114 -76 -57 -65 -68 -56 -78 -277 -157 -147 221 -162 -26 127 108 -219 166 -75 101
6545 101 -153 -117 55 -69 -116 -319 -159 49 95 34 -89 -26 152 221 -29 93 165 -58 34 -20 12 0 63 -131
6569 -131 196 -101 -52 -31 197 49 34 321 -82 168 -85 20 188 52 -235 82 60 -7 237 -8 146 80
6591 80 131 -68 -62 -63 -19 -40 -121 25 -29 0 -17 -149 -72 -23 177 99 -63 185 185 284 -35 -31 -81 -58 -20 49 172 -69
6619 -69 -34 -31 -90 -212 -58 -104 -4 -23 19 174 49 241 140 -27 -56 118 159 199 216 106 -170 -10 -120 122
6643 122 -43 41 -6 60 9 -157 -46 51 -79 -201 -56 -67 -63 57 -213 -39 134 -294 -37 -153 -111 159 -126
6666 -126 -41 96 100 141 190 -94 -100 -99 74 90 108 -26 -104 79 89 -51 10 -146 63 66 26 33 -93 211 -80 20
6692 20 -24 56 25 -64 52 -118 -214 200 165 -33 -165 -233 -116 -40 22 138 -27 157 -11 22 -33 82 -323 -64
6716 -64 -123 -150 80 -232 39 -5 -29 -65 -379 22 -448 129 46 -708 -360 308 -311 215 -15 242 169 -26 -171
6739 -171 -168 -85 -156 -24 180 -320 -7 -167 -252 271 -30 66 6 -112 329 -4 -32 -27 -190 -49 80 -11 -78 167
6763 167 118 6 -115 -97 -12 -28 -199 -121 -181 32 32 -22 147 -137 -119 147 -4 -143 122 -264 -18 -35 17 -176
6787 -176 -4 122 15 180 -174 -237 85 -43 -16 -80 86 100 84 -89 167 10 -201 196 -41 177 -2 -27
6809 -27 -33 12 -11 -86 191 150 -81 -44 -101 34 -18 -32 -113 88 100 -88 46 82 67 -37 12 71 60 -73 -98 -58 -160
6836 -160 135 163 -33 172 30 61 -43 -171 -97 -112 131 -13 249 -66 90 -3 -10 4 -11 73 -7 51 -78 140
6860 140 185 -155 84 115 152 40 -111 -165 -82 -259 -228 -75 0 19 41 208 -55 137 113 62 15 45 154 37
6884 37 -132 135 -78 -87 -178 -166 -14 24 -21 -27 71 -95 -182 -153 -104 96 -276 -21 136 232 -26 -69 15 41 23 58
6910 58 49 -184 -92 -33 -51 245 65 20 88 -81 63 -270 138 247 -131 -75 -34 53 -61 44 77 56 16 35 111
6935 111 27 -165 -221 -39 26 -159 -32 -69 67 92 115 -10 192 -154 -157 104 177 -73 -32 -63 66 23 -133 -252
6959 -252 -172 -109 47 -67 84 182 -144 5 119 -65 -82 -23 46 -69 3 59 13 -7 44 36 -103 25 -218 46
6983 46 130 -52 -202 220 158 249 -82 -160 -89 -85 -240 -73 -29 -57 -155 -111 -184 -34 34 -43 155 20 -91 28 96
7008 96 -91 -18 -173 -213 32 34 131 74 191 91 -129 113 -8 -81 -54 24 -53 -370 8 -124 90 -108 121 -23
7032 -23 -172 -25 -36 -123 -89 -43 41 -65 -120 204 235 100 -49 113 -177 48 -98 -83 27 -11 -229 -174 80 42
7056 42 104 -174 -143 -31 68 -115 -42 -150 7 126 -108 97 146 -209 62 179 27 224 -21 74 53 138 246
7079 246 283 77 -65 90 -209 107 93 207 -105 -94 -134 -119 89 101 -49 -102 165 -25 117 198 77 8 -7
7102 -7 169 -276 -135 90 18 265 109 -258 -11 -320 -93 -230 129 134 -71 -137 -290 28 -653 -213 488 -292
7124 -292 311 327 294 273 -41 286 -180 513 93 110 -480 48 177 -642 576 -23 247 45 26 673 361
7145 361 367 -317 438 1211 -211 131 327 -749 -426 -24 482 -168 429 -261 -112 6 17 409 597 -267
7165 -267 530 -576 -358 -375 -619 407 -45 -599 -610 -304 198 -574 -30 426 -756 -28 -246 -234 411 -159
7185 -159 225 -271 154 195 348 196 -326 719 -279 -619 348 -522 -298 87 -75 -126 198 250 128 329 64
7206 64 -235 64 -152 -433 -183 -105 90 264 -122 116 68 120 -283 -539 -195 71 414 62 -66 -284 282
7227 282 751 -108 -161 490 235 223 -32 476 361 121 -98 174 143 -476 -111 -543 -480 -28 138 -230 154
7248 154 52 -181 -396 -343 -419 2 194 -18 -18 -167 243 -624 20 405 399 52 230 -372 -278 -50 -354 -83
7270 -83 -35 177 694 89 -35 -1097 465 -479 -683 -420 -315 -530 -82 -71 -368 -60 -560 200 75 -526
7290 -526 -585 654 -52 -413 630 215 -324 -240 -79 -98 -73 42 81 21 -97 -74 13 76 -306 157 -77 44
7312 44 61 40 216 0 22 135 149 -59 -26 -219 17 189 87 21 -1 -74 -394 -189 841 77 -470 -455 -42
7335 -42 506 -887 269 -284 525 158 243 -8 -449 -285 354 541 -362 -169 736 -421 -337 253 496 -462
7355 -462 -125 -109 -204 -141 -111 126 169 -110 -149 -146 -177 -87 -234 55 -35 -139 -684 16 107 20 -75 61 156 91 170 -49
7381 -49 108 149 21 -5 -359 87 170 -34 -33 187 76 -57 72 67 -353 -138 6 -14 -12 -22 -63 -176 -131 -126 26
7406 26 -69 223 108 -93 -207 52 -77 100 -25 -25 -45 -112 126 -274 8 42 98 -82 32 100 -168 -149 75
7429 75 -368 184 -69 -76 -46 -230 -50 -262 72 41 -46 176 31 -62 319 -202 32 -86 49 156 -143 -75 -377
7452 -377 -309 59 -97 -98 -180 45 -62 -340 -220 -145 362 -671 -399 539 -448 -139 -437 -277 -307 505 186 406
7474 406 997 25 -110 707 67 58 -465 338 -87 -2 -502 -146 -174 88 54 -746 -134 -228 -243 229 -688 -330
7496 -330 -285 -934 584 412 516 -311 356 -558 443 -128 -768 -81 543 274 131 68 660 -764 114 308
7516 308 362 229 -444 -319 -1 -386 -109 -61 173 265 -208 -130 107 -5 369 -71 240 -351 -519 105 -109
7537 -109 -195 -363 422 69 372 71 61 -238 51 144 -104 492 57 88 237 147 -71 136 196 -6 -100 33
7559 33 -103 -9 163 51 32 -91 -25 130 -46 -232 -50 102 -76 -105 4 8 13 -29 144 4 -149 -84 -114 137
7583 137 -105 27 -152 -127 145 211 -159 108 99 111 37 3 7 112 24 -87 249 62 -82 64 60 -188 100 75
7607 75 85 39 174 135 -103 -72 -172 -25 -200 84 255 23 136 72 467 -243 -22 -665 166 -410 -1305 432
7629 432 -83 -60 376 -351 30 -532 45 213 -87 -103 -119 6 -261 65 370 86 160 -202 -176 -118 247 -109
7651 -109 141 -2 -174 -93 -64 -64 100 -378 -253 -73 -182 -133 -57 -161 25 -217 -71 187 -16 -53 -239 13
7673 13 59 272 -216 77 379 71 142 -211 -67 -42 -582 -151 -101 192 -39 -66 354 -229 -457 -211 125 -179
7695 -179 -83 317 -432 -500 439 -528 129 125 -507 465 204 -561 -17 -21 475 -20 -591 50 183 111 108 172 420
7718 420 328 -386 477 -602 138 -127 -45 -103 134 -19 270 -177 -388 390 -295 184 42 -86 -175 -114 -112 -172
7740 -172 -152 -140 -200 23 430 -274 457 244 -596 -99 -161 95 -705 208 -79 17 397 30 43 336 -32 -89
7762 -89 -74 143 -6 -63 78 -134 283 3 246 -29 23 -273 79 -29 68 65 82 242 -149 3 133 26 -184
7785 -184 144 -66 8 -6 -105 96 -115 -42 34 -139 -251 101 -57 87 -23 -157 108 2 19 109 -55 25 -141
7808 -141 168 -201 -138 191 -68 -242 10 -122 -128 23 -15 -559 240 -149 150 293 -143 42 7 489 -19 -79
7830 -79 43 102 200 5 66 -39 -6 -243 33 26 113 195 -61 -87 8 174 -199 22 -56 -51 55 -32 -19 21 80 -81
7856 -81 -318 24 15 -159 184 -121 -59 237 107 -59 33 -113 -132 158 102 208 32 -21 259 79 45 -168 255
7879 255 -50 53 -4 -11 78 -172 -283 66 -160 8 -125 -46 190 -31 59 -18 11 -75 143 269 93 -59 79
7902 79 43 -25 10 -42 32 -152 -108 -68 164 -39 77 6 47 167 150 76 8 -198 54 -10 58 -273 2 30 -19 111
7928 111 10 -202 -141 -39 -15 -53 -116 31 -193 334 -16 -87 16 -144 -98 25 18 -273 128 177 90 -61 -47 128
7952 128 42 -96 -103 -241 9 65 -99 -4 24 -92 198 -99 -96 -37 140 29 -158 126 -124 11 -27 -220 -63
7975 -63 -74 21 220 -143 -122 -111 3 22 120 -163 -8 -241 -174 -29 138 256 38 149 155 103 -9 -150 -20 -155
7999 -155 -31 -218 160 54 -109 -84 37 57 -225 241 -71 59 -1 -13 224 164 -57 150 76 58 -76 -244
8021 -244 -129 -20 19 -43 95 95 93 6 -121 -48 -64 -402 -212 69 18 -112 155 73 -12 122 -91 141 109 -167
8045 -167 141 -89 28 90 -164 -246 137 225 -104 120 -195 -22 197 91 60 -4 -148 -125 -123 239 66 45 94
8068 94 83 -75 74 -93 -57 126 63 25 -199 -119 -40 145 47 145 -241 -231 -28 2 -221 -77 -60 195 -179 -69
8092 -69 19 31 37 -95 66 -18 -22 -2 -164 58 5 -66 -76 21 29 -43 -69 139 1 -166 288 102 291 29 36 23 126
8119 126 -141 42 -73 81 125 -145 59 -23 -140 42 -16 178 58 -106 57 3 106 24 -161 -132 -113 -93 -148
8142 -148 217 0 51 -75 6 104 57 153 -92 -14 -115 5 -48 -170 -160 -71 155 250 -50 -70 144 -36 -175 95
8166 95 -160 -128 -56 164 68 18 -309 190 -26 -60 -123 53 -15 -134 102 33 -68 154 147 6 1 161 206 -68 42
8191D2
$$ Imaginary data points
##PAGE= N=2
##DATA TABLE= (X++(I..I)), XYDATA
0 0 0 0 0 0 0 0 0 0 0 0 0 0 0 0 0 0 0 3 -8 8 -8 8 -8 13 -16 16 -20 24 -24 32 -34 40 -46 52 -60 68 -76 84 -94
39 -94 108 -117 132 -146 162 -178 197 -218 241 -265 294 -324 356 -391 433 -474 526 -581 645 -721
59 -721 806 -906 1026 -1176 1368 -1618 1968 -2500 3431 -5598 26336 6557 14906 26117 3998
74 3998 -1825 18685 15445 -8508 21130 7284 5266 -472 28385 1244 -4476 21894 -3121
87 -3121 -6690 860 8924 -23878 -2950 2804 -19450 -6389 -1257 1013 -21505 10450 -1794 -15526
101 -15526 -646 651 -12199 -19157 9441 -21416 -14649 -1654 -7513 -15829 -4793 10613 -18543
114 -18543 4726 6431 -2177 -7125 8985 3306 -17064 10968 -1231 -6131 -3608 13858 -4457
127 -4457 -3081 22258 -314 6227 12181 17632 -3323 12074 16322 -4460 7100 8740 8064 -8405
141 -8405 18141 7972 -3231 15815 12529 5136 3452 23240 -2078 4200 12382 2321 -2833
154 -2833 1228 11716 -13186 5324 7787 -2298 -1951 10985 4888 -9985 14436 -1064 -5016
167 -5016 -1654 4474 -9022 -10204 7791 -11652 -6064 -175 3834 -11878 3141 8467 -11641 3353
181 3353 2508 -1585 -11332 6692 -4249 -12464 3624 -2184 -4994 -5295 11964 -6570 -377 10534
195 10534 -52 -963 4097 9368 -10871 6146 4024 -5307 -1407 5651 2538 -7507 13864 1990
209 1990 297 6610 10314 -343 -244 13871 -5810 51 4316 2394 -7502 4114 6827 -8555
223 -8555 6724 4834 1938 -3310 10442 1099 -6721 7415 -1725 -5321 -4912 6033 -10969 -4467
237 -4467 5259 -6461 -3160 944 4706 -10345 4743 1782 -7638 -2439 215 -3862 -13137 5056
251 5056 -7183 -8362 -52 411 -5483 -3269 8668 -8222 227 2981 -938 -6656 899 2327 -11795
266 -11795 3044 -572 -3298 -4222 7430 137 -4441 10780 1035 284 2201 9086 -4749 563
280 563 7882 -4595 -60 2963 5071 -6352 7401 6237 -2357 6188 6827 3330 -2889 10914 -1548
295 -1548 -2300 4575 1317 -3044 -1762 7810 -6961 1560 4739 474 -2086 3810 4671 -8013 4354
310 4354 -685 -5003 -4612 1883 -4588 -8749 4837 -5412 -4225 -1175 3600 -6821 -1148 4851 -7228
325 -7228 -1883 -847 -1003 -9677 1791 -1989 -8839 105 -176 -2231 -4962 7079 -2983 -2499 4817
340 4817 57 -2591 -960 5889 -7536 439 3060 -2694 -1805 3482 4920 -4828 7393 2708 559
355 559 2574 6140 883 -3020 7856 -2738 -777 2053 3826 -2822 1493 7345 -3820 3529 4151
370 4151 2963 -3687 5464 1912 -5743 3459 -238 -2766 -4570 5045 -4255 -3404 4406 -1771 -1916 -408
386 -408 4761 -6704 303 1777 -5228 -3660 -762 -1211 -8952 3064 -2473 -4861 -246 1816 -1922
401 -1922 -3770 6287 -4012 -1913 864 510 -5205 -1408 3682 -7774 1449 1368 -399 -2354 4450
416 4450 1701 -3954 5999 1627 -790 -1075 5224 -3185 -2635 4408 -2326 -1066 1029 4957 -4491 3239
432 3239 4496 -2131 1652 2157 1294 -5218 4043 -1601 -4524 -334 41 -2977 -4106 4903 -4693 -1530
448 -1530 1651 -636 -4023 -646 1939 -8477 -562 -1871 -4304 -5530 -323 -2499 -7297 2108 -2746
463 -2746 -2898 -2433 2604 -4645 -3960 3169 -5361 -2878 -1714 97 -7082 -182 649 -5088 301 1013
479 1013 663 -3887 5315 -463 -2972 2719 856 -1688 -1629 4428 -3591 -185 3499 566 -213 2526
495 2526 5577 -3051 5102 3568 339 340 4104 1487 -3254 5883 -248 -411 1379 4447 -590 543
511 543 6951 -1169 2019 2602 3305 -2606 2562 2582 -4057 1799 879 -117 -3373 4404 -585 -2295 3729
528 3729 -11 -717 -1211 4212 -4277 -1062 1231 -2896 -2918 -706 1189 -6641 1831 125 -3293 -888
544 -888 1040 -1018 -4209 3507 -2787 -2476 -1227 -195 -4065 -3362 2818 -5306 -543 132 -432 -3284
560 -3284 1863 1499 -4599 1433 -116 -921 -2694 2185 -1680 -3191 2749 -807 -829 -335 4480 -2446
576 -2446 1212 3729 -1140 582 1131 2333 -3921 3378 901 -1679 1097 2206 1209 -2083 6157 -279
592 -279 205 2955 2303 -704 317 4355 -3677 1085 1431 173 -1638 2159 2358 -2894 3711 889
608 889 441 -692 3569 -664 -2598 3423 -1768 -1096 -790 1905 -3583 358 2359 -2195 725 496
624 496 1546 -3260 2619 398 -3115 101 112 -1145 -3564 3607 -2996 -1286 1699 -71 -718 -35
640 -35 3538 -3292 1369 1075 -365 -1803 1247 1114 -3968 3110 88 -441 159 2979 -320 -922 4272
657 4272 -1020 533 548 2773 -2284 512 2914 -2531 1166 878 1375 -2153 3514 1218 -1466 2747
673 2747 684 196 -1718 3495 -2265 -1204 1510 -894 -1074 -546 2658 -3477 1320 1362 -918 -764 1136
690 1136 470 -3950 2422 -1591 -1835 -950 574 -1568 -2454 2516 -2371 -422 180 1509 -2658 41
706 41 2095 -3718 686 -341 -516 -2746 1838 -395 -2543 1779 -53 321 -1228 3724 -1379 -474
722 -474 2557 -955 -471 96 2221 -2922 1853 940 -1002 496 1444 1961 -2199 3944 206 -209 1217
739 1217 1493 -557 -867 3313 -2496 262 822 1014 -1317 1162 2717 -2461 2081 659 389 -1542
755 -1542 1860 -255 -2613 2090 -1254 -541 -1383 2229 -1963 -822 2234 -1717 -328 -445 1388 -3242
771 -3242 831 79 -2673 -308 -460 -235 -3280 2279 -1414 -1377 630 181 -796 -1372 2487 -2450 98
788 98 173 -465 -1567 -112 1527 -2870 1517 249 -296 -866 1824 251 -1573 2815 -831 148 -326
805 -326 1887 -1543 -266 2429 -1299 725 689 2046 -1527 2174 1529 -1305 1574 549 850 -1762
821 -1762 2840 -684 -484 1738 172 261 -531 3227 -1842 1217 1502 -137 -264 479 1492 -2743 1937
838 1937 -617 -486 -760 1218 -76 -1861 2850 -1178 195 -89 1219 -1398 -258 1798 -2558 178
854 178 -515 468 -2212 1114 484 -2120 1472 34 155 -1209 2260 -1122 -1031 1469 -839 -482 -972
871 -972 2181 -2471 614 1035 -700 325 377 1663 -2315 2147 -48 -575 -167 803 -131 -1843 2307
888 2307 -1561 -115 157 828 -1155 -347 2001 -2358 735 -120 288 -1901 669 134 -2384 884 -771
905 -771 -226 -1387 1411 -1529 -1166 1116 -1212 -662 -1481 899 -2667 -267 349 -1878 -653 -450 565
922 565 -2529 1677 -512 -670 317 152 -200 -1746 2294 -1594 -127 596 660 -968 -206 1956 -1813
939 -1813 1658 751 689 24 1525 1022 -1136 2462 -197 854 -198 2175 -70 444 2859 -454 1408
956 1408 234 2205 -881 1539 1606 -652 1047 499 1197 -2155 2012 47 -505 1047 749 265 -1426
973 -1426 2345 -1510 1078 382 -180 -383 -690 1676 -2157 758 -432 -853 -1041 6 21 -2609 1175
990 1175 -1491 -799 -1431 302 -1112 -1447 852 -2303 -402 -1135 5 -2259 -592 145 -2533 267
1006 267 -747 219 -1825 966 -890 -1557 636 -675 -232 -1245 1723 -1647 60 758 -382 -39
1022 -39 -106 1526 -1728 1331 392 -40 29 968 684 -1317 2355 -536 654 457 1443 -69 -290 2210
1040 2210 -1074 1141 329 1083 -649 856 1129 -1473 1504 -156 696 -703 1431 -66 -485 1019
1056 1019 -423 359 -846 1550 -1567 287 702 -941 26 -390 997 -1990 850 -450 -755 -267
1072 -267 39 -40 -2060 1262 -1218 -298 -165 -340 -620 -781 1059 -1886 333 -364 197 -1044 401 672
1090 672 -1764 1195 -616 350 -825 1117 -446 -828 1279 -448 772 -474 1652 -895 525 1207
1106 1207 -711 603 10 1189 -1180 1551 178 126 626 330 557 -1180 2156 -719 303 727 154
1123 154 81 -233 1346 -1471 605 -157 164 -501 44 507 -1670 1059 -633 -281 -799 376 -771 -1032
1141 -1032 950 -1284 180 -897 928 -1163 -391 479 -1205 -98 -652 115 -1572 697 -335 -919
1157 -919 524 -389 427 -1237 1330 -741 -33 433 -319 165 -457 1352 -1692 982 284 228 70 304
1175 304 853 -925 1540 -188 643 214 829 387 -466 1689 -738 697 -231 960 -621 -42 1282
1192 1282 -856 901 -147 853 -680 1181 183 -568 960 -569 258 -836 896 -801 -240 403
1208 403 -326 -31 -997 884 -1636 401 -131 -366 -247 -887 248 -1209 484 -766 -230 -346 -30 29
1226 29 -1146 1095 -1570 659 -299 100 -1292 -139 660 -1575 686 -318 177 -751 515 85 -725
1243 -725 896 -610 355 -649 1459 -351 172 604 -525 237 -362 1076 -936 1478 421 133 507
1260 507 20 962 -919 1276 -38 283 301 280 288 -599 1711 -934 731 88 348 -57 233 740 -882
1279 -882 843 -267 633 -253 399 332 -596 1040 -794 395 -166 666 -414 9 257 -791 368 -719
1297 -719 844 -1058 333 -37 -645 416 -718 440 -1216 694 -794 -464 296 -252 -13 -845 846
1314 846 -953 295 -235 -17 -158 -241 526 -1170 733 -696 311 -234 -82 -142 -821 920 -681 346
1332 346 -393 626 -284 -220 652 -746 604 -632 730 -880 241 56 -552 390 -458 82 -833 706
1350 706 -336 -392 156 -268 284 -741 820 -952 329 -264 -13 -68 -311 503 -1073 619 -880 -112
1368 -112 -379 -65 334 -752 776 -840 299 -269 197 -90 -270 664 -932 905 -471 684 -394
1385 -394 663 -42 -364 473 -84 499 -279 1330 -95 195 509 60 782 -406 931 -422 671 586
1403 586 185 544 -31 1294 -403 1203 -82 581 170 274 635 -358 1252 -256 806 -58 475 207
1421 207 -446 732 -338 588 -737 367 -175 -70 405 -899 323 -762 235 -926 473 -610 -318
1438 -318 274 -524 991 -672 412 -1295 -258 -9 -1098 214 -792 20 -890 165 -456 -501 -235
1455 -235 -324 195 -1016 558 -966 12 -237 -109 97 -321 564 -829 443 -431 371 -41 -52 95 -231
1474 -231 833 -122 663 -293 558 69 169 761 -315 808 -193 583 -24 446 584 -116 973 -383
1492 -383 895 -302 667 -231 167 355 -30 475 -546 876 -540 351 -51 11 126 -458 626 -716
1510 -716 566 -422 164 -323 -350 434 -913 580 -649 241 -421 -182 -189 -373 159 -842 345 -1070 322
1529 322 -636 0 24 -762 263 -739 449 -686 306 -331 -50 290 -534 343 -724 660 -434 221
1547 221 174 -170 374 -315 851 -480 844 -187 343 43 -173 251 -420 722 -527 502 -123 366
1565 366 230 -247 561 -247 528 -262 404 -22 -39 210 -517 504 -432 401 -473 256 63 -241 138 -446
1585 -446 516 -699 262 -109 -5 147 -483 282 -664 213 -700 478 -756 22 284 -212 545 -972 447
1604 447 -358 190 -531 -340 6 -658 174 -726 685 -671 -29 510 -396 -144 -130 910 -551 846 -735
1623 -735 702 61 267 896 -344 767 -278 675 -94 507 765 -168 901 -738 741 -247 947
1640 947 -118 -283 -16 -379 508 -625 307 -75 609 290 75 397 -562 486 -708 361 -694 -95
1658 -95 -10 -586 396 -355 277 -433 175 -369 -133 -109 -440 237 -503 5 -496 263 246 -377 -384 -533 1115 -66
1680 -66 700 -474 300 -209 -48 427 -492 512 -377 -81 -249 644 -195 358 -276 -438 788 -307 974
1699 974 -279 293 679 235 1058 -340 767 238 756 -746 -80 977 -251 475 200 729 181 528
1717 528 414 -89 246 50 584 -332 868 -11 234 314 -18 702 -255 753 -378 291 -108 13 -39 -326
1737 -326 625 -535 347 -498 326 -286 23 197 -416 376 -500 95 -635 352 -191 -471 150 -444 145 -509
1757 -509 501 -483 85 -164 -395 -166 -301 446 -870 374 -218 -234 -78 -127 126 -336 439 -596 367
1776 367 -222 -408 -203 -68 295 -629 666 -194 615 -9 -266 419 -33 804 -392 439 -386 632 -130
1795 -130 126 297 -285 340 -255 176 -399 357 81 -195 155 -259 438 -384 483 -92 -184 -6 -129 247
1815 247 -433 447 -328 109 -42 -12 -27 -509 414 -734 272 -307 142 -234 -146 74 -502 538 -162 449
1835 449 -24 206 120 -244 639 -531 265 -34 209 -13 232 -39 -370 540 -32 389 -227 622 -33 -101
1855 -101 539 183 659 -133 641 -358 246 280 -29 352 -142 587 -401 640 -21 368 143 6 524 -316
1875 -316 478 -441 172 2 163 -153 -381 313 -548 144 -411 71 -528 -33 -56 -773 -81 -426 -56 -523
1895 -523 -27 -399 -342 142 -372 53 -414 325 -524 39 -135 -407 0 -483 235 -616 392 -172 -66 124
1915 124 101 267 -620 666 -414 397 -87 275 21 -205 736 -435 308 50 337 -59 222 461 -212
1934 -212 645 -109 423 -347 484 -78 -75 604 -140 174 -213 468 -154 120 150 -230 135 -356 407 -214 444
1955 444 -249 -65 3 -255 127 -462 421 -629 8 -441 -186 101 -288 367 -710 -79 -262 -108 -410 -358
1975 -358 273 -684 185 -168 -65 -285 54 -107 -525 839 -340 -142 -77 385 -547 39 295 7 27 -55
1995 -55 459 7 711 -415 -68 166 933 205 -537 429 163 384 74 22 56 -211 505 -299 463 -120 80
2016 80 78 230 168 -381 320 -286 178 22 203 342 -502 407 -236 132 -195 179 -219 -102 131 -396 211
2037 211 -192 241 -437 197 69 -373 193 -187 206 -606 193 -227 64 -24 -123 -204 -507 465 55 61 -159 -256
2059 -256 -131 111 434 -648 375 61 58 61 184 66 -357 501 -437 103 -42 327 -12 268 517 -410 561
2080 561 -47 342 86 113 183 24 737 -102 441 -111 521 -342 160 265 -280 485 -357 417 -153 119 68
2101 68 -218 -6 -100 242 -496 397 -243 54 83 -78 191 -502 594 -675 -41 -315 -159 -528 -227 323
2121 323 -584 146 -467 -14 -446 -44 -227 -676 161 -395 -12 -451 102 -452 -27 334 -206 308 -26 366
2141 366 -491 417 122 -430 125 113 255 -319 634 -38 225 410 282 434 38 764 -227 430 375 100 -153
2162 -153 -228 538 -249 465 12 181 -25 165 -42 -284 635 -240 208 -279 481 -234 181 366 -378 32
2182 32 -370 69 -426 51 -168 -380 198 -295 105 -524 291 -319 -401 265 -154 216 -303 139 -580 45 39
2203 39 -232 -15 -158 103 -419 215 -84 -110 -111 23 105 -316 570 -118 156 20 85 -19 279 176 -110 145
2225 145 -158 26 -260 8 364 136 19 -518 303 81 597 -62 694 425 -688 321 -769 1283 -101
2244 -101 417 -263 -106 -491 332 794 -429 647 355 586 292 -113 -122 -162 335 -213 25 -258 -320 -40 53
2265 53 43 -593 150 -275 -547 -331 280 -225 -621 -373 773 -531 -185 330 274 -699 317 -1103 -99
2284 -99 -582 43 -120 1157 777 -15 -175 -497 -584 -29 1632 -287 503 139 215 69 242 169 198 450 252
2305 252 6 -57 -210 196 -537 401 -56 155 -94 369 -74 -474 284 -299 143 -164 489 -136 -200 216 -252
2326 -252 40 -295 274 -425 51 -22 -239 -120 -79 71 -497 -130 -407 -98 46 -141 75 -675 367 -748
2346 -748 -13 184 123 -237 -350 342 -469 326 88 -18 -91 294 220 -207 397 132 230 110 208 -261 -329 240
2368 240 -223 322 124 261 -23 81 401 -335 330 1 119 -213 208 120 6 238 -58 253 -65 784
2388 784 -145 616 -12 10 -496 -484 -90 -610 639 -237 230 -271 527 156 -952 230 -648 -732 363 30
2408 30 -317 -531 12 -629 -84 -161 466 -803 382 678 -222 -130 336 -418 84 -136 -532 16 61 -293 179
2429 179 -151 651 -481 -69 119 -15 100 -259 -250 -20 257 -13 37 365 55 -1 12 377 -180 104 40 -76
2451 -76 -72 92 325 -51 212 1 240 -283 -31 324 -307 290 -304 127 -268 219 -93 -161 252 50 62 -54
2473 -54 132 -119 69 258 -360 155 101 -39 -258 261 -50 -423 13 -1 105 -479 325 -469 -120 -119 -61 -194
2495 -194 110 109 -247 109 -37 0 -144 172 218 -444 163 -94 148 -312 185 -170 -313 180 -406 418 198
2516 198 437 64 7 230 -386 169 148 0 -400 279 69 -17 258 -157 194 -231 591 -258 124 62 196
2537 196 56 -55 336 -328 368 7 -45 -121 237 -18 -352 385 -113 -86 -42 -242 -149 -247 192 -161 -79 -31 -76
2560 -76 -429 -29 128 -320 -57 -22 94 -244 -85 -14 -313 205 25 -96 -364 149 -127 -249 133 -103 101
2581 101 160 222 -311 187 -32 37 144 58 353 -208 269 -107 108 107 262 105 19 383 41 139 281 252 -24
2604 -24 164 311 -278 364 -209 -262 -146 347 97 -134 217 130 -59 -68 610 -63 26 55 -126 -290 -428 416
2626 416 120 91 -241 -356 -203 311 66 -816 -250 -419 115 198 -376 -156 -337 -84 -55 -185 148 181 -823
2647 -823 405 80 -11 208 163 -9 -351 166 321 -451 -90 -251 -285 58 411 -309 242 -139 -330 82 50
2668 50 69 -89 370 -230 -110 -93 187 -141 -268 259 -30 -44 135 15 -11 102 229 -432 -108 -347 99 -152
2690 -152 -137 264 -118 239 42 -19 -115 17 -254 -66 163 -138 -89 -101 208 -270 -102 272 -171 119 159 201
2712 201 -213 279 25 -33 396 -154 128 -193 42 16 -176 388 -13 -10 141 271 -51 271 -61 -122 -225 -183
2734 -183 123 -280 343 -38 59 -183 40 -258 -57 283 -449 307 -50 5 -95 -140 260 -340 281 69 145
2755 145 106 218 189 -87 244 -135 137 -74 267 -99 -69 -97 -36 -40 18 132 -301 46 -17 -186 -89 -217 38
2778 38 -523 181 -330 -28 -55 -68 3 -37 188 -245 219 113 287 -198 29 68 -387 239 -100 -157 -147 -145 159
2801 159 -121 318 51 507 54 730 -113 520 211 65 205 -68 471 -593 -454 116 218 13 21 -338
2821 -338 110 256 -282 -215 258 -153 101 -12 76 -211 196 36 62 4 -102 5 -186 231 134 131 -86 55
2843 55 89 -29 189 -140 -98 -47 -31 -58 125 284 -138 -25 -29 265 -348 108 -61 -241 87 -241 -117 -191 22
2866 22 -74 -138 65 -120 214 -388 257 -200 145 -85 -192 -313 -260 123 -133 324 -54 91 -57 212 3
2887 3 -44 333 -94 101 -254 95 -73 -35 90 -101 121 5 126 -82 157 272 12 162 -9 -20 -207 152
2909 152 90 172 139 -130 157 -145 239 -261 30 -48 -85 -183 -268 20 -466 386 -32 -215 38 21 -29 -157 142
2932 142 -172 -26 66 135 -141 52 89 -122 30 -201 101 -145 116 -117 -43 -154 -39 54 -80 301 63 28
2954 28 -28 -360 26 -153 148 -106 181 74 -167 47 88 216 -330 339 219 37 122 13 58 -163 109 -346
2976 -346 -81 245 72 -100 278 -14 -186 186 86 -5 -224 125 150 -65 43 -36 -61 -77 81 -144 -133 42
2998 42 -92 67 -240 261 -452 92 -65 -203 -146 -137 -172 37 15 -129 -107 31 -237 9 -163 95 -308 -27
3020 -27 -120 32 118 -116 185 -202 236 -3 -60 -6 188 141 -215 177 -79 119 76 132 -1 77 265 -141 343
3043 343 102 263 -343 238 -64 -19 -19 62 167 -263 224 21 -144 6 99 106 -56 319 -371 155 29 85 110
3066 110 206 106 -68 50 -48 -124 -249 212 -48 -105 140 5 248 -49 38 -139 -26 229 -118 -46 -145 20
3088 20 91 -2 98 -107 89 -69 190 -90 223 -123 -272 316 54 197 -42 292 -325 209 -28 -159 30
3109 30 224 391 -220 316 -40 111 192 368 140 -26 223 -66 71 -128 254 60 -127 154 30 118 33
3130 33 341 -118 65 52 48 101 -195 20 -142 138 163 -30 96 -51 87 -169 -16 -451 -82 -49 68 277
3152 277 -65 54 -190 204 -170 -26 -68 108 -132 -50 -6 -164 -143 105 -2 69 -230 30 -53 -64 -138 179 -19
3175 -19 75 100 -214 97 -333 -48 -7 -35 -124 -191 418 -148 37 -30 460 -281 165 24 -55 160 -122 -317 -195
3198 -195 335 -339 -341 -146 -164 -11 -72 919 -275 11 -309 -101 165 -732 -76 -811 -336 -316 157 -220 -55
3219 -55 -718 -237 10 -542 -22 -335 229 -245 437 273 63 365 -259 -566 113 336 207 -109 149 -155
3239 -155 -35 -75 -196 -77 -504 359 73 277 210 65 -729 61 173 260 -516 111 -358 -200 355 -115 -361
3260 -361 -17 310 90 -132 20 110 -232 214 -143 -54 -359 -307 265 822 -191 655 116 355 246 136 93
3281 93 125 -248 426 625 401 -336 307 204 -384 186 1106 93 131 315 133 -266 -545 22 -1150 413
3301 413 -378 -355 -286 -253 -61 396 309 109 437 -681 0 155 -565 401 -241 471 -360 -147 -405 299 -138
3322 -138 -118 39 454 88 -234 181 288 8 65 462 -329 -386 -16 -495 9 330 -119 65 -75 88 -157
3343 -157 304 -323 8 425 204 -115 -224 185 18 195 182 337 -40 19 335 -21 192 17 162 110 123
3364 123 149 27 71 -414 242 -147 163 137 -109 157 -145 26 8 225 -165 157 -26 -53 8 11 -68 -204 -114
3387 -114 -103 208 -10 -31 -279 -179 191 147 -85 99 -60 -64 317 244 -88 239 -340 119 132 104 -29 -25 103
3410 103 163 257 -192 180 110 -171 96 203 146 -322 -149 -84 -118 27 -4 386 -130 321 176 -180 -127 44 -108
3433 -108 -218 49 719 679 -247 399 410 131 -203 654 -467 703 580 206 104 -23 573 589 379 278
3453 278 -199 448 -155 -289 1400 -321 -6 -385 -317 49 -1075 458 -146 -353 237 -15 -80 69 295
3472 295 -498 21 -115 166 128 -62 632 96 306 -159 110 -98 -21 -73 634 -251 -98 299 -235 -120 -331
3493 -331 55 -115 197 240 53 266 213 410 171 453 -52 -165 -346 124 510 72 285 -398 381 486 -5
3514 -5 216 -258 26 381 73 -216 79 -38 27 -102 7 16 169 27 -179 -242 -173 -1 -291 -212 47 -172 217
3537 217 -239 -71 -207 74 -210 49 19 110 131 -125 105 -168 41 111 -40 105 -224 74 237 -44 -197
3558 -197 162 -55 -189 175 -126 6 55 54 -34 52 -155 73 53 -71 52 100 215 159 144 16 23 257 -80 254
3582 254 121 37 190 -240 143 -105 -82 -236 51 82 -68 199 154 0 144 -109 -790 184 -590 396 -116
3603 -116 -519 103 -397 86 273 99 -3 268 218 -502 366 1052 123 -349 -184 134 -716 101 244 -216
3623 -216 -27 368 -27 266 572 170 516 -285 54 -21 132 300 14 77 -253 457 179 -235 363 245 340
3644 340 -41 -183 556 145 14 25 -130 -225 8 170 -52 17 5 -260 139 252 163 -493 79 -236 591 -139
3666 -139 162 187 -773 115 -286 -325 -202 -459 230 -126 36 19 48 260 -394 -238 -35 398 -477 703 435
3687 435 -371 301 -195 193 -299 -172 262 351 79 -89 31 -475 -22 310 -220 -64 -178 1 -245 317
3707 317 -126 4 110 11 264 102 282 198 55 245 83 -77 403 60 -188 106 389 -187 251 -639 251
3728 251 94 370 221 284 408 418 254 -260 -91 -83 -301 -358 -394 449 402 -113 298 246 39 76 187 -74 -101
3751 -101 42 -88 -153 -47 -37 21 -66 118 -95 -117 -262 -152 -55 -189 -82 431 -531 -752 -321 16 46 -631
3773 -631 -89 -312 -662 -137 -62 -416 -325 115 -140 -169 167 -122 -124 -195 -19 -24 373 -148 -47 -218 13 -6 -276
3796 -276 286 -21 100 25 -231 142 158 -27 128 77 17 -45 -169 -333 -5 -312 -102 55 -252 -184 -228 85
3818 85 -40 176 -131 35 -174 169 84 -244 32 9 86 -125 73 9 -16 65 31 161 -30 20 -121 30 48
3841 48 81 130 -37 -42 -87 -85 -2 366 200 -55 -268 130 282 -171 -60 85 6 -114 -153 82 -8 148 97 -3
3865 -3 -228 127 -22 92 70 -53 55 -171 -15 33 -82 37 -135 -110 -24 68 -55 32 147 -42 -120 -67 -95 -13
3889 -13 -82 -110 -138 -262 -143 -76 7 -196 101 -180 -140 74 -10 -144 150 -122 115 121 -139 68 -19 66 117 43 -30
3914 -30 52 48 -154 -184 183 19 -3 89 -116 -35 98 -42 200 38 -2 65 -200 -128 -21 -35 79 -50 39 359
3938 359 32 -166 -173 -25 64 -78 62 -219 -8 -125 -9 -40 151 -98 -25 172 167 16 -48 399 -106 172 24
3961 24 -114 130 -301 24 -108 48 -53 -11 -131 43 -108 -187 128 164 -26 56 119 97 -213 7 -212 -144 -203
3984 -203 123 90 111 116 -155 -63 41 113 163 148 -47 52 51 -101 118 -437 246 310 82 15 105 -203 -79 72 112
4009 112 168 -38 640 -5 -224 -28 226 182 -159 -282 -20 61 -25 132 -30 -5 175 54 -134 -344 -46 272
4031 272 -151 -68 -45 -278 106 174 -175 -379 -207 226 -228 520 -48 -470 -186 194 720 -419 -491 43 -278
4052 -278 -410 444 -915 -13 50 275 528 -442 -520 347 49 -137 197 -408 -13 -373 393 -14 167 230 525
4073 525 -483 -291 855 -56 194 205 -176 -129 -183 196 93 -101 24 -7 13 -88 27 52 174 48 -27 169
4095 169 -96 -27 -27 114 97 105 -85 -46 163 -25 -47 -137 113 -213 60 5 31 -3 153 136 160 123 -15 -77 -120 25
4121 25 13 36 -13 -120 -31 177 -86 63 -110 85 38 90 -192 13 276 -75 -41 151 125 -218 103 -7 -111
4144 -111 179 329 92 53 -30 86 165 120 185 79 25 84 -156 14 -129 -75 -118 138 -74 10 -79 -4 201 -28
4168 -28 6 -56 41 -50 -11 238 -55 111 -148 165 -41 255 -174 -108 149 -57 184 111 79 -100 57 33 20 49
4192 49 -34 150 -6 44 109 23 308 -147 127 -123 19 -123 -171 -96 -10 -101 -231 -141 -137 110 -45 -193 -189 -5 118
4217 118 -85 -97 -79 9 -101 -28 206 113 238 -246 -133 -189 120 19 56 144 -113 354 140 16 47 103 172 14
4241 14 99 98 -41 -242 3 32 -58 -10 -128 116 132 -99 162 -50 -105 -139 189 51 -240 39 -99 -166 -74 141
4265 141 164 96 45 -93 -75 217 -115 78 -206 100 -93 -109 75 193 -48 -28 306 -131 15 -91 81 -93
4287 -93 126 -131 -57 -38 199 -230 1 50 -166 83 19 95 -1 88 79 -109 32 10 -180 -9 -73 69 -39 -197
4311 -197 66 -186 -34 -232 -21 -136 -31 -284 218 -72 -270 257 43 172 122 2 -63 48 -268 -154 31
4332 31 32 -147 -127 -130 159 -74 -258 -106 70 -173 44 67 89 84 -69 227 -19 -36 62 19 -22 194 -118 -44 274
4357 274 -150 -88 13 -24 71 153 35 -12 -73 100 -145 -179 46 -248 -212 -123 -58 109 -49 -257 150 86 -147 211
4381 211 90 21 -164 142 38 -93 122 -37 -52 64 191 -176 134 -12 -14 -232 146 217 18 -106 449 -182
4403 -182 80 -43 -92 -372 -143 238 278 354 -467 -6 -10 51 -155 417 101 199 59 -181 64 -912 -249 -15
4425 -15 -53 -443 179 56 -714 -213 -99 328 255 141 327 32 77 491 76 273 -823 211 461 -53 74
4446 74 981 337 33 93 204 303 -144 -307 193 74 393 58 460 -21 227 441 110 -72 -61 350 -189
4467 -189 468 313 -163 -219 247 575 548 480 -156 -172 -35 398 206 -100 -241 -251 406 197 -97 -286 -382 -278
4489 -278 -197 -209 23 -39 -295 44 70 70 -38 -288 12 -160 232 -103 96 -25 193 -35 -136 61 -101 -51
4511 -51 -173 -109 319 303 -42 -163 25 7 -35 -68 112 -286 -31 315 181 -13 36 250 27 -140 -92 170 183
4534 183 -52 -71 73 35 -91 279 -20 -184 -392 47 -117 -282 235 -304 427 -139 -260 157 107 11 -283
4555 -283 -180 141 264 224 -194 -35 -296 -193 -51 -140 477 128 -317 187 -340 -352 -76 -159 2 -189 -46
4576 -46 -44 518 383 555 -66 22 -429 -121 69 -436 -176 -291 -72 165 80 22 -428 105 -37 104 407 -116
4598 -116 -749 259 605 -192 148 372 241 -362 -958 -344 -33 -509 37 793 138 -85 -110 71 -306 330
4618 330 389 7 125 233 118 -399 323 52 -91 -318 486 35 -449 132 324 63 136 -54 -448 -307 18
4639 18 -1 -342 85 -53 -18 145 -141 -115 -59 69 5 111 100 -400 -246 -76 249 -45 306 30 73 131 -80
4662 -80 -22 -160 -38 7 -101 2 -99 46 4 -184 -13 169 -111 30 81 -177 -227 -97 32 240 -10 32
4684 32 35 128 -103 -140 101 153 -175 -62 -6 -92 -95 -413 -20 13 213 56 54 -15 -94 -227 19 -3 -98 85 -188 278
4710 278 135 15 -177 163 -176 73 207 60 -140 146 -76 56 -8 -63 -70 -97 -102 -81 -320 -21 -139 11 45
4733 45 8 23 69 6 111 -156 81 -8 46 178 75 56 207 184 -2 60 -85 7 131 -55 110 -4 23 -121
4757 -121 197 -17 117 114 39 -125 6 -16 -109 134 -46 40 -180 103 -29 -158 142 153 -75 -135 36 82 -43
4780 -43 77 -82 -24 47 12 248 129 91 136 -142 -154 61 -112 7 18 83 25 135 -69 -384 -297 -18 112 9
4804 9 23 -233 197 -54 59 -92 -30 101 -109 108 -47 -30 -175 -118 26 108 34 -57 -294 183 -70 52 232
4827 232 -134 220 34 59 36 92 159 62 -24 -141 -26 260 144 -122 140 223 -191 -217 309 -108 146 264 -199
4850 -199 -105 -166 -17 -43 -22 -151 -187 -87 -96 181 -79 36 182 38 -49 321 -118 -158 -219 52 -61 30 199 112
4874 112 -183 93 36 -47 -118 -16 67 -103 110 142 65 -124 98 96 -211 -40 -70 -6 -138 6 135 -28 -21 59
4898 59 62 102 175 67 66 238 145 201 -21 98 120 247 46 -290 215 -51 266 -4 -46 -35 62 -32 -93 -96 38 55
4924 55 -177 -180 26 204 86 -24 -28 -119 -116 178 276 -164 271 27 40 51 -194 39 -110 198 -132 266 -86 13
4948 13 -231 127 60 -132 -10 -17 -145 -16 -176 -117 2 63 -34 -248 -106 -85 -30 -76 -5 -57 -159 -89 -42 -30 2
4973 2 41 -25 48 -39 46 -148 15 -170 19 25 184 -29 -63 177 -32 244 241 7 -19 -141 256 13 372 196
4997 196 26 360 152 145 336 -278 320 250 -256 64 -35 -269 -55 29 355 -429 -583 -335 306 -73 321 -81
5019 -81 -146 293 -514 -219 360 -101 -222 8 -29 -129 109 65 -58 -64 -77 -73 4 -68 -76 106 -115 64 14 -82 -24
5044 -24 -8 126 -50 -83 -27 101 294 -114 63 -19 -70 -106 188 -50 -177 98 -247 108 -133 206 178 -48 18
5067 18 -120 255 219 87 28 -126 -196 -20 120 -139 -251 -106 238 -249 94 -297 36 215 -218 -20 316
5088 316 235 121 520 212 -129 -333 47 7 -494 -46 47 143 -330 72 -62 -48 344 18 27 23 -153 63 167
5111 167 337 109 5 -252 -181 -365 378 -149 75 -394 -131 -528 -374 65 -376 257 -432 -432 161 213 -220
5132 -220 213 -103 -15 -294 90 -135 243 -175 -36 -220 79 -13 282 -112 -36 53 -171 -178 -119 182 475 -281
5154 -281 297 424 10 -305 174 -46 207 293 155 -173 148 66 -618 -210 88 60 719 -2 -36 364 59
5175 59 -26 -519 220 -64 268 -500 -290 -3 -515 -341 -103 53 19 -4 -6 -48 -287 464 -62 143 -409 -9
5197 -9 -145 12 715 292 59 -162 -384 -749 122 351 -193 249 -85 10 21 31 -15 16 -173 -16 -115 101 193
5220 193 97 12 134 25 72 -166 94 -9 76 -6 -97 28 -52 233 -47 -28 -364 12 46 -119 -4 142 -436
5243 -436 67 63 44 73 74 159 183 90 103 36 56 42 -149 98 -132 59 190 -184 -309 -209 53 45 105 59 -138 58
5269 58 52 -16 -15 -8 -12 13 176 148 -147 85 -31 -200 -33 121 41 -135 -169 -38 229 -216 -212 -59 56 136 122 -145
5295 -145 184 -2 183 76 -72 -117 -76 118 -25 -72 -214 -327 210 42 -15 45 -118 178 58 -19 -25 8 -24
5318 -24 -67 -86 118 -3 -81 -152 -5 -125 -15 12 20 -17 -123 70 211 130 -40 -150 6 -54 -101 78 -59 -54 145
5343 145 212 185 452 135 -107 27 -284 13 29 -12 -35 -148 51 -46 181 32 -84 79 -106 -120 21 -68 41
5366 41 35 -102 46 38 -179 -15 -152 -101 -64 -49 6 -202 143 121 67 201 -91 5 52 -204 4 -1 -23 -46 -13 242
5392 242 -64 -74 -84 -129 133 -187 233 194 95 -28 -47 -128 -154 -82 -44 -191 -118 43 -22 223 -14 226 -78 85
5416 85 -64 134 -10 32 -146 -13 -87 -110 192 -75 -12 -115 -70 -86 -52 4 213 -92 125 144 9 12 -47 18 8
5441 8 -76 243 57 8 272 -29 -299 -25 -113 -93 43 95 232 -120 -75 127 -46 -86 79 -131 -5 -52 59
5464 59 175 -6 -124 91 87 42 143 217 -109 118 -80 161 -275 136 -43 -81 -45 161 -4 115 140 -10 -101
5487 -101 -2 309 297 -267 49 74 -138 -33 -146 162 -204 -75 170 -66 -104 43 -8 191 -17 -105 -77 -24 -13
5510 -13 112 -38 87 96 17 56 -28 194 -37 55 47 107 -140 -94 -10 12 50 2 52 25 -91 197 164 -27 -104 23
5536 23 -35 -207 44 -73 -41 58 120 15 -89 -76 -32 -22 33 -22 116 76 163 26 14 167 1 -90 126 -5 253
5561 253 -142 -70 -222 -84 -61 -200 200 68 42 83 28 -90 113 -50 -112 181 162 43 312 -152 -176 -201 -23
5584 -23 79 -52 42 27 -135 127 11 104 -122 -42 -59 92 -130 -36 -59 -140 -48 -89 63 16 67 -191 -17 189
5608 189 -96 99 -302 -122 109 70 -216 -404 29 32 158 67 159 122 192 98 -91 -109 -188 -79 -23 64 51 52 119
5633 119 -144 -80 90 267 -102 87 -198 -151 -51 27 79 239 -240 18 110 72 135 -113 232 90 14 -47 75
5656 75 28 -48 99 278 43 -63 26 -210 -224 -28 64 -6 84 199 -209 139 189 -39 128 -253 -84 80 -34
5679 -34 89 131 28 -159 76 -223 -139 220 -98 62 -23 85 -84 64 -32 169 94 -70 -15 161 -424 -564
5701 -564 192 -140 54 76 -44 55 -145 -109 -91 117 -222 -120 -103 109 108 -188 -36 122 36 -182 -50 87 86
5724 86 -174 -72 -7 98 88 -137 -19 -33 -44 -92 -27 1 74 7 105 -148 -25 38 51 -14 126 105 -117 -85 199
5749 199 -145 73 58 -213 151 -223 -67 16 -65 204 -142 -46 -123 -19 18 -182 300 79 -269 -189 14 -42 -268
5772 -268 104 139 41 43 73 -30 -118 99 -135 -28 23 -44 16 -116 -24 82 -97 46 167 143 -214 73 -54 -3
5796 -3 -306 -28 -47 58 224 -85 164 -258 -175 28 55 111 -104 33 122 249 -31 36 -27 103 89 40 -311 -14
5820 -14 -2 205 73 43 22 23 24 -304 -18 -164 -111 -149 135 -55 141 -46 -62 10 80 -266 43 45 12 -69 -148 -418
5846 -418 -2 124 -149 108 37 74 11 -29 -170 31 42 22 -44 -4 75 251 24 64 136 146 -199 220 21 -99
5870 -99 1 204 299 -72 -67 1 -132 22 85 -12 -104 -101 67 -60 -1 -90 -74 113 130 -91 101 85 18 -36 73 154
5896 154 -97 29 287 130 143 -29 59 73 70 136 113 -406 104 -113 196 -186 11 -49 162 -89 -183 -16 -32
5919 -32 -125 99 -245 -2 17 -164 59 -172 24 200 168 1 80 -154 -60 25 -157 55 -131 1 -96 123 -69
5942 -69 -129 32 -213 -123 -71 -29 -152 66 181 -134 -148 293 -143 -163 -174 126 -396 -198 -19 -177 406 -416 -53
5965 -53 -513 229 -61 302 35 314 223 -44 102 128 -91 156 -181 -89 -2 -2 -38 -63 -9 -197 179 -139 15
5988 15 44 167 -71 -130 17 103 -60 -213 -20 -135 -155 118 -80 -71 -41 65 -87 158 130 -196 208 41 164
6011 164 56 81 340 69 34 168 -102 313 0 -96 19 -177 -96 60 -109 8 116 100 -153 150 -171 26
6033 26 117 -47 126 65 25 4 -338 -203 -158 -69 -139 -139 118 -38 -88 117 -137 149 -80 128 71 -228 -60 -2
6057 -2 -177 -198 -15 -163 160 133 131 -247 -143 171 200 116 -197 42 -198 199 -72 90 -38 81 200 -161 297
6080 297 565 265 168 -66 -69 100 -192 144 -322 -148 -17 -128 -47 -123 265 511 300 -108 273 56 51 -139
6102 -139 -72 -20 67 170 182 -77 -202 -203 -51 468 263 87 78 -50 -47 402 116 68 -464 -52 -61 368 57 -123
6126 -123 -146 240 384 -241 -340 -51 -314 305 313 6 318 5 82 -201 -176 -363 88 -177 -93 156 -227 23
6148 23 188 -185 -8 10 -35 -214 13 86 60 -35 -119 97 -157 24 -45 8 -77 76 -104 213 164 -8 244 -253
6172 -253 32 -99 36 26 57 -136 -215 114 137 35 19 67 119 176 -32 60 -14 -259 -53 -101 -4 -118 58 88
6196 88 350 -10 -135 -178 -21 97 26 59 -92 82 -80 17 262 369 77 -185 -80 151 63 -196 283 85
6218 85 -180 -171 59 40 46 -94 -61 -79 12 194 -71 154 26 -85 102 42 237 3 64 86 -29 -41 14 -191 -135
6243 -135 43 -130 33 51 -27 -64 -81 45 -25 -72 71 34 -107 -24 -8 123 16 130 127 -337 -139 -102 -130 120
6267 120 -70 -150 111 2 -72 -25 -28 -155 -135 -133 15 -62 53 -158 -110 27 -68 228 5 -87 101 3 -81 39 -75
6292 -75 -84 69 -164 68 99 67 -86 -208 23 -107 122 -39 55 209 -69 12 -59 -5 -171 -109 -38 62 -74 -44
6316 -44 31 247 -260 -120 -157 80 -38 136 -105 20 56 51 106 116 -118 120 42 -41 -9 93 78 -37 2 85 121
6341 121 -97 26 -105 -114 -18 -112 -78 -83 74 -99 125 121 -23 -16 244 -122 -12 -212 1 -13 56 -97 -151 -113 -235
6366 -235 55 -114 129 39 -125 83 55 260 234 -79 76 -63 -99 181 185 161 -34 89 -146 -43 -23 -41 180
6389 180 -75 -26 42 -13 76 19 -179 39 39 -124 12 -178 90 86 -61 101 -92 164 -41 240 109 202 -35
6412 -35 -159 57 156 -41 -214 45 120 -124 -43 39 -86 -237 152 -33 -11 105 2 98 -177 135 -91 93
6434 93 -72 -136 -13 68 33 -15 -50 50 -200 126 114 -16 -26 -149 34 302 -271 548 -14 -100 -34 -77 -392 96
6458 96 -604 873 -84 -590 -143 239 139 18 392 -510 -116 -497 -430 -253 -29 -16 -56 -509 106 -668 -29
6479 -29 -64 -27 -206 -247 -274 117 -224 -14 -275 -107 -141 1 87 -115 125 41 -63 -37 -60 -124 39 -115 -35 -42 123
6504 123 -227 1 172 35 -13 -39 -54 -59 -98 84 -39 30 -116 -106 -165 -30 -74 -123 -37 -144 79 -126 47 -229
6528 -229 -62 -25 155 129 75 -29 53 35 224 145 93 103 199 155 92 -15 -141 76 203 -71 -3 -110 84 36
6552 36 -195 -82 4 -347 80 -6 20 191 -6 -61 -7 23 28 -13 -132 -201 -33 33 -88 -35 48 -344 -27 23 -265
6577 -265 -215 144 75 43 -162 -85 94 101 22 -49 -96 36 -122 41 -40 161 37 292 85 -173 -85 62 10 78
6601 78 176 -227 108 32 -45 35 72 9 47 79 27 -189 4 33 -83 -33 42 22 183 85 98 -30 -29 37 -191 77
6627 77 -71 -38 97 -97 -143 -115 -10 61 22 -169 -122 -17 -26 134 109 140 -15 -4 51 -199 -148 181 -118 55 125
6652 125 -34 -110 54 -43 4 136 -38 -46 -175 61 -121 225 -45 52 74 -76 -43 107 17 -102 -29 30 -220 -191
6676 -191 165 -130 134 179 -70 -204 -38 -40 77 15 5 3 18 -136 -201 -2 91 182 83 152 -92 -59 -82 -31 71
6701 71 -42 100 -73 -50 3 -75 115 216 -147 -87 170 -73 67 141 -210 -162 56 83 -133 64 -6 10 -202
6724 -202 189 -571 -393 56 242 183 -207 -265 152 456 -240 -645 -83 226 83 -94 44 -15 -1 137 -34
6745 -34 -10 -142 -93 -140 42 -7 50 -141 -73 79 58 -114 161 -113 181 -111 -72 229 -23 -135 87 316 61
6768 61 103 108 165 -108 46 84 107 167 -81 118 -86 -80 -89 40 63 -23 7 109 -69 -92 77 -67 -15 -184 134 35
6794 35 -138 -51 164 121 71 -73 -103 341 -92 -27 50 55 -173 28 252 -96 24 95 -11 155 93 28 -59 -125 240
6819 240 -27 111 -5 390 -206 -142 33 73 -147 -66 -27 -88 164 6 -63 -59 -55 -149 173 -283 78 -156 -27 -58
6843 -58 -175 28 145 231 138 -7 -81 -156 10 -13 -220 19 84 -88 140 -5 -56 234 -69 205 16 294 36
6866 36 7 94 115 70 54 -116 -174 73 28 -175 -61 -121 27 80 52 -100 4 -137 184 -28 105 25 306 216
6890 216 -273 93 338 -5 -62 84 224 115 -47 -87 -63 35 68 -68 222 68 226 196 -256 -54 59 -51
6912 -51 4 228 7 -164 -292 64 -442 -225 -25 53 70 200 238 27 -34 -14 123 165 -42 247 -15 -226 107
6935 107 -42 187 183 8 -2 -92 62 147 -178 -127 194 -183 46 256 -66 -186 -19 40 -45 -21 -8 0 78 57 73
6960 73 -212 -136 2 -59 -68 -14 4 85 -215 160 4 -94 -37 -42 143 77 -77 40 -88 188 -142 -112 16 -184 -122
6985 -122 -242 185 -85 -79 -163 -84 36 -3 -108 296 -186 -86 -75 -71 331 -39 47 64 -47 132 -104 55 -16 243
7009 243 -89 97 127 17 -28 70 -4 -56 -112 78 79 -38 13 148 150 162 151 180 -93 210 -38 3 -180 -293 -9
7034 -9 -7 -83 19 -106 -130 16 -365 -59 -180 -187 -111 25 -2 260 218 -143 -341 -142 21 -17 22 61 -160 177 -123
7059 -123 -126 35 -157 78 -159 -8 -78 105 81 -49 10 -403 -142 222 198 106 58 75 78 -85 -122 -135 56 130 -152
7084 -152 106 -156 120 83 -78 38 -12 232 -220 47 278 260 96 -143 257 55 376 -325 309 233 -373
7105 -373 137 -59 -23 -90 162 201 128 -38 -163 27 97 -269 -289 20 -260 -415 -59 -209 -71 -163 -128 -2 -9
7128 -9 -372 145 60 -15 242 -1 33 253 426 538 135 205 -482 65 649 -797 319 657 334 -603 52
7149 52 -18 331 -85 -856 88 145 -617 -159 -95 7 -1292 -93 -146 62 -17 196 239 739 144 -52 -245 266
7171 266 246 -226 83 -368 -58 561 150 -231 -185 -41 -609 -13 -125 240 45 -75 429 -385 -487 -82 -496
7192 -496 -682 99 -430 -531 -67 -122 -127 35 -300 -311 244 -25 209 -564 -620 -143 -228 271 -285 109 22 -502
7214 -502 23 -53 199 134 -242 167 -161 -107 -571 86 -618 -116 -201 -21 -137 -282 -171 130 487 49 83 -103
7236 -103 430 20 -520 -707 -246 147 -254 334 184 -216 -369 18 36 302 37 473 197 545 -118 -208 391
7257 391 -198 -455 137 -243 477 45 258 -850 270 -302 -87 320 -296 -149 -176 -77 -606 -107 -632 -1032
7277 -1032 489 754 -112 -1002 233 -111 641 248 177 171 206 -251 299 -168 -7 -515 829 60 -204 124
7297 124 239 10 151 -201 274 -9 -82 -78 -80 178 -70 49 18 -9 76 18 46 61 182 -30 83 -201 407 -98
7321 -98 91 -32 -80 -196 37 -139 462 -495 -398 118 -487 190 -68 313 610 120 -264 -91 895 -176 320
7342 320 18 -549 145 -342 -662 -35 119 -250 -184 215 535 198 200 -310 92 -183 179 -486 -167 284 168
7363 168 -157 45 -324 124 -292 -35 -154 89 -116 112 19 241 182 -25 -238 194 148 235 -143 75 132 -339
7385 -339 -22 -223 -3 -38 -196 -151 105 111 -191 131 -165 -194 14 59 79 171 -56 22 178 37 48 -247 40
7408 40 24 -219 -83 176 88 78 164 -62 -137 -23 -3 126 -182 -17 5 -260 -209 1 -156 269 119 116 35 -120
7432 -120 -68 100 209 51 -26 187 17 110 221 -370 97 -75 -61 16 -354 255 400 119 35 -238 280 -350
7454 -350 -477 -311 -723 -180 -104 635 -739 318 -290 148 -165 -656 182 -59 285 -83 -220 -734 -366 163
7474 163 146 395 -149 -621 -85 620 374 192 53 -551 -140 -98 -157 416 225 353 168 -256 9 235 92
7495 92 18 -116 -118 353 346 88 18 -4 156 -349 227 -327 -104 295 167 228 347 -450 26 -31 24 -209 -180 32
7519 32 48 61 -395 366 90 -123 238 174 -11 15 299 36 -121 466 471 -618 462 -213 95 -235 23 -99
7541 -99 -67 -89 140 -25 112 3 -198 -22 -110 80 -53 282 -54 8 -163 -93 -61 177 83 195 114 86 -86
7564 -86 -35 -68 -89 61 138 197 57 -115 -22 -289 17 99 95 -34 152 69 78 -25 -101 87 35 66 10 -89 -14 -71 -234
7591 -234 -229 -61 -76 78 45 35 146 146 194 -49 -44 3 151 103 -303 66 -33 205 33 -120 -107 -14 61 -76 274
7616 274 169 -103 93 97 267 336 -196 -474 -49 347 782 147 282 1 -159 -716 -41 20 94 220 318 56
7638 56 -40 -113 49 172 84 75 160 -65 -291 -141 -69 15 -69 -298 74 41 -17 78 -170 -101 -203 21 49 -24 -173
7663 -173 -134 4 53 0 69 -92 -37 87 -176 -120 86 -21 -74 -16 -26 136 166 -226 359 123 119 7 33 250
7687 250 -13 -337 -119 290 214 -330 -120 -297 -152 -138 196 384 149 19 -406 89 358 195 258 204 384
7708 384 -853 95 669 73 -278 21 165 -500 -232 142 458 682 -238 -73 -7 -211 41 -63 -30 -231
7728 -231 43 -341 66 -577 257 169 -467 276 -87 -133 30 -366 156 -28 232 315 66 270 22 167 -102
7749 -102 726 -118 241 -19 390 -300 -279 317 84 241 -63 211 39 -163 -85 -25 195 -131 193 64 -88
7770 -88 -15 -88 259 276 -293 -110 68 -8 12 -209 162 140 -133 -149 128 60 -36 -156 -112 -21 -164 120 51 31 -24
7795 -24 -38 -127 -8 -1 -74 -78 -200 19 139 75 12 -18 -94 -104 -133 33 -254 51 120 -15 -303 110 -124 468 -15
7820 -15 -402 -19 -4 -370 -238 438 -379 272 -38 -251 2 -114 -96 314 91 -45 -123 37 -279 -3 -25 -58
7842 -58 176 156 -162 -70 10 78 -7 7 -29 43 155 46 192 -163 69 -168 63 119 -78 6 109 10 98 3 -129
7867 -129 39 -278 63 187 -23 93 170 88 128 151 -193 11 -88 -202 -63 139 165 -62 20 -62 293 18 211
7890 211 -47 -1 -89 20 109 -42 -26 115 -213 -335 333 98 -32 58 -98 22 74 -250 -26 79 -119 -24
7912 -24 -85 -188 -121 114 -87 47 243 -13 63 -74 75 124 144 14 -81 -51 -170 -55 109 184 91 52 46 47 160
7937 160 -132 69 -82 33 -30 -74 -128 -196 97 -46 28 219 -11 116 -102 -9 10 -64 -14 91 -47 18 -38 148
7961 148 -149 -120 13 -19 -6 14 -5 141 50 -76 95 111 64 -172 -163 141 159 1 285 92 273 139 95 159
7985 159 -101 -95 189 -187 222 -32 21 183 77 70 -107 -10 12 69 130 247 119 -183 28 -257 -47 -116 -22 141
8009 141 -21 82 -147 -205 -82 -54 13 -46 -130 -19 -219 24 21 177 -26 -105 -59 107 -389 -170 -53 -158 70
8032 70 165 -13 -143 -48 -75 -216 -98 11 -128 226 123 -34 -320 -34 193 -126 166 -127 -71 -306 17 -208
8054 -208 -87 109 0 47 64 -113 176 151 -108 -49 122 32 10 113 -128 84 -90 -72 93 151 -339 -135 -123
8077 -123 154 -3 21 -148 -43 122 24 -41 -233 -40 -20 24 24 106 99 -88 97 164 143 46 67 56 -20 -104 133 139
8103 139 -87 244 45 8 98 39 218 -76 -157 101 -188 293 -83 133 -32 275 166 -116 -2 4 -71 265
8125 265 -146 -122 -165 33 61 95 129 -40 81 0 22 -156 -102 -261 -162 -39 105 -65 148 -47 17 -189 7
8148 7 -88 -8 27 107 207 146 64 100 295 82 -133 -88 -13 -173 72 49 -86 -123 34 20 111 -155 26 1 -112
8173 -112 97 43 327 15 -150 155 122 -40 -127 44 108 37 49 113 -92 -149 -13 34
8191C4
##END NTUPLES=NMR FID
##END=
