##TITLE=1H_Pr 18-m
 D2O
 8 sc, 
 15.3.2024
##JCAMPDX= 6.0         $$ Bruker NMR JCAMP-DX V2.0
##DATA TYPE= NMR FID
##DATA CLASS= NTUPLES
##ORIGIN= UXNMR, Bruker Analytische Messtechnik GmbH
##OWNER= root
$$ XWIN-NMR		Version 3.5
$$ Fri Mar 15 14:32:01 2024 Russian Standard Time (UT+4h)  she@DPX200
##.OBSERVE FREQUENCY= 200.1313
##.OBSERVE NUCLEUS= ^1H
##.DELAY= (6, 6)
##.ACQUISITION MODE= SIMULTANEOUS
##.ACQUISITION SCHEME= undefined
##.AVERAGES= 8
##.DIGITISER RES= 18
##SPECTROMETER/DATA SYSTEM= spect
##.PULSE SEQUENCE= zg30
##.SOLVENT NAME= D2O
##.SHIFT REFERENCE= (INTERNAL, D2O, 0, 15.7039)
##AUDIT TRAIL= $$ (NUMBER, WHEN, WHO, WHERE, WHAT)
$$ ##TITLE= Audit trail, XWIN-NMR		Version 3.5
$$ ##JCAMPDX= 5.01
$$ ##ORIGIN= Bruker BioSpin GmbH
$$ ##OWNER= she
$$ F:/spectra/data/she/nmr/H-F/1/audita.txt
$$ ##AUDIT TRAIL=  $$ (NUMBER, WHEN, WHO, WHERE, WHAT)
(   1,<2024-03-15 14:31:00.56 +0400>,<she>,<DPX200>,
      <created by zg, POWCHK disabled, PULCHK disabled
       configuration hash MD5:
       00 E9 B6 7A A2 85 ED C7 34 08 36 98 17 FE 4E 26
       data hash MD5: 16K
       EE 5A F8 4E 72 38 38 2A E8 FE 75 FE 9A 90 EE 8C>)
$$ ##END=
$$ 
$$ hash MD5
$$ 94 BE 74 5A 4B A3 EB 53 37 80 DB 41 DE B2 90 A7
##$RELAX= 
##$RELAX= 
##$RELAX= 
##$RELAX= 
##$RELAX= 
##$RELAX= 
$$ Bruker specific parameters
$$ --------------------------
##$DU= <F:/spectra>
##$EXPNO= 1
##$NAME= <H-F>
##$PROCNO= 1
##$TYPE= <nmr>
##$USER= <she>
##$AMP= (0..31)
100 100 100 100 100 100 100 100 100 100 100 100 100 100 100 100 100 100 
100 100 100 100 100 100 100 100 100 100 100 100 100 100 
##$AQSEQ= 0
##$AQ_mod= 1
##$AUNM= <au_zg>
##$AUTOPOS= <>
##$BF1= 200.13
##$BF2= 200.13
##$BF3= 200.13
##$BF4= 200.13
##$BF5= 200.13
##$BF6= 200.13
##$BF7= 200.13
##$BF8= 200.13
##$BYTORDA= 1
##$CFDGTYP= 0
##$CFRGTYP= 5
##$CHEMSTR= <none>
##$CNST= (0..31)
1 1 145 1 1 1 1 1 1 1 1 1 1 1 1 1 1 1 1 1 1 1 1 1 1 1 1 1 1 1 1 1 
##$CPDPRG= <>
##$CPDPRG1= <>
##$CPDPRG2= <>
##$CPDPRG3= <>
##$CPDPRG4= <mlev>
##$CPDPRG5= <mlev>
##$CPDPRG6= <mlev>
##$CPDPRG7= <mlev>
##$CPDPRG8= <mlev>
##$CPDPRGB= <>
##$CPDPRGT= <>
##$D= (0..31)
0 1.2 0 0 0 0 0 0 0 0.06 0 0.03 0 0 0 0 0.0002 0 0 0 0 0 0 0 0 0 0 0 0 
0 0 0 
##$DATE= 1710498659
##$DBL= (0..7)
120 120 120 120 120 120 120 120 
##$DBP= (0..7)
150 150 150 150 150 150 150 150 
##$DBP07= 0
##$DBPNAM0= <>
##$DBPNAM1= <>
##$DBPNAM2= <>
##$DBPNAM3= <>
##$DBPNAM4= <>
##$DBPNAM5= <>
##$DBPNAM6= <>
##$DBPNAM7= <>
##$DBPOAL= (0..7)
0.5 0.5 0.5 0.5 0.5 0.5 0.5 0.5 
##$DBPOFFS= (0..7)
0 0 0 0 0 0 0 0 
##$DE= 6
##$DECBNUC= <off>
##$DECIM= 32
##$DECNUC= <off>
##$DECSTAT= 4
##$DIGMOD= 1
##$DIGTYP= 9
##$DL= (0..7)
0 120 120 120 120 120 120 120 
##$DP= (0..7)
150 150 150 150 150 150 150 150 
##$DP07= 0
##$DPNAME0= <>
##$DPNAME1= <>
##$DPNAME2= <>
##$DPNAME3= <>
##$DPNAME4= <>
##$DPNAME5= <>
##$DPNAME6= <>
##$DPNAME7= <>
##$DPOAL= (0..7)
0.5 0.5 0.5 0.5 0.5 0.5 0.5 0.5 
##$DPOFFS= (0..7)
0 0 0 0 0 0 0 0 
##$DQDMODE= 0
##$DR= 18
##$DS= 0
##$DSLIST= <SSSSSSSSSSSSSSS>
##$DSPFIRM= 0
$$ [...]
##$SUBNAM2= <"">
##$SUBNAM3= <"">
##$SUBNAM4= <"">
##$SUBNAM5= <"">
##$SUBNAM6= <"">
##$SUBNAM7= <"">
##$SUBNAM8= <"">
##$SUBNAM9= <"">
##$SW= 18.0517328524113
##$SWIBOX= (0..15)
0 0 2 0 0 0 0 0 0 0 0 0 0 0 0 0 
##$SW_h= 3612.71676300578
##$TD= 16384
##$TD0= 1
##$TE= 0
##$TE2= 300
##$TE3= 300
##$TEG= 300
##$TL= (0..7)
0 120 120 120 120 120 120 120 
##$TP= (0..7)
150 150 150 150 150 150 150 150 
##$TP07= 0
##$TPNAME0= <>
##$TPNAME1= <>
##$TPNAME2= <>
##$TPNAME3= <>
##$TPNAME4= <>
##$TPNAME5= <>
##$TPNAME6= <>
##$TPNAME7= <>
##$TPOAL= (0..7)
0.5 0.5 0.5 0.5 0.5 0.5 0.5 0.5 
##$TPOFFS= (0..7)
0 0 0 0 0 0 0 0 
##$TUNHIN= 0
##$TUNHOUT= 0
##$TUNXOUT= 0
##$USERA1= <user>
##$USERA2= <user>
##$USERA3= <user>
##$USERA4= <user>
##$USERA5= <user>
##$V9= 5
##$VALIST= <valist>
##$VCLIST= <CCCCCCCCCCCCCCC>
##$VD= 0
##$VDLIST= <DDDDDDDDDDDDDDD>
##$VPLIST= <PPPPPPPPPPPPPPP>
##$VTLIST= <TTTTTTTTTTTTTTT>
##$WBST= 1024
##$WBSW= 4
##$XGAIN= (0..3)
0 0 0 0 
##$XL= 0
##$YL= 0
##$YMAX_a= 573127
##$YMIN_a= -509268
##$ZGOPTNS= <>
##$ZL1= 120
##$ZL2= 120
##$ZL3= 120
##$ZL4= 120
##$ABSF1= 10
##$ABSF2= 0
##$ABSG= 5
##$ABSL= 3
##$ALPHA= 0
##$AQORDER= 0
##$ASSFAC= 0
##$ASSFACI= 0
##$ASSFACX= 0
##$ASSWID= 0
##$AUNMP= <proc_1d>
##$AZFE= 0.1
##$AZFW= 0.1
##$BCFW= 1
##$BC_mod= 2
##$BYTORDP= 1
##$COROFFS= 0
##$CY= 11.3945322036743
##$DATMOD= 1
##$DC= 2
##$DFILT= <>
##$DTYPP= 0
##$F1P= 15.7292609196834
##$F2P= 12.9074282941183
##$FCOR= 0.5
##$FTSIZE= 0
##$FT_mod= 4
##$GAMMA= 1
##$GB= 0.15
##$INTBC= 1
##$INTSCL= 1
##$ISEN= 128
##$LB= 0.24
##$LEV0= 0
##$LPBIN= 0
##$MAXI= 10000
##$MC2= 0
##$MEAN= 0
##$ME_mod= 0
##$MI= 1.114404
##$NCOEF= 0
##$NC_proc= 0
##$NLEV= 6
##$NOISF1= 3.799351
##$NOISF2= 2.8
##$NSP= 1
##$NTH_PI= 0
##$NZP= 0
##$OFFSET= 15.70392
##$PC= 1
##$PHC0= -25473.58
##$PHC1= 19.58731
##$PH_mod= 1
##$PKNL= yes
##$PPARMOD= 0
##$PSCAL= 0
##$PSIGN= 0
##$REVERSE= no
##$SF= 200.130013532006
##$SI= 16384
##$SIGF1= 3
##$SIGF2= 2
##$SINO= 400
##$SIOLD= 16384
##$SREGLST= <1H.CDCl3>
##$SSB= 0
##$STSI= 0
##$STSR= 0
##$SW_p= 3612.71676300578
##$SYMM= 0
##$S_DEV= 0
##$TDeff= 0
##$TDoff= 0
##$TI= <>
##$TILT= no
##$TM1= 0
##$TM2= 0
##$TOPLEV= 0
##$USERP1= <user>
##$USERP2= <user>
##$USERP3= <user>
##$USERP4= <user>
##$USERP5= <user>
##$WDW= 1
##$XDIM= 8192
##$YMAX_p= 0
##$YMIN_p= 0
$$ End of Bruker specific parameters
$$ ---------------------------------
##NTUPLES= NMR FID
##VAR_NAME=  TIME,          FID/REAL,        FID/IMAG
##SYMBOL=    X,             R,               I
##VAR_TYPE=  INDEPENDENT,   DEPENDENT,       DEPENDENT
##VAR_FORM=  AFFN,          ASDF,            ASDF
##VAR_DIM=   8192,          8192,            8192
##UNITS=     SECONDS,       ARBITRARY UNITS, ARBITRARY UNITS
##FACTOR=    0.0002768,     1,               1
##FIRST=     0,             0,               0
##LAST=      2.2672688,     0,               0
##MIN=       0,             -509268,         0
##MAX=       2.2672688,     573127,          0
$$ Real data points
##PAGE= N=1
##DATA TABLE= (X++(R..R)), XYDATA
0@%%%%%%%%%%%%%%JkRj6J6j6J6k4L2l2M0m9N5o6P7q8J00j15J32j50J71j93K17
$$ 0 0 0 0 0 0 0 0 0 0 0 0 0 0 0 1 -1 8 -8 8 -8 8 -16 16 -16 24 -25 30 -36 41 -47 53 -62 70 -80 91 -102 115
37A15k46K75l09L45l82M28m73N21n78O37p03P78q55R41j040J147j264J393j536
$$ 115 -131 144 -165 180 -202 226 -247 274 -304 333 -370 408 -447 494 -546 601 -663 730 -806
56h06J700j885K095k339K623k960L370l877M521n369O527q164J0330j1058L51566
$$ -806 894 -991 1104 -1235 1388 -1572 1798 -2079 2442 -2927 3600 -4564 5766 -5292 346274
71C46274J72442k90297l11963r8506P3464O045o8526l463J42740J32487K0681
$$ 346274 518716 228419 -83544 -182050 -108586 -102541 -171067 -174530 -31790 100697 121378
82A21378N028J14647Q1247j74652l94448k62468J30509L90160K51829o7036j76951
$$ 121378 126406 241053 322300 147648 -246800 -509268 -378759 11401 263230 196194 19243
93A9243j1132J12736M586j70934j67830j0092J06869R7612Q2319J43623J52549
$$ 19243 8111 120847 125433 -45501 -213331 -223423 -116554 -18942 63377 207000 359549
104C59549n1146l28183l51197m8257K59028K61933K9592j15729k0022J33744R6426
$$ 359549 308403 -19780 -370977 -419234 -160206 101727 131319 15590 -4432 129312 225738
115B25738r4057j91657j08088k342J0320J8135J20349K22184J43973j08703k86551
$$ 225738 131681 -59976 -168064 -170406 -160086 -141951 -21602 200582 344555 235852 -50699
126e0699j91469N1970J48338L1786p2203Q416J60404J64523p593j67371j64175
$$ -50699 -242168 -190198 -41860 -10074 -82277 -73861 86543 251066 243473 76102 -88073
137h8073o7397k5074k6349N0086J86310K07539M0318j55857j77453l1292P7048
$$ -88073 -155470 -180544 -206893 -156807 29503 237042 277360 121503 -55950 -87242 -10194
148a0194J3632j05033q0067Q1588J82084J12986k3512q7136p7478q1460j09318
$$ -10194 3438 -101595 -181662 -100074 82010 194996 171484 84348 6870 -74590 -183908
159a83908o4758Q9131K16337J64646j3808j18809o8093J4888q133j04251j21876
$$ -183908 -248666 -159535 56802 221448 207640 88831 20738 35626 27493 -76758 -198634
170a98634q80J36702J47249N3832j5143k2397m2869j02220j18530k6249J07112
$$ -198634 -199514 -62812 84437 138269 123126 100729 57860 -44360 -162890 -189139 -82027
181h2027J44338N2533m2595k4519M7623L2383q2425j61929j07697K8424J21249
$$ -82027 62311 114844 72249 47730 95353 127736 45311 -116618 -224315 -195891 -74642
192g4642J16952P1824M2571M929p5811j39785j00910J6302R1586O3860j705n770
$$ -74642 42310 114134 156705 161634 85823 -53962 -154872 -138570 -46984 16876 15171 9401
204I401N4247P5948n947j16943j36572n4510L6523P3249P3976P3134O0737P080
$$ 9401 63648 139596 133649 16706 -119866 -174376 -137853 -64604 9372 82506 143243 150323
216A50323p1654j05637n9670M210J1502j4841M222P7065J21561O9656m7908j28878
$$ 150323 78669 -26968 -86638 -82428 -70926 -85767 -81545 -4480 117081 186737 138829 9951
228I951j10471l4560K1568M3257O1873P4981N1109p104n4650n6905l0714k2798
$$ 9951 -100520 -135080 -113512 -70255 -8382 66599 117708 110604 55954 -951 -31665 -54463
240e4463m1552l4483L4137J11748J15549L7755n0730q7613p2334m2207k1167M465
$$ -54463 -96015 -130498 -96361 15387 130936 168691 117961 30348 -41986 -84193 -105360 -100895
252a00895M5337P3919N9349J7379j3934k7978m5301o7133o4391j3124O5065J08954
$$ -100895 -55558 18361 77710 95089 81155 53177 7876 -59257 -123648 -136772 -71707 37247
264C7247Q1421J2933l6962n0858n1880n2753m2700r545L4093O2767O1109M1137
$$ 37247 118668 131601 94639 43781 -8099 -60852 -103552 -113097 -79004 -16237 44872 86009
276H6009J8231j2067n3968q3160o7188q975N1947P6379N9949K7274O21k3422n1098
$$ 86009 104240 92173 38205 -44955 -112143 -121118 -69171 7208 67157 94431 95052 71630 20532
289B0532o9053n6012j4793L0630N9120O6149N4470K6353j5419n8005p6762n7741
$$ 20532 -48521 -104533 -119326 -88696 -29576 36573 91043 117396 101977 43972 -32790 -90531
301i0531j4337K5463M6890N2614M7121K8218o048m4800o6724n8190k5282J3771
$$ -90531 -104868 -79405 -32515 20099 67220 95438 89390 44590 -22134 -80324 -105606 -91835
313i1835M5983O3495O0280L3628q695m8823o8110n9215l0079N462L7471N8640
$$ -91835 -45852 17643 77923 111551 102856 54033 -14077 -73292 -103371 -97909 -60438 -1798
325a798O0843L9917J813l7321n9999n8299l6071l148L0654N4665N8761M0270O351
$$ -1798 59045 98962 100775 63454 3455 -54844 -90915 -94063 -63409 -8744 50017 90287 96638
338I6638l0659n5825n9846m2086r083K7934N5816O3105M6354J2380k5544n3296
$$ 96638 65979 10154 -49692 -91778 -100861 -72927 -17111 45994 92348 104728 79184 25888
350B5888o0987m7658j8297J7808M8075O0083M9567K1011j4974m5703n8095m8460
$$ 25888 -35099 -82757 -101054 -83246 -35171 24912 74479 95490 80516 34813 -23282 -71742
362g1742k0801J4243M4556N7765M9528K2958j1797m2896n8961n3762k9306O423
$$ -71742 -92543 -78300 -33744 24021 73549 96507 84710 41814 -17147 -70909 -100215 -93792
374i3792M0284N9161N5884L3009j489l4882n5438n4667l4226r91L1867N2266N2385
$$ -93792 -53508 5653 61537 94546 93057 58175 2737 -51930 -86156 -87147 -55280 -3014 49371
387D9371L3963L513k9644n2872n6039l6742l636K9683N1174N5142M1320J2013
$$ 49371 83334 86847 57203 4331 -51708 -88450 -92086 -62403 -11229 43913 85233 97246
399I7246k3488n1264n9100m3916j3049K0667M5408N4668M5267J8081j8059m6555
$$ 97246 73758 22494 -36606 -80522 -93571 -72904 -27496 27172 72439 90520 72461 25906
411B5906n4189m0583j4991J3319L7289N1822M9773K5622j2756m5059n6917m6845
$$ 25906 -28283 -68866 -83857 -70538 -33249 18573 68346 93968 81212 36153 -20764 -67609
423f7609k2632Q234L7321N5325N2846K6972j0100l7927m6832m2190k9992p501
$$ -67609 -90241 -82007 -44686 10639 63485 90457 80357 42430 -4402 -46592 -76584 -84085
435h4085K4493N2686N8722L5617l726l5469m7795m5898l2708n720K8794N2256
$$ -84085 -59592 -6906 51816 87433 83707 48238 443 -45455 -78163 -83883 -55089 -2833
447b833N1123K8285j55k1133l4394m6199m8311k4618K0251N6981O1163L7100M538
$$ -2833 48290 76575 76420 55287 20893 -25306 -73617 -98235 -77984 -21003 40160 77260 81798
460H1798k0743l6904m6138m2554j6899J9754M2302M1130K9335J8260K308k5731
$$ 81798 61055 24151 -21987 -64541 -81440 -61686 -19384 21746 51081 69341 71649 45918
472D5918n5446o1787k9457K1971N3670N1131L2823J5882k811k7958m8449m7563
$$ 45918 -9528 -71315 -100772 -78801 -25131 26000 58823 74705 71894 43936 -4513 -52076
484e2076k2560Q530K5509L0701L8001M1914K0140k7165o4890o1482k2359J9023
$$ -52076 -74636 -66106 -40597 -9896 28105 70019 90159 62994 -1896 -63378 -85737 -66714
496f6714L5682L3161L1698L1069J2512k2657m6924m3543k4562q384M962K7362
$$ -66714 -31032 2129 33827 64896 77408 54751 7827 -35716 -60278 -68662 -63700 -36338
508c6338N4560N9856K2326l5243o3894m7372j4092M505R878K0237L7677M2338
$$ -36338 18222 78078 100404 65161 1267 -46105 -60197 -55692 -45814 -25577 12100 54438
520E4438J9452j5705l4765l3980l2053l0615r738L4051O9064N9773J0585l6695
$$ 54438 73890 58185 23420 -10560 -42613 -73228 -82966 -48915 20149 79922 90507 53812
532E3812m5722k6915j5485j8721j1835J7165M5244M6272K2466l281j7891l0612
$$ 53812 8090 -18825 -34310 -53031 -64866 -47701 -2457 43815 66281 63000 45109 14497
544A4497m7478m7491r942M4889O8072M1552k104k1889j5292j1967k7376l9928
$$ 14497 -32981 -80472 -90414 -45525 22547 64099 61995 40106 24814 12847 -14529 -54457
556e4457k1704J8452M4793M2231K7868J4412n165l7576o2362m9312J020M6476
$$ -54457 -76161 -57709 -12916 29315 57183 71595 66430 28854 -33508 -82820 -81800 -35324
568c5324M8049J8394M63P132J1131j1043m2958n0143k1971J6403L5877L7973L6987
$$ -35324 12725 31119 31582 38714 49845 38802 -4156 -54299 -76270 -59867 -23990 13983 50970
581E0970K7526m563m6885o1793l4025R947K9164J7333N775J9488L7386K3139k0089
$$ 50970 78496 73933 27048 -34745 -68770 -58823 -29659 -12326 -6551 12937 50323 73462 53373
594E3373n3076m8769j9992P636K4253L6992M4829L0867r385m5555m5175j5787
$$ 53373 297 -48472 -68464 -60828 -36575 417 45246 76113 66728 21173 -24002 -39789
606c9789M394o02o895J1109M3366N2162J8765k8888n0038l9778k0844n030J4656
$$ -39789 -35395 -35997 -42892 -31783 11583 63745 82510 53622 3584 -36194 -57038 -62068 -47412
619d7412L7638M6174K5923r899k9403k1009q597j6216k8982j5226K6104N7357
$$ -47412 -9774 36400 62323 52424 23021 2012 -6585 -22801 -51783 -67009 -40905 16452
631A6452M9047R442k6477l6986l1794k6127j5517R915L6060L9527J9062j752n911
$$ 16452 65499 74941 48464 11478 -20316 -46443 -61960 -52045 -15985 23542 42604 40852 34941
644C4941l921j5566l8373m2274r274L6235N3936L5740O233j1936k0475k8471l2944
$$ 34941 31020 15454 -22919 -65193 -74467 -38232 15704 51444 57677 45741 25266 -3205 -36149
657c6149k1308O724K8828K8053J6066J3169J5024J959k8560n1579m0685p49L4237
$$ -36149 -57457 -50733 -21905 6148 22214 35383 50407 52366 23806 -27773 -68458 -69207 -34970
670c4970M0498K5810J2767L936j0314k8569l4665k0528J367J4016J5684J9778
$$ -34970 5528 31338 44105 48041 37727 9158 -25507 -46035 -44668 -30652 -14968 4810
682D810K9476K7202p12l7322n1118l1326J498K2048K5336K3349K2579J4879n799
$$ 4810 34286 61488 60776 23454 -27664 -58990 -57492 -35444 -10108 13241 35820 50699 44900
695D4900k6539l0635j9815q656j879Q907K7977M0894K9065n561l6940m0867k2488
$$ 44900 18361 -12274 -32089 -40745 -42624 -33717 -5740 35154 64219 58658 21718 -19149 -41637
708d1637l440O482J4094K4176K8989J9194j847j8935k3606k2667k1620j3653R149
$$ -41637 -45077 -38595 -24501 -325 28664 47858 46011 27076 3470 -19197 -40817 -54470 -45321
721d5321L5761M3812K4060p571k7387k7090j8741j3242p035P333K4113L0175K1240
$$ -45321 -9560 34252 58312 50741 23354 -3736 -22477 -35719 -42754 -35421 -11308 18867 40107
734D0107N324q640j9210k8647l0817j6764J2280L6269L6790J8274k306j2859j6503
$$ 40107 45431 36791 17581 -11066 -41883 -58647 -46367 -10098 26692 44966 42660 29801 13298
747A3298k0419k2910j5704L126K1904K8630K3616J3504l43j7917l2410l3117j4879
$$ 13298 -7121 -30031 -45735 -42609 -20705 7925 31541 45045 44702 26785 -5625 -38742 -53621
760e3621J1660K7824K6732J6341Q035R28j0584k3940k9147j9751m51J7509K6346
$$ -53621 -41961 -14137 12595 28936 36971 37899 27315 3375 -25772 -45523 -45974 -28465 -2119
773b119K6546J9553M216j6615l1427k9632j3747M706J5683J8794J9736J8506R524
$$ -2119 24427 43980 48196 31581 154 -29478 -43225 -38519 -22836 -4042 15694 34200 43724
786D3724q104k5288k9820k0904m755J1235K2930K7610K2799P462j2545k5838k5321
$$ 43724 35620 10332 -19488 -40392 -45147 -33912 -10982 16628 39427 46889 34344 8506 -16815
799a6815j6263n197N209J5636K4274K4807J3273o096k2150k7148k1786r866M501
$$ -16815 -33078 -38275 -33066 -17430 6844 31651 44924 38828 16678 -10470 -32256 -42122 -37621
812c7621J8782K6854K3786J0412o287j8245k2290k0081j3290j581J3994K5726
$$ -37621 -18839 8015 31801 42213 35926 17681 -4609 -24690 -37980 -39561 -25567 159
824A59K6224J5173j801j6264k3756k3098j5144j375J4233K4441K3693J4202Q16
$$ 159 26383 41556 39755 23491 -265 -23363 -38507 -39882 -25649 -1208 22485 36687 37503
837C7503j1466k0275k3102j8317n316J1039K3273K5021J7150L804r929k0428k3939
$$ 37503 26037 5762 -17340 -35657 -40973 -29934 -6661 18360 35510 39314 29385 8957 -14982
850a4982j8710o050R147K0309K3071J7982P115n886j7771k3881k0771q965O376
$$ -14982 -33692 -39742 -30595 -10286 12785 30767 37882 31996 14225 -9656 -30427 -39392 -33016
863c3016J8839K3282J9434R237m430j6905k3168k0527j0240L786J5741K1995K0318
$$ -33016 -14177 9105 28539 37776 33346 16441 -6727 -27254 -37494 -33708 -17967 4028 24346
876B4346J2087j191j4463k2553k1727j2686J089J3967K1172K1100J3374O91j2669
$$ 24346 36433 35242 20779 -1774 -23501 -36187 -35098 -21131 41 21141 34515 35206 22537
889B2537k0907k1314j3854j652J1231J9882K1553J5363L288j0475j9943k1868
$$ 22537 1630 -19684 -33538 -35190 -23959 -4077 17476 32839 36127 25652 5709 -16159
901a6159j5682l815R150J8764K1438J6408N168p917j7920k1173j6764o298O370
$$ -16159 -31841 -35656 -26506 -7742 13696 30104 35272 27355 9435 -11738 -28502 -34800 -28430
914b8430J7201K1141J7810P180n806j6590k0854j7725q235M363J5574K0648J8297
$$ -28430 -11229 9912 27722 34902 29096 12506 -8348 -26073 -34308 -29945 -14371 6277 24574
927B4574R136l178j4452k0415j8531j0104K004J3610J9867J8860J0823r68j2645
$$ 24574 33710 30532 16080 -4335 -22866 -32970 -30966 -17356 2511 21371 32194 31226 18581
940A8581j9326j9005j1729J0J1483J8882J9226J2543J094j0576j8445j9213j3165
$$ 18581 -745 -19750 -31479 -31469 -19986 -1104 18122 30665 31759 21183 2738 -16475 -29640
953b9640k249R590J7716J9230J3855L407q649j6935j9327j4450m253P474J6451
$$ -29640 -31889 -22299 -4583 14647 28502 31909 23260 6325 -13002 -27452 -31705 -24231 -7780
966g780J9127J4783N305o419j5759j8952j5291o136N467J4871J8752J5785P024
$$ -7780 11347 26130 31435 25016 9257 -9695 -24986 -31122 -25655 -10784 7968 23753 30777
979C0777m222j4177j8489j6280p832L252J3118J8263J6536Q775k277j2410j7926
$$ 30777 26555 12378 -6111 -22391 -30223 -26971 -13853 4410 20946 29721 27444 15034 -2892
992b892j6641r405J289J1556J7235J6917J0206k33j0685j7036j7008j0875o77
$$ -2892 -19533 -28938 -27649 -16093 1142 18059 28265 28032 17347 311 -16697 -27572 -28249
1005b8249R805J6481J7288J1523J456q970j6012j7025j1899k484P725J5180J7294
$$ -28249 -18444 -1963 15325 26848 28304 19334 3322 -13703 -25602 -28086 -20361 -5181 12113
1018A2113J2672L423o975j4889j6940j3117m372O065J4195J7109J3554M845n299
$$ 12113 24785 28208 21233 6344 -10596 -23713 -28085 -22020 -7825 9284 22838 27683 22384
1031B2384j3497j6469j3827o001M077J2845J6604J4295O577l251j2138j6123j4755
$$ 22384 8887 -7582 -21409 -27410 -23333 -10488 6116 20411 26988 23737 11599 -4524 -19279
1044a9279p401K527J1530J6085J4446P823j557j0298j5505j4927q989O83R862
$$ -19279 -26680 -24153 -12623 3462 17908 25731 24174 13876 -1629 -16556 -25545 -24862 -15000
1057a5000J5420J5107R306K32r189j4923j5139j0029p72Q446J4436J4808J0286
$$ -15000 420 15527 24833 25065 15876 953 -14186 -24215 -24987 -16541 -2105 12703 22989
1070B2989J886p114j3767j5464j1145k457O644J3569J5206J1238L547n999j2986
$$ 22989 24875 17761 3994 -11470 -22615 -25072 -18428 -4859 10347 21585 25132 19133 6147
1083F147j5288j1533m051N271J2118J4659J2093N210l987j1950j4845j2694n424
$$ 6147 -9141 -20674 -24725 -19454 -7336 7323 19416 24626 20639 8689 -6156 -18850 -24274
1096b4274L545J0982J4677J2807O319k804j0739j4389j2478o797J713R580J3778
$$ -24274 -20729 -9747 4930 17737 24056 21252 10513 -3876 -16354 -23151 -21438 -11858 1920
1109A920J3455P817j096r285j3935j3440p866K26Q562J3428J3639Q414K98p883
$$ 1920 15375 23192 22096 12811 -1124 -14564 -22430 -22204 -13642 -214 13425 21839 22137 14254
1123A4254j2874j3283q805j614O783J2679J3857R607J917o519j2431j3342r836
$$ 14254 1380 -11903 -20708 -22322 -15539 -2860 10997 20604 22521 16002 3571 -9771 -19607
1136a9607k697N709J1853J3491R985L103m796j0844j3192j0923m168L924J1083
$$ -19607 -22304 -16595 -4742 8749 18734 21837 17041 6197 -6995 -17918 -22086 -18162 -7079
1149g079J3512J0922M414l754j0099j2953j1245n121K808R621J2821J1141N741
$$ -7079 6433 17355 21769 18015 7916 -5037 -16282 -21403 -18595 -8974 3847 14988 20729
1162B0729j706q793j2734j1802o581J324Q779J2469J1708O678o37p892j1968j1823
$$ 20729 19023 10230 -2504 -14306 -20887 -19563 -10784 1685 13393 20071 19434 11542 -426 -12249
1176a2249p328J17P046J1662J1854P872Q89o505j1699j2117q143j226O196J0960
$$ -12249 -19577 -19460 -12414 -752 11102 18974 19863 13358 1659 -10458 -18601 -19827 -13631 -2671
1190b671J1792Q438K118n406j0492j1930q841k552M592J0072J1958R468L077m256
$$ -2671 9121 17559 19677 14271 3779 -8151 -16992 -19544 -14952 -4880 7078 16546 19623 15367
1204A5367r813j1718r455l529L342R225J1619R735M134k770q662j1348j0033m904
$$ 15367 5554 -6164 -15619 -19148 -15806 -6581 5038 14773 18907 16137 7475 -3873 -13906 -18810
1218a8810K197Q453J1407J0040M917j529p851j0886j0132n732Q52P459J0915J0114
$$ -18810 -16613 -8160 3247 13287 18204 16675 8824 -2062 -12194 -17926 -17074 -9615 1300 11414
1232A1414O178n40o642j0537j0614o492k5O542J0101J0192O757R29n488r944j0743
$$ 11414 17592 17052 10410 -127 -10741 -17233 -17258 -10716 -615 9577 16334 17263 11775 1831 -8912
1247h912p251j090N155R623J0415P543J906m726r472j0430p673k099M074Q522
$$ -8912 -16163 -17253 -12098 -2475 7940 15483 17389 12663 3191 -7239 -14912 -17011 -12937 -4415
1261d415J0336Q278K983l329q869j0451q228l071L062P978R980Q677L648k518
$$ -4415 5921 14199 17182 13853 4984 -5467 -13695 -16766 -13704 -5726 4254 12931 16579 14061
1275A4061p884r728q361m074J489O903J0028R332M786j779p269r612q741m749
$$ 14061 6177 -3551 -11912 -15986 -14497 -7594 2434 11766 16552 14773 7504 -2108 -10849 -15598
1289a5598O90O341R531R110N354o88n766q862q987o118n24N489R309R778N792
$$ -15598 -14908 -8567 964 10074 15428 14740 8974 112 -8875 -14993 -15517 -10028 -719 9059 14851
1304A4851J04n178q373r006o389j256M610Q535R040O390J610l587p732r546p379
$$ 14851 14955 9777 1404 -7602 -13991 -15247 -10637 -2102 6938 13328 14938 11351 3619 -5927 -13306
1319a3306k401L939Q564Q951O737K053k893p014r044p516k958K809P130Q630P259
$$ -13306 -15707 -11768 -3204 5747 12484 14537 11644 4630 -4414 -11930 -14888 -12079 -4949 3681 10940
1334A0940L678j564o832r423q326l457K356O682Q368P447M086q45n905q561q145
$$ 10940 14618 13054 6222 -3201 -11527 -14984 -12628 -5946 2422 9869 13955 13110 7205 -1356 -9501
1349i501m331Q37N362P981Q093N350j7n542q915q137m450L96M600P449P940N614
$$ -9501 -13832 -12995 -7633 348 8441 13791 13774 8232 -683 -8820 -13270 -12874 -8274 -825 7115 12729
1365A2729Q03m350p884q009n587j262L718P358Q629O446J179m177p409p806n375
$$ 12729 13532 9182 1298 -6711 -12298 -13560 -9842 -2484 6145 12591 13770 9593 2184 -5622 -10997
1380a0997j912K749O573Q184O588K143k759o681p817o519k964K100O668Q477O870
$$ -10997 -12909 -10160 -3587 4597 11185 13328 10569 3888 -3929 -10448 -13412 -11312 -4644 3833 10703
1395A0703K269k385n755p267o610l647J060N695P994P025L439j054n327p420p308
$$ 10703 12972 10587 4832 -2435 -9045 -12692 -11632 -5937 2057 9082 12521 11467 6140 -1280 -8588
1410h588m140R24N476P782O613L643l34m244o981p147m845l85M601P204P183M673
$$ -8588 -12728 -11804 -6328 1454 8067 11710 11376 7132 151 -6996 -11841 -12226 -7625 -421 6762 11435
1426A1435M26l759o961p534m923m86M002O365O862M837J330k714o460p334n741
$$ 11435 11861 8102 1141 -6393 -11316 -11802 -7800 -1435 5427 10264 11594 8880 2420 -4914 -10655
1441a0655j402L176O281P011N665J867k637o103p233n444j980K300N208O748N923
$$ -10655 -12057 -8881 -2600 4411 10076 11943 9306 3203 -4030 -9474 -11454 -9154 -3946 2802 8725
1456H725K927j587n580p272o009k680J630N230O791O104L080j358m929o751n826
$$ 8725 11652 10065 4485 -2787 -8796 -11476 -9846 -4616 2175 8279 11359 10001 5072 -1679 -7505
1471g505l374O39M267O730O462L821n99m483o483o202l615J37L897O291O217M025
$$ -7505 -10879 -10240 -5973 757 7219 11040 10441 5958 -525 -6727 -10342 -10205 -6308 -17 6200 10225
1487A0225J90l758o067o178m283p94L434O276O382M469P39l188n879o266m602
$$ 10225 10415 6657 590 -5588 -9871 -10665 -7231 -955 5427 9896 10635 7447 1568 -4698 -9300
1502i300j155K688N558O485M636J504k355n382o301n004j757K288N311O225M916
$$ -9300 -10455 -7767 -2209 4276 8912 10416 8061 2679 -3622 -8626 -10383 -8095 -2784 3441 8357
1517H357J871j875m974o217n150k333J627M778O205N332K465j301m426o067n446
$$ 8357 10228 8353 3379 -2838 -7988 -10321 -8694 -3916 2289 7621 10086 8785 4359 -1708 -7154
1532g154k719J030M288N874N379K903o04m024n935n521l053M92L739N709N579
$$ -7154 -9873 -8843 -4555 1319 6698 9601 8997 4973 -962 -6483 -9536 -9044 -5305 404 5983
1547E983L360q4l428n749n784l480o8L343N215N762L727M79l005n281n654l815
$$ 5983 9343 9259 5831 82 -5702 -9182 -9250 -5907 -692 5070 8797 9276 6271 990 -4664 -8479
1563h479p93K785N088N707M265R09k746n031n769l983j158K141M723N768M264
$$ -8479 -9272 -6487 -1399 4308 8573 9482 6736 1705 -4064 -8047 -9205 -7064 -2341 3427 7691
1578G691J663k021m596n509m608j797J627M393N838M651J902j758m299n353m598
$$ 7691 9354 7333 2737 -2772 -7380 -9177 -7550 -3157 2681 7332 9234 7476 3177 -2176 -6774
1593f774k167J111L917N699M826K411r38l907n339n066k853O86M009N402N036
$$ -6774 -8941 -7830 -3913 1786 6612 9023 8085 4178 -1161 -6227 -9080 -8394 -4385 1017 6053
1608F053K454n01l264m812n174l185P7L182N145N103L271Q3k858n149n298l584
$$ 6053 8507 8006 4742 -70 -5244 -8429 -8352 -5170 -25 5078 8349 8432 5574 425 -4873 -8457
1624h457j67L256M847M723L333O52j965m397n494m078q50K281M447N104M103J335
$$ -8457 -8624 -5368 -521 4202 7535 8187 6222 1825 -3669 -7747 -8597 -6316 -1869 3235 7338 8673
1640H673j988m747n450l878p29K103L704M555M047K160j141m052n575m423j845
$$ 8673 6685 1938 -3512 -7390 -8119 -6016 -2312 2243 6290 8450 7309 3257 -2318 -6741 -8586
1655h586J478L629N048M848K263j365m227m952l755j783N49K698M368M941L225
$$ -8586 -7108 -3479 1569 6417 8680 7315 3088 -1864 -5619 -7402 -6853 -4155 213 5154 8379
1670H379m29l722n200m430k410R6K968N040N130K574o94l208m002l757k987j094
$$ 8379 7950 4228 -972 -5402 -7812 -7716 -4748 292 5422 7996 7302 4094 92 -3665 -6652 -7746
1686g746J679M691N476L787J69k972m192m669l372q87K435M780M807K691L18j798
$$ -7746 -6067 -1376 4100 7887 8056 5084 892 -3777 -7149 -8036 -5601 -821 3986 6677 6995 5197
1702E197k839m275m350k389J514M941N506L648O71j682l553m677l906j423J696
$$ 5197 2358 -1917 -6267 -8656 -7142 -2201 3305 6953 7624 5942 2389 -2288 -6194 -7617 -5921
1717e921L945L762K999J726J57k375m928n418k758J670M306M756L431J766m90
$$ -5921 -1976 1786 4785 6511 6668 4293 -635 -6053 -8811 -7141 -2835 1921 5352 7118 6628
1732F628k922m554m362j899J019K548L101L717L602J308k534n658n589k312J215
$$ 6628 3706 -848 -5210 -7109 -6090 -3542 -441 3276 6878 8186 5652 -6 -5595 -7907 -6692
1747f692L266L597L605K796M67k402m304l957k317m57Q73L072M962M750J563k964
$$ -6692 -3426 171 3776 6572 7039 4637 333 -3624 -5941 -6398 -5525 -2453 2509 7259 8822 5858
1763E858n542m622k065K20J464K777M126L707J113j865l437l444l166k216J65
$$ 5858 316 -4306 -6371 -6151 -4687 -1910 2216 5923 7036 5171 1734 -1710 -4876 -7092 -6927
1778f927L579N660M979R55k870m137l504k327j639J55K819M459L862J565q18k298
$$ -6927 -3348 2312 7291 8246 5376 1239 -2265 -4592 -6231 -6076 -3257 1202 5064 6629 5811 3513
1794C513l491m334l417p4M105N711L952P78j584k398k874l284k885n09K496M238
$$ 3513 22 -4312 -7729 -7803 -3698 2013 5965 6743 5159 2761 -113 -3397 -6282 -6791 -4295 -57
1810e7L836K318O05j495l874n309l913K55L866M618L132J264K15q76k851m129
$$ -57 3779 6097 6702 5207 1333 -3976 -7889 -7634 -3768 850 3982 5246 5461 4585 1734 -2395
1826b395l759r63K191L590L782L253J878j421m293n718l222M50K637L033K582
$$ -2395 -6154 -7117 -4926 -1336 2446 5699 7577 6156 1863 -3855 -7077 -6627 -3990 -957 1625
1841A625K417K138K7l055m725l868j363R38K928M004M339K481j436m513m662k403
$$ 1625 4042 6180 6207 3152 -1573 -5441 -6804 -5866 -2938 1066 5405 7886 6450 1937 -2725 -5128
1857e128l65R00J438K797M005L252L9l105m514l670k109j04K363M309M715K376
$$ -5128 -5493 -4593 -3155 -358 3647 6899 6938 3833 -681 -4351 -6460 -6564 -4201 108 4823 7199
1873G199j147l375l255k521j755r44O36L680M756L497J81k412l915l983k690r50
$$ 7199 6052 2677 -578 -3099 -4854 -5798 -5162 -1482 3274 6771 6952 4540 625 -3358 -6048 -6998
1889f998K148M381M195K085k33j733k148l054l395k196Q50L918M846L189P56j566
$$ -6998 -4850 -469 3726 5811 5578 3845 1697 -1357 -4752 -6948 -6098 -2180 2666 5855 6611 5045
1905E045l213l784l504j396J689L632L576K213J140j32j792l540m530k560P32
$$ 5045 1832 -1952 -5456 -6852 -5163 -1531 2045 4258 5398 5266 3474 -66 -4596 -7156 -6424
1920f424L673M086L328J439m53k475m018l521j690P80K379K974K723K712R43j853
$$ -6424 -2751 1335 4663 6102 5649 3174 -844 -4365 -6055 -5275 -2896 78 2801 5513 6456 4603
1936D603m204m566k504M60K808L300L397K456M53k055l783l387k152l49J227K578
$$ 4603 399 -4167 -6671 -6211 -3403 -103 3294 5750 6203 4148 365 -3022 -5174 -5523 -4296 -1718
1952a718L779L412J387j847l955m067k456l52J503K772L605K953R83j285l126
$$ -1718 2061 5473 6860 5013 1058 -3009 -5465 -5817 -4314 -1542 2063 5016 5999 4714 1588
1967A588l126k840j414L23K623M044L795J714j354l334l522k767j353N04K434
$$ 1588 -1538 -4378 -5792 -5469 -2846 1198 4993 6707 5353 2019 -1503 -4270 -5623 -5119 -2685
1982b685L479L183J740n26k239l186l343k326j56K416M188L552J700m73k212l111
$$ -2685 794 3977 5717 5191 2952 -234 -3577 -5903 -6059 -3643 545 4097 5797 5324 3112 1
1998Al024k235l51J821L318L476K187L75j510l187l548k761m86J888L451L301
$$ 1 -3023 -5258 -5609 -3788 -470 3006 5193 5568 4058 871 -2677 -5438 -5924 -4036 -585 2716
2014B716K164N03j301k729l406k824q17J262K867L318K760J253r45k944l652k838
$$ 2716 4880 5383 4082 1353 -2053 -4877 -5694 -4432 -1565 1753 4513 5766 4821 1877 -1775 -4613
2030d613j039J219K494L252K684J357n60k335l536l060j259N50K251L309L121
$$ -4613 -5652 -4433 -1939 1313 3997 5354 4794 2459 -1077 -4137 -5396 -4846 -2595 714 3835
2045C835J762n15k342l327l092j491L23J917L092L058J951mj951l111l301j841
$$ 3835 5597 5082 2740 -587 -3679 -5170 -4847 -2930 162 3220 5171 5167 3216 105 -3196 -5037
2061e037r4J770L086L271J976K05j722l080l026k100m76J487K864L276K291N62
$$ -5037 -5131 -3361 -275 2996 4972 5177 3455 375 -2651 -4751 -5227 -3740 -876 2400 4691 5253
2077E253j421k795l125k460o16J089K825L064K577Q61r79k727l139k471j061Q93
$$ 5253 3832 1037 -2088 -4548 -5164 -4075 -1250 1814 4391 5252 4273 1546 -1593 -4064 -5125 -4232
2093d232K412L171K673J182q60k319l130k719j218M99K285L150K704J327m15k020
$$ -4232 -1820 1351 4024 5206 4346 2027 -1103 -3822 -5040 -4541 -2256 894 3598 4925 4510 2490
2109B490l070k803j541J75K029L059K854J706k52j712l051k993j618j22J796K777
$$ 2490 -580 -3383 -4924 -4749 -2720 339 3193 4899 4647 2935 -116 -3109 -4727 -4849 -3053 -276
2125b76L006J878K92j614k872k949j967l15J434K718K890K086N61j368k532l134
$$ -276 2730 4608 4900 3286 414 -2535 -4502 -4817 -3383 -665 2225 4311 4872 3504 972 -2162
2141b162j950p54J151K464K982K251Q93r24k532l069k337p77P84K349K902K378
$$ -2162 -4112 -4866 -3715 -1251 1731 3982 4875 3951 1419 -1650 -3987 -4764 -3980 -1631 1271 3649
2157C649J082o28k152l037k360j276N06K030K883K681J295m13k081k775k558j418
$$ 3649 4731 4103 1951 -1086 -3446 -4722 -4216 -2186 697 3378 4673 4260 2179 -596 -3154 -4572
2173d572K54J814K870K576J514j43j647k664k712j713P8J445K741K757J574K23
$$ -4572 -4318 -2504 366 2942 4456 4313 2666 2 -2710 -4423 -4345 -2900 -159 2598 4172 4395
2189D395j494k521k651j886k08J289K452K685J892M25j098k417k740k132n17J034
$$ 4395 2901 380 -2271 -4157 -4365 -3076 -624 2061 3953 4378 3280 863 -1877 -4009 -4526 -3492
2205c492K532K596K059O95j022k128k597k216o55O40J974K690K263R15n20j989
$$ -3492 -960 1636 3695 4390 3368 1240 -1357 -3573 -4228 -3588 -1614 1076 3339 4254 3734 1745
2221A745k696k355j066O60J827K555K276J222l84j666k554k474j120J30J536K507
$$ 1745 -951 -3306 -4372 -3712 -1885 670 2946 4168 3784 2118 -436 -2910 -4030 -3900 -2364 143
2237A43K420J497k8j663k531k325j402N5J431K129K467J444L03j366k270k410
$$ 143 2563 4060 4032 2369 -162 -2487 -3889 -3834 -2403 -274 2193 3637 3940 2574 304 -2106
2253b106j598k58J222K187K491J662M04j109k172k348j704n13P90K051K411J942
$$ -2106 -3704 -3962 -2740 -553 1938 3600 4004 2895 723 -1625 -3329 -3842 -3052 -1001 1410 3352
2269C352N24p65j992k373j936q11O87K018K490J751Q51p57j697k131j993j053
$$ 3352 3876 3111 1119 -1254 -3190 -4001 -3314 -1296 1194 2945 3796 3039 1342 -789 -2782 -3835
2285c835N98J554K345K112R21l35j539k323k062j055K21J632K165K045J124j62
$$ -3835 -3237 -1683 662 2774 3695 3360 1821 -502 -2564 -3619 -3398 -1766 399 2444 3568 3406
2301C406j320k232k081j303j08J464K078K089J505k8j221k068k181j347j17J143
$$ 3406 2086 -146 -2227 -3530 -3638 -2174 -96 1993 3498 3470 2249 181 -2000 -3347 -3464 -2321
2317b321J915K060J459L70q98j975k159j630m57R90J873K216J601N11r26j673
$$ -2321 -406 1654 3113 3483 2585 610 -1549 -3179 -3636 -2646 -773 1443 3044 3555 2629 956
2333I56k182j696n21O61J717K065J706Q76p21j731k075j751q09O35J518K087J845
$$ 956 -1226 -2922 -3443 -2782 -1065 1000 2706 3582 2861 1130 -945 -2696 -3505 -2870 -1352 735 2580
2350B580P55m44j387k079j831q59K64J421J877J865J059j03j493j887j871j025
$$ 2580 3335 2891 1504 -575 -2406 -3265 -3001 -1580 297 2162 3221 3118 1625 -262 -2133 -3158
2366c158J76J093K006J882J084K1j126j824j979j381M7J083J828J896J303K39
$$ -3158 -2982 -1889 117 1999 3083 3104 1978 154 -1825 -3206 -3159 -2076 -248 1648 2951 3190
2382C190j105j696k009j340j80R62J682J858J341M27p82j675j963j486l48O50
$$ 3190 2085 389 -1620 -2960 -3140 -2178 -496 1362 2703 3130 2348 673 -1290 -2776 -3124 -2474
2398b474J721J815J567N68p36j500j887j604n49N04J596J838J460Q44n66j467
$$ -2474 -753 1062 2629 3197 2461 961 -926 -2530 -3079 -2575 -979 859 2319 3163 2597 1130
2414A130j785j645n83K09J351J811J642R37l76j342j713j571r37J44J184J904
$$ 1130 -655 -2300 -2883 -2674 -1323 488 2130 3067 2691 1349 -364 -1935 -2872 -2728 -1544 360
2430C60J577Q47j27j121j588j617j179Q6J015J736J708J010n5q65j492j858j097
$$ 360 1937 2784 2657 1536 -52 -1669 -2848 -2762 -1747 -11 1697 2707 2652 1787 295 -1563 -2660
2447b660j62R42J615J579J187K52o21j545j756j303l90P45J586J654J283M03o50
$$ -2660 -2822 -1880 -265 1314 2501 2753 2132 587 -1169 -2472 -2862 -2117 -531 1123 2406 2809 2159
2464B159j461j744j352k93O57J219J636J289P16m00j424j806j429m41N31J129
$$ 2159 698 -1046 -2398 -2691 -2034 -815 821 2110 2826 2426 1002 -804 -2233 -2674 -2143 -1014
2480a014J516J499P35l51j307j616j262p90K08J133J438J459J026j90j284j479
$$ -1014 502 2001 2736 2385 1078 -538 -1800 -2590 -2382 -1249 189 1648 2674 2484 1200 -279
2496b79j429p53K59P91J468J558Q03or50j410j432q35k71P98J433J676J200j78
$$ -279 -1708 -2461 -2202 -1411 57 1615 2418 2412 1462 52 -1380 -2215 -2486 -1688 -255 1421 2621 2443
2514B443r33j358j351j042n5N79J415J448R91K38o57j272j402j143l08N47J338
$$ 2443 1510 152 -1199 -2241 -2296 -1717 -302 1146 2137 2375 1718 446 -956 -2099 -2407 -1860 -522
2531e22J555J152J21o03j085j245j386k49M60R67J524J106M82l30j069j387j349
$$ -522 1033 2185 2306 1703 618 -627 -2013 -2262 -1802 -835 689 1795 2277 1947 878 -509 -1858
2548a858n85M15J217J318J116N32j64q69j455j341n23J72R38J279J172P61m0q11
$$ -1858 -2443 -2028 -811 507 1623 2155 1991 1122 -333 -1674 -2197 -2025 -1087 192 1364 2125 2085 1274
2566A274j589j202o18K00R30J143J155P77j2p38j292j149r66n0P84J207J282R66
$$ 1274 -315 -1517 -2135 -1935 -1005 138 1293 2070 2058 1320 28 -1121 -2087 -2137 -1353 -146 1136 2102
2584B102J35q34j324j307p04o2M95J130J230J043K89o33j231j204r76j32M24J155
$$ 2102 2237 1403 79 -1228 -1932 -1994 -1499 -369 861 1904 2193 1560 329 -875 -1851 -1983 -1559 -404
2602d04J245R88J78n34j009j041j077l46L50R44J313J039M16m43r02j247j042
$$ -404 841 1829 2007 1473 464 -577 -1654 -2000 -1650 -706 607 1646 2062 1619 717 -530 -1572
2619a572n16L52Q69J366J078L77m09p73j053j142n45O5R30J223J250M46k17p82
$$ -1572 -2088 -1736 -867 499 1577 1954 1545 772 -281 -1423 -1968 -1903 -973 250 1500 1946 1729 947
2637I47j233j029o03J63P20J175J113O50r1o60j054j070q82p1P62J153J001Q61
$$ 947 -286 -1315 -1918 -1755 -1035 140 1253 1903 1812 1152 98 -972 -1854 -1925 -1163 -10 991 1852
2655A852j6o52r60j163q39p5M90J128J175P30K82m68j125j138r52r1N04R33J187
$$ 1852 1836 1184 224 -939 -1778 -1853 -1363 -235 940 1670 1952 1484 359 -779 -1731 -1822 -1318 -385 802
2674H02P41K97l71r71j105r24l16L70R26J111Q85M63m82q38j059r55l45J83R71
$$ 802 1543 1840 1469 498 -607 -1531 -1847 -1477 -551 560 1445 1908 1426 588 -471 -1426 -1771 -1588 -617
2693f17R72R79M20r3q84j177r50m62J73P41J199Q78N52r1p13j089r33o41J60O64
$$ -617 355 1334 1754 1661 777 -400 -1350 -1812 -1639 -898 301 1179 1731 1640 927 -162 -1095 -1736 -1576 -912
2713i12R75J056N22J08p51j055r78n57j01O29R93J026N95J14o05r87j087n79q7
$$ -912 63 1119 1641 1749 998 -57 -1035 -1592 -1693 -1064 -71 955 1550 1664 1059 72 -1015 -1594 -1681
2732a681N74Q19J068P26J47m71r15j057o96j63M32J007R68O78J05l14q23r71r19
$$ -1681 -1107 -288 780 1506 1653 1182 267 -790 -1486 -1649 -1217 -210 758 1436 1541 1227 404 -567 -1486
2751a486j65L88Q86R03Q10K71l57q00j056p76l42L30Q89J014P74K78k12p55r52
$$ -1486 -1651 -1263 -377 526 1336 1607 1250 450 -606 -1382 -1724 -1394 -505 509 1283 1561 1349 594 -358
2770c58q14m36K29O63R99Q70M70k12q61q51r31l25J88O10Q67R80M86j58n44r97
$$ -358 -1172 -1608 -1379 -716 283 1153 1623 1411 550 -301 -1232 -1557 -1369 -759 108 1088 1574 1416 872 -125
2790a25q63m37l6N80Q84R62O44k94m89r69p33m64m4M67P43J141N08J31n90r77
$$ -125 -988 -1425 -1461 -881 3 965 1609 1315 826 -143 -876 -1340 -1384 -917 -174 967 1475 1606 1016 39
2810C9q48n92j59M67R15R81O28O0m59p53q77p58j97L46Q84R44P00K96l91q64r95
$$ 39 -809 -1401 -1560 -1093 -178 803 1431 1491 1032 279 -598 -1356 -1553 -1207 -323 621 1321 1617 1226 362 -633
2831f33q07q7K47R49J023O00J64k41o42r65q37m72K25Q98J060P23L48k13p06j025
$$ -633 -1440 -1527 -1280 -331 692 1292 1456 1215 573 -392 -1229 -1701 -1476 -578 482 1205 1553 1340 634 -391
2851c91q56m34L66Q46P50P82M45j71m92r99r67o26L51P33R06P13O37p7p09j098
$$ -391 -1247 -1681 -1315 -469 281 1063 1508 1337 845 -154 -1121 -1747 -1396 -663 243 956 1593 1516 807 -291
2871b91p62l46M3N11Q16Q67O45J96o74j074j012m54J14N22P74J082O08Om57j070
$$ -291 -1053 -1399 -1356 -845 -29 838 1483 1679 1005 -69 -1081 -1535 -1421 -899 -125 957 1565 1571 1114 44
2891D4p67o39j23L22P71J012Q59L17n85j053r70o47o6L02Q48J142O26K54m96p13
$$ 44 -723 -1362 -1485 -1163 -392 620 1479 1796 1211 158 -812 -1459 -1525 -1223 -375 767 1393 1647 1151 438
2911D38q06q43l25M5P57J203Q75M58n47q29q47p88k78L3P94R68R20L53k19n05
$$ 438 -368 -1211 -1536 -1491 -734 469 1344 1802 1255 426 -421 -1209 -1487 -1454 -660 308 1228 1581 1362 857
2931H57r01r58p18K4Q76J138R85L48j33q00p68q48p25P1P34Q25Q61O53N1m40r97
$$ 857 -44 -1002 -1720 -1696 -820 318 1303 1651 1518 718 -50 -898 -1623 -1552 -818 7 868 1521 1572 1132 135
2952A35j041p25j38O97J176Q76M73Ol48q86q94o90l24N13Q31R08Q81K73l34j067
$$ 135 -906 -1631 -1769 -1072 104 980 1453 1459 1111 225 -669 -1359 -1683 -1170 -339 569 1450 1723 1389 322
2972C22j155o79j47N19P95R16P77K87l15p62j032q07l60J96O55J072J128N52m94
$$ 322 -833 -1512 -1659 -1140 -345 571 1348 1635 1320 558 -474 -1281 -1641 -1445 -790 282 1410 1962 1468
2991A468q63j120r35r1K39N25Q33J019N81k01n98r46j024n36N5O38J174R66O07
$$ 1468 605 -515 -1450 -1541 -1302 -777 56 1075 1656 1455 857 -89 -1113 -1649 -1594 -956 218 1184 1791
3010A791k81p77r57q13m43j0M97J000R33P32j02o21p65j013q50j70P46J032J122
$$ 1791 1510 733 -224 -1037 -1480 -1490 -993 7 940 1672 1570 949 184 -829 -1679 -1849 -1103 -71 1051
3029A051M77r9l59q14r34p95j09K59Q77J135P26L56m79r35j042r24k09N27J006
$$ 1051 1528 1429 1070 256 -678 -1473 -1582 -1323 -446 689 1415 1771 1292 357 -685 -1609 -1818 -1291 -285
3048b85R80O55J86j98p41j003j004l91K91R72J037R86K43k01q12j323o47m25K08
$$ -285 695 1350 1536 1338 597 -406 -1410 -1801 -1510 -538 499 1485 1728 1527 715 -608 -1255 -1680 -1472
3067a472Q67R42P74N68l8p31j110j050n74J89Q12J030R43N26j0p96j000r80n40
$$ -1472 -605 337 1111 1679 1641 910 -200 -1250 -1824 -1635 -823 207 1150 1676 1666 870 -130 -1110 -1650
3086a650Q3N75P58J238O25K65q08j000j118p05J8N25J148R87P32N7n72r37r33
$$ -1650 -1567 -992 -234 1004 1629 1894 1086 86 -1032 -1737 -1719 -1194 -46 941 1673 1730 1158 221 -712
3105g12p47k23L35R89J138Q62K67n19j078j037q22j55J53J222Q73J008K82m30
$$ -712 -1459 -1682 -1347 -358 780 1642 1909 1390 312 -725 -1547 -1702 -1549 -327 546 1554 1836 1406
3123A406p52j124r53n16K13J062J205R38L35k74p96j101j083m09K03P62J165J014
$$ 1406 654 -470 -1423 -1939 -1726 -664 541 1479 1814 1540 744 -357 -1440 -1849 -1646 -884 281 1295
3141A295N46q7q06j202r84n50J0P97J116J098M78n4n25j186r67p57j1N61J069
$$ 1295 1841 1754 948 -254 -1238 -1788 -1778 -981 135 1233 1711 1657 1132 -54 -1021 -1778 -1789 -1228 -159
3160a59J094P51Q5n12j058j193q82M2M28J110J123P88K47m02j090j113r04k78
$$ -159 935 1686 1771 1259 201 -992 -1874 -1832 -1404 -294 829 1617 1864 1462 372 -741 -1645 -1923
3178a923N16Q38J175R21M57m33r44j145j047l06M08P84J222R44M95k95q68j247
$$ -1923 -1407 -569 606 1527 1984 1551 607 -538 -1585 -1891 -1483 -699 523 1467 1962 1667 799 -448
3196d48r19n06K03Q23J131J064O54k26r20j155r68n45P8P32J127J068O51j02n50
$$ -448 -1367 -1873 -1670 -847 284 1348 2002 1776 856 -299 -1267 -1812 -1734 -1002 125 1193 1844 1742 1192
3215A192j083j304p40N3N68J273J182P62q2n46j079j158q59l7M91J096J152R52
$$ 1192 109 -1195 -1935 -1882 -1314 -41 1141 1903 1821 1275 196 -962 -1821 -1858 -1367 -271 881 1833
3233A833O1m80r63j230q99l36O03R38J235Q01L56l35j018j199j047l91L56J079
$$ 1833 1894 1414 451 -779 -1678 -2014 -1411 -473 762 1563 1919 1584 566 -633 -1680 -2071 -1715 -636
3251f36J135J039M44l17r99j166j004n40L82P82J137J136N59n7j009j211r78n75
$$ -636 499 1538 1982 1665 666 -500 -1504 -2044 -1662 -880 257 1393 1952 1895 886 -325 -1303 -1878
3269a878K0Q43J136J254N67l5p53j149j193p16pP10J102J326O24l3n71j115j201
$$ -1878 -1858 -1015 121 1375 1942 1907 1154 5 -1188 -1904 -1911 -1201 -99 1227 1851 1818 1247 132 -1069
3288a069p59p0N71J077J133R10J48n20j058j258r00j94M61J071J215R79K91l71
$$ -1069 -1828 -1898 -1327 -250 883 1793 1941 1421 363 -895 -1795 -1989 -1528 -457 758 1737 2028 1657
3306A657j097j245r78l91M37R33J374R15M09k62q61j431r42n43K57J014J236R56
$$ 1657 560 -685 -1663 -2054 -1617 -684 690 1605 2014 1752 891 -540 -1482 -2025 -1768 -754 482 1438
3324A438O99l43p34j387j149n85J62Q13J393R59O54K3p38j216j163p67q4Q48J129
$$ 1438 2137 1794 1060 -327 -1476 -2061 -1899 -1086 307 1266 1920 1943 1205 -11 -1174 -1941 -2025 -1177 -48
3343d8J206P84P5p10j150j332p23j65O90J100J302Q30K15n66j174j380p57l22
$$ -48 1158 1942 2017 1307 157 -1175 -1898 -2063 -1373 -273 1029 1859 2074 1508 334 -1046 -1803 -2125
3361b125N11J192J269J011L96n77j117j351q69m57L77J138J110J106N22l98j095
$$ -2125 -1614 -422 847 1858 2254 1677 560 -791 -1660 -2117 -1740 -602 508 1614 2136 1738 643
3378F43j194j164l38K37Q96J386J019O17k48r04j306j056p08K00R21J183J233
$$ 643 -551 -1715 -2053 -1816 -920 466 1485 2102 1854 950 -356 -1412 -2120 -1920 -999 184 1417
3395A417O92j70p22j286j228p03K9O54J343J161Q85J4q79j028j221q95j00O98
$$ 1417 2109 1939 1217 -69 -1297 -2000 -1971 -1317 26 1187 2072 2086 1207 179 -1042 -1937 -2037 -1339
3413a339J100J322Q70J21o16j116j324q52k33N08J035J413Q90M20n26j075j380
$$ -1339 -239 1083 1953 2074 1458 342 -982 -1834 -2067 -1559 -524 889 1779 2199 1673 598 -782
3430g82r19m31M85R94J175J080N18l93r13j261j202l52J97R15J323J148N16j04
$$ -782 -1701 -2132 -1647 -653 522 1602 2120 1727 814 -447 -1649 -2001 -1804 -889 434 1582 2098 1994
3448A994j026j243j252o05K12Q81J242J139O17pq12j297j065q19n4P80J222J211
$$ 1994 968 -275 -1527 -2132 -1920 -1039 203 1342 1959 1952 1140 -157 -1222 -2041 -2095 -1315 -93 1118
3466A118Q39J83p27j184j323q31k91O86J229J256Q89K75n45j317j172r34k85M97
$$ 1118 1957 2140 1413 229 -1094 -1925 -2216 -1530 -301 955 1844 2119 1574 257 -915 -1849 -2134 -1637
3484a637J170J260R59L55m06j055j372r28m92L85J053J320R95N58l35r67j319
$$ -1637 -467 793 1752 2107 1701 646 -726 -1654 -2146 -1761 -708 612 1607 2165 1830 863 -456
3501d56j080o12L93Q13J325J119M84j01q56j255j163n55l0Q64J146J364O05j00
$$ -456 -1536 -2148 -1755 -942 383 1502 1986 1885 1029 -226 -1389 -1944 -1974 -1110 36 1400 2005 1905
3519A905o47j220j295p09m8P36J196J252P47R0o69j223j114r14j65N76J168J279
$$ 1905 1258 38 -1257 -1966 -2014 -1278 -82 1170 1917 2007 1338 115 -999 -1913 -2078 -1502 -334 945
3537I45R22J31m75j096j189j045l07N12J107J372Q60L90m99r89j371r58l62L73
$$ 945 1867 1998 1523 427 -762 -1807 -2114 -1602 -495 877 1737 2127 1628 639 -732 -1690 -2052 -1679
3555a679R12J368R50M55j89r97j320j016n56K67R77J137J096O19j92p97j230j304
$$ -1679 -767 601 1551 2006 1817 820 -500 -1516 -2072 -1805 -828 309 1405 2024 1832 1035 -195 -1499
3573a499m84P5Q53J251J181P13n5r03j242j087p90o5Q34J231J173P26R4o03j185
$$ -1499 -1983 -1908 -1055 196 1377 2090 2035 1132 -110 -1197 -1987 -2052 -1218 13 1186 1912 2006 1403 218
3592B18j307r84m0O76J133J317P93K13o89r96j222r13j56L07J122J262R80M52
$$ 218 -1089 -2073 -2113 -1437 -304 1013 1806 2019 1330 334 -888 -1801 -1957 -1650 -528 734 1714 2166
3610B166o09r09j352r95l79L35J030J238J110L43k49r29j307j003n11K38Q28J346
$$ 2166 1557 648 -704 -1699 -2078 -1743 -713 525 1635 1978 1729 800 -507 -1510 -2021 -1783 -955 391
3628C91J134N96k36q69j249j214o29J30Q33J233J199P33j54p67j085j308p78j5
$$ 391 1525 2121 1885 1016 -233 -1447 -2076 -1946 -1113 120 1319 2052 1898 1131 46 -1262 -2040 -2055
3646b055P42J244J164R06Jo44j195j246q36q7N70J183J231Q53K23o02j065j255
$$ -2055 -1313 -69 1095 2001 2002 1358 163 -1083 -1919 -2006 -1436 -253 978 1831 2054 1452 387 -868
3664h68r07k31M36J100J269R54K71k99j123j293j082k89L17J086J260R91N02k60
$$ -868 -1775 -2006 -1570 -470 799 1753 2024 1725 602 -691 -1773 -2062 -1745 -659 601 1592 2094 1834
3682A834r89j295j091n23K50R12J331J036N92k43p82j299j213m80N8Q38J336J010
$$ 1834 845 -450 -1541 -2064 -1814 -902 429 1465 2057 1814 1032 -267 -1480 -1960 -1902 -1064 272 1282
3700A282O49J7p85j040j382o82K8N77J204J291P53J01n90j272j196q38j77N33
$$ 1282 1931 1948 1163 123 -1259 -1941 -1913 -1336 -132 1159 1912 2013 1423 151 -1045 -1883 -2060 -1527
3718a527J208J224Q70K22m95j000j300r48k97M12J071J171J120L77m61r65j268
$$ -1527 -319 905 1775 1997 1502 502 -798 -1746 -2043 -1631 -560 611 1731 2108 1647 682 -586
3735e86r68l91L08Q34J391R20N19l28r01j220j033o03K86P60J291J131N65k27
$$ -586 -1554 -1945 -1637 -803 588 1508 2027 1699 798 -422 -1455 -2058 -1772 -1012 279 1410 1975 1748
3753A748q01j010j174p11J56P96J005J238N84J21p31j145j273o23r8O77J075J148
$$ 1748 947 -63 -1237 -1948 -1792 -996 9 1247 1831 1952 1221 76 -1197 -1820 -1918 -1241 -166 982
3771I82Q06J60n55j145j102r23j61N91J031J089Q42L87o08r04j244j021k43N49
$$ 982 1788 1948 1393 248 -854 -1777 -1938 -1347 -316 773 1615 2002 1394 490 -754 -1775 -2018 -1469
3789a469Q77J301R59K98l40r94j183j034l11J35J067J171R82L98j54q51j301r15
$$ -1469 -592 709 1668 1966 1626 632 -551 -1585 -1896 -1761 -694 477 1459 1857 1703 852 -449 -1364
3807a364n82K38P62J262J051O18k48p03j113j193o47J6P91J130J213N64P5p34
$$ -1364 -1946 -1708 -946 316 1367 1985 1737 1034 -79 -1272 -1919 -1903 -1112 18 1231 1795 1870 1136
3825A136j172j046o88o9O67J103J059P23J96o04j044j146q60k15N51J042J139
$$ 1136 -36 -1082 -1770 -1839 -1172 -69 990 1713 1909 1305 261 -885 -1745 -1960 -1409 -367 772
3842G72Q66L03n10j021j094r50k93L59R33J291R21L05l74r04j242r59l72L13J007
$$ 772 1638 1941 1431 410 -684 -1634 -1927 -1568 -635 656 1577 1882 1508 604 -638 -1597 -1969 -1656 -649
3861f49J049J086N05l30r01j102r85m90J11Q92J047J096N42l1p75j268r86p07
$$ -649 400 1486 1991 1661 760 -342 -1327 -1817 -1706 -814 233 1329 1871 1840 1065 -203 -1189 -1896
3879a896J06P28J077J111P71p5p33j013j098o74j62O45J047J092P55J42n84r40
$$ -1896 -1790 -1062 15 1126 1897 1822 1089 76 -1022 -1696 -1858 -1213 -166 926 1681 1823 1239 299
3897B99j259o07l70O00R22J329P63K50n40q60j261q53l16L61J029J078R35L35
$$ 299 -960 -1567 -1937 -1337 -415 914 1677 1927 1387 527 -734 -1587 -1903 -1542 -513 565 1500 1835
3915A835l01q63j188q49n62L60Q69J143J044L23k94p61r82j091o94L19P50J121
$$ 1835 1534 671 -517 -1366 -1928 -1568 -699 444 1488 1811 1517 756 -226 -1317 -2011 -1692 -942 179
3933A79J083N33j03o56j214j003o61Q7P84J087J055N81K9q22r60j006p73rO09
$$ 179 1262 1795 1692 1036 -178 -1181 -1842 -1755 -971 116 1171 1752 1781 959 -1 -1007 -1780 -1789 -1180
3952a180J088J025Q03N7n24j036j089q46j44M96Q40J336P77J80m46r20j212q00
$$ -1180 -92 933 1736 1793 1269 233 -856 -1702 -1846 -1350 -510 826 1603 1783 1337 417 -795 -1595
3970a595j79K82R64J149P75M84l42r35j074j047k35J15R64J110R39M67k96o72
$$ -1595 -1774 -1492 -528 621 1396 1880 1538 603 -471 -1518 -1753 -1638 -674 436 1375 1842 1546 874
3988H74j182j067m80K52O48J172J062N28j61p52r32j025q22J88P00J054J066O25
$$ 874 -308 -1375 -1855 -1603 -955 217 1279 1807 1646 894 -38 -1063 -1885 -1697 -997 57 1123 1748
4006A748l1o24j017r96p90m5N68R81J094P29K04n73r69j079p74k49N51R73J093
$$ 1748 1717 1093 76 -920 -1710 -1755 -1187 -206 888 1617 1821 1248 279 -800 -1574 -1823 -1272 -299 794
4025G94Q30J45n13p62j149q57k67L06R61J049P94M31l96q02r93r59l99K16Q61
$$ 794 1624 1769 1256 494 -655 -1512 -1779 -1473 -512 537 1331 1762 1366 564 -429 -1388 -1787 -1571 -710
4044g10J139Q94M05j98o69j132j032m23J59Q12R08R91N27n1p80r37r92n96m5O05
$$ -710 429 1323 1728 1530 861 -271 -1303 -1726 -1567 -755 153 1144 1671 1620 840 -97 -1089 -1685 -1730 -1125
4064a125J126R34P50J2n14j176r70o91l8N09R34R78Q04J85n83r90q60p49l13N85
$$ -1125 1 935 1685 1697 1183 7 -963 -1654 -1692 -1183 -249 729 1533 1718 1135 145 -715 -1464 -1777 -1192
4084a192Q72J138N74K72l97r45r68p78k76L99P70J037R05L02l53p46j050r23l82
$$ -1192 -320 818 1392 1664 1267 322 -646 -1424 -1700 -1301 -531 506 1411 1713 1360 614 -436 -1359 -1741
4103a741K34P73J165P15M59j46p28r84j019m50K44O41R96J042N36j61o69j019
$$ -1741 -1507 -734 431 1146 1605 1459 731 -253 -1272 -1722 -1478 -837 159 1201 1737 1576 907 -112
4121a12j029n62J10P62R90Q95N10M2n61r44j105m32j61M25R91J017P52O7n51q11
$$ -112 -1141 -1703 -1593 -831 159 1054 1564 1606 1045 101 -1004 -1436 -1597 -1172 -181 836 1588 1655 1104 293
4141B93j051p78o1N29O89J040O93L00k56q73j241o84k54K87R06R77R58J36k60
$$ 293 -758 -1536 -1597 -1068 -379 661 1354 1654 1398 525 -716 -1400 -1654 -1367 -461 516 1474 1610 1350
4160A350p62r49j007k66J77O73J181Q66L03n2p99j049q83m02O4P14R61J072M10
$$ 1350 588 -361 -1368 -1634 -1457 -784 397 1263 1566 1514 715 -334 -1217 -1619 -1555 -841 120 1192 1602
4179A602n0p22j003p79p20O0O11J042Q80O84o3o21q25r79o16j33M91J040R48O52
$$ 1602 1552 830 -173 -952 -1672 -1612 -1001 41 921 1605 1542 921 96 -883 -1499 -1632 -1141 -101 847 1499
4199A499J27n15q91r59p47k12M29Q32J135P71J44l77r41r31p55k00J84Q45J013
$$ 1499 1626 1111 220 -739 -1486 -1698 -1269 -437 698 1469 1613 1236 295 -636 -1391 -1591 -1407 -562 451
4218D51Q20L45k68p41j007r17l43J95P47J056Q18N33k11p85j019p89n57K27N63
$$ 451 1271 1616 1348 607 -400 -1317 -1660 -1465 -718 338 1156 1689 1478 693 -326 -1115 -1672 -1445 -882
4237h82R55R76N26m2o43j033q29o24O4N84R90R11N73K9o10q29j001o25m1N23Q59
$$ -882 73 1049 1575 1533 890 -143 -972 -1596 -1532 -948 42 953 1526 1555 945 116 -885 -1510 -1551 -1028 -169
4258a69R89O67J18n22q09j167n12j86L15R69J000P01J75l18q47j082n47k63J87
$$ -169 820 1487 1605 1083 274 -893 -1405 -1591 -1276 -307 693 1394 1569 1251 404 -678 -1225 -1488 -1301
4277a301P62Q98R60K37k24p81r37p93l37K18O96R72Q93L31j66q31p79r38m29O8
$$ -1301 -539 359 1319 1556 1332 551 -386 -1179 -1516 -1298 -602 370 1263 1594 1428 597 -182 -1120 -1549 -1481
4297a481O86R76R19M10j49n94q70r32l92O2N43Q13R19O73j29n52q91q80n48J7
$$ -1481 -795 181 1100 1510 1361 767 -103 -1035 -1427 -1365 -822 -9 910 1583 1454 902 11 -869 -1417 -1400
4317a400L38Q53R45O57j3l56p94r94n80k45L75J059P47P48K69n02o40j041p51
$$ -1400 -1062 -209 736 1393 1380 1024 230 -764 -1344 -1589 -1214 -155 592 1340 1609 1107 467 -574 -1325
4336a325j58K74P35R67P63J90l01o30q61q50m02L27N73J103P54L09q7p05r03q69
$$ -1325 -1483 -1209 -474 493 1256 1446 1145 515 -346 -1196 -1598 -1271 -698 405 1159 1468 1381 676 -227 -1096
4356a096m13J59O26R19Q37M45j11n06q89j045m37R1N80R28Q29M82O0o03q65q25
$$ -1096 -1509 -1350 -724 195 1032 1477 1366 860 -29 -1074 -1511 -1420 -840 88 917 1399 1459 856 -9 -834
4376h34n81L5M22Q72Q70N03J53l77q46r15o03j74M51Q09Q49N69L12l12q39r97
$$ -834 -1415 -1380 -958 -86 784 1287 1440 1063 217 -698 -1301 -1475 -1024 -215 634 1203 1515 1203 364 -633
4396f33o60k48L60O12J163O24K41k17q12q10q70k03K24O20J032P19L74j77p68
$$ -633 -1293 -1541 -1181 -569 594 1218 1459 1242 430 -380 -1250 -1453 -1229 -609 423 1142 1516 1339 571
4415E71q09q26m01J29O45P54R31M87j63o07p39j009l83K0N17J013P35N55q8n14
$$ 571 -238 -1064 -1465 -1336 -691 63 994 1481 1318 711 -28 -1037 -1420 -1400 -883 130 865 1420 1332 818
4435H18q55p53o58OM83Q03R23O87m6l50q99q96n56k82N83Q14Q14O75J06k57q62
$$ 818 -37 -790 -1448 -1442 -959 -156 767 1454 1408 1058 159 -737 -1293 -1575 -992 -178 636 1311 1417 1160 298
4456B98r46o61j64K97R11Q02O86K44k08p70r88q01j60K24P76Q85O02M36j66p22
$$ 298 -648 -1309 -1473 -1176 -265 537 1223 1467 1259 489 -499 -1300 -1460 -1236 -460 425 1027 1463 1297 575
4476E75q73r20k06O4O25Q40R22M32j92m90r80p49m65J25N83Q53P47M56J02n66
$$ 575 -298 -1218 -1424 -1360 -735 105 1027 1459 1267 777 -203 -952 -1417 -1292 -709 144 891 1347 1449 883
4496H83p99r82m14p4M17Q53R06N78P4m30p98r35n03j58L27P23R72P19Q6l70p01
$$ 883 84 -898 -1312 -1386 -969 -116 790 1368 1442 1012 214 -721 -1224 -1382 -1055 -332 640 1359 1445 1075 374
4517C74r13p00k96L88P31R29O61K98k49q26q51p28l11L27O06Q31P92M14k28o02
$$ 374 -539 -1239 -1535 -1147 -416 513 1174 1472 1223 397 -454 -1182 -1493 -1166 -560 271 1063 1477 1249 647
4537F47r69p28m33K09N96Q03Q80M13n8o63r19p13l87nO21O81R36M61n7m32q64
$$ 647 -322 -1050 -1483 -1274 -678 125 1005 1418 1360 697 -222 -935 -1322 -1327 -706 -25 911 1372 1315 883 19
4558A9q45o28P8N44O67Q89O63k4l23q51q21p20q1L97P46R25N88J11k55p81q54
$$ 19 -826 -1454 -1376 -832 -165 724 1387 1363 1040 189 -632 -1352 -1433 -1036 -290 635 1223 1334 1079 298 -556
4579e56o83j01K64P00R64P03J80k72q58p70o98l20K88O59P53Q56L04j99o15r06
$$ -556 -1239 -1340 -1076 -376 588 1291 1471 1199 341 -429 -1127 -1447 -1159 -500 253 1109 1413 1214 599 -307
4599c07o41n09J89O79Q36O88M22r5m69q85q20m14N3M99P52Q25N76n6m81q34q65
$$ -307 -948 -1457 -1268 -589 247 935 1357 1262 793 -92 -912 -1326 -1273 -774 -22 803 1379 1323 842 8 -857
4620h57n47R1M07Q19Q24M68J70l89r06p68o39j02M67P23Q48O00J48l76o94q61
$$ -857 -1404 -1313 -906 -87 737 1205 1375 986 80 -688 -1327 -1429 -962 -239 609 1209 1357 981 287 -574
4640e74o43j01K66P75P35O49L28k85p27q08o91l82M12M36J095N72L13k71m43r66
$$ -574 -1217 -1318 -1052 -277 458 1107 1435 1150 423 -385 -1076 -1458 -1046 -610 485 1057 1370 1099 656 -310
4660c10p19l95O7Q01P86P59L69j30n28q87p97l75Q9N93Q04P80L90N6n16p80q78
$$ -310 -1029 -1424 -1357 -556 230 989 1358 1228 700 -187 -984 -1359 -1270 -677 127 907 1297 1353 837 57 -821
4681h21n20k8N41P63R19M32J24m68q41q07m66j15K96Q42P17P10K16n28p55p05
$$ -821 -1341 -1369 -828 -65 854 1286 1410 942 101 -706 -1172 -1287 -991 -149 568 1278 1494 966 211 -494
4701d94o86j06K55O21Q59Q10J04k89o52q95n58l13K09O04R05O61M13l14o62p06
$$ -494 -1180 -1286 -1031 -410 449 1259 1363 1074 422 -473 -1031 -1344 -1135 -531 374 1035 1448 1134 472 -234
4721b34q58j90M2O34P75Q17K57n1m79r10p15m09J5N49Q44P33N61j71m86o35q83
$$ -234 -1092 -1282 -1240 -606 169 986 1243 1192 713 -197 -912 -1321 -1306 -757 87 820 1381 1210 724 89 -794
4742g94l89k73O78O84Q21N27j5l85p72p82n19j51M87O66P87O58J02l71o41q36
$$ -794 -1183 -1456 -778 -94 727 1254 1239 854 82 -700 -1219 -1370 -883 -217 570 1228 1330 959 318 -518
4762e18p17m1K15Q49O31P06K37k32p42q06p03k15K72N48Q21P31L64k62n27r81
$$ -518 -1235 -1276 -1061 -212 419 1125 1362 1130 388 -418 -1121 -1336 -1064 -516 305 1036 1400 1138 611 -370
4782c70m94m41K17M43Q29P61N03j90n94q33o96l35m4N25Q06P66M40r4l47q03q27
$$ -370 -864 -1305 -1088 -645 184 945 1448 1258 664 -169 -865 -1200 -1244 -719 87 853 1293 1199 852 49 -778
4803g78m82o6N79P74Q04L63R0m11n60r03n67n0L39P21P22O81J50l92q29p62n86
$$ -778 -1260 -1326 -747 27 831 1194 1284 873 313 -590 -1157 -1207 -868 -147 575 1256 1406 1014 185 -577 -1163
4824a163j62L40O90P54P27J44j87p72o80p17l69L67O13P66O68L78k40o12q43p22
$$ -1163 -1325 -985 -295 459 1186 1330 1143 371 -309 -1026 -1395 -1028 -415 351 1019 1397 1157 545 -298 -1020
4844a020l00K31N45P53O91L46p4n13q26o74m96Q3N94O60P61N85q4m62q28o74n49
$$ -1020 -1320 -1089 -544 209 900 1246 1172 659 -167 -841 -1337 -1254 -660 0 761 1346 1262 800 -28 -702 -1251
4865a251l7M34P52Q66L43J94m08p92p73n72M2K00P54Q09O36N1k81p19r05m69k17
$$ -1251 -1288 -854 -102 764 1107 1301 893 101 -672 -1244 -1202 -1002 -248 561 1197 1248 967 248 -657 -1126 -1343
4886a343L56O68P07O16L37m51n05p85o66k27K32O20Q75O36K95l01n96p11p47l08
$$ -1343 -987 -319 388 1004 1341 890 385 -400 -1066 -1293 -1061 -441 434 1070 1365 1064 468 -243 -990 -1298
4906a298J22N38R15N68L87j08n79p02p01m43J70L41Q73P06M83j28m80o70p89l55
$$ -1298 -1176 -638 277 845 1232 1124 545 -157 -858 -1301 -1131 -790 83 789 1272 1144 664 -6 -795 -1150
4926a150j17M50P48Q55M52J2m18p32p78n35p0M40Q14O93M93J42l69p16o84o40
$$ -1150 -1267 -817 -69 786 1238 1250 832 100 -678 -1213 -1283 -843 -29 664 1157 1299 930 214 -470 -1110
4946a110j31L27P26O41N62K69k72n91r17n25l10L14N95O68P74L15k29p15o93p25
$$ -1110 -1241 -914 -188 453 1015 1284 1012 421 -496 -1021 -1331 -1017 -422 246 1020 1335 1106 391 -302 -1027
4966a027k01K37M66P64O42L07q0m95q40o85k39O4L87Q30N35O17j39m70o54q29
$$ -1027 -1228 -991 -525 239 881 1188 1108 613 -227 -912 -1151 -1087 -700 130 665 1282 1143 673 19 -810
4986h10m56M0N40O00Q02M20J44n69o25p42m65r4L33O44Q32M99P2l30o04p75n53
$$ -810 -1266 -1226 -686 -86 716 1136 1280 711 86 -656 -1121 -1215 -882 -238 594 1093 1165 835 231 -544 -1097
5007a097j41K91P22O82O21J93k63p78n69p38k37K97O15Q15M90L23r7o24p69n83
$$ -1097 -1238 -947 -225 457 1078 1271 1008 230 -339 -1077 -1314 -1017 -402 413 903 1226 1129 505 -264 -847
5027h47m21K61M99O91O87L47l3n39p98o84l68K6N90O91P56L34k8l98p86p16m05
$$ -847 -1268 -1007 -508 183 870 1217 1184 645 -153 -837 -1205 -1179 -589 102 858 1192 1164 766 -20 -736 -1141
5048a141k7L86Q04O24N04L2m50o29p87l86k31O18N19P41M91J54l73o30q28l84
$$ -1141 -1168 -782 22 646 1150 1182 732 103 -684 -1070 -1301 -683 -164 577 1068 1222 849 219 -609 -993
5068i93j24K16O53Q04M89K28l36n91p66n82k01K18O23P39N66K16j33o59o73o89
$$ -993 -1117 -901 -248 556 1045 1273 937 346 -420 -1002 -1203 -985 -362 377 943 1159 1026 367 -306 -995
5088i95l05J68O16Q58N09L10j6n82o77o67m13J04M95O43O97L89m3m13p10p33l64
$$ -995 -1300 -1132 -516 342 851 1161 1145 563 -114 -781 -1194 -1090 -595 48 745 1134 1091 678 -32 -765 -1129
5109a129NN04N49N91O62Lm23o39p10n29m8K43P94O90N14N0l31o29o71n87lQ4P06
$$ -1129 -1124 -620 -71 520 1182 1185 762 123 -587 -1116 -1164 -921 -127 563 1077 1127 796 167 -504 -1091 -1094 -1010 -304
5132c04Q74M00K28k80n43q38n87j83K66O86O49O01J60q6o49o40o74k18K07L33
$$ -304 570 970 1198 918 375 -463 -1050 -1233 -967 -281 368 969 1129 1043 394 -246 -920 -1138 -931 -598
5152e98Q59O65K53j24n71n99o32m30M6N83N81P46L55l4m36p04o69n17J37L13P19
$$ -598 261 926 1179 1055 484 -115 -747 -1177 -1131 -548 33 779 1134 1100 664 -40 -709 -1226 -1089 -776 -57
5173e7P15M80l3l94n34r05l23j51M23O50O78O67j15k79o09p18n59q2L27N29P32
$$ -57 658 1138 1105 711 177 -728 -1051 -1202 -779 -129 549 1216 1101 822 213 -505 -1064 -1146 -819 -290 442
5194D42M91K70k23n89q73m75k63L81N49P25M79J41m1n95p05n04m04K07M52P65
$$ 442 933 1203 980 391 -482 -957 -1220 -839 -290 435 914 1055 1014 419 -286 -790 -1194 -987 -535 230
5214B30N59K89j05m88o64o64l30P0N39N80O66M37M2n70o38o88n21J39M45O60O40
$$ 230 789 1078 973 485 -179 -843 -1173 -1103 -564 16 682 1119 1161 591 -47 -735 -1256 -1117 -672 -12 628
5235F28N28O1m69o47o78n47n0L87P12O81M84Q9l10p38p23m32j72K93N83Q14N37
$$ 628 1156 1217 748 101 -577 -1124 -1174 -787 -75 606 1090 1179 869 131 -592 -1024 -1196 -903 -320 494 1031
5256A031J20k67o26o21m83l24K57M95O95O65J85j76m15p97o49l20K08M73Q00O82
$$ 1031 1151 884 258 -363 -846 -1170 -913 -418 277 942 1127 951 536 -261 -910 -1230 -1022 -549 251 933
5276I33K60j80m79p04o27k63L0M06O90P56K62k3l72p18p25l38l4M39P64O13M62
$$ 933 1193 1013 534 -170 -797 -1060 -1030 -624 66 822 1084 1061 689 -29 -754 -1092 -1126 -687 77 690 1152
5297A152O0n18o10o97l85r2K86O43P49L96K30m53n99o06n95k47L76O73O58M79
$$ 1152 1212 694 84 -613 -998 -1090 -804 -161 588 984 1214 761 162 -444 -1039 -1286 -910 -237 421 900
5317I00K71l26n25n47o98j73J45N95P76O07J72j53o45p19n32k91J47N46O23O79
$$ 900 1171 845 320 -227 -925 -1098 -953 -358 418 1025 1197 1044 399 -320 -852 -1143 -996 -450 173 852
5337H52L91j97m92p79o44l24N5O50M24Q39K62pm42n53p15m29L4L01P89N94N16
$$ 852 1243 1046 554 -225 -869 -1193 -1138 -488 -64 775 1037 1030 588 35 -680 -1109 -1075 -774 15 609 1125
5358A125P7m46o80o17m97m0K58N96P21M94J77l88n07p55n07j19K35N12P87O12
$$ 1125 1202 756 76 -541 -1038 -1078 -820 -224 497 991 1168 780 273 -482 -989 -1108 -873 -361 426 1038
5378A038J55l76m76p81n01j94J79N72P37M96K24j11o25n73n61k57K8N20O93O28
$$ 1038 1193 817 341 -440 -941 -1135 -956 -384 353 849 1073 962 337 -236 -797 -1054 -1026 -506 187 815
5398H15L84o0n96o87n35m12L8M42P07N79M73j4n15p25m91m53RM86M95P70L30N5
$$ 815 1199 1139 543 -144 -679 -1091 -1053 -611 96 675 1148 1134 619 -106 -597 -1050 -1041 -555 -60 710 1040 1095
5420A095l87n42p06n67K5L69N02O75M89J56l33n77o35m61j52J80N75N85P14J67
$$ 1095 708 166 -540 -1107 -1082 -713 -211 464 953 1109 776 199 -436 -897 -1049 -869 -294 291 1005 1172
5440A172k74n42p87m26k56J74O68N77N32K90j34m28r17m57l91K70M27N97P35K79
$$ 1172 898 356 -431 -857 -1113 -939 -271 306 838 1128 994 566 -351 -808 -1199 -929 -502 95 830 1109
5460A109r6m33p43o04l73n3N94O69O40L78K8n11o26n88n15L6M29O03O41M27J44
$$ 1109 1013 580 -163 -767 -1140 -1193 -599 70 710 1088 1116 605 -21 -609 -1124 -1088 -659 -56 585 1012 1156
5481A156l79p51n85m98L2K24N70P80M18J89m27m79p35n10p8K07O14P40L67L13
$$ 1156 777 26 -559 -1057 -1025 -801 -231 549 967 1156 729 250 -485 -995 -1073 -866 -252 488 855 1168
5501A168l64m13p40l89m07J63O31O39N93K79j63m62p77n25l26J26M38O81O53L13
$$ 1168 804 391 -349 -738 -1145 -982 -351 288 881 1160 997 535 -242 -767 -1093 -967 -529 152 805 1118
5521A118j53m42p17o10k44j4M61N46P39L71j2l21p61o45l33l7M70O11N27M73J03
$$ 1118 965 523 -194 -804 -1048 -1062 -601 -55 684 1055 1043 722 -39 -684 -1017 -1054 -584 27 554 1027 1130
5542A130n12n37n68n65q5L00N90Q37M60M9j98o97o29m63l07L96N47O06O31J26
$$ 1130 618 81 -487 -1052 -1137 -837 -247 590 1050 1099 901 204 -425 -888 -1195 -799 -252 354 985 1111
5562A111k25n74o92n13j34Q5O57M92P66N6j15m71p47n53l36J89N43O44O20L65
$$ 1111 886 312 -380 -893 -1027 -942 -285 207 973 1029 914 443 -304 -857 -1193 -1004 -461 183 803 1168
5582A168j32m95p01n65l73N5M98N92O66L35L1l47p77n87m18q2M31O01O04M90J08
$$ 1168 1036 541 -160 -725 -1098 -1043 -545 47 713 1048 1079 732 -45 -632 -1050 -1132 -701 -100 504 994 1102
5603A102k65p73n79n75K5K49N53P56M49K3j09o17n90o13q1K56M62P30N51J16j81
$$ 1102 837 64 -515 -1090 -1065 -816 -263 493 942 965 856 239 -351 -964 -1045 -789 -327 403 954 1070 889
5624H89n63o63m56l65K84N77N49N34J86p5l74p72n30l35J86M60N80O16K75Mn17
$$ 889 326 -337 -793 -1158 -874 -297 252 786 972 897 523 -249 -779 -1114 -928 -468 112 728 1003 1007 490
5645D90n71o84k97L0L89P78N13M16q0l21o81n88m65K9L43N57O08N38P5l41n55
$$ 490 -81 -765 -1062 -1032 -643 135 648 1064 984 663 -18 -606 -1071 -1042 -699 -142 466 1004 1079 738 183
5666A83o56l85k66M11N66N25N09J96k59n81o34n34j22J51O81M84N74K86k08o79
$$ 183 -473 -858 -1124 -713 -147 378 887 1083 824 243 -391 -925 -1047 -896 -215 269 843 1129 921 242
5686B42n89n52j30J86N10O06N23L01k02m37p37n74k07P7M50O66N58K85J0m54n91
$$ 242 -347 -899 -1029 -843 -333 273 796 1097 895 458 -279 -853 -1060 -983 -533 133 691 976 986 532 -59
5707e9o26l32N5L64P00N84L71j6m02o66n34m46M9L79M93O15L62J33l68m55p27
$$ -59 -685 -1017 -962 -598 102 686 1057 1041 639 -27 -561 -1007 -958 -579 -86 529 891 1024 656 201 -526
5728e26m44j04L27O35O28L84J61l01m23p15n58j39K19N94N45O80R5j62m86o48
$$ -526 -970 -1074 -747 -112 516 900 1061 760 337 -378 -936 -1075 -856 -262 283 963 1058 896 410 -238
5748b38m81l70K79M68N99N30J83o5l78p61n97j15l8M44O96M45M83j08m44n95o94
$$ -238 -719 -1089 -810 -342 257 787 970 905 527 -234 -831 -946 -984 -540 156 601 1084 976 532 -63 -757
5769g57l40P8M09N64O99L97j11l01o31o32l31n1L80N09O84L62Jj79n80o85m66
$$ -757 -1097 -1019 -610 -46 653 1050 939 638 7 -625 -956 -1007 -627 -118 566 928 929 750 170 -515 -981
5790i81Q5K25N45O14M20J70k47o09n62n76j28K58N15N31O79M1j77l63o74n92k42
$$ -981 -896 -671 -126 488 908 1078 831 222 -340 -916 -1044 -786 -271 260 939 980 803 440 -234 -826 -1068
5811a068J91N35N94N10L70k20m71o50n14l52J94M21N17O94L02j60m34m61o27l32
$$ -1068 -877 -342 252 762 1132 912 441 -209 -723 -1075 -881 -460 57 751 1053 893 459 -2 -629 -961
5831i61n3L53P13N73L41m4k77n32o66l59o3K18N75O86M23P5k81m87p33m37j24
$$ -961 -1014 -661 52 625 966 922 645 113 -553 -912 -975 -757 -182 504 927 1002 721 234 -499 -936 -1060
5852a060K56N42O26M91J76k35n19o64m84r2L6O87N54M67J37n8n06o32l91l89J92
$$ -1060 -804 -262 364 855 1031 796 277 -387 -871 -963 -927 -240 314 781 918 860 354 -278 -669 -1058 -866
5873h66N15M58O67J30M6l95p19n56j69rM47O36O14J06P6m66n79m86m73J29L11
$$ -866 -351 107 774 904 950 555 -164 -720 -889 -898 -451 185 799 905 981 515 -64 -550 -1023 -894 -583
5894e83O18N99K05O7k83o83n26m31R2K40N78O60L38O5k38n97n82m78j63L93M37
$$ -583 35 634 839 906 623 -60 -586 -1017 -925 -685 -107 553 891 956 718 121 -461 -939 -1102 -709 -272
5915b72P11L49K15k36n02o66l85j51J28N66M93N48K15j48m97o20o35q5J45M35
$$ -272 439 788 1003 767 265 -401 -786 -937 -809 -243 250 798 1013 865 368 -252 -887 -972 -827 -392
5935c92N71M58L85j07m25o27n51l01J05L36O62M71K73O5m55n40n62l78J42J73
$$ -392 179 637 1022 915 490 -137 -688 -989 -884 -548 114 585 858 923 468 -72 -634 -1012 -870 -697
5955f97O40O01L99n3l67m61n56l43j64M14M68N23M61O4k60m76o82m28n1K63N65
$$ -697 -57 544 943 890 523 62 -494 -837 -1001 -587 -119 404 865 929 669 193 -489 -917 -968 -705 -140
5976a40N62M22L0j34m26o66n35j20J93M04O76M58K43j69n31n20n04k65J53N57
$$ -140 422 844 874 740 314 -352 -887 -1007 -814 -410 266 724 967 798 267 -253 -757 -1022 -869 -312
5996c12N39N00K60j33m45m82n91k49N9L16P01N20K61n4l48n30n89m37NM91N47
$$ -312 227 727 987 854 409 -73 -664 -913 -854 -538 163 683 944 890 542 12 -577 -1014 -1009 -518 29
6017B9M59L96l3j95o41m46m91j38L80N58N35M43P3l14n11o16m14n0K36M73O06
$$ 29 488 884 851 656 15 -431 -922 -1060 -680 -122 413 856 929 615 104 -512 -926 -976 -740 -267 339
6038C39M59J56k61m63m41n80j24P2N65N28N29K03k12m20n49n76k09J73L91N91
$$ 339 798 954 693 230 -211 -791 -915 -843 -278 250 779 982 770 350 -199 -775 -984 -811 -420 171
6058A71N04K90k8m38n78o04j56n0M35N55M60L08K0k74o87n00l46R3K78N30N34
$$ 171 675 965 937 499 -79 -683 -839 -889 -454 101 561 869 889 615 -72 -572 -918 -825 -547 -17 517
6079E17L93ll14n09o85j84k11L51N16N20M54J46k57o34m22m98j02K05M70N72N14
$$ 517 910 907 593 84 -601 -785 -996 -645 -129 391 845 991 734 100 -322 -820 -922 -717 -247 325 839
6100H39R8k07m57o33l43j99N2M71O80L90L49l39l70n85n24j72J32K77P33M94K39
$$ 839 937 730 273 -360 -703 -902 -850 -379 301 691 1040 701 331 -254 -778 -950 -818 -541 192 686 925
6121I25n3m97m78o43k79K00L42M68N64L86o1k92n82n49m32J21K50N55N32M20m
$$ 925 872 375 -103 -746 -1025 -825 -483 -15 549 935 874 582 0 -549 -981 -860 -610 -55 477 897 893
6142H93k96m99n59m46j36L56M77O70K55K95l64m20p09l20q7J02N62M84N30J19
$$ 893 597 98 -461 -907 -1043 -687 -210 460 715 1010 646 226 -483 -803 -890 -788 -226 258 788 907
6162I07k49m71n32m27j05Q6N12M90M74K28l7m40p38m19k02J12L72P00L16M02j69
$$ 907 658 187 -345 -772 -877 -791 -279 211 685 913 876 436 -302 -721 -923 -811 -439 261 577 979 810
6183H10m51m80m30l17o5L85N63N59L37j27j86n20o70k65j09L80M92N83L32k9k40
$$ 810 359 -121 -551 -868 -933 -548 15 574 911 784 598 78 -592 -857 -966 -586 -94 489 821 792 552
6204E52m07n44l75K8j4O05M81M87R9k52l96o02m07k22K16N16O24L33K57l08l83
$$ 552 145 -399 -774 -746 -760 -155 326 813 912 660 264 -338 -745 -967 -751 -235 389 722 979 671 288
6225B88m65m91l03K35L52N43M71L14j05n46m77m40k72N9L87N37N92K55m5m52n87
$$ 288 -177 -668 -971 -736 -384 159 630 944 839 293 -184 -624 -896 -837 -450 87 679 934 889 437 -150
6246a50m47k35m4L43N31O12K68o9k49n65m77l52J4K68M80N13L63O3k93m85m93
$$ -150 -597 -832 -876 -533 -2 610 878 809 560 -5 -482 -834 -820 -552 -72 441 804 867 574 89 -404
6267d04m65p6M30M50M21N21M2k00o16n32l84l7J58M82N31L61J52j20m85m40n85
$$ -404 -869 -945 -515 -65 356 877 919 719 103 -429 -813 -850 -692 -210 321 682 834 714 229 -211 -796
6288g96j24K42L37N73M60J60j41k56o29m84k28J12K96O44M37K92j01l37n01l91
$$ -796 -920 -678 -341 232 692 852 711 455 -174 -658 -886 -774 -478 166 603 895 794 457 -44 -435
6308d35m21l6L55M85N64K33Q4k67n75l99l41j06K59N83M16L99P2l10m55n69k49
$$ -435 -856 -892 -537 -52 512 745 829 562 -13 -412 -753 -859 -600 -17 399 798 870 560 105 -464 -713
6329g13k56K53N95M70M83Rk26m24m80l19k35K06L94N39L37K48j92m36m23n02k24
$$ -713 -969 -716 -121 349 832 841 615 191 -289 -608 -843 -637 -243 296 633 881 689 253 -170 -672 -896
6350h96O4N91M77M62J60k15k35o11m35j49L1K65O36N73Q2N3k79p00m47k18p7L62
$$ -896 -832 -241 236 698 858 643 408 -203 -638 -787 -756 -491 145 718 800 853 574 -126 -573 -791 -868 -506
6372e06N26N18L93j74l31l59n45l17j06L13N87L95M04nj64o16m07l15j11K54M34
$$ -506 20 538 931 757 426 67 -478 -795 -901 -588 -1 394 798 793 629 13 -394 -709 -820 -566 -132
6393a32M93K41K36j92m28n24l41j87J16M90M84M00J28o6m00n77m08k93J75N20
$$ -132 361 602 838 646 218 -306 -647 -834 -718 -228 256 656 784 718 318 -259 -667 -960 -785 -265
6413b65M13M20K37k3m12n61m47k22P4L96M71N31J43L1l31n60l42l41KL00N33N43
$$ -265 148 568 805 782 370 -191 -638 -860 -786 -390 81 612 755 786 455 -105 -447 -788 -786 -486 47 590
6435E90J22M7l49l55m93m00J10K92K88O15L33o4j65n34m49l49QM6N34M75M29Q5
$$ 590 712 759 410 55 -438 -838 -728 -436 -148 467 800 736 571 37 -412 -761 -753 -707 -173 302 731 816
6457H16k40m40n34l38j11K14M42M17L65K80l06l83m52l38k38Q0M63N80L34J85
$$ 816 576 136 -398 -736 -847 -633 -191 226 591 871 565 182 -270 -608 -846 -766 -303 277 611 796
6477G96p3l34m48n66k06R1L71M94L18L80j83k15n93l49k33O0K82N98L60L02j73
$$ 796 723 389 -59 -625 -831 -740 -369 125 443 823 640 425 -168 -517 -750 -690 -408 190 550 852 679
6498F79j20n62n14j58j09L63M56L49L23Q1k94m15n02l87J4J69M33N59L66M2j69
$$ 679 559 -3 -517 -675 -784 -421 35 384 707 788 494 79 -423 -810 -796 -627 -194 365 731 773 604
6519F04l19n63l83j69L20K93O29K25J51k06l37m48l71l15K51M03K96N32J88j24
$$ 604 285 -278 -661 -830 -510 -217 412 637 788 582 245 -203 -574 -889 -638 -235 61 593 781 657
6539F57l60m24l78l03J51L21N39L05K82K8l72n20m66l87P0M55M95L53K71m6k60
$$ 657 297 -127 -505 -808 -657 -336 203 508 790 818 446 -74 -540 -927 -857 -402 93 446 717 671 411
6560D11m00n02k85l4L08M68M47L81J0k42m11m73l37j18L55L41M42L49J27k76l52
$$ 411 11 -491 -776 -810 -502 -34 413 794 804 562 151 -322 -659 -777 -422 -81 361 710 837 561 209
6581B09o04l23p6J32L01P10L41J37k24k93n78m71q6J98L10N17M30L1j5k77m80
$$ 209 -395 -718 -794 -662 -361 349 690 827 603 310 -268 -739 -825 -627 -317 200 630 661 646 369 -111
6602a11m47k49R5L14N35L41K30N0m00m62l25l12l5L23N76L67J79P7k94m19l82
$$ -111 -558 -807 -712 -398 137 478 708 758 358 -104 -429 -741 -776 -453 123 490 669 746 452 33 -349
6623c49l97J8K95L59M66L01M8j82m66m90k02j18K17L28N03L71Q2k10m95m18l43
$$ -349 -746 -728 -433 -74 392 693 741 559 93 -397 -599 -717 -500 -172 331 702 784 574 79 -339 -682
6644f82k22K98M42M72K64J10n1l84m48n12j34J84L81M63L83J60J3m18n07l73j11
$$ -682 -904 -606 -164 308 572 682 631 247 -201 -713 -847 -663 -282 181 564 724 737 319 -188 -561 -672
6665f72N4L17M62K93J93k2k47m92l78j88M6K63M42L58K43K4k73m88m17k15j8K61
$$ -672 -618 -301 161 454 647 625 378 -114 -492 -680 -634 -371 71 429 672 696 423 -65 -482 -697 -715 -454
6687d54M76L44L40K7j24n24m22m03J0J62M32M45L95R2l54l49l41l66j13M0N10
$$ -454 22 366 706 733 609 85 -337 -740 -730 -568 -136 309 704 796 442 93 -248 -614 -727 -687 -177
6708a77M96K61J10n4m69l37l70k03O1M23M30K46L08j68l19l81n19p0O5J70N50
$$ -177 319 580 690 636 167 -170 -540 -743 -682 -259 171 417 725 557 238 -143 -662 -732 -667 -497 53
6729E3M47K43n0m43k67m74j30j33L11N54K44M20r1k85l15m74k55q2L04K90M37
$$ 53 500 743 693 250 -17 -491 -621 -754 -443 111 355 775 684 399 84 -390 -645 -727 -423 -133 304
6750C04L33J04k45m36m33l73N9J67N07L85K42M9j48m34m76k35j67K62L97M31L70
$$ 304 637 741 496 60 -373 -746 -687 -520 -13 372 614 663 515 81 -395 -630 -797 -535 -138 293 663
6771F63rr7l78l81k96k58J38M04M26K92K60j56l26m55m04r2K7M14L59L88J65j46
$$ 663 654 557 179 -202 -498 -756 -618 -214 212 504 764 608 282 -173 -577 -669 -642 -228 131 519 684 538
6793E38q3o25l43k49J23J75M99L82K89lk43n62k54l32M7J73M38M55J77J32k58
$$ 538 455 -170 -513 -762 -639 -464 35 417 706 703 460 -102 -356 -688 -641 -468 -30 425 602 734 476
6814D76l63m63l14j1J22M62L94K98R7k80j91n35l79%J19L42M77M09R5j48l62m41
$$ 476 113 -350 -664 -675 -553 -91 303 601 698 418 227 -308 -687 -687 -568 -226 251 660 755 607 245 -196
6836a96l32k55J30M55L49K82K16j09l33m35l01j80J05K71M49M41J71j21k26m79
$$ -196 -528 -783 -653 -198 151 433 649 540 207 -228 -529 -709 -604 -333 116 557 728 607 381 -98
6856i8l78k58jL99K89O06K3Jj10l83n33j96L2M7O13M46J39Q0k83l90l47k57o5
$$ -98 -476 -734 -735 -336 -47 559 582 583 473 90 -443 -639 -607 -560 53 499 638 718 435 45 -302 -559 -624
6879f24J38K92N67K58Mj29l47m40l35j30K65K81L86L07J95k18l15m51j52k01J43
$$ -624 -486 -194 373 631 635 506 159 -281 -616 -746 -481 -200 186 493 688 470 155 -296 -448 -649 -506
6900e06K90M62L58QK9l81l64m55r5n0M06L44M41K37m6l08m48n21j31O4K47N46
$$ -506 -216 246 604 612 641 260 -104 -559 -654 -704 -298 46 487 724 678 370 -78 -599 -730 -666 -419 127
6922A27K68L16j46j49m29m65j55n5K05N39L94J86Kj91m22m03k56r2J09N42L35
$$ 127 395 711 565 416 -13 -478 -633 -688 -483 56 450 636 638 447 25 -378 -634 -726 -617 -75 260
6943B60L95R1j83m36m65l84J4J29M54M35L50Q8j61n39k54l73p3n6M13M58M33L6
$$ 260 655 746 563 127 -338 -722 -708 -579 -125 310 660 748 587 48 -206 -579 -652 -708 -295 163 596 632
6965F32j30k91m46l36p6J24K40L67M30J36J1l11l95l52l96J13L92L15L72K71M9
$$ 632 502 211 -235 -571 -647 -523 -283 84 514 650 661 350 -45 -397 -793 -680 -288 27 399 670 719
6986G19l70m78l63k06O7K45M10L18L61l5q0n16l74l02q1K34L79L71M30q5k07l24
$$ 719 349 -129 -492 -698 -631 -386 24 342 703 668 588 72 -302 -604 -685 -451 -72 299 729 644 437 113
7008A13m40k58o2J65L20M31K69P1q2m16l52l35p6N4L67M21L70J64j41l04l82l81
$$ 113 -327 -585 -647 -482 -162 269 538 609 527 111 -241 -576 -652 -598 -231 190 560 724 583 279 -103 -484
7030d84k30J31K37N52K75K55r3k57n09l61j15r4K81N22L55J61J0k95m10l88k61
$$ -484 -714 -583 -346 206 481 736 643 386 -123 -484 -599 -693 -412 110 465 626 636 341 -69 -457 -718
7051g18R3J60L62N14K04M1k56m01l36l27p6K64L71M66L02j4j70l74m07l13%R2
$$ -718 -625 -465 -103 411 615 656 400 -1 -337 -664 -740 -476 -105 361 663 649 479 105 -302 -615 -615 -523
7073e23M28L39M05l0p3m11l66m36p4J91K41N72L14J28k58j78m76m21qR0L08K92
$$ -523 -95 244 649 619 546 135 -231 -667 -741 -550 -309 263 577 705 447 269 -207 -628 -636 -546 -238 54
7095E4M88K94j86l92m42k86j18o4K06N07M19J77r8o8n65k95l79J19J71M29L92
$$ 54 542 836 650 258 -184 -470 -588 -652 -446 61 480 657 559 491 -74 -369 -748 -629 -458 -29 363
7116C63L65n5l36k30m75k76P0R2K93N53J23J42j92l15m12k64j48K97J69M61L15
$$ 363 728 673 337 107 -368 -644 -574 -482 -189 364 487 629 437 122 -290 -554 -702 -405 -236 225 540
7137E40J61j20m00m32l86J1J19K73M51L66J00q5l57l73l37j95J29J44M38M38R6
$$ 540 701 581 181 -251 -637 -626 -507 -234 217 583 683 598 241 -132 -469 -664 -535 -391 47 485 581
7158E81Ol62k59m17k25J01L08L67L03J99K4k25m14m74q6o3J03M54N31J90kj30
$$ 581 587 225 -34 -451 -676 -575 -267 100 403 602 626 401 -13 -487 -573 -636 -533 -79 452 642 640 510
7180E10m78m17j65j48K67M51L38K30Q6j82m57l07k89j81K62L89L75L34Q6j21l47
$$ 510 32 -385 -550 -698 -431 20 358 588 674 492 35 -272 -561 -742 -480 -91 284 618 704 583 236
7201B36m99k94k3J39J95L95L95J24j33l34m03l58n1O6K24M03L20J72qj99l98m05
$$ 236 -263 -557 -580 -441 -246 149 544 668 535 201 -202 -560 -611 -545 -321 82 402 574 566 367 -31 -436
7223d36k69P3K55M46L71J50Q2l09m14l94k23m7L26L59L86K87qk38k20n11k78m1
$$ -436 -705 -632 -377 69 440 590 672 363 -51 -445 -668 -715 -389 -30 356 643 635 397 177 -334 -612 -653
7245f53K57K78M37K67J29k49m12m02j94j85J62M51K06M62R8j28l76l92k85j58
$$ -653 -396 -118 319 586 715 466 54 -348 -542 -727 -565 -114 92 554 652 524 148 -244 -529 -687
7265f87J27K72N04K75J53p2l26l50l81j34M7L50L87L02J28k7l25m10l49j46L7
$$ -687 -560 -288 216 491 644 572 246 -104 -485 -619 -572 -222 165 467 595 568 243 -167 -516 -662 -625
7286f25J98M19N02J92j1k71m25l38k33j4J64N08K69K43J4j53l86l78k53j48L46
$$ -625 -427 -8 494 686 675 404 -21 -359 -592 -606 -442 66 335 578 592 439 53 -325 -578 -726 -380
7307c80K33M83L65p2j66l72l81j85j94J79L82L73L37P3k19k56m18l08j80J19M08
$$ -380 -147 336 701 629 463 91 -290 -475 -669 -490 -108 265 602 675 456 200 -218 -526 -706 -587 -179
7328a79L41L24Q4L1k31n60k04k82R8K78M68L41J44ol97k56l68l00Q8J82M80L59
$$ -179 162 486 570 601 370 -190 -394 -676 -578 -300 168 509 653 647 250 -6 -374 -674 -586 -404 76 435
7350D35J09N8j17n16m32k06P2K26K27N47J47N0j96m31k62l63J6J31L46M41L77
$$ 435 544 602 485 -31 -463 -669 -597 -371 -144 403 550 600 404 -27 -289 -652 -636 -505 -159 282 659
7371F59k9j08m27l16l71n8Q6L01M61L93M2j10l23l78l83p2m2M68L79K52J95jl70
$$ 659 630 522 95 -221 -592 -650 -564 -263 198 591 633 523 200 -178 -561 -633 -675 -207 172 424 619 618 248
7394B48l72l51j11j6J90N43K39L64k05j98l17m01k61J46J50K53M15L05J7l54l13
$$ 248 -124 -475 -586 -602 -412 131 370 734 529 331 14 -387 -648 -502 -352 -99 316 621 638 284 -29
7415b9l99k05M7J60L06M46K38M4k02k13l78l75p4Q3M05K88L32J85k03l22l27l56
$$ -29 -428 -633 -586 -426 -120 326 564 608 406 193 -185 -560 -634 -551 -146 142 474 659 456 134 -193 -549
7437e49j32J51K53O08J73J46j04k99l94l58j57J68K64M00L07J55j23k22l63k92
$$ -549 -681 -530 -277 331 504 650 546 247 -147 -505 -662 -494 -230 170 477 632 509 287 -76 -368
7457c68l11L2L62L42K80K72j02p1n00l09k85K7K95K98L90K36q1k03k60m81k14
$$ -368 -679 -647 -285 57 337 609 507 436 -64 -373 -658 -631 -336 -38 352 588 507 304 44 -437 -651
7478f51q5L28L48M30K94l8r3l37m86k91j07J46L87L42M06K5j44k41l89l69j2N5
$$ -651 -736 -408 -60 370 664 626 533 196 -290 -581 -688 -542 -155 187 593 618 474 233 -156 -525 -537 -482
7500d82K16L56L85J77j40k26l81l13k41Q5J94N27M35P5j88j69m14l32j53m8K14
$$ -482 -266 90 475 652 512 286 -95 -408 -649 -564 -370 157 592 667 479 310 -104 -436 -589 -637 -423
7521d23M87M14O5J02l05l58l86j75N1P2M79L43J71J9j82l32l88k59m3K06L76L91
$$ -423 64 478 543 645 340 -18 -404 -579 -528 -456 23 366 537 556 374 42 -346 -605 -648 -442 -66 325
7543C25K47%j57k38m24k42j15K07L89K42K94J11k22k43l35l40j22J66J28N39K98
$$ 325 572 572 415 177 -247 -489 -604 -397 -8 234 528 639 417 174 -161 -501 -623 -457 -329 210 508
7564E08m0m0j75l79k45l16J60J81M78L04O6O0k97k80l94j68j2K83M00L91J24m0
$$ 508 468 428 253 -126 -371 -687 -527 -346 132 436 502 562 265 -15 -409 -577 -589 -306 94 485 609 569
7586E69j15m42m29k57J01J83L37L66L36o2k04l73l57j74k0J8L89M31J64J31k20
$$ 569 454 12 -417 -674 -573 -390 -53 313 649 587 383 10 -347 -521 -541 -523 -134 297 461 592 372
7607C72k65k75m30o3K51K84K77L27J37k05k04m73j96j97K00K81L35L01K28j35
$$ 372 107 -168 -598 -661 -410 -126 151 478 615 410 206 -267 -463 -660 -460 -179 156 457 685 550
7627E50m35k55k03k74J20R7N04K94J29P4k92l59l02k19K2K07L79K84L40j23j76
$$ 550 115 -140 -343 -617 -497 -400 104 398 527 601 309 -50 -352 -571 -549 -342 37 321 661 538 362
7648C62k30n39j46L6K21K56L59J03J07j74j94n38j88m1J93K52K63M62N5j22m06
$$ 362 132 -407 -553 -517 -296 -40 319 422 529 355 161 -377 -565 -606 -413 -161 102 564 619 497 91
7669I1l42k61j75K33L16L38L10Q1j01k77l94k24k58J47K53M33K54K03j63k78l34
$$ 91 -251 -512 -687 -454 -138 200 510 591 490 213 -181 -405 -663 -516 -263 170 424 627 464 186 -148
7690a48l42q7oL93K19L25J61j5j07m74l25j66O1J54L22L21K65m9j81k71m43k58
$$ -148 -490 -577 -583 -190 29 354 515 500 393 -81 -406 -572 -511 -357 -35 286 551 502 321 50 -393 -651
7712f51J9J38M40L61L01M4k42l06l42l46P7K0M82J47L68k0Q2l87m55k46J0L7K32
$$ -651 -632 -494 -54 307 608 652 410 104 -238 -584 -507 -487 -5 142 510 490 572 185 -270 -516 -506 -469 -237
7735b37L59M27k2j09k31l38l19n9R9R5M63K53K56j87k00l20m35l7n1K28L78K81
$$ -237 122 549 527 418 187 -151 -470 -529 -430 -335 128 381 637 450 250 -70 -505 -542 -593 -365 13 294
7757B94L55j41k16l82l86K4j09J34L71M06J92L1j68l42l37l44P6N6M34M37J78
$$ 294 649 508 292 -90 -476 -452 -561 -427 -56 350 542 573 405 63 -274 -618 -542 -486 -52 385 563
7778E63j4j30k93l52k53j23J40L57L67K09J19k07j80k93l25j20N1K72L80K60J61
$$ 563 549 419 126 -226 -479 -602 -462 -105 262 471 590 383 203 -90 -415 -535 -484 -212 168 428 589
7799E89q3k65l42l49o6R6K16K65L04K79O3m19m28k31j24j04K66L55L24J76%k55
$$ 589 506 241 -101 -450 -516 -420 -204 61 365 644 707 288 -140 -371 -495 -599 -333 22 346 522 522 267
7821B67j81n60j0m6J80L14L29L12j8j59m60k04k57o4J51K87M68J92Q8k19l68k46
$$ 267 86 -474 -484 -530 -350 -36 293 605 587 428 -32 -236 -493 -557 -406 -119 349 541 629 410 42 -204
7843b04l09p0J74K88L95K92j48M2l92l34j23j03M1K60L24K71J46j03k38m02l45
$$ -204 -513 -583 -409 -121 274 566 418 460 68 -266 -389 -492 -451 -191 133 404 550 447 209 -193 -538
7864e38o7J43K50K75K44J76nk32m83j11k07rK67L39K58L08j67q6l74m07l1r1K29
$$ -538 -605 -462 -212 63 307 483 478 246 -237 -348 -555 -564 -297 42 300 608 441 355 -19 -426 -457 -548 -319
7887c19K49M09K47q7o0l36l20l84KJ25M06L88O3N2r1j88n52j8K9j07L00L69K81
$$ -319 -70 339 586 499 439 103 -217 -601 -599 -474 -68 320 383 435 344 156 -396 -414 -385 -492 -192 177 458
7910D58K2j87k13k60k51r2N7J85L66L29N5Ll09k60k76j84O6K08L63L19R7l6k02
$$ 458 480 293 80 -180 -431 -523 -466 -281 85 414 469 472 163 -97 -373 -557 -491 -283 80 399 496 460 258
7933B58k48l43j96N1J76K65L77J52j4p1m07l84j33L6J39K92L09K52Oj97k42k73
$$ 258 10 -333 -529 -478 -302 -37 340 492 478 407 0 -384 -517 -481 -342 -50 259 511 517 320 78 -195
7955a95k32l6K4L40K99K91J51k56k63k34l87p4J52K70K45L76k3j22j42k73l35
$$ -195 -427 -463 -439 -99 200 491 642 386 123 -111 -498 -572 -420 -150 95 471 448 326 184 -89 -424
7976d24q4J4K92L35L21Q7n6k44k01m35r0N6K74J83L51J90j35k55k38k82k77L2
$$ -424 -508 -494 -202 133 454 541 485 241 40 -395 -485 -429 -155 28 379 569 434 179 -59 -341 -618 -586
7998e86K21L92K92K48q0r1l10l91j30j24J88L07L48K82j8k85k90j45j39j24M1
$$ -586 -365 27 319 567 487 396 86 -305 -435 -559 -371 -64 284 566 548 263 -27 -172 -311 -435 -394
8019c94L61K11L45k8j0l51k77k94r5J68J98L32L23Rr7k33l58j52j06K6J73L21
$$ -394 -33 178 523 495 485 134 -143 -437 -532 -364 -166 166 489 498 401 168 -190 -342 -448 -422 -249 72
8041G2M30J8j38j77j99k89k08K7J96L62K13J63r7j0m01j94m04J41J93L55K47K46
$$ 72 502 520 382 205 6 -283 -491 -464 -268 94 307 470 373 363 -38 -232 -636 -495 -302 53 300 546
8063E46q7j60l35k01k11n1J98K71K90J36P4j47k13l09k97j57K59K90K47K50N0
$$ 546 459 299 -36 -237 -448 -499 -301 -30 260 396 470 323 110 -199 -496 -653 -394 -104 143 393 443
8084D43kk44l34l41o4J10L17K30K85Q9j44j92k38l05q7j3K86L12K83P3o4j61l72
$$ 443 441 197 -137 -478 -542 -432 -115 115 400 489 345 153 -85 -390 -477 -490 -204 108 391 464 400 239 -133
8107a33k38j53Q3J92L50K19J61J2k17l55j75k27oK12L54K38J51jj55l57j40k78
$$ -133 -371 -524 -441 -249 101 320 481 493 276 -79 -254 -481 -487 -275 79 317 468 467 312 -45 -185 -463
8129d63m1Q9K90M11K07n4l7l07j95k74j51J66K22L40J72J54j05k54k68l14j72
$$ -463 -504 -415 -125 286 493 439 402 95 -100 -374 -525 -359 -137 203 375 529 424 170 -98 -412 -584
8150e84J74L05K22L54m3N3l22k95k33j50N3K30M01K66P5%l12l53j84j83LK17L19
$$ -584 -410 -105 117 471 428 481 159 -136 -369 -519 -466 -236 165 431 506 506 194 -159 -343 -526 -523 -306 13
8173A3K39K46k4k00k62l03j61qJ55K47L93Q6ok3l03k91j86p9
$$ 13 252 498 474 274 12 -291 -452 -460 -305 -58 335 421 415 392 89 -202 -388 -467
8191d67
$$ Imaginary data points
##PAGE= N=2
##DATA TABLE= (X++(I..I)), XYDATA
0@%%%%%%%%%Qj6J6j6K4l2M0n6O6p7R4j15J39j64J95k29K64l09L61m14M76n47O24
$$ 0 0 0 0 0 0 0 0 0 0 8 -8 8 -8 16 -16 24 -32 34 -43 51 -64 75 -89 106 -123 141 -168 193 -221 255 -292 332
32C32p10Q06r10J026j155J294j448J615j797K001k219K459k726L011l323L667
$$ 332 -378 428 -482 544 -611 683 -765 850 -947 1054 -1165 1294 -1432 1579 -1744 1923
48A923m040M452m905N402n954O570p256Q026q902R902j1062J2425j4050J6030
$$ 1923 -2117 2335 -2570 2832 -3122 3448 -3808 4218 -4684 5218 -5844 6581 -7469 8561
62H561j8501K1692k5997L2151m1743N8920r9205L72846K64403n86116k88376k5259
$$ 8561 -9940 11752 -14245 17906 -23837 35083 -64122 308724 573127 -12989 -301365 -326624
74c26624K02950L9873j7004J3450J60687Q8136k5794p1915L6374j4016j84851
$$ -326624 -123674 -83801 -100805 -87355 73332 161468 135674 63759 100133 86117 -98734
85i8734k66901p560L29016M05782Q6026k51940k80888l1500R4901j9120j58342
$$ -98734 -365635 -373195 -44179 361603 447629 195689 -85199 -116699 -21798 -40918 -199260
96a99260p2943J19280K04342J20465L5418K4948p310j74072l10878j79521J69262
$$ -199260 -272203 -152923 51419 171884 207302 232250 224940 50868 -260010 -439531 -270269
107b70269L66799K09847r5907k00806m9673J01664L3738j40943j66211q123J21953
$$ -270269 96530 306377 210470 9664 -40009 61655 95393 -45550 -211761 -219884 -97931
118i7931J09833O5846R3826J03407l0749k36631k81387p1213J84714K12477L5821
$$ -97931 11902 77748 171574 274981 244232 7601 -273786 -344999 -160285 52192 88013
129H8013p3059J5639J30202O9705j18642k15602j20600L5339Q8141O2456Q4858
$$ 88013 14954 30593 160795 230500 111858 -103744 -224344 -189005 -100864 -38408 46450
140D6450J37481P7035j08634k32763j48706N0613J41284M9104n9895j1961J29118
$$ 46450 183931 260966 152332 -80431 -229137 -178524 -37240 11864 -48031 -59992 69126
151F9126J54874J1745j38855j56451q1302k9321j4122M2347J50060J84526N4690
$$ 69126 224000 235745 96890 -59561 -140863 -170184 -184306 -141959 8101 192627 247317
162B47317j29414j72993n6177N0798K7371n0674l5376Q4676J63468R1969n2061
$$ 247317 117903 -55090 -111267 -60469 -33098 -83772 -119148 -34472 128996 220965 168904
173A68904j18887q9271o0490o5453l2927P1255J60118J26897n218r2160n0775
$$ 168904 50017 -39254 -99744 -165197 -198124 -126869 33249 160146 154928 62768 11993
184A1993K5096L011r1545j13644p778J22789J51617P0783k3568o3098p5417j00057
$$ 11993 37089 40100 -51445 -165089 -172867 -50078 101539 172322 148754 85656 10239 -89818
196h9818r4336n708J09720J37857N9426k6500l0586J8231J7589o4610j32415q7002
$$ -89818 -184154 -189862 -80142 57715 117141 90641 60055 78286 95875 31265 -101150 -188152
208a88152L4803J13820J01477M9335J1383j6993n9233r6454p7920J195O6748N7746
$$ -188152 -153349 -39529 61948 111283 122666 105673 46440 -50014 -127934 -126739 -59991 -2245
220b245J6000J9833O0545N6671k7116j24145j38088n0842N5682R7740P9216N2989
$$ -2245 13755 33588 94133 150804 123688 -457 -138545 -189387 -133705 -35965 43251 96240
232I6240L0677j1175o2951q1543n0340l822J3621M142J4933O4798R5827M7078
$$ 96240 126917 115742 52791 -28752 -79092 -82914 -69293 -65151 -50218 14580 110407 157485
244A57485n2388j13196r3596k7072K6807M7728N4483O2398N2315P256m5676o6131
$$ 157485 105097 -8099 -101695 -128767 -101960 -54232 251 62649 114964 122220 76544 10413
256A0413n5468m2110l0936j087N3730J00198R1053J9882n7678q3006n8367k5701
$$ 10413 -45055 -87165 -118101 -119188 -65458 34740 125793 145675 87997 4991 -53376 -79077
268g9077n755J3752M0618O0609N3816J9302k0485m4717n6251o2464m8056J268
$$ -79077 -84832 -71080 -30462 30147 83963 103265 82780 38063 -18188 -80652 -128708 -127440
280a27440O3853R5384P4126K0068k8642n0322n3753n2538l9705m164M0984O6502
$$ -127440 -63587 31797 105923 125991 97349 47027 -6726 -59264 -98969 -103133 -62149 4353
292D353O0332L1768l485l5880n9636o5789m3400M190N1220P0232N7193K9222m59
$$ 4353 64685 96453 92968 57088 -2548 -68337 -111737 -107547 -56327 13905 71098 100320 99861
305I9861k8957n4134o5629n1960j2511L2215O0650O4133M6626J4544k3980n6211
$$ 99861 70904 16770 -48859 -100819 -113330 -81115 -20465 43668 90294 104838 80858 24647
317B4647o6831m8886j0705K9003N3727N8079M4670J6835j9813n2104o5165n1601
$$ 24647 -42184 -91070 -101775 -72772 -19045 39034 83704 100539 80726 28622 -36543 -88144
329h8144j7309K1661N0225O1476N2226K4610j3031m6431o2835n6141k8066R208
$$ -88144 -105453 -83792 -33567 27909 80135 104745 91714 45283 -17552 -73693 -101759 -92551
341i2551M2245N9642N6126L0945o281m0458n8690n4136k9283N424L7465N6410
$$ -92551 -50306 9336 65462 96407 90126 49668 -9022 -63158 -92441 -87017 -49552 6858
353F858N5301L3657j778l6830n8297n9206l7806k129L3606N6682N9633M1041P550
$$ 6858 62159 95816 94038 57208 -1089 -60295 -98101 -100230 -66624 -9942 49691 90732 98282
366I8282k7628n1879n7167m2165j1373K3018M9043N6556M2478J1826k3059m9109
$$ 98282 70654 18775 -38392 -80557 -91930 -68912 -19869 36687 79165 90991 67932 18823
378A8823n7096m4131j4236K1292M9389N9122M7421J8565j6234m4863n7969n1143
$$ 18823 -38273 -82404 -96640 -75348 -25959 33163 80584 99149 82915 38052 -19917 -71060
390g1060k5072J1197M2449N6282M8537K4348o916l5959n3408n1369k8106O972
$$ -71060 -96132 -84935 -42486 13796 62333 86681 79765 43806 -9602 -60971 -89077 -82105
402h2105L8977N4724M9925K8066l006l4798n5894n5379l1846L100L3844M9599
$$ -82105 -43128 11596 61521 89587 86581 51783 -4111 -59490 -91336 -88236 -54392 -4793
414d793M9755L5706R806k4008n1874n8455l8702n051K6615M7094N1402L9355J1234
$$ -4793 44962 80668 90474 66466 14592 -43863 -82565 -87616 -61001 -13907 37495 76850 88084
427H8084k3938n0647n3547l3707o226J7141L6215M9688M8584K3865j6085n0838
$$ 88084 64146 13499 -40048 -73755 -79981 -62840 -26625 23063 71647 95512 79427 28589
439B8589n9885m2069j3638J3377L7659N3434M8619K0903j5110m0066m4292l5490
$$ 28589 -31296 -73365 -87003 -73626 -35967 17467 66086 86989 71879 31813 -12479 -47969
451d7969k3212n920K3670N4648O0498L1026j2951m4113n0572m0254k3148k09K9150
$$ -47969 -71181 -77101 -53431 1217 61715 92741 79790 35677 -14895 -55149 -78297 -78506 -49356
464d9356N2471N0496K3881n107k1831l2630m3684m5757k3478K1671O1255O3005
$$ -49356 3115 53611 77492 72385 50554 17924 -25760 -71517 -94995 -73324 -12069 50936
476E0936K9156q095k7093l4874l9952l5435j2162K1468M4838M2923K5975J2040
$$ 50936 80092 71997 44904 10030 -29922 -65357 -77519 -56051 -11213 31710 57685 69725
488F9725n29k6359n7347o2245k5507K8093N8255N0693K4117N084n059k2613m4404
$$ 69725 69196 42837 -14510 -76755 -102262 -74169 -15914 34779 58896 63980 58921 36308 -8096
501h096m5650j9098J2975K9091L2095L5228L5536J4917l0147o8962o2805j5207
$$ -8096 -53746 -72844 -59869 -30778 1317 36545 72081 86998 56851 -12111 -74916 -90123
513i0123K9229M0769L0563K4650K4046J1404j8907m5858m5372k2459k477R324
$$ -90123 -60894 -20125 10438 35088 59134 70538 51631 5773 -39599 -62058 -64535 -55211
525e5211K8138N2708N4642J5946l9922o6792m6344n569J4879J2581J5728L3443
$$ -55211 -27073 25635 80277 96223 56301 -10491 -56835 -62404 -47525 -34944 -19216 14227
537A4227M1078J9253j7253l9409l8842k9649k1891k934L5749O7943N5804L284
$$ 14227 55305 74558 57305 17896 -20946 -50595 -72486 -75420 -39671 28272 84076 87360
549H7360m2605m6841k3016p530j2185j2606J2557M4490M8644K1381r417k5276
$$ 87360 44755 -2086 -25102 -32632 -44817 -57423 -44866 -376 48268 69649 60232 34956
561C4956l4233m3209l7783k506M6636O7752L8870q105k7869j6368q916k3720l8095
$$ 34956 723 -42486 -80269 -82775 -36139 31613 70483 62378 34509 18141 9225 -14495 -52590
574e2590k2957J7724M9008M7148K4201L463j3696l7762n4776l9309P084M6520
$$ -52590 -75547 -57823 -8815 38333 62534 65997 52301 14539 -40237 -79546 -72462 -25942
586b5942M6460J6728l988K552J0485r924m4787n2412k0589K2171M3875M1263K9691
$$ -25942 20518 37246 33258 35810 46295 36371 -8416 -60828 -81417 -59246 -15371 25892 55583
599E5583J5448r639m2334n5468k9727J2132K9868J7822O430J7127L2716K0339
$$ 55583 71031 61392 19058 -36410 -66137 -54005 -24137 -6315 115 17242 49958 70297
611G0297k2429n6915n0219j3579J8330L0491L5127L6014K1967r976m0203m2284
$$ 70297 47868 -9047 -59266 -72845 -54515 -24024 11103 47117 69084 59108 18905 -23379
623b3379j7737L786K476l602J3151M2703M8454J4088l2788n3842l9836j2294N806
$$ -23379 -41116 -37330 -34854 -38456 -25305 17398 65852 79940 47152 -6690 -46526 -58820 -53014
636e3014J7679L2534L9461K2902r017k8039k4096j3434j4570k1092r012K7177
$$ -53014 -35335 -2801 36660 59562 50545 22506 -1590 -15024 -29594 -50686 -59698 -32521
648c2521N5988M5257L675l1115l8430k9004j9408r398R082L1533L8328K1053j935
$$ -32521 23467 68724 72399 41284 2854 -26150 -45558 -54956 -45874 -14341 23987 45040 43105
661D3105j0317r270j8272l4365l4019m064L6813N3714L3793P35j8364k2531k5563
$$ 43105 32788 23518 5246 -29119 -63138 -67202 -30389 23325 57118 57853 39489 16958 -8605
674h605k8102j7884O208K6951K9823J9199J1122Q080k944k8157m7034l4926K791
$$ -8605 -36707 -54591 -48383 -21432 8391 27590 38712 46792 43848 15691 -31343 -66269 -63478
687f3478L5406M0561K4813P530k203j2148k6186l2480k0142K306J7149K0085K1791
$$ -63478 -28072 12489 37302 44832 42629 30481 4295 -28185 -48327 -46021 -28872 -8787 13004
700A3004K5384J9732m611l6028m8252k8459M895K5047K6142K1147J7784J0490
$$ 13004 38388 58120 53509 17481 -30771 -59230 -54335 -29288 -3146 18001 35785 46275
712D6275o522k5046l0642k0704o442L562J3603K8701L6683K2944r335l6874l9754
$$ 46275 39753 14707 -15935 -36639 -43081 -39519 -25916 2785 39468 62412 53077 16203 -23551
725b3551k0711K79J0282J5002K1698K6057J7593k204j9926k6591k4035j7579o117
$$ -23551 -44262 -43983 -33701 -18699 2999 29056 46649 44445 24519 -2072 -26107 -43686 -49803
738d9803J3570L4383L9062J9435j0112k7982k7185j7722r884l267Q420K3367L0103
$$ -49803 -36233 -1850 37212 56647 46535 18553 -8632 -26354 -36238 -39505 -31085 -7718 22385
751B2385K0858K850j3220k3038k8379k5321j0047J4756L4048L3807J5903m289
$$ 22385 43243 46093 32873 9835 -18544 -43865 -53912 -39156 -5108 28699 44602 40313
763D0313j4250j6956j9985k0900j3028N252K3423L0222K3080Q444o710k0819l0400
$$ 40313 26063 9107 -10878 -31778 -44806 -39554 -16131 14091 37171 45615 38905 18086 -12314
776a2314k7760j0393J2615K6825K5948J6458O380k034j2604k4175k7667j7059
$$ -12314 -40074 -50467 -37852 -11027 14921 31379 37759 35725 23121 -1054 -28721 -45780
788d5780K912K0105K7065K4459J4387r15j7584k8740k6657j2208N650J6923K0817
$$ -45780 -42868 -22763 4302 28761 43148 42233 24649 -4091 -30748 -42956 -37306 -20383 434
801D34K0406J6220N114j1237k5740k8787j8246j041J4262K3309K5380J8692M099
$$ 434 20840 37060 42174 30937 5197 -23590 -41836 -42877 -28615 -5306 20074 38766 42865
814D2865j3184k4425k4718j5617k890Q472J7832K4070K1833R108q909k2877k6476
$$ 42865 29681 5256 -19462 -35079 -37969 -29497 -11665 12405 34238 43346 34437 11560 -14916
827a4916j9578o499P658J9416K5275K1527Q397p735j9375k2926j9525j0088K619
$$ -14916 -34494 -40993 -33335 -13919 11356 32883 41280 33545 14170 -8756 -28281 -38369 -35750
840c5750J6041K4920K3539J1997m474j7684k3325k1417j1971J534J5578K3660
$$ -35750 -19709 5211 28750 40747 36273 18589 -4736 -26153 -38124 -36590 -21012 2648
852B648K2380J2397j601j3996k1248k1941j5057j862J3074K2809K3540J5067J236
$$ 2648 25028 37425 35824 21828 580 -21361 -36418 -38280 -25206 -2397 21143 36210 37446
865C7446j2030k0870k2731j6275l232J0911K0704K2398J6067M291q809j8981k2581
$$ 37446 25416 4546 -18185 -34460 -37692 -26781 -6077 16321 32388 36679 27870 8889 -13692
878a3692j8175n999Q496J9607K2574J7736O405o755j8066k2468j8600p819N812
$$ -13692 -31867 -37866 -29370 -9763 12811 30547 36952 30197 12131 -10337 -28937 -36756 -30944
891c0944J7204K1602J8834R136l915j5913k2013j9657j0040L657J5311K1233J9449
$$ -30944 -13740 7862 26696 35832 31917 16004 -6009 -25666 -35706 -32049 -16738 4495 23944
904B3944J0763k057j4162k1010j9941j1562R75J2844K0314K0252J2905M78j2072
$$ 23944 34707 32650 18488 -2522 -22463 -34025 -33050 -20206 108 20360 33265 33743 21671
917B1671j9946k0571j3388j270J1024J9120K0292J3962K694r769j8749k0270j4751
$$ 21671 1725 -18846 -32234 -33504 -22480 -3360 16932 30894 33588 23819 5070 -15200 -29951
930b9951l631Q747J7861K0463J5525M510p706j7341k0197j5879n634O573J6263
$$ -29951 -33582 -24835 -6974 13489 29014 33524 25818 8477 -11720 -27599 -33233 -26660 -10397
943a0397K0179J6472O693n453j5671j9773j6890p607M447J4689J9562J7229Q482
$$ -10397 9782 26254 32947 27494 11823 -7950 -24840 -32447 -28000 -13311 6251 23480 31962
956C1962l450j3912j9083j7463r374K222J2959J8934J7735J0198j147j2145j8298
$$ 31962 28512 14600 -4483 -21946 -31320 -29098 -16139 2795 20530 30728 29581 17436 -862
969h62j8134j1003J39J1184J7887J8254J1510P98j0018j7292j8233j2355j821
$$ -862 -18996 -29999 -29860 -18676 -789 17465 28975 29773 19755 2463 -15770 -28125 -29946
982b9946R186J6810J8138J2962K875q221j6277j8225j3560l674P208J5750J8031
$$ -29946 -20760 -3950 14188 27150 30025 21804 5527 -12698 -26258 -29932 -22724 -6974 11057
995A1057J3908M758o131j4793j8171j4410n574N165J4177J7684J4914O661m370
$$ 11057 24965 29723 23592 8799 -9372 -23782 -29356 -24191 -10014 7670 22584 29245 24875
1008B4875j3608j7546j5311o920L487J2584J7082J5455Q049k389j1913j6786j5865
$$ 24875 11267 -6279 -21590 -28510 -25023 -12439 4643 20098 28147 25758 13845 -2941 -18806
1021a8806q743J486J0862J6605J6148R446n10j0481j6220j5880r745m72R286J5360
$$ -18806 -27549 -26063 -15201 1404 17552 26998 26488 16007 -213 -16093 -25838 -26310 -17024 -1664
1035a664J6091J0810J382q584j5108j6201j1272k128P666J4731J6335J1700K661
$$ -1664 14427 25237 26619 18035 2927 -13274 -24546 -26674 -19008 -4277 12058 23758 26419
1048B6419o913j3947j5820j2205l778N646J3454J6088J2718M619n116j2894j5786
$$ 26419 19506 5559 -10261 -22466 -26244 -20598 -7144 8944 21662 26281 21165 8271 -7515
1061g515j3148n387M270J2472J5806J3005N830l466j1347j5188j3584o850K189
$$ -7515 -20663 -26050 -21780 -9308 6498 19503 25333 21867 10520 -4668 -18252 -25102 -22913
1074b2913J0975J5461J3852P369j812j0247j4792j4143p971J041R732J4415J3797
$$ -22913 -11938 3523 17375 24744 22932 12685 -2107 -16250 -24221 -23180 -13448 967 14764
1087A4764Q388L3q256j3976j4547r427p89Q300J3741J4385R537J569p264j3330
$$ 14764 23152 23185 14929 953 -13594 -23021 -23810 -15510 -1769 12616 22153 23722 16458 3128
1101C128j4512j0212j924O650J2562J4024J0657L215n480j2173j4733j1158l693
$$ 3128 -11384 -21596 -23520 -16870 -4308 9716 20373 23588 18108 5935 -8798 -19956 -23649
1114b3649N187J1824J4132J1411M416m352j1429j3856j1547m888L419J0261J3614
$$ -23649 -18462 -6638 7494 18905 23321 18969 7540 -6316 -17863 -22751 -19332 -9071 4543
1127D543J2287N952k457j0353j3859j2238o122K046R285J3401J2533O763j342
$$ 4543 16830 22782 20325 9972 -3887 -16125 -22247 -20201 -10916 2485 15018 21781 20439
1140B0439q893j2905j2342p249K49P780J2754J3058Q142J12p811j2544j2605q269
$$ 20439 11546 -1359 -13701 -20950 -20701 -12921 -167 12891 21033 21145 13334 790 -11815 -20084
1154b0084r18O775J2198J2651Q746J570o161j1371j2638r377k588N510J1267J2971
$$ -20084 -21002 -14227 -2029 10622 19368 20938 14777 3406 -9232 -18609 -21197 -15687 -4420 8551
1168H551R677K731n062j0682j2555r775l608M219J0102J2588J0046M080l241r552
$$ 8551 18228 20959 15897 5215 -7340 -17115 -20723 -16504 -6402 6186 16232 20312 17071 7519
1182G519j2291j0857m659K785R427J2209J0499N162k162q611j1879j0706n902
$$ 7519 -4772 -15629 -20288 -17503 -8076 4133 14632 19794 17632 9021 -2858 -13564 -19466
1195a9466J538Q073J1593J0944O338o01p571j1654j1215o651L20P028J1059J1160
$$ -19466 -17928 -9855 1738 12682 19020 18419 10848 -806 -12021 -18672 -18352 -11324 -265 10895
1209A0895P077M51o395j0765j1173p472j050N713J0455J1298P967J542n382j0122
$$ 10895 17972 18423 12028 1263 -9910 -17382 -18432 -12719 -2264 9034 17001 18543 13161 3039
1223C039j1132q091k158M455R808J1091Q554K672m115r165j1013q757l361L489
$$ 3039 -8093 -16184 -18342 -13887 -4079 7012 15566 18238 14123 4958 -6055 -14812 -18173 -14684
1237a4684R008J1064Q886L446k885q264j0649r232m516K398Q012J0755R393M556
$$ -14684 -5676 5388 14274 17720 14835 6571 -4078 -13310 -17826 -15428 -7416 3339 12732 17288
1251A7288j660p448j0477r719n100J318P258J0042R484N428l21o355j0140j0063
$$ 17288 15628 8180 -2297 -12016 -17116 -15798 -8540 1502 10986 16414 16093 9738 -402 -10465
1265a0465n869J39O326R683R553O377M77n603r594r952o347o61N038Q687R532
$$ -10465 -16334 -16195 -9869 -186 9367 15744 16221 10618 1024 -8928 -15275 -15936 -10898 -2211 7321
1280G321P373J848m570r210j0012p126j621M205Q295R528P563K471l701q257r479
$$ 7321 14694 16542 11972 2762 -7250 -14376 -15997 -11792 -3497 6031 13594 16065 12364 4107 -5372
$$ [...]
8191H0
##END NTUPLES=NMR FID
##END=
