##TITLE=1H_Pr 18-d
 D2O
 8 sc, 
 15.3.2024
##JCAMPDX= 6.0         $$ Bruker NMR JCAMP-DX V2.0
##DATA TYPE= NMR FID
##DATA CLASS= NTUPLES
##ORIGIN= UXNMR, Bruker Analytische Messtechnik GmbH
##OWNER= root
$$ XWIN-NMR		Version 3.5
$$ Fri Mar 15 14:39:52 2024 Russian Standard Time (UT+4h)  she@DPX200
##.OBSERVE FREQUENCY= 200.1313
##.OBSERVE NUCLEUS= ^1H
##.DELAY= (6, 6)
##.ACQUISITION MODE= SIMULTANEOUS
##.ACQUISITION SCHEME= undefined
##.AVERAGES= 8
##.DIGITISER RES= 18
##SPECTROMETER/DATA SYSTEM= spect
##.PULSE SEQUENCE= zg30
##.SOLVENT NAME= D2O
##.SHIFT REFERENCE= (INTERNAL, D2O, 0, 15.7039)
##AUDIT TRAIL= $$ (NUMBER, WHEN, WHO, WHERE, WHAT)
$$ ##TITLE= Audit trail, XWIN-NMR		Version 3.5
$$ ##JCAMPDX= 5.01
$$ ##ORIGIN= Bruker BioSpin GmbH
$$ ##OWNER= she
$$ F:/spectra/data/she/nmr/H-F/1/audita.txt
$$ ##AUDIT TRAIL=  $$ (NUMBER, WHEN, WHO, WHERE, WHAT)
(   1,<2024-03-15 14:39:01.89 +0400>,<she>,<DPX200>,
      <created by zg, POWCHK disabled, PULCHK disabled
       configuration hash MD5:
       00 E9 B6 7A A2 85 ED C7 34 08 36 98 17 FE 4E 26
       data hash MD5: 16K
       2A D4 91 B6 2F 37 F4 AB 84 DC 12 33 1E A9 86 26>)
$$ ##END=
$$ 
$$ hash MD5
$$ 33 01 EC E2 D8 06 0E 84 B8 7D 06 31 97 6B F3 98
##$RELAX= 
##$RELAX= 
##$RELAX= 
##$RELAX= 
##$RELAX= 
##$RELAX= 
$$ Bruker specific parameters
$$ --------------------------
##$DU= <F:/spectra>
##$EXPNO= 1
##$NAME= <H-F>
##$PROCNO= 1
##$TYPE= <nmr>
##$USER= <she>
##$AMP= (0..31)
100 100 100 100 100 100 100 100 100 100 100 100 100 100 100 100 100 100 
100 100 100 100 100 100 100 100 100 100 100 100 100 100 
##$AQSEQ= 0
##$AQ_mod= 1
##$AUNM= <au_zg>
##$AUTOPOS= <>
##$BF1= 200.13
##$BF2= 200.13
##$BF3= 200.13
##$BF4= 200.13
##$BF5= 200.13
##$BF6= 200.13
##$BF7= 200.13
##$BF8= 200.13
##$BYTORDA= 1
##$CFDGTYP= 0
##$CFRGTYP= 5
##$CHEMSTR= <none>
##$CNST= (0..31)
1 1 145 1 1 1 1 1 1 1 1 1 1 1 1 1 1 1 1 1 1 1 1 1 1 1 1 1 1 1 1 1 
##$CPDPRG= <>
##$CPDPRG1= <>
##$CPDPRG2= <>
##$CPDPRG3= <>
##$CPDPRG4= <mlev>
##$CPDPRG5= <mlev>
##$CPDPRG6= <mlev>
##$CPDPRG7= <mlev>
##$CPDPRG8= <mlev>
##$CPDPRGB= <>
##$CPDPRGT= <>
##$D= (0..31)
0 1.2 0 0 0 0 0 0 0 0.06 0 0.03 0 0 0 0 0.0002 0 0 0 0 0 0 0 0 0 0 0 0 
0 0 0 
##$DATE= 1710499141
##$DBL= (0..7)
120 120 120 120 120 120 120 120 
##$DBP= (0..7)
150 150 150 150 150 150 150 150 
##$DBP07= 0
##$DBPNAM0= <>
##$DBPNAM1= <>
##$DBPNAM2= <>
##$DBPNAM3= <>
##$DBPNAM4= <>
##$DBPNAM5= <>
##$DBPNAM6= <>
##$DBPNAM7= <>
##$DBPOAL= (0..7)
0.5 0.5 0.5 0.5 0.5 0.5 0.5 0.5 
##$DBPOFFS= (0..7)
0 0 0 0 0 0 0 0 
##$DE= 6
##$DECBNUC= <off>
##$DECIM= 32
##$DECNUC= <off>
##$DECSTAT= 4
##$DIGMOD= 1
##$DIGTYP= 9
##$DL= (0..7)
0 120 120 120 120 120 120 120 
##$DP= (0..7)
150 150 150 150 150 150 150 150 
##$DP07= 0
##$DPNAME0= <>
##$DPNAME1= <>
##$DPNAME2= <>
##$DPNAME3= <>
##$DPNAME4= <>
##$DPNAME5= <>
##$DPNAME6= <>
##$DPNAME7= <>
##$DPOAL= (0..7)
0.5 0.5 0.5 0.5 0.5 0.5 0.5 0.5 
##$DPOFFS= (0..7)
0 0 0 0 0 0 0 0 
##$DQDMODE= 0
##$DR= 18
##$DS= 0
##$DSLIST= <SSSSSSSSSSSSSSS>
##$DSPFIRM= 0
$$ [...]
##$SUBNAM2= <"">
##$SUBNAM3= <"">
##$SUBNAM4= <"">
##$SUBNAM5= <"">
##$SUBNAM6= <"">
##$SUBNAM7= <"">
##$SUBNAM8= <"">
##$SUBNAM9= <"">
##$SW= 18.0517328524113
##$SWIBOX= (0..15)
0 0 2 0 0 0 0 0 0 0 0 0 0 0 0 0 
##$SW_h= 3612.71676300578
##$TD= 16384
##$TD0= 1
##$TE= 0
##$TE2= 300
##$TE3= 300
##$TEG= 300
##$TL= (0..7)
0 120 120 120 120 120 120 120 
##$TP= (0..7)
150 150 150 150 150 150 150 150 
##$TP07= 0
##$TPNAME0= <>
##$TPNAME1= <>
##$TPNAME2= <>
##$TPNAME3= <>
##$TPNAME4= <>
##$TPNAME5= <>
##$TPNAME6= <>
##$TPNAME7= <>
##$TPOAL= (0..7)
0.5 0.5 0.5 0.5 0.5 0.5 0.5 0.5 
##$TPOFFS= (0..7)
0 0 0 0 0 0 0 0 
##$TUNHIN= 0
##$TUNHOUT= 0
##$TUNXOUT= 0
##$USERA1= <user>
##$USERA2= <user>
##$USERA3= <user>
##$USERA4= <user>
##$USERA5= <user>
##$V9= 5
##$VALIST= <valist>
##$VCLIST= <CCCCCCCCCCCCCCC>
##$VD= 0
##$VDLIST= <DDDDDDDDDDDDDDD>
##$VPLIST= <PPPPPPPPPPPPPPP>
##$VTLIST= <TTTTTTTTTTTTTTT>
##$WBST= 1024
##$WBSW= 4
##$XGAIN= (0..3)
0 0 0 0 
##$XL= 0
##$YL= 0
##$YMAX_a= 200370
##$YMIN_a= -151380
##$ZGOPTNS= <>
##$ZL1= 120
##$ZL2= 120
##$ZL3= 120
##$ZL4= 120
##$ABSF1= 10
##$ABSF2= 0
##$ABSG= 5
##$ABSL= 3
##$ALPHA= 0
##$AQORDER= 0
##$ASSFAC= 0
##$ASSFACI= 0
##$ASSFACX= 0
##$ASSWID= 0
##$AUNMP= <proc_1d>
##$AZFE= 0.1
##$AZFW= 0.1
##$BCFW= 1
##$BC_mod= 2
##$BYTORDP= 1
##$COROFFS= 0
##$CY= 11.3945322036743
##$DATMOD= 1
##$DC= 2
##$DFILT= <>
##$DTYPP= 0
##$F1P= 15.7292609196834
##$F2P= 12.9074282941183
##$FCOR= 0.5
##$FTSIZE= 0
##$FT_mod= 4
##$GAMMA= 1
##$GB= 0.15
##$INTBC= 1
##$INTSCL= 1
##$ISEN= 128
##$LB= 0.24
##$LEV0= 0
##$LPBIN= 0
##$MAXI= 10000
##$MC2= 0
##$MEAN= 0
##$ME_mod= 0
##$MI= 1.114404
##$NCOEF= 0
##$NC_proc= 0
##$NLEV= 6
##$NOISF1= 3.799351
##$NOISF2= 2.8
##$NSP= 1
##$NTH_PI= 0
##$NZP= 0
##$OFFSET= 15.70392
##$PC= 1
##$PHC0= -25474.64
##$PHC1= 20.38731
##$PH_mod= 1
##$PKNL= yes
##$PPARMOD= 0
##$PSCAL= 0
##$PSIGN= 0
##$REVERSE= no
##$SF= 200.130013532006
##$SI= 16384
##$SIGF1= 3
##$SIGF2= 2
##$SINO= 400
##$SIOLD= 16384
##$SREGLST= <1H.CDCl3>
##$SSB= 0
##$STSI= 0
##$STSR= 0
##$SW_p= 3612.71676300578
##$SYMM= 0
##$S_DEV= 0
##$TDeff= 0
##$TDoff= 0
##$TI= <>
##$TILT= no
##$TM1= 0
##$TM2= 0
##$TOPLEV= 0
##$USERP1= <user>
##$USERP2= <user>
##$USERP3= <user>
##$USERP4= <user>
##$USERP5= <user>
##$WDW= 1
##$XDIM= 8192
##$YMAX_p= 0
##$YMIN_p= 0
$$ End of Bruker specific parameters
$$ ---------------------------------
##NTUPLES= NMR FID
##VAR_NAME=  TIME,          FID/REAL,        FID/IMAG
##SYMBOL=    X,             R,               I
##VAR_TYPE=  INDEPENDENT,   DEPENDENT,       DEPENDENT
##VAR_FORM=  AFFN,          ASDF,            ASDF
##VAR_DIM=   8192,          8192,            8192
##UNITS=     SECONDS,       ARBITRARY UNITS, ARBITRARY UNITS
##FACTOR=    0.0002768,     1,               1
##FIRST=     0,             0,               0
##LAST=      2.2672688,     0,               0
##MIN=       0,             -151380,         0
##MAX=       2.2672688,     200370,          0
$$ Real data points
##PAGE= N=1
##DATA TABLE= (X++(R..R)), XYDATA
0@%%%%%%%%%%%%%%%%%%%%%oJ4j6J6j6J6j7K3l0L2l4M0m6N4o2O7p6Q7r6J05j18
42f3J34j49J65j81J99k19K40k66K92l21L54l89M29m74N24n80O45p22Q10r16J044
63E56j201J403j670K037k567L302m057J13707Q2973n2788j08495r7844k4319K8884
77f0079K7443q551m982L0244O0813N3561J0076n2296p7449n2419j4081N565K3052
90e9103M3849O0711O0346K5545m8708j07627r3713j7024O0180R0825N7281q279
102F4283m0465j4178K0610J5550k5173o5728o4859l385P4692R9373N6572j0023
114A07269n8578o7904l9786p564N012J4798L5748M8269L4986L026l3931n2862
126a1517l4282J304J4172K925l307R871L6430N4690L1643l2711q4695p8079k1427
$$ y = [0, 0, 0, 0, 0, 0, 0, 0, 0, 0, 0, 0, 0, 0, 0, 0, 0, 0, 0, 0, 0, 0, -6, 8, -8, 8, -8, 8, -9, 14, -16, 16, -18, 22, -24, 30, -32, 35, -41, 46, -50, 55, -63, 71, -78, 87, -94, 105, -114, 126, -140, 152, -169, 185, -204, 225, -249, 275, -305, 340, -382, 428, -488, 556, -645, 758, -912, 1125, -1442, 1860, -2197, 111510, 194483, 141695, 33200, -64644, -88963, -60079, -32636, -41187, -46169, -15925, 44888, 98449, 108525, 56229, -21220, -73639, -87720, -82155, -59103, -15254, 45457, 105803, 131348, 82640, -24987, -118700, -135724, -75544, 15281, 72562, 64283, 23818, 9640, 30250, 45800, 20627, -45101, -109960, -113345, -38653, 60720, 117292, 107269, 48691, -19213, -58999, -66563, -61551, -46753, -11005, 37264, 72250, 75276, 41345, -11517, -45799, -44495, -30323, -27398, -30705, -20834, 15596, 70286, 101929, 69218, -15477, -93556, -114983]
139a14983M5020P8814N6722L084l0241k6022r948m340j1887k3939j9176J1795
151d5101M2342M3331K0664n893k5475l1343k5789k1310j4717R852M3394N6237
163D6192L6046p077m9547n9950k7875J4707L0405J8904J405m080J0337K8365J9387
176E7219j7803m9252m8905j8198K4707N1504M3073J3490r402j9775k4076k3213
188b0631j8103r004R292L0220L4021J6567m419j6264j7555j1210p750j3373j4430
201d2639L868L0477M2935L0461l778m0262n0023k6613O319K5651K6168J4601L240
214B0405K484N206k848j8160k5973k0320l608J7075K7805K2411J0864J118r230
227B7229k0513k5955k2004p054J7090L5024L1306R851j2010k3124j9937p911k49
$$ y = [-114983, -69963, 8851, 65573, 68657, 38416, 12394, 2446, -1894, -13781, -37720, -56896, -45101, -2759, 40572, 61236, 55343, 29868, -1475, -27264, -48574, -63291, -53439, -10045, 46192, 82238, 75161, 25614, -34336, -62211, -47504, -17099, 1805, 3210, -870, 9467, 37832, 57219, 39416, -9836, -58741, -76939, -52232, -728, 42345, 55835, 46433, 26658, 2582, -20631, -38734, -47738, -38446, -8226, 25795, 42362, 37943, 21679, 4124, -7086, -14836, -28209, -42639, -38771, -8294, 34641, 65102, 61324, 21062, -28961, -55574, -49255, -23604, 2564, 17165, 20405, 22889, 28095, 25247, 7087, -18886, -39206, -42814, -25739, 2066, 24477, 35341, 36459, 27229, 6716, -19239, -41243, -48297, -31207, 3817, 35123, 44974, 32964, 9840, -10097, -18008, -18257]
240a8257k219k934N924J8261K4583J7586l217k5879l2476k0355j046J4868K2176
253b985J9144J1025L649m872j5537k1243j6936n524Q062J8038J8068J0423L326
266B4638j151p304j4135j8127j5994m510J4055K6981K4349R451q397k0377k0627
279a1148j1459j955L607Q125J2418J3827J1415L686q507j8274j8745j1071k10
292b8291J0074J6440J6122J1121L077p566j7125j9182j2545r98J1078J7611J5263
305A5079P513k26o369j0823j2616j1312o570K529J2922J8123J5076N403o542j5376
319F811j6806j1600l153N031J1795J4315J2001N634l011j1232j5050j2525n591
332b3381K889J0343J3739J2225O858r70r243j4398j3881p904J265J0030J4518
$$ y = [-18257, -20476, -23410, -17486, 775, 25358, 42944, 39727, 13848, -18628, -38983, -40029, -25161, -2985, 16159, 27184, 30833, 25961, 10424, -10819, -27755, -33279, -25217, -7179, 10889, 21312, 24638, 23487, 16183, 2048, -16079, -32073, -36583, -22528, 4453, 28802, 38253, 29856, 9479, -11148, -22607, -24562, -20955, -12830, -412, 13415, 24830, 28516, 20009, 1735, -17010, -28081, -28291, -18217, -1777, 14345, 25466, 28543, 20977, 3852, -15330, -27875, -28873, -17795, -184, 15079, 22592, 22366, 15997, 5174, -7442, -18754, -25324, -22795, -9873, 8250, 23326, 28729, 22187, 6811, -9995, -21595, -24748, -19717, -7922, 6393, 18394, 24028, 21017, 9785, -5265, -17790, -23381, -20492, -10149, 3590, 15815, 22673, 21703, 12460, -1938, -15819, -23723, -22458, -12428, 2090]
345B090J3077O873j148q658j2555j2169p703o64O944J2227J2987Q877J205p006
359A4377j2489j3083q824j091O824J1819J2325Q568J842n353j0507j2164r608
372a7364l218M399J0645J2830J0153L146m826j0516j2034r269l098L873R165J1378
386E264R729M203l072q939j1613r920m501K708Q172J0846J0075N381j372p703
400I258j1240j0883n857J926Q221J0981R679M754j666o648r014r235o138n25N497
415a0890R663J0770P393M14o349j0054j0220o568k79N365Q808R610P198J307m854
430A1314q695r805p109j294M557P966Q951P253K362l210p458r683q393l254L541
445a2957Q222R709P982K438l486p097q510p382l277K117O085Q411Q299M219j751
$$ y = [2090, 15167, 22040, 20892, 12234, -321, -12490, -20193, -20857, -13913, -1686, 11301, 20178, 21383, 14377, 1888, -11195, -20019, -21110, -14286, -2467, 9858, 18426, 20268, 14915, 4408, -7756, -17364, -20582, -16183, -5538, 7292, 17445, 20591, 15765, 5249, -6785, -16054, -19152, -15279, -6114, 5264, 14993, 19196, 16124, 7185, -4428, -14348, -18849, -16141, -7969, 2877, 12952, 18333, 16961, 9258, -1982, -12865, -18722, -16796, -8575, 2406, 12085, 16839, 15173, 8525, -489, -9724, -15862, -16387, -10890, -1227, 9543, 16936, 17350, 11001, 947, -9273, -15841, -16120, -10755, -1947, 7663, 14861, 16168, 11314, 2619, -7186, -14295, -15589, -11032, -3066, 5885, 13138, 15500, 12290, 4832, -4851, -13244, -16498, -12957, -4735, 4974, 12956, 15394, 11908, 4811, -3699, -11081, -14358, -12241, -6156, 2255, 10554, 14773, 13022]
460A3022o406q786q325m126J758O176Q158P990M435j056n430p769q119m978M77
475a2979N073P648Q144N241k01m802p406p947n423k28M491P087Q012N760M60m314
491H616o989p755n441p06L581O051P063O130K076k588o099q148p143k025L564
506i813O948P698N753J108l247n188o045n659k781J422M509O891P171L518j772
521A0513n387o929o620l096J392M434O563O952M122j157n253p154o580k684K141
536h743M402M809M728L377P79j781m815p425o409j334M347P485P773M240j301
551A0132m747n333m995l593m97K367M432N981N122R42k984m799n309m266j398
566h945J272L307N791O772L542j782o330q231o066j57M872N639M112K313M04p75
$$ y = [13022, 6616, -2170, -10495, -14621, -12863, -6687, 1471, 9461, 13896, 12840, 7410, -359, -8478, -13456, -12979, -7906, -258, 7886, 13127, 12926, 8124, 718, -7229, -12652, -12880, -8389, -1302, 6710, 12470, 12930, 8616, 1627, -6128, -11569, -12275, -8694, -2643, 4420, 10550, 12626, 10038, 3939, -4209, -11352, -13377, -9813, -2865, 4833, 10586, 11694, 8447, 3259, -2786, -8445, -11226, -9804, -5295, 1596, 8767, 12285, 10513, 5126, -1803, -8423, -11519, -10127, -5693, 870, 7822, 11944, 10787, 5534, -1620, -8200, -10884, -8743, -4341, 468, 5196, 8573, 9352, 7571, 2756, -4669, -11078, -12412, -8065, -580, 7193, 11433, 10132, 5385, 52, -4943, -8536, -9033, -6666, -2234, 3747, 8869, 9811, 6827, 2028, -3281, -7547, -8945, -7673, -4366, 1425, 8197, 11739, 9957, 3627, -4604, -10670, -10827, -5955, -316, 3796, 6109, 6513, 5738]
582E738j364l498n700m605k90L916O676O686K739j950m301n042n098l056M95L620
598e034N859O181K933k236n018m674l067q55P87P28J404M070N608L465j188n945
614C018q562n785Q65N701O409M398J358j463k344k245l408l848j776J518L912
629b252M925L802O05j714k426l424m370l337l43L393O911P082K131l957o777n507
645e258k016J826L015J496O65K128L111K070p60m553o684m253Q03M336N417M319
661E662J683j003k548l877m678l121P11M013M966L719N56k244k327r83j141k404
677c016k804j260K330O417O608K071l759o807n959k112K447L903K727J610J562
692C958P92l93j966l790l765j022J617K766K996K612J528L23j294l955n618l630
$$ y = [5738, 4374, 876, -4824, -9429, -9719, -5803, 873, 7559, 10298, 8348, 4047, -995, -6093, -9149, -8654, -5034, 825, 7006, 9939, 7703, 2685, -1989, -5056, -5911, -5124, -4396, -2992, 1078, 6686, 10151, 8963, 3018, -5544, -11329, -10464, -4763, 1646, 6044, 7402, 5939, 3595, 1350, -2058, -5906, -7682, -6164, -2252, 2673, 6475, 7080, 5366, 2940, -484, -4854, -8191, -8534, -5141, 1770, 8852, 10983, 7026, 249, -5258, -7274, -5448, -2433, -937, -272, 1856, 4967, 7037, 6277, 1724, -4960, -9213, -8410, -4074, 1343, 5662, 7345, 6342, 3794, -83, -4761, -7882, -7171, -3158, 1808, 5527, 6083, 3839, 1512, 529, -612, -3016, -5820, -7080, -4750, 1667, 8275, 10346, 6587, -220, -6179, -8291, -5844, -1941, 786, 2396, 3958, 4750, 4357, 2391, -1399, -5164, -6186, -4569, -1803, 1193, 3805, 5333, 5656, 4362, 407, -5211, -8841]
708h841J122N195O404L925r88m310l642j189R2q1p48q35J353M330M387J343k655
725D862m975m819j993J373K814L128L090K131J73k274l796m117j750J632L187
740a334K532J160K59J59N75k07k738m584l087N92M392N972L798p22l861m019k440
757c553n97P75R43J103K049K526J511p20k288k963k381o95O28J272K184L116K590
774E500L79k415m721m337j156K572M075L090Q66r43j211m54m06j631k473j522
790d787O31L153M056K481m63k496l121k630j226K59J484K383L095J915k56k241
806B237k880k220o01P66J067P46J149J933J789M26j848l751l648r32K004L645
822a18L169J303p67j689j611j473j341q47L23J414K415K165Q81p89j627j940j802
$$ y = [-8841, -7719, -2524, 3880, 7805, 6817, 2507, -1135, -2324, -2232, -2313, -3061, -3896, -2543, 1787, 6174, 7517, 4862, -113, -4932, -6925, -5552, -2738, 390, 3480, 5611, 5784, 3510, -286, -4403, -6153, -4521, -1334, 1198, 2358, 2617, 2776, 3351, 3144, 406, -4178, -7265, -6673, -2281, 3691, 7489, 6767, 2906, -1113, -3553, -4150, -3375, -2432, -1329, 720, 3246, 4757, 4037, 1749, -1214, -3595, -4290, -3662, -2390, -206, 2910, 5500, 5879, 3464, -1257, -5594, -6750, -4178, -103, 2987, 3853, 2910, 1699, 1245, 839, -792, -3265, -4787, -4156, -1003, 3053, 5534, 5071, 2575, -546, -3176, -4402, -4143, -2659, -276, 2819, 4734, 4478, 2237, -643, -2863, -3464, -2698, -1631, -885, 264, 2197, 3986, 4412, 2564, -1187, -4835, -5767, -3763, -118, 3051, 4354, 3587, 1898, 287, -1186, -2527, -3374, -3051, -1637, 778, 2943, 3824, 3035, 1408, -532, -2334]
839b334j281k1J179K609K974J621o17k570l142k083j28J446J693J287J036P94
855B463M12m53j569k547j967k31J413K521K427J221l22j354j944j999j377j32
871c438J206K137K145J215k48j327j600j442r91l05K26J174J973K057R75o79k101
888I77k556j712j06J193J770J736J151L53n03j271j787j554p32M95J393J833J514
905B194O96k96j252j723j650j007J79J294K048J810P71m64j420j675j427o12J91
922b343Q52J476J591R83J47r55j641j695j071mR69J552J671R78J52q79j518j621
940a356j064j65P25J524J553J045K54o34j426j543j037m01O52J273J521J110M07
957B438n07j200j511j174n09L65J236J563J224M72m24j144j415j228n31L57J029
$$ y = [-2334, -3615, -3636, -2457, 152, 3126, 4747, 4130, 1560, -1582, -3665, -3793, -2347, -654, 633, 1669, 2463, 2875, 2422, 853, -1694, -3661, -3892, -2479, 42, 2469, 3690, 3368, 2014, 70, -1929, -3306, -3438, -2232, -95, 2050, 3265, 3017, 1690, 90, -1352, -2343, -2648, -2422, -1248, 725, 2782, 3757, 3078, 977, -1579, -3291, -3397, -2204, -434, 1302, 2453, 2806, 2303, 1032, -755, -2309, -3041, -2546, -1153, 680, 2194, 2890, 2594, 1342, -381, -2031, -3038, -2859, -1565, 483, 2293, 3064, 2600, 1180, -495, -1922, -2534, -2343, -1491, -15, 1576, 2559, 2706, 1751, 110, -1585, -2656, -2660, -1691, -139, 1532, 2510, 2662, 1783, 265, -1356, -2420, -2585, -1860, -336, 1217, 2262, 2516, 1882, 456, -1087, -2124, -2525, -1873, -600, 921, 2031, 2438, 1931, 731, -780, -1954, -2463, -2098, -862, 701, 1925, 2397, 1973, 829, -586, -1814, -2345, -1988, -959]
974i59J418J252O14l36r65j388j124n90J60P30J255J287Q08N8p64j441j518q07
992b310J35J077J304J151O11p7o65j051j220q11k43O81J200J223Q44J75o30j046
1010C48j176r56k57L64J163J499R34K38o79j319j190o28QL98P75R16Q36N00j16
1029A658q16j260j129m45L13J013J230Q37M62k65q68j126r39n00J96R29J139Q16
1047A245L32j53p18q02p83n43j87L91J071J234P84pp95j267j046m08J19P53Q48
1066F8P98N20N8k84r04r92o32j80M13R00R26N82K63l45p90r67r01l02M21J109
1086b39J096O12O6n64q38o97m39k23Q7N12Q00Q81N05j17q24j092p58k46K02P46
1106e30Q55P48L46j20o52r09q07k77J51O17P90O63K88m3l52o17q64n62j77M74
$$ y = [-959, 459, 1711, 2325, 1989, 1024, -364, -1488, -2078, -1918, -1188, 67, 1354, 2162, 2220, 1456, 15, -1503, -2310, -2175, -1098, 206, 1357, 1968, 1891, 1226, 175, -1045, -1856, -2099, -1418, -218, 1005, 1849, 2024, 1394, 348, -828, -1784, -2041, -1677, -514, 985, 1919, 2157, 1478, 159, -1031, -1659, -1651, -1253, -478, 438, 1274, 1774, 1658, 842, -418, -1547, -1992, -1679, -666, 564, 1401, 1863, 1598, 730, -396, -1335, -1835, -1639, -710, 429, 1245, 1577, 1424, 706, -96, -879, -1422, -1609, -1218, -147, 1087, 1871, 1864, 1069, -198, -1244, -1652, -1533, -780, 68, 866, 1386, 1444, 1160, 256, -736, -1368, -1548, -1135, -235, 691, 1273, 1536, 1191, 401, -566, -1467, -1769, -1348, -239, 857, 1469, 1535, 971, 133, -564, -1003, -1226, -1139, -627, 173, 1054, 1559, 1442, 618, -474, -1232, -1478, -1276, -530, 325, 1073, 1419, 1299, 647, -262, -1069, -1346, -1195, -578, 212, 875, 1163, 1120, 768, 151, -713, -1275, -1452, -978]
1126i78R92R09N15j49o12p93p14l57J11K69P17O82M56J75l12p32p81n09q0L21
1146h70N91P30N71J91k01p24q07n52j67L37P08P50L44J90k25n15o12n10k66m3
1166a080N37Q11O54K48j40n93p47n39k23J21M77O99M89K97o9m10p04n52k66O1
1186i29L60O69N11L26R0l59o34o16m34l3M56O40N94K87%l86m80n31l52j18K38
1207g01N28N87M61J25k46o44n92l45j18K34N06N61M61J55k25n00n93m10j49K02
1227g03M50N55L98K11j31m41n31m83k09P9M09N75N49J68r0m23n86l93k70N7L72
1248d37M68M78K41L0k79n06n69k92L9L46M98M87K69J9k26n77m76k74q5L30N49
1269C3L72K98M9k09m03n45k81o9J68M55M92L57R4k15m23n37k88p8J77L51M82K73
$$ y = [-978, 14, 923, 1438, 1289, 677, -116, -830, -1187, -1076, -807, -90, 592, 1048, 1223, 911, 179, -602, -1111, -1191, -870, -279, 451, 1022, 1213, 1012, 288, -519, -1071, -1238, -901, -193, 557, 901, 1091, 866, 351, -261, -771, -1037, -1080, -543, 268, 922, 1170, 1030, 437, -310, -849, -1072, -951, -474, 225, 714, 1011, 942, 532, -172, -724, -990, -929, -569, 100, 611, 937, 1027, 668, 34, -582, -1016, -1049, -593, 47, 641, 928, 928, 542, 62, -469, -821, -939, -701, -173, 414, 875, 1000, 754, 110, -482, -827, -945, -711, -205, 356, 817, 972, 747, 247, -346, -756, -905, -703, -253, 302, 700, 911, 780, 339, -192, -675, -884, -805, -396, 179, 728, 896, 806, 383, -203, -596, -866, -809, -437, 31, 509, 750, 780, 501, -5, -574, -866, -827, -481, 17, 504, 773, 792, 566, -11, -487, -761, -846, -516, 33, 405, 703, 752, 543, 140, -405, -686, -755, -587, -132, 360, 717, 811, 596, 173, -364, -652, -730, -553, -202, 280, 553]
1291E53J84j61l01m79l85j84O8M46L89M73R1m4l80m03m33j66J38L17L91M18J67
1312F99q7k89m04l79j58J5K25M35L79K65Qk69m69m09k10J8K83L75L62K09j0j51
1334D38l93l83j63k03K72L67L51K43R3j36l58l77l15r4J22L55M11L24J8j02l38
1355A32k79l17j06J00K43L53L31J52o7k96l80l44j14J67J84M10K68J19o8j78k93
1376A7l88j89O6K39K85L78P8J2j97l38k95k30K8K41K58K99K83J1j67l58l07j91
1398d65LJ08K26L81K23K0j41k18l46k23r0J56K92K90K36N7j13k40l62k39q6J35
1420c96K24K89K34R7m1k81k83k00j42R0J57L07K56J78q1k15k90k17j44%K36K86
1442F4K53J32k1j62k66k42j99k0K27K37K83J24J1j56j92k47j90n9Q2K31L13K10
$$ y = [553, 737, 576, 275, -204, -589, -773, -705, -259, 130, 603, 694, 650, 270, -133, -566, -732, -594, -277, 114, 532, 699, 612, 323, -81, -460, -618, -603, -378, 57, 436, 701, 709, 440, -29, -438, -648, -630, -347, 28, 390, 599, 589, 438, 45, -338, -501, -704, -432, -65, 286, 529, 622, 486, 128, -249, -564, -658, -536, -181, 230, 554, 572, 470, 132, -147, -464, -570, -470, -227, 126, 457, 609, 542, 246, -134, -478, -592, -425, -241, 169, 437, 556, 488, 310, 17, -371, -560, -494, -255, 30, 408, 486, 498, 301, -37, -332, -562, -534, -293, -35, 264, 547, 558, 391, 33, -274, -465, -462, -354, -128, 253, 476, 496, 355, 137, -209, -432, -522, -366, -74, 216, 452, 509, 396, 156, -206, -445, -531, -396, -172, 117, 351, 448, 407, 126, -157, -357, -499, -409, -252, 55, 311, 489, 408, 193, -97, -314, -458, -458, -222, 64, 317, 449, 428, 266, 0, -242, -441, -461, -234, 3, 286, 410, 421, 265, 73, -174, -364, -423, -341, -110, 203, 413]
1464D13L2j35k25k84k14J2J12K24K30K05L2j62j31k29k34m8J07J05K81K26J09
1485D26l3k09k49j93j37L7J76K77K37K1lk22k63r8j14K9J82J96J79J50J7j90k40
1508b4k12j07K2Q2K38J75J58L0p5k51k27k11P4J67J45K08J13j2j4j82k28j61m7
1531c39R9J67K38J03O3o1k04k02j17p8Q8J45K44J00J16r7j63k22j31p6P0J40J43
1554B6K09O7k0j56j83j58r0KJ22K65J09J10k0k10p8j90p6lN8K85J23J24n4r3j37
1579C2j79j08JN7J97P2J99O1j48j26k23n6m5O3J42J47J11O7l6j99j66j60L5R0
1603a72J37J25J24K7k1j74j13j56l9KK03J21J35k2L3j30j42r9k4k2J17J23J03
1626A36P9j9j04j48n8j12K9N5J37J18J05kj05j08j69n0N2M8J25J36N9rp7o8j76
$$ y = [413, 445, 310, 85, -199, -413, -401, -289, -65, 165, 370, 402, 240, 109, -120, -354, -402, -295, -190, 91, 317, 426, 393, 184, -65, -258, -395, -358, -182, 95, 332, 353, 350, 128, -135, -233, -347, -318, -136, 60, 239, 389, 406, 216, -24, -236, -343, -321, -239, -1, 174, 332, 362, 287, 36, -191, -402, -328, -161, -16, 192, 305, 293, 279, 97, -131, -292, -339, -240, -73, 165, 268, 331, 270, 66, -136, -253, -331, -243, -98, 146, 246, 362, 265, 102, -120, -251, -327, -257, -117, 26, 235, 302, 282, 126, -57, -215, -305, -303, -181, 84, 193, 303, 283, 73, -5, -195, -271, -274, -216, 69, 192, 316, 262, 169, 32, -147, -255, -254, -197, 0, 72, 271, 332, 184, 58, -165, -221, -266, -203, -61, 86, 197, 264, 228, 29, -137, -297, -262, -172, -35, 90, 214, 241, 220, 46, -67, -223, -262, -260, -57, 64, 199, 177, 210, 80, -62, -161, -185, -207, -90, 33, 136, 215, 196, 92, -56, -114, -226, -197, -142, -5, 113, 218, 216, 111, 3, -166, -216, -164, -116, 9, 145, 204, 195, 118, 50, -126]
1651a26l3p1J44O9J24R7oo5p6j11j72M8M7Q1J22J29%r3j06o7r6K1m3R4J12J18
1677A41K2Qj10j42p0m4QL0J90R2L3j4k8j88n7l0oJ25P7Q0N7n1j6p5j14p0pM5J05
1706iJ40L8Qj07p7j10M0o3Q8L4jP9N7K7j38r8n8RK7Q4N1O6M9m0l9r6p5n2L4Q8
1736d4J44P3j22M8p9k2q1l4L8m7J64Q9L3m7j8j80n1j0J2P9J13L8N9r3l8q5nnJ4
1765e7L5J3K3M9J4K0q3q7n0k5M0J04J14L3j05k6n0m9L9k5M1M0M1J8K7n9m1n4o
1794f6l9kN0J09M5K0n9l6q8n6J1L6J24j7j7N2j9j8l7o9qk2P3P3oQ6l7q4m0m0O6
1825a5n2M8J7R6%m3J3o8r4N4J0oN6Q2l6KMr6n6J8j3O2L9KK7m5Jk6k0m8K5k6N7
1858c1N4M9m1J8n4q7N9l8m2J36J8K2J4n3m3Nm5K8O0k2M5PJ6n7Lm3n5K5n5J03R
$$ y = [-126, -159, -230, -86, -17, 107, 204, 198, 133, 57, -54, -226, -178, -131, -50, 72, 201, 201, 108, 2, -65, -161, -140, -183, -89, 23, 141, 163, 171, 61, -81, -151, -195, -187, -157, 33, 125, 158, 144, 116, -72, -129, -159, -165, -40, 37, 117, 174, 123, 107, 32, -82, -152, -159, -114, -9, 131, 169, 177, 70, -7, -117, -77, -140, -52, -18, -19, 60, 117, 144, 6, -92, -150, -141, -114, -30, 21, 87, 136, 96, 57, -39, -114, -166, -132, -44, 100, 173, 51, 99, 20, -2, -83, -117, -79, -126, 38, 127, 160, 113, 95, -85, -136, -146, -134, -55, 58, 96, 155, 62, 24, -61, -66, -71, -57, -22, -9, 14, 63, 77, 97, 14, -73, -123, -148, -108, -4, 110, 143, 38, 12, -38, -87, -48, -73, -32, 8, 49, 67, 94, 35, -6, -60, -66, -105, -107, -57, 52, 97, 117, 58, 22, -66, -122, -111, -75, 49, 32, 15, 67, 48, 30, -7, -76, -84, -106, -33, 40, 34, 120, 83, -1, -41, -81, -15, -67, -19, -2, 94, 94, 51, 64, -4, -98, -44, -34, -40, 16, 98, 62, 64, 68, -28, -84, -66, -79, -17, 22, 24, 51, 6, 7, -19, -39, -87, -62, -88, -31, 23, 72, 31, 49, -5, -92, -33, -71, -113, 23, 41, 63, 77, 24, -19, -14, -59, -31, 29, 7, 52, 59, 75, 18, 21, -22, -77, -52, -107, -4, 5]
1889EK6K4l2k0k9j12J02J7j5K3M3J2L3j25J3l9K9mK7Q5j8K7l8Nm5l1p4Q5K5J1
1919A0M3K0j03O1m5o4N4j6k4P8M3J9n8k7rm4KO2K4Mk6J3pk1Lk9p6O3J4P9QK4j6
1952E9k9k3l6k1mK0J43j7j7m7L7p2jM9p9P8p3L3O1K4n7l7j7j26J29L9Q2n2k1o
1982A9Pn0m4JL5J3j2M5k7O3pn2K1n7l8L7L5M2J7K5j7p6k2K0j7J7KP8n8N4KL7m7
2015D6j14OmL5J23rm4j7N2q3p4LM4L6N9k0l1PjL6n2pm4p4J00O3QL6r8J7r1K0M3
2048b9Q0j3m3K5kK2k8m5%M5o5N3%l2Q6k1l2l8p7N3N4o6R6j7jQk6J5j0J5pmL9%
2082C5L9k9l0j5L3p5M5j7j4N2J4K8l3j05K8l8L0L8K3J5MK4lp0Ok7KN6l2L2J2j
2114B7o8qk3P4n8O1J4j2JN3K2q2M0r2O9l0K8LK5lLJ5q9L0n9M1M9lM9n5J1k7n2
$$ y = [5, 31, 55, 23, 3, -26, -138, -36, -19, -34, -11, 32, 44, 77, -48, -35, -74, -45, -49, -22, 63, 45, 72, 34, 39, -6, -37, -111, -26, -1, 10, 53, 73, -30, 31, -14, -78, -24, -40, -64, 14, 57, 76, 18, -9, -18, -62, -60, 2, 26, 30, 4, 17, 10, -11, -8, -37, -113, -50, -36, 43, 51, 75, 59, 30, 7, -29, -50, -54, -34, 109, 92, 75, 28, 65, -7, -8, 41, -38, 40, -33, 0, 61, 85, 28, -9, -26, -152, -23, 16, 98, 46, 25, 19, 26, -24, -68, -67, -32, -19, -31, 14, -13, 50, 43, -9, 12, -45, -83, -46, -11, 31, 48, 73, 56, -20, -42, -22, -39, -22, -20, 58, 0, 54, 56, 93, 46, -68, -62, -66, -31, 92, 83, 39, 22, 74, -9, -83, -80, -36, 0, 59, 39, 8, 15, 14, 50, -2, -9, -53, -127, -27, 36, 44, 80, -18, -1, -92, -72, -29, 51, 38, -5, 20, 18, 40, 12, -33, -33, 12, -53, 0, 0, -32, 54, 33, 1, -37, -114, -61, -7, -73, 23, 6, 5, 13, -13, 2, -8, 7, 0, -4, 35, 35, 74, 45, 15, 0, 33, -42, 3, -14, -28, 24, 38, 66, 33, -72, -44, -82, -52, -14, 9, 24, 28, 52, 49, -21, -15, -42, -40, 16, -16, 16, 28, 27, -41, -49, -72, 2, -56, 5, 19, 7, 8, 61, 83, 1, 41, -51, 18, -12, 16, 19, 44, 41, 44, 59, -30, 0, -59, -18, 31, 28, 77, 22, 33, 6, -46]
2147d6k1R8q6N1L6m4N8j1J0m6o1L0K9m4M5M8j1J7j02l3O2OnNK6ML8J8q0J2n7k3
2179g7M2N3m1O5Pk4o3J1j7K8r6Q3O0m7L2n4J5N2p0nM2m7L4R3K3n8k9j7p3%QJ9
2211e1J05o1M5kJj0l2RL3j3mkN3l3J2m3l1j3K5No1P1K5M3k6r7L3j8J5j7K3Q1q4
2244a9O6j7Nnm2l4k8J05nroJ3o8N1o6K1RP1m6M3M2j8k4r4j0L0j7m2J36n6K0Q1
2276H7j28l8O9l3M0J2K5K3j1o8J9k4Om8N0Rj7R1k9K0j4l8l1o1N2L2L0JRL1j9K3
2308G0r9m4N3PJ1Q0m6N8p6j1j4l6K0j6K6P9j6pp4N8j09N4n3K6K5J06lJ7j29M3
2338@jr9Q4J4k2Q8n5ML9n2J4m1l3LN6k0N6%Qm0k7jk8M5k6NJ9M7l5L0p9K5l5OJ9
2373c2PO9k8M6%r9Kk9OJ6O6K0J4m1oL2m2m6l4R1%j3P8j2j8J1o9j0nM2l4%Q4p8
$$ y = [-46, -67, 31, -55, -4, 32, -12, 46, 35, 45, -1, -62, -32, -3, -47, -2, 46, 35, 52, -50, -83, -21, -15, -20, -15, 11, 15, 53, 71, -9, 3, -54, -77, -35, 18, -23, 42, 49, 25, -38, -27, -44, -16, -112, -29, 31, -16, 16, -38, -23, 29, -41, -46, -4, -51, -17, 76, 99, 41, 12, -5, -78, -78, -70, -51, 54, -7, 38, 36, 37, 27, -5, 4, 37, 24, 20, 18, 71, 38, 50, 7, -24, -37, -12, -7, -68, 3, 28, 71, 45, -52, -19, -37, -22, -39, -16, 65, -19, 47, 30, 35, 30, -12, -46, -74, 31, 26, 17, 11, 24, -44, 7, -59, -38, -29, 42, -4, 39, 81, 63, 39, -55, -65, -35, -52, -94, 42, -14, 6, 87, -41, -79, -10, -43, -3, 9, 34, 57, 46, -22, -3, -27, -21, -69, -19, -10, -27, 64, 35, 55, 41, 3, -28, -89, -37, -5, 25, 26, 35, 66, 47, 70, -29, -73, -20, -13, -2, 78, 32, 90, 14, 3, -11, -47, -27, -43, -17, 62, 46, 39, -35, 23, -86, -32, -85, -59, -34, 72, 69, 86, -43, 0, -1, -100, -16, -2, -24, 64, 9, 13, 52, 0, 14, -27, -60, -57, -1, -21, 35, 35, 43, 3, -24, -25, -53, -8, -34, -29, -10, 37, 2, 32, -47, -22, -57, -51, -32, -25, 44, 16, 62, 62, -37, -35, -64, -58, -42, 24, 44, 58, 17, 11, 43, 1, -45, -79, 12, 12, -1, 77, 65, 47, 58, -11, -21, -26, 16, -18, -18, 66, -12]
2407a2M2m2Pl0qkj2M5N9L1j2k4m4Ok0M0k0K3K1P2j46k0J8Om4K9M7KJ3oM1Mjj30
2441f7L7POJ5nj1O5J3p3nm6J1K6O6j3J8j5M5o1l2J1l1N8l5L8M1L4q7J2l6lm2p
2474f6N5K6N0k2j3m2J0n0k8M1l4O1kJ07m0j4j5o1mm9P0J7Q2o8k2N3p7J1Pj2K0
2505iL4pO0M7j10J6n1k8L3j4K6L6J8K9p7j7Ql4k6Q6o3Q3J4l6lPj3l9j7nL0K4O3
2538F5J9r6J1Lm7M3k4MMjR2l4Kj12K4l4M6nK2L9k6P9p9k1J0l6K4pK3K5J7L4o5
2571aOJp3KO1L4l4M8pj3n4m9R3l9k9N9J5M5pl5Pl7k3m6M9N6j7qKkL3k4n9oP0m9
2607c1K7P7j01Q2l6l4n2K0NNJ6M8J6l2K8n0rq6L5J5O6K7K7m5Jlj4l0J5pk2Q7k6
2640A9Ok4k1J0j2j3M7NJL0No0n4j2K0L6l0P3Ql2J5J8l0Lj05O5L0j3M9n4O6Ok2
$$ y = [-12, 30, -12, -5, -35, -43, -45, -57, -12, 47, 78, 66, 42, -2, 4, -16, 24, 4, 27, 48, 120, -26, -46, -28, -22, -66, -37, 10, 12, 25, 19, 60, 64, 63, -67, -30, -23, -17, -2, -7, -18, 47, 60, -13, -18, -64, -53, -27, 39, 26, 44, 29, 74, 13, -19, -8, -39, 19, -16, 22, 63, 97, 10, 22, -14, -17, -59, -66, -11, 15, 65, 43, 30, -12, -2, -52, -80, -39, -73, -12, -14, 93, 53, 39, 24, -37, -41, -90, -20, -3, 79, 11, -11, 42, -35, -24, -17, -29, -9, 25, 18, 78, 125, 15, 31, -20, -48, -15, -29, -3, 33, 51, 80, 3, -14, -6, -40, -66, 20, -43, 40, 54, 18, 15, 22, 9, -30, -47, -52, -22, 2, 65, 84, -12, -1, 2, -45, -2, -26, -22, -18, -19, 73, 39, 41, -71, -47, -81, -35, -40, -18, 21, -5, 74, -5, -26, -16, -52, -28, -35, -12, 13, 30, 64, -1, 5, 6, -67, -65, -4, 30, -4, 44, 37, 24, -30, -79, 14, -25, -54, 5, 20, 65, 58, 23, 30, -7, -30, -76, -27, 29, 12, 4, 6, 4, 37, 13, -46, -52, 18, -31, -4, 73, -28, 54, 18, -16, -68, -48, -43, -38, -22, 26, 42, 10, 38, -12, -21, -107, -72, -57, 9, 36, 63, 18, 19, 16, 2, -28, -13, -20, -42, 45, 19, 25, 1, -20, -10, -22, -35, 12, 17, 18, 48, 53, -7, -61, -73, -53, -17, -47, 26, 34, 2, 17, 35, 5, 8, -97, -32, -2, -15, 34, -20, 46, 52, 30]
2673C0q1O7q1K1K8P7j9l8M7j1j7m8kk2oK5K3M4nk9k5l2K4Pj8%R8m3J5K6q3N1m7
2706b4p3O7O1k1lK8m5K9p9L4k3J1mQ1N6k2m1l0PJ7j04N6O2k1jK2K8o2j9k3KJ1
2738b3k0K4K0M9m8oj2lk4j3oN7K5qj3J1Nj9o7mP2M8RJ7qj1j2m6o1J03p3O5nl0
2772gP4j7n9o6N2Rl4K8K5O2Jj6ml7o3o9J07k8M7QMM3o8l1k3L3QpRQ8k2J7j23M7
2806a2mK4k5L2l2J01n6j4L4m0n0j5O9l2J4K5k5K7j1o0pQ0l9j6J2L0J6P5j07l2
2836c8J4n5M9j5J8Q0ml3L4o1j8qpN2kK9j1J9m4L2n2m1N7j8l2R9j04M6%L1n5J1
2868b7n9L1N3j1ON5q2J2L8j02M6M4p9R4KM1o5N2r2Qnp4R5L3k7L7L0o9R1n0n0J2
2900a2j4L4M6L0j0n2j3k3J9l0K4k8M7m7K6N6j9r5K0j8K3J3K8k1K9Kl8KL8m1Qm
$$ y = [30, -51, 16, -65, -44, -16, 61, 42, 4, 51, 40, 23, -25, -27, -49, -55, -30, -7, 37, 32, 3, -22, -54, -30, -23, -41, -41, 57, 14, 29, 55, -28, 23, -24, -97, -30, 31, 10, 7, 35, -10, 19, -60, -26, -49, -38, -42, 39, 95, 73, 32, 2, 9, 26, -78, -22, 40, 19, 18, 40, 68, 6, -13, -36, -34, -23, -43, -19, 1, 50, 2, -4, -16, -19, -43, -56, -62, -5, 20, 12, -1, 10, 15, -4, -71, -75, -3, 45, 54, 71, 63, 52, 40, -6, -67, 36, -37, 28, 23, -7, 67, 50, -9, -75, -23, -14, -48, -20, 5, 67, 68, 52, 48, 11, -52, -121, -14, -42, 5, 13, 17, 60, -8, -39, -62, -29, -21, -28, -19, 69, 47, 64, -59, -12, -16, 8, -17, 15, -17, 84, 28, 14, 48, 8, -42, -57, 12, -20, -6, 19, -6, 21, 10, -50, -57, 23, -16, -32, -20, 10, 26, 101, -6, -38, -24, -79, -30, -45, -27, 53, 49, 16, 50, -11, -29, -37, -44, 8, 6, 35, 24, 43, -1, 31, -21, -62, -5, -23, -55, 44, -60, -14, -14, 17, -38, -27, -86, -55, -2, -13, -7, 48, -34, -22, 16, -86, -40, 4, -75, 19, 21, 62, -3, 49, -43, -35, -40, -114, -19, 14, -13, 24, 54, -15, 76, 26, -24, -12, -26, 8, 54, 84, 74, 22, 9, -14, 5, -25, -1, -29, 18, -29, -3, 53, 34, -61, -41, -59, -36, -23, 5, -16, 13, 15, -23, -21, 17, -24, -16, -20]
2932b0RM5N0n6M9r3L0n7M0k4P0Jl3N4o2j2kj5m0N1oR2m8K1l2l8M1l0j4K6Ko3J06
2965D2l4MJ6l7pM8o9O4j7K7k8Jj5M5qr1M5J9l5N7j7N9n6jp3N2m3M3m1J08n4O3
2997F7o9j5l4Nj9K6M0J7Rok0J6m9J7K6l8J7K1L0mK2m6k8MJ9m7M0J9J9rj6l9M4
3030A9r3O1k5K4kN1m6O4p4l4N7l2KN2K5K6l1l3k1l5K7K2m0qO6j2j0J3M4l9o0J6
3062b6o7N1L6O5k9j0j8k4j6K9QN3r6K4K4K3k1pk1N8k9rKm9J12n0l0mMnJ3l8O0
3095A3J0l7N2m5l3jMpK6N7j1K7j8M5o8k4k6M3p1O4K8l8R7p5K2k8l4j9j2J3J1N9
3127B4k8k2K8k1mm8K3O9nk1N5ll5j1l9K7k3L9J1j6L3L6n7lm0RJ3J2lM7m7%J7J9
3161C6q9N6j2j4J4J4PJ8k3k8Oqm1Q6l5kJ5J5j3nM5o4j3L7m1L0L7j7KK0o4j7OM7
$$ y = [-20, -11, 34, 84, 28, 77, -16, 14, -43, -3, -27, 43, 44, 11, 65, 3, -9, -11, -26, -66, -15, -21, 71, 23, 44, 12, -26, 15, -15, -29, -3, -1, -64, 42, 8, 12, 28, -9, -16, 32, -37, 27, 10, 37, 9, 10, -5, 40, 32, -59, -14, 5, -30, 27, 10, 69, 13, 12, -61, -9, -52, -9, -50, 58, 4, 67, -2, -17, -51, -46, -65, -39, 1, 18, 27, 21, 1, 17, -32, -15, 11, -27, -10, 11, 41, 37, 59, 13, -15, -11, 8, -39, 1, 20, 39, 30, 14, -25, 19, -74, -13, -38, -14, -16, 35, -11, 53, -21, -55, 2, -30, -28, 24, 49, 75, 44, 11, -10, -45, -18, 4, -36, -44, 22, 10, 0, 13, 57, 18, -42, -26, -93, -42, -6, 59, 30, 20, 2, -22, -38, -9, -1, 52, -44, -20, 4, 27, 6, -1, -22, 36, 7, -2, 0, -49, 63, 13, -17, -21, -17, -22, -9, -47, 13, 23, -14, 38, -7, -40, -41, -37, -44, -18, 39, 28, 55, 37, 82, 14, -10, -36, 7, -64, 0, 28, -10, 87, 12, 34, 6, -28, -47, -59, -46, -35, 24, -4, -26, 2, -19, -23, -71, -48, 21, 16, -5, 50, 47, 12, 1, -38, -11, -34, 5, 16, 0, 33, 69, 12, 9, -31, -22, -9, 3, 0, 47, 0, 0, 17, 36, -53, 3, -9, -23, -9, 5, 12, 30, 7, -21, -15, -23, -64, 22, -13, -15, 0, 15, 2, -3, 42, -22, -35, 2, -39, -9, 28, 11, 13, 33, -31, -48, -42, 5]
3195ERj0k9L6j8N0q9K3J4l8J6J14o2Ml2l7M7m3O2m6QJ1N6n4R3q5j3m2M6k7J5L3
3227A7j7L9m1N3m5K0o5rNK5k7P9J1j4J0q9L3m0N7l1K0KM7l3nqRnm4J3J8J3M3p
3261C4j6n0Ml4L6M6l8J4O7o1K2o5j7O5o2M1N3j5j8jj0k5J4k9k0O6M8o1K4J2m2
3292a8M4o1j2N8MJl1J0K2j8l3K9j9J4qN4JK3pn6M5n9L1n0M2j4j0O2j3l6K7j6J6
3325B2K1p3L1K7lqO0j04K2K0o0k0O0l8M6K5qm9O7o7K4l7P6oPLj7m3K1L1j13Q1
3357bPjkN2n4L3m2K0k2k2j7J02m4L6Kj8jo9rN1kJkJ4k3O4p2JM3m2n0M3R3n3pR
3393A7MJ5o5J2KM7k3%o0L5K4n7R0n8L2j7k1O3K5o7qM1l0m5O3rK5n8L1kl2O4n4
3426a6j4nj0L3NjQ7q4M0o9k8M8m3R3j5m1rM9l4J1l3M8o9O6jL8qk9M3n8l6K1R2
$$ y = [5, 14, 4, -25, 11, -7, 43, -46, -23, -9, -47, -31, 83, 21, 25, -7, -44, 3, -40, 22, -24, -16, -5, 51, -3, 90, 5, -8, -50, -4, -31, -16, 17, 0, 39, -2, 51, 6, 26, -39, -48, -43, -18, -45, 34, 45, 31, 41, -48, -15, -55, 2, -29, -9, -7, 40, 7, 2, -6, 3, -2, -46, -33, -15, -2, 41, 34, 18, -32, -28, -62, -26, 20, -18, -4, 63, 2, 24, -41, -58, 7, -55, -14, 39, 24, 6, 5, -5, -30, -16, -45, -65, 1, 49, -12, 12, 24, -18, 26, -35, -47, 11, 15, 16, -15, -5, 17, -1, -34, -5, -24, -10, -18, 36, 37, 60, 53, -3, 42, -17, 14, -36, 6, -8, -18, 44, 31, -5, 22, 6, 22, 43, -30, 1, 28, 25, 17, 77, -27, -5, 15, -45, -65, -5, -43, 3, 28, 20, -29, 38, -29, -5, -42, 34, 28, 35, 38, 21, -22, -1, 30, -83, -2, 5, 4, 2, 54, 0, 33, -9, 11, -11, -33, -50, 52, 8, 44, 46, 28, 27, -42, -51, 0, -2, -1, -3, 11, -12, 52, -20, -19, 24, -18, -68, -25, 68, 15, 8, 17, 21, 36, -29, -17, -15, 32, 9, 9, -51, -16, 8, -49, 41, -17, 15, -2, -23, 40, 65, -2, -10, 31, 1, -44, 19, 10, 35, -23, 8, 6, -26, 38, -16, -30, -35, -45, -12, -7, -8, 79, -5, 35, -34, -62, -14, -57, 36, 21, -20, -29, 20, -14, -3, -36, 12, -57, 9, 8, 46, 38, 9, 52, -6, -42, -21, 71]
3459G1o3p7N5K5j6K8n8K2j2J4j4K7J3Nk9lN5nl2J8J8r9P9Jk7J0kJ9J5j5k8j4M9
3492C0k0M9qo0%L2mj8K9j9rL9J7m2p4QO4m4P8o0J3J6no1MQ8l9oj2M5k5P8m9l9
3526dJ6pm2M0j3K2PK6qq2L8K1J9o1P3n4L1M2o5%j7k7J4PJMN0ko5J9qK6o2Q7K3
3561D9m8n3O4J7k1j8M6r9P9ml0K1Mm7J02l9rP1o4L4m0K7l2q3P4Ok3MMj6OL0L8
3594E0J1j1k8n8OK7j1QL2j1Nj4L1l7j9j2L3l4K4k5O1l1j1K8k9J0M4j0k5K1j1J2
3626B6K0k6l3j1J9K4j2L8n5O3Ko8kPLJ9j4L0k7l2Ol9Q0L2o1K2k4M9k2jQMk9Jk5
3661b8K8O1k6n6O2j2j0l7k3J2O6n6N6o0M5jl3l5rJ4N9j6n6Q0j4l2kJ2MJ6Po4N8
3694A0m0K8n4P6p1O0l0K9qj0L8k9K1J4k4Nk6j9P3o9L5j9rN2Pm1j0j2L3k5pJ5j
$$ y = [71, 8, -69, -14, 11, -5, 23, -35, -13, -25, -11, -25, 2, 15, 20, -9, -12, 43, 38, 6, 24, 42, -57, 22, 23, -4, 6, 4, 23, 38, 23, -5, -19, 30, 10, 59, 51, -9, -9, 23, 19, 1, 30, 11, 2, 41, 58, 16, -58, -50, 14, -30, 48, -12, 1, 17, 12, -49, -45, 43, 4, -2, -14, 31, 6, 84, 35, -4, 12, 5, -37, 3, -10, 12, 19, 45, 37, -45, -7, 14, 33, -28, 45, -9, 22, 64, -1, -1, -18, -45, -31, -24, -23, -19, 31, 29, -36, -17, -25, 1, -61, 26, 49, 1, -52, 12, 29, 8, -10, 36, -63, 16, 12, -18, 3, 7, -40, 62, 23, 14, 85, 21, 55, 15, 42, 10, -73, 1, 7, -16, -12, -8, -24, -18, 12, 50, 61, 50, 22, -36, -30, -3, -14, -6, 26, 15, 20, 6, 37, 0, -19, -31, 2, -32, -8, -33, 28, -3, -14, 14, -15, -5, 39, 29, 4, 25, 14, 26, 46, 20, -13, -24, -5, 19, 7, 45, -10, 53, 55, -13, -15, -8, -5, 14, 0, 30, 3, -29, -23, -62, 18, 50, -11, 11, -13, 36, 14, 13, 21, 25, -4, -3, -28, 0, 61, 35, -21, 41, 29, 19, -18, -41, -29, 37, -19, 37, -23, 22, 21, -12, -47, -56, -42, 17, 1, -55, 25, 11, -21, -23, -11, -7, 9, 16, -48, 10, -30, -2, -56, 20, -51, 9, -21, 8, 0, -10, 28, -1, 20, 34, 10, 15, -11, -30, 43, -26, 9, -10, -19, 33, 40, -1, -11, -23, 10, -15, -22, -7, -8]
3727hj6J7nm2R6q9L6pk3K1L2Mm5K4m7R3n9l4O2k0M6k7Nm9M6%j7j1K4j7j1kJ6k1
3761b8J0j8Q4k6m8M4k5l2K3m9N9kpK9Rl4QJ4Ol7NJ8K2n6J0OO1l1ll3jK3J4k6P
3796dJ4mJ7l9J0kK7pm0lM4j1l5L2j1l2%K5N%j3L4m3N7n0L9j2l6L2K0j8mJ1qpO
3832fLnmJ2J3o2J13On8kl2l5L5K2J4J0k2m3PN6j8r3O9j3O2p5K5Lj7O8j5k5J2j2
3866gj7L9j0k8J7k1J6J1K4l3j6K9%l0NjM5k3k0N0m7NL0m6j9L5K8j6j0J2l5nJ3
3899b5l0N6Oj3J3l5Mk2Q0p2PQJ0k3J8MO1o5J6K3Rl5m9L0%J8j0M5m2J4k4L5l5J2
3933a1l7M2k4L9j5Lk3pM0k6L1l4qK9J9m3M2p6O6nK5k4l%Nl9RN1j8Ro2L5J4K9j5
3968A8l5J2J5j8k9M8K6q0N3n1N7l5M8j6n4M7j9l2K2jl4P9j3Nn1M9L8l8qk3N2K9
$$ y = [-8, -24, -7, -12, -54, 42, -47, -11, -18, -41, -20, 12, 16, -29, -5, -52, 41, -18, -52, 10, -10, 36, 9, 14, -35, 11, 11, -6, -17, 7, -10, -21, -23, -7, -28, -18, -36, 48, 22, -26, 18, -7, -39, -16, -65, -6, -8, -15, 14, 23, -11, -3, 11, 17, -20, -15, 3, 25, -31, -21, -15, 46, 15, 12, -21, -22, 1, 15, -11, -4, 10, 6, 23, -16, -6, -8, 19, 12, -28, -31, 13, 2, -33, -1, -12, -44, -44, -19, -14, -14, -27, 7, -36, 21, -29, 10, -2, -38, -6, 14, -4, -8, 3, -5, -12, -6, -3, -8, -12, 0, 13, -49, 64, 70, 12, 10, -22, -57, -22, 0, 14, 24, 2, -41, -34, 22, 4, -89, -20, -33, 29, -46, -21, -18, -35, 33, 18, -7, 5, -7, -24, 15, 5, -23, -6, -27, -11, 0, 24, -9, -25, 4, 4, -26, -21, -22, 23, 0, -20, 30, -17, -12, 18, -28, -47, -12, 16, 0, -10, 2, -33, -38, -25, -55, 1, 7, -6, 7, -28, -24, -46, 34, -38, -31, -23, -13, -36, -18, -14, 47, -18, -2, 21, 30, -5, -54, -24, -24, -6, -16, 29, -13, 1, -23, 12, -23, -11, -48, -6, -30, 9, -6, -3, -26, -33, 7, -19, 12, -22, -30, -1, 18, -25, 17, -59, 7, 2, 27, 3, 0, 0, 5, -34, -25, 26, 8, 17, -45, -10, 4, 33, 18, -17, -5, 10, -8, -37, 11, 37, -43, 10, -41, 16, -19, 29, 13, -41, 6, -13, -45, -23, -24, -58, 21, 8, 13, -38, 11, 49, 11, 3, -20, 32, 61]
4000F1j5l6k0n3M7mO4p3K0J8om9L9m9M0K3j4m7O1o6K9L4l4l1J1L8j5M8m0J1l0
4031c8L1mK6Qp3K4kM7Qk9J7J4J4m9j2L6p5P8j4l2L8L8k7k2J1k4KK4j9J5oL8k2
4064B1l7M0m5j9O3p8qN2l9M0L0Jp5N1l4L4Q5j01Qj5L2jL3j8j0M5n9K4Rml2jK9
4097B1m2M6k7j6L6l2j5J1K8p4Q1m4N4K1p5L4K5m4K5l9L1l8M5l2P5k6k3lK5l0K1
4128A9k8J7J8j1l9N8l1p3J09j04N1JMk2J2J1l9NL0Rj6N4nj00K1O7Pj3k0J9qj6
4160a3L0K3m4J9K5n3K5k8L7k6n9R2l4J0M5j0n9O0J9l5o3J7ML0J4m5PM4o4j1M8
4191Eo8N8Rk0K0Mk7PP%k8kL7m2N5l1M2Ol0J0lN7p3ol9M3N3o5M1Rj6joJ8l8K7m9
4228c6Q5l6l3J4j1L3j1LJ0k7J1K0j0n2N8k3J0nj3k2K0J0j9KqJ0K9Q4r5jK7m4r
$$ y = [61, 46, 10, -10, -63, -16, -20, 44, -29, -9, 9, 3, -46, -7, -56, -16, 7, -7, -54, 7, -59, -30, 4, -30, -61, -50, -12, -27, 21, -19, -8, -38, -7, -11, 15, 23, -50, -26, -28, 19, 27, -2, 15, 29, 43, -6, -18, 18, -57, 21, 7, -25, 13, 51, 24, 2, 13, -11, -9, 15, -4, 11, 5, 43, 21, -16, 24, -21, -40, 23, -55, -63, -11, -50, -10, 20, 21, -54, -3, -37, -3, 82, -19, -11, -26, 6, 5, 38, 20, 10, 55, -4, 20, 29, 25, -7, -8, 21, -21, 25, -2, -18, 18, -14, -29, -18, 10, -64, 17, -27, 27, 48, -27, 7, 32, -12, 13, -26, 5, -33, 12, -20, 55, 29, 6, 3, 28, -2, 19, -9, 8, 26, 15, -24, 34, 3, -70, 39, -65, -14, -13, -9, -31, -19, -8, -47, -42, -12, -3, -19, 35, 30, -70, -49, 18, 25, 12, -8, 11, 3, -13, 17, 40, -4, 15, 40, -13, 12, -16, 21, -5, -64, 28, -6, 4, 49, 39, -20, 40, 59, 24, -39, -22, -18, 12, 26, -19, -12, 32, -32, -43, 5, -63, -5, 4, -16, 4, 8, -19, -12, -5, -5, -33, -35, 2, -40, 15, -16, 26, 32, 2, 12, 9, 66, -7, -13, -52, -9, 44, -21, 20, 29, 13, 12, 6, 24, -14, 13, -36, 49, 13, -20, -6, -17, 16, 5, 8, 18, -9, 2, 22, 12, -40, 18, -5, 5, 0, -13, -35, -15, -5, -24, -22, -30, -20, 9, 93, -2, -3, 24, -20, -29]
4261b9MN4L5j5n9oN1n1pL4k2K2jl3j4L6Om6OJ1m9N8k2J1j3M4j7J0j2Q7m4%n1k5
4295d7J48o9rm5J1kL1p4R5ql5L9J1k7k3JOp1P5NJ5kl4J3pm0J3N7n5O2k6m9O2j2
4329IJ7k4n0L4J0L1m1K2j5O8Kj03L3JK3l6L6m8L8m3K4J6n1PP9o1L1L4o6%L2J9
4361B8j4J4nnl5J8L4q0O4qrj2NOnJ9m3O7m7K9l8j4Q6r3K7K6MK1l0L8j9j6l7J4
4395a0KQk3O2l7J6k1L9o2j0j9K2L1Nj3l8J5J2J0k8O6l7l0O8n4J7k2RN0k2j9M7
4427C4j7l2l2O4%m5J2L7k8L5n6l2O6Qj8j02J26j7m6M8N0p2LK5j06P3J4j3pO9k3
4458A8m3J8k3M9n0K2kL3pJK3L9o1j7Rl3P1o4k2K4K1J4K9m1j3k3L2J0n2N3Jl2K3
4491GmL2o7N2Om2L8j1l3M3nMm6Q2m7J8rJoj8J6p8Q4m6QK9m%pj6Mk3L9m5O5k7N7
$$ y = [-29, -25, 29, 64, 49, -10, -16, 35, -16, -23, 11, -11, 11, 10, -23, -37, -1, 5, -41, -35, -24, -73, -15, -37, -26, -39, 5, -12, -2, -14, 73, 29, 29, -22, -47, 101, 32, 23, -22, -11, -13, 18, -56, 39, 31, -4, 35, 46, 19, -4, -3, 3, -68, 7, 12, 27, 25, -9, 4, -3, -43, -30, 27, -28, 34, 8, -41, 21, 9, 26, 2, -48, -14, -4, 27, -14, 8, -7, 61, 63, -40, -7, -6, 17, -19, 17, -31, 7, -36, -12, 4, -47, -40, 39, -22, 9, 43, -23, -23, 9, 28, 14, 28, 23, 18, -17, 1, 35, -45, 19, 11, 2, -10, -5, 1, -4, 15, -28, 39, -8, 21, -17, -31, 55, -38, -11, 15, 19, 40, 10, 48, 29, 13, -24, -10, -8, 0, -23, 39, 2, 18, -3, 36, -26, -36, -55, -33, -2, 3, -10, -48, -33, -21, -11, -39, 27, -10, -40, 28, -26, -9, -31, -22, 28, 6, -13, 34, 17, -15, -47, 17, 17, -28, -16, 21, -7, 28, -28, -60, 6, 14, -4, -106, 20, 3, -43, 5, 55, -17, -14, 11, -95, -22, -8, -21, -28, 41, 18, -25, -7, -30, 19, -31, -9, -11, 22, 15, 16, 39, 78, 17, 0, 9, -24, 47, -17, -39, -15, 6, 20, 49, 8, -5, -28, 4, 14, -38, 15, 16, -16, 7, 3, 35, -32, 20, 26, -16, 22, 11, -22, 21, 16, 20, -26, 56, 9, 27, 18, 19, 13, -5, 11, -67, 17, -29, -21, 8, 4, 4, -3, -19, -15, -38, 1, -44, 21, -6, 51]
4528E1n6l1L0j4PJ8J9j9l9l5O2l1L2%nj8K2O8o1K9k5J5j5qL1p3L5P3o8J2j1L4
4560B9l0J0K9n2J2j5PJ0K3n2j7K5Pm2J6L1J7j9J8rj6k0N3k9o4K7R5k5k3M4j18
4591g8R9j0J5L4j5k9J8K3j2m4L2m0rM1l4lpnN2pl7j1k1M3j7M1l8O0M5j17nQ2q3
4624c7Q8Lj09J6L5oN3Mr0pM4mJL1Pm5J5J0j5qQj9J0j4L6j0N7p4j0Jj7J4M2m7O9
4659C2p8O9m2j3KL4Rm3N4MRn6L3K8m0K8k2JO9o1ml4R9o8k0O8p9NM5o8R7o5L4l5
4693hm0j5N2Pj1L8m8K2Ql8J7kj1OMJ9qP4j28L9m2O7J0J8p1N3K7j6q7J45j10M8
4725A9l4M8k3o3P3n1R1n7pj6k8J8L6JJ4l5j6P3kr5L1l6mJ9L0M0l8L2rloK4l2N7
4759E1K9j00%M2RKl0qK1j1K4o4M2L1j2l0LrL2n1kM0l2OL7Nk6L4kjno7k5Q4J5k7
$$ y = [51, -5, -36, -6, -20, -13, 5, 24, 5, -34, -69, -7, -38, -6, -6, -11, -29, -7, 61, 0, 29, 4, 19, 4, -4, 27, -46, -11, 62, -6, 6, -5, 29, -1, 9, 38, -14, -2, -17, -10, 0, 23, -29, -46, -21, -14, -56, -40, -9, 8, -11, 7, -2, -18, -38, 15, -14, -78, -51, 44, 19, -4, 40, -78, 21, 11, 26, 60, 45, 16, 34, 57, 45, 1, 33, -7, -16, 25, -9, -12, -19, -24, 28, 21, -16, -27, -48, -5, -22, 19, -19, 41, 86, -31, -36, 46, -37, 51, 54, -55, -39, -4, -10, 43, 47, -43, -50, -6, -10, -9, 22, 29, -16, -1, 9, -6, -14, -6, -25, -15, -29, 7, -3, 54, -20, -30, -29, -46, -32, 10, -37, 32, -46, 23, -19, -32, -30, 4, 13, -30, 24, 28, 37, -19, 14, 42, 2, 30, 8, 9, 78, 17, 13, -21, 78, 10, -10, 58, -21, -16, 29, -39, 58, -7, 27, -8, -48, -63, -11, -4, -15, 23, -25, -3, 5, -33, -16, -18, -29, -23, -19, 0, -8, 66, -62, -23, -65, 2, 12, 30, -41, 12, 39, 23, -64, 81, -29, 19, -15, 33, 10, -53, 20, -31, 60, 3, -4, -20, -48, -30, 6, 7, 21, -14, -30, 43, 41, -54, -23, -59, -63, -44, -14, 26, -12, 20, 11, 8, 2, 26, -6, 51, 80, -20, -20, 22, 31, 33, 3, -5, 16, 5, 29, -35, 7, 38, 26, -4, -1, -10, 22, -29, -31, 9, -23, -17, 20, 25, -1, 33, 31, 30, 25, -42, -67, 17, 32, 5]
4795Ej3m1M9l5O8l3K7m3L6lJ6m7J3KJ6Nl6K9l4LM4l9L5Ln2N4k8l3j7K3LR1l6q9
4829e7L0Q4p1k8P3Qn3J9QL5Jk9o4N8k7PL8p6L0J0j9QO8m3lK6J0m4j5J1J2o3M6
4862a0K7m1j6K5L1n3J6K2pl8M5j7m1P7j9l8K2JM2n1k8L9L6qm5M9j2J3Mk7RJ6P
4895C0J1oml0j1LnK3j9J1Kk2J5n6N7k6N0J2l6l1Pk8J02n0k9k2L9J7j9K1j7K7K6
4928D2m0Ol0j5N4m2O1n6M5l1N7k4n2K9l1%J0K2J5l9k4J6k4N0l1l2O6Oj6K6L9o5
4960hL8n3k2M1M8n9K0k9PONj5%k8Q6o8L4J8l7pP6k0l0J1qmQJo0O4l9N3Lj5o2J7
4996b8L8q0K2J6K7j0o4O7L1o8N1k7l1M4pL6J9K5p1O2l6p0N7l8K1L1l1N4j09P0
5026AP1r5K6O0n7l3nm1R2m0P3r3L6L5Rl2Rm8jO2l2N2n1Lk2k7O6J2k9M6o6J9K1
$$ y = [5, -8, -49, 0, -35, 33, 0, 27, -16, 20, 17, 33, -14, -1, 1, 17, 22, -14, 15, -19, -16, 28, -11, 24, 27, -25, 29, 1, -32, -49, -26, -23, 68, 32, -57, -27, 57, -14, -42, 31, 39, -14, 5, 13, 48, 49, 20, -44, 14, -13, -6, 32, -44, -14, -4, -23, -15, 53, 10, 7, 33, 43, -1, -16, -5, 7, -56, -10, 17, -24, -40, -15, 16, -37, -21, 1, -6, -44, 1, -16, -57, 20, 1, -37, -15, -14, 28, -23, -51, -12, 24, 16, -29, 20, 8, 21, 25, -2, 7, 23, 30, 41, 35, 31, 1, -10, -7, -12, 11, -8, 3, 5, -17, -2, -58, -1, -27, 23, 35, -1, -32, -25, -53, 49, -1, -30, -52, -13, 4, -15, 6, -11, 16, 42, 2, 8, -22, -37, 17, -25, 36, -20, 25, -6, 51, 27, -25, 4, -27, -27, -17, 5, 20, -19, -43, -27, -51, -1, -32, -64, 2, 8, -8, 18, 57, -8, 30, -23, -45, -4, 44, -15, 5, -24, -17, -11, -6, -21, -21, -49, 37, -31, 3, 21, -16, -23, 53, 33, 3, 14, 6, 2, 10, 11, -49, 15, -24, 29, 32, 17, -45, -28, 10, -70, -48, -32, -5, -15, -79, -12, 19, -49, 2, -25, -56, -12, -19, 17, 36, 61, -10, 52, 16, -54, 3, -35, -14, 17, -14, 40, -69, 1, 72, -23, 3, 63, 6, -27, -32, -73, 19, -21, 52, -41, -5, 30, 39, 7, 16, -32, -33, 29, -3, 49, -2, 1, -21, -48, 18, 30, 1, 47, -19, 0, 21]
5059B1m8LL2Nm7L2k3N2m6K8L1k4l2jL6J0l2K4k3M3l5l5J4LN0m6J1J3qo3L7K4k1
5092a5O5mk8n2J6M2j5ML7p3L2Mn1O3o1M9J5k6L2j6n0K3PJ1l4rO8l7L0o8N1l1K9
5125Hk0l3j6L3R1j09N7J1k4N9k6q6P6J0o9LN3l3k9M7L3l0mL8l3k3N0J0l8k0L1
5156A7nl%L1k5Rk7K8k8l0J6K6k8l9P3o9P6o7M1ljn3M0J2k8K6K2l2J7NOJ9l5rp
5191b5M5mKJ0J1n2j1J8OL0j5K1m6ll6M8nMOKj0j3j4J4kP8o2Jk0K0K0k8Mj7M6Q
5227C1l7N2m3N2o8j2Q5n8jJ3m1N4ok3n0M1O7k9L6q0M2k0M0n9L0j9L3n6lk2Q2n1
5259b0NLj1J7Rpj1M5k3m8L1K2k7P9p4j4O7p0J0M5l3J3m4Q0k0%o7mO4l1pN6n5j3
5293c3L3p5R2%pKk4j6J3k6J3J4l2N7o1R5q0J7P7p2L6Qn5K8k2Ln7P0O5j01J10r7
$$ y = [21, -27, -24, 8, 13, -34, -2, -25, 27, -19, 9, 40, 16, -16, -17, 19, 29, -3, 21, -2, 41, 6, -29, -15, -12, 38, -8, 3, 16, 8, -55, -18, 6, -15, 50, 46, 18, -34, -18, 24, 9, 13, 50, -23, 9, 13, -38, 25, -36, 13, 28, 2, 34, 18, -32, -9, -2, 9, -25, -34, 34, -3, 27, -41, 10, -21, 8, -12, -45, -61, -28, 63, -46, 11, 22, -2, 57, 31, -55, 21, 31, -38, -35, 18, -15, -44, 3, 36, 6, 2, 40, 7, -16, 34, 44, 6, -14, 17, 12, 9, 9, 40, 15, 24, -3, 25, -3, -33, -17, 9, -19, -58, 15, -54, 22, -45, -4, -7, -8, -61, -21, -9, -37, -11, 11, -21, -4, 1, 7, 26, -9, -18, -25, 20, 16, 18, 28, 39, -13, -24, -6, 0, 30, 15, 36, -10, -13, -49, -1, -6, -2, 4, 6, -4, -17, -31, -17, -19, 59, -3, -2, -22, -2, 18, -10, -6, -23, 23, 31, -6, 46, 3, 55, -13, -25, 60, 2, 1, 14, -27, 27, 21, -2, -52, -11, 56, 27, 63, -17, 25, 5, 45, -14, 16, -3, 30, -26, -29, -51, 31, -20, -15, -12, -23, -6, 3, -4, -15, 30, 7, -41, -10, 12, -15, 64, -10, -24, 43, -27, -17, 28, -5, 8, -36, 44, 24, 24, -43, -47, 17, -14, -21, 35, -20, -33, 0, -75, 17, 17, 10, 12, -12, -28, -15, -41, -28, -14, -46, 11, -50, 45, -35, -18, 59, -13, 23, 31, -24, 4, -18, -15, -72, -2, 63, -38, 72, -25]
5325b5J8M5Pq4L2j3M2j7M1m1k4P6r7L5Ok2J4K3Qj6K2l1Km4M8l1N2n5N5m9MQJ6
5358ErK1m5N4J1k9n8Q1N6j03J9Lk9L0lPJk3k7L6k2m0O3j8Qj6P1j8pN7o9k8N1l4
5392dJ5l0M2k1k4K5j3K7l6k4P4k0O3j2o5P9q6k1Q6m6MQNqn9P9l7j0L2qn6P3l6
5425dj5N1k7l8kJM3J0K4k3j6n6N1pK7L6p1J6K7m8N1j6J3j28J05N4l3l8M3J9m3
5456Fk2J7qK9rjQOn0j3rk5R6m7RJ1J4j0K3o8L7%J1m8P4n8L5l8J1NM0k3n8M0L8
5491B3l0M0l4%j3l3M6J1p0Q1J5l7lj8NQj3J6l7M8j1M2m2N0n3k2L3k3O5n7K8lL7
5524D9l6j5k8MK7J6nn2Q2j6l2mO1o9K5j5k1rM6n6L3jOJ0j6N1o6R0n0oJ0k3J4j2
5558hj8lQJ13o5m3QM9p2K4M4k7l3P3m4P%J3K1j7l1L8k4pj8J3P6r5K5k5m5P3Kl2
$$ y = [-25, -7, 38, 45, -39, -7, -20, 22, 5, 46, 5, -19, 57, -40, -5, 1, -21, -7, 16, 24, 8, 30, -1, 1, -43, 5, -26, 26, -29, 26, -23, -19, -11, 5, -4, 17, -28, 26, 37, 8, -50, 31, 87, -16, 3, 6, -23, 7, 4, 11, 12, -11, -38, -2, -24, -64, -1, -19, -11, -27, 44, 26, 19, 76, 7, -21, 30, -4, 11, -19, 23, 2, -22, 3, -10, 17, -19, -43, 31, 11, 74, 62, -3, 76, -10, -31, 55, 9, 13, 21, 26, 18, -41, 38, 1, -9, 23, 15, -41, 32, -4, -19, 32, 5, -33, -35, -34, 9, 19, 43, 20, 4, -52, -1, -8, 19, 55, -16, 0, 27, -21, 30, 14, 27, -101, 4, 58, 25, -13, 30, 49, 6, -16, 1, -7, 22, 13, 12, 20, 26, -24, -37, -46, -71, 25, -22, -13, -2, 12, 2, 25, -43, -6, -6, 5, -43, 31, -27, 8, -30, -19, -14, 26, 3, -55, -15, 23, -7, 33, -1, -1, -14, -47, -1, 10, -60, 21, 36, -1, -4, -22, -17, -9, -22, -6, -43, 5, -6, 36, -6, 44, -9, -31, 2, -21, 44, -13, 15, 12, 49, 13, -2, -30, -26, 1, 17, 12, -40, 42, 26, -6, -10, 51, -18, 7, -8, -29, -38, 8, -48, -15, -16, -10, 0, -16, 35, -31, 59, 9, 3, 13, -10, 4, -8, -26, -29, -21, 92, 27, -16, -8, 41, -31, -7, 37, 10, -23, 50, 6, 13, 13, 26, 47, 30, -1, 37, 13, 6, -12, 1, 77, -18, 7, -18, -63, 10, 12, -20]
5592b0JJ3Pmj9L8J0q2O0p2Q0k7lJ9j3K7n1L4J7k7J5OJ2jj7J2N1l9m3j6k3O0j9
5625a4QK3o4N2m3L3l6J8J5k0L6l4k1%M6J2n3M4%K2m5M7K2k4Pmk0J3N4k1Pl3m6
5658a9O3n8j4N5mk1M7o9O0m9j1Ok2O5l7J9J0m5j4LRj0L6j7Oj1ML0m0O7l2Pkl8
5692b6KL5J5M5r0K2k3M2LOK9n2M0l3L1Rm9Pj6k0K7q9P9J9Oj8M0l9k3K9Nm7k8K4
5726c8M9RK2o3mN4m8J2jK9Pj7K1M2o6K8p5Q0l4Jl1N5pk6L4k1j7j7O0l0j1O0m3
5759A4l4L3J5k3M3l3K2k0J5o3K7K2k8K1j5%j7j2L1nK4l3j1J2K4rL3j4j5Q9p3k2
5791bj0M3k7k8j7J6M9q5M4K6o2O8j8J7L0n8N3n5k2M2rm4J12q0L5Jj0ql1K7JJ7
5823A5j2Oj0j0M7Jn4O2n5K0k3L4j3MJ7j7j3J6k2RJk6RlO1k1r1L7R3j03N5o1P9
$$ y = [-20, -19, -6, 1, -3, -22, 16, 26, -56, 4, -68, 12, -15, -18, 1, -12, 15, -36, -2, 15, -12, 3, 9, 21, 20, 3, 15, 66, 27, -16, -32, -55, 5, -14, -6, 17, -47, 5, -38, -5, -41, -23, -8, -28, 8, -26, -47, -47, -1, 11, -42, 2, 2, 24, -21, 26, 48, 24, 31, 27, 7, 20, 74, 53, 60, 27, -19, 44, -14, -28, 27, 23, 2, 49, -20, 40, -9, -20, -14, -36, 29, -8, 11, 21, -24, -38, -35, -26, -36, 0, -17, -11, -22, -18, 12, -28, 39, 7, 14, 12, -26, -24, 11, 26, 71, -19, 3, -20, 22, 25, 31, 60, 8, 48, 15, 46, 55, 6, 13, -3, -23, 4, -85, -6, 13, 19, 1, 41, 2, -21, 8, 13, -34, -62, -38, 11, 20, 42, -21, -25, 29, -19, -7, -8, 21, 28, 11, 32, 74, 8, 36, -39, 41, 7, 8, -23, 32, 25, -1, 33, 12, -5, -22, 38, 8, -3, 57, 14, -20, 13, 28, 5, 48, 15, 37, 17, 32, -31, -4, 18, -10, 11, -4, -4, -21, -33, -2, -7, 17, -16, -27, -15, 9, 0, 33, 19, 4, 93, 20, -2, -12, 31, 4, -24, -41, -25, 24, -61, -17, 9, -53, 15, -3, 14, 44, -14, 39, -16, -38, 4, -5, -49, 63, -17, 18, 19, 9, 1, -30, -3, -2, 15, 3, 9, -1, -11, 36, 37, -17, 45, -10, 10, -13, 21, 8, 12, 29, 12, -1, 15, -7, 2, 3, -23, -14, -17, 44, 23, -68, -31, 62, -41, 14, -47, 32]
5856C2m3J7J5p4L7j2K1P2j24K9K4j0%J4K7nJ2n4L8rm0J16o6r0J18q5J7j3R5p1
5886a2j5K1OJ6J5n0K4k2N8k0p2Q5n3k9J41p5oM0k7kL2mqk2J1RL3m7J1k5J4on0
5919b9NP3qn8L1J8o4M6ok4K6j8J9l4N8m8lJ9L5q9M1mM1k4oL3q6O8Mj2L1n0K3L7
5953D5k4q5O3O6j17N6K8Nm0j1O2p0L3Kk3J2OJ7np4R2j4r8N8M4l9N9m3k5N7pk2
5985Hj9qM1j6OK5l8Nm4O0l9pN2p1P4Jl0M7m9L0k3k8j3N0%j9j1%m8N1LNkK3Mj3
6021Gj1jJ8n1P4j3l3O8m4QqQJ0rm1rK7j1O1l3ok8l8N0%J8K4m9J7K2j5l8L0K5m0
6056a1M4m8Rj0L2n3J9L8ln0K1N3r6O4K7n0Rj2nL5k8R1l0Jn2l4K6J4lN2j1m1rk2
6090c3N3K6j9m7mNkL9l9M1j2J8o6J1M6j5K1k8RmL3m0Nl7K3J7j1m5M5J6K2rj8l1
$$ y = [32, -11, 6, 21, -53, -16, -28, -7, 65, -59, -30, -6, -16, -16, -2, 25, 20, 32, -22, 16, 7, -33, 83, 17, -73, 45, -40, -23, -36, 59, -12, -27, -6, 0, 16, 31, -19, 5, -17, 41, 21, -51, 34, -19, -48, 93, 18, 12, 52, 25, 23, 55, 51, 43, 21, 32, 41, 74, 27, 38, 13, 27, 21, -29, -24, 49, 41, -17, 14, 32, -32, 14, 8, -16, 10, -8, 11, -23, 35, -13, -16, 3, 38, -51, -10, -14, 27, 3, -3, 30, -56, 12, 16, 4, 35, -15, 8, 45, 21, -64, -1, 65, -52, 4, 32, 37, -3, -14, 48, -22, 11, 13, -10, 2, 8, 25, 20, -54, 38, 24, -74, -16, 28, -11, 48, 5, -20, 37, 30, 8, -11, -19, 22, 6, 12, 37, -1, 4, -40, 20, -19, -26, 26, -45, 29, 30, 0, 47, -2, 28, 5, -23, -36, 14, 14, -5, -16, -16, -64, -13, -10, -5, -7, 16, 20, 7, -4, -5, 13, -38, 36, 23, -10, 58, 14, 22, 14, 22, 32, 23, -18, -27, 0, -11, 50, 17, 11, -17, -55, -5, -5, 13, 37, -12, 5, 27, 12, -26, 4, 29, -11, 33, -15, -6, -16, 16, -37, -18, 20, 17, -33, -12, 41, -55, 9, 36, -14, -5, -17, -22, 13, -15, 76, 46, 47, -5, -39, -13, 1, -2, 50, 39, -2, -11, -33, 20, 46, 27, -20, -24, -19, -21, 18, -21, 20, 8, 26, -40, -29, 17, 2, 23, -5, 4, 0, 33, -7, -2, -39, -16, 1, -10, -55, -10, 6, 28, 19, 1, -30]
6124c0O4jl0k8L0lKK1M2m2m6R8m2n8J9n2P0K4Lk6j6M8p9L5PK9J7q4QmK7Rp8P5
6158IJ7l9j6N8J3l8mj9j9KN9l5J8L9m2m%j3OJ7l7J7RJ3j3K2pk3L8q1L1KLK3np
6194fK3l9j4pQ0l1m5O4lkrKn8P7l1LN5J3n4L5n3J6k9L8ok4K7rj3j9L7j5J6m7J6
6229a2%%KMK1K7l2l3O5r3K6O6o2J3M4l6L8k4j8klj0K3l2j3J3K4j5RK2K9n1K4n8
6263d4N5l2N1j3JJ9l2Nlj6J8k2k3Pj6lM3k0O7m5K3o8O4J1j1k0j1L6L4o4J1pN2
6296D7l0j8NK5p1L7K3Nk2j7k1M5L3m7L8n2K7J6m6QQO1k6M1q4L6l8mL0j0ooO9j5
6330D1n6l6O9o9R1j33Q8M4k8N8J8n2K4l5m7L3k7K5pJ4j3Nk3O8p8k5L8k0L5Oj1
6361cJ0o5N8jj6j5j1m1J00j5M2k6km5K9rl9M0J0j6L3l5Q7q4jK0K2k8J9m7J2K5
$$ y = [-30, 34, 33, 3, -25, 5, 2, 4, 25, 67, 25, -21, 77, 35, -23, -4, -56, 14, 38, 41, 15, -1, 47, -32, 3, 10, 39, 56, -28, -20, -24, 3, 12, -66, 9, 26, -13, -29, 29, 42, 4, 0, -19, -38, -36, 23, -12, 6, 45, 3, -1, -1, -14, -8, 9, -28, -11, -2, 11, -2, 20, 13, -10, 28, -53, -22, -20, -17, 6, 1, -6, 17, -22, -36, -43, 37, 6, -39, 25, 22, 20, 11, 13, -45, 32, 1, 4, 59, 72, 18, 53, 0, 16, -13, 25, 19, -5, 22, 13, 0, -19, 18, 3, 19, -28, -12, -12, -12, -10, -6, 15, 42, 10, -23, 42, -51, -25, 41, -21, -8, 36, 0, 38, 14, -4, -6, -9, -19, 4, -28, -41, -28, -4, -19, -10, 12, 41, -10, 14, -44, 11, -21, 30, 17, 18, 37, 5, 10, 7, -9, 9, -13, -36, -29, -45, -48, -5, -25, 42, -3, 20, -48, 16, 27, 16, -4, -15, 21, 55, -9, 2, -5, 47, 17, -1, 4, 29, -42, -5, 18, 23, 1, -16, -37, 8, 41, -6, 32, -20, 7, 23, -23, -15, -7, 54, 28, 69, -15, 21, -17, -21, 9, -1, -7, -13, 56, 41, -15, -51, 18, -51, 40, -93, -5, 39, 11, 69, 87, 35, 59, 24, -23, 10, -17, 8, 1, 15, 2, 7, -16, 52, -26, -51, -13, -33, 2, 8, -3, 7, -58, 0, -1, -17, -32, -43, -84, 16, 1, 43, 17, 15, -30, -1, -10, -49, -9, 1, -15, 18, -17, 70, -14, -15, 5, 27, -1, 18, -29, -17, 8]
6393HK4nk5J9l4J2k4NqJ3L1p0N1NQNm6P9p1J9M7m2j7N1m9P1l4m8N0M4q5M0j5m0
6427c1O1J0m0kjj9K0J5Nj7%J4lJk4J1J5n2P9l3J3n5Nj4M8O3q5M2m3m0N5L2j9M2
6461E3l2j2J3K7q9M6J6l4M0K4%%l6l5K3k6O7p3J3l0OL4j1L2o7P4lr3O6J4m9j1
6493e3K0%N5n2N8j6n4O8LorM8m1jn3L0N1o3J1Jk1M6MK0k3k5Ok7M4o8M5J9k5K2
6527A4j0j6J6k4K7m6j3R0j05Q9k0l6Q7j7j3l3M8q6j1Q7M8n3L1m9n2P2o2oQ7jm3
6558@ok0oR0m1kL7j14O6Nnk8QPN6n3K5j00O6j4O7p4n1P8N3p6J9L1j08Q5lJ1J9
6591B2j0rk9M3j4J5mML7m6J1j9Mk0M2r8Q0k8k3L4K1%pk8j4L5pNl2M5n2O8KLr7
6626f6Q7l9L3Jrm7O7J6p5O1k3K2K0j4pj4k9j7L6m4N8jl0N0Pj7k8K8n3J5K3k3L3
$$ y = [8, 32, 27, 2, 21, -13, -1, -25, -20, -28, -15, 16, -54, -3, 2, 10, 15, -31, 48, -23, -4, 43, 1, -16, 35, -14, 57, 23, -25, 25, 69, -16, 24, 9, -31, 30, 40, 0, -2, -3, -22, -2, 13, 18, 1, 1, 15, 12, 13, -11, 0, 15, -37, 42, 9, 22, -33, -28, -42, 6, 69, -16, 26, -17, -57, -2, 30, 11, 53, 21, 9, 22, 49, -40, 6, 22, -12, 28, 52, 52, 52, 16, -19, 4, -22, 45, -28, -15, -45, -39, -5, -16, 16, -51, 23, 20, -73, -7, 7, -42, -53, -33, -33, 22, -30, 28, 12, -42, 26, 29, 23, 14, 62, 21, 20, -33, -3, 48, -15, -4, -3, -24, 22, 26, 46, 23, -2, 4, -23, 21, -47, -2, 17, -8, 14, 4, -12, 4, -20, 7, -39, -52, 38, -67, 22, 2, -34, 53, 36, 23, -10, 38, -48, -59, 28, 76, 23, 54, 5, -47, 25, -37, -43, 44, 43, 0, -6, -26, -32, 58, 17, 15, 52, -62, 4, 9, 4, -24, -16, -9, 47, -6, 19, -81, -15, -29, 38, -36, -87, -9, 44, -32, -13, 18, -90, -5, -8, 3, 22, 12, 3, -26, 17, 3, 18, 14, 18, 55, 9, 20, 1, 5, -15, 27, -71, 9, -19, -42, -8, 13, 13, 6, -22, -36, -1, -8, -3, -35, 10, -42, 26, 28, 31, -66, 21, -18, 15, 16, 7, -40, 27, 43, -32, 29, 6, 28, 48, 34, 27, 13, -16, -33, 3, -41, 17, 16, -14, 36, 43, 26, -2, 26, -27, -12, 11, -12, 21]
6659B1j5o7O8j3J3l6j2K0J9m6jK9J6qL6l6N0j3Plj2rJ1M4%n1K2J7k7k3n5R3o6
6692b7j9Q4p2m2L8M5mj0J7k2Pn9O1k5J1J8n9M3M8k4K2k0J5j1rL6k7K1l2j9J6k
6724aK3oJ2K2n2J3lK5o0N7l0K1n2M3k8L3j3l6K6L9o7OM1jl8MQ1n0N6r4O3qmJk8
6759eK1J4LLj0j8L1m3k5N8J3r2Q4j2Jk5%J7K5k2%K5m6oQn5N0J8J6l9K5Kl8K8j6
6794a0okK8J9m2K8L7L1j11L3L2Qj5mj6k4M2jM0n2k6N6k9m2PO0m1K2qj5lJ3jj4
6828flJ1K9k0J6o6J1M1ll0J5k4M8Ln7O3k1N1k4j3m0L2j9K7n4N6n1J9L2l8P9l3
6860C1r1P6j2J4m9JK3nj4QOJ6mQ5o2p5L3l2M2J0QPm7J6J3L9m8J0J4J6N1q0L7j7
6894B0l6L3K5l3Oj9L0j1o8K1M7JMk6j6j9P7rn1o8N9N7l3J0M4k6k4J2k6l4nM9j6
$$ y = [21, 6, -61, 7, -6, 7, -29, -41, -21, -2, -48, -49, -20, -4, -12, 24, -12, 38, 25, 32, 29, 17, 8, 19, 63, 63, 12, 34, 51, 24, 1, -54, 39, -27, -46, 38, -34, -76, -38, 7, 3, -7, 10, -12, -5, -64, -3, -28, -17, 1, -58, -15, 33, 9, 31, 11, 26, 15, 6, 42, 15, 36, 4, -15, 1, -1, 22, 16, 28, 50, -2, 11, 8, 33, -27, 30, 0, 21, -31, 12, -16, 17, 4, -32, -6, 33, -34, -28, 13, 12, -26, -22, 59, 9, 65, -29, 34, 26, 22, 23, -5, 16, 30, 33, 36, 26, 8, 39, -4, -29, 29, 42, -50, 34, 22, 23, -2, -2, 15, 40, 18, 18, 43, -3, -9, -1, -56, -6, 12, 28, -11, 14, 16, -22, 6, -10, -16, -18, 10, 29, -13, 15, 52, 83, -28, 5, 37, 45, 30, 26, 10, -14, 28, 27, 67, 15, -11, 45, 16, -26, -19, 41, 0, 22, 14, -1, -4, 9, 8, -6, -9, 2, 31, 11, 27, -39, -28, 13, 10, -20, -5, -29, 19, 22, -35, 28, 7, 58, 34, 21, -19, 13, -6, 21, -33, 23, -28, -9, 23, -15, 64, 31, -60, 16, 4, 18, -31, -30, -7, -12, -26, -18, -12, 4, 0, 85, 23, -52, -19, -51, -9, 1, 9, 16, -31, -15, -2, 37, -11, -1, 13, 29, 80, 0, 37, 20, -16, 17, 42, 9, 15, -4, 26, 15, -53, -32, 15, 16, 20, -6, -22, -41, 36, 27, -24, -92, -33, 24, -9, 1, 45, 19, -5, 7, -19, -53, -58, -9, -25]
6927b5k8N5L3q5P4l6J4Qpj4J3j4k6N6lj3J5pL0Nk3kNm5J6Nmo3J4P2j3ojL8pm7
6963a6j3lKJ4K9M3m8M5k4l8lK3QJ3j4LJ3k7j2J6Qm1P2n5k3N7j2k6k1rMO7n0k2
6997d0K8K0j2NK1J9m1j0L0qM1l9J8o5K0L8%m6J4L9mm1J2k3NL1j%m%K7oq8L5K6
7032AJ7k5m5M9l2J5k1J01p1mnJj8J3K9J0J5q0Q9j7l5L9l2P5p0J3J1K0l6K9k3L1
7064D4k1K6lm4j6m0PN2m3L9Rj7QjRj9j4LL0L4o1PMk3jQ9k1m2L1k5k4L2j2Mj3j3
7100b5N3o5M3N9n2P0j22P0j8j7L0l2KK6Qo2nM5J7mkJ6o8J7K1qONN4o0k2lM1l9
7134b1L7K1k2No0K0jOkPJ1l2J2kM6l6j4M1k3k2K7J7Mj1k7K2j8M3k0L7l1o5Q4p6
7168d3N4l7L1p0J8l4N8Rm0L0%L0j2K2Ml3k1N7m1L0J4l4rJJ5J8oL0n6K5k0j6N7
$$ y = [-25, -53, 2, 35, -50, 24, -12, 2, 10, 3, -11, 2, -12, -38, 18, 15, 2, 17, 10, 40, 45, 22, 20, 25, -20, -4, 1, -3, -66, -52, 20, 7, 1, 0, 38, 31, -16, -29, -32, -30, -16, 13, 56, 8, 53, 29, -9, -12, 11, 19, 32, 18, 21, 34, 7, -5, 11, 19, -22, 50, -5, -28, 29, 17, -9, -30, -39, -35, 32, -18, -40, -12, 8, -4, 1, 22, 41, 0, -10, 20, 12, 53, 14, 32, -33, -13, 25, 25, -21, -7, 32, 28, -13, -1, -24, -19, 12, 11, 11, 7, 7, 34, 28, -60, -25, 1, 18, -7, -52, -3, -35, -20, -41, 60, -11, -15, -20, -19, -37, -24, 5, 15, 30, -50, 39, 22, -13, 26, -6, 69, -1, 12, 23, 43, 7, 36, 13, 44, 23, 49, 46, 2, -14, -54, -47, 5, -38, 1, 10, -7, 1, 0, 9, -10, -24, -21, 9, 43, -18, -11, -7, -30, -31, 58, 37, -5, 26, 1, -23, 9, -3, 1, -12, -25, 28, -37, 6, 65, 13, 83, -39, 31, 13, -4, 26, -6, -4, 22, 30, -32, -37, 8, 25, 21, 19, 35, -33, -16, 5, -3, 3, 8, 62, 2, -20, -23, 18, -21, 16, 37, 15, 20, -40, -20, -21, -15, -17, -10, 1, -31, -19, -21, 25, -11, -25, 16, -7, -29, -2, 15, 19, 8, -19, 3, -15, 28, 8, 45, 14, -51, 33, -43, 11, -26, 5, -65, -47, -81, -23, -14, -54, -24, -24, 6, -6, 16, 20, -13, -34, 23, -18, 12, 26, -8, -17, -16, -1, 17, 11, 41, -15, 10, -10, -26, 31]
7201C1J6j8J5m9l6K9N3n4K2j0j7O8o9k7K3J4l9M9nmK4PL5n5K4m9K4J2j6M5Nk6
7233B2o8O2J7l5K1jj4jk5J6K3k9M1l5N8m4m1L7j6L1o5J02j04N4n2N4J2j5j7QK5
7264B1kRMl3Rk9P1k3Rp7O0m4NmJ5j9K8k4J8K8l8J4j1N1p7L6l2K9n4M0kn5R3k5
7298imL4m0J5J0k9RP8j04K3OJk0j3N7rk5L0J9mJ2j8j2m1N0j8K2p8O1j3N1L1q4
7331a2J9Jn6qO9K0m4K1l8O2o5K4L4l6oJ8k9mJ9M2l7K8L2l8j9oj1K9OJ3j2m7N4
7364B3J0%m6L6j5m3J0L4j0L6l7k9N2lj5j8L7m3k6O0lmM6n4OL0K3p8N3m9N3j7K3
7397D2r0N6mN0p4J00l3j4N9j26N3%Mk8L2MLo2N7m6J4Kj7L9k2l2M6k1qJ8N2l0l3
7430ik4RM3pJ7k0kkJ5k3JK8m8M1l0L7OK1l4l0k1L8OK5l5K4Ml5M4n2L6o0M7q4P3
$$ y = [31, 47, 29, 44, -5, -41, -12, 41, -13, 9, -1, -18, 50, -19, -46, -23, -9, -48, 1, -4, -8, 16, 23, 58, 3, 27, -22, 2, 14, -2, 43, 48, 22, -46, 16, 33, -2, 19, 18, 4, 3, -22, -6, 17, -12, 29, -6, 52, 8, -33, 4, -12, 19, -46, 56, -48, 6, -46, 8, 20, 5, -12, -4, 21, 19, 28, 32, -1, 8, -21, 50, 27, 36, -41, 19, -25, -20, -24, -9, -28, 0, -24, -6, 22, -16, -2, -13, 38, -39, -3, -35, -6, -60, -20, -22, -77, 16, -9, -13, 21, -19, -4, 6, -23, -14, 64, -40, -17, -11, -10, -30, -43, 14, 5, -20, 10, 29, 25, 37, 19, 7, -34, 16, -2, 20, -58, 3, -10, 41, 72, -12, 7, 8, -48, -56, 13, 33, -11, 10, -28, 34, -31, -7, 27, -9, -15, 3, -26, -30, -11, 31, -6, 22, 54, 16, -3, -9, -20, 9, 15, 28, 16, -31, 23, 33, 33, -13, 23, 8, -35, -25, 9, -1, 35, -2, -31, 21, 18, 3, -15, 22, -21, -47, 13, 10, 6, 52, -2, 4, 34, 57, -21, 32, -17, 36, 19, 42, -48, 8, 4, 54, -20, 80, 47, 33, 92, -34, 19, 19, 23, -5, 27, 31, 34, -28, 29, -17, -3, -1, -18, 21, -1, -33, 13, -8, -16, 2, 54, 24, -9, -33, -24, 19, 12, 29, 9, 7, 5, 20, -3, -2, 26, -22, 19, -11, 26, 32, 53, 19, -11, -32, 6, 12, 37, 2, 26, 30, -5, 39, -13, 23, -37, 10, -74, -1]
7465aL7j9J4k6k2K9k5l9N7j9k4O4l3J1qk1P0k9k5lR5n4oo5L5NqJ3k2L6j9Ol3J8
7499a1l3J9P9m6j3Pk0O4l2L7l7j4QJqpkj0J1K6mj0o6K8N5M7m7J7J5m4PK2p7M1
7533CK8Oqn1L5K0m4J2K0k8L5k1j5j0LJ4m1L7n9P5Nk8J2K%N3q8j2L9J8J1k6L8l4
7567AMk7K9l2J4O9j0n4RJ0m9O4m5O3l3j9K5m6J6n8Q5l8L7K8m7N0n3P6m4q5N8l1
7599c3M6Qk1J5n5J1M3o4L0J1K2l1Nj5N7k5kK1j3k1M6l1J9rJ8m9M8m9qL6j1j3k8
7632d2O0Mk4n1J04j9m3J1oK3l8N6j7k3J0Lj8mL1m8J7M5l5J0NK9r4L8K3jk4J8K0
7665B0K6k6jKl9j6M7k5P2o0j5M8j8Kjj1j4m4O2mk3M2l9K3l9O5l4N0l5Rk5K4ml6
7699a7RpL1k7L0LOPjl9L2k2J0M0m8j7K7krk5L0L0l2j5%Rj3Q0n9lNm5J2N3J2k0
$$ y = [-1, 36, 17, 31, 5, -17, 12, -13, -52, 5, -14, -38, 26, -7, 4, -4, -25, 45, 16, -9, -12, 83, 29, 23, -42, -7, -2, -10, 3, -19, 17, -2, 4, -29, -11, -44, -25, 54, 8, -5, 2, -18, 46, 14, 51, 14, 0, 8, 9, 1, -6, -8, -18, -7, 19, 15, 5, -61, -33, 22, 69, 22, 39, 54, 10, 17, 39, -38, 3, 31, 37, 29, -22, 13, 33, -11, 1, 21, -7, 28, 7, -8, -18, -15, -1, -42, -5, -64, 11, 16, -12, 0, 2, 2, 55, -33, -45, -6, 12, 23, -3, 35, 1, 5, -22, 7, -25, -11, 58, 48, -6, 3, 13, -36, 28, -17, 46, 13, -6, 19, -27, -11, -69, 16, -22, 15, 43, -4, 46, -7, 69, 25, -60, -2, -33, 13, 21, 0, 15, -40, -29, 14, -50, -20, -9, 13, -18, -13, -28, 29, 4, 2, 23, 10, -11, 35, 4, 23, 14, 32, -17, 31, -18, -26, 10, -1, -14, -42, 18, 22, -2, -53, 51, 32, -11, 0, -6, 17, -21, 35, 18, -5, 5, 8, -10, -14, 17, -31, -14, 31, -4, 6, 11, 40, -54, -16, 7, 6, -18, 0, 20, 46, 20, 19, 21, -18, -34, 13, -12, 60, 0, -15, 33, 15, 17, 16, 5, -9, -53, 9, 5, -18, 24, -15, 8, -31, 34, 0, 50, 15, 24, -1, 23, 19, -17, -8, -15, 16, -11, 19, 22, 28, 35, 34, -5, 27, 5, 15, 55, 7, -10, 17, 15, 6, -19, 11, 41, 9, -6, -6, 3, -10, 70, 11, 8, 13, -32, -20, 33, 45, 25]
7735B5Pk2J9K8o6M7k4kM4j9l3J2l5K2n2O9oM0k0o1K5m4O3l3K0l7M8j5k7N3qo0
7767d2N5Lj2j2j3PNNk6N4qj2oM0Ok5m5J0K7l9P6k2ok2kK4o1mL3K7m9M3k4K3j6
7802hK0kk9M8nm7%jLM8q1N6J9k7L3m8nNN0nK0l1Oj1m7Q0m2K1J4p1O0J5Pj12P2
7837Eqj7pj2NO9j7n2O3l3k2J9rJ2pjJ2%lK3k0qKj1J7J4kj6l3P1k0M3l5JO2j01
7873a6K3qnJ6Jj8N2n2nJ5K0ln3k4N5o2N3j8J1Ko5O7J3Lrk9M3mJ6l0J2J1n0L7L3
7908C2k6n1N1mj5l6N4p%Oj6j9N1j8J9j16N3L2L0m6J6j0M2k7l2lK1L7l9N3l8j7
7940b3O9n6J2j6k4kK0L2K0p2P9n1L4l1L7j7k5k4L0J2%K6k7J1m0M5j2Rj2m4kM9
7972Gj8J7l2L1n3R2n1lJ8K1M5n6Mj0J1rK9o8P7l5K2q3P3n7Q2m1j7L2J0rl0k8N1
$$ y = [25, 32, 10, 29, 57, -9, 38, 14, 12, 56, 37, 4, 16, -19, 3, -49, 20, 14, 54, 34, -27, -2, -46, 17, -16, 4, -33, 15, 0, -27, 26, 18, -42, 13, 16, 4, -8, -21, -14, -9, -4, -30, 24, 16, 4, -2, 38, 44, 19, -26, -16, 11, -28, 48, 26, 20, -2, -4, 20, -41, -45, -12, 15, -34, 9, -15, 8, -8, 12, 10, -19, 29, 24, -23, -23, -24, -21, 27, -54, 2, 21, -6, 27, -21, -26, -21, 29, 24, 44, 13, 19, 8, -39, 41, -1, 20, 34, -37, 23, 38, 45, -67, 5, -3, -20, -27, -39, -34, 35, 18, -34, 29, -4, -26, -7, -16, -4, -11, -12, 0, 0, -3, 20, 0, -8, -6, -17, 0, 14, 12, -4, -37, 34, 14, 57, 22, 23, 85, -16, 7, -1, -6, 10, 11, -7, 45, -7, -12, 3, 23, 20, -33, -57, -2, -64, -11, -29, -18, -16, -81, -14, -1, 2, -7, -36, 7, 3, 19, -11, 1, 12, -38, -1, 32, 6, -45, 6, 2, -13, -49, 5, -2, -2, 4, -12, -31, 20, 2, 21, -95, -42, -10, 20, -26, -10, -20, 22, -5, -37, -40, -19, 18, -21, 32, -6, -23, 46, -10, 2, -14, -38, -40, -20, 12, 32, -40, 39, -12, 22, -9, 28, 11, -14, -38, -8, 4, 4, 30, 3, 14, -26, 19, 7, 16, 4, -40, -42, 7, -11, 6, -26, 5, -48, 44, -7, -10, 8, 29, 74, 18, 22, 12, 23, 14, 43, -25, 52, 17, 39, -44, 29, -28, 54, 13, -4, 28, 38, 29, -1, -29, 22]
8005B2Rj8J8k5K8j02R0l6L7j19J31k2J9p6Q4p4M0l9RK5K2lk6L4o2J6O6j8j9l5
8035b4j3P6m3K9j7k5j9pM5KJ5k0M1Rm0K2j8rK0n6M0K4O%l9M5l7%k8Mm0K3P2o9
8069c1L5%K2kk6Pk0K5k4K4pn1N6Nj9m4O4nJ8j9ok7J6j5j4L1l6O0m6R0m2j5n2J0
8103c8M8j1qJ8klo1M1J9qJ9l1K0N5k1k3L8m6mm3K6J9RmpKoN3o1K3j1nn6L9n3J01
8139B8l8J6j6j4K3K9l4Moj9j4L0k8J3N5j9j1l3M9Mm8M7ro3J8K5O8r3J5L2k9J6
8171bJ8ML0p3O2m5K1l4j1L8k3j5R3r0M7j3J7n2M0n3
$$ y = [22, 31, 13, 31, 6, 34, -68, 22, -14, 23, -96, 35, 13, 32, -44, 40, -34, 6, -33, -24, 1, 23, 20, -6, 28, -34, -18, 48, 30, 11, -24, -37, 39, -4, 25, 8, -17, -36, -43, 2, 4, 19, -1, 40, 49, 9, 31, 13, 4, 24, -32, 8, 32, 38, 38, -1, 44, 7, 7, -21, -17, -57, -34, 38, -31, 4, 4, 26, 24, -2, 5, -15, 10, -14, 10, 3, -48, 8, 13, -6, -50, 14, 9, 27, 8, 2, -25, -9, -24, -38, -7, -43, 17, -29, 61, 19, 4, -48, -38, 10, -1, -9, 9, 7, 4, -57, -16, 3, -5, 14, -17, 3, 58, 37, 14, 52, 6, 2, -41, -15, 4, 13, 9, 2, 4, -2, 51, -10, 13, 2, -3, -59, -20, -73, 28, -10, 6, -10, -24, -1, 28, -6, -2, -8, -27, -41, -11, -39, -26, 29, 10, -1, -34, 15, 19, -29, 18, 9, -54, -36, -11, 57, -36, -21, 11, -18, -2, 16, 20, 50, -23, 39, -6, 15, -19, -30, 8, -15, -30, 63, -27, 20, 7, 24, -28, 12, -41]
8191d1
$$ Imaginary data points
##PAGE= N=2
##DATA TABLE= (X++(I..I)), XYDATA
0@%%%%%%%%%%%%jRj6J6j6J7k5L2l5M3n2O1p3Q8j04J18j35J55j75K01k31K63k96
35a56L31l73M20m70N24n83O47p17P95q82R76j078J189j309J442j588J748j927
53a011K127k349K598k883L209l584M025m550N190n990P024q419J0412j3519J9095
68A1375l2222J22504R8713j71737j15591o4422M8341O7869N2653p323L361K5670
80C9191M1382J700l9909p9595o0465q333M3767M7985M4561L7345K8181j583l9965
93E4262q6593r0134k8626O3210J05927Q1104R574n3774o2707j5647K0183O251
105C030l1691m4317j3203N0805R4046O7666j1655p4504q4681m9775K974L9233
117e2072M0592L1362L1268K3553n402l7368n2938m2823n661L1425L4281J2137
$$ y = [0, 0, 0, 0, 0, 0, 0, 0, 0, 0, 0, 0, 0, -1, 8, -8, 8, -8, 9, -16, 16, -19, 24, -28, 33, -40, 48, -56, 62, -73, 82, -93, 108, -123, 140, -156, 175, -198, 222, -248, 276, -307, 340, -377, 418, -464, 512, -566, 623, -686, 756, -832, 916, -1011, 1116, -1233, 1365, -1518, 1691, -1893, 2132, -2418, 2772, -3218, 3806, -4613, 5799, -7720, 11375, -20847, 101657, 200370, 28633, -86958, -151380, -103039, -35170, 17483, 10160, 13521, 39191, 80573, 82273, 42364, -37231, -97696, -106029, -62262, -14277, 30284, 67629, 95810, 94227, 54262, -32331, -122465, -151091, -87881, 18046, 99150, 108724, 54950, -7757, -23404, -3221, 3030, -28661, -72978, -86181, -35376, 58670, 126336, 114681, 40177, -44504, -94279, -91305, -52072, -11480, 19882, 51150, 74703, 69301, 31933, -21005, -63828, -69489, -38064, -3783, 8354]
129H354K233J2810K4938J9416j6123o4544p6521k7339M4526Q5325P1995J5047
141A00117m4201n9023l0173m78O396n36m992N561L0350M2523K1228j4965l6742
154A5065l8207k5137n137Q925J7234L1551M3610K9696r450m7533o1050l8390J0864
167f7959M7365M2435J2452r345j0434L045J1736m202l5036m4527j7817K4159N2763
180D635N0561J6875k2480l7987l0679j8350o420N730J5928K5386L0071J7525r028
193D1767k7369k6758j5269k424M628L047M527J9199L2408K3954m451l5884n0301
206c2926l3139O794L7421L8786K0191r62j2886j1427o250j0306j8228j4553J388
219c6097J8833K8983K4510O233j1595j8845k0338j9845j2698J556J8065L1081
$$ y = [8354, 10587, 23397, 48335, 67751, 51628, -12916, -89437, -116776, -72250, 13075, 85070, 100117, 55916, -3107, -33280, -33758, -27362, -27898, -32890, -27329, 3021, 45544, 66772, 51807, 15065, -23142, -48279, -53416, -44491, -27257, 4294, 47904, 77600, 68150, 20617, -40433, -78823, -67959, -20594, 21841, 34293, 24948, 14514, 17559, 29295, 25093, -9943, -54470, -72287, -48128, 4635, 55196, 72071, 49591, 11604, -19075, -37425, -43845, -38115, -22187, 3199, 33270, 50795, 41767, 14398, -12360, -27629, -30053, -25425, -22378, -17851, 1348, 33756, 57710, 53259, 17375, -32926, -66065, -59271, -21850, 16936, 37127, 36165, 23279, 11852, 5602, -4704, -22932, -37485, -36097, -17264, 11719, 36229, 42462, 30867, 12022, -8316, -28161, -40859, -39303, -21238, 9843]
231I843L0763J0529j6939l1053k6401j0414O310J2953Q325N053J0475J5479J0263
244C5186m809k2770l1728k1079L180K2700K7668K0659O632o906j3860j6347j7326
257a8800j2985m58J2938K0256J9419R581l736j1309j2239j2227j1966p364J644
270b7246J3674K3799K2783P235j3048k4728k3698j1619M022J3521J4146J1891
282A0732R337M646k452j0558j7000j7273p880N427J4971J7817J4661N773m370
295B3831j2040j6703j6520q771L879J4864J9246J5491M750o822j2785j3332j0974
308a5886o223J69O878J2903J6022J2095J208j0477j7372j6890r041K260J0870
321a3484J4594J3483Q366J59p858j3358j4558j0089j187P874J3301J3991R763
$$ y = [9843, 40606, 51135, 34196, 3143, -23258, -33672, -27362, -14409, -6084, -1031, 9444, 24923, 35186, 30377, 7607, -24121, -45200, -42020, -19320, 8348, 29007, 35639, 28733, 14873, -1474, -18800, -31785, -32243, -19305, 951, 20370, 29951, 26215, 14906, 2667, -9560, -21526, -28890, -27246, -13572, 10227, 33010, 40245, 27197, 2469, -21229, -32848, -28826, -15305, -1159, 10732, 20069, 24715, 22263, 11705, -5295, -22568, -30448, -25021, -10050, 7767, 22428, 28201, 23831, 11791, -4912, -21432, -30203, -26324, -11460, 7786, 23277, 28027, 21205, 8420, -4912, -15886, -22109, -21940, -15062, -2159, 13863, 25958, 27166, 16689, -683, -17573, -26614, -24354, -13484, 1110, 14593, 22959, 23118, 15260, 1902, -12656, -22745, -23932, -16058, -2757, 11234, 20997]
334B0997K003n971j1897j4000j1261l750N564J2709J4852J1216K937o066j2130
347E203j3415j0124l408M331J0338J2945J1099N028l065j0281j3461j1821n442
360b2073L081J0075J3232J1112N237k500q964j2026j0873n939J002P962J1955
373A281J1840O999o93q247j2560j1732o481Q75P599J1443J0852O862M53o282j0862
388A347j1296p489r92O052J0592J0978P216J567m952r943j1066q385k515M856
402a4030J0706J1731Q050J603n096r652j0068p140k498K752P878J0067Q731M269
416A7303k209q669j1190q873l640K945Q364J0210Q155L824j744p383j0131q766
430a1804m368J444P186R839Q366M314o60n832r076q595n554m64N664R794R437
$$ y = [20997, 23000, 17029, 5132, -8868, -20129, -23879, -18315, -5606, 9246, 20462, 23399, 17333, 5203, -8212, -18336, -21744, -17413, -7075, 5870, 16969, 21997, 18932, 8651, -4810, -16631, -22073, -18992, -8917, 4315, 15427, 20664, 18164, 9200, -2826, -13699, -19638, -18636, -10674, 1281, 13121, 20120, 19427, 11180, -1380, -13112, -19593, -18718, -11119, 324, 11176, 18038, 18491, 12209, 1347, -9949, -17438, -18430, -12378, -1786, 9192, 16408, 17975, 13023, 3080, -7986, -16371, -18886, -14030, -3324, 8407, 16457, 18060, 12964, 3312, -6756, -13896, -16394, -13642, -5764, 4303, 13034, 17303, 15094, 6425, -4765, -13638, -17278, -14333, -5969, 4241, 12396, 16220, 14476, 7093, -3038, -11804, -16172, -14728, -7542, 2297, 10663, 14977, 14317, 8485, -591, -9186, -14740, -15204, -9540, 254, 9691]
445I691N445j56o096r432q469m778k45M731Q216Q409N699J588l927q474q981o255
461a3034j643L971Q266Q843N900J691l383p630q456o015k218K666P235Q570O401
476A1164K581k347p009q561o443k824J850O561Q401O641L165j370o352q396o599
491i538l077J270N844P689O130L323j97m667p438p093m601l40N122Q624P578L851
507A2480p81n342p524n916l124l89L242O184O413M840J742l089p145p397m771
522a0577j064L321O631O762M684J854k486o739p679n111j181L459O836O221L300
537H231Q10j440l978n120n023m064l67N174Q220P069K894k452o899p386m133r85
553i449J574M151N458M576K964N4m220o442n217k401M05L370N075M689L899J962
$$ y = [9691, 15136, 14980, 8884, -548, -9017, -13795, -14040, -9309, -1093, 7316, 13015, 14603, 10676, 2202, -6779, -13034, -14677, -10706, -2440, 6403, 12303, 13994, 10611, 2981, -5475, -11490, -13708, -11042, -3807, 4763, 11164, 13745, 11398, 4389, -4172, -10615, -13439, -11589, -5028, 3373, 10014, 13179, 11809, 5457, -2939, -9538, -12615, -11345, -5501, 2188, 8318, 11641, 11444, 6777, -661, -7754, -12355, -12695, -7573, 1051, 8629, 12480, 11699, 6357, -1167, -7083, -10207, -10596, -7354, -1170, 5243, 10083, 11825, 8736, 1591, -5806, -10577, -11641, -8320, -1689, 5073, 9757, 11611, 9125, 2386, -5293, -10404, -11585, -8126, -1290, 4931, 8231, 9041, 7601, 3623, -1497, -6520, -10584, -10951, -5777, 2443, 9512, 12406, 9954, 3055, -4331, -8464, -9449, -7875, -3724, 1734, 6310, 9274, 9328, 5108, -1334, -6551, -8952, -8547, -5177, -102, 4587, 8486, 10448]
569A0448k595o818p708m867K44N910Q081N155P02j946l162l366k855k733k667
584h177J71M581O696N454J994k964o533o055l332p45J916M890N712M450J790k490
600G358o321o242k672P62K750L352K466J871K606K079j528n675p082n002N12O655
616d111Q368M869J0l360m700l753j926j286m94K000M459M552K819p6l334m575
632e38l288k016j243R50L829N664N216K130l760p867o757j905K802N160M276J086
648C739l52M27P71j081l611m870l813O90N415O489L885N64k733m496m140k829
664e945j487J123M338N518L449K30l048m428k834k77O9n89p4J883M160N228K265
681I581l557p317o458k012L024N934M843J407o87j037j468k270k664k489r39K149
$$ y = [10448, 7853, 1035, -6673, -11540, -11296, -5386, 2695, 7850, 8552, 6606, 3444, 78, -2777, -5510, -8177, -8006, -3425, 3271, 8725, 10719, 7755, 1222, -4833, -8165, -8910, -6994, -2104, 3608, 8058, 9848, 7358, 1037, -5205, -7877, -7115, -4365, -1013, 1453, 3324, 5930, 8009, 6481, 806, -6276, -11278, -10766, -4111, 4257, 9126, 9136, 5776, 1076, -2677, -4603, -5889, -6383, -4383, 76, 4628, 7447, 7371, 4037, -538, -3826, -5842, -7085, -6135, -2306, 3358, 8574, 10704, 6944, -923, -7680, -9585, -6783, -1623, 2653, 3739, 3387, 3814, 4585, 3504, -107, -4977, -8790, -8100, -2685, 3804, 7689, 8253, 5520, 1024, -3116, -5945, -7432, -6309, -1971, 3547, 6996, 7226, 4178, -250, -3084, -3361, -3292, -3881, -3955, -2072, 2088, 7316, 9581, 6024, -1293, -7751, -9763, -6739, -805, 4038, 5445, 4758, 3721, 2253, -17, -2681, -5170, -6109, -3960]
697c960M101L421J581J1j337k476k981l400k626J018N135O388L830p58m998n886
713b937k653J004K068J227M95N19K090L289J391k601n042m702j765K063M544M087
729C077K046M77j015k777l792l112j346J741M084L851J360q06j498j227q13j140
745h90k493k391M05L966N406L825m76m659n567k919K38K296K597J913J119R83
761C353O75r58k652l016j796j96J689K568K184J631J274k82k545l982l589j157
777f799K569M988L921Q58j812k779k035n72j09q61q43Q28K635L330K328n65l305
794A777l806k504l80J337K491K602J992J077o18k563l332k125j72J477K382J695
810A330O22M95N36j84j578k916k890r78K127M090L507J181j444k810k615j338
$$ y = [-3960, 141, 3562, 5143, 5154, 3817, 1341, -1640, -5040, -7666, -6648, -1513, 4875, 8705, 7947, 2949, -2937, -5590, -4586, -2518, -1291, -796, -277, 1813, 5102, 6493, 3892, -1150, -5852, -7617, -5554, -1010, 3077, 5123, 5600, 4585, 1808, -1984, -5096, -6442, -4701, -617, 3234, 4594, 3788, 2290, 1063, 250, -890, -3383, -5774, -5369, -1403, 4003, 7828, 7352, 2693, -2874, -5793, -5555, -3259, -662, 1251, 2370, 3353, 4028, 3070, 418, -2598, -4394, -4590, -2901, -333, 1851, 3482, 4756, 4474, 1929, -2053, -5642, -6799, -4230, 758, 4679, 5537, 3725, 946, -1089, -1661, -1770, -2631, -3474, -2646, -11, 3319, 5647, 5082, 1777, -2029, -4533, -4913, -3576, -1085, 1517, 3509, 4586, 3968, 1405, -1927, -4052, -4224, -2747, -365, 1330, 1952, 2447, 2983, 2799, 1221, -1695, -4585, -5563, -3436, 654, 4161, 5342, 3898, 1088, -1527, -2865]
826b865j59J90R30J654K010J633L53j199k389k159j255k05Q45J668K190K110J103
843D455q71k791l252j987K79K095K659J727M43k89n52j015j342j637j430L9J727
860a742K745K262Q13r73k055k311j660n52N05J671K223J913P11p19j900k042j289
877b400l98M43J003J359J528J299N00r80k230k441j439K48J858K325J772N40l57
894B630j174j574j521j044j92R75J647J856J129R9q97j617j624j283l91O91J653
911f37J927J559L25r76j816j875j115r3P91J444J499J116M62l65j291j737j407
928b189o98N36J406J747J346N64l93j325j678j291p06L85J180J657J380O52k99
945B274j091j548j428o90K05J015J453J504Q02j77r73j412j388r05j9Q51J431
$$ y = [-2865, -3024, -2834, -1904, -250, 1760, 3393, 3746, 2547, 158, -2001, -3256, -3461, -2616, -948, 1242, 3352, 4455, 3584, 793, -2459, -4446, -4167, -2072, 587, 2314, 2757, 2468, 1916, 901, -441, -2078, -3508, -3469, -1742, 1003, 3265, 4078, 3105, 1050, -1261, -2921, -3473, -2968, -1297, 926, 2839, 3550, 2831, 931, -1111, -2400, -2798, -2355, -1352, 7, 1535, 2834, 3334, 2354, 124, -2317, -3756, -3508, -1650, 675, 2447, 2987, 2630, 1456, -118, -1639, -2683, -2875, -1900, -253, 1603, 2732, 2831, 1934, 317, -1307, -2590, -2981, -2290, -637, 1290, 2849, 3174, 2198, 382, -1493, -2608, -2701, -1910, -466, 1033, 2149, 2611, 2246, 955, -782, -2189, -2887, -2351, -945, 802, 2148, 2712, 2319, 994, -684, -1975, -2681, -2296, -1116, 541, 1921, 2573, 2274, 1183, -365, -1793, -2483, -2278, -1263, 190, 1694, 2496, 2319, 1346, -66, -1454, -2359, -2378, -1527, -96]
962i6J469R37L9q84j354j471r00k5P39J340J378R80J39p27j314j373r19j40O44
981a538J136J183J015L85m05j048j492j179n12N83J297J425J053K45o03j034j116
998f05r74m20K89R01J220J088N38l01r13j134j116n12J15P52J220J268O73j25
1016A964r79j368j166m94M22Q84J020P86N27J0m62q66j154r02j96N81J295J200
1034A102P47Op24j007j033p95j00N58J035J182P52K0o43r21r41n51j85K67O53
1053e78R56R58N50k92r53j285j044k21O81Q61J008P48J36l58n57r07q77l57J32
1072a399P26R30R09L97j95o07q22r32o08M8O28J048J058N64k93q24r09p35l23
1091a339K12M36O12P24O00J94l70q50r59p82m4O00Q81R15N07O2m65p75q15n82
$$ y = [-96, 1373, 2310, 2349, 1465, 111, -1360, -2260, -2285, -1546, -206, 1172, 2152, 2291, 1564, 250, -1123, -2042, -2182, -1538, -402, 781, 1796, 2181, 1776, 728, -764, -1943, -2455, -1872, -575, 850, 1903, 2148, 1545, 511, -605, -1579, -1999, -1710, -809, 411, 1499, 2037, 1736, 823, -311, -1427, -1939, -1824, -1072, 148, 1416, 2089, 1964, 985, -383, -1549, -2043, -1621, -737, 283, 1069, 1596, 1606, 1144, 278, -876, -1778, -1974, -1393, -98, 1102, 1849, 1855, 1131, 124, -909, -1704, -1804, -1246, -211, 971, 1723, 1743, 1100, 179, -762, -1313, -1498, -1231, -578, 378, 1336, 1886, 1594, 641, -644, -1688, -1909, -1228, -367, 641, 1389, 1525, 1167, 610, -297, -1174, -1531, -1399, -673, 257, 1166, 1563, 1368, 761, -61, -993, -1601, -1553, -925, 123, 1181, 1745, 1452, 628, -281, -1016, -1339, -1127, -691, -79, 645, 1245, 1439, 1069, 219, -740, -1522, -1566, -966, -85, 830, 1337, 1399, 934, 159, -656, -1238]
1111a238j50M80P36Q29N37Q6l91n95p26n92j86P8N26R33Q38L64l60p97r34n97
1131a159m5K97N88O28O12K00o8n02p46p14l77J78N86O99O40L98j45m78o71p63
1151h42m08J01N04P60P24L38j55m51o59n27l67n8L77M73P06N80J11m12o54p56
1171f15n30M8L59O68O25M01J27l36n76o05n31j08K96N39O12N44J41k78m64o01
1191b84n45k15J73N09O81N72J93k83m89n40n45j98J81L92N86N18K54q9l96n91
1211a16n80l08J50L85O31M99K72j19l91m70n78l09Q6L44N29N20L15Pk48n89n41
1232e11l29m0K90M92N58M14Jk72n24m74m39k7K37N35M08M12O0k00l49n29m25j90
1254i02K14M52N88M03J74k26m68m40m46j76J28M16M71M35J61j36l73m53l68k32
$$ y = [-1238, -1388, -908, -172, 657, 1194, 1280, 889, 294, -432, -1024, -1210, -1132, -606, 327, 1165, 1529, 1169, 372, -562, -1159, -1204, -907, -319, 309, 921, 1121, 1053, 551, -195, -909, -1286, -1108, -522, 177, 817, 1215, 1070, 592, -79, -842, -1250, -1149, -645, 115, 839, 1177, 1022, 571, -88, -615, -982, -1040, -663, -190, 516, 1096, 1207, 795, 141, -615, -1145, -1097, -738, -70, 555, 956, 1083, 747, 171, -434, -965, -1073, -777, -238, 374, 918, 1059, 781, 317, -284, -829, -1044, -871, -362, 319, 891, 1084, 801, 312, -228, -773, -971, -790, -398, 188, 706, 960, 871, 475, -116, -696, -1004, -854, -469, 162, 661, 933, 814, 423, -47, -625, -934, -848, -504, 25, 545, 860, 867, 619, 30, -511, -840, -880, -590, -98, 460, 874, 875, 603, 79, -395, -834, -861, -624, -89, 319, 731, 791, 591, 242, -287, -712, -902, -688, -236, 352, 755, 929, 703, 235, -205, -651, -827, -699, -283, 188, 623, 784, 648, 275, -178, -546, -778]
1274g78J19K91M45M43K82k6l47n50m73j46K1L27N08L64K49r6j86m45l75l61J0
1295g24L26L45M30L23M4k44m48l31l62q3K56L46M80K66J29k68m29l67k96o7J84
1316d90L07M63K58J30o4m07m04l73j45K00L85L63L48R6j53l06l77l06j68J02K70
1337b71M20L36J55j08k59l60l39k10P3K82L38L93J82k8k81l91l12k35O3K10L92
1358E0K77K16Lj83k84m26k61n6K41L53L45K56J13k29l29k99k35j27J31L29L49
1379B34K66J19k36k56l23l45k7J10K62L54K16J51n2k70l75k37j77J45K56L19K46
1400C80J26m9k18k82k65j60k4K94K43K98J60lk26l00k26k59L6J42L03K75K02P2
1422E19k26k60k87j56m1J61K64K64K08k0n7k67k84k10o6J18J60L51K43O6j33k60
$$ y = [-778, -659, -368, 77, 520, 802, 776, 429, -121, -594, -740, -719, -392, 116, 480, 729, 633, 447, 2, -373, -734, -724, -398, -53, 377, 700, 744, 500, 52, -279, -641, -724, -468, -122, 358, 624, 753, 485, 56, -311, -607, -674, -490, -183, 280, 538, 668, 604, 197, -207, -580, -725, -525, -140, 223, 571, 667, 514, 208, -169, -475, -643, -541, -271, 149, 485, 640, 532, 273, -87, -426, -636, -563, -281, 57, 450, 632, 604, 323, -68, -380, -615, -552, -342, 50, 327, 543, 546, 363, 79, -347, -608, -664, -423, -70, 275, 531, 644, 415, 86, -213, -448, -575, -444, -115, 234, 500, 619, 383, 127, -196, -541, -568, -458, -196, 158, 374, 525, 473, 203, -172, -409, -586, -441, -185, 134, 380, 506, 457, 239, -43, -308, -468, -492, -198, 45, 343, 503, 500, 274, -26, -252, -511, -475, -333, -30, 245, 447, 519, 293, 33, -254, -410, -451, -290, -26, 238, 446, 426, 369, 102, -182, -392, -458, -340, -180, 171, 414, 480, 347, 87]
1444H7k76k45j3Q6L07J80K36J22j01l09j84k13o2J3K09K45K26J18p9r2l65j73
1466b83j12M3Q5L40K45J07m7j31k93k23j17l4K08J84K71J03J5j68j54k33j17j30
1488d41J22K78K29J83N2j50k50k63r7m5J44J56K35J19Q1m7k32k23j76o7O5K13
1510a14K31J40J30j16j40j85k56j10R0J90K02J89P7m4j47k19j34r5m0J78J66K42
1532B35P5J5j42k37j80p1m6J97J87J48J58l8j40j51j95j24N0N8J23K03J57j6m6
1555B20j62j70j88l8Q6J78K23J06N2j40j51j51q3l5N5R7K10J34N5j02r9j89j10
1578b02j18N5J13K08J63N7K4j69j90j80oK1R2J81J38Q6k1j04j82j41j05P8L6J66
1602@J16R2M8j38j34p4j64J9J13J19J76N8J2r9j18j56r6L9pJ59J20J05K8p7q5
$$ y = [87, -189, -434, -447, -361, -54, 126, 362, 484, 383, 74, -110, -323, -385, -372, -163, 82, 308, 426, 347, 255, -110, -283, -395, -352, -267, 73, 318, 425, 378, 247, -46, -269, -386, -420, -212, -28, 243, 346, 361, 193, 39, -194, -311, -441, -319, -41, 188, 371, 423, 273, 23, -240, -337, -382, -238, -82, 153, 272, 353, 306, 74, -149, -325, -392, -327, -114, 117, 257, 387, 271, 131, -54, -310, -420, -330, -140, 62, 251, 328, 284, 137, -82, -216, -311, -351, -173, -7, 235, 310, 325, 183, -54, -234, -305, -351, -154, 33, 181, 339, 301, 161, 10, -185, -309, -259, -201, -78, 125, 282, 266, 220, 58, -112, -300, -338, -252, -74, 149, 255, 307, 167, 16, -135, -218, -253, -198, -101, 109, 243, 298, 196, 97, -92, -202, -320, -265, -152, 56, 219, 276, 300, 131, -59, -239, -245, -224, -132, 49, 187, 273, 252, 148, -34, -175, -280, -202, -166, 0, 116, 208, 256, 118, -16, -90, -254, -235, -122, -3, 173, 231, 243, 144, 26, -130, -226, -187, -194, -35, 85, 190, 218, 141, 56]
1627E6j37j42P0oJ19J34J28rl2o6j87j36k0J23Q0J15R5N5j10n9j05j56pN2N1J14
1653B0R4J5N0o8j47j33j6n4J21J55R6N2K8m4j96o9r4O8O4K9J29P6Lo6p9j43%m4
1681a53M5J06R0O8nqr8j26l6q0P4J21J20L0Kq1m2o4o9k8p5J16J33J03N3o8r2q9
1709e3j25O0J3J30K5R1Kj7q8o5n3j7l3M7Q7Q6L3n7l0J2j58n7M8M2P4R0O5n0l6
1738F6p1jj29Q1KQJ26J1nJ3l8j41m3M3%O3Q1N6Po8n5k5j24N1J1P6O1M0oJ2j6m7
1770C9o8Mo8L4R6P8ko5o0n2J8j9K2PP3M4j9R6r6q0o4k1LP5L0Q9m0L8q6l6r7k6
1802a53P8Q7J4O9L2o4m9l1k1m4J1K9K0JR3mK4j41p5kO0K9L6Q7M2j04Pl8p0J9Q
1833e0J6J0J06mn9K8J0j07n2l9J19K3O1N5l5n6p1j2n6O2J2J6L5L5Q8j20N4n9k6
$$ y = [56, -81, -223, -153, -159, -40, 94, 222, 213, 181, 115, -72, -208, -228, -105, -25, 90, 185, 240, 130, 71, -34, -190, -197, -145, -94, 20, 114, 129, 179, 111, -36, -169, -185, -239, -118, 37, 133, 185, 213, 169, -27, -96, -190, -122, -58, -29, 100, 176, 179, 113, 34, -109, -109, -153, -108, -2, 88, 156, 151, 143, 45, -81, -117, -197, -123, -2, 118, 148, 150, 69, 27, -37, -106, -134, -209, -93, 40, 143, 196, 128, 36, -53, -178, -118, -105, 25, 50, 141, 143, 126, 38, -27, -80, -97, -130, -83, 4, 90, 123, 66, 36, 48, -110, -167, -119, -77, -3, 87, 152, 102, 66, -5, -6, -135, -54, -52, -44, 82, 93, 88, 101, 63, -78, -121, -78, -78, -15, 66, 122, 129, 61, 6, -19, -143, -92, -81, -5, 56, 96, 90, 102, 86, 39, -29, -25, -93, -59, 37, 115, 113, 48, -12, -64, -46, -65, -43, -36, 37, 81, 62, 158, 62, -18, -82, -103, -100, -25, 5, 94, 54, 92, 6, -30, -127, -153, -75, 12, 26, 95, 127, 63, 14, -17, -38, -82, -71, -42, -22, -21, 72, 68, 92, -49, -124, -126, -66, -37, -1, 86, 128, 24, 31, -7, -77, -58, -50, -34, -24, 82, 78, 19, 47, 57, -50, -102, -141, -22, 1, 62, 117, 82, 26, -45, -57, -113, -51, -39, -23, 12, 47, 135, 15, 69, 10, -16]
1862a6q2Q3j1QO1K2J3m5q4k1QM9N0J9K0m0J4m9L5n2l2j7L1N5P5m6J6or9ok9M6
1894c0RK3K8j8L8n9K3o8l3K8l1J27QRL3n9j2o7l8nJ09k9L9M8j4o7K4m0m6M7J3
1925a0k9K6N6L0j8j01jPk9M7J02J4p2M0pp9j4m9K8PN3L9K0j1o6n0K0K7m4L5K9
1956@M3N7l5l2o1l1%O5m7KM5N7m5nJ0k2p1k3M2O6N3J3j3q9k7J3%l5K4J3K1M9k2
1989A5Nm0L4l7J5n5K7K6L6M7m3K5o9m3JM5P1l0k2Pn7P4Lj4j36L1L8P1M4MMn6j14
2022i3J10j25M4LN8M9k8Kj5m1qM2ll5L5nN3K0q1K9o3l7L2M6N5L0p3O5l1l5l1m
2054c5J6k3J6L2K7l0O8o0rj4n0%l7J33NK9%r3r2N7O6K8n4j0L4J4Kk3L5j6o9j4
2086f7N5K9L0jl1L6k0m4n9rJ20k8K0l2M2o5k9O2%l3j1K1L4jL1j9p3M8l1l0K1J6
$$ y = [-16, -98, -15, -26, -18, 43, 65, 78, 33, -51, -72, -64, -15, 35, 54, 74, 34, 48, -1, 34, -18, -50, -67, -36, 19, 94, 48, 64, 58, -41, -47, -76, -30, -21, 2, 30, 12, 50, -9, 14, -54, -87, -59, -90, 37, 45, 54, 87, 28, 16, -51, -89, -94, 15, -14, 25, 73, 59, -8, 16, -24, -70, -23, -10, -39, -13, 43, 73, 55, -46, -47, -40, -69, -22, 80, 94, 22, 62, 55, -24, -38, -87, -59, -52, 1, 40, 60, 49, -17, -67, -47, -20, -64, -29, 0, 43, 100, 65, 33, -28, -59, -59, 6, -41, -39, 6, 63, 18, 13, 23, 1, -70, -93, -51, 15, 68, 81, 68, -21, -48, -35, -35, -70, -46, -33, -12, 37, 15, 20, -20, 14, -23, -8, -63, -36, -10, 26, 73, 30, 55, -14, -57, -56, -11, 60, 30, 8, 15, -42, 32, 35, 21, -115, -84, -46, 25, 69, 73, 77, 21, -93, 17, -108, -64, -61, -3, 46, 18, 20, 5, -36, -44, -2, -5, -40, -5, -10, 43, 63, -18, 11, -52, -89, -57, -11, 44, 74, 1, 66, 35, 0, -31, -35, -19, -42, -26, 6, 33, 3, 71, 11, 2, -12, -62, -62, -99, 34, 39, 68, 68, -25, -117, -60, 6, 34, -20, -30, 4, 18, 20, -3, 32, 16, -53, -67, -12, 17, 47, 46, 15, 51, 31, -13, -72, -81, 39, 11, 31, -1, 41, -24, -53, 9, 9, -24, -35, -14, 20, 19, 50, 31, -42, 6, -25, -55, -34, -18]
2118a8J34o7J6k2k7r6O7nJ9l2N5J8n6N6j5n3L5j43J20K4K1M3j5l1j8l5Mk4M6Q
2148Il5L6Q0o6j9k3Nm3j1N7J5J5QM9q1k4k9j2j3L4J8O1l3N7m5L2j1p6oK4K9KO
2181A0L0J4p4o1L3MJ5L1P0m9J8l6J7mk1n0j2P7kJ1j5M1ro2L0p5K6K9L1K6m3qm
2214a2K0n5L1k0M6KrJ2N6m1m4m1lR0n2M1lL5J1l7kp7l6P9j2L0l2Q2jn7Mrn6m3
2248a03J07J3nK5J4l5l3o4Q0o7K6N9kJ8Lk3k0PQLm7K2L2L3rk0J8l3l0l6M8J3N5
2281E7ln1Q0o7Mq0RqQ4J5k2P5p0Kp0n7O6L2J0l5O5rM4l2Qq9PO8p0N5J2O6k0m6
2315C0mq7LK2qL8P4o7L4k8j8k0j8J5k9J3Q7M2J0k4p8n2nL6k5J14Q2o6m0k2L6m2
2347Cj6k4%M0pPR9l6o5o5PrM4J1K2j4O3j7o2k4j6rM9J1j2P4L2k7n6k7K1j09O6
$$ y = [-18, 116, 49, 65, 43, 16, -80, -13, -18, 1, -31, 24, 42, -14, 42, 27, -26, 9, -134, -14, 10, 31, 74, 59, 28, 10, -25, -21, -45, 1, 9, -26, 10, 90, 24, 5, -18, -13, -56, -67, -10, 5, 20, 28, 77, -4, -28, -57, -69, -82, -48, -30, 31, -2, 55, 10, 42, 31, -45, -51, -27, 2, 4, 10, 40, 54, -20, -81, -48, -44, -29, 2, 72, 23, 41, 5, 22, 18, -3, -53, -65, 12, 10, 21, 6, 47, 38, -24, 6, -69, -43, -14, 17, 43, 0, -8, -12, 8, -47, -16, -36, 10, 12, 3, 15, 71, 30, -14, -55, -58, 32, -20, 21, 18, 53, 64, 27, 25, -52, -88, -9, -21, 9, -23, 59, 58, 1, 5, -4, -60, -103, 4, 17, 12, 37, 51, 16, -17, -81, -1, -68, -42, 17, 15, 33, 36, 13, -7, 0, 8, 11, -36, -14, 18, 51, 42, 22, 40, 7, -23, -59, -11, 2, 57, 54, 3, 83, 16, 20, -60, -51, -59, 25, 40, 18, 93, 23, 25, -45, -102, -36, -4, 6, -29, 36, 27, 71, 39, 47, -42, -35, 33, -37, 18, 30, 96, 76, 30, 26, -61, -58, -36, -44, -6, 68, 1, 35, 7, -11, -31, -49, -34, -63, -50, 37, 79, 89, 65, -13, -65, -70, -34, -59, 55, 137, 71, 31, 9, 45, 3, -13, -37, -37, 3, -4, 3, 102, 66, 1, -64, -57, -66, -22, -11, 11, -3, 60, 43, -19, -43, -59, -68, -19, -8, -20, 54, 86, 59, 3, -24, -3, -112, -46]
2380d6L0j0N5JM5r6J6j2j0QRK8K9L2j9l5m3j0J7p7K6K7M0N1N2j25k7K6J0k3k0
2411e1NP3%lqk1ml0p%K4J16p7N9j8l1q8K5K3j8N7n2R1k0j1l4l5nk4P6k9k3Q6m0
2445FN0L3q0l2o5P6pmK6Q2Nq2rq6N5lk7J7J17m4K8j02mL4k0K9m2M4L5j1J6K2p7
2478b0l2J9j0j2P5k3N4N7Oj21k8Jk8J3K9rR6lj5pj52O7J1j7M9K3M0Km9L3n0PL
2511Ik9N3m1Q3J9n3m7n9JkJ1O3K8K7k0J3o0j1mll4L6M0K1M3j6lo1o0J1K5j7MR3
2545F0k7J1j2q2K8p2R9J4q8Q0L9j9L4k6k2m5j5nM7nN3j3K6mj3m1k9k2M1L8M2n5
2577A7K4l6J8n3kJ0j8J9N6k0K2k7o3M5m5J0J3qR0K7o1l2k4N0k0j5J3JNL4k0m2
2609c2N9l3o6J8K6L4l2O6J9n6K6l1p8j3M3J01o1Plj4N9p0J3k9O9k2nL6J3L7q9
$$ y = [-46, -16, -26, 29, 30, 75, -21, -5, -17, -27, -19, -10, 18, 47, 79, 60, 25, -18, -28, -11, -88, -62, -35, 5, 56, 108, -17, -44, -18, -8, -31, -51, -46, 27, 27, 24, 16, -5, -9, -39, -46, -46, -22, 94, 17, 76, 58, 27, -61, -36, -13, -31, 26, -26, 65, 45, 34, 0, -35, -40, -64, 12, -17, -40, 46, 6, 56, 89, 9, -23, -88, -12, -19, -23, 3, 85, 90, 8, -1, -87, -32, -35, -62, -45, 72, 28, 56, -46, -50, -16, -36, -7, -49, -5, 30, 19, 35, 57, -20, -52, -33, -43, -55, 20, -3, 51, 108, 114, -7, -35, -34, -62, -49, -20, -29, 67, 64, 49, 42, -110, -43, -32, -49, 0, 23, 63, 65, 16, 49, -1, 6, 9, -20, 33, -8, 75, 94, 41, -6, -65, -64, -66, -55, 8, 36, 63, 43, 56, -4, -15, -19, -22, -56, -20, 20, 41, 84, 68, 65, 4, -56, -45, -20, -37, -33, 60, 33, 44, 32, -50, -22, -94, 5, 19, -69, 11, 50, 31, 65, 39, 17, -28, -43, -48, -1, -6, 47, 34, 60, 56, 43, 2, -27, -49, -8, 30, 72, 17, 41, 5, 23, -30, -32, -22, -40, -21, 35, 15, 37, 10, -53, -8, -53, -43, -30, -38, 52, 79, 18, -14, -38, 12, -8, -23, -10, -9, -4, 30, 10, -32, 27, -6, -72, -54, -28, 6, -26, 40, 59, 3, 29, -2, -80, -93, -50, 51, -10, -3, -6, -20, 39, -31, -18, -47, 22, 0, -5, 31, 44, 81, -8]
2640hqk7nQ2q6R3j2K8l7Ln4j5K4J2J2k9O8j1K2M3j02m8K5JK3j9M1N6j3l0Lm1n4
2673f3M0L9rL3J2J3qp4L0k7%j3QmL8J1m3L0l0jk6M9j5j4Q3l5l0K0l3Ok5l5R6L
2707B6k0O6Kq4j6l5K3k1P4k0qN3J7m8kp9R9j0l8jK9N6kj6q2Mj9k5P7K2o7M2Q0
2740G7p0Ln1J4o3R2J0j7M7n7Prj6L2nj0PQN5RJn1k9j6Lm9M0O5J2N1k0k8l6L9m7
2775bm7M8L3j5M9J1o6l2j8M6q3Q6n4M1J1k4J2m7L4m6O4m2K0K6L0J8k1k2j2k2J1
2806a3k2M9L8j2j7lm0k7j%K3k9J05Rk0j8j8om1J3J1pK8L4m0J5jm0m4PM6PL8j2
2840A2J1Qj2j2n2poL5O7m3L9K0l6nn5L5n1M3L0P3q3j5P9j33N6m0lM0M4qk7N0n1
2873CK8o4rk7M8lRM7m4mM1r4M7n1J4P4K4PK6p3L7n0J7POm2L2J9Koj0L1m9l0j1
$$ y = [-8, -16, -43, -48, 34, -52, 41, 29, 57, 20, 23, -31, -46, -22, -10, 2, -27, 41, 30, 52, 95, -7, -55, -30, -29, -6, -25, 16, 72, 59, 29, 32, -9, -63, -23, 16, 7, 40, 52, 65, 57, -17, 13, -14, -14, -27, -19, -23, 15, 26, -17, 13, -17, -18, -44, 5, -10, -24, 59, 24, -6, 14, -19, -13, -38, -73, 23, 26, 6, 72, 74, -10, -26, -61, -38, -59, 15, -5, -13, 40, 57, 9, 7, -72, 27, 17, -21, -22, 7, 63, 61, 45, -37, -33, -52, -77, 0, 22, -45, -3, 77, 7, 10, -41, -27, -90, 2, 12, -5, 42, -15, -8, -17, -33, -1, -6, -16, -9, -1, 54, 63, 64, 13, -16, -32, -29, -78, -38, 27, 39, 90, 70, 42, 6, 45, -2, -49, -1, 32, 17, 66, 77, 11, -21, -39, 7, -76, 10, -44, -3, 8, -16, -4, -51, -17, -63, 1, -41, -21, 5, 35, 53, 32, 10, -2, -24, -13, -35, 14, 52, 40, 23, 20, -20, -47, -48, -48, -25, -54, 51, 60, 40, 22, 4, -2, -43, -30, -19, -26, 2, 36, -4, 11, 10, -30, -74, -67, -21, -14, 24, 12, 23, 31, 19, 7, -45, -52, -58, -23, 44, 1, 40, 60, 24, 19, -36, -1, -52, -9, 21, 94, 11, -4, 75, -58, -2, -42, -45, -5, 39, 31, 4, 54, 3, 31, -33, -42, -69, -21, -24, -15, 32, -12, -16, 25, -69, -22, -73, -59, 15, 39, 46, 72, -1, 36, -14, 3, 10, 16, -26, 6, 25, 27, 21, 11, 42, -7, -37, -48]
2908d8O4%kK2m2rL0m8k8L7Rk5O8k3P1m9k7Qm2J2kM9M1m3j5L4m7l1JJ2LQ0p1L2
2942B1k0nj6L0l2Qm5O0j5K6mk5J7j8K0l1J7J2P4n0klj4nl5NMNO7n1OO6n3k3j3
2977b2JM2o1L5J0q6J08P0j01j2k6J5J7K7L1l3N0k9j4j7J5k9l3M9J8J6O7j47%K3
3007a6q4K6Q3j0K0PM4l4l1L3r8ON0l7J8L5L2ok8l9j3P8o1K6%k0K1J0J2k6K3j2
3039Il1OK6L7j5l9L6Oj09L1%N0k7O3m6Q8p1Ok7j3nNL6qK3Ql5J9l2n2L8k2M4K0
3073A9j9K9K5j9q5M4ok7N0J2MJO1m6q1j8QP4k2j8oJ17m5m5j1L9r5RM9m0J14p8
3105fM1j07O8Jlrj4K9L1j8K4m4jo0M9J0mk6Q1k3nJ9m7J0l3M1qP0l5J9Mm7j5J7
3139Ik6m3K5k6N8K0J2J1j1o2M3K1K2l6j2P0Jo6j8k0m8N3%l4N6N5p3L6m2M4q8J5
$$ y = [-48, 16, 16, 14, 36, -6, -15, 15, -33, -61, -24, -15, -40, 28, 5, 76, 27, 0, 8, -34, -22, -24, 25, 66, 23, 8, 42, -5, -36, -35, -23, -20, 60, -11, 21, 1, -4, -20, 10, -22, -14, -59, 1, -14, 12, 8, -17, 0, -18, 2, -29, -12, 0, 74, 24, 22, 19, 5, 0, -35, -30, -26, -21, 46, -5, 1, 67, 14, -9, -22, -21, 21, -40, -5, 5, -81, 27, 97, -4, -16, -42, -27, -10, 17, 48, 15, 65, 36, 22, 5, 20, -9, -42, 7, 25, 41, 108, -39, -39, -16, -100, -74, 9, -1, 19, 26, 70, 36, 5, 38, -60, -54, -4, -41, -23, 12, 44, 38, 10, -29, -42, 36, -25, 1, 1, -19, 2, 12, 24, -2, 21, 9, -22, -16, 10, 47, 32, -7, 29, 35, -74, -43, -43, 7, -20, 43, -3, 85, 14, 20, -7, -20, -25, -20, 16, 8, 31, 39, 4, 23, -9, -61, -23, -45, -1, 19, 0, 29, 54, 35, -50, -6, -12, -39, 11, 23, 27, 28, 89, 43, -38, -56, -48, 26, 4, -14, -20, 97, 52, 7, -4, 35, -60, -51, -2, -42, 72, -6, 35, -72, -4, -3, -6, -15, -29, 0, 31, 13, 37, -7, -8, -68, -19, -9, -13, -39, 42, 19, 14, 33, -14, -4, -37, 4, -4, 66, 31, 50, 54, 7, -8, 9, -17, -60, -35, -61, -3, 17, 29, 40, 29, -33, 10, 31, 53, 17, 5, 75, 76, 10, -8, -28, -76, -23, -23, -57, -1, 54, -19, 17, -25, 19, -69, -54]
3171e4J6J8m1P1M4n4LjK0n3M5l3K1%%pJ02o5l5o3L6j8P5j4P9m1j8k3l8K2lm0L4
3204a5J4L5K9j9k1q1M4qPn4J01K3k4l3rj6j7J5l3R1K9p5N2j8j0L9p4OjK2L5l0
3236DN6q0jM1l4K1J1j19P8M3n3O5n9M7m3K8n7L7K3PL4k9nJ4k3j6J4J3o0L9ll1
3268c8O1l4mj2p0R1J0J3l1P3l3m8K4Rl3k7Q7JM2m9m6Mk1k2L0L6k5j5J01k9Nj7
3300C3O4o9j7m7PO7l1KN1nl2l4k2Q2l5n4P2M5k9J1l6l1l1L0l4L5K1nK6m9k6M8
3332Gj6J5m1K9j2K5K3l7L5l3RlK1o1J3Pl7J20p1J8lk6k4L5j8K5l0L5PMJ3n4n4
3365g9P7L7m2L4m4j3qO6p8N0l2pJ05p0M7p4M6k6m6RJ6M4K5j6jm0L6K5m9l3K4K3
3397Fj7N0K3m5Jl7Nj9L9kL5mNk1n6N8o9l5M7P4n5J5jN4o3J5J0Pk7omO4k3k3oJ8
$$ y = [-54, -38, -20, -61, 10, 54, 0, 3, 2, 22, -31, 14, -19, 2, 2, 2, -5, 97, 32, -3, -66, -30, -48, 27, 13, 92, 51, 33, 10, -28, -6, -9, -49, -15, -1, 34, 63, 44, 23, -58, -14, -22, -15, -69, 32, 55, 31, -2, -11, -27, -44, -29, -62, 29, 58, -17, 35, 17, 7, 46, -28, -22, -23, -1, 34, 4, 60, -20, -21, 20, -14, 7, 18, -101, -23, 20, -33, 32, -27, 20, -23, 5, -52, -15, 8, 15, 49, 20, 15, 29, 6, -10, 4, 17, -43, -4, -7, -38, 23, -11, -15, -27, -97, -6, 4, 17, -14, 59, 26, -22, 2, 11, -22, -49, 38, 39, 81, 32, -14, -10, -31, -53, -23, 13, -12, -27, 74, 45, 50, 33, 97, 28, 11, -36, -29, 38, 7, 9, 60, 55, 23, -11, -33, 49, 14, -40, 32, 77, 48, 59, 23, -8, -39, -9, -43, -8, 13, 8, 34, -15, -41, 7, -9, 6, -35, -6, -18, 7, 30, -7, 28, -5, 4, 1, 22, -39, -26, -19, -56, 64, -7, 11, 8, -18, -42, -7, -25, 0, -30, 5, 12, 16, 29, -25, -79, -2, 35, -7, 27, -17, -30, -38, 28, -50, 0, -32, -39, 66, -4, 43, -31, 15, -11, -57, -48, -32, 12, 37, 21, 20, -20, 16, 41, -8, -41, -17, 6, -11, 39, 62, 17, 18, -19, -14, -33, 6, 4, 39, 35, 40, 19, -37, 21, -48, -83, -36, 38, -17, -2, -3, 51, -12, 3, 13, 20, -7, -13, -17, 47, 24, 1, -5, 13]
3433A3Pn0L6qM6m6M7k4j6j8J9j4k4J1kOM4RN1p6No5pO7j1Qkj2N6j5k0jp9P8l5
3468b2L3j8M2J7o4%n9M3n9R4m9J04ko5M3l9l8L5%k5Q5j00P2j3K3n9J1k3K0N0m2
3499eP0j3o7O9j07KOK3K5NkJJ1J0p4J13q2KK8m6K1J8K0J8n9k3K2m1L9L7j3RNL0
3533E2q8K6Rj9K7j9K8k0pK7j8M7Jm9m5L5K0Jl0O5r2L0ol9N6orK2QO2j0k2l3%O
3568A0j4QJ7K6l5Rmj6n3O8l9M4k4J9%OJ8on1m8P7Qj3pJ1m4L4j6j2K9l0M7j3lM6
3603D9Rp8K0l2K3j9kL2Jl1N2JmJj8Mn5O8K5K0r1J9K4k5P1n9m0j8RK6j1N0o2J9
3637b2K1K2q3J04n8J6K3Pj2j1%m3L2l4J7N6l2N3k9o1L3j2L3m6O0J0p9O6m5K5n
3668FL4Jj11J01k5j3L7Jl3k0Moj2M8K3q2N2L6m0k1l3J4j3J13o3L2K1n8m3K6N2
$$ y = [13, 20, -30, 6, -2, 44, -2, 45, 21, 5, -13, 6, -8, -32, -21, -23, -17, 27, 36, 87, 11, 16, -49, -56, 11, 0, 8, 6, -6, 50, 35, 15, 14, -65, 13, -22, 11, -7, 35, 52, -12, -12, -71, -28, -87, 7, -42, 62, 60, -5, 38, -1, -39, -4, -4, -29, 56, -44, 28, 15, 38, -21, -10, -33, -13, 37, -5, 65, 52, -15, 54, -53, -51, -45, -22, 3, 8, 6, 7, 18, 28, -46, 67, -15, -13, 15, -31, -10, 8, 28, 46, -13, -36, -14, -55, -16, 21, 8, 17, 22, 52, -36, -10, -1, -20, 7, -12, 16, -4, -11, 16, -2, 45, 46, -3, -48, -13, 7, 8, -22, 43, -49, -19, -25, -64, -8, -14, -23, -1, 7, 69, 59, 37, 4, 4, 10, -4, 4, 21, 47, 12, 21, 17, 1, -52, 16, -23, 21, -3, 16, 16, 22, 40, 34, -17, -65, 12, 20, 7, 0, 11, -33, 1, -15, -27, 2, -28, 19, 6, 3, 49, 58, -20, 0, -32, -9, -28, -30, 2, 3, -28, 24, 25, 21, 22, 4, 8, -47, 21, 46, 66, -25, -6, 18, -7, 64, 5, -35, -53, -44, -18, -29, 21, -41, -22, -1, 21, -62, 42, -16, 0, 23, 30, 18, 7, 7, -36, -4, -38, -21, 35, 3, 56, 27, -34, -1, -13, 20, -26, 34, 44, -35, 31, -14, 11, 6, 40, 41, -70, 31, 6, -7, 30, 31, -2, -22, -18, -24, -36, 12, 35, -47, 5, 41, 1, -20, -53, -39, -52, 61, -2, 30, 51, -7, -50, -24, 28]
3699B8Nm0K8o4O5j5Mk9M4m6n6R5p2N3lM8j1m2j4P1Rr9KN0Ll9j4K8JL4o4M6Kjk7
3734b0K3L3q9J02j02L8l8O0M9q0M4M4l9n4L4L6p8K4oK4N7q9L8l6O4k0m9M5J9m0
3764fNk5LJ01r8J8J5k0LK2mk4mLJ2j5MM5m4jLJ9m0J1j2nP6q6K8RM8n1J4l1qJK5
3801il2P4o2P9k4l0kJ0J8qK1Mr6M0L6o7L2J1j3jk2M5J7J2m5L3j4j0k2K4J4j9K8
3834B2l8L2l6O3m9N7q5K0J8N5o2Ljj7klJ8k8L3j9K0mnpK3O9p6Opk0M8%j7nk3M9
3870C2j1k1MKljj6k0Jk8P3j4K2j8j2PJ7j6n0O4l1NO%L4o3J4M3l1qJ5J1Nj2J2O
3906A8Ko9P4Kk1o2L5j6k0P6j9M5k2l4k8N5j2m6LjL0J8J2m0K6jj7mM2ln7N0j6j1
3940a1o1N3j5K2j3J1L9l5J6m9J05o1J9J5o0M1J5p9P7n0nL2j0j7j1P0p5N0r4R4
$$ y = [28, 33, -7, 21, -43, 22, 7, 11, -18, 26, -20, -76, 19, -53, 0, -3, 45, 34, -8, -22, 49, 58, -41, -39, 11, 14, -25, -39, -11, -10, 24, -40, 6, 8, 7, -20, 3, 36, -53, 49, -53, -15, -53, 7, 56, -24, 20, 64, 25, -29, 5, 41, -37, -13, -19, 5, 62, -27, 11, -25, 39, 19, -30, 15, 34, -6, -1, -26, -23, 78, -20, -2, 13, -7, -4, 18, 14, -10, -14, -11, 1, -14, -10, 35, -9, -10, -7, 12, -28, -17, -29, -34, 42, -44, -16, -7, 41, -10, 4, -27, -35, -34, -9, -41, 33, -29, 50, 26, -4, -6, 4, 22, 14, 35, 39, -57, -17, 19, -48, -16, -5, -18, -19, -41, 4, 21, 33, -12, 21, 7, -3, -25, -1, 13, -6, 22, -16, 16, -20, 43, -6, 51, -34, -14, 4, 59, -3, 0, -1, -18, -20, -23, -5, -33, 0, -19, 1, -3, -8, -15, 8, 77, 1, 7, 0, -20, 28, 28, 11, 6, -17, 32, 21, 0, 4, 6, 3, 2, -14, -34, -33, -61, 12, -2, 20, 2, -10, -3, 14, -2, -52, 12, -19, -14, -8, -8, 26, -37, -23, 20, -11, -19, -4, 7, 12, 0, 12, 18, 20, -49, 25, 27, 6, -56, -21, -37, -57, 19, 0, 45, 23, -11, -39, 16, 4, -42, -39, -40, -10, 8, 20, -20, 6, 5, -12, -16, 26, 23, -34, 16, 0, -11, -72, -19, -34, -12, -25, -14, 25, -10, 6, -43, 62, 1, 20, 35, -25, 16, 31, -48, 29, -21, -26, 6, -4, -21, -32, 38, -37, 13, -81, 13]
3970A3l5OJ3k8M4k5j9J6j4L9p0Q3m3J3p3J19k9L4j2q8L3kL3l2j6L7Rj3Np0Q7J5
4002C0j3lk1jK7p6N1Nk8kM5Kk0k6nN8Pn3P2k0K2p9P9l2L2o5m1Q4Nl0L1k8o1K7
4036b7N8n0J8J3m0N0q7M3K3jj0orj1Q7o3j5k3K5L6j5m9O6jJ3k4qK2J6o9J4P6l7
4069A5l2L1l3KqM7j5K4l8K1K4l3Oj8K0lRl9KQj1j7M2j1k3N8j20P7L7k9rN1j9L6
4103E2m4j0K8k6l5M5o4M9M8m5P2q1L5j1K7k7k4l0N5n1N0lj1Okl5O1k9k1K6n5N0
4135@kM5j8ml3J2o3J36j42J28q9K1N8Mo2kl3L5mQ0o1l6oL5Rn1O0Qll8qP8n9o5
4169g0M2P0n7Lmj1LJ0J1lQo0O9R3m2m8Ml2M8k5n0J9kk1P3l5K7J8mn0OM0j4j7l7
4204c8K9L0K9j1n7lN2lj9J1L2p2K1kk2OLK4j5L5m0K1oRL2n1M9k4N5p9M6k7l9K0
$$ y = [13, -22, -16, -3, -31, 13, -12, -31, -15, -29, 10, -60, 23, -20, -7, -80, 39, 10, 44, 32, -56, -23, -25, 8, -24, -40, -3, 6, -7, -2, -72, 15, 30, 17, 14, -7, -8, 19, -57, -6, -1, -29, -31, 14, 16, -4, -30, -35, 23, 30, -23, 49, 29, 51, -28, 51, 19, 51, -14, -55, 29, 34, 4, 35, 7, -54, -27, 31, -19, -1, 12, -28, 22, -65, -22, 1, 0, -10, -16, -25, -36, 51, -12, -27, -50, -25, 11, -4, -53, 13, 12, 25, 1, -7, 15, 31, -38, -24, 52, 15, -17, 14, -19, -17, -25, 22, 7, 31, -7, 14, 38, 5, 11, -7, 13, 10, 19, -20, -18, -10, -21, -38, 4, -7, -30, 28, -92, -15, 22, -7, -16, 35, 16, 52, 8, -2, 26, 0, -35, 10, -54, -5, 43, -2, 70, -11, 24, 13, 40, 13, -11, -41, 14, -37, 13, 10, -1, 5, 3, -32, 29, 0, -21, 5, -50, 0, -2, 43, 25, 21, -12, 0, -63, 73, -69, 59, -30, -9, 49, 53, -9, -11, -44, -9, -13, 67, 6, -30, -36, -1, 8, -43, 17, 25, 22, -16, -24, 54, -5, -70, -28, 42, -15, -12, -16, -27, -24, -14, -3, -6, 2, -58, 11, 104, 62, 14, 18, -14, 34, 9, -41, -22, -24, -45, 28, -7, 20, 38, 34, -16, -10, 30, 16, -1, -38, -9, 21, 50, 39, -18, -21, 31, 28, 9, 20, 52, -20, 1, -1, -23, -17, -14, 10, -5, 30, -10, 11, 5, 14, 46, -5, 44, 20, 75, -4, 42, 15, -24, -4]
4238dJQOQJ9j9l8L1pj6k4M1K6K5p5l0N3l9M7k5jL9n1M3k2J4p3Q7%k1m8L9jJ2R
4273A4k2J2rLRl1OML4Mn7L4MNQn2L9L2l5LNQm9P9l1K6j3n3O1Lmo5M1j0j8MOJ5
4311A0QK5n1K9o7J9M3JK9L6n4m9J8K8j3%j3k1l6J7K9k1N7J0%k5n5Q2k1m5K5M5
4343D0m7J6n3N5l1N7j7o9N6M2n9K3ql8j0PP4kk9L2L2p9N1q7J3KK1j2K0%QL8l3
4376A3n2j5N7k0k7N5l0L6Mp6N6J8p1L2L0jK8l5L7o2L8M6j19O6j3Lj6lM4j9J2n1
4408c5rN4L3o7O3o6N1K7j1q3L3l4J4j4K4M8o9lP4k4k4O8l8nj0j5K9mLnM0o1K4
4441Hj9KM9j7l0k2JK4M0j09L8L1O9j01l0Q9n7K6M0m8L4j9L8o3j4J0M9j9J4K1%
4472C5J6n5KL8p4Q5p8j7O5r7P6K5k9jJ0J2k6oMlk3N5k7JL9%j0j8K4p0kP7j1Lk
$$ y = [-4, -3, 5, 11, 19, 38, 19, -19, 12, 5, -11, -35, 6, 32, 57, -18, -48, 5, -34, 13, -12, -13, 26, -25, 18, -4, 10, -63, 24, 24, 3, -45, -6, -7, 5, 14, -8, 4, -5, -2, 7, -24, -18, -14, 20, 24, -33, 1, 5, 10, 18, -34, 5, 37, 2, 5, 10, 18, -31, 48, 17, 43, 30, -23, 38, 41, 37, -28, 13, 3, -15, -11, -5, 10, 18, 43, -8, 21, -46, -27, 16, 17, 46, 82, 28, -21, -3, 25, 12, 12, -1, -22, -58, -41, -12, -33, 24, 34, 34, 9, -46, 36, 15, -30, -5, 40, -7, 9, -44, 11, -20, 37, 20, -49, 7, 49, -10, 13, 5, -33, -43, -36, 38, 36, 7, 39, 71, -8, 43, -44, -31, -29, -8, -20, 0, 0, 8, 46, 13, -39, -54, 3, -17, -44, 11, -19, 17, 21, -55, 1, 19, -52, -20, 10, 9, 37, 2, 39, -23, 15, 61, -58, 8, -5, -2, -18, -21, 23, 4, 16, -35, -44, 10, 43, -24, 39, -27, 24, 51, 40, -43, -10, -44, -30, -44, -20, 28, -41, -44, 30, 6, -18, 50, 12, 7, -3, -18, 11, 7, 10, 5, 45, -16, 8, -11, -9, 40, 23, -7, -29, -28, -4, 36, -73, -35, -4, 65, -36, -66, 23, -34, -8, 32, -16, 18, -1, 37, -26, -40, -30, 19, 0, 14, 35, 35, 51, -4, -2, 36, -38, 47, -31, -48, 17, -80, -4, 21, -8, -9, 1, 13, -13, -19, -15, -18, -41, 14, -13, -12, 27, 27, 17, -1, 23, -47, -49, 28, 17, 20, 18]
4507A8qk8M1l7k4LN0m4jN0J1k3j9LKM1m6J5J0k4L2j1k3oj9L0l0J1nN8m4j6L5p1
4541f9J02k8n4J7qL4k6N5l9L3j4rL8l6lqJ6j4OK8m7M7k3n5J09j02O0m2nJ2k8K7
4573b6j6J07q4KJ7J9k7jj8J4m7M9P8k5Jm5qrP0m3j3Q0p1r%L0j8j1NlM6k7Oj3n3
4608d3L6k0O3l3qj4J5m9P9l8JM5n2J2l1j4N2j1lJ9L8l3o5O6o7L3J0jNJ6mk3j7
4641c6lN6j4J2p7N4P5j08j0J2L5mNl3L5J6qm8J2N1jo3ml1L4P6pJ9o7L3n3O9k4
4674CL5j8m5M2n3N4L2q6Q9p1J4j7K7J8K0l9J1j0j6L1k8l0M7J3j6QM4m2k5K8o9
4705d9O1m5L7nn5L5J3M1n2j7R9q0K4k4OJ9l7K0j1k3O6m8M9j2lM0n2Nqo0O5K2m4
4738b3L3k0j5N4k4rJ7k2M3m1Lm3M8J0r9J23k5J5o4K0NK5J9j9j2LJ1lk0K1j7J7
$$ y = [18, 10, -18, 23, -14, -38, -35, 15, -29, -30, 20, 31, 8, -11, -8, -6, 35, -11, 4, 14, -10, 22, 11, -12, -18, -37, -7, -37, -26, -31, 27, -17, -33, 2, -69, 33, 5, -49, -32, -40, -6, -32, 23, -16, 17, 3, -6, 32, -4, -7, -15, 1, -13, -7, 21, -26, 21, -2, -57, 52, -50, 10, -32, -37, -25, -53, -26, -42, 65, -19, -17, 0, 19, -8, -9, -27, -13, -60, -11, 67, 42, 43, -2, -10, -19, 51, 8, -5, 75, 4, -5, -5, 25, 7, -4, 1, -2, 44, 17, 23, 10, -43, -7, -27, 36, 3, -5, -19, -4, -53, 26, -12, -11, 34, -18, -6, -37, -51, 1, -10, -13, 6, 44, 11, -54, 12, -55, -22, -12, -13, -8, 8, 4, -19, -36, -39, 17, 3, 15, -62, -8, 67, -41, -51, -39, -4, -8, -3, -36, -1, 15, 7, -41, -29, 22, 21, -42, -46, -77, -43, 33, 26, 45, -22, 11, -42, 27, 3, 38, 20, -25, 17, -36, 18, 50, -36, 53, -18, -4, -21, 6, 24, 44, 5, 16, 6, -10, 21, -7, -37, 10, 23, 7, 15, 59, 17, -8, 20, -49, 12, -33, 4, -1, -56, -21, -8, 33, -19, -36, 63, -17, 7, -17, -11, 8, -29, -9, -20, -43, 23, -25, 24, 12, 9, 49, -3, 2, -6, -66, -1, 21, -23, 10, -10, -25, 29, 5, -4, 13, -9, 34, -7, -4, -47, 1, 11, -88, 35, 10, 25, -39, -19, -14, 11, 30, 11, -1, 2, 13, 10, -10, 11, -6, 11]
4770A1KllJ7J5n0K3nl9J7n7L5M3k2j9k1Q6p8L8kj7L3j2j1N1k0mK6n1j0K5K7jK0
4804D4n5N1o9O8j0m3j8M9k4MqK9Nm8O4m0M5j4j0J8K7o3K8n7k9L0L6PKJk7l9P8
4837C2o4mO7j3rk4L5l8PJ8Kmk4K6k9K4J1MJ6m9l1M3j2K7j1j4k4J8k4P0k3lK8k1
4871GL5n3nm9L7K5K8r5K7MJ4NpO8m0j4J0l1L1k3N1nk4j1L1Mm8L2ll0J5RM5m1M6
4906D5m6J6%p5Q5Ml1J3jk8k7J8L3JJ8P4m9k5l9oK4l1K8nJ4k0N4Np5M5ko4K0M9
4940B2m1QK8m7j8J7nO7o7Q9p7N4o4P8o4P0o6J6l0qK0RL1l3K6m0L5k9K8m8N5J2
4972B8Pl7M5m1j3l1O1p4N5k3l7R3M5j01K7k4RN1m1nk2L0j3J0%rk2N2n2L7j9L8
5004B4p9R6o4n6J44q4rQ2j8l2l5O0j2l1Q0n0mrj4N6q6L7J1L5k9loJ9k8R2o2J2
$$ y = [11, 13, 10, 7, 24, 39, -11, 12, 7, -32, -15, -72, -37, 6, -16, -35, -56, 30, -48, -10, -12, -29, 4, -8, -19, 32, 12, 8, 34, -17, -27, -2, 25, 24, 44, -11, 40, -29, 39, 29, -14, -32, 17, -7, -3, -11, 18, 23, -25, 39, -1, 44, 30, 20, 38, 65, 2, 30, -27, -56, -26, 10, 17, 19, 20, -7, -46, 32, -32, -36, 31, 18, 9, -15, 20, -18, -11, 7, 9, 5, -19, 7, -22, 2, 13, 17, 33, -16, -47, -4, -16, 11, 0, -14, -38, -20, -44, 26, 3, 0, 28, 7, 42, -11, -16, -65, -28, -3, 25, -70, -43, -39, -25, -20, -27, 41, 1, -13, -3, -34, -3, -26, 25, 20, -4, -15, 16, 20, -28, 4, 1, -29, -14, -5, 40, -1, 45, -1, 15, 15, -60, 25, 29, -2, 11, 10, -18, -45, -27, 6, 7, 25, 99, 50, 25, -14, -20, 4, -27, 1, -4, 10, -10, 44, 49, -26, 19, 17, -47, -27, 22, -19, -11, 17, -30, -48, -31, -36, 31, -36, 53, -24, 30, -34, 44, -20, 50, -16, 0, -30, -38, -18, -9, 22, -11, 15, -25, 10, -19, 9, -39, 16, 28, 35, -2, 43, 2, -11, -42, 19, -55, 0, -23, -60, 33, 78, -23, 4, -20, -11, 40, -1, -6, -28, 2, -11, -1, -1, -10, -32, 20, -32, 5, -14, 24, -55, 41, -23, -79, 65, -19, -28, 54, 36, 4, -31, 29, 17, -14, 66, 16, 12, 3, -11, 45, -41, -4, 7, 42, 13, 10, 4, 23, -5, 87, 25, 37]
5036C7nl3j4Plk2N3J8m9l2J6mRL0m3N2m7L4J7k3m4O7j2l1j5L9ll1J3oN7l0J1j1
5070BMJ1l5j5mN9j7j3LN0j01P2J3k2K5k4jM2l3m4m0N7Ok6M1q0K3L3J0mM7km4j0
5104a7M0k0nJ3jk6k2P9Mr1N3j4j4L0p8M8L2k4L4n5K7L1p1L0MJ2j9QQj0L9n4J5
5137a4K1jj1Kj3L0k7J2n2Q0k5K8k2nj2P0n7n0N0L0r3J00j1m4JK3%k6J8K9m3p2
5169h4Q7m4Q4j9K5o4L1kK1q9O1l9L2k3oKO8l1PQK8p4Ol0L3J1L9n2J3%j5J5kJ5
5203A2l6J9LN6j8np9K8L4j4m4J01q4L9Kol2M3K4j04J14o9M8m4Q4m1lm5Pm8Q6l5
5235gj1N6m4L6m3L7l7l2L3m2L3N1k3k0L8rm4K0l6P1m7J8j5OM3Pk0n0K1l7M4mL4
5268B7k3k5J2K2k7K8j7N3k4m7N4rj6Ol6M6k8K0l5oK9k6J4qO8k8k2J6L6m1n7K4
$$ y = [37, 32, -1, -15, -8, -11, -33, 20, 38, -11, -43, -27, -31, -22, 8, -35, 17, -30, 4, 21, -2, -46, 21, 9, -22, -37, 2, -1, -32, -19, -25, 32, 2, 13, 2, 6, 17, -18, -33, -37, 22, 5, -8, -5, 45, -56, 16, 29, 7, 32, 8, 7, 49, 16, -28, -68, -11, -5, -31, 10, -70, -47, -14, -4, -8, 39, 37, -7, -17, 23, 3, -2, 11, 10, -16, -38, 41, 45, -46, 7, -7, -21, 9, -69, -21, 11, -13, 21, -34, -7, 24, -47, -17, -13, -1, -20, -12, -4, -14, 25, -29, -14, 7, 6, -5, -3, -16, 14, -13, -1, -53, 27, 2, 30, 8, 3, -9, 61, 4, -46, 4, 34, -59, 41, 30, -14, -13, 10, 10, -16, 2, 31, -12, -84, 3, -41, 43, 24, 49, -15, 16, 14, 35, -54, 7, -32, 0, -23, -29, -27, 41, 10, 17, 25, 53, -21, -15, -45, -12, -1, 38, -14, -1, -1, -16, -1, -3, 12, -24, -5, -2, 54, 36, 31, -48, -20, 14, 0, -44, 57, -27, 12, 14, 8, -24, 19, 43, -61, 53, -16, 32, -12, 72, 31, 28, -17, -10, -58, 28, -7, -18, 38, -6, 30, -13, 24, -13, -45, -12, -54, -21, 30, 7, -13, 25, 16, -28, -8, -44, 27, -20, -2, -17, -11, 32, 39, 19, -31, -10, -47, -3, -7, 27, 4, -21, -9, 13, -14, 14, -3, 50, 26, -21, 33, 24, 8, 14, -22, 24, -4, 16, -19, -25, 4, -22, -8, -16, 52, 24, 2, 18, 54, 13, -44, -20]
5300b0J0LJ2J6qKj2nJ0j8J6rn3K9K2L3l6K2qNjk3L9Mn3K2K6m3M8k2k3K8n8OPJ0
5336b2j6M4l7J6jPK4p9L7M7L7l8L2ok7o9j1P1kk1j4J5J2j7pk9N6k6J9K1M1l9l0
5369a2J1M5n7oL0qm2j5R8m8J9l2K7l7K9ooMN9n3K5Jj2k3L3m4J4%K9j4l0K0m7J7
5403c1L2k2m4O8PK2j0n0K5PJ5k3k8Q2p5j3O8L6l4l2k1L0m1qO7k4J9j0l0J4j9Q
5435a5l9N1j5J9K0l7M4n8K1K2k3N2m8l3P6o4M0k3k1OM5o8O7Lj4Pl7O8m1Mj0k2
5467b3K9J0LRMn9P3r2P6Jn0MK8l4O8m7K4k3Jj6j2QJ8%L1k1J1j1L2j5l8P0q9J5
5501a5qN0oj1j4PmLL2l6N1J3p0mK0K7k2Ko5M7k8K4K7Jl1%k7P1l7J9L7n9M3o9K5
5536gL3j6j6J6j4K0J9n0K7Lj5lJ5Kj3p6O8k5L3L6J0n1lJ5J6l0pL3k2Om7P2o2P6
$$ y = [-20, -10, -7, 5, 21, 13, 15, 3, -2, 8, -10, 6, -3, -56, -27, -5, 28, -8, 14, 6, 11, 10, -13, 26, 30, -23, -1, 25, -18, 30, 8, -15, 13, -45, -39, -32, -22, -38, 6, -31, -15, -16, -9, 15, -64, -27, 20, 57, 19, 51, 45, 18, -51, -62, 9, 7, -14, -28, -13, -1, -18, -25, -54, 2, -24, -5, 16, 57, 18, -12, -1, 44, -13, -19, 11, 3, -39, -54, 44, -4, 15, -17, 10, -27, 2, -4, -10, -6, 53, 0, 25, 26, 14, -9, 24, -20, -6, -6, 23, 9, -21, -1, -48, -31, 1, -21, -65, 3, 10, 32, 22, -28, -3, 4, 19, -4, -32, 50, -25, -38, 30, 66, 32, 0, -21, 9, -32, -40, 27, 3, 22, 12, -18, -4, -23, -15, -54, -3, -18, 1, 21, -16, 28, -30, -9, 13, -10, 42, -6, -39, 37, -27, 13, -10, -31, -25, 20, -48, 19, 22, 8, 15, -22, 46, 5, 9, -1, -23, 6, 16, 19, 28, 32, -27, 46, -46, 30, 31, -19, -15, 13, -21, 47, 0, 24, 1, 2, -14, -26, -18, 0, 0, 31, 10, 21, 10, 42, 27, -11, 59, -30, -15, -23, 27, 21, 10, -4, 3, -1, 2, 34, -2, 49, 62, -8, -12, 8, 35, 13, 15, -50, -3, -31, -7, 20, 21, -10, -10, -37, 34, -3, 16, 53, -6, 37, -32, -7, 26, 10, -6, 10, -4, 16, 35, -15, 12, 15, 0, -3, 12, 14, 1, -75, -7, -32, 1, 37, 47, -4, -7, 8, 24, -6, -13, 20, -2, 4, -43, 29, -33, 43]
5570D3L2j03O7l7l9O5n1QL9k8L7PPq3KN5m4j0M9m5J0L2kqMK5l9m0O9j4J8mp9K8
5604b9P0o6J0J6k3L8k2K9J2j3J%l1K0Jm5l3J12l0r0Q8j08O9l1Q7m6l9M5k6K8j3
5635a9M0j2j8L3l7J1lM8Rj3k1k5pM6n3K9rK9p2N7Np0P9k0m0M1j1%jJ7m5K7N2m1
5669FJ2K4j04J13n6J5l7N6l6K5J6j2k5J1qk5J3N9p7K4j8L3n7N2PL4J3l4k8M4l8
5700Bjj5K3j1k0Q2k5m3j0M8l6J7p6P1oQm1O9l6nM6Nm3nm4N1nK3j1k0m3O5rOj6
5735en7L7Mo8J11p1P8p3K2O8nn0L4n3J0Kj1N4o9N0m5L9QJk3QpM9Ko6P9m8kK7l0
5770@M7m6nl3Qm2j0J04qm6L6Rl2K6J5K7n3kPl9J8mj5N1j6rJ4%l4J4J8LK3m0p6
5805i0J05o6P1Lj8L6k4j9K9J3o9L2pk9L5J8k5k9N4j2nnJ0J2l8L7pl2K3k8j7M1
$$ y = [43, 75, -28, 39, 2, -37, 28, -23, -15, 24, -4, 33, 40, 47, -36, -34, 21, -23, -33, 16, -29, -19, 13, 11, 3, 7, 32, -7, -47, 22, 8, 26, 22, -57, -29, 41, -25, -15, 1, -22, 16, -6, 23, 35, 22, 23, 23, -8, 12, 13, -32, -65, 47, 17, -73, 15, -93, -24, -55, 32, -14, -53, -8, -34, -6, -19, 21, 9, -9, 24, -13, -2, -5, 43, 52, 39, 18, -7, -14, 32, -21, 8, -1, 28, -44, 13, 18, -52, 27, 7, -33, 8, -3, -3, -4, 13, -32, -5, 47, 6, 18, 42, -62, 51, -5, 10, -27, 29, -7, 18, 34, 22, -3, 8, 0, -25, -12, 47, -30, -6, -24, 9, -48, 4, 11, 45, 58, 24, -4, 40, 2, 1, -14, 9, -2, -22, 60, 35, -8, -18, 30, -6, 11, -65, 6, 0, 8, -33, 36, 0, -5, 41, 46, 3, -2, -46, 5, 0, 23, 12, -8, -51, 14, 5, 11, -5, -62, -25, -21, -89, 22, -49, 29, -44, -22, 46, 41, -9, 25, -28, -18, -16, -27, 27, -42, 8, -37, 2, 10, 11, -12, -4, -11, 38, 40, -26, 53, 5, 3, 30, 0, 47, 1, -4, -37, -29, -71, -81, 23, 15, -31, 5, 14, -18, 8, 23, 50, -3, -5, 2, -37, -19, -23, -38, 13, -3, -12, 2, 2, -32, -18, 0, 3, 26, -14, -90, 15, -51, 20, 23, 5, 41, 17, -2, 27, 40, -29, 3, -4, -33, 2, 20, -5, -34, 20, 8, 3, -2, 8, 20, -18, 19, 12, -20, 3, -25, -42, -1]
5837ak9J1l2N1k5n6J9J8O9l5m0N0J3L2q1nM5J9o7Q8jj23Q0L8m9K8Jj4j2K7m6L7
5869A0l1jK9l4O9m8m0P0k1pl8N7pj4j3K1No3P1pm8OK2qL2J4j1p4P4j4J8m6M5k
5903A6lj8L6l7n9L7J2K1nnkl7N7k9JK4Rj%l7j5j0LJ8M4o0O1nRk8k8N6n2O5k1J0
5939B7J6m7l2O7J2l3oJL6k1n0M4J0m8P3m1l5K8j7j6J6K1n0LL8RnM0nlj6LLn9L2
5974eK1rK7m4mK5k5N0k7k5L0l0NkPOjNJ9l5M1j0j2J2nm4P4l3N0p2N7o6J6O5j14
6009e3P3k8k7M3k6N5k6j5J0L6jk4m2L7K2l1Ok6k0J8O4l6K8k4jKk8L9j5Oj4P8n6
6042B4l9pk2N6Oj4j3M6n0K9Pjl0Lk0M0o1L6o7Q6n5M5l4L8L0l2jM6o1p4J07l1O3
6075E0r7K3n6J08l2K3%k5k3J4P1r5R6o5J8j3M3k0KJ2k7N3m0o5L7L7k1k9K0J0k4
$$ y = [-1, -30, -19, -51, 0, -25, -81, -62, -44, 25, -10, -50, 0, 13, 45, -36, -41, 4, 23, -44, 44, 43, -80, 0, 38, -11, 17, 18, 4, -8, 19, -27, 10, -21, -22, 7, -27, 42, -6, -46, 24, 3, -4, -42, 15, 8, -6, -19, 2, 7, -56, 15, 8, -40, -34, -12, -20, 12, 26, 15, -59, 15, 1, 19, -27, 18, 16, 13, -5, 31, -6, -65, -28, -16, 5, 0, -5, -7, -44, 13, -16, -15, 9, 18, 17, 17, -20, -35, -45, -42, -24, 20, -40, 21, 16, 25, -3, -31, 25, -27, 38, 17, 27, 43, -4, -36, 31, 43, 10, 4, 5, 41, 20, -30, 14, 24, -24, 49, 8, -27, 1, -16, -32, -16, 5, -45, -42, -4, 5, 0, 40, 35, 32, 16, 19, 22, -37, -5, 16, 7, 34, -10, -14, 11, -14, 36, 9, -16, 14, -16, -11, -13, -6, 0, -1, 4, 23, -12, 29, 19, 7, 19, 14, -30, 44, 11, 61, -11, 46, -20, -4, 61, -53, 20, -8, -35, 8, -18, 37, 11, -4, 6, 42, 41, 17, -25, 12, 34, 3, 9, -17, -37, -19, 45, 9, 37, 13, 12, 14, -14, 25, 10, 16, 2, 80, 24, -15, -22, -44, 12, 18, 4, -9, 37, -13, 16, 23, 22, -8, -5, -25, 15, -46, -10, -77, 9, -46, -1, -35, 3, 33, 1, 0, 46, -15, -89, 18, -13, 50, -47, -24, -80, 28, -4, 19, 19, -6, -29, -15, 56, -39, 57, -8, 10, -3, 40, 20, 22, 34, 7, 60, 20, -45, -8, 29, 8, -21, -1, 9, -15]
6106a5JL8Mk7kKj9LOk1J7rK1J4j8L0o2J01r4J4L9n4O2l1j7K2k6O3jrl8m8P4on7
6141d3L2l9M5J1r3P9N1p4j1M9k1L8k0n7O2L0n5P0l9j4N0j12J06q1O3k7K4l0lL2
6171B3j9P7o3m5O0Jn5L8j8J6m3NM4N2p7Ll0NK6m0O7k6k0j3M9kl9J7K9j7LLl0l8
$$ y = [-15, -14, 24, 28, 1, -1, 1, -18, -15, -9, -30, -13, -22, -1, 13, -5, 25, -37, 64, -30, -16, 23, -31, 31, 0, -17, 5, -21, 42, 41, 32, -6, -54, 20, 14, -43, -11, -50, -5, 6, -87, -8, 43, -31, -42, 7, -14, 24, 4, -53, 9, 39, -16, 54, 15, 1, 51, -61, 45, -36, 27, 0, 24, -6, -9, 23, 4, 81, 18, -27, 33, 34, -21, 17, -1, 15, -28, -23, 21, 73, -4, -1, -31, -26, 0, -40, 27, 1, -19, -32, 17, 15, -24, -7, 22, 5, 8, 11, -19, -57]
$$ [...]
8191h
##END NTUPLES=NMR FID
##END=
