##TITLE=1H_Pr 1755
 DMSO
 8 sc, 
 7.9.2023
##JCAMPDX= 6.0         $$ Bruker NMR JCAMP-DX V2.0
##DATA TYPE= NMR FID
##DATA CLASS= NTUPLES
##ORIGIN= UXNMR, Bruker Analytische Messtechnik GmbH
##OWNER= root
$$ XWIN-NMR		Version 3.5
$$ Thu Sep  7 14:37:18 2023 Russian Standard Time (UT+4h)  she@DPX200
##.OBSERVE FREQUENCY= 200.13135
##.OBSERVE NUCLEUS= ^1H
##.DELAY= (6, 6)
##.ACQUISITION MODE= SIMULTANEOUS
##.ACQUISITION SCHEME= undefined
##.AVERAGES= 8
##.DIGITISER RES= 18
##SPECTROMETER/DATA SYSTEM= spect
##.PULSE SEQUENCE= zg30
##.SOLVENT NAME= DMSO
##.SHIFT REFERENCE= (INTERNAL, DMSO, 0, 15.7039)
##AUDIT TRAIL= $$ (NUMBER, WHEN, WHO, WHERE, WHAT)
$$ ##TITLE= Audit trail, XWIN-NMR		Version 3.5
$$ ##JCAMPDX= 5.01
$$ ##ORIGIN= Bruker BioSpin GmbH
$$ ##OWNER= she
$$ F:/spectra/data/she/nmr/H-F/1/audita.txt
$$ ##AUDIT TRAIL=  $$ (NUMBER, WHEN, WHO, WHERE, WHAT)
(   1,<2023-09-07 14:36:22.46 +0400>,<she>,<DPX200>,
      <created by zg, POWCHK disabled, PULCHK disabled
       configuration hash MD5:
       00 E9 B6 7A A2 85 ED C7 34 08 36 98 17 FE 4E 26
       data hash MD5: 16K
       69 C6 38 1E 9F 08 E4 BA E6 CB 25 33 62 CE 93 7D>)
$$ ##END=
$$ 
$$ hash MD5
$$ 28 62 90 BC B8 48 2B 42 61 45 A0 0B D7 3D 12 D7
##$RELAX= 
##$RELAX= 
##$RELAX= 
##$RELAX= 
##$RELAX= 
##$RELAX= 
$$ Bruker specific parameters
$$ --------------------------
##$DU= <F:/spectra>
##$EXPNO= 1
##$NAME= <H-F>
##$PROCNO= 1
##$TYPE= <nmr>
##$USER= <she>
##$AMP= (0..31)
100 100 100 100 100 100 100 100 100 100 100 100 100 100 100 100 100 100 
100 100 100 100 100 100 100 100 100 100 100 100 100 100 
##$AQSEQ= 0
##$AQ_mod= 1
##$AUNM= <au_zg>
##$AUTOPOS= <>
##$BF1= 200.13
##$BF2= 200.13
##$BF3= 200.13
##$BF4= 200.13
##$BF5= 200.13
##$BF6= 200.13
##$BF7= 200.13
##$BF8= 200.13
##$BYTORDA= 1
##$CFDGTYP= 0
##$CFRGTYP= 5
##$CHEMSTR= <none>
##$CNST= (0..31)
1 1 145 1 1 1 1 1 1 1 1 1 1 1 1 1 1 1 1 1 1 1 1 1 1 1 1 1 1 1 1 1 
##$CPDPRG= <>
##$CPDPRG1= <>
##$CPDPRG2= <>
##$CPDPRG3= <>
##$CPDPRG4= <mlev>
##$CPDPRG5= <mlev>
##$CPDPRG6= <mlev>
##$CPDPRG7= <mlev>
##$CPDPRG8= <mlev>
##$CPDPRGB= <>
##$CPDPRGT= <>
##$D= (0..31)
0 1.2 0 0 0 0 0 0 0 0.06 0 0.03 0 0 0 0 0.0002 0 0 0 0 0 0 0 0 0 0 0 0 
0 0 0 
##$DATE= 1694082981
##$DBL= (0..7)
120 120 120 120 120 120 120 120 
##$DBP= (0..7)
150 150 150 150 150 150 150 150 
##$DBP07= 0
##$DBPNAM0= <>
##$DBPNAM1= <>
##$DBPNAM2= <>
##$DBPNAM3= <>
##$DBPNAM4= <>
##$DBPNAM5= <>
##$DBPNAM6= <>
##$DBPNAM7= <>
##$DBPOAL= (0..7)
0.5 0.5 0.5 0.5 0.5 0.5 0.5 0.5 
##$DBPOFFS= (0..7)
0 0 0 0 0 0 0 0 
##$DE= 6
##$DECBNUC= <off>
##$DECIM= 32
##$DECNUC= <off>
##$DECSTAT= 4
##$DIGMOD= 1
##$DIGTYP= 9
##$DL= (0..7)
0 120 120 120 120 120 120 120 
##$DP= (0..7)
150 150 150 150 150 150 150 150 
##$DP07= 0
##$DPNAME0= <>
##$DPNAME1= <>
##$DPNAME2= <>
##$DPNAME3= <>
##$DPNAME4= <>
##$DPNAME5= <>
##$DPNAME6= <>
##$DPNAME7= <>
##$DPOAL= (0..7)
0.5 0.5 0.5 0.5 0.5 0.5 0.5 0.5 
##$DPOFFS= (0..7)
0 0 0 0 0 0 0 0 
##$DQDMODE= 0
##$DR= 18
##$DS= 0
##$DSLIST= <SSSSSSSSSSSSSSS>
##$DSPFIRM= 0
$$ [...]
##$SUBNAM2= <"">
##$SUBNAM3= <"">
##$SUBNAM4= <"">
##$SUBNAM5= <"">
##$SUBNAM6= <"">
##$SUBNAM7= <"">
##$SUBNAM8= <"">
##$SUBNAM9= <"">
##$SW= 18.05172834244
##$SWIBOX= (0..15)
0 0 2 0 0 0 0 0 0 0 0 0 0 0 0 0 
##$SW_h= 3612.71676300578
##$TD= 16384
##$TD0= 1
##$TE= 0
##$TE2= 300
##$TE3= 300
##$TEG= 300
##$TL= (0..7)
0 120 120 120 120 120 120 120 
##$TP= (0..7)
150 150 150 150 150 150 150 150 
##$TP07= 0
##$TPNAME0= <>
##$TPNAME1= <>
##$TPNAME2= <>
##$TPNAME3= <>
##$TPNAME4= <>
##$TPNAME5= <>
##$TPNAME6= <>
##$TPNAME7= <>
##$TPOAL= (0..7)
0.5 0.5 0.5 0.5 0.5 0.5 0.5 0.5 
##$TPOFFS= (0..7)
0 0 0 0 0 0 0 0 
##$TUNHIN= 0
##$TUNHOUT= 0
##$TUNXOUT= 0
##$USERA1= <user>
##$USERA2= <user>
##$USERA3= <user>
##$USERA4= <user>
##$USERA5= <user>
##$V9= 5
##$VALIST= <valist>
##$VCLIST= <CCCCCCCCCCCCCCC>
##$VD= 0
##$VDLIST= <DDDDDDDDDDDDDDD>
##$VPLIST= <PPPPPPPPPPPPPPP>
##$VTLIST= <TTTTTTTTTTTTTTT>
##$WBST= 1024
##$WBSW= 4
##$XGAIN= (0..3)
0 0 0 0 
##$XL= 0
##$YL= 0
##$YMAX_a= 381248
##$YMIN_a= -363528
##$ZGOPTNS= <>
##$ZL1= 120
##$ZL2= 120
##$ZL3= 120
##$ZL4= 120
##$ABSF1= 10
##$ABSF2= 0
##$ABSG= 5
##$ABSL= 3
##$ALPHA= 0
##$AQORDER= 0
##$ASSFAC= 0
##$ASSFACI= 0
##$ASSFACX= 0
##$ASSWID= 0
##$AUNMP= <proc_1d>
##$AZFE= 0.1
##$AZFW= 0.1
##$BCFW= 1
##$BC_mod= 2
##$BYTORDP= 1
##$COROFFS= 0
##$CY= 11.3945322036743
##$DATMOD= 1
##$DC= 2
##$DFILT= <>
##$DTYPP= 0
##$F1P= 15.7292609196834
##$F2P= 12.9074282941183
##$FCOR= 0.5
##$FTSIZE= 0
##$FT_mod= 4
##$GAMMA= 1
##$GB= 0.15
##$INTBC= 1
##$INTSCL= 1
##$ISEN= 128
##$LB= 0.24
##$LEV0= 0
##$LPBIN= 0
##$MAXI= 10000
##$MC2= 0
##$MEAN= 0
##$ME_mod= 0
##$MI= 1.114404
##$NCOEF= 0
##$NC_proc= 0
##$NLEV= 6
##$NOISF1= 3.799351
##$NOISF2= 2.8
##$NSP= 1
##$NTH_PI= 0
##$NZP= 0
##$OFFSET= 15.70392
##$PC= 1
##$PHC0= -21204.02
##$PHC1= 8.852709
##$PH_mod= 1
##$PKNL= yes
##$PPARMOD= 0
##$PSCAL= 0
##$PSIGN= 0
##$REVERSE= no
##$SF= 200.130013532006
##$SI= 16384
##$SIGF1= 3
##$SIGF2= 2
##$SINO= 400
##$SIOLD= 16384
##$SREGLST= <1H.CDCl3>
##$SSB= 0
##$STSI= 0
##$STSR= 0
##$SW_p= 3612.71676300578
##$SYMM= 0
##$S_DEV= 0
##$TDeff= 0
##$TDoff= 0
##$TI= <>
##$TILT= no
##$TM1= 0
##$TM2= 0
##$TOPLEV= 0
##$USERP1= <user>
##$USERP2= <user>
##$USERP3= <user>
##$USERP4= <user>
##$USERP5= <user>
##$WDW= 1
##$XDIM= 8192
##$YMAX_p= 0
##$YMIN_p= 0
$$ End of Bruker specific parameters
$$ ---------------------------------
##NTUPLES= NMR FID
##VAR_NAME=  TIME,          FID/REAL,        FID/IMAG
##SYMBOL=    X,             R,               I
##VAR_TYPE=  INDEPENDENT,   DEPENDENT,       DEPENDENT
##VAR_FORM=  AFFN,          ASDF,            ASDF
##VAR_DIM=   8192,          8192,            8192
##UNITS=     SECONDS,       ARBITRARY UNITS, ARBITRARY UNITS
##FACTOR=    0.0002768,     1,               1
##FIRST=     0,             0,               0
##LAST=      2.2672688,     0,               0
##MIN=       0,             -363528,         0
##MAX=       2.2672688,     381248,          0
$$ Real data points
##PAGE= N=1
##DATA TABLE= (X++(R..R)), XYDATA
0@%%%%%%%%%%%%qJ6j6J6j6K4l2M0m8N6o4P2q8J04j27J51j68J92k24K56k88L24
34A72l65M13m66N22n84O51p24Q05q92R88j096J211j336J474j624J791j975K174
52A139k395K641k917L231l585L989m460N013n674O485p500Q818j0611J3195j7280
67i911K4744m2797J68992K40220k45993l15087j83696J54096L14054K34780p2238
78B67164k95141k78932k850K59557L07401P2112k11453l14196j35922J50026L09444
89A27210J92542q2101k90789k41156J6161K61156K72659M9133k18318k87320j08997
100c09820J60758K86929J65067r9883k74390k12187L7281K52474K43873K2122
110B72224k15418k62035p8938J67362K65989J35344j12452k61436j82237N4931
$$ y = [0, 0, 0, 0, 0, 0, 0, 0, 0, 0, 0, 0, 0, -8, 8, -8, 8, -8, 16, -16, 24, -24, 32, -32, 40, -48, 56, -71, 80, -88, 104, -120, 136, -152, 172, -193, 220, -246, 276, -308, 343, -381, 424, -468, 520, -576, 635, -701, 773, -851, 940, -1035, 1139, -1256, 1385, -1532, 1699, -1886, 2103, -2357, 2656, -3018, 3467, -4033, 4785, -5826, 7369, -9911, 14833, -27964, 141028, 381248, 135255, -179832, -363528, -209432, 104622, 339402, 267164, -27977, -306909, -309759, -50202, 257199, 329311, 117858, -196338, -332260, -182234, 127210, 319752, 237651, -53138, -294294, -278133, -16977, 255682, 304815, 86497, -200823, -309820, -149062, 137867, 302934, 203051, -71339, -283526, -246245, 6229, 250102, 272224, 56806, -205229, -284167, -116805, 149184, 284528, 172076, -89360, -271597, -216666]
120b16666K44406K16816j031k13103k36314n4048J71979K44688J06917j22343
130A41301k45470j52880P3278K34151J88469k3439k10865k10370k9324J74462
140f0687K25001Q0964j31401k30075j27802Q7888K23598J61493m1006k04599j86116
151b02742p982J73249K04355N8308j38092k13616j02766R9442K12889J37055n6481
162A63619j97326j64949R425J71888J84992L8755j42078j98116p9502J08130J99729
173I4567J14068p0069j88484j42338K5779J70107J65662J8261j45527j82752n7828
184a98554J16771J86507R2555q0858j80299j21605M0102J66232J47421o28j47316
195B0328j64968l7224J23320J72651P0633r0923j71401j01813N4725J62076J29359
$$ y = [-216666, 27740, 244556, 243525, 30422, -205892, -259940, -87961, 156727, 263644, 141301, -104169, -257049, -183771, 50380, 238849, 215410, 4545, -205825, -235149, -60687, 164314, 245278, 113877, -116198, -244000, -156112, 67486, 228979, 187973, -16626, -202742, -210724, -37475, 166880, 225188, 87096, -126520, -229286, -129844, 83045, 220100, 163619, -33707, -198656, -189231, -17343, 167649, 206404, 64326, -133790, -213292, -105162, 94567, 208635, 138566, -49918, -192256, -166477, 3630, 169292, 187553, 42026, -140726, -198554, -81783, 104724, 197279, 116421, -63878, -185483, -145381, 20851, 168272, 167644, 20328, -144640, -181864, -58544, 114107, 184740, 93817, -77584, -179397, -124672, 37404, 166763]
206A66763j6514j48057j48888j9804J26288J59869N2469r8010j61075q4046O5594
217a05411J56722J11606l0340j46553j33398k811J28912J46638L5670j04844j51623
228i5432o7406P4213J50958R5484m2408j43303j18668J0997J29684J33049K0464
239A47632j09117j41466n0514Q2512J43893P9840n4309j40274j03250K4819J30655
250A0421J19970M798j12262j30629l5469Q9176J35407O4446o3614j36186q7926
261a41868L6924J28896J06558q825j14127j19330k1652R4504J27890M9915p1600
272F7285j30996p4468M7493J25963R3541k0048j14425j07948q629R7741J19400
283I4909L6047p9010j24635o0443N7322J22834P9957l1275j14029r7025L973J00737
$$ y = [166763, 150249, 2192, -146696, -166500, -40212, 119657, 172126, 74116, -86959, -171005, -105411, 51311, 162917, 132577, -13976, -147374, -150185, -21273, 125365, 161035, 56191, -95432, -162838, -88625, 62333, 157817, 115409, -27894, -146562, -135565, -5881, 127168, 147632, 38515, -102951, -153465, -70953, 72940, 152780, 98471, -41803, -145053, -120234, 10421, 130391, 135189, 22927, -107702, -143171, -53995, 81412, 145858, 82244, -53942, -141868, -104944, 23952, 130510, 121685, 7558, -111772, -133424, -38920, 88970, 138885, 67285, -63711, -138179, -90686, 35277, 128818, 108770, -5655, -113603, -122232, -24491, 94909, 130956, 51946, -72689, -133132, -75810, 47024, 126981, 95706, -18323, -115348, -111375, -10638]
295a0638J10305K3040q5175j17425m6300O4844J17970O6755m1411j12097q5670
306a15802J5571J02897J00371J0156q9251j09931l3333P1167J12442N5327m9591
317G0023j09684p4532K5008J03095R0584j351r1708j01394k1640P6541J06056
328G0998M3451n6376j06646o3711L4063J02169Q1092j1644r3501r2739j0816Q0249
340b3411R9925L2149o2342j02235n2832M2573J00063P0390k1169r4304q3826k49
352i5268Q2979R3034K1630o7668r7145m2467M9178R7691O0456k9291r3508p5323
364i5702R194Q4473Q5360J2131p1133r1516l2628N4395R4282N1475l6595r2096
376b8360o6925J7115Q5192P7857L420p3450q6014k3579N8948R0128M2629m2753
$$ y = [-10638, 99667, 122707, 37532, -79893, -126193, -61349, 56621, 123376, 81965, -30132, -115802, -100231, 2666, 103037, 113193, 23942, -85989, -119322, -48155, 64287, 119614, 70023, -39661, -114193, -89185, 13910, 104494, 103143, 11435, -89959, -111599, -35058, 70998, 114449, 58073, -48573, -112284, -78221, 23948, 105040, 93396, -105, -92844, -103660, -23411, 76514, 108663, 46321, -55914, -108746, -66173, 33890, 104280, 83111, -11193, -95019, -95268, -12289, 80745, 102375, 34707, -62438, -104905, -55727, 41964, 102420, 73129, -20379, -95702, -86508, -2035, 83325, 95456, 24323, -67193, -99821, -45426, 48856, 100331, 63736, -28360, -95285, -78170, 7022, 84879, 88299, 14849, -71165, -94744, -35796, 54332, 96961, 54208]
388E4208r0053n7970K4564Q4940P0309n424p5232p9742j4821O3245Q5688L3307
400I3019m8465q7494m8885L2016Q3710O2375j3320p6683p2851o085O6552Q0584
412F4473K3762n3612q3585m0056L8233Q1990N4184k0437p7058o6149K098O8571
424g586P5092J5237n7597p9140l1510M3499P9804M6222k6872p6310n9362R803
436f8720O9951O8808P387o0580p4688k3519M7367P6731L8831l2540p5104n2312
448g8388J6266P0582O2636Q1o2119o9798j6279N0957P3222L1827l7261p3294m5219
461g6787K2027O9992N6574o520o3297o4664r597N3647O9243K4630m1155p0885
473c6792l8604K7305O9045N0570j2368o3986n9173k897N5717O5152J7574m4848
$$ y = [54208, -35845, -93815, -69251, 15689, 85998, 80574, 5342, -74400, -89221, -25976, 59712, 93019, 44554, -42940, -91825, -59809, 23901, 86276, 72956, -3727, -76578, -82663, -16111, 64473, 88235, 34623, -48962, -89018, -50785, 31205, 85389, 64952, -12106, -78255, -76157, -7586, 67506, 82743, 25146, -53994, -85504, -42005, 37799, 84021, 57149, -19161, -78523, -68720, 1231, 70039, 77426, 16846, -57842, -81361, -33994, 42737, 81568, 49028, -26076, -78388, -62122, 8460, 71096, 71177, 9058, -60740, -77019, -26062, 47160, 78987, 41726, -31568, -76787, -54760, 15232, 71806, 65286, 1989, -62675, -72272, -18625, 50618, 75248, 34093, -36792, -75396, -48091, 20954, 71524, 59156, -4830, -64003, -66900, -11183, 53969, 71543, 26695]
485B6695o7856l1813L2289O7504M3879j8243o4188n3478L854N7267O0458J0887
497F7255m7962o4390k4954L6362O5738L7343k3576o3413m7652R937N8189N5305
509E8182M427n0105o0800j8434L9936O3275L1095k8464o2370m1762J5121N8488
521H589N0404j247n1593n6861j2266M2962O0288K4904l2480o0781l5806K0154
533d3733N8210M5364p076n2962n2617o271M5641N7093J8643l5948n8823k9991
545f2470K4717N7260M0021j2362n3734m7837j30M7699N3482J2239l9225n6154
557c6494k4081K9044N6292L4563j7343n3964m3156N492M8791M9467O808m1651
569A3768n3194j8537L2326N4680K9018k1859n3361l8454J0328M9796M5407J573
$$ y = [26695, -41161, -72974, -40685, 26819, 70698, 52455, -11733, -65211, -61357, -4090, 56368, 67255, 19293, -45097, -70051, -33689, 32049, 69392, 45816, -17597, -65249, -55312, 2877, 58182, 62609, 12504, -48296, -66730, -26794, 36481, 67576, 39112, -23258, -65020, -49899, 8589, 58993, 57746, 6153, -50708, -62974, -20012, 40276, 65180, 32700, -28081, -63887, -43733, 14477, 59841, 52765, -197, -52814, -59085, -13444, 43649, 62292, 26344, -32479, -62470, -37753, 19507, 59528, 47166, -6568, -54405, -54535, -6836, 46646, 58885, 19660, -36494, -60575, -31531, 24761, 59324, 41981, -11983, -55139, -49647, -856, 48611, 55419, 13768, -39426, -57963, -25637, 29043, 58061, 36202, -17159, -55613, -45285, 4511, 49918, 51491]
581E1491m3556n0300j3083L5330N2622K4031k5472n2380l3543J4741M9802M1138
593E0821l327m4761m6950q052L7796N0158J9098k8914n1238k8874J8527M9570
605A3854L7237p699m5641m3457l403L9598M7569J4066l1507m9364k4136K2354
617c0529M8859L2800j2010m6217l9814J234M1011M4875R471l3799m7461j9860
629e1440K5282M7947K8640j5652m5926l5975N529M1759M1574N041l5934m5184
641c4339j5052K8169M6743K4205j9244m5653l2237R386M2454L8242Q90l7289m2749
654c6474j0590L0464M4811J9897k2411m4683k8006J3085M2709L4948l460l8550
666A740l9991o366L2630M2788J5770k5080m3639k4021J6395M2285L1383p330l9167
$$ y = [51491, 7935, -42365, -55448, -20118, 32504, 56535, 31063, -21317, -54860, -40119, 9683, 50821, 47494, 2733, -44217, -52269, -14473, 35685, 54783, 25869, -25369, -54243, -35716, 13854, 51091, 43392, -2249, -45706, -49109, -9511, 38058, 52124, 20617, -28747, -52883, -30529, 18330, 51130, 39120, -7097, -46911, -45677, -4666, 40209, 49680, 15881, -31580, -51440, -26158, 21789, 50429, 34777, -11149, -47124, -41595, 164, 41738, 46779, 10845, -34339, -49391, -21222, 25521, 49726, 30482, -15171, -47408, -38022, 4432, 42674, 43564, 6275, -36474, -47064, -16600, 28211, 48108, 25697, -18986, -46992, -33907, 8802, 43750, 40290, 1740, -38251, -44617, -11987, 30801, 46571, 21491, -22148, -46169, -29774, 12511, 43894, 36564, -2603]
679b603l6691k269L4307M0373J1358k7495m2264k0042J9724M1878K7555j0796
691C3035l9665l3581J646L5205L7930P418k9403m0261j6011K2227M0911K3695
703D3146j4126l9519l0186N469L6070L5216L723l1011l8513j2282K4450L9685
715B2122K0147j6902l8804k6880Q565L6338L2241o2l2201l6116q377K6638L7982
728B4691J6451j9746l8260k3431J1761L6631K9328l612l3094l3586m664K8163
740i368L6117J2585k2074l7015j9667J4912L6233K6014p164l3743l0835r73K9626
753e352L4130Q960k4000l5804j6363J7459L5565K2714j0113l3796k7882K382L0347
766a753L1826N376k5743l4138j2803J9807L4848J9423j2793l3742k5236N462L1007
$$ y = [-2603, -39294, -41563, -7256, 33117, 44475, 16980, -25284, -45326, -25602, 16276, 43831, 33035, -6630, -40211, -38565, -3360, 34570, 41988, 12585, -27676, -43687, -21460, 19451, 43146, 29020, -10499, -40685, -35216, 854, 36070, 39793, 8782, -29731, -42013, -17563, 22122, 42269, 25367, -13437, -40317, -31752, 4586, 36827, 36765, 4564, -31552, -39929, -13291, 24691, 41142, 21396, -16864, -40295, -28534, 8097, 37425, 33813, 719, -32867, -37531, -9368, 26749, 39334, 17260, -19755, -39422, -24510, 11723, 37737, 30573, -3170, -34005, -34978, -5352, 28778, 37738, 13738, -22066, -38429, -20970, 14595, 37309, 27196, -6600, -34482, -32100, -1753, 30073, 35449, 9706, -24432, -37235, -17428, 17420, 36843, 24050, -9692, -34928, -29466, 1541]
779A541K9502K191k6940l2228r391K1621L3497J6129j5365l3216k2069Q391L1500
792E163K6825j094k8073l0351o185K3414L2151J3039j7564l2611j9016J1052L1296
805H046K4117m204k8740k7894k769K4758L0457R623j9635l1644j5964J3682L1107
818A0940K1486p012k9048k5708K9K5634K8810O656k1127l0275j2978J5714L0415
831A3536J8484r458k9135k3333K873K6422K6906L869k2541k9064j0210J7480K9716
844A5545J5912j1688k8916k0817N512K6941K4549Q05k3589k7290p008J9249K8634
857A7839J3056j4041k8583j8265Q036K7154K2464j782k4382k5465m387K0496K7240
870A9380J0323j5706k7881j5584J0367K7080K0041m524k4958k3555j767K1687
$$ y = [1541, 31043, 33234, 6294, -25934, -35325, -13704, 19793, 35922, 20557, -12659, -34728, -26337, 5163, 31988, 30894, 2821, -27530, -33715, -10301, 21850, 34889, 17325, -15286, -34302, -23250, 8046, 32163, 27959, -781, -28675, -31444, -6686, 23771, 33394, 13759, -17885, -33849, -20167, 10940, 32426, 25414, -3634, -29342, -29313, -3679, 25131, 31787, 10660, -19615, -32593, -16879, 13536, 32020, 22562, -6573, -29906, -27033, -611, 26295, 30164, 7623, -21441, -31651, -14171, 15545, 31457, 19769, -9147, -29964, -24452, 2489, 27038, 27843, 4254, -23036, -30044, -10795, 17839, 30895, 16854, -11729, -29994, -21958, 5196, 27660, 25878, 1496, -23969, -28356, -7860, 19380, 29703, 13997, -13884, -29468, -19101, 7979, 28020, 23496, -1462, -25017, -26784, -5097]
882e097K6004P574j7336k7020j3110J2280K6651J7794o624k5111k1515P77K2454
895b279K4318N035j8825k5839j0513J4240K6212J5421q863k5196j9593L172K2962
908B52K2773K486j9798k4611p961J5537K5364J2935j0665k4981j7372N476K3377
921B812K0848J16k0730k3232n600J6923K4539J0744j2392k4505j5234P365K3430
934E084J8838k155k1075k1678l245J8029K3343Q364j3943k3977j3018R227K3351
947G145J7032m146k1532k0151j066J8829K2102O106j5189k3072j0833J0979K2909
960I113J4925o237k1834j8233J183J9632K0749L794j6422k2189q545J2520K2472
973A0928J2720p924k1700j6362L276J9963J9103J602j7219k0962o327J3651K1766
$$ y = [-5097, 20907, 28481, 11145, -15875, -28985, -16705, 9946, 27740, 21116, -3995, -25510, -24733, -2279, 22039, 27074, 8249, -17590, -28103, -13863, 12349, 27770, 18907, -6289, -25882, -22710, 252, 23025, 25511, 5713, -18898, -26859, -11322, 14042, 26977, 16312, -8669, -26041, -20565, 2812, 23660, 23776, 3046, -20186, -25786, -8863, 15676, 26420, 14028, -10477, -25711, -18346, 5084, 23922, 21767, 692, -20986, -24231, -6202, 17141, 25505, 11562, -12415, -25433, -16206, 7145, 24177, 20031, -1501, -21652, -22718, -3889, 18213, 24319, 9130, -13942, -24775, -13796, 9113, 24038, 17801, -4033, -22266, -21083, -1451, 19298, 23092, 6670, -15519, -24064, -11544, 10928, 23648, 15724, -5976, -22338, -19062, 901, 20004, 21606, 4387, -16575, -22902, -9251, 12515]
986A2515J0848r659k1527j4598N081K0129J7559k62j7899j9725m270J4714K0815
999A3721Q741j1043k1003j2550O816K0206J5820k310j8340j8338k296J5733J9883
1012A5040O677j2294k0424j0760Q378J9951J4119m036j8522j6842m68J6388J8678
1025A5885M805j3416j9628q866R826J9593J2444n607j8721j5356J299J6874J7503
1038A6635K904j4237j8743p052J1013J9133J0608p168j8623j3746L099J7254J6145
1051A7222J084j4994j7723n175J2001J8497R004q529j8334j2184M638J7293J4781
1064A7581o33j5489j6667l340J2928J7727P141r770j7999j0511O155J7285J3437
1077A7845k254j5830j5529j713J3680J6920N432j0848j7410q889P399J7162J1961
$$ y = [12515, 23363, 13704, -7823, -22421, -17340, 2789, 20348, 20086, 2187, -17538, -21808, -7094, 13721, 22462, 11419, -9584, -22134, -15318, 4888, 20708, 18398, 58, -18280, -20576, -4843, 15040, 21717, 9423, -11001, -21761, -13383, 6568, 20687, 16651, -1871, -18713, -19181, -2793, 15885, 20690, 7274, -12354, -21220, -11394, 8199, 20643, 15036, -3685, -19041, -17742, -868, 16635, 19539, 5302, -13441, -20493, -9480, 9653, 20261, 13093, -5530, -19276, -16177, 1077, 17222, 18306, 3312, -14411, -19586, -7585, 10912, 19916, 11387, -6947, -19131, -14493, 2800, 17581, 16948, 1459, -15208, -18548, -5620, 12107, 19248, 9478, -8521, -19032, -12877, 4408, 17845, 15591, -239, -15768, -17481, -3801, 13119, 18551, 7703, -9707, -18596, -11197, 5965, 17926]
1090A7926l791j6175j4309O1J4298J5944L689j1717j6813p284Q645J6903J0358
1103A7735n207j6168j2921J655J4574J4903K089j2514j6069n639R835J6482Q768
1116A7523o502j6139j1574L096J4937J3688M54j3030j5154l994J0612J5896P286
1129A7099p799j5857j0077M503J5129J2325j019j3623j4122k328J1517J5198N570
1142A6516q936j5396q556N817J5024J1071k569j3912j3043p23J2089J4313M100
1155A5795r752j4933p149O881J4958R754l898j4035j1911O52J2634J3416K505
1168A4917j0469j4329n675Q032J4457Q439n082j4062j0688K032J2871J2474J119
1181A4036j1173j3592m209Q916J4022P055o181j3864r518L290J2974J1460j64
$$ y = [17926, 14135, -2040, -16349, -16288, -1990, 13954, 17643, 5926, -10887, -18171, -9526, 7377, 17735, 12528, -3640, -16561, -14906, -332, 14571, 16660, 4146, -11923, -17562, -7727, 8755, 17523, 11021, -5118, -16692, -13596, 1341, 15029, 15483, 2453, -12701, -16695, -6083, 9813, 17099, 9300, -6557, -16634, -12131, 2998, 15323, 14304, 681, -13441, -15769, -4252, 10946, 16516, 7580, -7816, -16372, -10555, 4469, 15540, 12971, -941, -13984, -14707, -2618, 11695, 15795, 6043, -8890, -16039, -9158, 5800, 15554, 11656, -2379, -14290, -13638, -1004, 12412, 14917, 4448, -9881, -15556, -7524, 6933, 15372, 10290, -3772, -14460, -12428, 443, 12917, 14036, 2863, -10729, -14938, -6022, 8000, 15055, 8874, -4990, -14508, -11218, 1756, 13216, 13052]
1194A3052j1536j2799k901R512J3540N779p100j3617q244M337J3018J0349j443
1207A1947j1844j1921j523J0100J2923M314p891j3239o956N435J2920R206k725
1220A0746j2032j0881k24J0679J2076L014q715j2792n618O487J2720P969l859
1233I570j2171r808J083J0954J1261J716r291j2141m414P296J2423O667m845j2041
1247c741q800K300J1222J0333M16r877j1397l068Q022J1971N450n801j1913p649
1261a2532L316J1308R426o94j0122j0718j881Q618J1361M339o605j1672o460M317
1275g999J1261Q410j786j0385r908p76R053J0832L235p278j1258n425N102J1142
1289D220P409k794j0494r024M25R380J0143K088p864j0859m410N937J1018O395
$$ y = [13052, 1516, -11283, -14184, -4672, 8868, 14647, 7547, -6070, -14314, -9977, 3041, 13390, 11947, 103, -11818, -13341, -3241, 9682, 13996, 6105, -7134, -14090, -8655, 4265, 13471, 10746, -1286, -12167, -12391, -1712, 10364, 13378, 4663, -8129, -13747, -7260, 5460, 13429, 9570, -2601, -12409, -11326, -372, 10889, 12605, 3314, -8827, -13241, -5945, 6478, 13145, 8300, -3741, -12541, -10241, 981, 11314, 11730, 1853, -9544, -12612, -4590, 7381, 12831, 7030, -4883, -12532, -9216, 2092, 11518, 10824, 702, -10016, -11897, -3279, 8082, 12421, 5816, -5856, -12316, -7999, 3262, 11672, 9886, -499, -10407, -11183, -2130, 8702, 11937, 4659, -6599, -12024, -6922, 4220, 11629, 8835, -1659, -10683, -10258, -878, 9265, 11353, 3489, -7370, -11780, -5843, 5175, 11570]
1303A1570l713j0587q092J321R639R477R42q311j0181l278O557J0647N375m591
1317F775j0452p159K301R812Q667Qq778r668k238P231J0213M330n309j0311o221
1332a0799L252R805P805j035q985r024j146P726R718L360o034j0045n325M170
1346f557R809O909j982r102q303j25P999R200K286o628r626m296M902R653O064
1361A0203k890r285p472P41Q390Q594J320p027r245l335N458R407N107l549r189
1376b772o700J665Q475P907L89p484q766k410O100R144M224m336r082n913K529
1391g030Q560P247n47p761q051j492O529Q710L237m965q812n009L302Q624O464
1406I006j470p987p515n27O924Q239K395n618q540m117L967Q524N562k222p981
$$ y = [11570, 7857, -2730, -10822, -9501, 138, 9615, 10557, 2246, -7935, -11213, -4656, 5991, 11366, 6775, -3677, -10836, -8535, 1277, 9944, 9952, 1174, -8494, -10732, -3501, 6712, 11042, 5733, -4578, -10799, -7547, 2258, 10063, 9028, 43, -8981, -10127, -2401, 7317, 10677, 4643, -5402, -10727, -6557, 3252, 10161, 8179, -923, -9226, -9351, -1352, 7848, 10134, 3506, -6120, -10416, -5514, 4139, 10203, 7313, -1972, -9444, -8703, -313, 8281, 9601, 2574, -6671, -10006, -4548, 4859, 9966, 6417, -2772, -9472, -7807, 668, 8575, 8964, 1480, -7286, -9696, -3596, 5548, 9772, 5436, -3646, -9559, -7030, 1530, 8777, 8230, 469, -7582, -9074, -2545, 6165, 9402, 4437, -4375, -9384, -6082, 2542, 9006, 7536, -451, -7966, -8493, -1569, 6670, 9065, 3447, -5093, -9210, -5243, 3281, 8843, 6621, -1360]
1421a360o816M04P141P746J459o071q225l233M594Q356M819k958q031o095J123
1436g147P351P157O61o366p794k364N060Q057M059l629q028n287J876P548O463
1451G617r5o722p290j596N461P763L239m173p841m592K641P436N854r38o876o745
1467f857q14N949P372K473m671p685l954L281P457N219j567o968o239n9O183O912
1483F032J604m981p355l148L738P324M553k300p050n664O60O434O489R51n435
1498A852p062k447M259P155L840k782p028n030J262O644N908K07n705o628j766
1513g321M614P015L222l380o947m508J947O535N557m69n860o243j108M988O612
1528D654K556l838o764l819K517O603M941j113o029n878l57N348O308J841m249
$$ y = [-1360, -8176, -7772, -631, 7115, 8574, 2503, -5722, -8955, -4361, 3995, 8814, 5856, -2175, -8270, -7147, 204, 7361, 8022, 1656, -6138, -8502, -3442, 4615, 8674, 5045, -2983, -8270, -6394, 1154, 7617, 7522, 800, -6490, -8086, -2625, 5138, 8377, 4204, -3637, -8229, -5588, 1848, 7702, 6764, -112, -6857, -7671, -1722, 5650, 8123, 3452, -4233, -8187, -4906, 2551, 7770, 6203, -765, -7004, -7063, -880, 6032, 7636, 2655, -4700, -7848, -4110, 3214, 7767, 5467, -1583, -7247, -6587, -153, 6336, 7287, 1852, -5210, -7657, -3398, 3757, 7597, 4815, -2213, -7243, -5981, 663, 6571, 6778, 1073, -5555, -7321, -2707, 4308, 7530, 4150, -2797, -7305, -5358, 1177, 6734, 6265, 405, -5838, -6946, -1958, 4654, 7210, 3372, -3392, -7211, -4694, 1909, 6850, 5737, -292, -6170, -6527, -1179, 5129, 6970, 2721]
1543B721o588l196L018O538M238j606o124n274L12N425O010J146m567o388k528
1558f863L441O460L738k146o243m791Q50N661N497O07m838o021j886L748O248
1573C462L186k633o190m214J363N726N101Kn096n651j320M144O060K551l057o095
1589b661l648J897N686M630o24n214n298p18M519N825J835l440n926l138K338
1604c937N775M073j085n314m900j05M648N479J256l797n682k469K791N642L600
1619E975j659n385m517M66M880N076Q14m144n433j900L079N609K936j984n407
1634a594l946R42M903M714K05m309n174j394L478N358K559k467n394l431J358
1649d192N093M205k27m525m767q86L694N119J990k775n287k986J833N111L780
$$ y = [2721, -3867, -7063, -4045, 2493, 6731, 5125, -999, -6273, -5961, -536, 5474, 6620, 2053, -4335, -6863, -3422, 3038, 6776, 4630, -1613, -6404, -5554, 107, 5604, 6211, 1373, -4648, -6534, -2786, 3462, 6648, 4015, -2175, -6389, -5026, 700, 5801, 5803, 707, -4944, -6264, -2120, 3940, 6491, 3434, -2661, -6309, -4412, 1274, 5904, 5280, 66, -5232, -5950, -1431, 4394, 6229, 2789, -3137, -6275, -3937, 1838, 5911, 4826, -488, -5388, -5493, -845, 4634, 5890, 2093, -3589, -6058, -3267, 2375, 5975, 4316, -1069, -5586, -5120, -240, 4836, 5650, 1506, -3927, -5827, -2748, 2861, 5797, 3813, -1594, -5540, -4598, 305, 5019, 5224, 915, -4259, -5653, -2175, 3183, 5742, 3275, -2119, -5550, -4192, 901, 5106, 4879, 354, -4413, -5299, -1605, 3514, 5504, 2729, -2558, -5544, -3711, 1400, 5180]
1664E180o67m641m456m25L926M873J512l118n091k416K091N050L314j098m709
1679f75m091J53M091M605R62l409m884k023K577M914K858j551m631l658M42M261
1695e9M298N07l649m581j535K842M792K418j941m711l165R63M317L915P7l826
1711F62m413j073L162M622J935k322m619k730J361M382L477l40m069l991n54L352
1727a158M438J465k632m486k364J749M404L128q30m081l741j27L588M136J018
1742D507k850m335j961K126M359K708j264m096l399K84L715L950N95l115m192
1757b968j511K360M224K341j578m099l023P25L800L593J60l317l910j139K690
1772a652M145J880j914m064k670J041L891L298k13l387l764p12K888L973J522
$$ y = [5180, 4513, -128, -4584, -5009, -1083, 3790, 5302, 2184, -2907, -5323, -3232, 1818, 5132, 4034, -675, -4766, -4613, -522, 4083, 5045, 1636, -3248, -5271, -2694, 2220, 5078, 3527, -1104, -4762, -4320, -59, 4239, 4746, 1097, -3484, -5019, -2177, 2615, 5033, 3092, -1619, -4784, -3821, 496, 4411, 4488, 662, -3751, -4824, -1662, 2960, 4895, 2573, -2046, -4776, -3415, 967, 4444, 4104, 35, -3956, -4510, -1158, 3280, 4745, 2113, -2373, -4737, -2988, 1416, 4544, 3714, -367, -4108, -4235, -647, 3489, 4507, 1657, -2678, -4639, -2513, 1846, 4554, 3290, -806, -4205, -3921, -206, 3744, 4339, 1224, -2968, -4479, -2119, 2105, 4446, 2868, -1231, -4254, -3529, 271, 3864, 4024, 707, -3203, -4342, -1652, 2493, 4373, 2459, -1605, -4275, -3234, 657, 3955, 3742, 355, -3409, -4121, -1233, 2740, 4262]
1787D262k115m123k280J395L935K978o12l591l443k73L021L802J209k435m026
1802b296j884J686L962K541q77l689l127J1L236L587P77k679l839j527J987L918
1818A787K281j276l668k845L52L331L320M62k837l679j133K194L778J850j463
1833B454l640k608P12L448L107N0k966l496q51K434L660J565j747l596k286R96
1849b764L481K779k09l192l225m59K611L479J255k000l592j934J351L462K556
1864C599n97l194l044j68K803L299Q56k152l497j570J521L476K299r21l271k803
1880c364K36K910L087N62k390l305j357J854L379J975j175l291k482M55K972K913
1896B979K59k557l154r62J938L324J684j464l219k184P26L025K653kk672l032
$$ y = [4262, 2147, -1976, -4256, -2861, 1074, 4052, 3440, -151, -3594, -3867, -846, 2956, 4165, 1730, -2296, -4180, -2494, 1468, 4009, 3132, -557, -3684, -3673, -437, 3150, 3927, 1248, -2591, -4118, -2131, 1787, 4068, 2792, -876, -3721, -3369, -38, 3282, 3744, 907, -2772, -3905, -1711, 2067, 3917, 2454, -1186, -3794, -3082, 366, 3473, 3523, 557, -2939, -3790, -1356, 2304, 3869, 2122, -1474, -3760, -2764, 717, 3496, 3287, 95, -3130, -3589, -978, 2501, 3756, 1756, -1836, -3770, -2419, 1043, 3599, 3002, -192, -3236, -3404, -601, 2698, 3554, 1402, -2095, -3665, -2144, 1332, 3631, 2710, -561, -3364, -3128, -218, 2869, 3431, 1041, -2264, -3621, -1767, 1612, 3587, 2412, -879, -3361, -2906, 66, 2979, 3238, 681, -2473, -3435, -1497, 1827, 3511, 2047, -1172, -3356, -2630, 395, 3048, 3046, 374, -2658]
1912b658o27K124L242J320j635l184j907R73L045K441l24k711k836l96K376L038
1928B281J028j855l135j634J285L010K100m82k840k613o2K454K858Q04k039l078
1944a918j286J424K979J892q01k842k305J41K618K685M22k207k867j076J651K979
1960A489J634j079k867k113M63K581K579J43k309k716q17J837K859J330j283k841
1976a110j879P17K704K310j25k454k588m13J947K772J038j480k778j576R80K728
1992G93K001l62k495k408k63K218K580Q58j735k715j391J254K677J812o41k599
2008d16k143M8K304K444N02j893k659j042J417K642J621q93k626j943L84K274
2024B1K321K26j981k491q48J551K714J247j099k568j773N93K426K096j5k139k379
$$ y = [-2658, -3285, -1161, 2081, 3401, 1766, -1418, -3325, -2352, 693, 3134, 2810, 99, -2737, -3133, -757, 2281, 3309, 1454, -1681, -3315, -2030, 980, 3080, 2598, -242, -2855, -2917, -463, 2395, 3199, 1160, -1918, -3204, -1780, 1199, 3091, 2290, -552, -2857, -2716, -98, 2587, 3009, 802, -2065, -3141, -1490, 1489, 3123, 2044, -823, -2936, -2473, 108, 2687, 2830, 521, -2195, -3012, -1175, 1684, 3014, 1731, -1110, -2989, -2272, 432, 2742, 2617, 163, -2425, -2838, -891, 1881, 2919, 1439, -1339, -2915, -1935, 793, 2794, 2432, -63, -2471, -2734, -516, 2064, 2922, 1187, -1528, -2919, -1665, 1012, 2824, 2183, -416, -2559, -2511, -207, 2237, 2739, 846, -1813, -2855, -1438, 1204, 2825, 1932, -694, -2637, -2253, 21, 2342, 2568, 587, -1904, -2752, -1201, 1513, 2760, 1661, -907, -2680, -2087, 339, 2435, 2420, 281, -2098]
2041b098n62J764K592J059j341k530j567Q49K439J905l25k192k221k28J835K467
2057A846P52j416k571j241J013K414J693m59k269k081k3J960K387M36j554k462
2073a575r84J154K440J435o19k286j972K76K052K210K18j714k281q60J413K334
2089A241J265q59k349j683L92K133K040Q2j924k211n27J442K365J026j013k391
2105i71j413N58K272J793j37j982k087l95J698K238Q28j216k344j260Q02K271
2121F55J659l65k044j954j52J772K119O65j453k218j080R95K236J445m86k079
2137b85j751k5J891J966M05j481k152r18J112K232J302p48k071j619K41J897J915
2154A911K43j655k086o59J280K132J091q85k088j446N08J909J700J04j826j898
$$ y = [-2098, -2660, -896, 1696, 2755, 1414, -1116, -2683, -1834, 605, 2510, 2185, -7, -2228, -2456, -621, 1846, 2598, 1182, -1389, -2630, -1617, 797, 2490, 2031, -238, -2319, -2342, -382, 2005, 2441, 887, -1575, -2559, -1405, 1035, 2470, 1851, -435, -2407, -2131, -79, 2131, 2349, 635, -1646, -2506, -1093, 1241, 2506, 1647, -702, -2385, -1993, 140, 2180, 2262, 338, -1873, -2400, -958, 1407, 2433, 1420, -971, -2384, -1826, 446, 2239, 2102, 120, -1967, -2362, -664, 1574, 2402, 1186, -1158, -2418, -1616, 655, 2314, 1949, -95, -2049, -2201, -429, 1690, 2355, 902, -1316, -2396, -1401, 835, 2280, 1794, -285, -2036, -2061, -170, 1796, 2201, 720, -1432, -2350, -1238, 994, 2296, 1548, -523, -2142, -1901, -4, 1911, 2154, 499, -1587, -2246, -966, 1166, 2257, 1372, -716, -2162, -1654, 255, 1955, 2059, 233, -1665]
2170a665n39J508K064Q22j024k069j263N86K027J619k35j796j853k46J545K020
2186A501O82j289j979j095P90K001J538m58j835j788MJ642J879M61j298k028q98
2203b170R91K036J264n98j923j551J20J784J793K79j494j974o27J091J997J057
2219B075p49j906j378K53J835J649O7j474j906n22J269J986Q68q68j978j229M94
2236a514J800J548Lj706j706l43J302J878P65j034j898j168P59J840J430l35j705
2253h4j657j30J477J777O20j153j908r51Q26J886J244m09j831j456M4J574J679
2270A548L32j262j859p29R87J862J072o31j755j382J67J598J704J50j303j864
2286a365n38J092J775J015p94j766j267L39J659J543J7j507j638m01J245J729
$$ y = [-1665, -2204, -696, 1368, 2190, 1166, -903, -2166, -1580, 447, 2066, 1831, 35, -1818, -2064, -519, 1501, 2183, 894, -1085, -2180, -1390, 611, 2149, 1691, -144, -1932, -1928, -286, 1593, 2054, 756, -1272, -2170, -1179, 857, 2121, 1523, -400, -1951, -1831, -47, 1746, 2025, 531, -1443, -2070, -979, 1018, 2075, 1326, -580, -1958, -1705, 130, 1779, 1846, 372, -1534, -2056, -787, 1199, 2067, 1199, -779, -2008, -1514, 286, 1834, 1837, 131, -1575, -1918, -616, 1262, 2027, 993, -905, -2073, -1314, 526, 1956, 1621, -84, -1741, -1871, -394, 1383, 2003, 850, -1058, -2009, -1183, 703, 1947, 1538, -293, -1749, -1705, -131, 1548, 1880, 618, -1241, -1970, -983, 879, 1951, 1320, -435, -1817, -1650, -52, 1652, 1802, 499, -1365, -1903, -811, 964, 1979, 1185, -581, -1848, -1509, 150, 1693, 1710, 203, -1435, -1836, -591, 1138]
2302A138P74r08j775j059M90J725J348j42j541j577k27J285J719O25j055j715
2318h95r19O40J695J254l39j555j428p6J336J567M76j089j704q25Q63J687J062
2335A750l97j685j281K2J432J549K76j210j557p07R28J695R73o14j639j216K84
2352a397J455J428J36j267j583m64J028J581Q05o97j612j064L27J552J292p2j305
2369A43j487k87J075J567O69q71j544r45N42J531J179k04j416j336j43J180J553
2386A206M40r67j595p48P20J471J092l33j482j260M6J247J437L07j062j543n64
2403a588P02J591Q97n00j472j115J60J335J341J42j155j486l98Q25J515P92o42
2420I44j469r37K64J332J262Oj195j402l17R35J579N50p20j447r40M52J377J173
$$ y = [1138, 1912, 1004, -771, -1830, -1340, 385, 1733, 1591, 50, -1527, -1754, -469, 1250, 1875, 820, -895, -1814, -1174, 521, 1775, 1436, -119, -1547, -1623, -287, 1280, 1756, 667, -1037, -1862, -999, 688, 1750, 1353, -332, -1613, -1591, -159, 1390, 1666, 456, -1101, -1808, -880, 815, 1788, 1174, -465, -1681, -1397, 58, 1486, 1622, 355, -1228, -1692, -664, 917, 1722, 1025, -587, -1651, -1324, 228, 1520, 1448, 143, -1344, -1631, -556, 1011, 1680, 809, -735, -1680, -1138, 393, 1572, 1368, -48, -1384, -1527, -347, 1206, 1646, 679, -916, -1664, -944, 527, 1619, 1286, -196, -1456, -1410, -163, 1274, 1581, 519, -1024, -1588, -886, 705, 1602, 1102, -370, -1485, -1325, 10, 1351, 1493, 338, -1148, -1546, -721, 794, 1586, 944, -525, -1462, -1198, 134, 1396, 1402, 207, -1195, -1512, -577, 1002, 1552, 832, -615, -1555, -1103, 274, 1447]
2438A447j41j284j286j53J052J361N33q80j436p54N65J429J012k57j322j223j
2455a338J139J332L04r42j348o44O40J445Q69l90j333j063M5J225J219K06r92
2472C74j318n26P70J377P84n18j334r68J90J250J153N1j072j284l21Q32J368N67
2490A375n81j298q94L57J251J059k7j128j268k04R48J300M95o67j410o49M24J261
2508C44R69j75j191j089j20J023J252L68q69j216o51N48J266Q55l13j171j071
2525a241P1J010J184K54q50j287m70O51J244P82l88j212j020J88J044J164P3r34
2543B63j162m11P27J262O44n50j173q87K89J156R60M5j005j161k19P59J265M94
2561A296o14j164p51L99J076R63j63j025j027j71Q64J191L87p00j190o71N04J091
$$ y = [1447, 1306, 22, -1264, -1417, -365, 996, 1529, 649, -787, -1541, -976, 453, 1465, 1208, -114, -1337, -1338, -199, 1133, 1437, 495, -853, -1497, -857, 588, 1457, 1067, -266, -1329, -1284, -59, 1160, 1366, 374, -944, -1470, -700, 677, 1461, 943, -391, -1359, -1169, 81, 1234, 1285, 213, -1071, -1392, -560, 808, 1375, 794, -504, -1398, -1041, 210, 1269, 1242, 114, -1154, -1358, -410, 890, 1385, 718, -692, -1341, -917, 344, 1313, 1138, -53, -1142, -1262, -239, 1013, 1381, 512, -704, -1355, -807, 459, 1314, 1001, -170, -1241, -1170, -160, 1024, 1278, 428, -859, -1329, -678, 566, 1348, 960, -252, -1272, -1084, -40, 1124, 1197, 263, -899, -1310, -583, 679, 1323, 773, -400, -1287, -998, 158, 1118, 1163, 158, -1003, -1222, -463, 802, 1296, 682, -482, -1233, -834, 242, 1205, 1042, 17, -1010, -1181, -317, 874, 1261, 561, -629, -1300, -796, 295]
2579B95Q66j63j064j015n0R69J074L46q09j172n23O26J053P68l47j068q24j4R89
2598f3J092J31q55j135l52O10J090O62m12j103p76J48J006R96mq09j090l16P51
2617d29J063N67n62j072o91K44J027Q37N0r12j013k18P77J058M26n57j142n55
2635a102L21J110P46j39r44r60n4Q18R85L46o83j012n87M74J086O99k09j000q27
2654i32j9Q55R39K84p76j020l76M48J020P04l69j001p78J28R05Q86J13p42j039
2673g70l13O29R74N62l97r87p76K48R62Q10L0q31r40j98O05J005M73n33r39o02
2693i88K58Q88Q31p2r11q32j70P21R42L93n32j028n31L69R04P07j43q57q64l7
2713i52Q05Q89K42n72r78m18L95R47O37k55q42p86KQ14Q97J54o77r29l70N06R55
$$ y = [295, 1161, 998, -66, -1081, -1131, -162, 912, 1258, 449, -723, -1246, -620, 433, 1201, 854, -214, -1038, -1052, -63, 1029, 1160, 305, -830, -1182, -572, 518, 1180, 768, -335, -1111, -963, 43, 1039, 1035, 226, -864, -1180, -429, 634, 1201, 639, -433, -1124, -880, 147, 984, 1034, 122, -891, -1109, -332, 726, 1152, 595, -547, -1102, -781, 329, 1075, 936, -8, -968, -1022, -204, 781, 1127, 444, -568, -1155, -681, 405, 1104, 895, -105, -932, -951, -96, 843, 1127, 351, -669, -1045, -597, 423, 1127, 758, -243, -1021, -893, 12, 898, 1011, 269, -770, -1083, -454, 520, 1082, 685, -302, -1078, -830, 132, 942, 972, 141, -799, -997, -392, 613, 1086, 553, -386, -988, -730, 158, 989, 917, 6, -826, -996, -275, 667, 1060, 528, -500, -1031, -662, 242, 949, 806, -51, -915, -952, -147, 742, 984, 412, -566, -984, -589, 358, 995, 740, -102, -888, -886, -72, 825, 979, 302, -627, -997, -491, 464]
2734D64N49m02q24p19J15Q61P62R7p43q99k01N79Q85M37l75q54o88K34Q78O82
2754H38qp55q01j82O25R46K39l85r46m96K74Q37O80Lq62q08p4O72P83L84n94q45
2776d75m65L43Q80O10j80p78p20m2P19P96J61n29q50l56L50R10M96j91q70o34
2796h25P7O67Q00J02o06p92k76M44Q28M67l06p97o06J47P28P16K7n81q30k20M99
2817c37P90M49m11p74n61K13O98P02l4o41p48j48N97P23L79n04p80m54K95P64
2837B18N90j06p30o79m4O20O79K48m67p46l57K99P32M95j71o60o63P6O23O43J55
2858G55m49p36l81L86P65N20l04p06n85J04N97O75J08m97p71k60M34P55L95l01
2878E04o99o21J96P17N83j0n28o94j72M25P42L28l95p08m27J92P02N92p6o32o34
$$ y = [464, 1013, 611, -213, -932, -817, 44, 806, 903, 160, -739, -940, -361, 524, 961, 586, -268, -956, -722, 156, 838, 830, 75, -726, -908, -283, 663, 902, 517, -429, -925, -651, 186, 866, 869, 7, -801, -875, -203, 580, 964, 370, -475, -940, -597, 283, 893, 713, -65, -785, -827, -108, 688, 849, 320, -530, -886, -536, 374, 870, 679, -191, -825, -748, -81, 719, 821, 215, -577, -853, -409, 419, 886, 580, -217, -823, -676, 52, 768, 795, 214, -616, -836, -337, 453, 902, 491, -283, -844, -631, 67, 769, 735, 94, -654, -802, -205, 518, 897, 393, -387, -841, -546, 218, 808, 702, -28, -707, -751, -131, 548, 796, 329, -417, -774, -475, 257, 752, 581, -79, -742, -666, -43, 600, 755, 306, -430, -811, -425, 340, 860, 556, -150, -735, -631, -34, 641, 749, 252, -519, -779, -345, 410, 805, 504, -195, -816, -620, 97, 680, 670, 142, -552, -724, -299, 443, 771, 376, -332, -759, -567, 135, 727, 651, 19, -615]
2899f15j08N26P44K14m25o57m50L06O58N02q4o72o16PN70O09J72l86o92l50M03
2920c44N74M81j41p11m79m1N93O49Q2m53o92k44L58P13L53j82p45m52N8O28N45
2941E50J23n37o25j79L71P38K71k23o86m92J70O19N33pn53o05j46M32O55K74k74
2962D09p27l37J28O61N60o4o23n65r8M90N98K43m01o43l46K48P10M04r3o26m87
2983e59m4N50M78J99m12o28k55L41N48M96j95o69m57N0N36N89R3n09n81j76K80
3004c25O31L46k19n97m63J30N12M84J19n17n49j53L03O63K67k80n79m21J13O34
3024I9M79n6m70n52j52M94N08L22l85n72l44K19N33M36mn28n95k7M49N99K08l97
3046B64n86l14K00N97M27j01n28n35qN28N19J74m01n53l77L28O00L64j66n24m99
$$ y = [-615, -723, -197, 547, 761, 336, -321, -771, -465, 193, 695, 611, -61, -677, -670, -100, 509, 681, 295, -397, -747, -344, 230, 711, 570, -141, -620, -661, -68, 581, 663, 210, -482, -726, -368, 345, 698, 516, -229, -681, -623, 5, 550, 673, 136, -489, -668, -297, 441, 712, 489, -197, -689, -519, 100, 633, 626, 73, -532, -678, -246, 409, 683, 409, -318, -655, -527, 134, 694, 630, 7, -558, -656, -166, 432, 675, 274, -369, -715, -467, 243, 647, 554, -72, -559, -603, -53, 425, 624, 212, -416, -671, -330, 218, 714, 519, -150, -607, -557, -21, 568, 661, 152, -429, -605, -325, 306, 652, 433, -164, -627, -497, 15, 499, 618, 101, -448, -601, -298, 365, 632, 352, -227, -648, -535, 99, 578, 522, 52, -500, -652, -158, 350, 672, 287, -285, -629, -410, 123, 559, 555, 27, -568, -595, -146, 453, 661, 264, -322, -636, -436, 161, 588, 487, -41, -576, -584, -56, 463, 637, 236, -317, -694, -366, 234, 598, 432, -92, -591]
3067e91Q9M77M84R5l65n53k14K82N67L82k59n14m51J54M48M34J02n31m55j51L33
3088b37N47K54k47n76l30J54N70L60K1m53n19r8M00M98K44l21m86l73J79N03M34
3109E24j6n03m60j07L88O38J43l57n73k19K00N64L16r3m44n08O2M07M54J68l98
3130A86m96k84K67N41K96j07n27l88N4M91M04Q8l61n17j37K67N22K26j60n16l17
3151d68N5M28M34K9m16m40j59L15N57J94k47m71l65J74N03L47j3m11m61p1K94
3172a92N79J67l03m62l73K40N52K85q1m29m11p5M11M65J23k77n06k48K30M98L18
3193E11j13m43m10J7L89M37P2k83m90k16L54M06K63j70m34l16J4M28L75N0l29
3214A12m49j05K48M53K07j94m25l05N0L58M29M9m11l72j45L43M07K36k26m52k44
$$ y = [-591, -502, -25, 459, 554, 189, -364, -578, -296, 271, 653, 394, -120, -571, -417, 31, 465, 567, 36, -419, -570, -237, 310, 564, 317, -259, -589, -435, 135, 495, 516, 63, -456, -554, -154, 344, 588, 267, -219, -592, -413, 90, 524, 508, 5, -455, -562, -174, 464, 607, 250, -323, -542, -342, 222, 538, 445, 1, -507, -445, -38, 416, 584, 186, -310, -594, -327, 214, 510, 403, -124, -512, -458, 33, 437, 525, 164, -353, -490, -223, 299, 525, 365, -151, -468, -413, 15, 449, 478, 62, -378, -537, -222, 335, 529, 282, -189, -554, -380, 123, 470, 457, 46, -415, -486, -192, 387, 554, 251, -211, -584, -344, 208, 493, 412, -17, -428, -503, -92, 373, 496, 219, -287, -535, -305, 193, 511, 398, -45, -455, -438, -49, 388, 460, 177, -313, -529, -175, 231, 494, 324, -110, -426, -412, 16, 391, 441, 112, -337, -442, -194, 259, 466, 272, -153, -458, -408, -50, 379, 428, 17, -355, -500, -157, 250, 486, 260, -192, -436]
3235d36R0M56L77j18l84l97oK81M36J89k70m04l40K06M72L33j35l45l80p7L49
3256a03M55J77l47n02j64K75M20J99m1m22l55k9M00L85J23l42m43p8J50M52K39
3277D49j40l76l19J6L66M31j0k87m41j28K61M43J77j15m59k58J01L59L38j2l05
3298I1m63n6K71M28J14j33m72k43J22M18L12o0l80l54m3L79L53J53k27m34k58
3319d82K13M03K67m4l81l46l7M05L08J45k53l99k07K20L53K27p5l56l07l5L60
3340b1L55N7k94l34j95K50K98K78j07l69l11M1L92K74R7l40k93j72J96M37J78
3361D17j90l61k51J10L70K59jk84l69j05L01L81J85k73l65j90J24K92L10m8l38
3382b6l09o6L19K72K10k81k93k01K00L12K40o8l24l23kK59L32J43k73k74k11K01
$$ y = [-436, -346, 110, 487, 369, -15, -412, -418, -137, 299, 488, 218, -186, -526, -320, 152, 485, 350, 5, -375, -452, -103, 352, 529, 182, -320, -484, -209, 211, 410, 369, -53, -408, -437, -37, 348, 471, 129, -314, -392, -242, 210, 449, 309, -67, -386, -370, -4, 427, 417, 130, -311, -439, -178, 265, 442, 327, -132, -390, -289, 70, 408, 396, 91, -372, -428, -157, 271, 385, 252, -220, -463, -341, 77, 389, 329, -51, -405, -448, -69, 284, 437, 210, -224, -482, -269, 134, 401, 357, -24, -370, -407, -2, 306, 451, 198, -201, -408, -188, 165, 392, 317, -39, -346, -381, -21, 334, 391, 97, -237, -432, -182, 116, 394, 287, -82, -393, -352, 40, 314, 411, 71, -222, -394, -198, 239, 417, 227, -134, -385, -275, 95, 354, 353, 69, -300, -405, -104, 277, 462, 189, -176, -366, -242, 50, 360, 312, -26, -335, -401, -82, 190, 400, 119, -174, -375, -175, 137, 377, 309, -15, -338, -340, -81, 251, 394, 121, -153, -364, -163]
3404a63L38J50o0l44l07J08K92K75P0k66l36r5J92L81J52j96l35k18O8L51K62
3425C19N9k71l44p0R2M14J03l0m35k15O8L68K72k6l24k66r3K64L52R5j28l39j70
3448c05P0L08K77o4k92k37o3K67K89J06k12l38j11J50L13J83j17k96k04l6L20
3469HK47L6k10k85j56J88L09J91j32k83k24L8K97K44L2k25l28j04K82K37J63j27
3491A98l07j87J06K07K65L5k74l12n9J92L78J38k65k42j62J14K66K31q5k49k40
3512b52m2K35K13J41j73k57j90J60K94J82j07k63k04K0K52K21J05k25l43o3J61
3533a35K96J61j34k24k21J3K35K21O2k02k75o1J64L35P3j54k75k03J01K68K35
3554B80n5k27k11q7K02K77Q3j53k12k12P7L44J45L2k81k67NJ88K83J08k28k31
$$ y = [-163, 175, 325, 265, -79, -386, -278, 14, 289, 359, 93, -243, -338, -146, 235, 387, 191, -144, -362, -294, 57, 319, 378, 107, -237, -307, -215, 199, 302, 272, -163, -378, -310, 58, 330, 304, -20, -286, -379, -115, 237, 332, 204, -135, -305, -235, 73, 350, 286, -6, -243, -306, -39, 250, 356, 144, -194, -305, -155, 158, 341, 224, -72, -276, -312, 8, 255, 291, 81, -204, -360, -172, 137, 328, 196, -87, -311, -273, 24, 268, 300, 75, -253, -357, -75, 162, 325, 198, -109, -296, -190, 17, 282, 317, 43, -269, -328, -136, 242, 380, 115, -127, -289, -175, 91, 322, 237, -12, -252, -294, -59, 154, 295, 122, -135, -325, -165, 129, 311, 204, -59, -263, -243, 9, 230, 335, 110, -233, -296, -135, 161, 322, 188, -36, -257, -244, -9, 212, 274, 72, -203, -264, -100, 235, 308, 154, -121, -324, -223, 45, 280, 225, -2, -213, -300, -98, 179, 262, 109, -103, -315, -238, 106, 251, 283, 2, -265, -260, -72, 211, 319, 91, -140]
3576a40j11M2L43J31j0k58k24L3J55K84M2k45k21p4J08K52K54j47k82j68L3J70
3598c3K50P2k19k62p0J23K43R3l3k51k06J20K36K25o2j89k37n8K22J95J09n4l47
3621a33j64Q6K76J90N4l02k18j0J63K16J11j48k72q3Q1K07K04J3l26j94j2J86
3643g5K98%j91k24l0J03K14J21m6k10k30L7J67L22k9j54k10j22Q9L16J03r8k24
3666g3j69N0K18K32L6k49k55m7J00L45J05r6k40k29Q3K26K13p2j77k29o0J31K80
3689A23J36j95k18o4L6K54J66ok57k31k3J78K57J11j40k90o6J49J77J11l3j89
3711a4k52N2K19J95K5j20k81p1R5K95J29o5k74j79J0K73J39O5k09j79j13J82K00
3734A22J10m6k98j16K9K44J63M6k44k10j4J19K26J68j78j93j24L2K28J90l3k03
$$ y = [-140, -251, -209, 134, 265, 255, -3, -227, -194, -39, 245, 287, 42, -179, -253, -145, 107, 361, 214, -68, -236, -203, -33, 217, 289, 70, -192, -262, -139, 104, 197, 164, -87, -293, -173, 63, 288, 226, 37, -200, -258, -36, 159, 268, 214, -133, -297, -211, 65, 255, 309, 7, -211, -221, -58, 158, 269, 121, -151, -234, -153, 54, 258, 271, -55, -249, -261, -75, 223, 223, 32, -192, -222, -119, 95, 216, 170, -40, -270, -233, -66, 256, 227, 73, -137, -259, -170, 146, 249, 151, -73, -242, -192, 26, 258, 294, 45, -210, -257, -157, 188, 293, 197, -43, -272, -189, 37, 250, 178, 1, -228, -288, -157, 123, 259, 64, -154, -218, -182, 72, 238, 232, -25, -256, -279, -101, 156, 267, 127, -163, -229, -80, 97, 208, 175, -14, -266, -214, 5, 200, 225, 105, -176, -247, -152, 143, 272, 207, -67, -246, -236, 37, 176, 241, 32, -147, -260, -78, 122, 232, 186, -112, -228, -199, 45, 208, 254, 10, -200, -214, -95, 131, 299, 121, -72, -196, -164, 64, 254, 221, 18]
3756A8k30L5J22K50P4j96j71q1L9J60K49r3k24j75K0J92K11K0j43k14j20J21J88
3779E2J45m0j55k78J02J76J87M0k20k30j7J71J83J22j19j61j88O4K06J53L1j97
3801B7j98n6J39K35R5j44j71j76P2K14J66J4k39j21j34K46J91N3j52j51r9K6K31
3824F8J69p1j52k04j8J59K06N3j71k05l5J13J54J55k4k12j94JK09K23L0j89k25
3847a60m4R0J97J29p3k01j43N8J96J75k5j66j78p2J04K34N8j13j75p8M1K00J45
3870A99J9k14j79o7J82J75J25j42j40j85J30J32J53Kj91j11o9J51J74M7j10k19
3892a38n3R4J55J76p0j96j72J6J85K39m2p9k85o1J19J71J11n4j51j29nK07J84
3915B22k7j72k21o5J91J75Q1o7j56k06O5J82K10l3j58j28p9J47J74R2q4k92pN1
$$ y = [18, -212, -177, -55, 195, 269, 73, -98, -179, -140, 20, 269, 176, -48, -223, -203, -11, 200, 220, 77, -137, -257, -136, 52, 197, 157, 2, -276, -174, 2, 189, 229, 9, -221, -238, -67, 116, 238, 119, -42, -230, -166, 40, 193, 224, 27, -171, -227, -88, 147, 242, 98, -73, -249, -177, 37, 203, 217, -22, -143, -277, -31, 160, 213, 61, -90, -189, -163, 68, 237, 166, 14, -190, -208, -49, 157, 210, 39, -166, -201, -88, 66, 221, 197, -15, -209, -208, 1, 224, 254, 65, -160, -204, -114, 83, 212, 139, -62, -205, -147, 49, 224, 199, 33, -145, -217, -113, 121, 179, 66, -109, -187, -146, 54, 199, 218, 4, -175, -242, -60, 115, 240, 98, -42, -227, -97, 35, 188, 190, -1, -112, -181, -30, 144, 191, 81, -138, -191, -97, 58, 234, 164, -32, -204, -188, -3, 236, 194, 115, -170, -231, -112, 59, 170, 116, -35, -164, -169, 38, 222, 195, 23, -198, -263, -72, 103, 184, 117, -39, -245, -180, 2, 212, 179, 21, -107, -186, -39, 135, 227, 143, -149, -156, -105]
3939a05J45J79q9j03j93OJ14J84M2j44j25j54J17K04J50j33j30j16l1J50J86Q1
3961B35j74j99n0J57J62Q7j05j59j41N4Q7K16M2j17k66J2P2K17R8j66j03j87Q8
3984a40J95J25j2j55j38r2J24K37jl4j99j53J27J31J47Rj46k11n9J87K43L2j55
4007F2j51j27J18J99Q5J6k29j28jJ56J74M0r7k80q9J11K00J55n8j33k84Q3J52
4030b6J49P8j89j83m6J30K00P7r4r7k20J29J35J82l0k32j17o3J45J85Q6o9k16
4053h6j41N1K06J56Oj33k71O8J29J48J16j31k93j7K1J84J80n8k00j01k0J12K38
4076A64mn7k16j24N6K86P6k8j85j27jJ61Q3J41j49k28%L8K19J13nk28j57K1J81
4101C0J55Kj85j42k3O8K02O1j03j25j73M0K12J58oj62j88j3J35J84M4l5j64k11
$$ y = [-105, 40, 219, 130, 27, -166, -160, -46, 138, 180, 36, -89, -243, -126, 78, 228, 95, -35, -151, -182, -32, 154, 235, 61, -138, -188, -31, 131, 218, 113, -46, -187, -133, -46, 170, 212, 95, -171, -159, -87, 130, 228, 62, -41, -228, -140, 55, 180, 168, 13, -125, -217, -93, 144, 143, 109, -90, -243, -116, 15, 162, 171, 25, -186, -245, -58, 185, 217, 62, -89, -216, -98, 101, 186, 202, -27, -155, -156, 0, 174, 214, 117, -163, -252, -141, 59, 214, 156, 23, -261, -178, -26, 123, 201, 12, -171, -217, -87, 113, 190, 96, -1, -221, -92, 43, 225, 195, -37, -154, -217, -72, 113, 199, 130, -86, -227, -176, 30, 186, 192, 59, -212, -144, -15, 133, 249, 118, -175, -192, -171, 13, 193, 135, -65, -166, -186, -74, 164, 160, 103, -113, -237, -181, 105, 181, 153, -32, -159, -160, 1, 84, 225, 76, -152, -152, -114, 105, 218, 213, -15, -172, -151, 30, 185, 187, 2, -140, -163, -95, 107, 168, 65, -60, -233, -193, 19, 177, 171, 9, -179, -192, -57, 127, 171, 136, -28, -239]
4125b39J15J58J36J1k01j09qP8J59Q7n9k11j45Q5K00J35Kk07j93RJ32K03P0j54
4149E4j66r4M1K40J59l6k47j34PJ46J50R7j56j35r2N4J84J53r0j61j70K7K02J25
4173A58M3q8k42k9J8K48N5l4k11j60J20J70J92o3j84j41J0P9J92N0o3k17j02L0
4197a69J43J88j5j71j52j9J52J47J02j46j58r0N1J68R8L6j63j57MJ29J87Rj27
4220D7j10r9Q5J27J78r6k16j13oK09J63J0j76j60m3J57J02J41p9j85j00J6K25
4243G7Q2j3j57j13p5J38R3J47m6k23q1J5J85J14J8j50j59o3J97J81M4r2k08m1
4267a30J1K17N2lj42j53J5J48R4N0j27j01j33P5K26P8n3j86r5m0J36J78L3j11
4291C9j56p9J03J59J41n5j85j05kJ22J55N6j33j87n2J23J52O1k1j46j08JJ25J88
$$ y = [-239, -124, 34, 170, 181, -20, -129, -137, -59, 100, 187, 128, -83, -228, -143, 57, 192, 194, -13, -206, -197, -65, 138, 208, 54, -112, -206, -165, 75, 234, 198, -49, -183, -176, -30, 120, 217, 61, -74, -166, -112, 72, 225, 135, -26, -196, -169, 33, 158, 201, 113, -129, -158, -140, 108, 163, 129, -82, -242, -122, 48, 240, 177, -7, -148, -138, -59, 133, 183, 120, -97, -199, -169, -26, 162, 147, -24, -176, -195, -43, 104, 206, 60, -98, -188, -137, 31, 129, 165, 2, -155, -151, -22, 165, 174, 47, -63, -162, -77, 50, 228, 132, -84, -197, -203, 6, 169, 179, 3, -157, -200, -43, 59, 200, 121, -64, -164, -148, 77, 159, 146, -11, -124, -199, -61, 32, 179, 133, -90, -171, -156, 29, 143, 161, 11, -148, -211, -14, 167, 211, 119, -89, -130, -119, 98, 150, 147, 5, -148, -133, 15, 109, 159, 32, -69, -202, -127, 99, 177, 124, -62, -157, -197, -61, 117, 150, 39, -117, -196, -93, 66, 207, 152, -33, -138, -140, -18, 137, 193, 60, -127, -179, -56, 96, 157, 136, -10, -118, -117, 8, 196]
4315A96k0j40j94k7J51J16R0j02j62r1J0K34Q0k3j76r0RR7J32J21j60j85m3P0
4339a07J68J30q6j22j36j8J80J30L4q3j54q2K3K56O4p5j92p0J4J65J12Oj18j29
4363i0j23J54J21J10n9j87m5l9J44J57K3j25k00l8J43J35Q7n5j60r8LJ33J78J3
4387A82j95j02l0J13J40L7l7j74m5Q8R8J24p6j14j55j7J66J39k0m1j77r0M7J88
4411D9P5pj72q3LJ51J51k8m1k55j8P0J75O4l0r5j51RJ64J11L2j28j98m0J25J33
4437F6Q2Qj74j58K8K24J26o8j54m7r4J02J89L7p3j34p8M3R9J24K3k09r0%J07Q6
4463F5J00j13j56l4L6Q6J14k7o7j55J3J14J50L6j9j90j31J17J46Q5j8j15j64j7
4487a44J48J55k9q9j30o7J03J04J46o7j87j05RJ31J28rm7k31l3J38J96J7p4j13
$$ y = [196, 176, 36, -158, -185, -34, 82, 172, 70, -92, -183, -173, 61, 141, 118, -58, -148, -139, -42, 90, 211, 51, -134, -177, -107, 61, 191, 105, -17, -153, -171, 9, 139, 173, 90, -64, -146, -123, 133, 197, 122, -70, -140, -126, 39, 151, 157, 39, -90, -213, -59, 62, 172, 113, -74, -119, -158, -14, 143, 166, 41, -159, -197, -54, 81, 168, 113, -47, -145, -142, -9, 169, 182, -13, -115, -145, -32, 108, 145, 108, -66, -111, -23, 75, 199, 123, 9, -146, -163, 3, 142, 122, 81, -96, -186, -139, 49, 124, 117, -55, -138, -135, 16, 167, 139, 98, -157, -175, -105, 70, 134, 104, 9, -142, -133, 31, 142, 174, 46, -152, -192, -67, 66, 148, 156, -18, -176, -148, 76, 202, 134, -20, -67, -161, -59, 130, 167, 94, -40, -118, -75, 24, 148, 171, -38, -128, -128, -21, 65, 165, 52, -104, -138, -102, -16, 98, 71, 4, -151, -138, -24, 126, 162, 143, -47, -178, -61, 85, 170, 152, 37, -127, -144, 4, 159, 130, 41, -89, -156, -53, 51, 197, 130, -57, -162, -153, -22, 106, 97, 50, -181, -214, -76, 120, 137, 63, -50]
4511e0j24J12J35M8k6j7j58q2L4K49O6o8k02o7P7J03J16m4j20j08mQ9J22L0o7
4536D4j05r2Q7R7R8k4j18j27J5J03J49K3r4j56n0O5J41J62r0j80l8j3J10J32L9
4561A78j45j67l5Q6J51J07j08j19n4L3J00J25m4j10j45k7J48R9J03r7j04j36K2
4584a39J20J32j4j52j25L2N3J38J27j09j46q9O5J50J13l2j18j00l2J20J36ro2
4607E9j35p6R4J07P3N3j77j53jJ92O9N3j00j87m8R7R0J12j4j51r1J4Q5J42K3j14
4633A6r0l4K4J71Q8p0j45r0PJ35R8Qr0j22j4Q9J03O9o1q1j55L6J44Q8lo4j49l1
4661a23R1J01N8o2j49n6P4R9J35r8j43j2l7O2J45P4j52q3q4N2K09M3k7j33j31
4686a47K9J23Q4N7j14j37l1N9J55P1l8j63q1rJ82O9J2p1j37nMJ74N5j5j96p2N2
$$ y = [-50, -174, -62, 73, 121, 95, 78, -80, -162, -128, 121, 187, 119, -83, -150, -73, 30, 146, 102, -18, -126, -130, -41, 81, 111, 44, -61, -153, -66, 31, 129, 105, -13, -140, -125, -22, 127, 150, 56, -100, -150, -85, 56, 218, 128, -52, -90, -103, 7, 139, 178, 33, -134, -169, -83, 68, 175, 67, -52, -106, -73, 27, 152, 108, -2, -147, -174, -26, 73, 176, 79, -25, -161, -139, -19, 113, 99, -53, -178, -146, -93, 45, 172, 63, -83, -172, -107, 43, 156, 124, 6, -94, -126, -6, 130, 121, 59, -76, -152, -58, 49, 122, 175, -2, -155, -156, 36, 105, 158, 58, -129, -177, -80, 10, 122, 108, -43, -134, -120, -35, 107, 130, 16, -74, -108, -84, 87, 175, 105, -40, -130, -123, 12, 110, 118, 28, -94, -108, -19, 84, 153, 92, 11, -144, -108, 36, 124, 121, 57, -92, -123, -32, 69, 127, 65, -84, -140, -66, 33, 168, 70, -73, -85, -122, -60, 85, 159, 7, -76, -160, -108, 101, 144, 117, -16, -147, -118, 5, 89, 146, 32, -105, -136, -77, 78, 149, 111, -52, -133, -142, 40, 109, 121, 50, -87, -92, -88, 86, 141, 126, -70, -142, -90]
4713i0R8J15l4j26j21K1Q8R7J23j52q3q0O9J08Q3j8q9j19m4J47J36K4j46r2m1
4738a26J27lJ15j1r2j29L4M3J42K2j18j17n6O4J50P0q9m7q5j2P7J24Or7q3PL4
4765e0J01N8jj77q7J7J59J15L1j39p9j4NP9J49j02j36q3K5J60R1j9j01j03qR7
4791a2O3Q8q3j45k2K8J42jL0n9j54JJ16J08O0o8j74k3M1R9R4n5r4p5K0M7J07M9
4819A28j28o4p2M8J09L7J5m7j42J3J19R9k3n8j51jO3J89j7p4j23n9L8J45P6l0
4845I0q6j14L1M2J20n1N3j39p7L2J45O3q2l6j1j21J42Q2J7qj57k2O3J02L5k6j29
4872d2l5K5O1N8k4j5m2p3M8J40K1l4j11p2jJ08M9M9r0j01l2O4J07P5m7r1j19K8
4900i6J09Q8j7j05j0m3K7J04P7q2j22l3M8N1R8J6j19p6JK8J43L5q7j00m5pK12
$$ y = [-90, 8, 123, 89, -37, -158, -137, -49, 48, 171, 19, -64, -144, -75, 33, 116, 98, 9, -110, -154, -7, 129, 153, 7, -85, -126, 1, -2, 113, 102, 10, -119, -85, -42, 100, 122, 4, -113, -169, -105, 45, 115, 26, -21, -106, -118, -41, 83, 89, -8, -91, -84, -50, 51, 109, 108, -69, -156, -139, 20, 135, 166, 27, -52, -66, -61, 18, 167, 65, -71, -154, -129, 31, 122, 103, 2, -101, -109, -12, 51, 139, 56, -89, -111, -83, 59, 58, 88, 29, -125, -124, -8, 100, 160, 92, -82, -105, -64, 35, 129, 74, -20, -95, -75, -28, 79, 128, 0, -64, -136, -88, 21, 58, 73, 26, -116, -103, 16, 115, 92, 34, -117, -118, -55, 134, 117, 43, -80, -139, -101, 44, 120, 90, 4, -110, -79, -37, 83, 32, 85, -54, -131, -99, 46, 109, 27, -9, -20, -141, 1, 83, 100, 92, -65, -87, -24, 78, 113, 87, -42, -77, -52, 9, 67, 43, 28, -14, -87, -39, 101, 122, 88, -23, -95, -96, 12, 61, 110, 20, -81, -113, -49, 58, 133, 86, -5, -124, -96, 13, 101, 84, -21, -31, -74, -47, 57, 134, 52, -70, -103, -55, -4, 94, 110, -9, -85, -84, -56, 87, 122, 35, -65, -110, -117, 95]
4927I5N0n8r9j02R1K6R0Jn5r7m3M9J04P1l0o1j38Q3J12m8J00j38p4j6R1Q1M4o0
4955F9j29mJ0O7J05k8p1j11j4L1J43J7k3j16j3p2J10J26J0j24m3l3N2J00MK2j24
4982c9n1kJ65L8n7j24j3LN1J39k6m2r2m2M7J23M4n5j11k2l7P8R4k2Pr0q4K3J60
5011F3J9p5n0k6m4J20P4Kq6m8n9L5J17Q0j23o6l1M2N4N8l8k1q1QP1P9P8r4r9n4
5041i5L2M0J41m6k4j28PP3J19rj38n2m1N6J11O9p4j05oj0O3N9L5n3j14K1J7J24
5069G2M4n5j6o8p1N6J32J5p0r1j20J60N8Q5r1n8j06Q4N0P0nq6l8l9N1J08k8k8
5097A5q4j1L2Q2O0l8p9q2M5RP4L9m7m0n1jJ04R3l1q5j5o2J21J6qoj43P8j6J00
5127F9J9q2m5r2J0J03M6N2p1m4k5K8J22j2L2j48m7l5J42J8N8o8o1n2R8P1po7J9
$$ y = [95, 145, 87, -12, -114, -23, 3, 93, 94, 39, -58, -101, -52, 52, 123, 93, 32, -106, -23, 89, 41, 141, 3, -71, -87, 4, 85, 129, 69, -60, -64, -54, 13, 118, 90, 19, -92, -106, -75, 68, 85, 62, -54, -67, -139, -29, 97, 107, -17, -60, -93, -41, 59, 63, 85, -39, -90, -92, 73, 111, 54, -70, -83, -80, -29, 110, 84, 42, -50, -92, -45, 78, 122, 67, -44, -66, -103, -25, 69, 47, 54, -36, -120, -97, 63, 82, 7, -43, -69, -113, 7, 81, 83, -3, -51, -110, -75, 42, 122, -1, -67, -98, -56, -2, 56, 18, -3, -84, -76, -5, 74, 152, 58, -41, -95, -63, -23, 118, 72, 48, -80, -73, 0, 119, 110, -28, -80, -121, -65, 46, 115, 41, -64, -70, -80, -17, 42, 77, 24, -90, -69, -52, 72, 116, 61, 45, -23, -94, -38, 94, 109, 39, -52, -172, -12, 46, 131, 40, -18, -124, -40, 10, 80, 75, -11, -49, -88, -37, 71, 43, 15, -69, -80, -48, 34, 94, 56, -23, -105, -60, -51, 23, 62, 15, -25, -76, -77, 27, 120, 89, 4, -11, -73, 48, 64, 56, 50, -93, -15, -31, 69, 88, 6, -39, -131, -121, -18, 28, 80, 9, -35, -60, -32, 90, 78, 110, -38, -85, -120, 22, 40, 98, 30, -31, -83, 15, 86, 79, 12, 31]
5156C1j59J40KR5l7j15l7QR1M8P6j44m8q9N5J29N7l5j43J4nL3Q0P1p6q8l4Q8L5
5185D3J2Lo7l3l1J11k9K9l2l3n1J9J02L0r0lp0Q3N9R6m2r1q0j4Q0L3L8m3r2j0
5215g3L8P5QK9p6j07L8K0J22L9o7j23J7RO9R2o7n9p0L6J0R6Rm5l9n5N4nJ02J5
5245I2m7n6k1J0J24k3o4p3pLP3J10j14k0o5N8j5J15Oj10l6jPJ38L1m4r9n8N9K
5275b5N7M3m6p3J4M6P7Lp7k7q6N0P1P4p2Ko4k7N5Q2K4r3Lr0N4P2nN5j51k8K3P9
5307B0O3n2l4o6k4OP1N2M1r8l0l3L7J03N6p7j50LN9J52K2p3p2l6K1P3O1j1r4l
5337a3ljQ6Jj6j22l2JJ36k5K6m9m8l9Q4J25p0k5p2m3K2J33j8J6m3p8j9R5M1nl9
5368Fl3l2R4m7J07n5j05M5n4P3K0N2o6o7j2P7QM2rl9j2o8N3J41n0r1k4j4N0L2
$$ y = [31, -128, 12, 14, 109, 72, -43, -80, -72, 19, 67, 143, -1, -49, -138, -83, 46, 103, 68, -75, -61, -66, -33, 47, 118, 42, -46, -80, 8, 43, 55, 58, -9, -42, -73, 38, 9, 38, 6, -27, -78, -59, 43, 73, -17, -20, -90, -7, 52, 148, 106, 15, -65, -79, 1, 34, 72, 29, -63, -73, -35, 40, 48, 77, 1, -106, -68, -48, 74, 113, 46, -77, -60, -51, 18, 110, 43, -16, -86, -50, -40, 56, 65, 20, -19, -74, -20, -25, 77, 92, 45, -11, -32, -22, 102, 79, 15, -58, -65, -62, 11, 121, 7, -13, -78, -20, -35, 80, 86, -24, -60, -61, -54, 84, 115, 71, -28, -86, -27, -25, 32, 75, 29, -44, -30, 16, 93, 96, 19, -8, -94, -44, 27, 101, 29, 31, -33, -60, -5, 77, 101, 8, 11, -79, -25, 47, 42, 97, -54, -82, -59, 20, 83, 31, -3, -69, -93, -87, -16, 36, 77, -21, -51, -84, -47, 56, 112, 35, -115, -112, -53, 99, 121, 48, -24, -60, -39, 34, 95, 84, -10, -13, -16, -17, 69, 70, 54, -68, -100, -99, 37, 12, 38, -11, -59, -98, -14, 111, 41, 16, -56, -99, -77, 56, 38, 54, 11, -67, -86, 9, 50, 45, 6, -27, -59, 35, -12, 95, 40, -65, -20, -74, -1, 19, 71, 5, -62, -74, 3, 11, 53, 44, 5, -7, -75, -22, 119, 69, -22, -46, -60, -10, 22]
5398B2LJo1p9P2M9K3O4r4m9K4j2M8N5m7o4l1K5J21K6k6o3o7J1jJ23N6r9k4q9L6
5429d7J18qjj00l0k2J11ML9q2l5Lj0J04K1q0oJ2nM8N7J9q2n5j2NQ0Nj7n5m2L0
5461c3N9L0N2j26K1l8L3M2K1q1Jn2N7L0K2N2j51j0K2J04J5j5ro8p1N8Q9j9m5r
5491a9k3k3M7K6N4qj22K0PP1N7k9q1MmK6R5n2j4n1m5MJ01J4J5r9J7l5Q1J6n5L5
5523C0o7L9k1Q0pm3r0L7pR6K9m5l1m6M0J2M5O4j17j3m9L3J04l0K5o1l9J5L0M0
5553E3K5l7q8J7L0L5K8o8%n8L0Q7j7j7l7%m3L1R0j9J6p1k7J9J2RN8n2p0L2L4J1
5585A3N2m1k7r2Q9L4%Qm2m6j6J19k1K3k5p9L3M3j1Pkj0p3J1OP1pj0n7LJ3R2On0
5619A4k5q0P7KN7Ko4K8p2N8N7o2N2j7l1k3M0P5p3qo9k0O5J6J7j9K0r2J9O9N5J
$$ y = [22, 25, 26, -35, -114, -42, 7, 30, 94, 0, -49, -25, -37, 11, 66, 19, -45, -76, -51, 70, 96, 70, 7, -60, -49, -50, 73, 129, 30, 6, -83, -47, 71, 63, 62, -38, -68, -90, 21, 25, 64, -18, -53, -50, -60, 44, 65, -15, -21, -9, -14, 34, 91, 110, 28, -27, -39, -34, 46, 51, 34, -21, -63, -33, 26, 56, 108, -18, 3, -35, -2, 40, 61, -20, -19, -71, -14, 16, 38, 90, -61, -71, -49, 55, 70, 55, 46, -22, -93, -35, 54, 35, -10, -19, -42, -65, -18, 8, 62, 54, -68, -48, -41, 30, 87, 58, -23, -19, -23, 3, 98, 46, 32, -19, -64, -60, 41, 55, 70, -29, -12, -47, 34, 50, -5, 30, -37, 2, -19, 61, 54, 11, -79, -42, -49, 47, 76, 31, 0, -46, -6, 6, 51, 115, -2, -15, -64, -31, 73, 43, 68, 7, -32, -17, 13, 53, 78, 41, -47, -30, 0, 35, 63, -5, -5, -63, -33, 54, 37, 20, -17, -17, -60, -29, 61, 42, 58, -13, -40, -21, -9, 0, 58, 6, -64, -32, 2, 13, 65, 24, -3, -95, -6, 28, 28, 36, -6, -52, -68, 51, 30, 53, 28, -51, -18, 25, 14, 21, 19, 9, -64, -53, -47, 24, 17, 7, -50, -47, -34, 58, 64, 14, -11, -91, -14, -12, 45, 47, -17, 11, -61, -3, 54, -8, 44, 27, -4, -27, 13, 88, 15, 7, -62, -82, -17, -1, 16, -3, 17, -75, -56, 13, 68, 69]
5651F9j08K0n8J09l2O1p5n0J1J2N8L0Km3m7jP2K1J0j4o3l5M4N3rj3ql5k6M7O1
5682F3rl2m7Pm6N7L0j3o8K5l5M4R8m4m3oo9K4R6J0o2K1j6k1L4M5J0m7Mp8O8N9
5714E9lj2m8mpMO2o6K5p9P8l1N0J6j2q2JLM1N0r3J7ml5N7lj1N5k2m5NK5Jj2j5
5749c5Rj1O3K4Kj10O4o2M0K8k5R5k4p0j6J0P5k6o2K7Jj2M0l3O1q4m0N2KO3k4r
5781A3p7J7K2P5%l8j8lL8J7Lk1k8m8K0K5P3n6K1l4m6L7K7qoL1j9l0L8LK1o8l1
5814e0K9PK8K5l9k1l6L7N2rk7rk8j8L4L9M0k0Jp1nM1O6rr8L2nJ2L3J3p0J0j1j
5848b8Q5l8n6K6k0kL9P9o8k3k2l7O6J6j4J2m5OK7pK4l3Ppn8O8L4J2j9j6l4PL5
5881A6Jk5K5m9N2J4j2K9Kq2J8nM2l9K3nj9l5N4j1L5l8j4J5p3J00lK3q1M9r4N2
$$ y = [69, -39, -19, -77, 32, 0, 61, -14, -64, -53, -41, 17, 47, 49, 6, -41, -42, 30, 51, 61, 47, -16, -51, -7, 46, 37, 24, 16, -19, -45, 2, 63, 54, 22, -25, -18, -64, -7, 23, 10, -58, -33, -68, -24, 74, 30, -13, -19, -88, -64, 32, 42, -20, 1, -15, -36, -2, 43, 53, 6, 10, -68, 0, 59, 56, 44, -4, -8, -15, -11, 51, -15, 10, -69, 9, -22, 28, 44, 32, -50, -49, -46, -5, 45, -48, -31, -35, -70, -13, -16, -27, 28, 6, -39, -34, -9, -8, -20, -35, -26, -37, 26, 50, 52, -58, 6, -56, -16, 12, -13, 82, 58, -12, -28, -18, 57, 31, -31, -4, -3, -15, 25, -8, 53, -31, -71, -19, -17, 46, 22, 13, -64, -47, -25, 50, 50, 12, -6, -9, 29, 46, 49, 28, 0, -48, -28, -3, 70, 14, 35, 1, -45, -8, 19, 11, 5, 36, 17, -13, 25, 28, 49, -19, -50, -21, -14, 14, 39, 0, -21, -57, -20, 32, 23, -4, -13, -41, -59, -25, 14, 54, 34, 35, -36, -41, 0, 66, 57, -41, -9, -14, -2, 31, 44, -26, -16, -27, -28, 57, 19, -37, -11, -31, -33, 6, 85, 17, -6, -28, -65, 1, 17, 3, 15, -30, -24, 3, -4, 20, -13, -6, -13, -71, -3, 31, 43, 24, 8, -26, -19, 16, 17, -8, 17, -32, 20, 34, 22, 51, 53, -29, -11, -16, 26, -13, 10, 5, -14, -49, 5, -6, 29, -9, -23, -8, -81, 19, 16, 39, -42, 7, -87, -35]
5913c5K0K0l6M0n2PQ7j7km9rK8nL5NJ1q2Rl1J12mo1M8r4K4K8kL6k4lo8L3k9L7
5947b3L6m6j8L2L7L6k5J6q7J3Ml6M7M8r5L8l8O7J8k8n5PP2j7L1j5Pj8l3l6Q5K7
5979E1rl3l7L2NK3K9p2m2JN5j3K5k2jk5k8Q2MJ8o8j0M3p4J01k4L6n5Rpl5M0N8
6012E7p0o0Q1oM6k3l4J1k2K2OK5j9pn3L7L0QK1%j05M2j6RN4pj2m4LMNK7K3n8k9
6047e4O6rl5K7l5N5n1N1nM3ol8roKO0o6j4L0pl4M6O2q8k5K4N3l1L3n5j9L7k2L2
6081A2pj2K2n0pQ4J1j9J1n3KpoL2PPm6o5N6K8J0j9Kj0Lk0O3l1m1K2K7L1k6L5k3
6116B3n6J0j8K0lJ1k6nL6lQ2m1j0j0j6J7m5N6j9nj8o2J05LP1j01jqOM0j7K7l5
6149Hk1l0P0p9M3j6Lrj3L0J0j0knK1jQj3k1J3NM2Rk5j8k9LLM0K2l8L2q1J14rp2
$$ y = [-35, -15, 5, -31, 9, -43, -36, 51, 34, 32, -17, -26, 2, -3, 32, 37, 48, -34, -25, -56, 56, 52, -9, 39, -55, -31, -3, -5, 31, 7, 4, -64, -31, -60, -23, 13, -33, -51, -19, 18, 54, 29, 45, -42, -29, -25, -61, -14, 34, -61, -23, -61, 6, 24, -4, -59, -52, 20, 3, 34, 19, 26, 8, -25, -61, 24, 51, 42, 9, -28, 4, 9, 32, 61, -11, -53, -52, 3, -10, 15, -7, -8, -33, -61, 21, 25, 43, -25, -35, 8, -66, 35, 11, 47, -8, 1, -6, -41, -1, 57, -13, -73, 8, 2, 48, 25, -9, 2, -20, 2, 8, 33, 14, 7, -46, -9, 21, 29, 50, 50, -55, -13, -29, -20, 34, 27, 15, -29, -26, -22, -17, 10, 33, -25, -54, 12, 3, -32, -5, -40, 15, -36, 15, 10, 53, 47, 9, 0, -6, -4, 56, -10, -24, 6, -1, -35, 11, 73, -15, -40, -16, 37, 6, 39, -16, -35, 2, -20, 12, 5, -7, 15, -35, -42, 42, 53, 34, 45, -8, -6, -13, -19, 13, 20, 27, -19, -84, -28, 0, 10, -9, -7, -17, -14, -34, 29, -2, -43, -21, 6, 37, 11, 46, 23, -33, -23, -41, -21, -24, -13, -39, -44, -8, -11, 71, 30, 20, 10, -6, 11, -34, 22, 3, -2, -20, -82, 23, 26, 97, -4, -5, -13, -7, 33, 16, 43, 8, -13, -43, 27, -52, -9, -25, -22, -31, -44, -14, -4, -14, -16, -21, 0, -1, 7, -6, -27, -14, -9, 33, 42, 17, -1, -30, -27, -24, 16, 38, 0, 32, -49, 65, 56, -16]
6185a6O4j4n0M0k9K4L0q8J4L3J6m3N9l3o5M7k1L9J9m5j6K7m6N9m7k0O8kk7%JM5
6217B3m0olk7L1O1J5L3p2nk7R9j2l2l6k4M7J1Jk4j9MJj6K5N6l1o9J1k0k9J29k6
6250B9l8L0o1M6J0L0k6k2j5pJ7R3no4rm2kK8P6j9q5J8p5J10l1O5k8o5k5NP6L4
6282D8m2m0KM0Kj8L5K3q4K0mM7K2rjr3M0QoL7p9P2l0k5M1%J2ol2K3pN3o0L4m6
6317b3k6M5L8j1kp4J5m8R9M4o4J3p3P4j6K6Jnl6J0nl3L3K1o1J1O6J5j4Rl7l5O4
6350B1%JM4q6N5q9L3pL1jk3J7m6L0K9j5%k5k0J8J3j9K7M6p6p1R4J6k4O5l3o0N
6383e0N6RL0m7m7J7kN1J0j8n2MK1j6R7j0o9K5J1rM3n7l8N6j9M9j2o5K2%kl4Q1
6416C5k7m3J9m4N4j9P2n8M1m3Np6J25l0n0L8Oj5j1N3Mk4j0pl3M1K7j5K4j05N7
$$ y = [-16, 48, 34, -16, 24, -5, 19, 49, -39, -25, 8, 24, -19, 40, 7, -58, -11, -32, 7, 26, -19, -35, -8, -54, 5, -42, -62, 6, 4, -23, -23, -22, 23, -17, -23, -26, -53, -22, 39, 54, 87, 15, 10, -17, 82, 70, 38, 2, -22, 25, 36, 37, 13, -6, -2, -1, -17, 8, 64, 33, -36, -25, -45, -74, 55, 29, -9, 21, -40, 6, 16, 46, 20, -2, -17, -24, -7, 86, 81, 17, 8, -34, -36, -8, 68, 49, -36, -18, -93, 17, -14, 51, 23, -42, -67, -62, 14, 48, 6, -34, -32, 8, 10, -8, 27, 50, -34, -14, -18, 29, 51, 42, 41, -52, -12, -4, -10, 27, -52, 20, -10, -35, 6, 6, 18, 12, -20, 3, -4, 49, -11, 23, -23, -49, -4, 34, 23, 21, -53, -38, -86, 13, 57, -7, 6, -67, 7, -9, 17, 18, 13, -23, -13, -18, -51, -18, 3, -58, -47, 19, 34, 20, 29, -8, -43, 21, 21, 22, 66, -20, 35, -54, -21, -28, 3, 2, -21, -4, -50, -20, 9, -6, -6, -31, -51, -33, -20, -39, -12, 34, -42, -113, -19, -3, -27, 38, 5, -55, -50, 6, 15, 45, -2, -49, -32, -34, 17, 27, 9, -43, -39, -18, -34, 63, 53, -16, 9, 20, 11, 54, -3, -41, 15, -4, 45, 33, -32, -10, -10, -12, -46, 35, 8, -35, -16, -60, -6, -25, 47, -11, 30, -13, -8, -84, 41, 11, -39, -1, 5, -10, -21, 32, 36, 12, 2, -5, -38, 3, 30, 15, 39, -66, -9]
6447iK3J4N4o0J8n8K8M2m1J3k9p6Q2j3O9p7J7j5kl3P8k8rK2j8M9o2K8j2l8L4Q
6479ak0P7l9k1kok5KN2J5l7ll9O2J8p0O1j5o1J9N5JoL1q2jML1o5QK1kL6L7m2N6
6515D9m3p4J13NmPJ0l7q0P4k0%Kl2j%l2P3J6j0p0P0L1k2K1l4m2J6j9O6Nq2J8l3
6549e9J7K5J2k2LN3o1RN0K1Qo9k3lP3j1L5r6O1k9j1N2KJ0o5k2K6qO3J0m7k5mj5
6583d0L8l5M2j9l1M0j1M3n5PnJ8%j7Q2n9lnl2R9mj8k3Rj4L3J2k5M2p7k2jQ0mM5
6618I0p4k4j5O1o9L0Om2j5O5j8K4j0k4rkN9j3K1k4Ln4RK6M5n8P2k6o1jK9K8l4
6651eOq6N9M4M0o0J4jn5Q1m2l4O8r3K7K1L2JRk8J4J0n5m3J09K3q6l5N4K8K1q7
6683d9%K1K3J7qJ1j3k8P9qKM8j03J0J0p5Q9PK5rq0K8L5k5N6m0m3lN7k5l0L0l0
$$ y = [-9, 14, 28, 82, 22, 40, -18, 10, 52, 11, 24, -5, -81, 1, -12, 57, -20, -3, -18, -20, -53, 25, -3, -12, 10, -8, 41, -21, 7, -5, -43, -9, -1, -21, 56, 17, -4, -6, -12, -37, -35, 17, 32, -5, -8, -47, 15, 33, -37, 24, 9, -52, -33, 22, 23, 17, 48, -34, -35, -31, 0, -65, -57, -36, -38, -2, 35, -7, 49, 6, -68, 45, 50, 46, 53, 63, 26, -54, 20, 0, 0, 2, -30, -31, -31, -63, 10, 26, 16, -54, 16, 47, 25, 46, 12, -30, -14, -33, 33, 38, -44, -26, -59, -42, -17, -5, -27, -24, 29, -32, -23, 27, 48, 56, -13, -36, -39, 34, 23, 58, -38, 23, -6, -17, 35, 37, 47, -18, -40, -14, -22, 41, 51, 4, -21, -25, -40, -2, -37, 5, -14, -45, -5, -16, 27, -28, -21, -26, -8, -8, -25, 57, -2, -5, -10, -42, 57, 53, 35, 12, 21, 7, 40, 52, 27, 69, -8, -30, -31, 49, 45, 90, 16, -8, -23, 38, -31, -1, 5, -37, -52, 13, -5, 19, 9, -15, -24, -26, 33, 20, 41, 17, 20, -34, -25, 1, 46, -12, 60, 34, -27, -28, 1, 29, -5, 1, -85, -26, 18, 58, -2, 12, 11, -44, 37, -5, -39, 29, -64, -37, -16, 16, 17, 26, -2, 12, 22, -33, -76, 33, 56, -30, -65, -11, 17, 38, -49, -49, -28, -5, 12, 4, 15, 2, -26, 53, 45, 47, 95, -8, 2, 12, -63, 26, 33, 58, 49, -31, -3, 32, 7, 63, 23, -20, -23, 34, 9, -21, 9, -21]
6716b1rr4J15K3J8k8q8M4K0L9L2l1k4l5Q2l6M2k7k4l1N5n1P8On8k2k7nQ2N3m4
6747C4o2kM8JrN5r1%Lj4M7L8j5k2o8K0M1kM2k1n1m2M6J8P7l1k1m1OK6M6k7j9l4
6781b4M4p5O9L7j5m6n2O4L7K8l2k3l9j1rP4jk2m8PK9K4K8J8o1l5l7L8MO4j8o0
6813d3lk2J23K7n7n5J6LK3Ol0K7k4O3p7L4jO5j35P6m4OK2O8q9RjNpJ2NK3m1p5
6847i1P3M1J1m0ko0R5n6M2M0k8l0K4j5Rk6M2p7j9R7k6M0l4j8k7J9L0J0kOn3Mk
6880b3Q0n8N0j02M8k7L1J0j7L4p5N9n2K2M1K6l5l0j9M2M9m2k8m1j8M7J29n3k6
6909B2p1K2L6M7o3MQk6m2M3oL7Rmm0P8k1n5L8l8o3M9K9K5l7L5j9m8K4j5N7j2k1
6942a8k5Q1n1M4%Qn3J1OKL0l2Om1K0L0K5k7m3L4j1lQk9M1m2K9j6k0Q4n9q%l3J09
$$ y = [-21, -30, -124, -9, 14, 32, 4, -84, -40, -20, 19, 51, 20, -4, -39, 43, 7, 49, 22, -2, -33, 22, -29, 49, 55, -3, -25, -52, -57, 25, 78, 34, -28, -30, 18, 19, 10, 65, -26, -26, -23, -37, 10, 48, 33, 11, -57, -37, 4, 2, 44, 23, -28, -70, -24, -6, 71, 40, 19, -22, -16, 10, 56, 29, 10, -24, 20, -55, 14, 51, 36, -10, -62, 2, 39, 67, 35, 12, -27, -38, -47, 27, 26, 4, -44, -37, -8, 16, 44, 62, 1, -34, -71, -33, -29, 35, 17, -43, -46, -68, 55, 82, 25, -30, -14, -11, 12, 18, -12, 15, -9, 54, -23, 11, 10, 75, -60, 16, -28, -22, 0, 68, -21, -12, -13, -8, -15, -3, 2, 25, -16, -91, -18, 23, 34, -6, -8, -68, 27, -29, 13, 53, 25, -5, 19, 4, 13, -13, 29, -48, -67, 30, 4, 44, 10, -8, -35, -16, 14, 24, 22, 28, -25, -21, -23, 57, -1, 49, -53, -5, -32, -1, 9, -8, 26, -49, 10, -42, -20, 21, 47, 12, -18, -37, 5, 54, 12, -16, -57, -75, -28, 101, 48, 22, -49, -27, 9, 56, -7, -3, 5, -21, -63, -20, -26, 11, 20, 16, -24, 54, 33, -22, 16, -22, -85, -36, -7, 18, -19, 16, -3, -51, -27, -42, 15, 3, -18, -43, 38, -13, 31, 31, 39, -14, -3, 3, 5, 35, 3, 9, -32, -12, 18, 43, 16, -27, 7, -4, -7, 1, -28, 13, -29, 0, -16, -36, 48, -11, -19, -19, -52, 57]
6977E7k7lJ5k7k2J6k7P0k6m0l4P2k0J4j1p2L8N7o0Q2j7J9k5l9L1k2P3n0m7JJ9
7008eJ5O%j5l5QL3K1oK3o1K0k5m9Q0J7j8l6L1OPL8m2l8j3M5L8j7j6M4m5k1l5P3
7042B8J2J8l3m5M9l7PN3n2J9l7N8m8K8j8J2l0k6N1j9L8m9N8m0Rl7N3k3j8j%M3
7074B3M1n2N9n9QooL5J9p1K9k1jm0M4Ll8lmJ8L7j2M0o0M2o0O4k1j3J4l8J9o6R7
7108B1J8m8l4J6L7J4Rl4Qk8JL7K2qLpL7m5J5rl8jj4Q1m8L9p0lN2l6O5p0omK6k9
7144c1M4k5N0k9j8k9P1Pm7k3kL6k3O5J5k9o3R0o9M0Pk1J9m6m0N9J3mK2j5n7L5
7176Bm8N1J4K6j7p7M8J4L1o5K3l9J2O0m8OK2j03Q5lM6m9K1nl5M6J6J2k1k2l2M0
7208A1k4K6On6M2j7n6J14k5kj2l2n1M2K1M3j7Mq2Q3l8P8p4l1J8Qj8O5Lm2P5p6
$$ y = [57, 30, 27, 42, 15, -7, 9, -18, 52, 26, -14, -48, 24, 4, 18, 7, -65, -27, 30, -30, 52, 35, 54, 29, -10, 21, -1, 72, 22, -25, -24, -5, 10, 16, 16, 1, -34, -26, 7, 28, 22, 45, -16, 4, -21, -70, 10, 27, 9, -27, 4, 10, 17, 55, 13, -25, -38, 7, 45, 28, 12, 56, 11, -10, -45, 28, 40, 58, 25, -20, 29, -8, -1, 52, 0, 19, -18, 40, -8, 20, 2, 14, -16, -42, 9, -10, 28, -21, 37, -3, 6, -31, 22, -1, -19, -20, -20, 23, 64, 12, 71, 12, 20, 14, 8, 43, 62, -9, 20, -1, -2, -42, 2, 5, -33, -36, -40, -22, 15, 3, 43, -17, 25, -35, 29, 8, -5, 9, -29, -10, -76, 21, 39, -9, -43, -27, 10, 24, 33, -1, 7, -21, -20, 17, 39, 31, 34, 27, 64, 19, 34, 25, -13, -14, -28, 53, 5, 44, -26, -29, 23, -13, 52, -18, -24, -28, -2, -31, 13, -12, 38, 9, -9, -38, 33, 40, -7, -30, -32, 4, -19, 46, 61, 32, -31, 59, -10, 30, 37, 16, 35, -11, -51, 8, 21, 17, 39, 24, -33, 2, -46, 5, 19, 45, 28, -49, -1, 13, 44, -21, 2, -37, -25, 35, -13, -7, 15, -88, -3, -6, 40, -9, 12, 7, -28, 18, 34, 46, 25, 3, -29, 11, -13, 13, 19, -37, 5, -12, -68, 46, 21, 19, 7, -25, -76, -34, -13, 30, 13, 17, -65, 18, -20, 58, -16, -47, -29, -21, -39, 26, 29, -13, 62, -14]
7240a4qP6j4l3k8j7M3J8j6L7l5j4n6R8m6OJ2k0J9m5K3K3J4l3l9J3L5M2j4m2NJ
7272im5R2k9K8o5KM4l7J3P0lp8n2K4J01k7j8Pn2M9O0n5k4QJ6m7M2j9Q2p6k6j6
7304d0N2o8P4Km0KJ1j3K5K4Mn3K1n2J8Q9p5M2o2J1J2j1M3N0n4J0m5K6L6k7j9k8
7336c5N0qMKL8m9k1J4PJ4j3jM8o5l3LN8l4m3M2m3L7L0l4LN3k6k3O1j6N1o5j0J3
7370Io5N0oJ2j0j8K5l0Q0o3j6L1j5L5rL3k3j3k9L9k8K2j3l2ON6m1L7qk6k7PP4
7403D4m8Nj8lL5j6n7P5j3OJ7J0k7O4o6J6l2m6M6M6j3lk2Pk1O1Jl7k6rK4qK2o7
7437e3J00n8ML3k0m6poP1o6L6L8n7M7nk2Km7O3j5O3m1L4m6m1O7oo5M2K3l9L4j2
7470EK8j7j4lL0Ll9NK3l6J8L6o2N8n9L9j0j2m5M0l3L1l3P9q0J2K2L3mNM6p0J5
$$ y = [-14, -22, 54, 40, 7, -21, -38, 5, 23, 7, 44, 9, -5, -61, 37, -9, -3, 9, -11, 8, -37, -14, 9, 23, -10, -49, -36, -1, 41, 27, -15, -10, -9, -54, 38, 9, 37, -28, -26, 18, -19, -6, 64, 61, -17, -69, -45, 56, 29, 11, 18, -34, 15, 75, 20, -4, 4, 20, -27, 15, -4, 78, 2, -24, -40, 12, -56, 18, 20, -20, -18, -7, -20, 5, 29, 33, -20, 1, -51, -33, 56, -19, 23, -39, -28, -16, -27, 16, 66, 12, 22, -23, 3, 39, 12, -7, -35, 15, 7, 11, 13, 51, 2, -19, -5, 2, 16, 3, 2, 50, -15, -48, -45, 13, -21, -64, -22, -65, -28, 2, -32, -29, 24, -2, -25, 36, 20, 71, 6, -4, 9, -56, -6, -12, 0, -10, -28, -3, -33, 47, -16, -32, -1, -16, 19, 10, 43, 20, 7, -22, 17, -11, 11, -2, -34, -28, 28, -13, 24, 16, -10, -37, -30, 44, -4, 1, -17, -20, 15, -1, -58, 17, 4, 10, 27, 37, 10, 74, 8, 24, -8, -54, -8, 38, 25, 22, 0, 7, -14, 47, 48, 11, -15, -24, 0, -8, 14, -53, 47, -11, -7, 26, 6, -40, -47, -53, 18, -48, -12, 26, -31, 16, 11, -11, -9, -56, 7, -8, 55, 14, 48, 2, -39, 28, 22, -43, -1, 22, -17, 17, 5, 33, 16, 2, -1, 29, 32, -7, -2, 21, -15, 3, 39, -23, 35, -24, 15, 5, -7, -52, -12, -45, -14, -47, 32, -48, -36, -14, 19, 15, 20, 66, -4, 11]
7503A1k1K2j6N3o4j4K3j0J5l5N1k5K2j7p0Q0RQml4ON8q5L8k4L2k1k0KQj3K1L3
7536A9k3j0nK3J0n5qL6N5%jp6lK8RL9m8L1m9N4m5j1N0O4j15J6k6L7L1p1N4l4N
7569a9J0L3n0O2Ll6K6m4K4j5K4p4O2m3J6L1j4M8j10O4L9m6O0l0m6L1J8n3O2l1
7599BKNm2P3k4L4k0J0n5j5L0LpL6o5J7L8k1k0j5K7Rn1N9J2m6j6N6l3J9J5mj4n
7633fM3m3L1M2j06K1M7o4L1j0L7J3o8N6L0j9k0k7pk6L3Qj7rqj0J5pJ6K6pQk2J
7667a8P2l6k9K6km6K3M2q1M5JK2j1PL0m4J3pM7o3JJ0j6J1OQmpK0l6j5QL9m5O2
7702C3m7oP5m5j6j5N8m9M0k7MM8m1Qm5L2n8R3n5M6o4M4j5K8m1L0jKK7l7Kk1J8
7735El0O3o8J6lMK8k3RRp2L2qL6j9kL1J9p1M4lj0L0l7M7J1j9k1J9K6rj6k4J0k
$$ y = [11, -10, 12, -4, 49, -15, -29, -6, -16, -1, -36, 15, -10, 12, -5, -75, 5, 14, 22, 18, -16, -10, 48, -37, 1, -23, 9, -12, -32, -30, -22, -35, -14, 19, -4, -14, -19, 4, 14, -41, -49, -13, 42, 42, 41, -35, -38, -10, -1, 38, -10, 21, -28, 26, -19, -30, 20, 84, -31, -15, -41, -4, 27, -44, 10, -24, -19, -9, 24, -26, 36, 39, 3, 29, -15, 9, -6, 18, -56, 6, -37, -21, 10, -4, 44, -66, -2, 37, -9, 51, 21, -25, 6, 24, -29, 33, 2, 4, 9, -33, 40, 16, 50, 30, 40, -15, -30, 0, 3, -4, 32, -33, -16, 22, 1, -19, -34, -7, 2, -49, 10, 22, -24, -40, 16, -17, 2, 17, 13, -1, -6, 37, -6, 25, 67, -39, -18, 29, -35, -4, -14, 23, 36, -32, 24, 54, 35, 15, -12, -19, -45, -12, -4, -21, -30, -38, -48, -33, -40, -24, 2, -5, 3, -19, -18, 54, 18, -11, 15, 13, -33, -10, 32, -49, -4, -3, 19, 8, 15, 45, 1, 14, 7, 54, -9, -8, 2, -14, -3, 3, 11, 7, 0, 20, -16, -31, -23, 16, -29, 33, -14, -20, 55, 10, -6, -21, 37, -12, 28, 1, 5, 53, 12, 20, -25, 7, -51, 42, -13, 33, -31, 13, -2, 26, -15, 15, 14, 16, 43, 6, 8, -13, 5, -25, 38, -30, -14, -17, -13, 15, -8, 1, 10, -62, -30, -38, -2, -21, -23, 8, 27, -44, 0, -3, -13, 17, -20, 27, 38, 19, -2, 17, 43, 34, 18, -6, 4, 2]
7770BK5pNo3Q3n7N7j8m6n3O6k7N8l6k9J1l1M8m2O0NRj6k6lJ2MM5%n4M2j4j2l3
7804c5R4n7j7L2K2k4J0j3N0m7RL0o4N2l4n7L0J0k6Pl5O3J4m5N6p6O3k9L0m3J7
7835a3L0m0K5MJ3lJ3%k7j8J7J8Km2M0L5n8K1n5N5K9k5Ok2j6L7k5l2L8J2l0Ll7
7868d5L4j4L1j3l1LJ3J3J2Kl6L1M5j02M3N9n1J2jj4j0M4p0L7MP1q0JPMNO0j03
7901c9M7l2nNL7nj6j7K4j6M8m1rJ5qK3l2mK7K7Jr0O2j5J4%P1n2o6J7N4j8m0K3
7935a0QL0n7pL1LLK7j8MJn0K1NK6j5j8j5k8L4N8k5j4j1j3L5MJ4m1%J3N4Rj01O5
7970B2k4n8P3l1k6L4l5N3k0k1J10j04L9M8n7p9J35n9m6R3o5N6p6O4m3QJ1pk2o
8000c3m6M2M1k8J2n1J39r9K3l2Q1n9K5j4JL1k2n9Q6o5mN3M4o1kJK4n5K4j8PO3
$$ y = [2, 27, 20, 25, -38, 45, -12, 45, 27, -19, -72, -6, -33, 25, -11, -40, -29, -60, -12, -54, 6, 11, 20, 4, -22, -25, -13, -9, 36, 36, -18, 24, 10, -2, -35, 59, 2, -15, 17, 39, 15, 25, 12, 62, 15, 24, 54, -10, 42, 8, -49, -19, -9, -35, -28, -63, 0, 14, -31, 25, -51, 12, -17, 13, -30, -13, 17, -23, 2, 6, 19, 16, 29, 29, 2, -16, 1, 19, 21, -21, 19, 54, -4, 17, -38, 17, 46, 21, 27, 5, -11, 26, 1, -31, 7, 19, -11, -8, -45, -11, -25, 6, -7, -38, -35, -22, -9, 3, 5, -31, 0, 45, -57, -14, 45, -6, 6, 5, -9, -19, 25, -45, -8, -4, 67, -13, -12, -5, -1, 4, 64, -39, 8, -24, -29, -24, 13, 8, -8, -25, -1, -17, 31, -10, -19, -4, -12, 11, -21, -25, 2, 29, 30, -60, 2, -13, 1, 1, 72, 20, -46, -29, 25, 7, -33, -10, -2, 28, -29, -36, -5, -2, 1, 28, 10, 14, 15, -35, -14, -9, 17, 2, -16, -31, -59, -25, 33, 8, -6, -17, -30, 5, 9, 23, -18, -18, -5, 49, 58, -43, 22, -2, -60, 13, -18, -44, -10, -45, 8, -12, -33, 77, -27, 12, 60, 3, -76, 59, 0, -46, 47, -18, 38, -38, 26, -17, -9, 2, -5, -27, -33, -79, -37, 4, -24, -12, -63, 76, -23, 0, -32, 49, -10, 15, 1, 2, 33, 11, -48, 38, -27, -31, 22, 66, 5, 3, 4, 28, -27, -3, -21, -14, 49]
8032D9o8K7q9L8O1l8J5Ml8N3pk7n0L7j3M4OnJ6l0M7m8k4L2M1n4M8oNj9J8K8m2
8065A1Knl3K0M1qo1L4QK7m8j2J8m7J9m4O1J7k6K4l5L3K4n0j1N7j6L6j4L0j01R7
8097D8o5M2omm8K9N2p3P2j6m3%jM4n1M0l1j1j2J8L1j4m5O0Mj3n6Q1m2KPj9J0R
8131aK3l0l3j4J1N1KJjqK6%Ko5L5M9o0j3j7Q1k0k7J6pk7J6Qk6L6n3M0j9N4o8J7
8166b1M4l0jmJ6n7M1J3rl5OM4LMK6m4j1K2k6M7l3l9Q0l9J3
$$ y = [49, -19, 8, -81, -43, 18, -20, -5, -1, -39, 14, 7, -20, -70, -33, -46, -2, 4, -1, 15, -15, 32, -16, -40, -8, 33, -21, 27, 21, 26, 7, 25, 53, 11, 13, 8, -25, -5, 36, 28, -33, 1, 9, 36, -12, -24, -6, -53, -34, -78, -17, 0, -26, -2, -37, -4, 20, -30, -41, 16, 0, 36, 22, 52, -49, 48, -17, 25, 19, 15, -33, -4, 48, -25, 47, 31, -12, -12, -13, 31, -20, 20, -11, -22, -34, -16, 15, 1, -44, 16, 20, 7, -49, 32, -10, -8, -1, -20, -10, -1, 22, -8, -41, -55, -44, 7, 9, 10, 9, 1, 27, 27, 29, -36, -1, 48, -12, -25, -42, 39, 19, -8, 8, 1, -26, -10, -2, -28, 8, -45, -5, -24, 30, -38, -21, 23, -7, -8, -12, 4, -53, -12, 1, -8, -43, -37, 7, 10, 14, 40, -4, -15, 7, -19, 28, -5, -44, 36, -3, 10]
8191A0
$$ Imaginary data points
##PAGE= N=2
##DATA TABLE= (X++(I..I)), XYDATA
0@%%%%%%%%%%%%qJ6j6J6j6K4l2L3m1N6o4P2q8J04j20J36j56J80k08K40k72L08
34A64l48L92m42M95n55O21o90P68q53R44j048J160j278J410j555J713j887K080
52A091k293K528k790L085l420L801m240M756n367O106p027Q202r766J1966j5308
67h676K1070l3694J10862j23687l08988M9828K70708L11478M1111k28561l25494
78b24043j18928J69745L30166J83860j09629l16566k34008M2626K85074K67212
88B75509K9508k37686k91988r8271J84224L02202J59191j28263k95140k03602
98c04316O5482K70721K39507J490k31930k67383o8936J88951K81455J26349j38754
109A62636k79755j71764Q0794K58477K10869j7382k27527k39722m4665J91473
$$ y = [0, 0, 0, 0, 0, 0, 0, 0, 0, 0, 0, 0, 0, -8, 8, -8, 8, -8, 16, -16, 17, -24, 32, -32, 40, -48, 56, -64, 72, -84, 96, -112, 128, -144, 164, -184, 208, -234, 261, -294, 327, -363, 405, -448, 496, -552, 608, -670, 740, -815, 898, -989, 1091, -1202, 1326, -1464, 1621, -1799, 2002, -2238, 2518, -2849, 3257, -3770, 4432, -5334, 6632, -8676, 12394, -21300, 89562, -34125, -343113, -293285, -22577, 288901, 330012, 101451, -224043, -342971, -173226, 156940, 340800, 231171, -85395, -319403, -276777, 8297, 275509, 305017, 67331, -224657, -322928, -138704, 163498, 322689, 194426, -100714, -304316, -238834, 31887, 271394, 272884, 40954, -226429, -295365, -106414, 175041, 301390, 162636, -117119, -288883, -208089, 50388, 261257, 243875, 16348, -223374, -268039, -76566]
119g6566K57890R6314j47593k59602j42546R6189K45444J82145l7361k23656k14121
130b23463j8953J92708K35573O9758j54735k39564j15262J07467K32332J54282
140B40143n4550k15702j88823M084J92175K11339M4929j60084k21010q9075J16675
151a19899K19136J30389o9671k07455j65623K1149J89117J89441K4438j60358
161E0664k02396o6454J23948K03791J07263q2127j98389j42205L7405J85064J69024
172A85588M354j61474j84299m5874J30068J89428Q5591r1231j88387j20535N2133
183a44638J78807J48123j3873j61376j64792k5506J34138J75151O3950j00503
193H9481j78142j00258O6230J73320J27729k9899j59886j46881o939J35931J59884
$$ y = [-76566, 181324, 277638, 130045, -129557, -272103, -175914, 69530, 251675, 214314, -9342, -223463, -242416, -49708, 185865, 255623, 100888, -138676, -253938, -146471, 85861, 240143, 185593, -30109, -218932, -214848, -22673, 188666, 233595, 73511, -147499, -236574, -119899, 99237, 229626, 159955, -47500, -213123, -191974, -2857, 186584, 211022, 50664, -151732, -218186, -94238, 109553, 216816, 134689, -63700, -205905, -168500, 16564, 185588, 189942, 28468, -155831, -201705, -71637, 117791, 203382, 112151, -76236, -196771, -144638, 34169, 182292, 168419, 7043, -157749, -183255, -49117, 126034, 189984, 89481, -88661, -188919, -122689, 50631, 178360, 148461, -11425, -158306, -165245, -29314, 130570]
204A30570M5156j07639j66326q0464P6881J66665J08204m4433j56389j30213Q886
215a49102J36887J45561K9253j12813j56212o2749Q5723J59023R1016n6314j51008
226d0735j13296K2124J36454J31357J3247j16502j45462m5880R3693J50114P4537
237A59651o6247j46395r7881L3762J34952J18487j407j19190j33418l0003J00215
248d7474J40620N7186p5012j39969q1803M6233J32636J04462j5018j21441j21243
259a20823j5102J04428J31254M2090q1933j32951o8042N5637J29273R0603k6604
270A07830j21211j08919j096J06956J20800K8298q8154j25619n4151O3817J25548
281E4099P7534l7365j19617r7255J1119J08959J10171J4938r2664j17686l9876
$$ y = [130570, 175726, 68087, -98239, -178703, -101822, 64843, 173047, 128614, -27775, -157988, -149102, -12215, 133346, 162599, 49786, -106426, -169175, -83452, 75571, 166587, 110273, -40735, -154031, -131907, 4547, 135904, 149151, 32649, -112813, -158693, -65000, 85114, 159651, 93404, -52991, -150872, -117110, 17842, 136329, 134922, 15732, -117686, -147689, -47474, 93146, 150332, 75320, -64649, -146452, -100219, 32417, 136879, 121861, 420, -120823, -135925, -31497, 99757, 141847, 59914, -73037, -141079, -85442, 43831, 134434, 107830, -13381, -122300, -123396, -16440, 104360, 132658, 44504, -81115, -135266, -71449, 54099, 131633, 94268, -25349, -122604, -111485, -2526, 107645, 122583, 29919, -87767, -127643]
292a27643P1112J19988O4224m7732j17403q4458K2931J10128R9482J844r6055
303A6418j09329k7129P7461J13596N1504n5787j14245p2140L2997J08981Q8816
314A11143r633r7880r9885j5314Q1976J07093L9252o2555j10347o0909M2238J07396
326C2575P8019j9474r8647r0452m661Q4524J00260K8148o8389j05220m9723N0199
338f2841J04704O6823k8789r8183q1262N925Q7122R2737J7499p3497r9591l8341
350a07694N6531J01026N6115l6862r6476p2067J4996Q8372Q4674P365p6993r3505
362g4518k7629O2040R6413M6362m3776r4397o2917K2539Q8699P7144j688p8969
374I303q6886j8135O5967R1212L7094m9050r1735n4211K9794Q7784O9333j0254
$$ y = [-127643, -56531, 63457, 127681, 79949, -37454, -121912, -98981, 11147, 110629, 112473, 16418, -92911, -120040, -42579, 71017, 122521, 66734, -47511, -119651, -86654, 22327, 111143, 101510, 3630, -96255, -111569, -29593, 77500, 116752, 54197, -56150, -117059, -74821, 32575, 110594, 91120, -7527, -97979, -102640, -18116, 82144, 110292, 41903, -63317, -113040, -62841, 41863, 108686, 79897, -18286, -99548, -93623, -6501, 86236, 103735, 30238, -69353, -107694, -51163, 49863, 105978, 69116, -27360, -99427, -84431, 3941, 88615, 95980, 18987, -74518, -102147, -40107, 56306, 102668, 58892, -35505, -98422, -75883, 12816, 89960, 88272, 9303, -77583, -95718, -29751, 61461, 98555, 49505, -42230, -96441, -66647, 21137, 90470, 80216]
386H0216q0348p9791r488O9142Q6250K7891n4004q8246m5599L6683Q6332O0779
398H9817j8089q1246p2395l80P1600Q0521J8688n8583q4084l6511M2936Q4472
410C6746N2105k5695q0861o5042Q124P3256P4005J0245o2194p9403k7681M7785
422c8610Q1506M3740l2186p9793n7554J5334P4238O7425K091o4497p4407j9295
434h2008N2049P7957L6063l7694p7990m9862K1892P4094O0755n343o5893o9011
446f4991j2033N5176P3962K8348m2249p5740m2452K7709P2939N4311j1741o6789
458c550o3169n175N7651O9866K1104m5980p2622l5527L2754P1392M7612j7327
470E7029o6834n7751J249N9080O5244J4237m9378o9078k8425L7132O9501M0940
$$ y = [80216, -132, -79923, -89411, -20269, 65981, 93872, 39868, -48378, -93977, -57294, 29038, 89817, 71728, -9518, -81913, -82293, -10693, 69828, 88516, 29933, -54151, -90662, -47726, 36746, 88851, 63156, -17705, -82747, -74623, -1367, 72638, 82883, 20689, -58714, -86395, -38610, 42896, 86636, 54450, -25343, -82897, -67563, 6675, 74100, 76191, 11694, -62713, -82008, -29959, 47998, 84061, 46367, -31623, -81485, -59593, 14501, 75256, 69913, 4020, -64991, -77024, -21848, 52114, 80462, 38213, -37527, -79979, -52270, 20669, 74980, 63239, -3550, -66719, -71894, -14243, 55623, 76727, 30747, -41875, -77402, -44648, 26744, 74356, 57029, -9805, -67556, -66307, -7227, 58017, 72254, 22876, -46202, -74627, -37495, 32006, 72946]
482G2946k2720o6245n2076P758O0451O0217P262n2085o5162k1261M0776O6861
494C6722L4322k7915o5197m5952J3787O1155N4695N35n3938o0983j4534M4255
506b3048O3825K8016l2291o3815l9676J9122O0955M9448n579n5115n6382q428
518f2968M6718O0404K1634l6013o2075l3542K3967O0326M4022j0977n5911n1732
530e6147k486M8732N7112J5334l9269n9447k7606K8475N9114L8184j6066n6193
542a0263m6801L459N0448N3037R234m2499n6561k1617L2297N7707L2451k1016
554C9876n5869m1705R151N1412M8475L458m4674n3297j5382L5701N5601K6878
566E9625k5558n5042l6555J4014N2062M4193j872m6069m9921j0231L8248N3059
$$ y = [72946, 50226, -16019, -68095, -60337, 114, 60331, 67593, 15508, -49654, -70915, -30139, 36722, 71044, 43129, -22068, -68020, -54233, 6922, 61617, 62152, 8214, -52769, -67303, -23048, 40777, 68793, 36502, -27313, -66989, -47867, 13088, 62536, 56957, 1842, -54540, -62968, -16250, 44154, 65788, 29775, -32300, -65842, -41875, 18451, 62473, 51496, -4415, -56147, -58633, -9901, 47211, 62545, 23276, -36171, -63777, -35302, 23812, 61996, 45930, -10263, -57064, -53605, -3157, 49880, 59114, 16615, -39946, -61563, -29266, 28441, 60892, 39876, -15993, -57698, -48547, 2865, 51340, 54798, 10124, -43173, -58555, -22854, 32747, 59625, 34067, -20975, -57530, -43516, 8546, 52739, 50867, 4798, -45123, -55354, -17106, 35953]
578C5953K1616k9170n3799l1318J8365N1689L9680o948m7081m6212n026M0725
590a1526N0502J6248l2142n2167k6480K2243N0968L5434j1017m7659m2487k08
602d8291M2121M7502J1083l4734n0002k1629K5708N0154L0785j5352m7949l8540
614d9144M412M3421M4432O497l6896m7615j6904K8504M8665K6357j8901m7502
626a4674l4619Q650M4123M0754K042l8441m5232j2368L0994M7163K2288k2265
638B8415m6868l0558J2469M4385L7234k290l9547m2215p906L3299M5031J7548
650D8997k5358m5836k6272J6164M4250L3698o401m0597l9213l798L5015M2835
662C3484J3341k7649m4297k2114J9376M3578K9803j0212m1058l5875O12L6416
$$ y = [35953, 57569, 28399, -25400, -56718, -38353, 13336, 53016, 46068, -1013, -47225, -52251, -11526, 38976, 55224, 23082, -29085, -55565, -33322, 17646, 53080, 42063, -5596, -48083, -48291, -6170, 41332, 52415, 17681, -32321, -53950, -28242, 21912, 52697, 37345, -10604, -49144, -44732, -1311, 43121, 49618, 12722, -34893, -51797, -23293, 25372, 51729, 32828, -14674, -49293, -40643, 3480, 44234, 46276, 7835, -37397, -49765, -18771, 28392, 50680, 28415, -18453, -49011, -36542, 7843, 45077, 42787, 3240, -38975, -46881, -13582, 31449, 48997, 23639, -22197, -48469, -32305, 11945, 45643, 39242, -1355, -40568, -44366, -9351, 33484, 46825, 19176, -25121, -47235, -27859, 15719, 45522, 35310, -5748, -41623, -41011, -4595]
674d595M0347Q914l0059m2620j8061K2312M2945K6013j3532m1189l2530M499L7298
687b58L7314M828l1854m0320j3802K4909M1746K1862j7018m0755k9047Q116L7969
700C690L4435J132l3230l8298r971K6897M0156J8197j9643l9914k5335J1312L8041
713G469L1295k659l4195l5734o151K8928L8382J4405k2014l9098k1879J4213L7789
726A0751K8254n975l4768l2992k441L0222L6183J0409k4381l7586j8088J7385
738b3027L7321K4769r480l5325l0168J312L1375L3993O781k6024l5949j4587J9729
751a9280L6452K1209j2436l5151k6913M843L2081L1354L203k7689l4254j0877
763c7458K1915L5372J8045j5196l4611k4154P693L2420K8637Q1k8679l2142p454
$$ y = [-4595, 35752, 44666, 14607, -28013, -46074, -23762, 19183, 45196, 31664, -9525, -42055, -37556, -258, 37056, 41884, 10030, -30290, -44092, -19183, 22563, 44425, 27407, -13348, -42395, -34279, 3690, 38125, 39257, 6027, -32271, -42242, -15345, 24811, 43008, 23365, -16549, -41884, -30572, 7469, 38764, 36105, 1910, -33824, -39975, -11047, 27335, 41740, 19726, -19372, -41251, -27038, 10751, 39005, 33030, -1738, -34730, -37171, -6949, 29234, 39643, 15262, -22324, -40412, -23027, 14294, 39063, 29583, -5742, -35910, -34598, -3223, 30770, 37551, 11527, -24422, -39009, -19280, 17172, 38381, 25945, -9206, -36119, -31276, 805, 32159, 35362, 7673, -26581, -37458, -15543, 19829, 37874, 22678, -11933, -36087, -28394, 4026, 32663, 32744, 4065, -28077, -35531]
776c5531K3668L3877J4508j7636l4078k0828J0676L2671K6098l214k9644k9908
788b9341m262K5242L2205J1350j9539l3109j7607J3114L2290K3253o325l0099
800b828k7461q36K6480L0418P941k1543l1985j4662J5669L1918K0258q974l0254
813e859k4947K124K7143K8381M717k2998l0410j1349J7710L1105J7323j1511l0212
826h783k2480M945K7848K6397J931k4082k8940q566J9280L0113J4520j3595k9743
839a1155j9755P387K8016K4001r30k5129k7177n459K1000K8866J1626j5743k9224
852a3676j7206R879K8166K1699l724k5626k5097k636K2117K7287Q713j7521k8346
865a5971j4259J2146K7852J9267o207k6107k3115J8K3038K5834O057j8873k7260
$$ y = [-35531, -11863, 22014, 36522, 18886, -15192, -36020, -25344, 7327, 33425, 30211, 567, -29341, -33603, -8361, 23844, 35194, 15655, -17454, -35061, -21947, 10343, 33596, 27271, -2828, -30289, -31125, -4645, 25773, 33714, 12171, -19814, -34476, -18807, 13111, 33369, 24395, -5859, -30806, -28682, -1539, 26842, 31559, 8561, -21849, -33198, -15488, 15617, 32940, 21429, -8783, -31263, -26318, 1530, 27927, 29858, 5776, -23164, -31730, -12450, 17663, 32183, 18588, -11155, -30910, -23523, 4493, 28494, 27564, 2435, -24742, -30201, -9201, 19665, 31291, 15548, -13676, -30882, -21003, 7163, 28862, 25138, -488, -25585, -28221, -6104, 21183, 29896, 12375, -15971, -30230, -18084, 9768, 29035, 22828, -3279, -26394, -26376, -3338, 22496, 28553, 9680, -17580]
878a7580j1736J4072K7285J6695q488k6168k0884K697K3655K4078L320k0310k6013
891a9377r094J5740K6682J4314j0529k5904j8835M960K4070K2174Q71k1123k4446
904b0497o503J7240K5677J1775j2477k5610j6456P110K4436K0178j468k1883k3059
917b1537m093J8254K4607R465j3960k5021j4182R065K4186J8185l789k2315k1245
930b2380j698J9432K3325P017j5469k4267j1995J0854K4025J6190n728k2556j9569
943b2819N28K0005K1840M799j6644k3298r581J2462K3459J3976p658k2549j7730
956b3210K636K0578K0518K515j7646k2140p444J3885K2753J1809r488k2355j5675
969b3264M825K0815J8730J39j8448k0888n063J5161K2005R687j1102k2007j3746
$$ y = [-17580, -29316, -15244, 12041, 28736, 20248, -5920, -26804, -24107, -452, 23626, 26946, 6636, -19377, -28471, -12731, 13951, 28265, 17736, -8168, -27003, -22043, 2027, 24201, 25072, 3949, -20497, -27000, -9760, 15917, 27692, 15215, -10395, -26851, -19741, 4695, 24873, 23405, 1522, -21537, -25630, -7376, 17231, 26696, 12736, -12285, -26467, -17402, 6784, 24969, 21180, -1135, -22380, -24078, -4646, 18679, 25696, 10227, -14040, -26035, -15181, 8844, 25034, 19306, -3250, -22819, -22291, -2286, 19554, 24353, 7709, -15589, -25170, -12708, 10751, 24727, 17069, -5480, -23210, -20574, 4, 20522, 23037, 5391, -16749, -24193, -10308, 12445, 24254, 14766, -7589, -23264, -18439, 2376, 21106, 21245, 2797, -18091, -23154, -7993, 14012, 23699, 12597, -9410, -23156]
982b3156O539K0985J7056j728j8932j9487l009J6070K0851P562j2359k1404j1710
995b2722Q145K0909J5307l694j9386j8011r70J6819J9795N614j3515k0703r736
1008b2148R714K0476J3395n416j9369j6379R43J7368J8603L431j4462j9828p817
1021b1489J1030K0072J1593o885j9439j4819K658J7723J7264J621j5269j8712
1033a4652n932J2177J9451R731q450j9133j3171M383J7962J5838j26j5844j7782
1046a5548m069J3080J8675Q057r761j8771j1464N886J8005J4347j900j6240j6514
1059a6217k312J3902J7905O229j0859j8378r697P317J7901J2791l492j6552j5197
1072a6659n53J4559J6812M423j1951j7588q074Q632J7637J1237m997j6687j3923
$$ y = [-23156, -16617, 4368, 21424, 19696, 764, -18723, -21732, -5662, 15189, 22751, 10392, -11012, -22722, -14577, 6332, 21639, 17945, -1441, -19452, -20422, -3603, 16192, 21806, 8291, -12412, -22148, -12434, 8042, 21437, 16021, -3348, -19727, -18784, -1416, 17187, 20618, 6156, -13672, -21489, -10459, 9613, 21206, 14321, -5118, -19937, -17279, 444, 17708, 19329, 4060, -14652, -20584, -8407, 11044, 20775, 12325, -6808, -19979, -15596, 2366, 18204, 18078, 2234, -15548, -19617, -6537, 12138, 20195, 10434, -8337, -19801, -13915, 4090, 18437, 16537, 297, -16217, -18529, -4627, 13278, 19507, 8648, -9730, -19427, -12110, 5791, 18582, 15090, -1462, -16659, -17212, -2653, 14159, 18582, 6631, -10957, -19031, -10399, 7238, 18475, 13478, -3209, -17132]
1085a7132J094J5114J5833K771j2711j6936o385R737J7201R654o344j6645j2481
1098a7230K691J5403J4588J022j3438j5936m700J0697J6700Q039p504j6574j1010
1111a7252M169J5547J3368n07j3895j5070l056J1610J5960O446q727j6126r589
1124a7122N548J5593J2049k064j4273j3998j488J2334J5198M809r748j5639p986
1137a6787O840J5422J0639l568j4507j2717J56J2884J4270L214j0650j5126o368
1150a6298P965J5167R126m757j4580j1567J638J3177J3299J705j1288j4385m893
1163a5691Q823J4817P820o012j4494j0312K975J3484J2206K46j1854j3519l492
1176a5003R767J4231O345p181j4213q917M247J3484J1126j141j2171j2672k052
$$ y = [-17132, -16038, -924, 14909, 17680, 4969, -11967, -18352, -8615, 8586, 18240, 11896, -4749, -17230, -14539, 864, 15452, 16474, 3036, -12900, -17600, -6903, 9797, 17836, 10332, -6242, -17252, -13083, 2464, 15832, 15325, 1430, -13640, -16696, -5086, 10874, 17320, 8593, -7533, -17122, -11574, 4019, 16068, 14004, -269, -14267, -15755, -3421, 11777, 16586, 6838, -8801, -16787, -9947, 5475, 16114, 12546, -1961, -14678, -14522, -1638, 12632, 15846, 5196, -9930, -16298, -8333, 6834, 15960, 11203, -3377, -14944, -13306, -129, 13170, 14875, 3587, -10798, -15691, -6868, 7949, 15769, 9757, -4737, -15049, -12074, 1410, 13616, 13862, 2008, -11511, -15003, -5236, 8995, 15340, 8159, -6054, -14971, -10724, 2760, 13886, 12745, 574, -12098, -14150]
1189a4150J0348J3604N008p957j3900p632N229J3473R939k333j2430j1705p44
1202a3250J0878J2859L654q716j3428o378O204J3326Q771l482j2572j0687O10
1215a2211J1305J1975K259r434j2713n088P168J2999P528m593j2580r581J861
1228a1105J1567J1072J032j0038j2098l712P998J2593O156n591j2446q416L039
1241i949J1728J0124l06j0491j1398k350Q732J2038M928o528j2215p129M051J1779
1255C014R017j499j0718j0530j057R192J1402L769p373j1813o046M999J1683Q108
1269A2148k596j0843r627p0R562J0780K532p880j1311m958N902J1309P075l590
1283H433j0871q743J082R898J0033J496q541j0865l784O636J1122O016m503j0847
$$ y = [-14150, -3802, 9802, 14810, 6853, -7047, -14679, -9450, 4023, 13962, 11629, -801, -12506, -13250, -2372, 10487, 14141, 5425, -8003, -14381, -8177, 5149, 13920, 10438, -2134, -12821, -12211, -906, 11069, 13328, 3894, -8819, -13907, -6739, 6260, 13788, 9195, -3385, -12966, -11105, 462, 11534, 12566, 2528, -9570, -13282, -5284, 7309, 13465, 7874, -4572, -12988, -9949, 1779, 11903, 11597, 1106, -10292, -12642, -3910, 8128, 13056, 6528, -5687, -12816, -8765, 3014, 12031, 10532, -186, -10716, -11773, -2581, 8821, 12590, 5217, -6596, -12642, -7643, 4040, 12148, 9552, -1291, -10918, -10988, -1426, 9354, 11886, 4006, -7305, -12263, -6361, 4948, 12023, 8433, -2438, -11181, -10099, -201, 9832, 11328, 2787, -8078, -11862, -5226, 5896, 11912, 7409, -3438]
1297c438p810K086J0071R258L26q890j0158k741P242J0749M839n271j0621o921
1311a1279L041J0267Q386p10r188r581j684P792J0305L811n976j0461n782L870
1325g189J0176P553j740r336q963n28Q261R703K787o582j0112m910M669J0083
1339C872O639k625r462q056M11Q505R137J737p203r703l821N442R913N669l505
1354F950r492p317J384Q823Q362Q04p544r176k897O061R522M682m217r401o453
1369i909K394Q838P702j72p892q752j828O539R241L870m962r254n552L016Q887
1384B166O942j062q122q020r30P025Q696K846n608q933m609L774Q888O158j876
1399G335q333p380j5P328Q230J898o016q632l685M456Q719N281k801q270o647
$$ y = [-3438, -11248, -9162, 909, 10167, 10493, 1603, -8555, -11296, -4054, 6695, 11534, 6263, -4358, -11279, -8238, 2029, 10415, 9705, 517, -9064, -10748, -2956, 7349, 11160, 5184, -5277, -11059, -7189, 2987, 10540, 8800, -536, -9499, -10027, -1766, 7937, 10724, 4142, -5970, -10880, -6211, 3872, 10511, 7886, -1576, -9632, -9221, -716, 8421, 10158, 2955, -6748, -10569, -5127, 4786, 10455, 6950, -2542, -9859, -8475, 348, 8710, 9514, 1970, -7206, -10103, -4042, 5480, 10162, 5945, -3456, -9909, -7515, 1323, 9025, 8853, 961, -7791, -9619, -3080, 6161, 10031, 5069, -4185, -9737, -6721, 2166, 9108, 8046, -76, -8096, -9026, -2001, 6695, 9541, 3933, -5000, -9609, -5835, 3053, 9211, 7335, -998, -8378, -8393, -1065, 7165, 9063, 3047, -5585, -9270, -4814, 3905, 9186, 6385, -1885, -8532]
1414h532Q75P589P643R85o512q229k854N055Q505M481l471q266n840J606P749
1429G84O996J24o786p739j911N557Q130L608m055q178n127K421P749O406n90p132
1445B57p172j202N983P778K828m527q010m347L109P759N604j433p195o679l34
1460g581O333P385K000n112p702l583L644P604M969k056p235o072M61O454O918
1475F427J159n425p362k794M204P532M286k793p233n553J123O763O456M71n728
1490A533p030k153M643P275L534l306p232m834J859O752N869k21o106o588j301
1505g306M998P021K863l826p067m132K334O794N258p87o173o141o95N339O678
1520E158K113m150o930l523K886O800M694j409o373n647l3N584O313J451m555
$$ y = [-8532, -7657, -68, 7575, 8560, 2048, -6181, -9035, -3980, 4525, 9006, 5535, -2731, -8571, -6965, 784, 7780, 7904, 1118, -6621, -8532, -2975, 5155, 8763, 4708, -3470, -8597, -6176, 1573, 7979, 7389, 257, -6915, -8117, -2134, 5644, 8472, 3945, -4065, -8412, -5303, 2456, 8060, 6627, -568, -7247, -7581, -1248, 6137, 8137, 3025, -4677, -8260, -4616, 2988, 7957, 5901, -1334, -7406, -6945, -491, 6427, 7586, 2161, -5201, -7995, -3791, 3741, 8027, 5234, -1999, -7552, -6429, 334, 6790, 7261, 1533, -5497, -7650, -3007, 4268, 7802, 4496, -2736, -7570, -5711, 1041, 6910, 6689, 583, -6005, -7306, -2308, 4713, 7576, 3750, -3317, -7449, -5115, 1679, 6937, 6150, -23, -6164, -6859, -1520, 5158, 7271, 3121, -3809, -7332, -4446, 2354, 7048, 5639, -734, -6381, -6414, -830, 5483, 6934, 2379]
1535B379o666k841L433O675M026k065o419n065O24N798N960P54m962o395k213
1550f977L908O499L462k600o274m491J050N981N416J47n123n999j499M192O254
1565C946K825l062o332l975J800N901N028m21n362n645r94M574O011K257l493
1580C058o185l405K259O003M401r83n440n310k76M850N687J637l841n955k861
1595f361K708N929L889j547n572m644K04M998N341J027m156n708k273L123N797
1610B755L388k056n598m260P98N076N057M05m408n404j619L424N605K804k457
1625C510n547l666J254N179M535q2m591n171j143L895N400K332k844n539l172
1640e650J666N243M066n68m757m708o08M061N171J659l135n331k766K217N211
$$ y = [2379, -4287, -7128, -3695, 2980, 7006, 4941, -1478, -6543, -5919, -121, 5839, 6593, 1631, -4764, -6977, -3069, 3430, 6892, 4292, -1982, -6473, -5423, 558, 5974, 6121, 998, -5001, -6500, -2308, 3946, 6771, 3709, -2623, -6598, -4798, 1103, 6131, 5710, 348, -5297, -6291, -1717, 4294, 6551, 3058, -3127, -6532, -4273, 1730, 6131, 5148, -292, -5602, -5878, -1028, 4659, 6296, 2455, -3500, -6361, -3653, 2276, 6165, 4618, -954, -5598, -5394, -396, 4945, 5972, 1816, -3892, -6165, -3042, 2755, 6143, 4087, -1511, -5771, -4973, 103, 5160, 5565, 1157, -4247, -5866, -2442, 3163, 5967, 3510, -2037, -5703, -4449, 730, 5265, 5183, 592, -4579, -5722, -1827, 3573, 5905, 3061, -2478, -5650, -3984, 1259, 5325, 4757, 0, -4708, -5316, -1255, 3916, 5575, 2440, -2891, -5657, -3440, 1771]
1655A771L606j028m837m413n1M217M869J186l433n105k248K516N135L067j452
1670C800m849l951M24M423M556N57l597m893j737K843N025K653j832m897l468
1685d943P84M477M204J83l929m638j173L159M799K218k256m843l038J312M500
1700H16L774j99m114m309p51L429M591J680k520m674k691J672M638L402p89m138
1716a83m036k50L588M386J282k860m578k234K056M501K996j113m210l603J14L770
1732c74M110P69l131m362j731K313M571K479j441m335l229N62L920L775L48l325
1748I19m161j278K634M379K109j904m224k816Q82M043L479k1l499m013r01K898
1764a474M222J726k213m170k482J305M016L171m41l638l715m00L120M042J257
$$ y = [1771, 5377, 4349, -488, -4901, -4952, -735, 4134, 5320, 1887, -3218, -5466, -2950, 2185, 5252, 3800, -1049, -5000, -4576, -153, 4403, 4960, 1363, -3530, -5267, -2424, 2601, 5254, 3422, -1475, -4943, -4159, 318, 4522, 4705, 776, -3862, -5035, -1876, 2923, 5141, 2885, -1958, -4996, -3684, 816, 4590, 4391, 277, -4032, -4783, -1354, 3237, 4917, 2397, -2277, -4968, -3296, 1342, 4744, 3955, -183, -4219, -4469, -881, 3505, 4787, 1927, -2651, -4885, -2829, 1672, 4668, 3555, -655, -4258, -4144, -374, 3736, 4505, 1374, -2988, -4719, -2406, 2165, 4644, 3203, -1132, -4361, -3799, 121, 3896, 4244, 919, -3242, -4520, -1886, 2493, 4602, 2698, -1526, -4342, -3460, 583, 4062, 4041, 542, -3471, -4372, -1474, 2748, 4474, 2261, -1909, -4391, -3086, 930, 4101, 3660, 22, -3693, -4093, -973, 3069, 4326]
1779D326k461m047k120J545M042K922q90l689l408o9L307L780Q86k629l987j777
1795d269J994L964K486j183l758l101K97L411L619M33k816l822j351K184L892
1810A980K101j440l786k756O65L483L303J70l054l646j022K507L775J757j690
1825B347l787k527J020L601K969k06l169l431n74K604L718J400k025l726k126
1840c912J310L574K688n11l293l116k94K767L544J017k178l648j802J592L542
1855A280K443q59l356k882N1K917L277P61k411l519j463J784L548K110j181l304
1871h04k600L50L016L104M14k666l284j132K012L426J789j434l280k351O45L083
1887B88K845P9k730l178p62K168L356J454j604l252k131R81L111K528j69k762
$$ y = [4326, 1865, -2182, -4302, -2757, 1285, 4207, 3317, -372, -3780, -3849, -542, 3238, 4124, 1495, -2492, -4269, -2275, 1689, 4175, 2992, -766, -3867, -3570, -159, 3460, 3893, 1077, -2745, -4096, -1912, 1980, 4081, 2641, -1145, -3901, -3236, 247, 3550, 3720, 666, -2980, -4002, -1495, 2280, 4037, 2347, -1440, -3967, -2947, 654, 3623, 3417, 248, -3183, -3757, -1153, 2565, 3965, 1940, -1786, -3912, -2602, 972, 3660, 3149, -144, -3260, -3554, -787, 2757, 3774, 1596, -2052, -3854, -2262, 1280, 3723, 2864, -492, -3374, -3323, -406, 2871, 3632, 1221, -2298, -3761, -1977, 1571, 3681, 2500, -804, -3404, -3054, -38, 3066, 3480, 814, -2470, -3602, -1590, 1836, 3625, 2191, -1089, -3440, -2795, 288, 3133, 3212, 482, -2696, -3458, -1290, 2066, 3520, 1916, -1336, -3467, -2486, 625, 3153, 2984, 222]
1903B22l069m05K340L160J164j773l215j782J159L105K325m76k935k743j72K507
1919e88L058Q14j982l138j519J402L113K108q06k922k515J29K617K779N60k116
1935I94k995j231J592L140J700r70l003k265L79K686K627K63k303k864r31J831
1951a350L073J414j211l014j942O73K707K409L0k434k698o14J955K844J270j479
1967A633k937j740R05K808K111k50k439k580l42K184K713Q82j641k816j481J158
1983a832K778J874n80k525k356j2K285K583O42j785k787j254J364K781J679p48
1999B107k664k114J93K413K406L85k026k680q77J617K675J370j012k564j874M14
2015b231K420K247J06k140k481o33J702K629J176j253k630j657P79K448K059q0
$$ y = [222, -2847, -3252, -912, 2248, 3412, 1639, -1576, -3358, -2199, 906, 3231, 2755, -180, -2923, -3095, -588, 2470, 3284, 1302, -1836, -3355, -1953, 1160, 3268, 2462, -460, -2975, -2846, -229, 2550, 3110, 994, -2001, -3232, -1640, 1500, 3200, 2230, -773, -3038, -2659, 27, 2654, 2917, 614, -2250, -3181, -1350, 1723, 3137, 1926, -1088, -3030, -2357, 350, 2759, 2789, 355, -2343, -2957, -1002, 1842, 3112, 1633, -1304, -3044, -2139, 669, 2780, 2530, 91, -2489, -2831, -647, 2066, 2948, 1307, -1509, -2990, -1832, 946, 2820, 2240, -285, -2641, -2653, -368, 2215, 2857, 1072, -1715, -2969, -1605, 1176, 2855, 2107, -557, -2671, -2478, -65, 2341, 2726, 700, -1980, -2857, -1240, 1435, 2805, 1793, -771, -2645, -2231, 189, 2436, 2542, 402, -2079, -2712, -1010, 1619, 2795, 1542, -1088, -2745, -1966, 482, 2541, 2461]
2031B461k329k406l06J882K512R06j427k542j428R05K518J838m65k315k142j21
2047b459K006K409O73j570k591j174J166K467J702o92k398j932Q1K123K266M42
2063B519j702k542r42J409K466J357q04k468j793M27K195K050K19j924k217p25
2079b475J370K458J193j057k411j545N46K241J927m8j923k220n10J679K336R75
2095B536j252k402j364Q07K251J699k35k077k047k46J811K264O82j411k304j151
2111b439R60K265J547n15k079j848q2J879K161M68j546k186r78J153K203J365
2127B328o47k141j747K11J972J960L32j669k206p84J334K168J205q61k143j537
2143b225L43K020J905N2j709k128n06J436K074J049j048k116j428O04K048J723
$$ y = [2461, 132, -2274, -2580, -698, 1814, 2720, 1293, -1249, -2677, -1772, 746, 2584, 2119, -196, -2338, -2459, -453, 1956, 2629, 1059, -1532, -2706, -1540, 927, 2629, 1937, -461, -2393, -2312, -189, 2077, 2519, 817, -1725, -2667, -1258, 1208, 2565, 1761, -707, -2500, -2073, 122, 2172, 2391, 467, -1750, -2475, -1105, 1353, 2546, 1489, -922, -2467, -1921, 320, 2247, 2199, 276, -1944, -2454, -775, 1561, 2536, 1284, -1118, -2482, -1675, 576, 2275, 2040, -37, -2084, -2330, -519, 1745, 2427, 1016, -1288, -2439, -1479, 786, 2333, 1818, -261, -2109, -2191, -312, 1849, 2317, 771, -1415, -2393, -1240, 963, 2328, 1681, -460, -2207, -1996, -24, 1936, 2268, 599, -1607, -2391, -1057, 1111, 2316, 1455, -688, -2225, -1882, 138, 2043, 2095, 386, -1742, -2248, -812, 1262, 2311, 1263, -853, -2281, -1677, 371, 2094]
2159B094j22j878j956l03J507K093Q11j182k104j233P98K048J608l97j896j824
2175a936j2J625J914O14j356k032j055R22K134J366n74j868j730J30J703J868
2191A713L90j490j952q47J096K085J198p16k024j485L25J785J738J84j572j902
2207a474n99J212J966J007q41j995j288M66J847J599k5j643j860m27J435J948
2223A328P48j032j914j191N93J898J524k13j769j653k44J473J926N53j123j939
2239a035j021Q00J887J334l65j765j640L4J508J832M42j312j879q14R54J819J223
2256B002n72j850j448J86J599J701K63j378j817p07J100J901J010o95j855j311
2272a871L41J607J612N5j438j714m98J244J796Q13q46j836j188N32J727J477j66
$$ y = [2094, 1972, 94, -1862, -2165, -658, 1435, 2246, 1064, -1040, -2273, -1475, 573, 2181, 1784, -112, -1936, -1948, -323, 1591, 2205, 849, -1183, -2238, -1316, 818, 2184, 1610, -258, -1988, -1858, -155, 1713, 2103, 613, -1339, -2186, -1090, 995, 2193, 1477, -547, -2032, -1707, 78, 1816, 2000, 428, -1474, -2073, -861, 1105, 2112, 1271, -724, -2012, -1546, 301, 1900, 1875, 232, -1628, -2055, -620, 1328, 2076, 1044, -870, -2061, -1468, 430, 1954, 1741, -28, -1681, -1925, -452, 1474, 2027, 904, -1035, -2056, -1256, 631, 1965, 1600, -165, -1805, -1771, -263, 1569, 2011, 699, -1180, -1994, -1040, 779, 2002, 1430, -420, -1868, -1682, -83, 1618, 1881, 503, -1314, -2021, -921, 980, 1990, 1295, -560, -1871, -1530, 77, 1689, 1744, 306, -1408, -1906, -662, 1134, 1947, 1101, -735, -1923, -1391, 336, 1813, 1647]
2289A647j497j667l25J345J718O71r62j793j060O31J786J322k96j523j583j08
2305a694J328J700N12j081j762r11P29J799J230m55j594j459L3J427J613L66j212
2322E69j690p32Q97J732R68n27j647j272K29J435J494K46j240j692n38R85J679
2339H96Q95o75j584j253L97J505J407L1j398j611l65J141J683O56p44j648j087
2356a754M67J584J286j23j402j472k43J198J661M93q92j635q56O00J605J106k87
2373A336j488j324n7J255J513M15j052j534p24O82J626R85m13j530j217J46J345
2390c6J366K32j129j570n12Q90J532Q72n55j562j123K83J351J320O8j130j483
2407a186m08J023J436P51p40j484q64L51J388J193q5j253j350k32J030J421N88
$$ y = [1647, 150, -1517, -1842, -497, 1221, 1892, 930, -863, -1923, -1292, 494, 1816, 1520, -3, -1586, -1694, -366, 1334, 1846, 765, -997, -1908, -1179, 620, 1850, 1395, -199, -1658, -1625, -198, 1415, 1781, 569, -1121, -1853, -956, 776, 1744, 1217, -430, -1702, -1473, -38, 1456, 1702, 462, -1230, -1768, -783, 896, 1791, 1116, -468, -1721, -1324, 181, 1588, 1619, 221, -1390, -1755, -614, 1069, 1725, 981, -667, -1754, -1287, 297, 1583, 1460, 58, -1414, -1657, -459, 1202, 1695, 803, -832, -1688, -1088, 517, 1623, 1336, -152, -1476, -1533, -278, 1235, 1650, 598, -936, -1660, -978, 648, 1633, 1220, -310, -1527, -1381, -36, 1330, 1562, 433, -1137, -1649, -759, 773, 1645, 1090, -472, -1595, -1312, 39, 1359, 1427, 297, -1186, -1594, -571, 865, 1616, 876, -608, -1472, -1121, 267, 1460, 1375, 122, -1228, -1460, -430, 991, 1579]
2424A579q07j468q68N61J417J052j86j336j252j03J135J388M00r00j467o97O22
$$ y = [1579, 772, -696, -1564, -1003, 414, 1466, 1280, -56, -1308, -1411, -276, 1112, 1512, 612, -855, -1552, -930]
$$ [...]
8191B8
##END NTUPLES=NMR FID
##END=
