##TITLE=1H_Pr 16
 CDCl3
 8 sc, 
 8.04.2022
##JCAMPDX= 6.0         $$ Bruker NMR JCAMP-DX V2.0
##DATA TYPE= NMR FID
##DATA CLASS= NTUPLES
##ORIGIN= UXNMR, Bruker Analytische Messtechnik GmbH
##OWNER= root
$$ XWIN-NMR		Version 3.5
$$ Fri Apr  8 14:00:28 2022 Russian Standard Time (UT+4h)  she@DPX200
##.OBSERVE FREQUENCY= 200.13135
##.OBSERVE NUCLEUS= ^1H
##.DELAY= (6, 6)
##.ACQUISITION MODE= SIMULTANEOUS
##.ACQUISITION SCHEME= undefined
##.AVERAGES= 8
##.DIGITISER RES= 18
##SPECTROMETER/DATA SYSTEM= spect
##.PULSE SEQUENCE= zg30
##.SOLVENT NAME= CDCl3
##.SHIFT REFERENCE= (INTERNAL, CDCl3, 0, 15.7039)
##AUDIT TRAIL= $$ (NUMBER, WHEN, WHO, WHERE, WHAT)
$$ ##TITLE= Audit trail, XWIN-NMR		Version 3.5
$$ ##JCAMPDX= 5.01
$$ ##ORIGIN= Bruker BioSpin GmbH
$$ ##OWNER= she
$$ F:/spectra/data/she/nmr/H-F/1/audita.txt
$$ ##AUDIT TRAIL=  $$ (NUMBER, WHEN, WHO, WHERE, WHAT)
(   1,<2022-04-08 13:58:52.21 +0400>,<she>,<DPX200>,
      <created by zg, POWCHK disabled, PULCHK disabled
       configuration hash MD5:
       00 E9 B6 7A A2 85 ED C7 34 08 36 98 17 FE 4E 26
       data hash MD5: 16K
       D6 32 0E 7F 75 9C E6 90 78 D5 5A E1 9B 5B C4 4D>)
$$ ##END=
$$ 
$$ hash MD5
$$ 22 73 4D 4E CF E5 02 B9 18 4C 07 59 3A D0 B3 64
##$RELAX= 
##$RELAX= 
##$RELAX= 
##$RELAX= 
##$RELAX= 
##$RELAX= 
$$ Bruker specific parameters
$$ --------------------------
##$DU= <F:/spectra>
##$EXPNO= 1
##$NAME= <H-F>
##$PROCNO= 1
##$TYPE= <nmr>
##$USER= <she>
##$AMP= (0..31)
100 100 100 100 100 100 100 100 100 100 100 100 100 100 100 100 100 100 
100 100 100 100 100 100 100 100 100 100 100 100 100 100 
##$AQSEQ= 0
##$AQ_mod= 1
##$AUNM= <au_zg>
##$AUTOPOS= <>
##$BF1= 200.13
##$BF2= 200.13
##$BF3= 200.13
##$BF4= 200.13
##$BF5= 200.13
##$BF6= 200.13
##$BF7= 200.13
##$BF8= 200.13
##$BYTORDA= 1
##$CFDGTYP= 0
##$CFRGTYP= 5
##$CHEMSTR= <none>
##$CNST= (0..31)
1 1 145 1 1 1 1 1 1 1 1 1 1 1 1 1 1 1 1 1 1 1 1 1 1 1 1 1 1 1 1 1 
##$CPDPRG= <>
##$CPDPRG1= <>
##$CPDPRG2= <>
##$CPDPRG3= <>
##$CPDPRG4= <mlev>
##$CPDPRG5= <mlev>
##$CPDPRG6= <mlev>
##$CPDPRG7= <mlev>
##$CPDPRG8= <mlev>
##$CPDPRGB= <>
##$CPDPRGT= <>
##$D= (0..31)
0 1.2 0 0 0 0 0 0 0 0.06 0 0.03 0 0 0 0 0.0002 0 0 0 0 0 0 0 0 0 0 0 0 
0 0 0 
##$DATE= 1649411931
##$DBL= (0..7)
120 120 120 120 120 120 120 120 
##$DBP= (0..7)
150 150 150 150 150 150 150 150 
##$DBP07= 0
##$DBPNAM0= <>
##$DBPNAM1= <>
##$DBPNAM2= <>
##$DBPNAM3= <>
##$DBPNAM4= <>
##$DBPNAM5= <>
##$DBPNAM6= <>
##$DBPNAM7= <>
##$DBPOAL= (0..7)
0.5 0.5 0.5 0.5 0.5 0.5 0.5 0.5 
##$DBPOFFS= (0..7)
0 0 0 0 0 0 0 0 
##$DE= 6
##$DECBNUC= <off>
##$DECIM= 32
##$DECNUC= <off>
##$DECSTAT= 4
##$DIGMOD= 1
##$DIGTYP= 9
##$DL= (0..7)
0 120 120 120 120 120 120 120 
##$DP= (0..7)
150 150 150 150 150 150 150 150 
##$DP07= 0
##$DPNAME0= <>
##$DPNAME1= <>
##$DPNAME2= <>
##$DPNAME3= <>
##$DPNAME4= <>
##$DPNAME5= <>
##$DPNAME6= <>
##$DPNAME7= <>
##$DPOAL= (0..7)
0.5 0.5 0.5 0.5 0.5 0.5 0.5 0.5 
##$DPOFFS= (0..7)
0 0 0 0 0 0 0 0 
##$DQDMODE= 0
##$DR= 18
##$DS= 0
##$DSLIST= <SSSSSSSSSSSSSSS>
$$ [...]
##$SUBNAM2= <"">
##$SUBNAM3= <"">
##$SUBNAM4= <"">
##$SUBNAM5= <"">
##$SUBNAM6= <"">
##$SUBNAM7= <"">
##$SUBNAM8= <"">
##$SUBNAM9= <"">
##$SW= 18.05172834244
##$SWIBOX= (0..15)
0 0 2 0 0 0 0 0 0 0 0 0 0 0 0 0 
##$SW_h= 3612.71676300578
##$TD= 16384
##$TD0= 1
##$TE= 0
##$TE2= 300
##$TE3= 300
##$TEG= 300
##$TL= (0..7)
0 120 120 120 120 120 120 120 
##$TP= (0..7)
150 150 150 150 150 150 150 150 
##$TP07= 0
##$TPNAME0= <>
##$TPNAME1= <>
##$TPNAME2= <>
##$TPNAME3= <>
##$TPNAME4= <>
##$TPNAME5= <>
##$TPNAME6= <>
##$TPNAME7= <>
##$TPOAL= (0..7)
0.5 0.5 0.5 0.5 0.5 0.5 0.5 0.5 
##$TPOFFS= (0..7)
0 0 0 0 0 0 0 0 
##$TUNHIN= 0
##$TUNHOUT= 0
##$TUNXOUT= 0
##$USERA1= <user>
##$USERA2= <user>
##$USERA3= <user>
##$USERA4= <user>
##$USERA5= <user>
##$V9= 5
##$VALIST= <valist>
##$VCLIST= <CCCCCCCCCCCCCCC>
##$VD= 0
##$VDLIST= <DDDDDDDDDDDDDDD>
##$VPLIST= <PPPPPPPPPPPPPPP>
##$VTLIST= <TTTTTTTTTTTTTTT>
##$WBST= 1024
##$WBSW= 4
##$XGAIN= (0..3)
0 0 0 0 
##$XL= 0
##$YL= 0
##$YMAX_a= 149269
##$YMIN_a= -298836
##$ZGOPTNS= <>
##$ZL1= 120
##$ZL2= 120
##$ZL3= 120
##$ZL4= 120
##$ABSF1= 10
##$ABSF2= 0
##$ABSG= 5
##$ABSL= 3
##$ALPHA= 0
##$AQORDER= 0
##$ASSFAC= 0
##$ASSFACI= 0
##$ASSFACX= 0
##$ASSWID= 0
##$AUNMP= <proc_1d>
##$AZFE= 0.1
##$AZFW= 0.1
##$BCFW= 1
##$BC_mod= 2
##$BYTORDP= 1
##$COROFFS= 0
##$CY= 11.3945322036743
##$DATMOD= 1
##$DC= 2
##$DFILT= <>
##$DTYPP= 0
##$F1P= 2.36226072786647
##$F2P= -0.459571619588291
##$FCOR= 0.5
##$FTSIZE= 0
##$FT_mod= 4
##$GAMMA= 1
##$GB= 0.15
##$INTBC= 1
##$INTSCL= 1
##$ISEN= 128
##$LB= 0.24
##$LEV0= 0
##$LPBIN= 0
##$MAXI= 10000
##$MC2= 0
##$MEAN= 0
##$ME_mod= 0
##$MI= 1.114404
##$NCOEF= 0
##$NC_proc= 0
##$NLEV= 6
##$NOISF1= 3.799351
##$NOISF2= 2.8
##$NSP= 1
##$NTH_PI= 0
##$NZP= 0
##$OFFSET= 15.70392
##$PC= 1
##$PHC0= -18388.93
##$PHC1= 10.60078
##$PH_mod= 1
##$PKNL= yes
##$PPARMOD= 0
##$PSCAL= 0
##$PSIGN= 0
##$REVERSE= no
##$SF= 200.130013532006
##$SI= 16384
##$SIGF1= 3
##$SIGF2= 2
##$SINO= 400
##$SIOLD= 16384
##$SREGLST= <1H.CDCl3>
##$SSB= 0
##$STSI= 0
##$STSR= 0
##$SW_p= 3612.71676300578
##$SYMM= 0
##$S_DEV= 0
##$TDeff= 0
##$TDoff= 0
##$TI= <>
##$TILT= no
##$TM1= 0
##$TM2= 0
##$TOPLEV= 0
##$USERP1= <user>
##$USERP2= <user>
##$USERP3= <user>
##$USERP4= <user>
##$USERP5= <user>
##$WDW= 1
##$XDIM= 8192
##$YMAX_p= 0
##$YMIN_p= 0
$$ End of Bruker specific parameters
$$ ---------------------------------
##NTUPLES= NMR FID
##VAR_NAME=  TIME,          FID/REAL,        FID/IMAG
##SYMBOL=    X,             R,               I
##VAR_TYPE=  INDEPENDENT,   DEPENDENT,       DEPENDENT
##VAR_FORM=  AFFN,          ASDF,            ASDF
##VAR_DIM=   8192,          8192,            8192
##UNITS=     SECONDS,       ARBITRARY UNITS, ARBITRARY UNITS
##FACTOR=    0.0002768,     1,               1
##FIRST=     0,             0,               0
##LAST=      2.2672688,     0,               0
##MIN=       0,             -298836,         0
##MAX=       2.2672688,     149269,          0
$$ Real data points
##PAGE= N=1
##DATA TABLE= (X++(R..R)), XYDATA
0 0 0 0 0 0 0 0 0 0 0 0 0 8 -8 8 -8 16 -16 24 -24 32 -33 40 -48 57 -72 80 -96 110 -126 144 -165 187 -213
33 -213 241 -273 306 -343 385 -430 480 -535 594 -659 730 -806 893 -983 1085 -1194 1316
50 1316 -1449 1597 -1759 1941 -2146 2376 -2636 2936 -3286 3699 -4190 4795 -5555 6545 -7891
65 -7891 9837 -12914 18498 -31878 136591 -8221 -239659 48877 78440 -41026 -4517
76 -4517 63743 -48077 -10619 73441 -35083 -119851 -8219 41209 27268 39081 2371 -79902
88 -79902 -21569 32005 -20647 839 68778 3129 -52009 21838 15808 -72505 14009 83518
100 83518 -24769 -35631 66359 -3356 -107042 19297 103913 -27316 -46135 58185 16041
111 16041 -73952 -17949 39221 6348 9468 20478 -18829 -30221 -5403 720 -3923 5322 1154
124 1154 9736 29439 -23985 -63426 6151 53815 1164 -21686 29717 12182 -42767 -5942
136 -5942 29950 -5845 -5191 39210 7770 -39477 3086 25206 -23208 -25829 29788 33858 -15277
149 -15277 -27106 -12222 -1295 10526 5708 -4469 -6912 -3815 -141 1145 -2017 -11286 1244
162 1244 26033 12212 -19965 -13985 13114 3929 -7901 17692 20121 -13926 -16054 11761 4396
175 4396 -10668 10670 6347 -18174 4049 22291 -16375 -36764 8952 30086 -3158 -15237
187 -15237 -5683 -3546 1440 4409 -6663 -6133 12815 7253 -6173 1705 635 -10262 6547 21968
201 21968 -5087 -14396 16100 9494 -17715 -94 17479 -6029 -10747 13313 -298 -18945 4513
214 4513 8995 -12479 -4311 11020 -5913 -12233 5898 2040 -7727 1349 2147 -3424 6351 5544 -11301
229 -11301 522 17342 -1464 -9494 8560 6723 -7877 2957 10616 -7477 -4735 13025 -1072
242 -1072 -12562 3824 6256 -9898 -5909 6207 -655 -5791 -1607 -3034 -1514 4365 -2351 -7799
256 -7799 3718 4738 -3361 2854 2938 -5908 2482 12764 -387 -9943 5798 9562 -4082 -661
270 -661 4595 -2891 -901 6818 -1101 -7853 -369 2597 -2205 -2975 -2527 -2714 335 664 -5714 -544
286 -544 4621 -5028 -3670 6491 1451 -5719 2000 7301 -1625 -737 7295 -221 -3798 6373 4486
301 4486 -4683 -86 4564 -419 -1162 634 -1688 -1698 787 -2720 -4184 1429 -1865 -6353 2410 1880
317 1880 -6541 -974 4345 -2920 -3517 5294 1706 -5365 2997 7388 -2156 -934 5576 1028 -362
332 -362 3900 313 -2343 2259 2413 -1775 -867 610 -2428 -154 1811 -5645 -4357 3926 -1170 -6495
348 -6495 543 2095 -4229 -1019 3974 -2466 -3223 4895 1762 -3582 3117 4232 -2072 1374 4731
363 4731 158 548 2587 -780 -1254 4045 735 -5189 938 2263 -3925 -613 2030 -5259 -4113 3529
379 3529 48 -5499 -669 1450 -3425 466 4258 -2528 -2970 4463 1940 -1673 2168 2155 -520 2821
395 2821 4854 -657 -1763 2499 146 -798 3405 -392 -3958 889 1355 -3917 -2039 1435 -2439 -3427
411 -3427 457 -463 -3043 -313 -905 -2774 2682 3263 -1653 -1030 1757 311 1364 3705 365 -1616
427 -1616 3146 3486 -523 842 701 -1823 2694 4157 -3320 -4564 1002 -165 -2934 1835 1952 -5448
443 -5448 -3479 1250 -2458 -2100 2565 -1292 -2018 4527 1517 -6019 -655 5254 -459 1336 8037 -139
459 -139 -6492 1273 4150 96 3366 3121 -3610 -1125 4053 -2617 -6001 1739 1160 -2776 3215 1375
475 1375 -9747 -6557 4723 3966 -1975 -1742 -2421 -2302 4197 3244 -4551 66 7157 1186 -1730 2524
491 2524 12 -3008 4388 6780 -942 -2631 687 -2019 -1606 3098 -344 -1781 2472 -1573 -7099
506 -7099 -1114 3362 -2538 -4162 2426 2412 -1978 -1227 -2450 -3450 2903 5084 1123 436 1012 -1765
522 -1765 -672 5995 3555 -5202 -1734 7243 4670 -2342 -3710 -2270 712 3257 984 -4292 -3820
537 -3820 852 823 -977 -763 -4100 -4141 2730 5031 -1615 -5363 179 4550 -139 -2846 1570 3213
553 3213 1066 865 908 655 1435 1491 -1402 -976 4608 1256 -4615 550 2865 -4125 -1332 4948 -3260
570 -3260 -9049 981 6099 -2374 -3015 1370 -3725 -2036 4815 -981 -5557 3989 5603 -2142 432
585 432 4554 -5090 -4936 10372 7008 -6639 -270 5738 -2891 -2000 3841 -3025 -4134 7210 3279
600 3279 -9040 -1914 3805 -7060 -3398 7363 -1987 -7020 4667 2906 -7890 -1517 6577 -1376
614 -1376 -1901 5675 -351 -3477 5627 2313 -6536 3114 8934 -2171 -3977 3502 -29 -4407 4329
629 4329 3558 -6411 -1522 4050 -4032 -4051 3655 -1235 -4944 3348 2310 -7373 -2944 4772 -184 -699
645 -699 4864 -608 -4064 2009 1856 -1814 2543 4655 -719 155 3479 -1979 -4303 3310 3122 -2273
661 -2273 833 2211 -3882 -3718 1025 -607 -2342 1335 407 -4504 -1720 1991 -2005 -2154 1939 1228
677 1228 -553 849 377 -1715 904 3448 505 -5 2134 609 -504 1773 905 -964 900 1492
693 1492 -1015 -1983 401 -244 -2292 -666 698 -1445 -2584 -566 -298 -1862 -817 1981 -112 -1475
709 -1475 816 1124 -921 140 2312 1140 189 1702 1502 -503 714 1404 -82 395 1774 -346
725 -346 -1628 -21 -220 -2047 -274 447 -2132 -1280 973 -2164 -3241 1217 632 -2531 239 2466
741 2466 -1227 -1535 2908 943 -1691 2131 2948 -1199 684 2920 -42 -659 2310 964 -1427 588
757 588 592 -2293 -284 1171 -2100 -1268 647 -1664 -2115 675 -257 -2430 173 1518 -1782 -1387 2207
774 2207 394 -1275 2009 1332 -733 1079 2205 -195 -76 2028 721 -889 1195 679 -1288 508
790 508 274 -1804 24 238 -1752 -1288 462 -1017 -2067 -126 112 -2067 26 1147 -1454 -240
806 -240 1794 138 -23 1259 1230 165 1059 1658 -8 575 1680 -97 25 1337 -329 -948 811
823 811 -489 -1624 -429 410 -1386 -1581 567 -1206 -2032 711 37 -2001 68 574 -584 291 958
840 958 -28 -24 1717 1184 -100 1179 1150 -283 1253 1454 -818 17 1327 -211 -864 436 -175 -1778
858 -1778 -302 286 -1830 -1277 306 -1280 -1070 402 -494 -697 -139 310 -132 411 1078 -102 307 1972
876 1972 698 118 1709 453 -330 1239 977 -305 -150 687 -232 -903 972 -565 -2100 -267 41
893 41 -1736 -665 -506 -1462 -881 355 -927 -1043 570 481 -289 1144 1214 -1117 421 2280 437 470
911 470 1697 1016 -749 789 1209 -514 -95 850 -630 -1112 364 -970 -1788 -72 122 -976 -734
928 -734 -659 -1193 -1262 773 -128 -55 692 -609 -515 1397 815 -673 963 2453 943 -161 735 162 -322
947 -322 1386 1379 7 -102 -804 -1711 82 132 -1454 -715 588 -1151 -2301 -459 -113 -1584 405 995
965 995 -919 -286 355 -959 -396 2708 2019 -469 544 1688 -686 -257 2563 821 -154 1327 694
982 694 -988 -1122 -796 -945 1108 1839 -1716 -2464 92 -1554 -2448 879 1125 -1476 -482 1049 -838
999 -838 -2017 531 1397 949 2314 1324 -1268 -488 1354 425 798 2045 1252 -825 -818 -785 -799 626 946
1018 946 -446 -411 -440 -2692 -1946 418 67 -741 1291 894 -2480 -2740 517 1258 810 1841 610 -657
1036 -657 130 -416 -456 1514 2418 1485 1121 513 -2011 -2313 1238 1326 424 1169 2 -2705 -1711 -575 -1419
1055 -1419 -773 1751 1430 -2195 -1551 -155 -1951 -938 2589 2273 183 -281 -35 -592 -377 1366 1997
1072 1997 1524 1168 -658 -1287 14 317 398 1503 1083 -474 -1924 -1406 -936 -921 437 1515 -312 -1908
1090 -1908 -1481 -1204 -924 -109 1651 1080 -573 624 240 -2139 -327 3039 2103 507 1307 1175 -1778
1107 -1778 -1285 1903 935 -18 1844 613 -1765 -1149 -985 -1540 -49 1528 -30 -1390 -242 -1371
1123 -1371 -3008 398 1878 -640 687 1901 -1565 -2459 1307 1626 -929 1636 3233 -1347 -1533 1997
1139 1997 101 -1221 2410 2390 -1499 -1364 450 -1290 -1291 1431 461 -1747 -178 -846 -2838 -719 1024
1156 1024 -357 33 1595 -858 -2366 572 1429 -986 1543 2978 -557 -1184 1360 418 -821 1380
1172 1380 2302 -304 -593 983 -1005 -1364 563 368 -624 -439 -286 -1296 -1215 -350 -740 -72 540 -381
1190 -381 -717 299 177 -654 572 1506 -70 -31 1331 563 -198 698 1372 238 -117 730 272 -597 -11
1209 -11 247 -303 -536 -321 -294 -1050 -729 -399 -268 -471 -859 -77 -336 -843 6 3 401 420 175 504 561 212
1231 212 320 839 1055 403 456 870 45 -453 605 255 -1110 -27 522 -740 -869 -12 -155 -1241 -484
1250 -484 454 -813 -655 655 -379 -521 241 261 -54 245 562 15 410 1170 300 -185 1096 636 -310
1269 -310 1119 1022 -662 -155 642 -348 -1048 463 125 -1483 -365 265 -1421 -892 223 -360 -841 112
1287 112 29 -544 86 296 -71 167 744 -44 171 1168 226 217 1092 673 -459 257 914 -454 -598 628
1307 628 107 -1232 -30 -345 -814 -520 -63 -684 -763 -271 21 -514 120 211 -598 377 244 -136 612 607 -107
1328 -107 510 1104 444 -133 864 796 -630 390 1018 -414 -205 197 -474 -515 -260 -475 -866 -519 -312 -503
1348 -503 -593 -64 -523 -523 316 -359 -170 485 374 87 616 603 274 171 954 374 -168 849 648 -110 149
1369 149 391 -405 -312 -74 -342 -421 -408 -366 -767 -384 -289 -675 -229 -312 -678 180 96 -13 269 407 67 166 348
1392 348 666 264 428 740 167 489 253 -75 264 -70 -433 151 -12 -691 -586 -216 -250 -996 -328 155
1412 155 -797 -591 55 -517 -651 271 357 19 134 731 -315 116 1155 440 111 890 760 -182 595 546
1432 546 -298 -134 633 -402 -771 417 -351 -1482 14 381 -1229 -682 556 -700 -1181 397 153
1449 153 -652 248 788 -553 -16 969 234 83 1374 679 -198 492 901 -555 -66 1300 -110 -527
1467 -527 542 -187 -1389 354 545 -975 -170 449 -1179 -1341 388 -168 -928 598 778 -742 -489
1484 -489 599 -140 -15 1159 347 -141 1037 1016 -331 747 1075 -157 -393 969 -127 -874 475
1501 475 292 -979 -394 562 -1028 -899 468 -340 -1413 334 155 -1236 -210 784 -222 -286 1224
1518 1224 297 -389 562 693 -202 739 961 -141 69 991 -129 -483 602 381 -764 -181 649 -980
1536 -980 -772 278 -523 -1218 -497 46 -784 -358 395 -272 -777 468 38 -394 525 836 -32 338 580
1555 580 500 427 748 231 -58 494 560 -256 251 286 -513 -532 -173 -111 -746 -133 542 -605 -751 -387 -466 -653
1577 -653 151 174 124 145 98 -157 -116 374 584 614 986 817 -129 268 106 -339 188 855 295 77 80 -332 -1051
1600 -1051 -500 149 -281 -438 111 -546 -688 -169 148 -229 -280 878 -110 -438 279 512 186 896 909 -18
1620 -18 54 283 108 342 1177 837 -440 191 53 -1297 -614 903 -372 -588 153 -504 -1662 -730 310
1639 310 -442 -270 1178 -10 -1004 238 116 -451 607 1250 221 44 627 69 -900 930 976 50
1657 50 504 609 -676 -794 535 -78 -681 519 338 -1317 -590 462 -638 -538 667 -164 -1085 65
1675 65 301 -334 -188 1175 250 -17 601 21 -461 828 749 98 423 674 -191 -423 347 -74 -484 860
1695 860 147 -988 -443 -90 -1091 -677 495 -240 -614 -101 2 -722 -152 520 9 187 857 -60 -93
1714 -93 507 87 302 961 596 201 329 528 -121 -34 529 221 -303 -92 -276 -1024 -596 171 -311 -591 -88
1735 -88 -238 -881 -113 186 -295 -32 403 -116 40 214 296 290 569 600 181 455 297 -31 351 510 -52 77
1757 77 118 -376 -462 -247 -381 -268 -561 -166 -100 -486 -108 -64 67 -177 -139 8 185 -168 148 288 434 164
1779 164 585 448 -4 41 690 186 54 417 35 -45 -37 -108 -221 -64 -384 2 -275 -231 -350 -638 106 -130
1801 -130 -298 40 -64 -85 -31 270 289 -189 465 426 100 622 888 148 169 354 285 149 229 218 -88 -322 2
1824 2 -146 -442 -80 -358 -475 -265 -423 -544 -212 -247 -343 -292 274 -126 -27 185 89 -214 356 298 363 684 397
1847 397 80 240 295 139 -150 145 209 -307 251 -44 -375 -249 -87 -605 -323 -144 -431 -477 -91 -7 -310
1868 -310 -62 370 -249 -23 306 2 16 641 209 139 451 386 121 136 453 123 -177 284 -248 -227 151 -208
1890 -208 -518 -269 -178 -520 -570 -331 -207 -570 -165 -85 -309 -217 118 -151 218 508 296 214 335 279 39 181
1912 181 441 238 55 203 -276 -111 40 -41 58 152 23 -341 -635 -286 -572 -361 47 -407 -100 -357 -106
1933 -106 -182 -80 128 320 99 30 131 152 285 184 432 463 155 -97 150 -16 -237 222 242 -145 -380 -98
1955 -98 -293 -582 -323 -3 -126 83 -243 -601 -289 -52 -29 188 457 57 -65 125 353 104 547 771 398
1976 398 321 -7 -93 -284 157 545 208 31 -163 -690 -331 -290 -218 102 224 -110 -534 -513 -358 -249 161 628
1998 628 162 151 225 -306 -35 651 837 436 574 263 -278 77 455 314 426 848 -32 -620 -358 -464 -609
2019 -609 248 841 -210 -216 -460 -803 -917 379 468 15 296 173 -741 -507 234 312 481 953 583 -275 -170
2040 -170 322 -21 346 645 278 -262 -148 -370 -637 96 525 180 -339 152 -836 -541 30 -13 -393 476
2060 476 -134 -650 -562 30 127 83 823 636 -94 -39 170 -145 268 940 268 369 -26 -228 -774 -100 381
2081 381 62 565 266 -873 -931 -487 -636 -341 853 317 -332 -287 -327 -606 -173 973 181 -74 319 66
2101 66 -639 133 815 262 473 539 -27 -795 153 341 -93 510 511 -626 -554 -328 -343 -279 457 206 -742 -442
2123 -442 -438 -677 -208 709 486 -303 425 87 -570 -60 809 766 264 752 102 -609 -147 386 -29 118 771
2144 771 15 -533 -223 -4 -574 -102 509 -323 -527 -46 -732 -653 93 149 -130 34 422 -406 -389 450 634
2165 634 -49 466 435 -75 111 445 499 113 195 478 -505 -153 251 -127 121 249 -46 -473 -364 -502 -384
2186 -384 -199 105 -151 -124 218 21 -417 437 341 22 529 445 -64 79 407 343 -250 307 517 25 142
2207 142 448 -194 -291 213 -393 -117 -18 -142 -494 -1 -70 -397 -386 205 -301 -348 -30 97 -356 222 457 -137
2229 -137 -325 263 516 -168 214 567 -254 -163 319 -123 -276 227 55 -182 -2 266 -283 -105 230 -496
2249 -496 -190 -133 -181 -555 40 365 -360 285 379 -183 34 493 354 -64 369 310 -80 5 665 98 -126 383
2271 383 227 -81 -192 240 -134 -78 140 -398 -378 -454 -220 -203 -422 -93 -331 -39 331 -326 123 81 -43 -96
2293 -96 336 369 317 80 259 225 89 413 -37 204 234 137 252 -92 48 -60 -71 -51 -198 -384 -30 -173 -277
2316 -277 -21 -226 -167 47 -113 94 95 4 344 206 180 243 -98 219 372 253 410 116 -128 9 24 47 27
2339 27 84 -89 -253 -71 -19 -480 -495 -187 -70 -94 -89 -245 -234 149 97 147 150 -40 470 104 211 95 263 396
2363 396 344 -35 94 120 346 61 164 -159 -205 324 90 -108 -100 -254 -171 -154 -296 -152 36 -117 -185 -186 89
2386 89 -72 71 -85 28 -23 133 311 -94 487 289 241 113 187 24 -204 124 8 -429 105 270 -82
2407 -82 18 212 -74 -231 -77 -119 -108 -244 -105 -330 -144 73 -254 -39 490 -88 -127 220 356 133 296
2428 296 410 29 -85 169 155 -413 -9 61 -269 -327 -153 -137 -390 -149 -48 -260 -16 4 -441 -156 159 -193
2450 -193 -84 299 -167 -191 149 308 -92 42 607 -89 265 440 -109 -159 197 406 -134 260 143 -151 -410
2471 -410 8 -66 -306 50 53 -325 -98 -174 -328 -27 239 -21 -196 195 32 -257 166 390 213 -11 320
2492 320 38 -195 143 217 91 7 396 -208 -382 139 -122 -490 262 53 -84 -350 -309 -359 -249 239 10
2513 10 -138 76 48 -381 -146 328 244 125 355 301 -260 143 343 -26 203 647 489 -260 -87 -108 -404 240
2535 240 157 -32 -37 -151 -241 -550 -242 38 110 154 341 72 -289 -355 64 -82 445 523 85 -115 157 -17 -117
2558 -117 583 517 349 -71 -240 -537 -296 204 336 148 28 -511 -615 -398 -169 -66 -25 222 -190 -566 -267
2579 -267 -74 -157 701 647 127 112 185 -56 -314 550 525 -55 403 314 -367 -266 167 81 208 454 -83 -723
2601 -723 -236 -124 -406 -210 461 -73 -792 46 -250 -462 104 666 -240 -96 396 -177 -448 535 607 -172
2621 -172 344 887 -327 -574 257 4 -235 355 377 -532 -328 -146 -683 -531 372 326 -728 -163 9 -747
2641 -747 -348 608 37 -301 303 105 -448 -143 346 -224 -68 672 30 -202 278 10 -485 275 807 -436
2661 -436 -463 -120 -367 -527 184 309 -620 -280 -247 -554 -579 112 -19 -364 65 -18 -465 -22 349 -66 122
2682 122 365 231 -40 316 96 50 9 387 164 -115 100 -168 -228 -37 136 -152 40 79 -293 -414 -59
2703 -59 -73 -64 -7 -44 34 -107 12 -97 68 427 262 -129 297 417 191 218 326 -143 -149 190 26 -43 -10 -29
2727 -29 -184 -220 167 -433 -338 -3 -44 -76 -55 -79 -143 -174 80 -63 -201 277 183 29 193 249 116 -181 212 189
2751 189 24 222 312 109 -221 -36 -134 -4 -63 -68 -167 -191 244 -10 -147 69 -81 -20 -21 -104 -170 -25 74 -2 -29
2776 -29 201 183 22 176 160 -36 178 191 71 314 122 133 34 27 155 -219 -135 38 -252 -236 14 -210 -329
2799 -329 -110 -142 -373 137 -126 -48 -106 96 141 43 85 228 349 54 -22 140 -143 -64 111 -126 154 136 95
2822 95 -103 40 -196 -98 -98 6 -282 -119 -17 -221 -183 -85 -371 -53 63 3 -15 97 106 126 334 162 240 -12
2846 -12 338 132 139 328 204 -77 -66 55 -102 -115 29 -101 -321 -225 -88 -300 -47 -7 7 -366 -29 -254 -51
2869 -51 192 -246 75 33 154 36 192 137 188 204 261 175 36 118 65 46 257 94 133 -120 -191 -56 -177 -125
2893 -125 -304 0 -419 -156 -215 -47 -1 -47 92 213 -2 -49 152 128 163 -20 -34 215 57 115 8 266 72
2916 72 -117 170 -88 -123 -29 -191 -72 -78 -85 -309 -93 -104 -117 -264 171 -11 73 -183 -46 125 -203 256 410
2939 410 203 44 310 -268 31 30 217 3 174 27 -114 41 -46 35 -152 189 -315 -204 14 -54 -309 -190
2961 -190 219 69 -18 98 -101 -240 -88 -46 -147 288 206 67 -163 404 288 14 204 268 -24 211 4
2982 4 -167 -66 153 44 -146 -29 -165 -375 -458 172 132 110 80 13 -330 -51 274 -328 -3 445 -16 6 254
3005 254 141 -152 332 206 -54 219 329 -105 -112 266 337 -283 48 -244 -334 -64 107 -206 -512 74 93 -306
3027 -306 -21 302 -38 -110 243 315 -261 44 290 -216 256 285 79 26 185 7 -68 -36 100 -275 69 318
3049 318 97 -202 -181 35 -404 -81 30 -421 -230 310 -197 -396 25 87 -196 22 400 -89 -253 188 218
3070 218 -176 183 207 20 177 272 86 -185 142 180 -81 180 141 -311 -492 71 -123 -225 130 62 -164 -208
3092 -208 38 -123 -76 318 297 -201 66 126 -211 -316 -13 135 -30 343 91 -451 158 250 -93 -107 102 -271
3114 -271 50 249 -282 -288 140 63 -136 -203 -114 -270 -188 236 51 56 124 123 -292 -50 -14 174 258 525 58 -310
3138 -310 294 81 -310 149 434 5 108 -31 -254 -328 46 158 -250 -22 -16 -288 -420 -80 -52 -160 384
3159 384 384 -246 -308 139 -167 24 543 284 -97 109 19 -169 -28 437 166 9 233 79 -388 -291 394 -82
3181 -82 71 153 -185 -175 42 59 -206 -190 40 -196 -387 206 -16 -198 19 261 98 -114 172 323 -216 135
3203 135 184 113 6 307 -16 -282 -88 44 -4 -200 -82 -51 -217 -125 -148 -79 64 -89 -142 20 8 -35 -280
3226 -280 -32 22 74 28 218 1 62 221 10 21 2 172 76 -66 -53 19 -185 -227 -42 -169 -54 -66 -170 -134
3250 -134 -74 303 -270 34 174 -210 -96 -232 -77 -80 6 37 169 -50 253 162 184 337 169 -147 206 48
3272 48 78 191 133 41 -39 -208 -258 -82 -161 85 -73 -177 -413 -189 -322 -29 -113 -65 65 -231 93 54 319
3295 319 -54 412 169 23 149 132 -115 -50 191 110 134 -106 -181 -402 -303 -96 -201 -147 -149 -268 -220 46 -113
3318 -113 -52 -114 -161 -69 84 165 -212 -59 143 169 111 87 34 263 -87 63 -119 -305 -114 167 235 86 -261
3341 -261 -104 -91 1 -232 -25 -136 -76 11 189 -137 93 -413 -164 -102 143 -79 -81 40 240 239 123 219 215 36
3365 36 83 -16 -195 219 80 -127 130 -36 -120 -375 -73 -73 -172 -304 -176 -95 -54 -65 -15 52 -85 -154 -74 177 19
3390 19 -40 54 -91 141 -116 139 75 163 141 190 -135 -116 210 307 76 -143 117 -128 -126 -47 -170 -297 -18 -198
3414 -198 -202 174 -12 -9 -48 -21 131 181 242 311 369 66 105 102 370 85 198 -94 64 117 73 38 -50 -16 191 -224
3440 -224 -80 -371 -21 66 -72 -98 -125 -292 -210 255 264 131 123 -67 155 171 130 28 -86 52 83 187 -255 88
3464 88 -109 50 -192 90 -47 -19 -37 -274 -201 -146 64 -163 26 -76 -112 145 -35 15 -105 -7 305 -144 -100
3487 -100 2 -234 -44 74 86 181 227 152 -101 -79 335 -74 -3 210 -120 -209 63 5 -490 70 66 -280 -428
3510 -428 -272 -298 -120 148 147 63 -30 131 -306 -91 121 285 -171 193 161 -2 42 300 -115 21 343 206
3532 206 -168 -129 30 -98 -112 276 -32 -257 -177 -154 -563 -275 327 -86 -270 171 -263 -457 69 167 -157 96
3554 96 499 -128 -197 44 148 -256 115 296 -310 -193 232 -339 -306 228 350 -303 -93 43 -483 -589 231
3575 231 -1 -135 40 17 -465 -218 227 -400 22 350 290 -137 96 209 -253 128 561 -3 -67 151 -102
3596 -102 -575 18 43 -272 16 -37 -214 -419 -281 -20 -353 22 466 -107 -301 494 130 -162 76 354 -205
3617 -205 47 126 -277 -131 321 247 -10 136 540 -16 -42 108 -59 -193 30 -77 -159 -2 -59 -386 -144 303
3639 303 -146 -491 54 -103 -279 85 185 -333 -175 207 -296 -311 55 87 -228 345 407 -42 -207 402 -230
3660 -230 -325 397 304 -336 244 12 -188 -330 191 81 -283 187 -255 -569 77 -9 -134 -21 201 75 -486
3681 -486 127 168 -159 196 207 28 -58 503 24 -278 122 -256 -449 31 154 -233 -129 184 -1 -431 -190
3702 -190 206 -473 -284 145 -58 -397 213 188 -224 85 456 -166 -76 361 6 -78 420 -32 -457 192 200 -140
3724 -140 -152 150 -145 -470 55 74 -249 -114 365 -322 -367 -1 33 -387 -128 155 -341 183 30 -206 -104
3745 -104 63 22 48 -30 205 37 -120 252 218 -132 432 84 -36 -232 378 -86 -194 -202 -5 -164 -88 -227
3767 -227 -112 -52 33 -189 -40 225 -24 -1 44 140 -33 89 186 176 -109 -93 268 60 97 117 51 -35 -119 -156 17
3792 17 106 60 -154 -99 -9 -78 -57 12 -141 -144 -9 -76 -104 -120 -207 -163 -216 95 45 103 44 217 6 -18 211 52 201
3819 201 124 -58 -3 -1 34 208 -316 -18 -26 82 -222 -261 -4 -17 8 -116 -127 101 3 -283 -48 88 69 115 180
3844 180 34 -2 -38 154 72 1 11 -97 109 -81 -129 26 132 35 -67 -32 20 -57 106 -125 -52 -178 -55 31
3868 31 -55 179 153 19 7 -101 99 -9 1 197 98 179 110 106 -197 10 -142 46 -14 199 -54 219 -47 5
3892 5 -180 -207 119 -364 -175 -111 -200 34 -118 -106 200 -213 -101 129 -101 83 104 254 168 -84 147 -57 139
3915 139 -110 134 38 66 243 21 165 -83 61 -112 26 77 -27 -151 -99 -102 -229 -75 -57 48 79 31 98
3938 98 20 110 55 131 -113 -88 116 -3 -140 57 142 117 151 -67 -48 235 47 15 98 20 -140 -242 -109 -104 -4
3963 -4 157 89 103 151 86 -145 102 14 104 -44 -48 238 -160 63 -30 -137 113 178 205 -324 -66 -23 0 111 239
3988 239 -99 -88 135 -397 -304 53 -12 -134 -108 159 -235 -89 101 93 100 57 111 67 82 149 9 -93 257 -133
4012 -133 109 74 33 -382 -175 179 -73 -239 -234 -383 -103 -43 101 -124 130 -33 -83 3 -5 32 74 -3 -24 -94 144
4037 144 274 69 -16 -59 139 21 5 13 -134 21 180 -104 98 115 18 -230 -102 261 -158 -27 115 -168
4059 -168 -28 99 -143 -63 110 -82 -136 -181 18 -18 196 65 36 -101 38 134 -76 209 198 -123 -67 40 -196
4082 -196 11 323 344 12 -222 80 -165 -118 165 36 -57 -17 141 -22 -201 233 -4 -361 223 106 -136
4103 -136 32 121 -97 -98 95 -141 -73 143 80 -291 -54 332 -157 88 118 -153 -525 49 62 -93 86 130 -195
4126 -195 -294 -96 -261 -302 90 231 -304 -82 211 266 14 297 307 -136 157 86 -65 -113 93 46 37 546 89
4149 89 -393 -158 176 -220 -84 276 -31 -327 -107 -9 146 64 258 -217 -34 282 -121 114 233 107 -136
4170 -136 101 32 -320 138 163 71 -179 259 50 -262 -70 -28 -156 -131 177 -76 -246 -295 -149 -355 24 257
4192 257 116 -122 23 -209 -335 117 342 -34 54 253 -30 -499 223 -136 131 174 167 -187 83 68 -93 -338
4214 -338 181 161 -109 -62 70 -119 281 -116 204 22 -49 -41 -141 -172 203 -117 171 28 74 -29 -34 214 -15
4237 -15 111 155 115 40 214 -255 -28 15 114 -153 -20 156 -331 -396 -79 137 -164 181 -109 -154 -92 76 34
4260 34 -289 205 -127 -69 -109 61 24 10 41 183 -11 266 81 -190 180 17 -151 25 82 111 -240 -46 -119
4283 -119 -93 -79 -38 -95 -164 265 -116 -114 -209 76 148 64 126 21 91 121 -26 -175 -163 -175 123 -144 29 82 -47
4308 -47 -62 88 -91 40 -48 -96 29 -52 -118 11 -78 -227 -120 -100 106 -80 -94 -104 130 -97 142 201 27 -66
4332 -66 28 -38 14 229 164 107 -1 289 -68 224 -88 5 26 -5 -215 -132 -129 -159 -91 -187 94 -222 -64 -186 -36
4357 -36 104 -28 -107 36 54 128 87 -20 149 -131 38 5 -171 56 70 -116 -20 -215 -154 24 -144 0 33
4380 33 42 231 36 -145 -14 -240 -66 -184 -285 71 -47 187 161 94 60 -223 27 185 79 213 -24 -29 -100
4403 -100 192 -79 119 14 -200 1 -178 3 -115 60 -30 -132 -39 -57 176 -46 -126 -96 -49 -88 21 355
4425 355 78 34 133 -187 95 167 104 291 -11 -167 89 -118 153 -129 -106 119 7 -148 -46 -209 -281 10
4447 10 -40 -26 306 43 3 55 101 -19 18 -223 23 -95 192 -97 197 209 187 136 -16 -34 -125 -158 -55 -65 24
4472 24 134 -6 -268 -128 19 -91 -10 62 -17 -43 -208 -65 -173 79 468 17 45 35 100 -8 33 313 73
4495 73 -116 269 -40 123 -112 100 -43 13 -141 -207 -165 97 9 -317 -137 114 -70 -81 103 -223 -236 103
4517 103 247 -50 -22 -141 16 -58 62 84 71 -8 168 -97 -109 -198 -75 -43 70 -49 171 -91 75 88 -162
4540 -162 35 32 -48 -136 -76 6 -57 -78 -78 291 73 -37 -28 20 81 117 152 76 21 -44 43 -51 27 119 89 -92 82 -216
4568 -216 -78 114 -131 -180 7 -22 -176 -28 15 9 -124 189 118 128 198 16 67 10 151 265 -163 -16 -241
4591 -241 72 -85 -79 -140 -156 92 38 131 -193 152 185 -153 108 -50 -6 -108 -125 -144 48 257 31 55 -3 -49
4615 -49 -111 292 134 -180 117 27 -96 -104 212 19 -173 -82 7 -70 -146 -18 -166 121 47 -109 -240 -222 -209 9
4639 9 237 -59 -15 -104 -64 -309 132 134 133 -37 18 80 181 -89 55 -33 78 179 -116 210 -198 75 -96 150
4663 150 -107 216 52 66 156 -127 -133 20 -259 -97 173 -185 -248 22 87 34 -141 225 123 71 163 -69 156
4686 156 40 217 -99 110 42 -371 72 -90 256 -393 -126 102 -26 -324 177 -164 25 -131 -65 -126 -103
4707 -103 -210 -250 -11 -196 186 21 -113 -75 -91 103 59 190 172 123 102 37 -61 344 69 -45 -41 -84 34 25 48
4732 48 25 -155 -78 -222 -215 -34 -47 -29 -37 -116 79 59 -260 -43 7 102 54 27 161 273 -1 20 52 148 54 81 -145
4759 -145 -98 79 65 191 -205 -47 -88 -29 -22 59 -64 -24 -61 -121 -50 -16 104 97 -170 124 73 211 -274 -19 47
4784 47 48 109 28 -43 -106 34 -125 79 58 49 -109 96 2 -128 3 -91 -250 -20 137 -295 -139 100 -21 -14 187
4809 187 225 -133 -105 -4 -137 94 66 -67 -122 58 114 -164 263 67 -191 -89 104 -243 99 6 -25 53 -111
4832 -111 -204 -307 -46 -108 124 109 -139 -100 289 216 -80 -17 -221 89 -58 -76 23 -322 -120 -117 -230 -80 84
4855 84 -51 208 -48 -130 -63 -130 -147 -103 -15 -43 -17 -74 -33 -57 -47 8 -41 254 125 -23 28 256 -63 52 -57
4880 -57 110 35 -15 126 114 -120 46 -127 -136 108 -57 -377 -257 120 -213 -34 -203 81 -148 9 96 114 -31
4903 -31 74 222 -56 -86 51 42 271 38 -100 2 -101 116 224 -205 -133 53 -227 -255 115 -93 -45 8 -71
4926 -71 26 165 -196 -130 -173 -20 207 -167 -10 119 120 -48 -25 -29 -8 -73 29 156 -3 -168 149 51 -72 -125
4950 -125 -56 -233 8 -7 -19 67 -142 61 -305 63 -207 -74 22 171 7 238 -87 -79 -211 -40 88 -50
4972 -50 6 -65 168 115 -92 19 130 -106 254 -34 -38 -95 -217 -201 -16 42 15 -71 -107 52 -20 98 85 -170 -223
4997 -223 172 -202 138 86 -64 9 6 -86 63 88 32 96 8 -139 -108 -285 -46 103 20 167 -65 -99 50 -87
5021 -87 137 9 -119 -54 74 -73 16 -13 21 91 19 -120 166 151 169 400 -9 -58 -114 -137 94 -92 161 -118
5045 -118 112 13 -114 -113 0 200 -102 -230 -51 39 -32 3 -115 -2 -206 -148 -22 2 10 69 -124 54 38 41 -12
5070 -12 131 197 132 220 -151 -321 144 12 54 -170 50 -60 -86 -284 153 6 110 29 -96 -84 -55 30 16 214
5094 214 -117 65 -30 27 83 -109 54 -10 135 50 -71 -4 94 211 278 131 -242 53 85 -293 22 134 12
5117 12 85 -168 155 34 65 -135 -83 10 26 24 4 -243 56 29 -111 -81 -275 -53 107 132 -19 93 -63 -216
5141 -216 41 3 -23 55 -96 167 92 157 -56 -31 -76 54 120 -35 -118 -150 -25 20 65 -69 -14 216 93 143 -40
5166 -40 -78 -11 193 -95 156 -49 260 107 -25 77 251 91 -174 65 -156 -36 -234 86 201 92 84 54
5188 54 107 74 69 20 18 -25 73 -47 32 -20 -85 388 26 -24 226 -32 118 -192 50 19 178 61 -2 -23 -113 127
5214 127 189 65 90 -173 158 75 -104 265 121 131 -177 -161 -10 153 113 -46 11 183 68 -7 116 94 45
5237 45 23 114 302 18 -207 -78 101 -148 -236 -99 32 26 -13 -215 -167 -306 -1 117 -176 -25 -86 -58 -37 71
5261 71 10 167 -7 -78 36 -66 -50 6 -76 5 -90 -141 125 -100 47 14 170 -121 103 92 -87 -28 -32 -222 -233
5286 -233 254 58 76 66 -88 -31 -91 21 -90 -116 -289 33 71 167 7 27 -147 79 37 -32 0 111 16 47
5310 47 -85 -40 -21 125 -393 -4 273 -54 117 72 -68 117 188 -91 -129 145 -345 -104 79 89 -4 -175 88
5333 88 42 -150 -201 -215 288 4 42 27 49 -19 -120 -112 29 174 -41 -12 -143 257 74 133 -55 90 -24 -19 218
5358 218 -121 78 -221 336 48 -128 -44 161 70 189 -123 24 -97 -47 70 300 -183 -145 -118 -125 -26 -26 49 -94
5382 -94 -98 38 145 -39 -233 30 129 237 -25 112 -8 -105 -261 -24 -93 46 -95 -18 37 210 194 -63 -77
5405 -77 -88 111 51 -38 49 -115 -59 -248 -181 -5 131 -91 5 92 117 -82 -123 48 -278 310 226 236 64 171
5429 171 -76 -64 -41 1 -15 -14 75 73 -66 159 -188 20 73 -11 -26 -186 -62 -235 -231 111 138 -254 124 6 221
5454 221 44 -170 -53 -37 -133 229 -4 140 19 135 -13 142 171 -103 -15 96 -54 -142 73 -18 57 144 64
5477 64 -33 -171 96 -71 -133 -152 -60 -221 -164 -140 84 -74 142 52 -89 301 103 191 -1 136 -105 -12 294
5500 294 101 38 305 174 3 -1 37 48 -24 -291 -86 121 89 -11 -123 249 -105 -61 -154 108 105 140 -190 201
5524 201 6 161 200 92 -21 -38 79 -176 -56 250 -154 -258 -102 126 22 31 173 80 21 -20 144 -86
5546 -86 77 235 -87 -106 -9 -77 -1 -138 -174 -101 171 -117 -117 181 49 147 -124 -91 -41 -123 181 -153 -199 171 15
5571 15 -140 -158 106 -356 -57 -71 -246 -4 74 216 -71 48 -199 65 166 -22 -48 -160 -126 -65 -269 -94
5593 -94 167 159 -90 132 121 -252 43 100 44 0 -92 -138 -9 -190 225 186 202 210 15 7 146 -70 -235 -72 130
5618 130 23 -89 32 -78 114 109 -27 -163 -12 -92 -12 -42 -170 64 112 -249 -190 -26 -27 -29 -167 -76 -61 -53 13
5643 13 243 49 -124 9 317 14 -48 -65 227 -113 181 36 -31 145 -121 -212 -22 33 -45 127 189 -56 52
5666 52 -41 -80 -77 -153 -68 51 -135 14 30 106 -76 -115 -315 -66 55 -155 -79 -31 103 1 50 -59 104 -3
5690 -3 133 104 181 71 -10 -258 -164 37 -399 67 -200 -114 -30 121 -95 74 -7 173 76 -38 27 158 17 12
5714 12 205 -57 -127 24 -301 -29 1 -264 105 14 -108 -11 36 132 0 -59 -7 -93 -263 -134 -203 85 15 -56
5738 -56 -190 31 146 22 -6 -44 -84 2 199 192 51 167 8 46 91 110 48 150 -47 -24 202 10 -32 -79 124
5763 124 65 -123 -30 -204 98 -262 79 -48 56 56 348 -89 52 259 -72 181 -57 285 108 107 -59 -12
5785 -12 55 -50 -75 244 78 59 61 82 -155 -76 11 -329 -209 -149 -103 -80 134 82 8 64 -40 94 48 119 124 -242
5811 -242 162 181 87 38 -22 146 152 -16 143 153 -276 -97 96 126 114 72 -159 -214 305 108 -35 135 1 -109
5835 -109 -94 -18 -127 -88 -253 41 337 270 165 120 -95 226 13 45 -283 -1 192 89 -52 -35 -358 -76
5857 -76 260 -65 -138 71 -32 -173 -45 -2 -269 27 139 -76 -185 28 -64 142 0 -54 -212 -59 53 73
5879 73 -42 50 193 -16 128 -70 -80 -41 -132 26 -98 -6 129 202 9 16 -179 87 55 -225 102 -6 121
5902 121 15 31 166 -54 38 -30 128 34 -106 -59 106 -120 -26 37 211 -92 -25 110 -23 -141 -102 56 74
5925 74 -214 -69 -38 55 -92 -189 155 -79 27 -33 -104 108 -115 -66 -329 77 -8 -41 2 2 -195 -134 116 19 173
5950 173 -186 -193 19 -59 183 165 -14 170 29 -52 3 -154 87 218 41 -81 82 -63 207 -85 -111 92
5972 92 -33 -45 52 17 59 51 73 102 94 -44 24 38 36 -103 124 175 -171 71 -310 207 153 -151 -129 -22 265 52
5998 52 186 -136 -130 -128 -143 197 97 235 113 72 94 -74 -249 195 -81 223 87 -63 56 100 -23 -56 20 55
6022 55 -126 -180 -84 -290 -198 -55 -186 39 -70 -62 35 -127 -267 -165 -63 105 -97 -35 39 6 125 204 76 -110
6046 -110 255 -2 43 -130 147 48 -71 -45 -5 -102 -137 168 90 56 121 1 -66 -39 43 -106 35 -49 30 -291 -138
6071 -138 163 -6 -14 15 52 -233 111 184 32 70 107 -66 105 183 -101 117 11 31 192 72 -85 163 -44
6094 -44 137 72 30 -60 48 112 -148 215 -68 100 215 106 -98 6 197 125 -20 -176 -127 -164 -126 -81 -105 91
6118 91 -67 37 127 -91 -137 -44 62 86 -186 -188 183 -134 -10 72 177 107 106 -118 -146 182 -142 67 -2 -79 120
6143 120 76 -60 148 159 34 -153 31 -183 52 -121 -40 -251 -39 -46 132 -67 -63 -71 -326 112 -150 -214 -50
6166 -50 -17 11 207 -145 -42 11 261 -95 111 9 108 36 -80 14 -12 -138 -35 -98 16 189 -46 -2 0 35
6190 35 -98 -119 123 50 137 12 -70 -91 -176 -87 125 29 143 59 192 -95 -195 -4 -18 -84 -154 -323 52 -15 -295
6215 -295 17 -43 66 57 -8 193 170 -140 135 -140 -67 -62 -65 154 75 -163 -237 -48 -101 31 -40 58 -106 257 -133
6240 -133 67 61 17 56 -65 -142 -85 -134 179 42 -171 -191 33 -80 -105 -82 -143 41 -70 -126 -77 82 -201 58
6264 58 77 -36 -146 -96 -27 -38 157 -1 5 219 27 -24 119 -170 -37 -78 140 66 -25 -153 99 10 -22 25 -23
6289 -23 227 -49 177 49 26 111 78 159 -127 157 21 184 -119 -56 -70 58 14 -41 -75 80 99 50 -230 -203
6313 -203 104 43 34 0 -149 -159 -78 -225 96 -93 -45 107 115 179 39 -148 299 -110 302 226 11 62 -115 -57
6337 -57 -84 -33 196 2 -151 41 -21 -153 59 176 -17 22 90 167 37 27 -38 -59 -2 -204 117 -80 -153 132
6361 132 -166 15 -64 -187 -58 -120 62 127 -21 -18 146 207 177 179 49 11 -122 -194 -73 -29 82 1 -23 -63 -266
6386 -266 79 133 -173 -163 89 -281 -143 -66 -71 -226 165 -184 -184 -81 -164 -136 141 7 -155 -33 186 331 12
6409 12 -56 -130 -143 9 -219 -377 -122 -180 98 96 94 -239 -5 138 93 83 -108 -115 -22 -194 60 352 -145 -211 -102
6434 -102 104 64 -50 29 -181 -144 -272 128 -184 202 -112 -55 -96 -125 -136 81 9 -146 72 -53 222 45 175
6457 175 139 38 199 69 62 -62 -71 40 -181 95 -48 -99 143 -24 132 133 11 -199 19 -288 -227 39 112
6480 112 218 43 -4 -23 -76 -288 112 -58 128 -500 -231 -136 34 -167 226 -329 -80 47 96 -293 145 28
6502 28 -88 -104 -100 290 0 383 -75 59 -65 37 -136 198 88 -122 144 61 87 -43 129 273 -202 166
6524 166 95 -125 116 47 -71 -58 -93 13 -160 -67 -150 49 189 -133 215 -205 -95 -75 330 29 -62 60 -93
6547 -93 -146 106 -118 -31 -124 -72 105 44 5 24 62 28 -164 -263 -48 -60 72 42 109 13 20 82 38 -132 58 -63
6573 -63 -126 125 47 -93 52 -58 34 221 -3 -228 236 -125 -8 -61 229 42 -290 115 -44 -226 -23 8
6595 8 55 150 155 -161 49 -221 -35 65 110 -105 34 -76 -60 59 -203 -73 -117 65 269 -114 -111 -191 -41 177
6619 177 -30 260 -25 -240 65 140 -53 -157 -107 242 93 -298 4 -145 -28 117 -90 -189 0 -339 -262
6640 -262 159 -95 -139 34 132 0 84 83 -238 -113 142 182 107 53 -50 2 103 -63 91 -158 168 37 70
6663 70 -17 112 -142 -57 -115 261 -166 -21 92 -123 -92 -124 -15 -73 102 -132 175 -63 65 -91 174 -113
6685 -113 -134 -158 -182 61 -15 -137 142 -3 -23 -152 -91 5 -36 161 52 -204 -5 -160 76 341 63 8 64
6708 64 127 -70 149 14 100 -51 -35 15 -76 -143 -346 312 -79 -26 -134 -28 328 39 -215 6 -69 -66 -329 -253
6732 -253 -53 -171 -68 74 27 -124 90 -170 -109 -197 200 70 -30 -40 -26 -2 231 -58 -13 104 -314 -87
6754 -87 -105 0 4 55 168 -63 63 153 8 -152 -35 -164 267 -39 59 -23 -55 88 -87 66 74 -112 -154 51
6778 51 -93 34 -14 -226 -136 -79 -31 -80 37 48 77 71 -21 -4 90 16 -165 -266 106 -35 -23 -158 27 11 -138
6803 -138 74 159 161 165 35 193 52 -73 121 36 -201 142 76 -102 -254 -248 242 -27 117 188 60 87 -161 114
6827 114 103 -91 -110 -156 149 27 -248 -285 -27 181 164 -246 -85 -56 53 -99 51 205 62 40 -131 39
6849 39 14 30 -229 -85 50 -148 232 134 -272 -31 -24 188 66 -43 -5 -215 9 -235 16 -107 97 -191
6871 -191 2 -35 100 -206 155 118 140 250 330 39 -273 61 -143 80 114 15 230 -110 -9 206 71 -132
6893 -132 -96 -41 150 34 49 -83 -38 48 -40 32 -121 19 26 164 77 74 44 107 45 -28 114 25 174 149 -150 112
6919 112 -114 37 -8 15 12 84 69 -175 148 286 12 -28 -32 -209 -35 21 116 65 127 -27 -37 -72 31 -169 -55
6944 -55 -2 -127 88 -5 68 10 -285 -201 -158 -180 20 -133 29 -50 75 -74 163 -29 129 -167 1 -20 34 -14
6968 -14 -117 -18 -214 100 -38 -51 -34 19 -106 153 41 34 -55 -31 35 287 27 30 132 72 -75 105 -55 -30 100
6993 100 -119 14 -288 107 -38 -42 -174 14 244 -10 -182 52 116 287 -139 25 -23 189 -60 76 -120
7014 -120 -348 -63 55 102 -281 -88 141 167 -205 47 -169 -131 29 -43 87 -26 -4 -30 -143 -93 67 -71
7036 -71 141 102 -76 78 -13 -34 -168 55 -150 -200 47 50 126 27 87 -45 -131 -71 13 20 175 -112 79 -44 119
7061 119 -187 47 -121 9 -18 -68 -9 109 -34 -107 -16 73 56 -18 -139 -305 -69 -79 37 -90 -111 122 144 -108
7085 -108 -128 -18 99 17 -79 176 -223 -109 82 64 -50 -410 -102 -308 45 -215 26 -59 120 -109 214 -107
7107 -107 -164 332 -190 -20 63 -83 -66 106 -105 256 235 11 80 -236 -280 -188 64 -129 -17 27 82 -49 147
7130 147 148 -134 13 -187 -103 -83 22 68 34 368 -18 22 112 83 -80 -183 26 -45 -16 53 42 -141 9 -132
7154 -132 -148 -17 -202 -3 160 -70 -100 178 121 95 61 74 49 97 7 -169 36 -22 -49 -94 104 10 78 -90 -80
7179 -80 71 180 94 -11 115 -13 48 -42 33 92 -1 -91 45 -25 -191 113 55 114 -57 -148 -23 -9 -147 -124 -4
7204 -4 110 139 -97 200 -125 13 -41 -248 152 114 -27 -19 295 108 287 -292 -72 33 -89 -191 -1 290
7226 290 128 110 -193 88 -191 37 -177 51 186 48 -90 -188 136 190 -43 -26 110 87 139 7 -58 28 -235
7249 -235 2 -23 147 -50 13 -135 97 46 -91 -8 -110 82 217 124 164 333 -78 -275 69 162 186 -85 3
7272 3 165 -29 58 -212 234 -138 7 -150 8 195 -303 290 -192 245 83 -213 56 -212 -137 -8 -61 126
7294 126 -167 -17 187 -19 -113 -40 33 2 77 -203 -230 -257 -89 -116 100 33 107 162 -101 -152 -171 -166 -30 115 160
7319 160 -194 -184 -7 102 115 -109 -190 -8 310 -165 62 151 214 1 110 -267 209 77 38 39 67 -67 -109
7342 -109 -158 -57 43 -159 74 -34 -34 143 139 213 -123 -297 -15 -38 -63 -43 -50 190 112 108 222 -59 131 -191 -89
7367 -89 154 20 -59 168 206 -99 -371 48 -178 -30 -235 165 -18 -113 37 -67 221 -68 141 301 31
7388 31 -124 94 -33 -36 -103 87 -64 222 86 0 -112 -100 -280 85 105 -36 93 -72 96 -257 16 34 96
7411 96 42 103 -5 -86 -73 172 -135 106 -77 119 198 175 -137 -56 72 108 -96 -245 70 195 -239 32 -166
7434 -166 -6 -153 -269 -42 -122 134 -200 -164 68 56 -262 -92 203 -417 27 -107 5 112 -34 -32 -96 -306
7456 -306 266 -53 164 -50 150 -25 45 46 10 81 148 14 -66 33 65 127 -76 86 -94 -150 82 -293 -187 -89
7480 -89 151 -141 99 -57 -174 73 -23 398 -44 173 110 31 -74 179 -36 67 -57 -25 228 20 -195 -305
7502 -305 -55 197 102 69 10 -88 -39 11 -22 86 224 31 -13 75 -4 -100 -204 -74 94 -421 -156 -28 227 133
7526 133 70 8 118 -56 -45 71 -93 -151 -143 24 -4 24 99 -154 -189 40 14 -94 115 -108 118 -34 109 -203
7550 -203 -59 -150 56 103 -49 -44 -37 -121 129 44 89 -12 51 -77 -41 -73 255 -26 61 108 -55 -9 72 183 -10
7575 -10 211 67 22 48 -154 -103 -86 -105 75 124 -121 -72 37 -252 -130 42 -20 64 -92 -76 -111 -60 228 -84
7599 -84 -169 0 -219 -82 115 -29 -96 -10 -91 80 -216 -22 -169 231 73 40 -85 51 179 0 77 170 195
7622 195 -148 -303 163 -56 -97 0 -206 76 -97 46 -4 147 -38 109 -30 -29 34 106 -9 -134 -10 63 -266
7645 -266 -19 -157 235 -101 44 177 9 -252 39 28 -69 86 -79 -54 -240 87 94 -37 -11 92 109 19 -83
7668 -83 -175 -62 158 -64 -207 -110 -67 96 26 -209 -78 84 66 37 227 52 -72 -79 7 -49 101 117 -88 -74
7692 -74 -47 261 -89 -347 1 -17 -98 17 -125 -189 -4 98 149 -16 -249 66 15 11 -74 -192 122 -40 -56 -34
7716 -34 76 -80 -69 226 83 97 -82 -100 -127 62 8 161 18 102 14 -80 -101 -303 -193 51 -138 212 -49
7739 -49 131 64 -59 -73 -136 222 90 -149 68 91 -34 -38 -86 30 217 -51 67 36 133 -76 334 90 -102
7762 -102 -46 -42 -17 -159 -224 -32 -193 -27 172 -135 148 93 146 34 -23 143 -80 12 138 155 120 14 46 -304
7786 -304 -67 52 187 189 27 -139 -171 16 -231 -61 106 20 -120 -23 -106 24 15 105 54 -217 -130 65 -134 119
7810 119 113 -7 -286 -121 -26 154 -117 -65 -16 -190 170 -45 -252 68 164 82 239 -171 74 151 155 -125 19
7833 19 -349 79 200 81 -134 -98 126 182 -58 180 11 210 -175 -31 19 161 -47 -196 90 -171 -92 212
7855 212 86 -64 -32 34 -57 -55 -98 -46 -27 93 -162 -76 -32 -98 -206 73 -24 -97 206 -257 -25 -94 -111 -6 129
7880 129 -30 -46 -84 208 -113 258 114 4 229 93 64 69 -198 25 93 -91 -279 -246 -181 -104 56 4 -39 29
7904 29 137 26 18 -167 136 -116 15 73 -48 -61 -23 -137 -3 16 46 -7 -81 -212 98 19 54 208 79 -59
7928 -59 104 65 39 -59 102 38 83 46 -192 141 32 -38 162 -162 -69 237 344 85 -5 -4 61 -113 254 39
7952 39 -170 -39 -21 -89 63 -16 -15 -49 25 -104 17 309 -71 123 63 22 115 17 27 121 -45 -24 125 63 28 138
7978 138 218 203 -208 -237 -120 -252 236 -253 -10 -167 -28 -7 -6 17 -36 69 -145 117 -36 144 -17 -232 -44
8001 -44 40 233 -106 14 -57 -70 51 -106 -192 -60 86 15 107 33 283 -109 -68 156 47 225 28 37 120 68
8025 68 77 -15 -165 14 75 -140 -101 57 176 -189 211 -62 65 -66 102 119 -110 -48 79 18 35 -31 102 -50
8049 -50 64 35 59 207 181 153 -162 -34 53 -20 -102 198 -170 -121 -192 153 -141 -155 -92 -227 -74 37 13 110 -90
8074 -90 89 -89 -111 -407 50 -20 -96 -52 -113 17 -18 57 38 -85 78 -23 17 41 180 155 35 99 -22 17 -41
8099 -41 62 26 -182 97 59 -74 -100 -103 37 -124 15 225 48 22 149 170 8 -98 -85 51 -45 12 62 247
8123 247 68 -197 -84 2 -161 -139 35 -294 72 16 33 -8 -165 -219 -68 -37 163 -7 100 121 53 -16 -140
8146 -140 -7 21 17 40 146 -137 142 -149 -237 21 24 163 -8 41 -91 -294 -187 30 64 79 67 -70 -161 -34
8170 -34 114 82 -241 -186 -45 157 89 -88 40 44 85 99 151 -109 -66 67 171 63 -5 22 -70
8191g0
$$ Imaginary data points
##PAGE= N=2
##DATA TABLE= (X++(I..I)), XYDATA
0 0 0 0 0 0 0 0 0 0 0 0 0 0 0 0 2 -8 8 -8 8 -8 16 -16 16 -24 24 -32 32 -40 46 -49 57 -65 75 -85 95 -107 121
37 121 -134 150 -167 185 -206 228 -252 278 -307 338 -372 411 -453 500 -551 606 -670 743 -825
56 -825 918 -1028 1157 -1311 1497 -1734 2041 -2453 3042 -3950 5501 -8657 17538 -92904 -298836
71 -298836 25000 149269 -41422 -38090 64142 -32379 -37285 53471 -16999 -101712 21260
82 21260 100138 28870 9564 -10219 -69890 -12289 56939 9370 -13352 46941 -150 -74435
94 -74435 2722 28024 -51947 -414 78287 -19302 -71150 39997 10453 -92932 17893 112973
106 112973 -15611 -73510 43996 32108 -70690 -8992 64160 19123 -7281 7560 -15057
117 -15057 -30287 8494 18089 1185 7463 1031 -1711 6586 -25699 -51443 11921 63719 -1450
130 -1450 -39591 11373 9167 -40681 -13092 39070 4098 -16106 27576 6320 -39131 -1184
142 -1184 34364 -7632 -21861 33709 32144 -23659 -30283 168 15971 14110 6767 -7798 -10498
155 -10498 -2054 -2022 -895 -4109 -8880 1490 15915 4007 -27328 -17246 16696 8252 -8338 7393
169 7393 14383 -15798 -19360 16257 13196 -7085 7836 11208 -11558 -977 21727 -10794 -29724
182 -29724 16359 35726 -4703 -24297 -3555 3469 327 3408 -7027 -7760 7830 3348 -11941
195 -11941 -6322 2380 -6930 2157 17647 -6458 -18661 10580 13154 -15205 -3077 22125 27
208 27 -11146 12837 6686 -14893 3527 15993 -8160 -6861 13049 -2424 -12452 5120 5476
221 5476 -8609 -3218 3274 -6017 -1036 2934 -11538 -3415 13901 -1085 -14122 4732 9100 -8409
235 -8409 -525 10974 -3924 -5050 13099 4986 -11089 4989 12050 -6164 -4464 8813 2601
248 2601 -6255 -1145 776 -1579 2856 -1659 -9154 907 3835 -6153 -3461 1077 -5712 -1739 9362
263 9362 -1892 -11718 3787 10722 -3876 -4546 6334 319 -884 7751 1871 -4645 2836 7015
277 7015 793 -2479 579 -314 1073 1025 -4590 -1865 3909 -3777 -6250 3733 812 -9352 -1490 4896
293 4896 -3436 -4516 3893 396 -5362 4623 5450 -5143 -608 6334 1542 -726 2373 1960 722
308 722 3054 1364 -1818 2696 1412 -4635 1024 3166 -5817 -3104 4271 -2742 -5895 2491 732
323 732 -7246 -1609 5005 -3826 -5447 4145 1045 -2351 2875 1366 -1769 2655 4024 -626 89 3150
339 3150 1287 1219 3896 -1633 -2616 5515 1647 -6444 -20 3010 -3929 -2926 2494 -2107 -5554 2148
355 2148 1155 -5992 -851 2733 -3606 -1844 3584 -219 -1273 2647 963 -411 4264 3111 -3044
370 -3044 1481 5463 -1054 -352 4505 -1535 -2621 4979 1523 -5346 -1767 1974 -2868 -2493 2542 -3199
386 -3199 -5629 2389 1025 -4440 -1088 753 -2143 404 2991 -1327 -2288 3024 2603 -94 3240 2129
402 2129 -2303 2283 4145 -1507 -583 3600 518 -2075 1206 662 -3022 -902 -156 -2905 85 1465
418 1465 -4030 -3894 467 -546 -929 1089 -776 -2858 1157 2749 -1415 -297 2384 343 2712 4671
434 4671 -1562 -3318 3510 3534 -792 1932 2957 -3685 -3245 2944 -191 -2370 1691 -893 -3994 1067
450 1067 -104 -7197 -2324 4836 -370 -2486 3709 -1610 -7922 1092 6112 558 1258 2954 -2390
465 -2390 -796 5464 931 -3797 3530 5033 -1501 1217 1934 -7109 -4125 7545 4768 -4384 -4347 -1972
481 -1972 -2504 1444 1304 -5853 -2974 5157 -278 -5425 216 1011 -2238 3079 6061 -1902 -4082 1957
497 1957 1488 611 4864 2866 -1456 1912 579 -4862 389 5661 -645 -4160 2261 2552 -4061 -3379
513 -3379 -1949 -2840 1589 3609 -2186 -3760 -1350 -2040 -1354 3883 2508 -5218 -2054 7591 4300 -3836
529 -3836 -3347 1067 3917 4905 1535 -2841 -1645 3184 2670 -1075 -1190 -2199 -2241 3220 3946 -3537 -6964
546 -6964 -773 3653 -1685 -5121 -259 2022 -1209 -1142 -86 166 609 1123 -566 -210 4483 2546 -3476
563 -3476 864 5494 -1141 -983 5467 -457 -6721 2280 7664 -2021 -5359 693 -1327 -3054 3293
578 3293 -429 -6325 1559 4743 -4342 -4411 1925 -3370 -4805 8400 6824 -8249 -3135 7079 -719
593 -719 -2901 5090 1044 -2170 6740 4998 -7686 -2279 7052 -2275 -3506 7493 493 -8594 2406
608 2406 3777 -8042 -3643 6388 -786 -5626 2707 49 -6196 2273 2455 -6230 853 8625 -1762
623 -1762 -6224 4062 3378 -3021 3725 5490 -4563 -1931 6303 -751 -3493 4719 1745 -4515 1844
638 1844 2702 -6626 -4151 5349 554 -3761 1651 -1304 -6120 726 2617 -2497 343 3504 -1628
653 -1628 -2460 2788 -219 -2938 4047 5384 -1475 -166 3241 -1591 -2510 3418 2768 -974 1078 1267
669 1267 -3488 -2060 2457 -1485 -3424 1038 737 -2594 -1385 -654 -2245 -375 2118 -655 -1807 983
685 983 342 -902 1644 1682 -147 1071 2331 30 -632 1958 1888 -529 338 1827 -345 -1714 -122
702 -122 667 -1187 -1164 670 -826 -3347 -1059 442 -2087 -1320 1147 -187 -1291 84 638 -1089 -68
719 -68 1941 394 487 2438 930 -594 1055 1657 259 650 1749 -278 -1030 1595 -505 -2854 920
736 920 1155 -2846 -1505 1400 -2193 -3323 990 766 -3131 240 2119 -2388 -1130 2366 -155 -1156
752 -1156 2107 1860 -588 1188 2202 -515 768 2659 -66 -629 2051 -169 -1499 955 564 -1610
768 -1610 -368 1005 -1931 -2782 879 -249 -3071 -47 671 -1906 -918 1444 -546 -919 1616 816
784 816 -798 1247 1570 -351 762 2059 -80 840 1875 -525 -560 1703 117 -1722 140 685 -1709
801 -1709 -922 836 -1590 -1887 527 -849 -2029 -178 11 -1118 -130 697 -191 -239 1511 506 -493
818 -493 1679 939 -208 1573 1334 -393 769 1511 -257 -547 931 39 -1685 456 438 -2109 -724
835 -724 248 -1196 -1221 -214 -1027 -1420 204 108 -1025 1 712 -413 610 1615 -592 276 1991 784
853 784 104 1561 1475 -182 566 1718 -55 -865 1138 -149 -1046 487 -533 -1626 -612 -436 -1187
870 -1187 -761 -334 -1224 -1299 443 3 -1368 516 637 -647 965 1268 -382 175 1638 901 125 1351
888 1351 1012 -934 643 1519 -408 -239 539 -710 -624 251 -954 -1609 -430 -99 -1424 -333 -81 -2165
906 -2165 -1027 1482 -328 -1230 921 397 -1055 610 1885 262 -9 1689 634 -420 1398 777
922 777 -634 1029 1144 -644 -669 -233 -920 -709 537 -39 -1091 -590 -986 -1836 243 144 -1661 -355
940 -355 1324 -219 -1304 115 569 111 1499 1772 96 106 293 148 1380 1641 -181 212 1337 -101
958 -101 -1702 37 775 -962 -389 884 -1629 -1814 -132 -1433 -1139 1536 605 -2232 -1211 985 -669
975 -669 -894 2214 1249 -795 957 1515 -596 80 982 792 1750 2357 -1111 -2315 1016 295 -1183 1240
993 1240 1786 -1845 -1718 66 -1324 -2456 11 1211 -389 -334 -585 -2638 -1002 1526 869 226 1268
1010 1268 829 -806 -630 929 903 1754 1804 173 89 -50 -1305 -624 1899 1319 -646 343 -10 -2651
1028 -2651 -2682 1115 1386 -208 -238 -913 -2388 -1073 -601 -358 1595 2042 53 -711 -407 -1067 -693 2564
1046 2564 3104 980 660 16 -1715 -593 1308 857 525 1792 1079 -2728 -2680 147 -590 -632 1921 947
1064 947 -2318 -2533 -1146 -721 -458 1235 1534 29 -355 -977 -1083 981 1563 1237 1646 1238 -343 -911
1082 -911 -166 1019 1270 1407 1601 -870 -2323 -1128 -266 -234 272 1138 -145 -2049 -1447 -633 -2018 -673
1100 -673 2864 1198 -1072 -428 134 -1710 -693 2464 2005 179 1191 742 -1535 -452 896 624
1116 624 1476 1988 410 -1729 -450 -638 -2061 641 2190 -1199 -1257 359 -2151 -2858 846 1717 -1529
1133 -1529 -88 1963 -1828 -2684 1896 1393 -955 2000 2541 -1422 -1550 1650 710 40 2313 1524 -1481
1150 -1481 -292 139 -1339 -88 1870 -1 -1206 147 -1306 -2942 -185 1466 -1092 -192 1652
1165 1652 -1452 -2574 684 987 -911 1122 2303 -278 -841 1250 494 -676 1525 1674 -140 354
1181 354 453 -565 -347 484 320 -373 29 -279 -1266 -382 -134 -1257 -215 236 -669 -1263 306 201 -939
1200 -939 -159 1283 -184 -388 749 634 -219 672 1168 820 373 363 623 197 -22 547 193 -82 -496
1219 -496 -442 -280 -666 -322 -241 -642 -500 -850 -693 -454 -305 -379 207 368 -287 -11 668 157 -454 961 1188
1240 1188 -263 438 1387 171 -315 704 635 -775 -224 786 -371 -954 248 -351 -1247 -514 -123 -770
1258 -770 -608 -142 -531 -700 25 -65 -684 702 595 -405 797 889 58 -38 1511 703 -407 772 1119
1277 1119 -719 133 1275 -401 -517 499 -190 -1021 -560 264 -823 -728 -113 -611 -698 176 -725 -445 426
1296 426 -190 -291 332 381 -166 287 1022 287 -346 987 990 -419 692 935 -230 -139 270 -126 -356 -33
1316 -33 81 -779 -442 -293 -1117 -646 117 -896 -529 -22 -691 -93 451 -67 -367 481 814 -217 148 1467
1336 1467 194 -91 817 680 -176 229 279 11 -65 107 -118 -415 30 -548 -793 194 -650 -935 -93 -166
1356 -166 -687 -110 9 -517 -732 452 406 -421 569 811 -33 452 773 395 297 794 688 215 148 394 2
1377 2 -1 121 -503 -324 -286 -862 -571 -45 -790 -539 -206 -603 -640 -259 -49 -242 -212 101 200 86 534 455 440
1400 440 890 323 498 612 121 259 349 582 -394 -110 690 -344 -935 -7 -460 -882 19 -193 -539 -550
1420 -550 -36 -615 -913 415 -42 -653 541 650 -497 255 940 194 200 1099 482 -354 809 747 -826
1439 -826 263 1058 -529 -408 1088 -278 -1315 -66 445 -993 -541 441 -976 -850 417 -114 -807
1456 -807 439 77 -1068 -122 1007 -154 -33 1221 541 -641 831 498 -350 806 1156 -205 -97
1473 -97 895 -530 -945 391 477 -1036 -328 375 -1362 -1022 260 -865 -870 528 -158 -763 185 315 -746
1492 -746 181 1330 25 -509 1142 504 -454 902 1111 -356 -26 859 -98 -610 1109 213 -1212 4
1510 4 264 -1443 -599 565 -432 -775 375 -152 -1341 -41 449 -796 69 861 -106 -250 905 6
1528 6 -456 770 1139 26 419 1473 -66 -445 709 554 -647 182 376 -297 -511 80 -512 -990 -102
1547 -102 -242 -960 -329 130 -776 -329 90 -50 -270 110 108 224 456 988 359 386 507 20 -66 979 475
1568 475 370 312 529 -186 -781 -194 -254 -440 51 334 -439 -745 -749 -809 -519 -45 243 144 203 5 -698 -180
1590 -180 420 -51 594 937 325 35 331 288 -79 105 1001 346 -227 650 -226 -669 -164 321 -535 -365
1610 -365 -176 -745 -898 -195 96 -565 -24 20 -763 -355 229 316 337 995 737 -510 -21 536 -405 264 1785
1631 1785 582 -134 334 75 -1252 -257 1049 124 -368 615 -445 -1795 -579 199 -765 -112 1025
1648 1025 -101 -901 -148 -148 -615 604 1230 -177 -84 957 -268 -292 1444 895 -87 693 468 -853 -463
1667 -463 936 -336 -550 547 75 -1385 -320 42 -514 -398 351 -423 -1245 -124 -252 -720 313 723
1685 723 -31 233 546 -404 -366 641 673 314 874 932 -361 -156 542 -258 60 917 19 -580 -151 -302
1705 -302 -867 -565 270 -181 -606 37 -466 -815 84 158 -240 442 205 -132 -89 468 373 299 651 610 -229 492
1727 492 463 30 217 740 14 -362 81 -11 -712 -166 232 -359 -368 -188 -412 -515 -124 -207 -34 7 -39 -430
1749 -430 -37 68 -186 131 657 384 22 390 300 176 252 481 260 15 344 177 -136 -17 -304 -115 194
1770 194 -348 -378 -387 -457 -309 -218 -248 -398 -62 14 -270 -90 261 271 -13 326 353 105 333 588 567 93 415
1793 415 291 178 221 89 -94 171 -228 -414 -70 -76 -673 -714 -141 -217 -630 -403 -51 -687 51 265 -213 54
1815 54 227 57 47 451 330 330 195 218 250 323 194 99 -25 308 -107 -226 99 -48 -548 -241 -139 -468 -662
1838 -662 -133 -260 -534 -151 66 -219 -295 38 -59 -120 180 293 85 505 420 -54 393 188 57 284 512
1859 512 -167 -132 153 -158 -136 0 95 -633 -211 -191 -599 -509 -24 -279 -469 -65 6 -279 -161 77 -17 126
1881 126 179 229 228 529 402 -56 793 157 121 333 -29 -236 -7 -32 -81 -488 -275 -235 -575 -360 -352 -188 -586
1904 -586 -153 -370 -296 -300 -22 93 26 252 101 183 306 86 488 557 222 350 463 83 211 -19 303 219
1926 219 83 49 -31 -90 -247 -360 -228 -59 -65 -268 -360 -247 -446 -122 51 -93 220 376 62 -33 522 242
1948 242 -170 659 587 367 -61 -138 232 137 497 396 75 -197 -165 -509 -332 -47 -54 19 -143 -556 -774 -346
1970 -346 -84 -57 87 497 -252 -184 -16 67 146 399 735 261 186 22 20 95 565 434 583 180 -43 -352 -310
1993 -310 -349 -70 360 424 -300 -557 -336 -717 -426 205 134 -294 -178 -470 -383 -206 474 333 360 552 289 -641
2015 -641 60 367 177 750 776 145 -549 -336 -540 -67 405 573 -435 -632 -466 -1149 -788 287 395 62
2035 62 14 -247 -833 -848 316 355 403 982 199 -469 -35 70 -75 597 905 269 -329 -95 -175 -452 429 407
2057 407 -160 25 -131 -1266 -576 25 -216 0 134 -79 -852 -565 9 -74 211 742 156 -343 -56 -315
2077 -315 -30 796 1138 707 470 122 -450 -713 460 250 250 633 -34 -841 -752 -203 -449 -109 664 -19 -605
2098 -605 -359 -495 -652 -32 444 386 -9 22 14 -486 251 610 234 440 507 -189 -452 502 155 276 615 341
2120 341 -666 -744 -56 -249 -292 437 131 -858 -292 -248 -788 -437 347 292 -130 -89 -109 -919 -174 664 365 403
2142 403 633 261 -122 -84 79 216 270 698 196 -367 117 -212 -525 207 120 -300 -490 -50 -451 -688 -74
2163 -74 136 -606 -186 12 -371 -96 84 522 46 145 258 42 70 445 356 428 480 68 -162 -94 -30 219 268
2186 268 384 -217 -442 -148 -364 -936 -176 172 -608 -272 -142 -518 -334 131 331 -40 54 207 -236 117
2206 117 399 185 21 517 179 -255 382 138 -192 328 185 -179 -318 158 -123 -541 -151 74 -566 -400
2226 -400 -118 -322 -390 310 157 -654 83 231 -55 -208 581 408 26 388 602 -171 143 470 332 -89
2246 -89 360 56 -327 302 -75 -221 40 98 -596 -374 152 -44 -790 -30 88 -712 -13 34 -179 -267 323
2267 323 300 -31 446 361 77 117 313 -84 290 293 175 30 -61 -33 -185 23 438 -337 -234 -63 -393 -345 -103
2290 -103 -247 -311 -140 29 -129 -132 243 234 -46 238 286 31 150 116 364 454 153 377 279 15 46 167 90 -87
2314 -87 -93 43 -92 -88 -289 -208 -78 -113 -75 -262 -372 -364 -18 -148 148 -95 -136 87 88 -21 114 650 142 189 478
2339 478 318 -6 92 378 223 146 178 -133 -168 56 -51 -277 -251 -295 -10 -354 14 -81 -242 47 -241 25
2361 25 76 -110 94 227 155 85 94 334 302 85 377 358 60 190 -31 -58 239 247 -197 -163 -210 -82 -245 -222 -330
2386 -330 -300 -330 -239 -259 83 -59 -89 9 253 -58 -24 227 -47 240 -27 470 215 112 298 211 111 84 223
2409 223 67 146 21 -490 -245 0 -305 -134 13 -99 -382 -146 90 -395 41 249 3 51 214 185 -68
2430 -68 122 332 -195 277 605 -79 199 204 3 -123 100 178 -88 -196 26 -328 -154 27 -105 -380 -10
2451 -10 -168 -472 -314 40 -341 179 199 150 -255 62 173 -265 22 381 32 252 310 -83 -168 311 398 -273
2473 -273 183 472 -427 -170 -206 -261 -24 -124 57 -561 -167 -217 -326 -254 416 -86 -28 165 2 -238 208 323
2495 323 224 413 524 -238 -248 277 248 97 346 572 -187 -336 80 -185 -102 326 283 -154 -350 -233 -623 -464
2517 -464 237 366 -122 -63 -129 -384 -193 165 -30 369 603 406 2 -26 91 158 82 456 430 -58 118 -148
2539 -148 -299 82 287 -23 -183 137 -648 -729 -222 166 -20 -18 -34 -422 -462 -3 -182 89 546 266 49 -67
2561 -67 53 -275 258 508 327 -46 118 -119 -627 -3 372 201 171 122 -523 -601 -195 -3 2 460 512 -461
2583 -461 -603 -255 -109 -193 600 645 -234 -227 260 -355 -170 800 258 -31 443 -50 -504 -13 379 95 -15
2604 -15 592 -18 -975 -264 157 -415 44 392 -433 -612 -66 -40 -586 192 507 -303 -156 346 -190 -463 504
2625 504 357 29 395 888 -297 -275 700 22 -3 643 428 -598 -111 98 -726 -209 214 130 -460 96
2645 96 -92 -760 -146 555 -285 -258 326 62 -398 181 399 -169 220 541 184 -338 427 404 -206 532 460
2666 460 -253 -142 96 -118 -389 386 88 -353 -150 -17 -512 -257 20 10 56 119 -66 -33 58 208 12 165
2688 165 540 198 -92 291 116 179 -34 290 223 165 113 80 -45 73 -174 -221 -308 55 -338 -346 91 -209 -138
2711 -138 -109 -9 -218 150 168 -213 -169 60 -27 185 163 137 -19 161 124 -44 154 211 70 -5 -52 171 -71
2734 -71 -258 -155 48 -165 -250 -54 -230 -247 -36 -369 -233 312 -79 -233 -2 53 -168 241 111 221 185 53
2756 53 356 -295 278 42 285 236 255 -126 82 255 -45 -294 -354 -9 -91 -66 36 10 -297 106 -24 -322
2778 -322 -34 165 -228 120 -13 -55 -76 101 253 -46 82 153 316 206 305 132 135 -143 119 -48 -109 113
2800 113 -25 -183 -209 -91 -135 -24 106 -95 -274 -272 37 -304 -158 11 -102 21 222 221 -74 276 124 107
2822 107 305 269 183 313 -58 104 22 -40 -16 -314 198 -201 -107 -62 -172 -198 -122 40 14 -34 -186 -195 -273 -39 23
2847 23 -33 137 119 120 332 67 151 8 197 291 -121 -50 22 29 -90 67 -328 133 96 -186 -235 -221 -164 -178 145
2872 145 66 -383 -137 50 205 -84 120 -136 184 176 0 78 285 60 122 170 133 138 226 86 66 -91 -150 -39
2896 -39 -32 -53 -338 -47 -75 -205 -157 -113 -179 -80 18 -242 89 -12 -15 -132 118 333 275 -56 313 291 -32 253 326
2921 326 214 76 281 232 -115 168 30 -156 -153 -23 -169 -310 111 -122 -66 -246 33 -134 -348 125 -294
2942 -294 -158 207 29 -77 217 94 34 64 286 78 129 164 231 78 106 167 -191 2 321 -13 -317 -111
2964 -111 39 -304 15 150 -378 29 -81 -245 -255 -17 -114 -34 5 109 -146 -62 400 296 145 371 314 -69
2986 -69 143 131 -406 -79 365 -128 -338 349 84 -280 -71 133 -429 -309 150 -396 -430 -168 -97 -47 151 162
3008 162 -367 5 324 -121 -81 -46 254 -52 -86 380 -202 -192 74 -154 28 136 5 -123 -77 279 -96 -101
3030 -101 175 -159 -437 -187 270 -440 -251 228 43 -318 -137 238 -317 -60 408 27 -174 421 474 -152
3050 -152 142 454 -156 7 366 -38 -236 36 -175 -198 -4 243 -292 -278 84 -225 -427 19 -117 -202 166
3071 166 416 -156 -244 130 222 70 286 544 -42 17 302 -88 -287 195 280 -176 188 -70 -306 -138 60
3092 60 -79 -154 186 155 -685 -97 82 -278 -60 52 -20 -166 142 50 -372 -193 401 83 61 466 137 -121
3114 -121 235 56 -12 255 188 -329 -4 356 -289 -359 299 62 -370 -10 -349 -524 -467 114 241 -183 -174 59
3136 59 -343 -106 109 -123 379 436 -92 -84 40 100 -167 366 361 325 -188 219 -401 -379 132 105 -96 -10 36 -587
3160 -587 -284 -83 88 -194 -11 0 -131 -186 -75 -282 -146 165 395 32 331 -12 71 141 293 297 35 396
3182 396 209 76 -31 82 -174 -173 33 -301 -187 98 -93 -191 68 301 -2 22 -113 -144 -207 212 117 -31
3204 -31 16 18 -26 63 -45 381 259 98 129 -167 129 125 305 -152 147 107 -317 -231 -344 -228 -152 26 -109 -138
3228 -138 -208 112 27 -187 8 149 112 -288 103 -125 158 144 298 123 89 -59 125 249 -84 298 -129 125
3250 125 143 -59 -118 -92 -170 -124 13 -149 -162 53 9 -176 61 315 113 204 -119 -47 47 -25 89 258 106 400
3274 400 50 169 120 132 68 215 154 171 -4 -213 145 -161 141 -106 -287 -343 -210 -277 -79 -111 -166 -53 -245
3297 -245 -398 -54 65 36 258 301 30 172 -4 4 107 -45 276 -92 180 -115 122 42 78 -30 -138 -262
3319 -262 92 -31 8 -29 -167 -196 24 -370 -195 -171 23 166 36 -60 200 315 212 92 91 88 23 192 85
3342 85 -79 167 64 -155 165 -75 -17 33 -266 -32 -58 -398 -79 50 9 -38 -263 -141 -99 29 -85 -62 -91
3365 -91 69 -60 67 17 134 -72 129 124 235 63 59 114 156 240 -93 -326 -82 -89 -253 -229 -66 93 -34 -295
3389 -295 -175 7 -135 -152 -28 -42 6 -27 61 164 76 185 138 19 52 83 5 83 -17 152 31 -244 -74 -126
3413 -126 -237 20 -201 65 67 -145 -187 -86 -69 91 -275 -110 -100 174 -94 112 352 106 13 -25 140 15
3435 15 17 81 -60 -112 176 187 99 1 222 -17 39 -39 -232 -273 97 -276 28 -273 -332 -307 -311 95 139 -89 -25 22
3461 22 145 24 -57 198 262 173 88 -147 -155 -92 224 79 189 71 104 21 -87 -313 -32 -273 -194 -10 -198 -163
3485 -163 -273 -300 -148 -148 182 -153 -72 82 -62 -66 168 439 124 131 119 41 -443 182 62 70 240 36 50 -489
3509 -489 121 94 -141 102 289 -216 -212 140 -24 -511 39 -89 -132 -14 -88 -70 -283 279 68 196 421 227
3531 227 97 -39 110 62 197 518 -8 -16 -104 141 -399 -95 541 -31 -171 227 -190 -531 -36 305 25
3552 25 -108 61 -117 -385 122 143 16 440 307 -71 -228 385 14 -266 440 446 -148 -155 95 -412 -249 184
3574 184 104 -258 107 -23 -767 -161 32 -17 -110 182 86 -627 -84 125 -173 97 363 90 -291 52 92 -34
3596 -34 100 494 -17 -123 -20 63 -226 178 106 106 260 163 -338 -452 6 -175 -237 215 196 -361 -361 25 -190
3619 -190 -165 459 239 19 313 230 -23 57 100 308 -108 477 170 -352 -100 151 -199 196 149 276 -323 117
3641 117 -2 -341 52 146 -225 -4 -99 -107 -409 215 273 -131 205 85 -200 -211 541 164 -364 377 226 -208
3663 -208 -129 230 -167 66 275 143 -187 211 251 -286 140 443 -73 -349 248 5 -122 18 210 -187 -44
3684 -44 249 -156 -360 346 55 -165 262 282 7 117 464 -18 -292 102 124 -178 99 108 -46 -91 287 -39
3706 -39 -154 283 -121 -468 -22 418 -344 -83 226 121 -225 32 55 -120 -168 369 13 6 309 26 -222 15
3728 15 294 -106 -237 149 70 152 48 36 -163 91 21 -147 -187 167 -139 -281 -124 101 -212 -164 277 -150
3750 -150 -107 266 -28 37 -14 118 -107 -109 163 -11 -132 14 217 -238 69 149 -270 99 114 -64 -394 -163
3772 -163 15 -111 62 -37 16 -170 -149 16 -199 134 -27 85 69 -67 118 294 17 173 37 137 63 56
3794 56 -96 9 -299 -96 136 40 -227 -123 -168 -329 -126 -110 199 -136 -56 -86 -134 81 50 33 136 82 -183
3817 -183 245 46 101 -25 27 232 167 -25 -37 146 -106 145 71 -205 33 -83 -216 -162 60 -59 108 0
3839 0 -113 -154 -59 -88 -6 -78 33 115 -32 54 134 311 355 136 171 -19 -28 218 96 32 93 -247 101 -3 -108
3864 -108 -222 -324 131 -38 -120 -70 194 -40 104 65 -84 -129 -75 142 115 -128 -144 441 57 -125 -137 97 -81
3887 -81 87 -74 100 189 91 -65 -45 46 -112 216 289 173 -94 -168 53 63 -122 30 3 62 -234 -214 -4 41
3911 41 -11 -73 -70 21 273 126 172 -4 117 215 38 150 202 48 109 -65 -173 -222 30 197 -59 -268 -172 34
3935 34 -232 3 -208 53 7 -101 99 31 127 49 -95 45 -12 -122 -67 8 -20 217 97 -115 -121 292 -191 -119
3959 -119 149 -64 -60 166 -346 -194 204 -25 -34 -17 267 96 55 -31 -18 -321 -36 11 72 -46 215 68 -45
3982 -45 222 478 -77 86 215 -125 87 14 -41 26 211 242 -216 -10 46 -186 -149 -115 113 85 94 91 -18 17 262
4007 262 -81 119 37 -109 171 141 -145 32 289 217 14 -71 349 80 -184 194 48 -41 -20 -23 21 -199 216
4030 216 112 -109 -83 9 -142 125 -8 30 20 119 176 1 220 225 2 -8 160 -119 113 277 77 -70 320
4053 320 -150 -107 -109 442 -128 -173 86 146 -48 -136 -114 -284 -46 149 -196 -243 303 221 -118 -85 192 -183 -91 99
4077 99 -36 -282 125 205 -265 157 125 3 -69 55 -59 -170 -56 61 -277 78 126 57 68 69 -66 -245 129
4100 129 117 -185 -364 236 -132 34 358 84 -81 114 189 104 87 265 -182 -92 130 -25 -65 126 234 -462
4122 -462 -190 -124 -156 -340 270 237 -71 79 10 -111 -301 266 81 -191 46 -310 -205 36 31 2 -126 98
4144 98 -2 108 100 -85 -103 172 123 108 -39 233 65 -97 189 6 -24 32 93 -290 -216 -106 -227 -237 130 317
4168 317 -26 -172 39 -54 -89 134 112 66 -28 94 -50 -3 199 157 242 393 -70 -138 96 102 -9 -146 335 -142
4192 -142 -97 -65 -111 -125 134 43 -242 41 116 -187 12 136 190 -270 70 266 -235 43 183 -56 123 125 425
4215 425 -265 143 261 180 137 211 -126 -162 -81 91 -232 -162 124 -248 -315 177 -160 -310 -189 140 47 83 28
4238 28 136 -153 145 20 -42 150 221 44 157 287 -126 6 146 40 20 -55 197 -126 -150 52 -90 55
4260 55 79 -38 -132 -106 200 92 -26 188 -174 -101 -9 250 -62 202 191 -157 100 47 227 -170 89 -73 -55
4283 -55 203 75 -76 -115 93 -164 -200 103 169 -128 -72 -203 336 152 72 41 -219 -227 139 -209 105 28 74 -52
4307 -52 99 142 3 63 160 92 210 97 -128 100 -122 -6 -67 199 86 -63 -49 -191 -136 -73 -72 9 162 -234
4331 -234 -146 37 126 -279 157 257 188 204 -38 126 129 259 13 -321 -31 -341 126 -58 9 103 5 -42 -82 -102
4355 -102 -143 -49 -147 -321 -131 74 177 211 -60 -6 124 131 10 98 -140 -70 -141 -86 -126 -98 -128 -52 -24 67 81 -156
4381 -156 200 -115 23 -162 46 -67 -120 32 -242 -165 -302 -116 -8 -105 -132 105 -100 -5 156 -115 0 -22
4403 -22 -17 -81 78 157 214 6 121 257 -89 -6 -38 -16 76 -2 -221 -274 -305 121 70 -27 58 -69 158 66 -291 -121
4429 -121 105 106 135 -61 -102 -6 114 -90 167 218 -124 -145 -130 14 12 -159 -92 -30 123 -65 29 -80 -3 34 -139
4454 -139 24 -275 33 -32 186 -110 -45 -242 -61 -141 107 -15 171 253 48 62 31 82 45 -31 -133 74 70 121
4478 121 39 -98 213 -152 -66 -86 -97 30 128 -89 181 148 44 -204 95 237 -3 95 157 -30 8 119 -78
4501 -78 -4 94 185 -21 45 76 -124 -49 -163 -61 -137 -185 -67 -75 -145 220 -69 -38 -213 -46 106 22 -30 -230 -56
4526 -56 -156 -45 204 121 99 239 42 210 -198 57 -161 -52 156 -92 -49 82 -155 -217 -201 90 0 154
4548 154 -7 -2 -435 15 67 149 202 8 -21 96 -338 -102 -81 43 112 -182 170 94 46 -50 114 182 -13 -2
4572 -2 161 -43 142 -28 35 -195 -337 -29 40 -66 -51 -37 -203 -149 110 -79 -34 114 -52 80 52 109 -70
4595 -70 130 53 -212 37 66 290 111 71 -125 -149 -116 153 266 -127 322 -313 24 72 -87 -66 259 117 101
4618 101 -66 154 -134 -114 81 157 36 256 61 -122 53 92 125 -153 219 39 -98 106 212 -124 -129 217
4640 217 -153 -33 -13 -106 -119 -81 232 -9 -269 29 -40 -202 47 -164 -161 -128 228 97 -278 113 88 -16 -91
4663 -91 320 82 37 130 -39 -345 210 -216 -208 3 191 29 -380 3 -68 -80 16 35 -61 408 58 110 43 155
4687 155 -235 63 2 -298 -16 -15 37 150 -144 -76 149 120 3 -64 -24 228 -16 -120 -282 -88 256 122 -33
4710 -33 -36 -49 -243 -61 -131 -77 7 -172 -233 128 -70 -183 -187 49 67 -68 79 -1 145 -111 167 -28 -111 80
4734 80 158 -16 -149 206 -96 -34 -77 -98 -36 -118 61 -177 -175 -161 131 -49 197 -246 -74 -16 -31 62 -23 -46 42
4759 42 10 77 20 13 172 122 -259 117 117 158 -17 22 -257 -80 -124 -283 -198 -104 176 30 80 -173 -79 27 -63 99
4785 99 319 -89 100 143 8 36 43 56 39 128 -179 74 13 26 53 141 -45 -263 -10 -237 87 -96 -162 78
4809 78 -157 372 -94 143 -154 -250 -7 -158 130 49 -135 175 -21 272 -108 -13 -242 -44 -24 -146 -149 -139 81
4832 81 102 136 69 77 -85 59 -68 65 202 -14 154 -201 -85 -26 111 54 -157 -21 -43 139 9 183 -84
4855 -84 103 151 20 -82 -48 -140 18 -114 -147 14 0 19 -43 -44 -19 -229 -142 -33 65 -155 -86 -26 -136 32 260
4880 260 153 58 33 -198 68 170 -134 -155 176 -149 99 -305 85 213 -71 -57 -60 -107 -54 36 25 -321 161
4903 161 101 -295 132 -210 -130 -127 -114 51 -70 212 -155 -68 -24 139 40 189 82 135 27 106 -101 124 192 -80
4927 -80 -53 -153 -106 4 -48 -41 -49 -24 365 -34 131 127 -62 157 55 -90 -159 143 334 -122 -99 -149 -178 -73 -62
4952 -62 301 117 318 88 -117 104 146 -41 52 -8 -35 -200 48 -56 -175 -156 23 9 -120 -99 51 -113 -132
4975 -132 99 87 -151 245 -59 -2 114 -45 94 24 -136 -25 -47 -11 -28 -204 159 112 -9 -128 -54 95 -209
4998 -209 27 52 38 -175 189 78 52 -34 193 -113 -87 228 -33 23 -28 75 212 59 115 377 177 -52 48
5021 48 -48 46 -263 38 -85 -118 247 169 -174 61 270 -87 -240 -287 -36 52 106 114 95 74 58 108 113 -11 137
5046 137 106 -157 -73 -137 190 114 306 88 42 -34 -197 33 -14 146 -249 64 -139 -28 65 -52 -102 -183 -11
5069 -11 117 4 -107 205 67 -4 -55 19 262 22 -6 -102 107 -236 148 272 37 -63 -90 -39 270 149 -74
5092 -74 -100 29 -207 178 16 -71 209 25 -18 16 -40 9 -79 -315 187 -31 -109 50 48 41 155 -39 146 -22
5116 -22 214 191 23 -138 18 -139 -75 -140 171 -98 -250 5 -152 -19 69 38 -130 -188 57 47 14 119 45
5139 45 -6 -120 49 236 -32 142 68 94 132 -16 -79 124 -5 28 24 -184 -160 -206 -329 -54 -267 22 -17 123
5163 123 -326 -168 -18 -145 -44 35 -252 -50 -29 -173 77 -78 32 -22 -237 -177 -119 -31 185 -83 130 131 48
5186 48 -22 31 -2 -11 -153 -58 -13 -259 -42 -38 -142 -146 57 -32 -46 -152 74 86 69 22 45 31 43 -290 27 133 51
5213 51 39 -170 0 47 -65 -136 -111 57 55 64 -183 -159 -252 -244 -104 8 117 -77 43 228 266 16 110 159 80 125
5239 125 -151 238 -207 39 -124 158 94 -66 -30 -63 -175 -41 -77 -27 -26 -53 -13 72 -75 113 -170 1 -132
5262 -132 121 -83 -152 130 -119 108 284 55 -64 -204 6 43 -41 172 -98 205 -283 -14 115 -237 -50
5283 -50 67 -97 202 -249 79 -114 -91 -96 -166 -43 143 -51 150 4 -5 -333 -123 -28 30 103 26 148 -26 -1
5307 -1 347 -8 -36 34 -102 146 130 187 16 76 131 -55 -168 -312 59 -36 -40 -95 -58 7 -78 -11 97 -95 92
5332 92 -181 60 -1 151 380 115 192 -57 87 -21 32 216 -58 13 -63 2 17 -30 244 -33 178 66 -49
5355 -49 -114 -64 45 -8 -63 -38 -161 -136 98 -42 57 31 48 84 -232 -47 20 -83 -66 51 -44 -105 18 57 119 67
5381 67 -44 -51 120 -200 -116 93 -244 11 -68 -154 225 -74 25 1 45 -59 201 -22 0 151 -125 -39 -113 -193
5405 -193 -286 33 -209 -47 118 -66 7 -120 -55 -40 390 -123 -185 -281 -62 -218 -103 72 53 68 -172 -39 -26
5428 -26 -43 -221 7 -126 47 -93 -55 -24 -89 -226 -43 -23 -173 18 -46 8 -151 -77 64 -35 -126 -202 74 -110
5452 -110 -83 80 161 54 123 76 -174 258 98 203 141 140 300 -30 -67 4 -149 212 -12 -139 29 70 -116
5475 -116 -21 79 -168 120 -33 -260 -199 39 -73 7 -47 59 -37 -12 -193 -242 -191 11 192 -174 81 257 -32
5498 -32 121 -203 3 23 8 198 6 -189 -262 155 -51 72 14 73 -1 -227 60 -196 -155 -128 -21 -83 -234
5521 -234 225 67 -56 -126 142 -53 136 154 -106 -90 261 203 -172 88 266 182 169 17 -108 -102 -65 218 61
5544 61 -29 87 -62 -49 282 -12 -53 117 146 241 -113 23 -97 26 -144 -90 -80 -100 67 218 -39 313 5
5567 5 -102 245 35 -51 147 -100 -126 46 45 -82 237 52 -35 -97 204 139 3 26 -102 94 -104 202 218 -46
5591 -46 -328 18 228 18 107 318 54 67 -95 277 135 41 111 -17 -48 -62 -163 140 129 76 -142 193 45
5614 45 -179 -21 -99 -316 -108 189 118 -70 -164 328 48 78 36 -3 -13 57 114 -135 -4 -213 113 -36 -136
5637 -136 -115 240 -171 202 -22 -31 187 -22 -25 -19 -307 -84 59 -66 -247 -14 115 -4 5 -50 181 108 176 40
5661 40 -69 117 -192 244 23 166 156 -144 25 6 75 198 84 -128 20 254 -5 336 4 -70 1 123
5683 123 -135 -116 50 -97 -106 -135 35 -65 35 109 -213 143 -149 -53 -56 63 29 16 -26 -179 78 -102 -94 45
5707 45 96 143 -182 115 98 -148 -86 14 -34 197 215 54 -16 172 190 -154 72 169 37 -183 399 -15 195
5730 195 48 13 130 -115 77 -103 82 -117 -105 -297 85 -39 -57 -123 -45 -60 -153 -25 -96 90 99 -79 292
5753 292 188 99 116 210 66 14 13 56 -159 182 -14 -228 -21 -34 -177 -76 206 -96 -36 -177 94 -316 -22
5776 -22 -14 141 18 -47 285 -251 -199 -13 -79 104 -72 72 -266 210 -159 54 75 -22 60 143 170 -9 41 -140
5800 -140 -113 129 -4 -62 101 47 25 77 251 -230 -158 -184 -78 102 -145 -170 -61 28 170 312 54 222 75
5823 75 -87 -102 -125 -13 1 -80 -44 -100 12 199 39 5 -36 88 14 122 186 -125 47 -279 -246 -53 -25 7 21
5848 21 257 -35 100 -92 -201 204 128 -63 -12 -21 79 -60 26 13 52 -69 248 -78 -84 -246 22 -86 -43 -67
5872 -67 116 25 -71 -307 54 97 47 -9 41 185 80 143 -89 -154 187 -173 2 44 -29 142 -76 -72 25 -173 27
5897 27 -97 103 -252 -140 45 -187 -71 -46 -218 -46 -207 239 31 83 -78 0 -427 -218 -139 248 95 232
5919 232 -73 4 17 182 -9 -123 106 -249 -67 -85 180 -97 -114 -375 -7 -118 1 171 -6 -96 -73 205
5941 205 86 -295 -188 296 -140 44 -6 5 -109 205 -60 201 -101 -32 49 -205 -39 -46 -135 -5 125 68 59
5964 59 158 257 36 -277 85 -24 -351 -68 -5 159 138 -78 -77 230 -65 -145 110 -77 -94 31 322 15 149
5987 149 130 -120 140 109 -104 44 -39 -120 -134 -132 82 -71 -131 42 132 228 -41 165 -120 -115 17 -218 -48 -78
6011 -78 -143 48 -15 -32 -49 116 -26 228 111 -83 28 -150 154 -68 99 -57 36 16 -41 -119 83 45 69 69
6035 69 -176 -2 153 4 125 -2 -97 46 68 173 28 -134 0 129 -123 61 -42 -31 -35 17 88 39 20
6058 20 14 -12 -185 106 109 -149 15 -67 24 148 -90 208 -72 217 -71 -43 -79 -12 54 -12 337 -128 77 -84
6082 -84 -346 153 55 -294 60 129 -163 75 -137 -65 358 -6 -59 251 -198 -103 -74 57 25 -204 83 -201 26
6105 26 190 147 162 151 178 162 66 -74 58 106 -81 147 34 -95 -175 19 141 51 85 35 214 194 -11 -246
6129 -246 -127 -112 -17 127 39 154 104 -9 -48 167 -47 -3 62 104 256 322 -106 58 -51 -132 -8 303 164
6152 164 -162 -261 79 280 -64 -154 24 -207 -1 148 157 154 -40 -77 -97 135 202 -64 -138 -39 16 117 91 -27
6176 -27 -24 235 -131 39 95 -178 98 -50 -2 204 -41 164 -186 -156 149 -214 -122 -212 -110 -33 -142 219 -19
6199 -19 215 -71 -202 252 41 -180 245 -73 17 -99 -34 73 -324 6 5 -37 121 109 -193 219 49 131 -29
6222 -29 301 -47 -86 -35 -165 64 -106 -42 -40 -57 -122 -90 5 305 202 -214 -161 81 -118 -64 -338 -107 -128 37
6246 37 73 37 129 -150 81 74 -178 -202 28 29 65 20 14 -12 105 106 -7 -48 87 -213 -190 229 -44 -13 248 -28
6272 -28 46 -10 -82 -117 -165 0 11 -75 131 49 77 -292 90 -252 1 5 -25 92 -254 39 34 1 8 143 -9 28
6298 28 -74 -34 17 186 6 -12 5 -154 79 234 180 6 65 -18 208 103 109 48 -48 -145 -134 -29 -49 275 -29
6323 -29 -283 -21 17 59 115 -143 -55 127 51 140 55 105 66 -52 -175 89 167 5 125 -25 91 76 92 141 15
6348 15 20 -146 -35 -89 -30 155 35 126 147 63 -79 -23 23 -127 -302 82 -89 -39 -112 435 123 -204 -77 128
6372 128 115 -67 -77 -16 -56 -320 134 -25 93 -55 36 2 -34 -131 131 -162 99 -42 -44 -95 -86 7 -56 143 170
6397 170 -128 -12 -170 131 11 129 -8 85 -169 -111 -72 141 -59 -51 -49 146 46 -94 26 -103 -177 -55 -18
6420 -18 -107 -33 -22 -169 90 25 -55 27 17 237 -52 0 89 13 94 131 48 9 101 75 -23 185 -110 242 139 134 236
6447 236 -29 8 -87 -1 -139 -50 176 -147 32 32 80 73 112 -185 20 32 -49 -34 41 -38 34 -127 -165 -59 -174 16
6473 16 -158 -92 -27 -158 135 124 -51 100 -122 -196 -26 -74 -47 -180 -133 -36 -50 -98 -142 -44 97 -68 -53 61 274
6498 274 15 -160 -68 37 -42 -120 -42 -69 -26 353 24 225 -100 -225 4 -35 113 -108 75 211 -55 -45 93
6521 93 17 -115 96 -3 76 125 142 187 98 9 -149 66 -234 -54 222 23 105 29 18 -36 -118 228 -24 121 -95
6546 -95 53 68 -114 -43 -187 196 -74 -216 -203 -34 298 82 -70 -15 -184 -88 -108 111 -7 249 131 75 -12
6569 -12 81 14 -137 69 123 -143 -197 -26 -202 -56 -181 71 81 -43 122 -319 -130 -23 -146 -250 -75 -20
6591 -20 -61 -103 -35 122 140 109 102 -172 32 -82 246 -43 195 5 30 170 209 -12 110 -21 63 -36 -180 57
6615 57 -59 114 -15 15 -63 45 -8 -48 -60 43 -28 -134 -120 -102 -30 233 -89 -53 96 106 -99 -141 12 -49 -69
6640 -69 132 -135 -5 -77 -351 137 -22 42 115 80 -70 -167 -224 -72 -36 180 -72 -122 -31 18 -64 -49 75 90 45
6665 45 -174 -148 -23 32 -103 30 -20 -159 224 -18 19 -52 22 -246 -89 66 -282 107 216 -284 -109 -54 -22
6688 -22 -87 -87 110 -70 -50 -81 2 37 109 20 10 68 81 24 -20 113 -103 -127 32 -77 -307 -210 274 -143 33 36
6714 36 26 -153 7 134 -193 -115 -40 36 60 27 -240 -63 48 -114 5 22 -172 80 -69 -35 171 -92 41
6737 41 148 -17 -34 54 11 -194 112 -150 17 -54 -85 -40 -3 -301 -88 -147 192 23 46 -95 137 157 21 -67
6761 -67 -200 24 140 129 78 239 -182 -215 -114 245 -88 -182 -87 36 14 -21 147 47 -88 -294 -122 81 28
6784 28 297 -26 -5 28 -43 204 -20 86 298 -44 -212 71 -289 -23 -20 -113 -88 -4 -45 -177 -62 35 -79 -3
6808 -3 19 -157 125 -53 -224 -7 -179 47 -319 -153 28 76 -44 151 -50 -169 -8 119 65 186 33 -104
6830 -104 -239 -151 -77 155 234 -41 -233 8 -22 -59 -213 28 -6 60 -95 -21 -209 58 -60 78 -10 -68 46
6853 46 -91 70 96 -139 -24 8 325 -180 -53 94 -104 198 120 8 72 -24 -155 -31 -74 131 48 6 310
6876 310 55 -40 47 124 -65 26 96 -157 -73 31 174 -132 -55 70 -58 -2 36 161 -120 28 -35 34 -4 -127
6900 -127 -71 81 -10 167 -27 -75 -134 115 -177 87 254 57 -45 208 120 -34 72 -46 31 -51 -11 -39 121
6923 121 172 57 110 -84 -129 86 -139 -70 67 -41 -52 19 -43 -68 16 75 -181 -304 -87 -62 -212 -95 -113 82
6947 82 -5 -73 39 -65 77 3 16 167 -6 14 163 24 -305 139 -30 -53 -151 -17 112 -214 23 26 -202
6970 -202 50 266 210 86 -46 -177 18 -153 -158 -118 -37 -26 248 -114 -17 134 187 101 100 106 -61 -24 60 -125 100
6995 100 -169 -184 78 -73 0 -246 119 87 147 -91 225 -106 -85 161 63 -23 -17 67 -183 -161 172 -106 -75 -50
7019 -50 90 -112 -131 -101 -37 -50 50 -138 56 50 5 -11 -57 -175 -157 141 72 -80 125 73 -130 62 -175 -62
7043 -62 42 -220 113 34 94 -155 -225 -81 -194 4 50 154 -42 -116 39 -103 40 -120 -128 -135 152 111 -23 -163
7067 -163 -123 -66 53 -63 -89 40 66 -137 -101 -50 31 -9 -129 -190 -109 -18 -126 -2 13 -179 115 54 61 -221 -226 -1
7093 -1 -192 223 -130 -120 -49 -53 -148 -202 -379 97 87 151 -94 44 -124 -166 -49 60 -77 249 78 -212 112 115
7117 115 109 -155 42 -57 108 5 -97 -92 84 97 -98 30 46 -11 95 -222 10 -110 171 181 -66 -5 91 -50
7141 -50 -127 21 -179 65 162 82 41 -146 -111 -216 -42 158 12 -125 20 -28 167 -161 -229 -149 85 -195 136
7164 136 -1 91 -22 -154 -108 60 32 -97 -138 81 152 79 27 21 -38 -47 -27 161 -19 -155 -55 27 -58 142 95
7189 95 -167 -60 148 14 117 55 15 175 -13 96 -34 113 -120 7 158 -89 102 28 -17 101 -30 29
7211 29 98 -42 -109 30 294 -175 54 64 58 -26 75 -92 78 101 -32 -25 -98 63 -85 61 167 15 73 -6
7235 -6 -9 6 -165 -181 3 61 303 28 -23 28 177 32 -224 -20 -114 55 -116 -190 193 -140 32 115 -59 1
7259 1 -135 -159 -180 -128 32 163 130 147 -74 67 87 145 -57 -221 81 95 174 -157 101 -14 212 4 90 113
7283 113 218 165 -8 161 44 70 119 5 -18 -165 96 -63 -86 8 95 94 -14 154 -127 123 20 25 -76 101
7307 101 -111 -75 -114 364 -65 -1 -44 -128 137 26 -130 33 -6 -71 0 -89 63 -88 -28 368 -119 -229 -32
7330 -32 -65 -11 208 -236 30 19 -108 136 58 -205 -92 -180 -10 -136 171 97 130 134 109 78 -23 47 77 102 -114
7355 -114 -45 0 -205 46 455 -174 -37 -156 26 -84 -114 -330 52 218 170 -3 -38 -190 -57 29 -176 257
7377 257 -104 -189 -207 93 -46 -22 0 -344 -124 -2 395 46 -188 38 -256 170 65 -206 68 119 143 -150
7399 -150 -52 -17 135 26 -110 96 155 20 -15 -127 -5 -91 124 23 202 -114 84 100 -23 -50 61 -7 -110
7422 -110 -173 -109 -254 111 6 -104 43 -108 10 -194 56 66 -187 -194 99 1 -78 90 -3 -54 125 -65 -66 -40
7446 -40 -246 10 -88 -23 -65 -53 170 -67 56 56 -10 -197 -71 -226 -144 122 -61 -153 -61 69 -156 74 252 107
7470 107 212 -38 6 58 -85 339 -25 5 28 -87 9 -48 54 -42 -110 248 78 169 102 133 -101 17 -71 86
7494 86 -109 -20 116 139 174 67 -312 12 29 -186 -84 11 -88 -143 24 23 -71 -4 -161 -6 101 0 90 -16
7518 -16 -7 -208 -247 5 9 -218 -140 -110 87 150 19 -107 -207 196 -124 13 183 18 -118 207 -107 31 267
7541 267 109 -366 70 -272 -149 -100 -28 -181 63 -219 53 -39 54 -210 125 73 -176 -37 60 -67 17 180
7563 180 -55 106 -108 61 -140 -135 111 -75 -74 222 -90 81 0 -163 28 301 -56 -97 -15 -17 94 158 115 -34
7587 -34 -50 139 151 -81 -12 -174 -95 41 -166 -200 83 148 -238 -35 86 42 -19 107 -137 121 84 -273 94
7610 94 -127 -67 30 -81 -252 58 -24 121 -22 -88 229 49 -222 42 -22 8 7 319 297 149 23 100 -136 -17
7634 -17 228 30 -190 -1 7 21 225 -94 64 -128 -120 -35 -222 -86 110 -62 186 -103 86 50 68 145 -162
7657 -162 103 127 39 50 -45 -131 -86 -129 71 -25 44 58 38 15 40 -65 16 -46 260 94 -143 -133 -64 -59 122 24 -153
7684 -153 -41 138 2 3 -98 -55 -43 -48 -164 -160 -127 -90 -195 43 30 -38 -157 -32 79 -95 -159 60 164 -17
7708 -17 129 126 -184 -200 -22 -1 -197 -13 43 -111 -127 9 -212 156 106 9 -211 -92 -85 -4 -75 -147 70 -17 53
7733 53 27 -82 -39 225 47 -50 -354 -195 148 51 113 -164 42 90 -436 -132 11 -47 41 -142 -252 -33 -50
7756 -50 -44 -3 -8 -52 8 -25 -48 -231 -36 -105 -107 187 -178 -5 -2 -82 -19 215 172 78 -62 -186 -193 -90 -48 152 -26
7783 -26 -92 -82 3 -45 -91 120 61 31 190 185 65 31 -34 -401 -48 -2 -158 158 -121 76 -101 -33 95 148 86
7808 86 -52 65 -125 -23 9 -201 60 112 -87 87 38 263 26 19 65 110 99 45 -27 160 14 57 113 198 75
7833 75 71 25 -105 -118 -388 -124 22 117 183 -79 56 -203 9 -100 -196 -44 99 26 -57 265 -31 112 -90
7856 -90 120 -197 45 -86 3 -157 -94 81 -97 179 98 -120 119 190 95 49 -117 231 -215 72 186 178 11
7879 11 -62 -105 -143 138 113 -51 -30 167 -184 -160 35 137 3 -224 -97 7 -96 -40 -60 108 -13 -80 -165 -13
7903 -13 15 84 -125 -62 -74 172 -117 106 -100 43 190 11 -24 30 -65 42 -167 -55 -59 186 -78 -371 69
7926 69 58 -248 -75 -32 139 -55 -167 42 -84 -31 -65 -5 60 -4 -14 -6 21 -139 51 -89 19 90 62 110 133
7951 133 71 -137 -255 24 346 -43 -64 -151 68 -68 -32 -145 -206 -37 -32 -90 38 -91 41 -165 -191 -132 -76 -43
7975 -43 35 90 14 18 -49 63 173 139 -219 101 -50 43 -45 -50 110 68 105 -97 2 -36 180 263 162 67 -334 -157
8001 -157 191 -135 51 -243 -168 130 -167 -320 139 -190 153 -2 189 -164 40 -107 109 246 148 143 -14
8022 -14 -13 98 8 -166 -52 59 -8 -63 -186 -16 179 -274 -61 25 9 -22 -109 137 99 -140 -192 -136 131 36 -96
8047 -96 34 121 265 172 -91 -64 -74 -77 122 -131 -55 64 -350 -258 -5 -19 -91 -61 -251 -273 -24 170 -82 -19 -107
8072 -107 6 -118 -142 -17 47 -137 337 124 28 -123 -31 -107 -113 110 6 -67 -50 -48 -112 -20 -33 -27 147 -136 101
8097 101 -91 116 -37 36 -5 -27 -14 -3 143 11 105 -17 -87 -23 -198 -8 -46 -241 2 -132 -34 -68 129 -288
8121 -288 -138 -43 -37 40 73 -451 -113 31 132 78 -62 -74 120 -161 -25 -3 79 -67 -46 -253 -182 -101 153 84
8145 84 -12 254 18 145 23 -152 83 188 175 -143 141 -107 111 163 -189 -105 -108 -42 -91 -32 -78 -19 -145 1
8169 1 -154 234 -63 -153 -155 -17 -5 236 20 104 61 -72 -79 16 34 -73 -282 -1 -115 -99 -11 308
8191C08
##END NTUPLES=NMR FID
##END=
