##TITLE=1H_Pr 1520
 200.13MHz, CDCl3,
 8 sc
 
 5.3.2025
##JCAMPDX= 6.0         $$ Bruker NMR JCAMP-DX V2.0
##DATA TYPE= NMR FID
##DATA CLASS= NTUPLES
##ORIGIN= UXNMR, Bruker Analytische Messtechnik GmbH
##OWNER= pz
$$ XWIN-NMR		Version 3.5
$$ Wed Mar  5 14:56:03 2025 Russian Standard Time (UT+4h)  she@DPX200
##.OBSERVE FREQUENCY= 200.1313
##.OBSERVE NUCLEUS= ^1H
##.DELAY= (6, 6)
##.ACQUISITION MODE= SIMULTANEOUS
##.ACQUISITION SCHEME= undefined
##.AVERAGES= 8
##.DIGITISER RES= 18
##SPECTROMETER/DATA SYSTEM= spect
##.PULSE SEQUENCE= zg30
##.SOLVENT NAME= CDCl3
##.SHIFT REFERENCE= (INTERNAL, CDCl3, 0, 14.3821)
##AUDIT TRAIL= $$ (NUMBER, WHEN, WHO, WHERE, WHAT)
$$ ##TITLE= Audit trail, XWIN-NMR		Version 3.5
$$ ##JCAMPDX= 5.01
$$ ##ORIGIN= Bruker BioSpin GmbH
$$ ##OWNER= she
$$ F:/spectra/data/she/nmr/H-C/1/audita.txt
$$ ##AUDIT TRAIL=  $$ (NUMBER, WHEN, WHO, WHERE, WHAT)
(   1,<2025-03-05 14:54:19.76 +0400>,<she>,<DPX200>,
      <created by zg, POWCHK disabled, PULCHK disabled
       configuration hash MD5:
       00 E9 B6 7A A2 85 ED C7 34 08 36 98 17 FE 4E 26
       data hash MD5: 16K
       CB 5D E8 8D 16 CF 09 7E C6 D9 0F 88 31 48 C6 6F>)
$$ ##END=
$$ 
$$ hash MD5
$$ B1 AF 15 81 DC 95 27 15 DE C5 5E 2F 24 F5 89 7E
##$RELAX= 
##$RELAX= 
##$RELAX= 
##$RELAX= 
##$RELAX= 
##$RELAX= 
$$ Bruker specific parameters
$$ --------------------------
##$DU= <F:/spectra>
##$EXPNO= 1
##$NAME= <H-C>
##$PROCNO= 1
##$TYPE= <nmr>
##$USER= <she>
##$AMP= (0..31)
100 100 100 100 100 100 100 100 100 100 100 100 100 100 100 100 100 100 
100 100 100 100 100 100 100 100 100 100 100 100 100 100 
##$AQSEQ= 0
##$AQ_mod= 1
##$AUNM= <au_zg>
##$AUTOPOS= <>
##$BF1= 200.13
##$BF2= 200.13
##$BF3= 200.13
##$BF4= 200.13
##$BF5= 200.13
##$BF6= 200.13
##$BF7= 200.13
##$BF8= 200.13
##$BYTORDA= 1
##$CFDGTYP= 0
##$CFRGTYP= 5
##$CHEMSTR= <none>
##$CNST= (0..31)
1 1 145 1 1 1 1 1 1 1 1 1 1 1 1 1 1 1 1 1 1 1 1 1 1 1 1 1 1 1 1 1 
##$CPDPRG= <>
##$CPDPRG1= <>
##$CPDPRG2= <>
##$CPDPRG3= <>
##$CPDPRG4= <mlev>
##$CPDPRG5= <mlev>
##$CPDPRG6= <mlev>
##$CPDPRG7= <mlev>
##$CPDPRG8= <mlev>
##$CPDPRGB= <>
##$CPDPRGT= <>
##$D= (0..31)
0 0.7 0 0 0 0 0 0 0 0 0 0.03 0 0 0 0 0 0 0 0 0 0 0 0 0 0 0 0 0 0 0 0 
##$DATE= 1741172059
##$DBL= (0..7)
120 120 120 120 120 120 120 120 
##$DBP= (0..7)
150 150 150 150 150 150 150 150 
##$DBP07= 0
##$DBPNAM0= <>
##$DBPNAM1= <>
##$DBPNAM2= <>
##$DBPNAM3= <>
##$DBPNAM4= <>
##$DBPNAM5= <>
##$DBPNAM6= <>
##$DBPNAM7= <>
##$DBPOAL= (0..7)
0.5 0.5 0.5 0.5 0.5 0.5 0.5 0.5 
##$DBPOFFS= (0..7)
0 0 0 0 0 0 0 0 
##$DE= 6
##$DECBNUC= <off>
##$DECIM= 32
##$DECNUC= <off>
##$DECSTAT= 4
##$DIGMOD= 1
##$DIGTYP= 9
##$DL= (0..7)
0 120 120 120 120 120 120 120 
##$DP= (0..7)
150 150 150 150 150 150 150 150 
##$DP07= 0
##$DPNAME0= <>
##$DPNAME1= <>
##$DPNAME2= <>
##$DPNAME3= <>
##$DPNAME4= <>
##$DPNAME5= <>
##$DPNAME6= <>
##$DPNAME7= <>
##$DPOAL= (0..7)
0.5 0.5 0.5 0.5 0.5 0.5 0.5 0.5 
##$DPOFFS= (0..7)
0 0 0 0 0 0 0 0 
##$DQDMODE= 0
##$DR= 18
##$DS= 0
##$DSLIST= <SSSSSSSSSSSSSSS>
$$ [...]
##$SUBNAM0= <"">
##$SUBNAM1= <"">
##$SUBNAM2= <"">
##$SUBNAM3= <"">
##$SUBNAM4= <"">
##$SUBNAM5= <"">
##$SUBNAM6= <"">
##$SUBNAM7= <"">
##$SUBNAM8= <"">
##$SUBNAM9= <"">
##$SW= 18.0517328524113
##$SWIBOX= (0..15)
0 0 2 0 0 0 0 0 0 0 0 0 0 0 0 0 
##$SW_h= 3612.71676300578
##$TD= 16384
##$TD0= 1
##$TE= 0
##$TE2= 300
##$TE3= 300
##$TEG= 300
##$TL= (0..7)
0 120 120 120 120 120 120 120 
##$TP= (0..7)
150 150 150 150 150 150 150 150 
##$TP07= 0
##$TPNAME0= <>
##$TPNAME1= <>
##$TPNAME2= <>
##$TPNAME3= <>
##$TPNAME4= <>
##$TPNAME5= <>
##$TPNAME6= <>
##$TPNAME7= <>
##$TPOAL= (0..7)
0.5 0.5 0.5 0.5 0.5 0.5 0.5 0.5 
##$TPOFFS= (0..7)
0 0 0 0 0 0 0 0 
##$TUNHIN= 0
##$TUNHOUT= 0
##$TUNXOUT= 0
##$USERA1= <user>
##$USERA2= <user>
##$USERA3= <user>
##$USERA4= <user>
##$USERA5= <user>
##$V9= 5
##$VALIST= <valist>
##$VCLIST= <CCCCCCCCCCCCCCC>
##$VD= 0
##$VDLIST= <DDDDDDDDDDDDDDD>
##$VPLIST= <PPPPPPPPPPPPPPP>
##$VTLIST= <TTTTTTTTTTTTTTT>
##$WBST= 1024
##$WBSW= 4
##$XGAIN= (0..3)
0 0 0 0 
##$XL= 0
##$YL= 0
##$YMAX_a= 130352
##$YMIN_a= -143706
##$ZGOPTNS= <>
##$ZL1= 120
##$ZL2= 120
##$ZL3= 120
##$ZL4= 120
##$ABSF1= 10
##$ABSF2= 0
##$ABSG= 5
##$ABSL= 3
##$ALPHA= 0
##$AQORDER= 0
##$ASSFAC= 0
##$ASSFACI= 0
##$ASSFACX= 0
##$ASSWID= 0
##$AUNMP= <proc_1d>
##$AZFE= 0.1
##$AZFW= 0.1
##$BCFW= 1
##$BC_mod= 2
##$BYTORDP= 1
##$COROFFS= 0
##$CY= -3
##$DATMOD= 1
##$DC= 2
##$DFILT= <>
##$DTYPP= 0
##$F1P= 0
##$F2P= 0
##$FCOR= 0.5
##$FTSIZE= 0
##$FT_mod= 4
##$GAMMA= 1
##$GB= 0.15
##$INTBC= 1
##$INTSCL= 1
##$ISEN= 128
##$LB= 0.25
##$LEV0= 0
##$LPBIN= 0
##$MAXI= 10000
##$MC2= 0
##$MEAN= 0
##$ME_mod= 0
##$MI= 1.114404
##$NCOEF= 0
##$NC_proc= 0
##$NLEV= 6
##$NOISF1= 3.799351
##$NOISF2= 2.8
##$NSP= 1
##$NTH_PI= 0
##$NZP= 0
##$OFFSET= 14.38212
##$PC= 1
##$PHC0= -468.3897
##$PHC1= 16.79222
##$PH_mod= 1
##$PKNL= yes
##$PPARMOD= 0
##$PSCAL= 0
##$PSIGN= 0
##$REVERSE= no
##$SF= 200.129724274929
##$SI= 16384
##$SIGF1= 3
##$SIGF2= 2
##$SINO= 400
##$SIOLD= 16384
##$SREGLST= <1H.CDCl3>
##$SSB= 0
##$STSI= 0
##$STSR= 0
##$SW_p= 3205.1282051282
##$SYMM= 0
##$S_DEV= 0
##$TDeff= 0
##$TDoff= 0
##$TI= <>
##$TILT= no
##$TM1= 0
##$TM2= 0
##$TOPLEV= 0
##$USERP1= <user>
##$USERP2= <user>
##$USERP3= <user>
##$USERP4= <user>
##$USERP5= <user>
##$WDW= 1
##$XDIM= 8192
##$YMAX_p= 0
##$YMIN_p= 0
$$ End of Bruker specific parameters
$$ ---------------------------------
##NTUPLES= NMR FID
##VAR_NAME=  TIME,          FID/REAL,        FID/IMAG
##SYMBOL=    X,             R,               I
##VAR_TYPE=  INDEPENDENT,   DEPENDENT,       DEPENDENT
##VAR_FORM=  AFFN,          ASDF,            ASDF
##VAR_DIM=   8192,          8192,            8192
##UNITS=     SECONDS,       ARBITRARY UNITS, ARBITRARY UNITS
##FACTOR=    0.0002768,     1,               1
##FIRST=     0,             0,               0
##LAST=      2.2672688,     0,               0
##MIN=       0,             -143706,         0
##MAX=       2.2672688,     130352,          0
$$ Real data points
##PAGE= N=1
##DATA TABLE= (X++(R..R)), XYDATA
$$ [...]
1866D22L67m88j23qj01M8o73L89M3j65k20O4j0L34j55J33j48K93L25p9O7J06Q1
1889E02M3j18j85j9l52j29J19l02j58M17l48L47j27J79Q1k00L79J31m9M52r0l84
1911A89K43j37k70L25j31l49k93O8k03J23p7jK72J56j45K12j99L34J74K33j03
1932D21j68M81n9k60j51r2l42J60l08j79J38j15k3j32L81j50M6M22J68J32l2K94
1954F32j37Np3k49P1l03R0P8k68m96K37kN9J53j19J19J42J48J73PN1K53l47J16
1978C40%pj40j86k6K2o06J72j38M86k32q1q5J87L21L17j06QL09p4k19j04L86j31
2002D13l69Ll21K57j39r1J07l73P3J13j6j33M40J4P5K31K73k5j57j92o7K70k3
2025C63k10l42L09l34l1r9j01J46j3j51R5L11k52L60K6L57O8p4l6k99K17j05R4
$$ plain form
1866 422 789 301 178 170 69 117 -556 -167 -124 -289 -509 -445 -455 -121 -276 -143 -291 2 327 248 315 421 502
1889 502 545 427 242 223 -129 -258 -139 -441 -599 -182 -530 -183 -310 -131 -50 -250 129 260 211 663 573 189
1911 189 432 295 25 350 219 -130 -423 -355 -558 -435 -512 -513 -241 -85 -230 -18 -217 117 291 524 421
1932 421 253 734 675 415 264 172 -170 -10 -318 -497 -359 -474 -497 -629 -248 -398 -352 70 238 370 338 632
1954 632 495 500 427 178 249 -54 36 114 -154 -650 -413 -415 -356 -203 -322 -203 -61 87 260 267 318 571 224 340
1978 340 340 333 193 7 -19 3 -603 -431 -569 -83 -315 -396 -481 -294 27 344 238 246 555 481 262 158 544 413
2002 413 44 47 -274 -17 -156 -247 -140 -513 -440 -327 -343 -476 -36 -22 53 284 557 532 375 183 116 386 363
2025 363 153 -189 120 -214 -245 -344 -445 -299 -312 -463 -368 -57 -309 51 77 434 502 428 392 93 310 205 299
2048B99m64P5k07m0N0r6o4K04R9J45k52J87Q3K09o7J79j28J93K14l32J95m46j63
2071a27q3n8J12k89j56J29P1l2K23q9K28JK24p7K50j23L63k65l1k02K34j19k88
2094a04K3l06J25q5nJ40Q4NR2N34k60l44J69R4K04n0R8j04J52m15K2j11k17j8
2118b77k55J67K08j67J81j89J20L80k13J27K25N8m06L96j99J23J32k6n59Q1j19
2139b12q1L5j30J73o8QQ6P2J45J26k71K49J07K8O2k62L12l25j51L0K57l05j95
2162c10J95l35j38N76l20K57k20K00j55L59j3L3L09k66J46J84l91j96K14m43J7
2183b97L23j11j36k8R9j31J36P3j10M50K5j26j31K46k32N2J32k65L21m07j80J74
2205a23J14k1p0N1j79P7k7k3L90j44L85m02N2m8N08j8m01p9K80k34j1j60J9lj18
$$ plain form
2048 299 -165 -90 -297 -337 -287 -383 -447 -243 -144 1 -251 -64 19 228 161 340 212 405 619 287 482 36 -127
2071 -127 -210 -268 -156 -445 -601 -472 -401 -433 -210 -299 -71 -70 154 77 327 204 567 302 271 69 303 184 -104
2094 -104 -81 -387 -262 -347 -352 -212 -128 -123 -31 503 243 -101 68 162 366 316 414 310 462 47 69 -42 -259 -277
2118 -277 -532 -365 -157 -324 -143 -332 -212 168 -45 82 307 365 -41 355 156 279 411 385 -174 -93 -212
2139 -212 -293 -258 -388 -215 -283 -275 -189 -117 28 154 -117 132 239 267 329 67 379 54 -97 -67 190 -115 -310
2162 -310 -115 -450 -588 -12 -332 -75 -295 -95 -250 109 96 129 438 172 318 502 111 -85 129 -314 -297
2183 -297 26 -85 -221 -249 -150 -281 -145 -72 -182 268 293 167 36 282 50 102 234 -31 290 -117 -297 -123
2205 -123 -9 -30 -100 -49 -228 -151 -178 -201 189 45 430 28 80 32 540 522 121 42 322 88 77 -83 -64 -67 -185
2230a85J83j56Qk96L58J0J26K6K51m84L03J85j73j7R4j55k26K41Jk39r4l80N54
2253f5o6J21k58k5K65J52m8P2k61O8j37L29J50K2l6P8k26k34m2J94n3k7J52k19
2277i4j71K47J97j79M9R1K31k88JJ84P7k44J68p9o58M98k16km5N4p2K27j22J22
2301b4j87R5L57l29J86O0r4j28K92L5O1k36k08K59j1q1p1n2R5M8kj17K25k14N3
2326A2j0M6J28q3j01q0L55j75mO6l26J87kq6P0R1k9k9k93J93j16k4J4j28L17O6
2352E9l6N2o9m7K48j80P6k75M6k6j85M75k02l4k5k0r9n5K50K05j55n0J29o0K3
2377D5m8J09J54k66K3N7k73j28K76k57Q3p8K22o8O1K33j59k03M91p1j50k18K71
2400A06L5l86K85QN7o2Mj18P0j65j78J88K6j5n5J71J79k06n5L73j76K10l22J13
$$ plain form
2230 -185 -2 -158 -150 -446 -88 -78 48 74 325 -159 144 329 156 139 233 78 -148 93 94 -145 -239 -619 -65
2253 -65 -131 -10 -268 -293 -28 124 76 148 -113 -45 -182 147 297 319 283 361 135 -99 -141 53 0 -27 125 -94
2277 -94 -265 -18 179 0 49 140 371 83 84 268 345 101 269 190 -468 30 -186 -188 -233 -179 -251 -24 -146 -24
2301 -24 -211 -116 241 -88 98 158 64 -64 228 263 324 88 -120 139 128 47 -24 -76 19 67 65 -52 173 -41 12
2326 12 2 48 176 93 -8 -88 267 92 88 154 -172 15 13 -73 -3 88 59 30 -263 -70 -186 -210 -196 -324 -7 59
2352 59 23 75 6 -41 207 27 103 -172 -126 -152 -337 138 -64 -98 -123 -143 -242 -297 -47 158 3 -47 82 22 45
2377 45 -3 106 260 -6 17 74 -199 -327 -51 -308 -225 -303 -81 -149 -88 145 -14 -217 274 203 53 -165 106
2400 106 141 -245 40 48 105 43 47 -71 -1 -166 -344 -156 -130 -145 -200 -29 150 -56 -111 262 86 296 -26 87
2424H7Q6l2p8J4K6l30Q1K8j15J07Q6J55q5J14P8P1m06L48k08J79j86k0j3nJ10
2449I2m12N62j03n37M89p6M4j9k43J66n6J47K01l55J63J22j58K09j09l21O7K31
2471A04Lj66%J61k46n3L72l03l2K07K17J16k54k1J33j51J11j33L4k59J57N6q2
2494b9J15l00J20K72j30M9l05K69J4L7j48J07J0J50j85J80j51n2o5K56j78N5j42
2517e1q4k0K4L12j80j36J12jL1J82j89K02k61kK10O2J0j59p1n7P9Q2j24k94J57
2542a66J37k11K27O5J9m9j50K98l87M14j85m0j35L11j64J57j73k37mK2K69J05
2564A23j4j58K08k91K78k50R3N0K76k61J30j84k70K84J23mj93n0Q5qn9pK46k89
2588a42N2K4m9J64K2P9k53L08Q2l69L21o4k59m2K40O3j40r7l33J96O3J20K3K10
$$ plain form
2424 87 173 141 63 77 103 -227 -146 -118 -233 -126 -40 115 30 144 222 293 -113 235 27 206 20 0 -13 -18 92
2449 92 -320 242 139 -398 91 15 59 40 -203 -37 -93 54 255 -100 63 185 27 236 127 -194 -127 104
2471 104 107 -59 -59 102 -144 -197 175 -128 -160 47 264 380 126 105 238 87 198 65 99 -160 -3 53 -29
2494 -29 86 -214 -94 178 48 97 -208 61 75 112 -36 71 81 231 46 226 75 23 -42 214 36 91 -51
2517 -51 -135 -155 -131 181 1 -135 -23 -24 7 189 0 202 -59 -61 149 211 221 62 -9 -66 13 95 -29 -323 -166
2542 -166 -29 -240 -13 52 71 22 -128 170 -217 197 12 -28 -163 148 -16 141 -32 -269 -273 -251 18 123
2564 123 109 -49 159 -132 146 -104 -11 39 315 54 184 0 -270 14 137 133 -60 -110 -25 -33 -92 -99 147 -142
2588 -142 -90 -66 -115 49 71 150 -103 205 287 -82 239 175 -84 -126 114 177 37 -60 -393 -197 -134 -14 9 219
2612B19m05P5r6J85L33l62J79k77J2P3K04j74K24q8j29pj24K23n2j74L23j24L5
2635G3Qm3k9k1j20P4n3K1O5k24L44j82J76k95K19n8r4J35R8j69K57r2J0l66L32
2660F6j80K03j28J43K37k07j20k7j39P5K15l47J03r2J50K84k21K77l64m3J31j56
2682a40Q1K4r0J95J32l56M77j88k00r5K3L56k77k6P6K06j96M8MQ1n28K89K60l39
2706a83K94p4K1k31K6J00J30Q9k47j24k0M89j83P0l93J07J73k78K43J91n7l35
2728a92J51J23l02N61l56L2r6j67J94K11J82l22J91l05m8P7Q0n1qJ73l35K94k66
2751a79K82q4j52K49k39k6RJ52k70K83j31q5L32l66L1L30J1l58K21J31m0j40J29
2774I0j05J3J6q4L50j69l79L65l6j4K23j59j47K31Pr4p0K49k01N2Q3r5j73j15
$$ plain form
2612 219 -186 -111 -207 -22 311 -51 128 -149 -137 -64 140 -34 190 102 -27 -34 -158 65 13 -161 162 38 73
2635 73 81 38 9 -12 -132 -58 -111 -90 -25 -249 95 -87 89 -206 13 -45 -139 -4 94 -75 182 90 100 -266 66
2660 66 -114 89 -39 104 341 134 14 -13 -152 -77 138 -209 -106 -198 -48 236 15 292 -72 -115 16 -140
2682 -140 -59 -35 -125 70 202 -154 323 135 -65 -160 -137 219 -58 -84 -8 198 2 50 54 135 -393 -104 156 -183
2706 -183 111 37 58 -173 -147 -47 83 172 -75 -199 -219 270 87 157 -236 -129 44 -234 9 200 143 -192
2728 -192 -41 82 -220 341 -15 17 -79 -246 -52 159 341 19 210 -95 -143 -66 14 -37 -45 128 -207 87 -179
2751 -179 103 19 -133 116 -123 -149 -140 12 -258 25 -106 -191 141 -225 -194 136 147 -211 10 141 101 -39 90
2774 90 -15 -2 14 -70 280 111 -268 97 61 47 270 111 -36 195 202 108 38 287 86 138 221 126 -47 -162
2798a62J00Q1r9m9Q7Q2p9j3K54k27j34L30j62J50p2k18N7M0p2j04J4K54k40Q0
2822a02J17mM1J1j72J35j43K50r9j88K84j04q6K9n0J41j48j4r1J77J57l52K32
2845B1J51p5R2q3r8j7J35k31O4J53m2j6k03K07n5J44r8r6k07J93n2m7J65K54m48
2870a89L36P4l70Q1j69M03q2j44N0j94M12Q1m79K0J71j37qL35m14J02Q6j15K20
2893G0o8K1k4k9j00oJ70o1n7qJ17j47K2J06k24J24M00n59L53m12J27K18OL2K01
2918B72l30K9K90m88K19K6rJj2m4l0p2J81P3j55l03K45J94j0J72j71P2j04P6j97
2943g5k40L56j09O8k5N4j97M24l83j92O7K92k3k55K95k79J50K48r8m0K88j09j64
2966E3M1o2q6L81n11L52j24j65K62l92M08j82K40j98J41p9k9k44J95J76l49J50
$$ plain form
2798 -162 -62 19 -80 -129 -42 40 -39 -52 202 -25 -159 171 9 159 87 -131 -74 -34 -106 -210 -196 58 -182 -102
2822 -102 15 11 52 63 -109 26 -117 133 34 -154 130 26 -60 -31 -81 60 -88 -102 -193 -16 141 -211 21
2845 21 172 97 189 106 8 -9 126 -105 -41 112 70 54 -149 58 3 147 49 -47 -254 -61 -113 -160 5 259 -189
2870 -189 147 221 -149 -68 -237 166 84 -60 -10 -204 208 289 -190 -170 1 -136 -144 191 -223 -121 -35 -150 70
2893 70 2 23 -1 -30 -130 -136 34 -27 -84 -92 25 -122 -100 6 -218 -94 306 -253 100 -312 -185 33 39 71 272
2918 272 -58 -29 261 -227 -8 18 9 10 -2 -46 -76 -148 33 106 -49 -352 -107 87 77 249 78 150 46 122 -75
2943 -75 -315 41 -68 0 -25 29 -168 256 -127 -319 -252 40 17 -238 57 -222 -72 176 78 38 326 217 53
2966 53 94 32 -54 327 -184 168 44 -121 141 -251 157 -25 215 17 158 79 50 -194 1 177 -172 -22
2988b2J65l3k89K78P8j34j08K5p8j01K8O8J55M5R2k65J72m2K11o6pj76j77K49
3012F8j54P9n5m3J06J4j44L62j51N6k18o0L03j26k13J76N7m2J70K2q1l88J26M9
3036h7oj8j58L65j22J5J31q6J17l36K54k8l8j02M80rk12p5k18J89l48M07k38J49
3060B6O0QL1k69L91k79N7K66p7O8m39R2R2p0l7K23k15L81l17K26m10j32O18n50
3084b56K50K22j18j95L23l74P1L51k64N5k54J59NJ30m1j31l2j28M61l25jL4j02
3107a60K82J0j87n8J16J10Q3p8k62J70L2l1N5ok90J89K78l20j4K45j52j77J44
3130b1j19K11l57K2J56O5L4J92l34J93j0k12L11l2J95l63j31N68n43J35J17j54
3152g7J66k49J85j81J6o6M4N2J42L2J1k83K51j62K78l98M14k02k54N04m59N67
$$ plain form
2988 -22 143 110 -179 99 177 43 -65 -40 -118 -219 -191 -123 32 77 169 -96 76 34 245 179 172 -4 -181 68
3012 68 -86 -7 -62 -105 1 15 -129 233 82 138 -80 -140 163 37 -176 0 57 15 185 207 126 -262 -136 -87
3036 -87 -93 -111 -269 96 -26 -11 120 34 151 -185 69 41 3 -99 381 372 160 85 -133 56 -292 115 -123 26
3060 26 86 94 125 -144 247 -32 25 291 214 282 -157 -65 27 -43 -80 143 -72 309 -8 218 -192 -324 294 -256
3084 -256 -6 216 98 -97 226 -148 -77 274 10 65 -189 -30 -25 105 64 -67 -99 -227 234 -91 -92 -58 -160
3107 -160 122 132 -55 -113 3 113 196 118 -144 26 58 27 82 76 -214 -25 253 -67 -81 164 12 -165 -21
3130 -21 -140 71 -286 -264 -108 -43 -9 183 -151 42 32 -180 131 99 294 -69 -200 368 -175 -40 77 -77
3152 -77 89 -160 25 -156 -140 -206 -162 -110 32 64 75 -208 43 -119 159 -239 175 -27 -281 223 -236 331
3174C31o35M84k68Q9np1L9J85n6m9J50n9k13J20k22M3J0K86m8r1lp0J94j17k62
3199b38K20L71l53J4j85K52k73J82k71L50J34k70K37m05J56k6K1o2M4N2J02j43
3221i1n9J45R7r8j22L13l31Q1K59p0j68M25n7k81l6J85l2k35L04k30j14K39j79
3244e5K7m3K62k57L9j08L10J03m55Q4N2r9K45Q3l20K18k94K11J02k51K23m8j07
3267g8j21K96k46K31l3j07m9l6R6k3K10r0J01k04q1L30m94J02K23j31j96L25O8
3290I3J14k19M8J56n7K4j74L03l36K21r3N2p1k0n2j4r3R7M7l5k93R1L09j83R1
3315Fn2R5k77J16K45P1j82M3N0J0k56K17J2j89rr2J60k04J37J1O0Qj11j7R3L0
3341b5Q6o4j01P5K07j59Pj74P7L10k43k12J32JJ66r2k31R4M26k26j13Q6qM8K9
$$ plain form
3174 331 -304 180 -88 1 -4 -75 -36 149 93 44 194 135 -78 42 -180 -137 -127 159 111 20 17 -53 141 24 -238
3199 -238 -18 353 0 14 -171 81 -192 -10 -281 69 203 -67 170 -235 -79 -105 -84 -146 -102 -50 52 -91
3221 -91 -150 -5 92 -6 -128 185 -146 -65 194 124 -44 381 324 43 7 192 160 -75 229 -1 -115 124 -55
3244 -55 -28 -71 191 -66 -27 -135 175 278 -177 -93 -41 -140 105 188 -132 86 -208 3 105 -146 77 29 -78
3267 -78 -199 97 -149 82 49 -58 -107 -143 -47 -70 140 50 151 -53 -134 196 -298 -196 27 -104 -300 25 93
3290 93 207 -12 36 192 135 159 -15 288 -48 173 80 132 61 41 -11 -25 -118 -21 26 -9 -302 -211 98 -85 6
3315 6 -46 49 -228 -112 133 204 22 65 115 125 -131 86 98 -91 -100 -192 -32 -236 -99 -88 -28 -20 -131 -148 -55 -25
3341 -25 61 -3 -104 -29 178 19 26 -148 -71 239 -4 -216 -84 -83 83 -9 -240 -146 280 54 -59 27 19 67 96
3366I6N0j12n7J42Nk28J92N9k94J29j95J49J81j10M0j23L53k35Q1j52J30q7l7
3389b3k01j59L51J90O4k06p6l84N67k78O7J68j20J21q2j40R7M1R5o0rK22n84L52
3413A3m2J31o3J88k64L14p7m34J0K08p6p8K90k21J55K21k07j4R5k0J10k34q2j02
3437a79Q5J5j65R5L75k84k93L74k3j08J78k02J85J7J89l08N4L21k48o6l47M77
3459A42j45j7J44l27J67k6J00n5L9k6M1j84J87J37j0j73j29J62j42K99j37j40
3481i3n0J34j10M0K55j68M4l8Q4k08L66j09m27K07M21k96R3m34L79j39j39K87
3503I9J06j20j8J4r5J10k17J80j04J02j82M67k93n0O5j31J62j31K04k13j12o0
3525b17J83j74N3K16J39j55j01L6j70R2P6K06j66L4j52L44k60j05K38Op5L6j6
$$ plain form
3366 96 146 34 -23 119 124 -104 88 147 -147 -18 -213 -64 117 7 47 -76 277 42 123 -29 101 14 -23
3389 -23 -224 -383 -32 158 222 16 -60 -444 123 -155 -88 80 -40 81 -1 -141 -44 -3 92 32 23 245 -339 13
3413 13 -29 102 39 227 -37 277 200 -234 -224 -16 -92 -170 120 -101 54 275 68 54 149 129 239 5 -77 -179
3437 -179 -94 -79 -244 -149 226 -58 -351 23 0 -108 70 -132 53 70 259 -49 5 326 78 12 -335 142
3459 142 -3 -20 124 -203 -36 -62 38 -17 22 -4 37 -147 40 177 167 -6 -135 27 -115 184 47 -93
3481 -93 -143 -9 -119 -79 176 8 52 14 98 -110 256 147 -280 -73 348 52 145 -289 90 -49 -188 99
3503 99 205 85 67 81 -14 96 -121 59 -45 57 -125 342 49 -1 64 -67 95 -36 168 -45 -157 -217
3525 -217 -34 -208 -155 61 200 45 -56 -20 -190 -98 -22 184 18 52 -100 244 -16 -121 117 123 48 84 68
3548F8K00l77K18j12j05K9o9N0K57k18O0J50k74L02P3k62J06J4j35O5k81M55l21
3571a07J61j67N9K41l3k21ok98K56n3P7J7j09M15Q1k76R3L0l60J60O0o8K27Ok83
3596i8K95l64J8n3J36o5J27p1M5J02J86n6j35m71O90j84o0n3j87M4J34l2M95n05
3620f2K43%l92J91J49k40J62j80J40j90K47j50J62q4R3J41l61P2RJ84j43K43l68
3643a34K49m7r6P0L5L5k59RL48q6r9J96K4k46M7l25K77k20J33J76o6l7RJ86j03
3668G6j4J12O0k39j4L9j29J23j5K0J76l4q8j51k48K01K13m16L81r5l5J43j38p0
3692a42l7K29L84m21p9Q7j81J91k31m8L99n09M64j41k1P9j30j57J85K19K7j62
3714EN2%K26j90j39O8j34J04j50M2j17L26j14J09k96L02j50K0Q4J30mj3l99L62
$$ plain form
3548 68 268 -109 109 -3 -108 -79 -148 -98 159 -59 1 151 -123 179 252 -10 96 110 -25 40 -241 214 -107
3571 -107 54 -113 -54 187 154 -67 -73 -371 -115 -168 -91 -74 -183 232 313 37 130 160 -200 -40 20 -48 179 185 -98
3596 -98 197 -167 -149 -202 -66 -131 -4 -75 -30 72 258 202 67 -404 286 102 42 -11 -198 -154 -20 -52 443 -62
3620 -62 181 181 -211 -20 129 -111 51 -129 11 -179 68 -82 80 -4 89 230 -131 -59 -50 134 -9 234 -134
3643 -134 115 68 -28 42 77 112 -147 -138 210 124 25 221 245 -1 46 -279 -2 -222 -89 87 21 -16 -7 179 76
3668 76 62 174 234 -5 -19 20 -109 14 -1 19 195 161 73 -78 -326 -125 88 -328 53 -42 -77 66 -72 -142
3692 -142 -179 50 434 13 -66 21 -160 31 -200 -248 151 -358 106 -35 -56 23 -107 -264 -79 140 167 5
3714 5 57 57 283 93 -46 22 -112 -8 -158 -116 -233 93 -21 88 -208 94 -56 -36 48 178 174 161 -238 124
3738A24J58l06j54L93l27n8J89j36r1L14j81R8j49J67J28k56J29Qo5m9K17k74
3760a21K34k76K50l10L57k63L44j48R8j54J1l6R2q8J33k2l52L42J13l01Q5J03
3782I1j94J85J64k79j00N70n13J6nJ54j11J39j23Jj53J94l44M00o0j97j9j82N42
3805A76j90J36l99M38k74K25J39j34k08RM5q3M2J33Pj79J58r4K02k53Q1K23o7
3828A33k80r5K66Q5m5l0J62m81J76L85j25l35J17N3L10k70q6N2N5K5q3k5j78J98
3852a6P0n1q3J63O1k88J29J04j58j01r5J71R7j25J41l8J35K23k55R1l23Q6l3M84
3876C89l39P2k48lR2r8J25j4K09k29J45p5j34J67r7o8Q3j13J9K06m3J6J2l24J8
3901b32K9O3J0L36n7r1J39m60N5K56mk51L49j86j9J18K97m17r6O3K56l82P1K86
$$ plain form
3738 124 282 -24 -178 215 -112 -170 19 -117 -208 106 -75 23 -126 41 169 -87 42 50 -15 -64 153 -121
3760 -121 113 -163 87 -223 134 -129 215 67 165 11 22 -14 78 -10 123 101 -251 91 204 -97 -12 91
3782 91 -103 82 246 -33 -133 437 -76 -60 -65 89 -22 117 -6 -5 -158 36 -308 92 32 -165 -184 -366 176
3805 176 -14 122 -277 161 -113 112 251 117 -91 -82 -37 -120 -78 55 62 -117 41 -53 149 -104 -23 200 133
3828 133 -147 -242 24 109 64 34 196 -285 -109 276 151 -184 -67 -14 296 26 -60 -8 47 72 -11 -36 -214 -16
3852 -16 54 3 -80 83 144 -144 -15 89 -69 -170 -265 -94 3 -122 19 -19 116 339 84 175 -148 -62 -95 389
3876 389 50 122 -126 -129 -37 -135 -10 -24 185 -44 101 26 -108 59 -38 -106 -23 -136 -117 89 46 62 74 -250 -232
3901 -232 -203 -140 -130 206 149 58 197 -263 -208 48 44 -207 142 -44 -63 55 352 -65 -161 -98 158 -224 -153 133
3925A33j80Q3M6q3o6k12M10LK8j00j63L25l29j99K76K46j56Ko8l1N0r6J31mO0
3950A06j13J68j06j61Rj0L21k29K43o3q2j44J24j98Q8M6J13K42n14l4J76n1R7
3973B8j79J08j27JJ42j38O1R5M04m98K49k65j48L93k35o6J17J30j07j58J26Q3
3995A6R%n6p7J73j93J35j26l8J06j61L08J10j96j25J76M2j30Q5j42j1K41k70r5
4019b19K35j07p9Q0l9K48K9j70o7q3K94j34K70n69K54o2K63j28q7n3%P6%M1J4
4044GJ9j95rL33j38r7J11j7J00k34K6K44J07k52L04m34L9J74l2r9J65j91J90N2
4068A73k77J13M7J77k14l62N08K7j98K21k49J38j83L6Op2P7J44j11k21K31k66
4090b55M22k81K54q5k3j86n8L80k30K20k25J59j26K23N2l88r4L86j11j05j32J55
$$ plain form
3925 133 -47 36 82 -1 -67 -279 131 134 162 62 -101 224 -105 -304 -28 218 62 64 -4 -35 15 -81 50 46 106
3950 106 -7 161 55 -106 -97 -107 214 -15 228 165 83 -61 63 -135 -47 -1 112 354 -160 -194 -18 -69 28
3973 28 -151 -43 -170 -169 -27 -165 -104 -9 395 -103 146 -119 -267 126 -109 -175 -58 72 -35 -193 -67 16
3995 16 25 25 -31 -108 65 -128 7 -119 -157 -51 -212 96 206 10 -115 61 103 -27 58 -84 -95 146 -124 -219
4019 -219 16 -91 -170 -90 -129 119 148 -22 -89 -172 122 -12 258 -311 -57 -119 144 16 -71 -124 -124 -48 -48 -7 7
4044 7 26 -169 -178 155 17 -80 31 14 114 -120 -94 150 257 5 309 -125 -86 88 56 -43 122 -69 121 173
4068 173 -104 9 56 233 19 -343 165 192 -6 215 -34 104 -79 -43 -37 -109 -32 112 1 -220 11 -255
4090 -255 167 -114 140 55 32 -154 -212 168 -62 158 -67 92 -34 189 241 -147 -241 145 34 -71 -203 -48
4112d8l7L10p4k96J05M09m88r0L11k68K29l6n1j5MJ91n4K01l16Oj2j86J56j28
4136a77L77k92L6n3K17J44m10O0R1j77J38l9L68p7kK7l04L51k38j90MJ1K42j72
4160f5J26p8n6L4j18J86l99R7L89k07J89k74L1K57o8L3l83L08J54j95L6L0k14
4183a87J29J88j66k59K01q7P7M04k07k93K03M9j49j3qJ80l17L05k07o1K79j79
4205a18rq3L25m5N2l88M80j55j09p7K04j14K40l58K56o9P6j24n1oj23K69l66L01
4229HK72k20j90L25k48%J42l2J6j70J69j64K67k66M3k7Ml7j05K20j54M43k39j04
4253d7j29j58K17J53R7qM2k87l89O25j30N3j34P5k1L4j60o8K51L1j03J11p9j57
4277a81J79m7J76K2k67P8R7l8p0j94M58l19J05J39j17L9j32m6J80P3j51K83m20
$$ plain form
4112 -48 -85 225 151 -145 -40 369 -119 -209 102 -166 63 27 -24 -39 -35 156 102 303 -13 -7 -19 -205 -49 -177
4136 -177 200 -92 -56 -109 108 252 -158 -98 -7 -184 -46 -85 283 206 204 231 -73 278 40 -150 -146 -135 107 -65
4160 -65 61 -17 -73 -39 -157 29 -370 -273 116 -91 98 -176 -145 112 44 77 -306 2 156 -39 -3 27 -187
4183 -187 -58 130 -36 -295 -94 -181 -104 300 93 -200 3 52 -97 -110 -118 62 -255 50 -157 -218 61 -118
4205 -118 -127 -210 115 70 122 -266 214 59 -50 -127 77 -37 203 -155 101 32 108 -16 -67 -73 -196 73 -293 8
4229 8 280 60 -130 195 -53 -53 89 57 73 -97 72 -92 175 -91 -48 -75 -71 -108 -213 7 -147 296 57 -47
4253 -47 -176 -334 -117 36 133 125 167 -120 -509 116 -14 39 -95 -20 -41 -7 -167 -235 16 47 -56 55 -24 -181
4277 -181 -2 -49 127 149 -118 -40 57 19 -51 -245 213 -106 -1 138 21 60 -72 -118 62 135 -16 267 -153
4300a53M5n3K83j78j9k62M4L57j3k17L3n2J31K47j61Q0M9j46k5k64n8N11l88J66
4324d3o7M4J10n48N12KRp8l1P8j30K51l75J66%m0K48k24J21N4o7k11J25L30k19
4349A7R3Q9k26K5M8k35J64K02k70j28j05K33J63k14K16j54N6K02k67O9q0J76j27
4372e3N6q4K6K67n35R9L44k86j4O0K08j99J5K77k71P4R0p8nq5M1J83N8k29K20
4397A79j17l3J82j27j80K51q9k17N4j05J77K67l77J49j14j14M37j56q5j18P8%
4419e8J41O2j57k83J65r9K82J5K0l5J44j84j02J09o3j43K15r0K14j28Q2j28J75
4442A54l46J13K44O2k35l25M18J01k92J70j94O9J36j19j3r9PJ01J35k09J83K60
4464C21k56j21M5M7k86L50m39M31j46J73j06j10j56J60K74j23J9J86l29Ok42K90
$$ plain form
4300 -153 -108 -161 122 -56 -75 -337 -293 64 51 -166 -133 -185 -54 193 32 112 161 15 -10 -274 -332 179 -209 -43
4324 -43 -110 -66 44 -504 8 10 19 -59 -90 -12 -142 109 -266 -100 -100 -140 108 -116 5 59 -8 -219 -94 236 17
4349 17 110 199 -27 -2 46 -189 -25 177 -93 -221 -326 -93 70 -144 72 -82 -26 176 -91 -22 -102 74 -53
4372 -53 3 -81 -55 212 -323 -224 120 -166 -180 -120 88 -111 -96 181 -90 -16 74 -4 -9 -94 -53 130 188 -41 179
4397 179 62 29 211 84 -96 155 66 -151 -97 -202 -25 242 -135 14 -100 -214 223 67 -18 -136 -58 -58
4419 -58 83 145 -12 -295 -130 -229 53 68 88 53 197 13 -89 20 -43 -186 29 -61 153 25 107 -21 154
4442 154 -192 -79 165 227 -8 -333 85 186 -106 64 -130 -61 75 -44 -57 -156 -149 -48 87 -122 61 321
4464 321 65 -56 -11 36 -250 100 -339 92 -54 119 13 -97 -253 -93 181 58 77 263 -66 -60 -302 -12
4486a2K18Mj65J44n9l8n4ll12J64L7o4J72J05l49K45j51j7O8L06j09m2n2o4J71
4511A43j4l3j95J08j66L92j82j1j90J85J8k4J33j69K91j61k73K01k26R3L08k75
4533d7P5p8P7J32j8j68J62j65J03k54J32J16q8j5k7J91k05mJ95J10K2l71QL92
4557B75l23L21l58K01j70l13M17K20m50J46l1n4J96J12k20j31J52R6j91K13j35
4578b7R8Q9l48J98Mj55J23j05J02J92l61L10l5l3P4J14j40p0K8N4j60J09j68L40
4602B33n58L33o5J33o0j2M6r4pj57N11k62J90j50lP3k77j6L46j09M1k96M70j73
4626A37k38J72j43o0J38k98K55K32r0j56K85pk97q9L2j0j35L75l3m6r4K67J17
4649C14l81L21l28J32o4j14m7J58j04o2J95J49j23j9J65j77j60J0J3J09j47L93
$$ plain form
4486 -12 206 210 45 189 130 92 38 35 -277 -113 -76 -140 32 137 -212 33 -118 -135 -67 239 130 88 36 -28 143
4511 143 129 96 -99 9 -157 235 53 42 -148 37 55 31 164 -5 286 125 -148 53 -173 -80 228 -47
4533 -47 28 -50 27 159 141 -27 135 -30 73 -181 -49 67 -21 -36 -63 128 -77 -81 114 224 246 -125 -117 275
4557 275 -48 273 -85 116 -54 -367 50 270 -180 -34 -65 -119 77 189 -31 -162 -10 86 -105 108 -27
4578 -27 71 160 -188 10 14 -141 -18 -123 -21 171 -190 120 85 52 126 240 100 30 58 112 -48 61 -107 233
4602 233 -325 8 -57 76 16 4 50 -44 -51 -208 303 41 231 81 78 151 -126 -142 204 95 136 -160 310 137
4626 137 -101 71 -72 -132 6 -292 -37 195 105 -51 234 227 -70 -159 -127 -137 -272 103 70 24 -70 197 314
4649 314 -67 254 -74 58 -6 -120 -167 -9 -113 -175 20 169 46 27 192 15 -145 -135 -122 -13 -160 233
4671B33l50j40L29kk49L35m4j49k6L18j98M8j34P2k2Q3p1p0K52r3j1j25O8l92
4695c38L81j66R4J52o6r8qM1J1L41n14J07p3J4K21k5q3J17l93N91j60J0k23Oj8
4720g9k65L12PL05n63L76l00o5K92j35L33l92l3L35l06K26j57J85l4j88J99J4
4742F7J51j10k05n8R1R6K02p0r6o2r3J96J95k52k02k53L85o2R3K8K7j19j96L15
4766F8j10R4K40m56J02m0O5j4j2kL20l85n0K86K9l32M07l71J61j10q9L16j02p8
4790f3Q5J46M9k34J66j17M7NQ5J5m53L63l14Q1k53M23J33l06K02j64J84m1P9k17
4814i9j22J15K6r2K44k54J93k07M07l66K84J48j52j31RK22k47K2j06Q4j9J20K26
4837C05l44K35k50j1K14m38O7K36m9j61K27K8l00K70L16m24J19N6J64K22n22J99
$$ plain form
4671 233 -117 -257 72 70 -179 156 112 -37 -63 255 57 105 -29 43 21 104 33 -37 215 122 111 -14 54 -338
4695 -338 43 -123 -29 123 57 -41 -49 -8 3 344 -170 -63 -136 -122 99 74 -9 108 -285 306 146 156 -67 -61 -79
4720 -79 -344 -32 -25 280 -283 93 -207 -272 20 -115 218 -174 -207 128 -178 48 -109 76 42 -146 53 67
4742 67 218 108 -97 -155 -64 32 234 164 68 6 -87 109 304 52 -150 -403 -18 -80 13 41 68 -51 -247 68
4766 68 -42 52 292 -164 -62 -102 -37 -51 -63 -65 255 -130 -180 106 135 -197 210 -161 0 -110 -199 117 15 -63
4790 -63 22 168 217 -17 149 32 79 84 169 184 -269 94 -220 -139 -392 31 164 -142 60 -104 80 39 118 -99
4814 -99 -221 -106 -80 -172 72 -182 11 -196 211 -155 129 277 125 -6 3 225 -22 0 -106 -22 -41 79 305
4837 305 -39 196 -54 -65 149 -289 -222 14 -35 -196 31 59 -241 29 345 -79 40 96 260 482 -40 159
4859A59l14RK29j89K2J20J03j05m3K2J41o4k95L55k51R4K7k41K13k03R7P4R1P3
4883A24j84p0J52oj31MM7J50m0q7J34l2R8l4Q8k29j52K25J75l23Q6J07j13q5K29
4908A33k07L4J40k19M1J78K8j20m2J13m4J37k16L76l08k08O8L79k77J77O6k63
4930c4J61n8J7k40J4m4M44n5k75j29J12K8k05N66j07l07o6j9L54j48R3k27Q0P5
4954C0J27j59J06k84K50j87L15m46L3K44J94k72J99mr6k46R7J33p0O3n2j13j30
4977b68K00J15L04l96j08P2K07J01k59K03o2oL8k11J11m4K75m74N38n3m84J92
4999ij79J62j9NJ41k18l3K06O2j44K9J13N8j23l16J61J73j35P0K19j35J14l78
5022a76J31j14K41q0j04m3K07j5K4j15Kl21O33J27p48M35k3M7q4K47l42K9L02
$$ plain form
4859 159 -155 -146 83 -106 -84 36 139 34 -9 13 154 90 -205 150 -101 -7 20 -221 -8 -211 -114 -40 51 124
4883 124 -60 -130 22 16 -115 -111 -64 86 46 -41 93 61 159 125 213 -16 -168 57 232 -91 -5 102 -11 -96 133
4908 133 -74 -40 100 -119 -78 100 128 8 -34 79 35 172 -44 332 24 -184 -116 263 -14 163 229 -34
4930 -34 127 69 86 -154 -140 -184 260 205 -70 -199 -87 -59 -264 302 195 -112 -178 -197 157 9 102 -125 -45 30
4954 30 157 -2 104 -180 70 -117 198 -248 -215 29 223 -49 150 146 50 -196 -99 34 -36 27 -25 -138 -268
4977 -268 -68 47 351 -45 -153 -81 126 227 -32 171 109 103 141 -70 41 -3 272 -202 336 283 -201 -9
4999 -9 -188 -26 -45 -40 101 -117 -150 56 118 -26 3 116 174 51 -265 -104 69 -66 4 223 88 202 -176
5022 -176 -45 -159 82 2 -102 -145 62 47 71 -44 -42 -363 270 397 -351 84 61 108 24 271 -71 -42 260
5045B60k77m32N19k07j04K31j78J95j38P6P3k03nJ56R1l05L41J8Q4j41kj39P7
5068a0m6l1K23k27N6j11R4m2M06Q5k46j03j13J56j22N1p9o9L35k06K25n4L5l75
5092a68J46j66Q3J34p7j9n0J40n3KK18o6Jj21K8k62L55j7q0m2r9j9r7K66q0J13
5118G0k78N3Q2K33l68p5M12j00J06j25j73J13L12l68K37j46p6J05L3M2%p2K06
5141B23l51j52N12k72K78k80q6J2j8K5M25n4j76m5j0j01P8j24K25r9K1p7o5j21
5165b32J81r4K75J28k80P5p0K73K9m84O4L55m24J09K27j98M7K60j81k18O8J89
5187I9n8j62K41J2Oj1j60J05j73P5Q9o1K74m01L39j49%K6n4j06K02k49L2RJ75
5212A00K62j82l0k02P4q9j22J37J37k79K97Q4l05O8J03P3k7K5p6L0k94L48l85
$$ plain form
5045 260 -17 -449 70 -137 -241 -10 -188 7 -131 -55 18 -185 -190 -34 57 -248 93 111 195 54 52 -87 -10
5068 -10 -56 -87 136 -91 -35 -146 -52 -94 312 397 151 48 -65 91 -31 20 -59 -128 207 1 226 172 207 -168
5092 -168 -22 -188 -105 29 -48 -67 -117 23 -30 -28 190 124 125 4 32 -230 125 108 28 -14 -113 -132 -229 37 -43 70
5118 70 -208 -155 -73 160 -208 -283 129 29 135 10 -163 -50 262 -106 131 -15 -91 14 47 89 89 17 223
5141 223 -128 -280 232 -40 238 -42 -128 -116 -134 -109 316 262 86 41 31 -70 8 -116 109 10 31 -46 -111 -232
5165 -232 -51 -145 130 258 -22 53 -17 256 285 -199 -135 220 -204 -95 132 -66 -19 241 60 -158 -90 99
5187 99 41 -121 120 132 138 127 -33 72 -101 -26 63 2 276 -125 214 65 65 91 37 -69 133 -116 -84 -75 100
5212 100 362 180 150 -52 22 -67 -189 -52 85 -194 103 187 -118 -50 53 126 99 124 48 78 -216 132 -253
5235b53J9J15j0J53q7M9j48K3P6K06k08K10p5j97JN4J6o2M73o03L62p9m1j09L55
5260B40j13j30l5P2j00Q2j72j24K56R9l5q1J45j85M76m77J1R6k09K48j10R8m8
5283DK8J28j39N8N5J55l92K71j39l44M53k61n9qK14L7k3J5N1l54lL74l25Pl9J56
5309h0J28q3P1k55p2K52k5K81m06J85j6q7J74k7O3j92K93m96L86l58K23J03j37
5332g5j63O25k15J49o98L86j86Q3M2j34J62J60j31J05j09J08m18M07q3JJ50l82
5354b16L15M1M3R2l11k0J66j26J07l78K74J97l27kL13j68Lk51O49l98j04J91P3
5377A63l0k28L6k39M24M3j22O9Nj8L9l41K64J87q2l28J42J15k1j44p8P0J9Q3n0
5402b2J71m0k93jK93j45J8j60P0K59l66L28J96k59P7k26p4J25j65L13J0k81K91
$$ plain form
5235 -253 -234 -119 -129 24 -63 -14 -162 -139 -63 143 -65 145 70 -127 -126 -72 -56 -118 355 -248 114 35 -6 -115 240
5260 240 127 -3 -38 34 -66 16 -156 -280 -24 75 40 -41 104 -81 395 -82 -71 25 -184 64 -46 52 4
5283 4 32 160 21 79 134 289 -103 168 29 -315 138 -123 -182 -190 24 61 38 53 104 -250 -253 121 -204 -197 -236 -80
5309 -80 48 -35 36 -219 -291 -39 -64 217 -189 -4 -20 -107 67 40 103 -89 204 -292 94 -264 -41 62 -75
5332 -75 -238 387 172 321 -377 9 -177 -94 -52 -186 -24 136 5 110 1 109 -309 98 15 16 166 -216
5354 -216 99 140 183 275 -36 -56 110 -16 91 -287 -13 184 -143 -145 168 0 3 -248 401 3 -101 90 163
5377 163 133 -95 -59 -298 126 169 47 116 121 103 142 -199 65 252 170 -158 -16 99 78 -66 -144 -74 -55 28 -22
5402 -22 149 109 -184 -185 108 -37 -19 -179 -109 150 -216 112 308 49 126 -100 -174 -49 -214 99 109 -172 119
5425A19j40rN3P6%ML8l3N4n11M15j0K3o8Q5k7P8r5p2k07J83m0n7L07o5j10M4J33
5453A68j85q1J46k1N4q8j68J2J49k09K26o4M8L03j66k25J21R3p4J40k91J28K62
5476B78l12P5J37k55n1K06N6m37K76J42Qj2k49R1Q6k5j95L69l93R5J95l0k35O8
5500a12K99P3l44K2O3K21m70K50Q8q6O7q5L55p28K92J25J17l32j1K56J9O0j12
5523B7K31n6o14K35K25J08l83J75L89k98j91J88r7O9j64K45j64J60J17Qk77L3
5545c4J91p8J01l04K15j31M0J37k50L3K60l35%K75n0j46J69o5Q7j37J09m98M51
5568D0Q1p4O4o1o8L8k28K87J54m46J49N0J66J2j98O1K0j85m1J81n0K10J45n23
5592b16J31K75j33j00L3k6L13o8j66J79m00L0K41k83J21L02j68m03K00J57o3N0
$$ plain form
5425 119 -21 -30 23 99 99 103 141 108 162 -349 66 56 79 11 96 69 147 52 -20 -227 -44 -84 -141 166 101 -9 35 168
5453 168 -17 -98 48 27 81 -7 -175 -163 -14 -223 3 -61 -13 290 124 -101 20 113 39 179 -112 16 278
5476 278 -34 41 178 -77 -128 78 134 -303 -27 115 123 111 -138 -47 39 14 -181 188 -205 -110 85 55 -180 -112
5500 -112 187 260 -84 -62 1 222 -248 2 90 4 71 -14 341 -387 -95 30 147 -185 -196 60 79 139 27
5523 27 258 202 -412 -177 48 156 -227 -52 337 39 -152 36 -61 8 -156 89 -75 85 202 210 -67 -34
5545 -34 157 79 180 -124 91 -40 0 137 -113 -80 180 -155 -155 120 70 -76 93 28 115 -22 87 -411 40
5568 40 121 47 111 50 -18 20 -208 79 233 -213 -64 -14 152 164 -34 27 47 -138 -179 2 -48 162 307 -216
5592 -216 -85 190 57 -43 -10 -36 277 209 43 222 -178 -148 93 -190 -69 233 65 -338 -138 19 -44 6
5614FL7p7j53K00J71j19l06M09k29K30k55J6J15K42k41J50k07l18L37nq6k30L47
5637C4O9o2k26R9L3p6J69M0j83K36lj82Q0K84l09M3k34J47K6J22k51R8K11j56
5661IJ00J32j37j88J14k17K92Q0l98N75n0n66K45m8j88K93k15J93K10k49R0k30
5683a53J21L9j07L18k47O2J97k30J70N9j79K27l29j78L05M6k29R2j18K26L60m99
5705d7J48L2k74J82QJ85n13L45k90L20j05j17K90k79Q3K47k19K51j79L3j04J63
5727A60J46n55J67N2J37j23k27K55Q2n66O38j64J3j36L3r0J67N9J59l11K55k88
5749a37J41J5K7q8K57l44J23j01J58J46k47q1J6R7O9j52k7K41j85O3J32n6P0p5
5773F2J13j30j05k0N6J13k58J26p0L33l92M63l99J38r9j48K20k9K3l8q0J19l4
$$ plain form
5614 6 43 -34 -187 13 184 65 -241 168 -61 169 -86 -70 45 287 46 196 -11 -329 8 3 -83 -313 34
5637 34 103 41 -185 -86 -53 -129 40 80 -103 133 130 -52 28 312 3 46 -188 -41 -15 107 -144 -46 165 9
5661 9 109 241 104 -84 30 -187 105 185 -213 362 312 -254 -9 -57 -245 48 -167 26 236 -13 77 -153
5683 -153 -32 7 -100 218 -29 33 230 0 170 229 50 277 -52 -230 75 121 -108 -16 -134 92 452 -47
5705 -47 101 133 -141 41 49 234 -279 66 -224 96 -9 -126 164 -115 -32 215 -4 247 68 101 -3 160
5727 160 306 -249 -82 -30 107 -16 -243 12 94 -472 166 2 15 -121 -88 -178 -11 48 207 -104 151 -137
5749 -137 4 19 46 -42 215 -129 -6 -107 51 197 -50 -131 -115 -18 51 -101 -128 113 -72 -9 123 67 137 62
5773 62 175 45 -60 -80 -24 89 -169 -43 -113 220 -172 291 -108 30 -69 -217 3 -26 -3 -41 -121 -2 -36
5796c6l1K45k77j0L27r4l7L61o62L10K14l19J92k03q5Mr2K25j80rM40m56K70j35
5820c8K42j87R2j35K88r8j52J02j49k8L29m36L94k93J95j04J25O1k17P0l1k12
5842a82J24K23k75L2k20K21kM2O8r0K2J83j26j36M6J12j66M08l28j58O0K45j69
5865f6j35N05n09K47Q4m8j36J5l58N77nj73l3P8N3j17l5J52r5q5p2J97k44L3L79
5890B09j72Q9j19J32l0K20o36N03l00M0j03J99j65R7l00M16k11Q9o6J7K90k61
5912f2L02j46J52l80M16k36p5P1Pk5j17J39j64R7K50N1m14J73R7m53N82l07j9
5935f1J30N2l47M0J74r1L52k62J50N8j47OP6J02k60n0P4j35J44J57k38O8j34R6
5959d6j4J70m61K39j82K32L5l6K78o5j89o2J9L2K55j36k86K18J7j03J35j49Q1
$$ plain form
5796 -36 -67 178 -99 -109 218 124 87 448 -214 96 310 -9 183 -20 -105 -101 -193 32 -148 -157 283 -173 97 -38
5820 -38 204 17 109 -26 262 164 12 114 -35 -63 266 -170 224 -69 126 22 147 208 -9 61 30 -182
5842 -182 -58 165 -110 -78 -298 -77 -79 -37 31 -59 -37 146 20 -116 -70 42 -124 284 -44 -202 -142 103 -66
5865 -66 -201 304 -205 42 126 78 -58 -43 -401 176 171 -2 -35 43 96 -21 -56 96 1 -84 -156 41 -203 -170 209
5890 209 37 126 7 139 109 329 -307 196 -104 -64 -167 32 -133 -36 -336 80 -131 -42 -108 -91 199 -62
5912 -62 240 94 246 -134 282 46 -29 42 49 24 -93 46 -118 -21 229 280 -134 39 136 -317 265 -42 -61
5935 -61 69 121 -226 -186 -12 -103 249 -13 137 195 48 54 130 232 -28 -78 -4 -139 5 162 -76 -8 -142 -46
5959 -46 -60 110 -351 -112 -294 -62 -27 -63 215 150 -39 -101 -82 -50 205 69 -217 1 18 -85 50 -99 -18
5982a8R9j87K20l64M38o1j95J83j56k44Q7K01J75l0j84J18l8m4k71K46j8J4J99
6005A70j34j49Q8L2j43K06M5j13p9K29p7R3k47K58n2n7p3N1J23P0rl8l55J73m1
6030b9K3j72K44J25j19j60J2K88k26j02K23O3N6j55o0N1k87L48j33R0K00k19j5
6053D6J81M4n21J87J35k42QJ19j08J44j54J46j06n6J72j70L2L73r4l2j79Q0R6
6076A01J23l13K73q8L9j98K8R0j83L01l55R0K65J52m43M87p86M36L9J05q0L9j17
6099EO6j90J80j18K38j04j24J78l87K57j5o7P2r3o3J07K30k15L12l02m3J45lj
6123F5j21K7N2j72J04j1K0J79l14J46R9k18K62j69K90J9j11r2J5l7n0j98K06N7
6147D8M4l84K84j47M6L06j90J64l33K77l05J57j82J62l2m2J88l08L03J05j5l13
$$ plain form
5982 -18 81 -106 114 -250 188 127 -68 115 -41 -285 -198 3 178 148 -36 82 44 0 -271 -25 -43 -29 170
6005 170 36 -113 -25 7 -136 70 115 2 -77 152 75 168 -79 179 127 70 -3 48 171 241 232 194 -161 12 -29
6030 -29 -6 -178 66 191 72 -88 -76 212 -14 -116 107 170 226 71 11 62 -225 123 -10 80 280 61 46
6053 46 227 271 -250 -63 72 -170 -162 -43 -151 -7 -161 -15 -121 -177 -5 -175 -143 230 136 104 -75 5 101
6076 101 224 -89 184 96 135 -63 -35 55 -128 173 -182 -92 173 325 -118 369 -417 19 58 163 83 122 5
6099 5 71 -119 61 -57 181 77 -47 131 -256 1 -14 -81 -9 -102 -165 -58 172 -43 269 -33 -76 69 66 65
6123 65 -56 -29 23 -149 -45 -56 -36 143 -171 -25 74 -144 118 -51 239 258 147 55 70 33 -17 -215 -9 48
6147 48 92 -292 -8 -155 -109 197 7 171 -162 115 -190 -33 -215 -53 -85 -127 61 -247 56 161 146 -167
6169a67J12RJ45m2M2L7p0o1K79k43J36j15j70K65k86J09m1jk09L00j3J59m25L7
6193b13K78j19l2J16J50l32K74m35L99l42N68j53j19j00p3J39j43j0jO2Q4j28
6215a30M37j20o2j42L9l5J23l57J48J37j67J08j63K95j99K32j36r2rJ43KJ81l86
6238a53K56K0l0K6l7k23k9K38J13n84M51j38O8K00l36J15k6J70k12Q2M6k2Q2l4
6262D3j1k12L62j98L5k45J12R1L46k57ml9J03j77j77J95O0K69m12Q7K02J32k64
6285D1m80K41J96K4J63j80J11k0l02L26j38J05J34l14o6J18J7R5K6N5j75N2Mk76
6309b43J72J70m22O0J49j0J87j47Q1j46K59k01j91K00J59l37J04J93o7J03j46
6330g3K21j03l12J41K47k02l2l0L05k57L2j17J57K3J07J29k13J19p3j27J00k52
$$ plain form
6169 -167 -55 -46 99 57 99 136 66 5 284 41 177 62 -108 157 -129 -20 -61 -62 -271 29 16 175 -250 -213
6193 -213 65 -54 -86 30 180 -152 122 -313 86 -256 312 159 40 -60 -133 6 -137 -147 -148 -86 -2 -130
6215 -130 307 187 125 -17 22 -13 110 -247 -99 38 -129 -21 -184 111 -88 144 8 -84 -93 50 52 233 -153
6238 -153 103 123 93 119 82 -141 -170 68 181 -403 48 -90 -22 178 -158 -43 -69 101 -111 -29 17 -5 77 43
6262 43 32 -180 182 -16 19 -226 -114 -23 323 66 62 23 126 -51 -228 -33 27 296 -116 -29 173 305 41
6285 41 -439 -198 -2 22 185 5 116 96 -206 120 -18 87 221 -93 -159 -41 -24 71 97 152 -23 29 33 -243
6309 -243 -71 99 -323 -263 -114 -124 63 -84 -3 -149 110 -91 -282 -82 77 -260 -156 37 -30 73 -73
6330 -73 148 45 -267 -126 121 -81 -113 -143 162 -95 -63 -180 -23 0 107 236 23 142 69 -58 42 -210
6352b10L2L81j95L10n62J46J14J46j76J7j25J56k84N44j19j74oJ66r4k17L64k98
6374h4n8N0Q1J84j39k71K06J91n4J0j63n8Q0j16k0K58j79J89k9p7j61J92l0P6
6398G8J19l19L58j70J2l18J98n0J33k3o1O7j96R0oJ5J61k04K60j45J27j25j28
6421a27L16r9j42m0J56m3N7j76K92m09J61K62p3M2j74j03K8L04j88j45K70l94
6443b25J74K5mJ4J1jm3q3K7R3k8J19Q1R4j43k03j1L35l51P5J36k22K52p0lj66
6469a17M7K22q4J08j65J80m2l51J65K36k43K26k07p6J4k3M4K17p5j18K3O8j84
6492a35J21n6j18J82K2k53K46K8q7K9N3K36k68J13j31J30p8o1J11j44K7R2k63
6515b04K49L23o13J82K83l07M26k23j31j20K95l4k55K93j94M4j55Q5N8L33k97
$$ plain form
6352 -210 -178 203 8 318 -244 -98 16 162 -14 3 -122 34 -250 294 175 1 -5 161 67 -150 214 -84
6374 -84 -142 -92 -11 173 34 -237 -31 160 106 116 -47 -105 -25 -141 -161 97 -82 107 78 1 -160 32 2 78
6398 78 197 -122 236 66 78 -240 -42 -92 41 18 -43 24 -172 -82 -88 -73 88 -116 144 -1 126 1 -127
6421 -127 189 90 -52 -92 64 21 78 -98 194 -215 -54 208 135 177 3 -100 -72 232 44 -101 169 -225
6443 -225 -51 -26 -30 -16 -5 -6 -49 -132 -105 -12 -40 79 160 254 111 -92 -103 232 -119 -44 92 -130 122 52 49 -117
6469 -117 -70 152 68 176 11 191 149 -202 -37 199 -44 182 -25 -101 -87 -110 -66 151 76 -42 -19 49 -135
6492 -135 -14 -70 -188 -6 16 -237 9 37 -50 -21 32 268 0 113 -18 112 34 -27 84 -60 -33 59 -204
6515 -204 45 368 -245 -63 220 -87 339 116 -15 -135 160 126 -129 164 -30 14 -141 -56 2 335 38
6536C8J13k61J90k40R5K16l76K36N5k05J5j07M23k42l1N6LJ6n1j3k10J87L51M2
6560C00m58J95J74j65O3q2m4j1M02j84k94J77n1J96r0k01K15j83J67J29o6j89
6582@M0r8M69j77l79K30%J00K6L2l12p9K67k39P2k24Q7M29k74O9j90K43Ro6J0
6607D5l79K02L73l35O2J66n2k09J5J85l24K47n0J86j57L8J4p2J15r7j9rj46J88
6631a3J31n3rk07j82K83K87k13K98l03j6Q0j58k3R2j44J86J14k4k55J00j65J10
6654h4o5K12j87K43k66L25l16L19j83J81j88R5l9j05m6M8R8j5J61k7r3l8J9o2
6678a3j9J25j82j32J92J19pk92N02k40j04l16K44K1K95k46L6O6q6l4J57n5j2k16
6702a97K47j08o0L38n56K68n0m0R1O1J32p5K83n48K88P0j26J81J05p10K65k23
$$ plain form
6536 38 151 -110 80 -160 -65 151 -225 11 66 -139 -124 -231 192 -50 -81 -25 -22 -6 -57 -70 -280 -93 258 300
6560 300 -158 37 211 46 109 27 -17 -28 374 190 -104 73 22 218 128 -73 142 -41 126 255 189 0
6582 0 40 -58 411 234 -145 85 85 185 211 243 -69 -148 119 -120 -48 -272 -185 244 -30 39 -151 92 101 35 45
6607 45 -334 -132 241 -94 -32 134 82 -127 -112 73 -251 -4 -54 132 -25 13 27 -45 70 -27 -46 -55 -201 -13
6631 -13 118 65 56 -151 -333 -50 237 24 322 19 3 83 -75 -98 -6 -150 36 150 126 -129 -29 -194 -84
6654 -84 -149 63 -124 119 -147 178 -138 181 -2 179 -9 86 47 -58 -104 -56 42 27 188 161 68 30 49 -13
6678 -13 -32 93 -89 -221 -29 90 83 -209 293 53 -51 -367 -123 -102 193 -53 -17 49 -37 -71 86 31 19 -197
6702 -197 50 -58 -118 220 -336 -68 -118 -158 -67 -6 126 51 334 -214 74 144 18 199 304 -406 -141 -364
6724c64J82K03K4K05k12o3j46L7J49j24K29j37N7p2J18k16K03R9k04M5J24j23
6746A4j71o6J84R0J64j82r1J13r6J51o6k31L65l84M15m30K92O1j23K1k38L32j92
6769f8K09l2j83K8n0J92p7n3K29j23j16l4K66j80K1k0J01j25J84j85J19j93k6
6792a16j15Q3j28N9j43J10L32j94L91m7k66l8j16J84l11M57L0l06J40RJ24m04
6814b65p3K5L18j38K24j12k06M02j52K86n04L10k51M3LO4J58J19o5q0R2l04K30
6837A24J3K60m44J15j59n9J70o9J7N8k12L95M9l61J91l73o1K85O0K9NK4O6n4j90
6862a21N9N6k3P1j62J00j25J68P0j66n1J7J21J45j86rP2K2n8J53j30P9J67o3j39
6887F7k05p9L08j94p9lN3J56O6jj66M3R1p0L1K21k23n6J42m6j7j78p6K03l1P9
$$ plain form
6724 -364 -182 21 45 250 38 -25 -171 -134 15 -109 120 -17 40 -32 86 -130 73 172 -32 13 137 14
6746 14 -157 -223 -39 51 215 33 -58 55 -41 110 44 -187 178 -206 209 -221 71 132 9 30 -208 124 -68
6769 -68 141 109 -74 -46 -96 96 19 -34 195 72 -44 -78 188 8 29 9 110 -15 169 -16 103 -90 -116
6792 -116 -231 -148 -276 -217 -360 -250 82 -112 279 232 -34 -72 -188 -4 -315 142 172 -134 6 15 139 -265
6814 -265 -338 -313 5 -133 91 -21 -227 175 23 309 -195 115 -136 -93 -90 -26 132 251 186 106 198 -106 124
6837 124 137 397 -47 68 -91 -150 20 -49 -32 26 -186 209 258 -103 88 -285 -346 -61 -1 28 33 57 123 69 -121
6862 -121 -62 -6 -29 42 -120 -20 -145 23 93 -73 -124 -107 14 159 -27 -36 36 58 0 153 23 102 269 206 67
6887 67 -138 -217 91 -103 -182 -185 -132 24 90 89 -77 -34 57 -13 18 239 16 -40 102 56 39 -139 -215 -12 -43 36
6913C6l61O5K25K80k91q5j04K81J37j00J8J56j82L10m38N0J84l75q8K89j21K23
6935A09m17K38j03M56j05m84J85J70j18R5j77K35Q7k93k6J22J54ok56K6r0J52
6957d6J53J3j16q0N2k45M02j60R8p2j01J22l48K67J22J17l3j28j54J62j67q8J22
6980a08J74r2O6l2K01l92K61L01l41K1n9j8L75k04k53J07l3K6M7r6J5n7j3K07
7004A03j53j6k1O7L5k47J53J88j03K41j4l62L83n5l26K48l8k60J74K4R9pJ6j10
7028A9p2p7K08p9j26L12j63j62J62K4L2j22Pj15M77o39M99j16Nj76J55mj83L27
7052A93m3rk39j30J43O0k47J53L93l36J15j87K25j44K23Q6l81L70k66J23j40N4
7074A6JJ43j91P3j77K30l32J59P8N0j06K97k83O2J48L6j38P6k44m7j2q8j18M25
$$ plain form
6913 36 -325 -260 -35 245 -46 -131 -235 46 183 83 101 257 75 385 -53 -3 181 -194 -282 7 -114 109
6935 109 -308 -70 -173 283 178 -306 -121 49 -69 26 -151 84 171 -122 -148 -26 128 122 -134 -108 -198 -46
6957 -46 107 120 4 -76 -24 -269 133 -27 71 -1 -102 20 -328 -61 61 178 145 17 -137 25 -142 -230 -108
6980 -108 66 -26 40 8 209 -183 78 379 38 59 0 -18 357 153 -100 7 -26 0 47 -49 -34 -91 -104 103
7004 103 -50 -66 -87 -20 15 -232 -79 109 6 247 233 -129 254 199 -127 121 83 -177 -3 21 120 113 129 19
7028 19 -53 -130 78 -1 -127 185 22 -140 22 46 78 -44 -37 -152 325 -314 185 69 74 -102 53 49 -134 193
7052 193 150 141 -98 -228 -85 -25 -272 -119 274 -62 53 -134 91 -53 170 256 -125 245 -21 102 -38 16
7074 16 17 160 -31 42 -135 95 -237 -78 0 50 -56 241 -42 20 168 204 66 142 -102 -149 -161 -249 -367 58
7098E8m8n2m4J30J58k76K22j74m3q6j92M87l20L62L7k92K02j6J07l35L30j06K48
7121C57l69k51P9K40j58J77j1k2k76K07LJ47j34j63M23m60N81o25L93l6j83K30
7143A49r0J04k99J62j07J51k40K27j65J03j65R9l7M1r0Q5K23K5k5k12K73l68J32
7166b4m7J99j57j2kOj12J11J47j5k71L25j07k65M88k25N5k80m5K62l5L69k06j76
7190a7QmN9J04k66K5L38k61p5o7K18J93j38l0j6o2P8j96J04K30m01J77rj01%K11
7216A02j07%K38p0j86J75j30k1p2rJ18J6r2L97o49J28MP5l0J54J57k26O0j21k8
7241a17n0K40j53J58j21P2k68N38k74Jj52J61j81J86rm0j68J72l5J60K2l53J49
7264f2N0J15j59O9m1j16L71k53Q2j35K4Oj04L63j60j74J96k16j00P4J12K18q5
$$ plain form
7098 58 10 -42 -86 44 202 -74 148 -26 -69 -155 -347 140 -180 182 219 -73 129 113 220 -115 215 109 357
7121 357 -12 -263 -184 56 -102 75 64 42 -234 -27 -24 123 -11 -174 249 -211 370 -255 138 102 -81 149
7143 149 59 163 -136 26 -81 70 -170 57 -108 -5 -170 -71 -108 -67 -157 -72 151 176 151 -61 212 -156 -24
7166 -24 -71 128 -29 -41 -43 -37 -149 -38 109 94 -177 148 41 -224 264 39 94 -186 -231 31 -4 365 159 -17
7190 -17 -9 -13 46 150 -116 -91 247 -14 -89 -156 62 255 117 87 71 9 87 -109 -5 225 -176 1 -8 -109 -109 102
7216 102 -5 -5 233 163 -23 152 22 1 -71 -80 38 54 -38 359 -290 -162 -158 -83 -113 41 198 -28 32 -89 -117
7241 -117 -167 73 -80 78 -43 29 -239 299 25 26 -126 35 -146 40 31 -9 -177 -5 -40 120 142 -211 -62
7264 -62 -12 103 -56 13 -28 -144 227 -26 56 -79 -55 -49 -153 210 50 -124 72 -144 -244 -170 -58 160 75
7287G5j17J49p6k04j08L45J78j86j52l35L30K45o3o9J07j1p5r5O2K48j73k28K02
7310D9k39rL02o2K8j23O3J13m80N10k37j45R2J11r5J87j95N4L5j11j06L95k31
7333i4l08N01O7k52M5K48q0k69J77o0J51j05j57J1p0K86k96pJ10J30k52K19n7
7356f2J9J28J11j87L07k53j31k57L05R0K5K24k54j88J73r4k23N62l95k5J03j62
7378a84J64j45J80j70jk6P1L45k20K15m91J92Q4M0N1n54M61p5J72j34J07m2m2
7401bL0K9J17j00pM0r1K0q0J09mj26r8J13QR4l12K16J52l16m5J2K08J57k50J2
7427a14J63M5M0j79j59J80j75K19o0j92M46k19j45r4J24O6O7j59K00M9k51K79
7449A31j45k79J92l17K70J18L4J48k17K32p2o1R3m3R9J08k06j53Q8J85k04p1Q0
$$ plain form
7287 75 -42 107 31 -173 -281 64 242 56 -96 -431 -101 144 81 12 119 108 33 -62 0 248 75 -153 49
7310 49 -190 -199 103 41 69 -54 9 122 -358 152 -85 -230 -138 -27 -122 65 -130 -76 -41 -152 -258 137 -94
7333 -94 -402 99 166 -86 -41 207 127 -142 35 -25 126 21 -136 -125 -195 91 -205 -212 -102 28 -224 -5 -62
7356 -62 -43 85 196 9 316 63 -68 -325 -20 70 95 319 65 -123 50 -44 -267 295 -100 -125 -22 -184
7378 -184 -20 -165 15 -155 -156 -182 -111 234 14 229 -262 -70 14 54 105 -449 12 -63 109 -25 82 40 -2
7401 -2 28 57 174 74 67 107 16 36 -44 65 61 -65 -163 -50 -42 52 -260 -44 108 -208 -253 -241 -33 124 -126 -114
7427 -114 49 94 134 -45 -204 -24 -199 20 -40 -232 214 -5 -150 -244 -120 -54 13 -146 54 103 -148 131
7449 131 -14 -293 -101 -418 -148 -30 4 152 -65 167 95 34 127 84 183 291 85 -68 20 205 1 -70 10
7472A0q6J29N9J9j81j10Q6Lj2R5N8P3J60m55oK94j01L9J39N8j33r9J35J35j59
7497A50kn4j7j27L2J55k46K71P9l33k06N15k57J83j86J90J36l87J30ll7k8O6l9
7521a5l8J38j98K15n2q1NJ86l30rJ69j64K27K6jJ0l7J85n8l26L69j8l29L6k6J21
7547Ek28L89l34J69n4j07J05j43L38j62K4p5l0J54l42M57j65l0J19m5O9j51m7
7570h4R0r1L40q5m07N25m77L88l01m3N3R3N3l5l9r0L04J98m59P7J15J20k39J59
7594A65l41Q9m9L6K28l57J14J38r7k1K43l60K58K0k63Q0N8J50p4k26L30l17L9
7617a57K78r4j52K76j81k03k2P5M6O6R8J76p4p5j88J17j30J57Mj23N5Q4o8l5K59
7642A89m00K99J20l79R3n5m5K95l02J46m3j78K43Qo7J10j23O2K19p0k61J09J80
$$ plain form
7472 10 -76 53 112 131 -50 -160 -74 -71 -83 12 70 143 303 -152 -158 136 35 74 213 271 138 39 174 309 150
7497 150 148 94 77 -50 -18 137 -109 162 241 -92 -298 217 -40 143 -43 147 283 -104 26 23 -14 -42 24 -15
7521 -15 -53 85 -113 102 50 -31 -26 160 -170 -179 -10 -174 53 79 78 88 51 236 178 -148 221 203 -126 -90 -116 5
7547 5 -223 166 -168 1 -53 -160 -55 -198 140 -22 2 -73 -103 51 -291 166 1 -29 90 45 114 -37 -84
7570 -84 6 -85 255 170 -237 288 -189 199 -102 -145 -92 1 54 19 -20 -110 194 392 -67 10 125 245 6 165
7594 165 -176 -87 -136 -100 128 -229 -115 23 -74 -95 148 -212 46 66 -197 -117 -59 91 17 -209 121 -196 -157
7617 -157 121 27 -125 151 -30 -233 -255 -180 -134 -68 30 206 132 57 -131 -14 -144 13 17 -106 -51 33 -35 -70 189
7642 189 -211 88 208 -171 -78 -133 -178 117 -185 -39 -82 -260 -17 -9 -76 34 -89 -27 192 122 -139 -30 150
7665A50n0j01n4L1R6M06l34j62qK7r8Q0j08M2j31J12L06k96J40j35n9J35J69j19
7689C9Pj53Q4O9lj10l6K5L05j18l80K46j51J90M5J28k59J98j31q4J99K3k48m5
7713a60J98j57m7J23k17L94Kj29r2K80l64N44m60Q3p4L98p7k99J96nK26m84L11
7736A90l45P9j8pJ49P0K51m44K56n7j27j12J66q7r1K31l55J26O0J91k35L54p2
7759A73m68J21n8L90P4j24P0l92J84R0j47j33K08j76M8K25K77k34l9l17K69p8
7781c7k16L6K41m8j17L45n0PN9k55J12k76J04J85j74K32p0j32j05J36J98j84n3
7804f2K92m89M32k93J34K71k07j63J05j03J53m8k71L89k67K91n9J03l0l10M39
7825C07k70l11J82K93l51P2k80L16K7n9k43J59J7j2K82k42M33m62J84N8k12K37
$$ plain form
7665 150 100 -1 -55 -24 72 478 144 -18 -26 1 -97 -17 -125 -83 -214 -102 204 -92 48 -87 -146 -11 158 39
7689 39 46 -107 -23 46 43 -67 -103 -78 227 109 -271 -25 -176 14 59 187 -72 126 -5 -89 110 133 -115 -160
7713 -160 38 -119 -166 -43 -260 134 136 7 -85 195 -169 375 -85 -2 -76 322 245 -54 142 137 363 -121 190
7736 190 -155 -76 -94 -101 48 118 369 -75 181 124 -3 -115 51 -36 -127 104 -251 -125 -65 126 -109 245 173
7759 173 -295 -174 -232 158 232 108 178 -214 -30 60 -87 -220 -12 -188 -140 85 362 128 89 -228 41 -37
7781 -37 -253 -217 24 -24 -141 204 154 161 220 -35 77 -199 -95 90 -84 148 78 -54 -159 -23 175 -9 -62
7804 -62 230 -259 173 -120 14 285 78 -85 20 -83 70 22 -249 140 -127 164 105 208 178 -132 307
7825 307 37 -274 -92 201 -150 -78 -358 -42 -15 -74 -317 -158 -141 -153 129 -113 320 -142 42 100 -112 125
7847A25j99RjJ88q4O9j91K71k92L7K00j91J81K9Nl63L79j15r8k8O5P0pj8m08N38
7873A71m54N87m60K27j11Q4k01J65O5j26K40j49j2P3j21m7J38m2P1n3M1jj94Q8
7897b1R8K6j67J72k3j55m1O9j47K01q8Q6j08J18O2KM2r0M1j23L5q7L71k95m8J22
7923E2J33l35J7j27M15k05J39l0r6j41M70k73L6j71K24l11K20p4j00K48j75j92
7945b76L02R8P7j25R1j00j93K7J69J74k58J4J65j20R5j79L4p1J50j34k29L86J13
7968B10l85L20j95J47K9j25L25j81p2m8k0k93K71m8k3Q7j87K03R5l8pN5j78J36
7992G8J45l48J01K38j48K15j15K5m11R1K6L62k47Q2mK7Nl33K59J62l57K52k71
8015a66q4L52L2m7l69M90l80J89J46k12J30%k42L6J18R9j41L64j5j1k31J07j20
$$ plain form
7847 125 -74 -65 -66 122 38 107 -84 187 -105 -68 132 -59 122 151 156 -207 172 57 -41 -69 -4 66 59 41 -367 171
7873 171 -283 304 -156 71 -40 44 -157 8 73 -53 187 38 26 99 -22 -69 69 27 98 45 86 85 -109 -21
7897 -21 77 103 -64 108 85 -70 -111 -42 -189 12 -76 10 -98 20 82 84 126 36 77 -46 -11 -98 273 -22 -70 52
7923 52 185 -150 -133 -260 155 -50 89 59 -37 -178 292 19 55 -116 108 -203 17 -57 -157 91 -84 -276
7945 -276 26 124 201 76 167 67 -126 -99 70 244 -14 0 165 45 140 -39 -5 -76 74 -60 -289 97 210
7968 210 -175 145 -50 97 126 1 326 145 73 25 5 -288 -17 -65 -88 -1 -188 15 110 72 65 120 -58 78
7992 78 223 -125 -24 214 66 281 166 191 -220 -129 -103 259 12 94 90 117 122 -211 48 210 -147 105 -166
8015 -166 -250 102 134 87 -282 208 -172 17 163 -49 81 81 -161 -125 -7 92 -49 315 300 289 58 165 45
8038D5R5k60j10l3L07L51k57l16L96j8o7J60l95PJ15J25k62R1j10r2L07K01L2
8061C12j96K19m12P9P7m0j63K20j07j21K00k09L36k11Oj07J27P8n4j05K22l48
8083a97j67L66oM3r8M6k23L82o0P3%l30P9m1j2kK86K02m01K18j58k93K72L11k20
8108G0j42j31M10j32L0j42q9J90L19l63j06K3K52j47J9o0k16L26k54K17j92J7
8130a01oJ1J56j6N0q6K97l57j33L93P1q6j39mo0n6k4J56k71j33L70o2j35J88m7
8155b4J44m60N71J04n37K41P7j7jK4n24M08j93J79M7j52m4p9K86J17p5q4o7j8
8179g7J36OJ09K39o08K57j58l3K02J29Q7m59
$$ plain form
8038 45 140 -120 -230 -263 44 395 138 -178 218 200 133 293 -102 -95 20 145 -117 -26 -136 -228 79 280 312
8061 312 116 335 -77 2 79 39 -124 96 -11 -132 68 -141 195 -16 -10 -117 10 88 34 -71 151 -197
8083 -197 -364 2 -4 39 -59 -13 -236 146 86 159 159 -171 -92 -133 -145 -147 139 341 -60 158 0 -293 -21 290 70
8108 70 -72 -203 207 75 105 -37 -126 64 383 20 -86 -63 189 42 61 1 -215 111 -143 74 -118 -101
8130 -101 -107 -96 60 44 94 8 305 -52 -185 208 279 193 54 50 -10 -66 -90 66 -205 -338 32 -30 -165 23 -24
8155 -24 120 -340 231 335 -202 39 116 99 98 122 -402 6 -187 -8 39 -113 -157 -236 50 167 92 8 -59 -77
8179 -77 59 65 174 413 -195 62 -96 -129 73 202 289 -170
8191a70
$$ Imaginary data points
##PAGE= N=2
##DATA TABLE= (X++(I..I)), XYDATA
0@%%%%%%%%%%%%%kJ0j6J6j6J6k4L2l4M2m8N6p1Q1r0J04j20J41j64J85k09K36k66
36a41K98l34L74m17M64n18N76o37P05p80Q62r51J049j157J274j403J547j705J883
55I89k085K313k572K871l224L644m154M791n612O718q297J0747j5119K5363r9748
70h3375o0331Q0820k308J9357L6256N8650J0569o659j1806J3311J0225l494k4653
83C6562L557K6400M825m3434l4485m054r918m5719l8297K174K6833J6646J1407
96d7503K3094M3210L5757L464j8599j581J3142r633l4678j4533J8102J3425j5795
109G872j8281L273P613j4030k7615j1938J3106J6948K159K792K6086L7360J3579
122E8924j5805j0508O651n562l2964k9981j937Q325n012j0397M831J7949J2790
$$ plain form
0 0 0 0 0 0 0 0 0 0 0 0 0 0 0 -2 8 -8 8 -8 8 -16 16 -18 24 -24 32 -39 42 -48 56 -64 77 -87 98 -111 125 -141
36 -141 157 -177 197 -220 244 -274 302 -335 370 -410 452 -499 550 -607 667 -736 811 -894 989
55 989 -1096 1217 -1355 1516 -1708 1936 -2218 2573 -3039 3679 -4618 6129 -8990 16373 -83375
70 -83375 -143706 -62886 -65194 -45837 -9581 49069 59638 52979 41173 54484 64709 61215 36562
83 36562 40119 66519 71344 27910 -6575 -10629 -20547 -66266 -104563 -102389 -75556 -58910 -47503
96 -47503 -24409 18801 54558 58022 39423 37842 50984 41351 6673 -7860 10242 23667 7872
109 7872 -10409 -7136 477 -13553 -41168 -53106 -40000 -23052 -20893 -18101 7985 45345 58924
122 58924 43119 32611 39262 33700 736 -29245 -31182 -22857 -27869 -38266 -33435 -15486 -2696
135b696n037j0150O168J9790N512j0418M651K6692J6074r060r834L707j429j9716
149A4254k7233j8018l983q48r812r442J1562K5737J0611n908O188K1626J0192
162B4926q399m292R651J0383Q5q178l566N825J860j6232k2273n334L111j0443
176b2876j8198j519J5038J0905l35L012J3653J4555K561p724l550P366N098q860
190I126r720O530J2341q40j0959l064O385j023j3389j2711N26O183p68o509K171
205a5721J4227J0444m578p630L211P614n377j3796j864J1099Q088k372j001R789
219A2133J0517k214j2506p781K105n47j1740r787O222J3247K610o492J748R839
233G354J322j1525r857K367P132M28m522M506J5094R021o219r165Q14J598r999
$$ plain form
135 -2696 -7733 -17883 -11715 8075 13587 3169 7820 34512 50586 41526 31692 35399 33970 14254
149 14254 -12979 -30997 -34980 -35828 -45640 -55082 -43520 -17783 -7172 -13080 -6892 14734 24926
162 24926 16527 12235 21886 32269 32354 24176 20610 26435 28295 12063 -10210 -15544 -12433 -22876
176 -22876 -41074 -42593 -27555 -16650 -16985 -13973 -320 14235 16796 9072 5522 12888 17986 9126
190 9126 -594 5936 18277 17437 6478 3414 9799 8776 -4613 -17324 -16798 -10615 -11383 -17892 -15721
205 -15721 -1494 8950 4372 -3258 -47 7567 2190 -11606 -13470 -2371 5717 3345 2344 12133
219 12133 22650 20436 7930 149 2254 1707 -10033 -19820 -13598 -351 2259 -4233 -2485 7354
233 7354 8676 -2849 -12706 -10339 -3207 -2779 -7301 -2795 12299 21320 15101 5936 6750 8348 -1651
248a651j5923l052R079O830j877J429J0868J1771j463j1119m921M066p3j0087
262f123n463Q714J2276k09p497l36N371m320j4638j0848K691P557J314j065R855
277b721J7951R407m656n154K634R20j0671j3884k091O889K070o351k726N488M198
292A303p026j2675k816O573K426l566L734J6014J5496L416k620L031M556n357
306B2489j5656j1284k14Q35o445p193L564Q999J019p980l871N215M752m075k943
321a2788Q044J4449P539o77J701P356J847j0515j4072n541p37o172j0401k738
335b2705P823P106j416k547N126Q046L48n002r8Q925O965p25j725N135O362k932
351A8686j0838p650j504l480j0314q591K286P376K821r45M588J0449O806k744
$$ plain form
248 -1651 -17574 -20626 -11547 -4717 -6594 -5165 5703 17474 16011 4892 -29 4037 3964 -6123
262 -6123 -11586 -2872 9404 9195 1698 1362 6733 2413 -12225 -23073 -20382 -12825 -11511 -12576 -2721
277 -2721 15230 24637 19981 14827 17461 18381 7710 -6174 -8265 -1376 694 -5657 -8383 -2895 1303
292 1303 -5723 -18398 -21214 -14641 -12215 -15781 -12047 3967 19463 22879 20259 23290 27846 22489
306 22489 6833 -4451 -4665 -3830 -10275 -17468 -13904 -4905 -3886 -11866 -15737 -10522 -5770 -9845 -12788
321 -12788 -4744 9705 17244 16567 18268 25624 27471 16956 2884 -2657 -3394 -9566 -19967 -22705
335 -22705 -14882 -7776 -9192 -11739 -6613 1433 1781 -3221 -3319 5606 12571 11846 10121 15256 21618 18686
351 18686 7848 198 -1306 -4786 -15100 -23691 -21405 -14029 -11208 -12153 -7565 2884 9690 6946
365F946l252L704N120j017n312m01N508J751n370o879j349K83o626j0332l473
380b0699M281L688o13J759Q986J0559L365k081R52M272M93o680o008J396K455
395F125k738n889j209K685p60o521n854N86L478m24j993M221J0302O730R10L1
411I680M771K979m097p887l686M61j552n410l942K461L831j848n069k61L700M40
427e429l233n09N635P450L221P7L475N540J094o317o258j288j422o136o994o4
443a1158L728J658j850q19L474L916j476l218J357N766K860o76J778N946M460
458A5746j815m867l242p50l695q458n182J112K443r30j146L386O074J841k255
473a738n27L073L331n69j859K715O147J784l215k370P57j651o527p011k365Q82
$$ plain form
365 6946 3694 7398 12518 11501 6189 5788 11296 13047 7677 798 -551 -268 -6894 -17226 -20699
380 -20699 -16418 -12730 -13343 -11584 -2598 7961 11326 9245 10197 14469 14962 8282 2274 3670 6125
395 6125 3387 -2502 -3711 -1026 -1786 -8307 -14161 -13575 -10097 -10521 -12514 -8293 2009 8739 9649 9680
411 9680 14451 17430 13333 5446 1760 2221 669 -4741 -8683 -6222 -2391 -4239 -9308 -9569 -5869 -5429
427 -5429 -8662 -9171 -3536 3914 7135 7212 10687 16227 17321 11004 4746 3458 2036 -4100 -11094 -11158
443 -11158 -7430 -5772 -7622 -8441 -4967 -1051 -2527 -5745 -4388 1378 4238 3562 5340 11286 15746
458 15746 13931 9064 5822 5072 1377 -7081 -12263 -11151 -8708 -9638 -10784 -7398 -1324 517 -1738
473 -1738 -2265 808 4139 3570 1711 4426 10573 12357 9142 6772 7529 5878 -649 -7660 -10025 -9143
489i143p22k071J397N308N687O02j580K252L840j03l227m57L020K584j343j756
505D288J96J624k193o453m753K39l1l216j647L763N606L151O37J402L574K160
521H347k169l388J1K145n86l826n07K820J10l481l880q09J35j435k788j10M157
538e254M271J063Q43M605M683p72l304j194L29q80l508l151k68J968p00l161p46
555e176J813K03l397j594K604L065J299J10K970M491L006m59k405K17J73l257
571C663n073j764P76q08k203n38J982J613m80j840m45K514J751p36O8L828L815
588F123O15k42O42O05j713l738m067q19p4j774k793J026L194J579j193K49J549
605h31P81o07p08P84K981J947p44L9K576J117k444l908j800l76k206k560o02J118
$$ plain form
489 -9143 -9865 -11936 -10539 -5231 456 1058 -522 1730 5570 5467 2240 1783 4803 7387 6044 4288
505 4288 4484 6108 3915 -2538 -7291 -7052 -7083 -10299 -11946 -8183 -2577 574 1211 2613 6187 8347
521 8347 6178 2790 2801 4946 4360 534 27 2847 2957 -524 -4404 -5213 -5078 -6513 -9301 -9411 -5254
538 -5254 -983 80 923 5528 10211 9439 6135 4941 5270 4390 882 -2269 -2537 -569 -1269 -4430 -5176
555 -5176 -3363 -3160 -6557 -8151 -5547 -2482 -1183 -1073 1897 6388 9394 8935 6530 6747 6920 3663
571 3663 -1410 -3174 -2398 -3206 -5409 -5947 -3965 -2352 -2832 -4672 -5117 -2603 -852 -1588 -1520 2308 6123
588 6123 6738 6496 7138 7743 6030 2292 -1775 -2594 -2668 -4442 -7235 -6209 -3015 -1436 -2629 -2380 -831
605 -831 -50 -657 -1365 -581 2400 4347 3603 3642 6218 7335 4891 983 -817 -1193 -3399 -5959 -6561 -5443
623e443K151J243j49J390K882N03k360j005J971J708j139m95J871J388P56k200
639C072k085r24q43k480l334M70K008N74m08J883L212J658l2p67l71Q71J0j281
657A233o09J666J356j104j280J98l17j725l437j484M02P32j50J34K482L478J579
674C154n88M68J347k70k216j078K95J057m9j650m68R46Q6k385k507l60M30p06
692d494j022J521K674K406R09N86J830J249n74k106j603M18l28j953p46Q36K96
709a01r35j272q31J80k95j126m19J823K597J478K90K190K056N98j719j042o78
726B794j087j633j862j016Q37L04j137n29P02M37k81j026L50K168R39P92Q79K501
744D132J764n75p54q55l05j578k689j880m13j10n75o69R74J231P46k0k33J493
$$ plain form
623 -5443 -3292 -2049 -2198 -808 2074 2577 217 -788 1183 2891 1752 1257 3128 4516 5272 3072
639 3072 987 63 -780 -3260 -6594 -6124 -4116 -3542 -3950 -2067 1145 2803 2771 2004 1633 2504 2514 1233
657 1233 624 2290 3646 2542 1262 1460 1143 -582 -4019 -5503 -5101 -4369 -4519 -4385 -1903 1575 3154
674 3154 2566 3034 4381 4111 1895 817 1112 2169 2120 470 2 948 1034 -1351 -3858 -4218 -3788 -4494
692 -4494 -5516 -3995 -1321 1085 1994 2580 4410 5659 5085 2979 1376 1794 1466 -487 -1233 -397 -101
709 -101 -1036 -2308 -3139 -2959 -3254 -4380 -4799 -2976 -379 1099 1389 3579 5635 6233 4514 3472 2794
726 2794 1707 74 -1788 -2804 -1967 -1663 -2800 -3329 -2627 -2190 -2471 -3497 -3147 -979 -40 752 1631 4132
744 4132 5896 5321 4567 3712 3407 1829 -860 -2740 -3153 -3263 -3838 -4507 -3533 -2302 -1556 -1576 -1809 -316
762c16J162j59K9J729J422Q72n58o18L40p71k496k346j270k75n54j207K85J681
780c050J564L74L46J037J484K36o60K22R04R93n05p27L67L28j158k190j314n49
798b298o62j459p52J291J295J286M74J318K020O52m25m70k6N19r02j122P1K99
816A109m3j297j275L7m48j161j180K79Q44J501L77J199J745J803N45q11K08K8
834C460q31j582j189R5q7j000n67j42L50l33j340m76P87R45j01Q89J457K140J201
853C676j0J15J43j97j648j767p06l32p99n54n16O80M49n42o79P24K33O63k38N31
873g74J511J649L69J35P04M75r30j417j202q10l67j578o74K16O05L52p3J54R02
892g53P46m93q9N78J307O11J37L21P93L46j246q37q64m72j782j071m81M67Q03
$$ plain form
762 -316 846 687 716 2445 3867 4739 4181 3563 3903 3132 636 -1710 -2980 -3255 -3809 -5016 -4731 -3050
780 -3050 -1486 -1112 -766 271 1755 1991 1331 1553 2457 3450 2945 2218 2585 2913 1755 -435 -1749 -2298
798 -2298 -2960 -4419 -5171 -3880 -2585 -1299 -825 493 2513 3165 2740 2270 2244 2763 1861 739 810 1109
816 1109 1066 -231 -1506 -1469 -1917 -3078 -4258 -3979 -3135 -1634 -1257 -58 1687 3490 4035 3224 3432 3460
834 3460 2629 1047 -142 -47 -134 -1134 -1701 -1843 -1493 -1826 -3166 -3642 -2855 -1910 -2011 -1122 335 2475 3676
853 3676 3666 3781 3924 3727 2079 312 -394 -726 -1525 -2079 -2595 -1915 -1466 -2008 -2687 -1963 -1730 -1067 -1305 -774
873 -774 737 2386 2755 2890 3594 4069 3139 1722 520 -290 -657 -2235 -2909 -2693 -2088 -1736 -1809 -1655 -753
892 -753 -7 -500 -589 -11 1296 1907 2044 2365 3158 3504 2258 1421 557 85 -1697 -2768 -3249 -2782 -1979
911a979l59L55J577R93J3k24J91Q52K15r1l15P48O67k69j234k74l89j070j300
930a893j197j86N90N7M5J227J378J092O6M2P28L88o70k75j73K77l65k29q79L35
950C58m54r76j349m80L18K75m95O27J534J142P78K67Q28M27J09j243p54J99n3
969A058r48p18K03K34p06r59l80J14%k22J19Q82J357Q20L06P16J046M85p29j014
989A664l98j55j093r11q13L8M99n53k43K58P74l08j32J07J306N33J82N96N81P28
1009B660K08o90q07j38o05j523j028j49P03m46m52M79L82Q37O6J44J46P82M64
1028A033k07L69R97M00p57m75k67o4r09j171q68K88j06l66k18J165Q13J86j96
1047c53Q50O97k83Q0k91J45M70M0m49l58N62m37r63p43K17m71n01l16P96R96K65
$$ plain form
911 -1979 -2338 -1983 -406 587 600 376 567 1419 1634 1543 1228 1976 2643 2374 1140 866 477 -593 -1893
930 -1893 -3090 -3276 -2686 -2629 -2584 -1357 21 1113 1179 1221 1949 2337 1667 1392 1219 1496 1131 902 23 358
950 358 -96 -1072 -2421 -2901 -2583 -2308 -2803 -2176 -642 500 1278 1545 2373 2800 2909 1666 912 1111 1058
969 1058 110 -608 -405 -171 -877 -1836 -2216 -2102 -2102 -2324 -2205 -1323 34 854 1160 1876 2922 3407 2678 1664
989 1664 1266 1111 18 -893 -1706 -1668 -1169 -1722 -1965 -1707 -933 -1241 -1373 -1266 40 573 755 1351 1932 2660
1009 2660 2868 2178 1371 1233 628 -895 -1923 -2072 -1369 -1815 -2267 -1788 -1406 -569 -503 -359 -213 569 1033
1028 1033 826 1195 2192 2592 1835 1360 1093 1029 120 -1051 -1919 -1631 -1737 -2103 -2321 -1156 -343 -157 -353
1047 -353 497 1194 911 991 700 845 1315 1355 906 548 1110 673 -290 -1033 -816 -1287 -1788 -2104 -1308 -312 -47
1068d7J04J07M97P88o4p12j93L34j28p98K98N2P7n33l60j87M51k94j087J79Q82
1089f34N50k07K05O63P95J77m42j68l25K80n47o02j77Q35k02j110K03N89l51l45
1109h13o08K94L79J99K51J97R14N53j48l50N64K57p62m86o13J42O5o09j49l0J31
1130f22L0o27q5N23k2j34p5N85J148L61J20k92M18M92m07q58j57l9l60j054J17
1151i38K43J26m09k11J28J46M33l66qP28P28K0R6R15K82k27q00m47L11o42q57
1172g49m12n6N52m9r09N50P75K16l98r5N39M63J09K10K97n4N32l60p29k06K23
1193D49o32j059k5o0J80l80N0R76L79L42k51K37R99K0j08o27O50M70n90k90n47
1214A83l46o9q77o08n3M65j50k78P60J041M86p6N48K60L70m21j60j34J91k84m97
$$ plain form
1068 -47 57 164 661 1449 1385 673 480 814 686 -112 186 238 315 -218 -578 -765 -314 -608 -1695 -1516 -634
1089 -634 -84 -291 -86 577 1372 1549 1107 939 614 894 347 -255 -432 403 201 -909 -706 -117 -468 -813
1109 -813 -1421 -1127 -748 -549 -298 -101 813 1366 1218 868 1432 1689 927 441 -172 -30 35 -574 -723 -753 -622
1130 -622 -592 -1219 -1304 -781 -803 -937 -1012 -427 721 1082 1202 910 1328 1820 1413 555 398 359 -1 -1055 -938
1151 -938 -695 -569 -978 -1189 -1061 -915 -482 -848 -856 -128 600 620 716 1631 1913 1686 886 439 750 108 -749
1172 -749 -1161 -1217 -665 -714 -1623 -1073 -298 -82 -480 -575 -36 427 536 746 1043 989 1521 1161 432 226 449
1193 449 -183 -1242 -1267 -1327 -1147 -1527 -1477 -501 -122 220 -31 206 1205 1225 1117 490 1140 1610 1020 730 183
1214 183 -163 -232 -1109 -1717 -1770 -1305 -1455 -1733 -973 68 554 478 1026 1286 1656 1235 1075 941 1132 848 351
1235C51m21N1k92q04n56k03k9Q41p15L83P55J093J48M85L39O58K54j202R3J51
1255A380n13o36m55k60J3l41o97m03N50K1J35j34O91N94M62J85N66P43K32l83
1275A750o31l79K50o23q61o42M50k06o41j37O62L61k3k02M96O40N87j19Q7K78
1295A097P38J54j173o2J1k64r18j099L76K28l63k66J80P18J94Q0J86M43P84k0
1315A024m38L64J78R3j08n25mm7o85o32n96J68P6o4k69M82P84J09k42P25O70o3
1337A000l60K37j4K73k85n50p7pr9p78m02p5L09l49p8J13P67K88P6K61N11M35
1359A196j49j63J83k15j74k67n95M57N8o17n97J51pJ00m16q3L91O52RK0J45R34
1381A013N16q30K01P7m3k79p19j45K19l81q4l67M30l45L9k66J22O31K0j60J52
$$ plain form
1235 351 -70 -19 -311 -1115 -1671 -1874 -1903 -1062 -1777 -1394 -639 454 602 1087 1426 2084 2338 1136 1229 1380
1255 1380 867 231 -224 -484 -471 -812 -1509 -1912 -1362 -1341 -1206 -1340 -649 -55 407 592 1158 1901 2133 1750
1275 1750 1119 740 990 367 -494 -1136 -686 -892 -1533 -1670 -1008 -647 -670 -872 -376 264 851 732 819 1097
1295 1097 1835 1989 816 754 765 501 -417 -1516 -1140 -912 -1275 -1541 -1361 -643 -449 -369 -183 260 1044 1024
1315 1024 586 950 1128 1221 1113 588 584 537 -148 -780 -1376 -1208 -1132 -1196 -1465 -983 -199 -90 -332 393 1063 1000
1337 1000 640 877 863 1136 851 301 224 217 118 -660 -1062 -1137 -828 -1177 -1255 -1142 -375 -87 -11 250 761 1196
1359 1196 1047 884 1067 852 678 411 -184 273 331 -286 -883 -732 -739 -639 -1055 -1138 -747 -95 -86 -66 79 1013
1381 1013 1529 699 900 977 934 655 -64 -209 10 -371 -455 -822 -392 -737 -698 -964 -842 -211 -191 -351 -199
1402a99O90N19j22N0J42j84R7r30p9j78J16n30p3m34N91p4O8k15K58L47Q1k46
1424c05M70O58J21l02r2M99j98j14o87k87P1j37j74n59N60J64l04j65K93L37J53
1445Bj58J87M9O82k6q0P4J26j59l94k57o0J22p26l33J70J62j95P3R0N33K27m7
1468F2K12o7L88M73n56M5Q4K68m01k77l47l5k05o23j11J99J24K52l26O35M19j17
1490I6j06J70Q41r8K73m20j72L06n33k99l69L15Mq59J11j73R9R3m4L20L41K90
1512A86K44L4P0M86O0k09l57J37J7l98p47J23nk78m22J43K5M17j37k4N48K41p2
1535H2L50K43K82n6J76o78J08K87n03k98l20K51k93n98J79J0L57j24N8p6P57L28
1557E22k36j1L50L30o9m63J18j00j67j82l88o6k0o7k05J37j67NJ53J76M81L56
$$ plain form
1402 -199 491 1010 888 938 1080 896 993 63 -16 -194 -78 -608 -681 -1115 -524 -598 -530 -745 -487 -140 -59 -305
1424 -305 165 823 944 642 550 1049 851 737 50 -237 -166 -303 -477 -1036 -476 -312 -616 -781 -488 -151 2
1445 2 -156 31 80 762 736 656 730 856 697 303 46 -14 108 -618 -951 -781 -619 -814 -741 -651 -118 109 62
1468 62 274 207 595 1068 512 557 641 909 508 231 -116 -151 -356 -979 -1090 -891 -767 -515 -841 -206 213 96
1490 96 -10 160 1001 903 1176 756 584 890 357 58 -311 4 8 -851 -740 -913 -814 -721 -765 -445 -104 186
1512 186 430 464 534 1020 1080 871 514 651 668 270 -477 -354 -359 -637 -1059 -916 -891 -474 -611 -635 -87 154 82
1535 82 432 675 957 901 1077 399 507 794 291 -7 -327 -76 -369 -967 -788 -778 -421 -545 -487 -563 194 522
1557 522 286 275 625 955 886 423 541 441 274 92 -296 -362 -382 -449 -654 -517 -684 -679 -526 -350 131 487
1579D87K4p9J05N62p9p9n53JK36p19o46L36K77n51m15K07J72L82o5l9L05L69Q7
1602C25L38k22J96K68k78j9k6ln50l24M4l80R4j38o48M70N11Q4k45M57O99l53
1624C00q7M36k74K41J41q7r1j70K0n22l52j9l2m74K42k15K75M27l63M00K76M83
1646E55n5qP7L36l0l53j00P4j18k59j99l39J39j88k84m62N24K99j5k64P50K35
1668C15L57k27K82J26j30M77r31m1j24Kn86l2k8L02l86j91K08J62J4L70l26N72
1690A85L02qQ0K16q6j53k7m97rL99p24j5m26q4N35o07K62JK62J72K31J48N85j06
1714F36J84K3k55J25p0l72k41Mm77j93k28J19q6O5o5M35K36j21N82Rl5N33n1Q7
1738H44k26P4p5j21m11k8m31pj74n09M47J88k46J13M25J35J6M03K85j88nL2J72
$$ plain form
1579 487 511 432 537 1099 1020 941 388 389 625 -94 -740 -404 -127 -678 -1093 -886 -714 -332 -397 -436 -131 238 325
1602 325 663 441 637 905 627 608 582 579 29 -295 -251 -631 -537 -675 -1323 -853 -342 -258 -503 -46 653 300
1624 300 213 649 375 616 757 670 579 409 429 -93 -445 -464 -496 -970 -728 -943 -668 -241 -604 -204 72 555
1646 555 500 492 569 905 875 522 422 496 378 119 -80 -419 -280 -468 -752 -1214 -690 -391 -406 -670 80 315
1668 315 672 445 727 853 723 1200 269 228 104 106 -480 -512 -540 -238 -624 -815 -607 -445 -431 -61 -387 185
1690 185 487 479 559 775 689 536 509 12 3 402 -322 -337 -763 -847 -312 -919 -657 -656 -394 -222 9 157 742 636
1714 636 820 843 588 713 643 271 30 34 -443 -636 -864 -745 -831 -766 -831 -396 -160 -281 301 310 275 808 757 844
1738 844 618 692 617 496 85 57 -374 -381 -555 -1064 -617 -429 -675 -562 -137 -2 14 417 702 514 509 541 713
1761G13Kp3j09o87m6J44j27m39Q7j91M17J41k56j21P53J68k12K3L60o5K30m41
1783B71L16k73j98k19n6j48J22l65j20r7L11J52N6j09M31K64l97K97L0M2l1K60
1805E39l11K37j04m29P7j8j78j89k25r1M16j17P8j13J77L49J00Q4j3J72J28J7
1827E86k05j16K58m52j46L26m05o0j69k28K91k8K6ok1K15K34q2M37N9K32l10N
1850D41m87M72l09M1k44p7k07k4m3j38m7J98K23j70L12J08Pq6L14k4J77K3j34
1873C26K16j36j35k29j20j65J26n04O1J53P2R7k12J18J62J97J13J37K06O6L3j26
1895D56r5J2j94J01k36k69M0j16j62j43k6N43Q5j82P0O9J39j05N43oJ94k09k00
1918C09M1M2l62N4l55o6Rn22M30j12K13P5N9L6P36n11L56q2k58L24p4k2L6k54
$$ plain form
1761 713 715 642 533 -154 -200 -56 -183 -622 -535 -726 -309 -168 -424 -545 208 376 164 187 547 482 712 271
1783 271 587 314 116 -103 -159 -307 -185 -550 -670 -767 -456 -304 -248 -357 74 338 -59 238 268 310 279 539
1805 539 228 465 361 -68 9 -9 -187 -376 -601 -692 -276 -393 -315 -428 -251 98 198 282 269 441 569 586
1827 586 381 265 523 71 -75 251 -154 -214 -383 -611 -320 -348 -322 -328 -349 -134 100 18 455 514 746 436 441
1850 441 -46 426 117 158 -86 -163 -370 -394 -437 -575 -622 -424 -201 -371 -59 49 56 -30 284 260 437 460 326
1873 326 542 406 271 42 -78 -243 -117 -621 -560 -407 -335 -238 -450 -332 -170 27 140 277 483 549 582 456
1895 456 361 373 179 280 44 -225 -185 -301 -463 -606 -632 -89 -4 -186 -116 -47 92 -13 530 524 718 509 309
1918 309 350 392 30 84 -271 -337 -328 -850 -420 -532 -319 -244 -185 -149 587 76 432 350 92 416 342 320 356 102
1942A02Q3m3m04j66J50o2j22j46R0K27J79j94J56K58K68j20J84p9j49j54J41K59
1964D58j45k53lm24K41j79j08j16R1R3j06J49K17K34J22J71P5j42k21L34N6j95
1986C49Mm22j19m6j86P7k74Q2O0K68j9j2L72m5J52p2J68r8M58j90l17j84L25j87
2010A44n00J57q7R3l6l97M87j19K4Pr9K56N5L68j93L20P3k21j5m38K05l1k25r6
2034b68J83j29j15j05L3J41J34K45r4L3K28O0J40j19J39M9j64k17l05L93n14k17
2056d69K00q2J82q5j32J05L1L80q4J60p4J97K51l20k28K85J33l89L33k71O8r1
2078A00l96k02L60m09K31j8j0K37j2J0J99l4M5K64j44O4o6K4M0n1J36l54k55j92
2102d33N98m17k07P6K50oL04j33j87K29J65K09j6K0l26J91k18o2o9q5j09j22J51
$$ plain form
1942 102 185 142 -262 -428 -278 -340 -462 -608 -518 -291 -112 -306 -150 108 376 256 440 361 212 58 199 458
1964 458 313 60 57 -367 -126 -305 -413 -529 -438 -345 -451 -302 -85 149 271 442 517 375 154 488 544 349
1986 349 353 -69 -188 -234 -420 -343 -617 -535 -475 -207 -226 -238 134 89 241 169 337 239 697 507 190 6 331 144
2010 144 -356 -199 -286 -193 -229 -626 -139 -258 -234 -227 -326 -70 -15 353 160 480 553 332 317 -121 84 53 -172 -268
2034 -268 -85 -214 -329 -434 -401 -260 -126 119 25 58 286 346 486 367 506 555 391 174 -131 262 -252 -469
2056 -469 -269 -351 -169 -254 -386 -281 -250 130 46 206 132 329 580 260 32 317 450 61 394 123 191 100
2078 100 -296 -498 -138 -547 -316 -334 -344 -107 -119 -109 90 56 101 365 221 285 219 243 283 232 368 14 -241 -433
2102 -433 165 -252 -459 -383 -133 -139 165 32 -155 74 239 448 432 452 126 317 99 37 -32 -117 -226 -348 -197
2125a97J9k55J3L2K68j15J62n8L05J00k31m6J93L56m13J54k39j69j87K15j43N0
2147a86q8Q0j72K6K64K08k70J29%L22K78k09p6k49M12n57L04l87K27k57j1K10
2169bk32Q6L45m06N3M2N6P6k48M18M62o13J59l0J36J02j26k78k48N2m24M37k49
2192d32K79KK55j07j60J06P3J89k31L65j17p0l9L8J70m08q8R6j00j76K52l21K30
2215a94p6m1J5J49J88l65M49p4J59Jk1j94N2O6N0j69q0O6K22l85J2j90R5K28m39
2240d76L15L0J85n7K66l36K63R9j74j09J38jk25J49k06L51m60J35K58j53m52K03
2262b57M57n16L80O9jj12M1M4J63m4k46j12K31j40n3j46J89N3p4k06L00P7m54
2285c57K91j04m0K69j01K37n4l14K98m0j32Q7O9O8k30Kj38q8MM09l41j5K26r6
$$ plain form
2125 -197 -178 -433 -420 -388 -120 -235 -73 -131 174 274 43 -3 190 546 133 287 48 -121 -308 -93 -236 -186
2147 -186 -274 -194 -366 -340 -76 132 -138 -9 -9 313 591 382 306 57 469 -88 216 -171 56 -201 -212 -2
2169 -2 -234 -148 197 -209 -156 -114 -58 18 -230 188 650 37 196 166 302 404 278 0 -248 -196 -620 -183 -432
2192 -432 -153 -151 104 -3 -163 -57 16 205 -26 339 222 152 113 151 321 -87 -175 -79 -179 -355 -103 -424 -194
2215 -194 -270 -311 -296 -147 41 -324 125 51 210 211 190 -4 48 114 164 -5 -85 -19 203 -182 -170 -360 -265 -37 -476
2240 -476 -161 -131 54 -3 263 -73 190 289 115 6 144 143 -82 67 -139 212 -248 -113 145 -8 -460 -257
2262 -257 200 -316 64 133 132 20 61 105 268 224 -22 -134 97 -43 -96 -242 -53 0 -74 -280 20 97 -357
2285 -357 -66 -170 -210 59 -42 195 141 -173 125 85 -47 40 109 177 -53 -51 -189 -277 -273 136 -205 -220 6 -90
2309i0qJ34L1J04p3m0O7j07M9J53q8j17r6j89n7M18l12J22k3Nl8NJ97lKJ36r7
2336H5R3j57J33k9J71j36k21m7J49j85K5k2J58j38q2R2j22L12l3o3k12O53k11
2359B13Q0m75N12j95j78Q1l1J58J4l43L1J53Rk02K65k24j1K12j75J34Q3j21K99
2382B89Ol11J80P3l06K77k76j69o2L86k38J80l54K29J16R7p6K71j58J25j61J18
2404B36j66K84j92k03Q8j48K33l45J96j77q6M5lK37l13M70j42o4J0j19J87r3J60
2427I5j49P3K1j51q4m4J21J44k73Q1q0j6O6j09K0L73J7k75L37P9K9j07k97L52
2451B23N5k50R4j22k95J17J31n8Q3R8N2l27K1M06k4k20p5K48J60Jk45J36j72j65
2475a28J28K49n60J46K9j40NL66J54j73j00L14l48L29N5j76K5m20K55j35K75l23
$$ plain form
2309 -90 -98 36 67 171 98 58 125 18 67 220 132 15 -81 -270 -327 91 -221 -99 -122 -117 -155 -150 47 44 46 182 85
2336 85 178 21 154 125 296 160 -61 -108 41 -144 -119 -141 17 -121 -203 -111 -233 79 46 -17 -229 424 213
2359 213 293 -182 330 135 -43 38 7 165 179 -164 -133 20 29 -173 92 -132 -143 69 -106 28 111 -10 289
2382 289 295 -16 164 237 -69 208 -68 -237 -299 87 -151 29 -325 -96 20 117 41 312 154 279 118 236
2404 236 70 354 162 -41 47 -101 132 -213 -17 -194 -280 -235 -238 -1 -314 156 14 -50 -40 -159 28 -65 95
2427 95 -54 19 40 -111 -195 -239 -118 26 -247 -166 -246 -262 -196 -305 -285 88 105 -170 167 246 275 168 -129 223
2451 223 278 28 122 0 -295 -178 -47 -105 -22 76 128 -199 -178 228 204 -16 -91 157 317 318 73 209 37 -128
2475 -128 0 249 -311 -165 -136 -276 -271 95 249 76 -24 290 -58 271 326 150 175 -245 10 -125 150 -173
2497a73J32k0J48k71K02j59L51l09J15J16l82K50j80L79m38L87k98j14K08K02
2517A46N8l31k7J43O1j44K36k96N6L69k87Lj43J75J98k24J44l00L53l44K36j79
2539i7j50K39j60K39lL0j89K31o8K0j70J42M4k62M81l69J27J64k38j9N5k3j2R
2563B1Pr8k09J80J21M7QL51n05j20K23n1j99M20o2N6k98J64K1k55J86j3l05K40
2587g0o5J11l5j48L86k08J90j61j04JJ6l7K42j20K0k8o7P8L7j62L61j84Nk25L77
2612B10m16J72n5q1q7O3L13K45k54p9n5n2j41L92j5j61k50K25j76j88L30M1R5
2635G6k43j51K85K65j36j90k9P4L7j04Q1J18m14N18M5k74k4j19M08l53N8P0J64
2658A62j15J10k42K23j22n8Q5k29O3L28k72L1K6K58k20k68k9L08p2kOk1j32M28
$$ plain form
2497 -173 -41 -61 87 -184 18 -141 210 -99 16 132 -250 0 -180 199 -239 148 -150 -264 -56 146
2517 146 204 -127 -154 -11 50 -94 142 -154 -98 271 -16 -13 -156 19 217 -7 137 -163 190 -154 82 -97
2539 -97 -247 -8 -168 71 68 98 -91 140 72 92 -78 64 108 -154 327 -42 85 249 11 -8 47 24 12 21
2563 21 28 -70 -279 -99 22 69 77 428 -77 -197 26 -25 -224 196 134 190 -108 56 77 -178 8 -5 -310 -70
2587 -70 -135 -24 -59 -207 179 -29 161 0 -104 -103 -87 -124 118 -2 18 -10 -77 1 38 -124 237 53 58 -167 210
2612 210 -206 -34 -89 -170 -257 -194 119 364 110 31 -24 -76 -217 175 160 -1 -251 -26 -202 -390 -60 -19 76
2635 76 -167 -318 -33 232 96 -94 -123 -49 -12 -116 -35 83 -331 187 232 -42 -66 -185 223 -130 -72 -2 162
2658 162 47 157 -85 138 16 -42 43 -186 -123 205 -67 -36 -10 248 28 -240 -269 39 -33 -35 -29 -50 -182 246
2682B46k63N0R9K1mj63P1l13L42l44K35K16m24R7P6j9Q9J91o8j2J12k96mK47j13
2707F9K00m42J91k5O0J17m16j41K54nk02M92k71J21J15J3k19P7n0q2J67J17k54
2730a14L65j0k11l17K63j32J92o4J31N2k90K03k09J25J65j16k66J53q7J24J8j3
2752c8K88l94J35O5j57J23r0J88k43J27k4K79k89J07j12j7J19j36j60K81L9k34
2774a43q1K82OJ3l52M07n2j94J99qJ5r9j15J88K3p1Mj26J85NN1k21J22j60J42
2799B0j10j74K48l85L07K70k19j20K57o8L69l97Q4j21M6L1L3j27o1K60j14J9M4
2822I2k54j65M15k84K39N1j69K05j62m0o9J76M1K3n3L3j42L0M3J20L0l59Q9L32
2846B22J02l20j49K43j26n6n9K17j33J35j43R6j0m3O8N9k73P6k46L00j27L41j01
$$ plain form
2682 246 -17 33 132 153 149 -14 57 -256 86 -258 -23 193 -231 -134 -58 -77 12 203 135 123 235 -61 -65 182 69
2707 69 269 -173 18 -7 53 170 -246 -387 -133 -138 -340 152 -119 2 117 130 -89 -12 -62 -144 23 140 -114
2730 -114 251 241 30 -287 -24 -156 36 -28 103 155 -135 68 -141 -16 149 33 -233 -80 -167 -43 -25 -38
2752 -38 250 -144 -9 56 -101 22 -68 120 -123 4 -20 259 -30 77 -35 -52 67 -69 -229 52 91 -143
2774 -143 -224 58 64 77 -275 132 80 -114 85 77 92 -7 -122 66 89 18 22 -104 81 86 137 -84 38 -122 20
2799 20 -90 -264 -16 -401 -94 176 -43 -163 94 26 395 -2 82 -39 7 38 71 -56 -117 143 29 48 92
2822 92 -162 -327 88 -196 43 94 -75 130 -32 -72 -141 35 76 99 46 79 -63 -33 10 130 160 -199 -110 222
2846 222 324 4 -145 98 -28 -84 -143 74 -59 76 -67 29 19 -24 44 103 -170 -94 -340 -40 -167 174 73
2869G3k5J69l21L42k09K18m97Q7M77k39km4o1J76j49J32K0m1q7r8K20j69J14l2
2893E4Qo9L3j58R6K79l2l93LL33j17P6J97l23J89j48m7nQJ33J39l56L03l21J09
2918ir2O8n2O9J57q5q6l5J32k5o9Q6O9J78k63O9mj16p2j28L29K3l7k10K42j07
2944C2K50n5k83K68j69j39J66j23J43j34k0O8J09J1j91k02j24K89n6R6q2J31j18
2967a33K39j74J74j98K71j05p5K5kJ7Jk84J45J02Qj20J00O7j19L16n5j77R3j78
2991f2R5O4k8M8j82j12O2J4j36L26Q2p3k41Q4M3j89J98K37j41j77J2K10k26K79
3015A87k56L33j13j42K1j6k04J71j14j83K94K44n48J88J27o0K71k38j73J78L28
3036B95n04L23qj33L17l57j1L56j99LJ69m54J73O0j04m9J54j07M53l8k13m48L27
$$ plain form
2869 73 48 217 -104 238 29 247 -250 -163 314 75 73 29 -32 144 -5 127 147 106 19 -79 141 -28 86 54
2893 54 62 -7 26 -132 -36 243 211 -182 -179 154 37 113 310 -13 176 28 -19 -24 -16 117 256 -100 203 -118 -9
2918 -9 -101 -33 -85 -16 141 56 -30 -65 67 42 -27 59 128 306 43 112 108 -8 -80 -208 121 144 107 -103 139 32
2944 32 282 227 -56 212 43 -96 70 -53 90 -44 -64 4 113 124 -67 -269 -393 -104 -160 -64 -146 -15 -133
2967 -133 106 -68 106 -92 179 74 -1 24 22 39 40 -244 -99 3 11 -109 -9 58 -61 255 200 23 116 -62
2991 -62 33 97 69 117 -65 -177 -115 -101 -237 89 171 98 -143 -59 -16 -205 -7 230 89 -88 -76 134 -92 187
3015 187 -69 264 151 9 30 14 -190 -19 -133 -316 -22 222 -326 -138 -11 -71 200 -38 -211 -33 295
3036 295 -209 114 106 -27 290 -67 -78 278 79 82 251 -203 -30 30 -74 -123 31 -76 377 339 126 -322 5
3059Ej30K86m88L88n6k42J61J26k61J28K30m63K97O3K55k06o0J4J13K1k41K58
3081A98l14J62p0N5J52k80J1j75L95k86K91M9p8j44r7M0K7q0J04p7P7k6o4K47
3105A17l11M13l79K49K9l75L34l41K35j76j61L31L5j92K52n8k7J59k38m8K70k04
3127h6O5J96j73J40l8j9K7k4j3l22J61J96m3k68L31j21L9K1k18l5J88k52L91j98
3151e5r1L54k04Q4Ql33L31r5J03k82K54k64L92j66j11M2L24mm29M46j96J26k54
3174b0J11j77L32j83JN6k51j75L11J45n8k61J85J17m6j82K23l86J71j95N95l02
3196A1j03K22j74k56L71K0j2r9j40K49l74K51J82k33K10K9p0j71j1M44n44K09
3218A1j17K28j87K54j01k06j04J11r0M7J79l44R8J01K9p3K55j17J73k13L49k05
$$ plain form
3059 5 -125 161 -327 61 5 -237 -76 50 -211 -83 147 -316 -19 44 299 93 33 47 160 181 -60 198
3081 198 -116 46 -24 31 183 -97 -86 -261 134 -152 139 188 110 -34 -131 -91 -64 -144 -40 -117 -40 -66 -130 117
3105 117 -194 219 -160 89 118 -257 77 -264 -29 -205 -366 -35 0 -192 60 2 -25 134 -104 -152 118 -86
3127 -86 -21 175 2 142 104 85 112 88 75 -247 -86 110 67 -201 130 9 48 69 -149 -184 4 -248 143 -55
3151 -55 -146 208 4 88 96 -237 94 -1 102 -180 74 -190 202 36 -75 -33 291 287 -142 304 108 234 -20
3174 -20 91 -86 246 63 64 120 -131 -306 5 150 92 -169 16 133 87 -95 128 -258 -87 -282 313 11
3196 11 -92 130 -44 -300 71 91 79 -20 -160 89 -285 -34 148 -85 125 154 84 -87 -98 346 -198 11
3218 11 -106 122 -65 189 88 -118 -222 -111 -201 -154 25 -319 -221 -120 -91 -164 91 -26 147 -66 283 78
3240G8N3j03J29j35J08k83K49m7j11J64k07O0k1J23p9Q7qL4K6k2j34q4J17J58
3264A52q8j15K03j71k99K84L85m99j0J44j09L86m20K55K6p3K01k41J55l53L62
3285A75l24J31J2l5J1k44M00kM5j77j91Q6j34K24k54K47L06j89J19m70L44o6j84
3308a70P5P7J44l42j9L15J7k18K76r7k62M39k35K98K9k99K55j84k26n9K56j62
3330i2J25j05p5K14n7j08K4r3J27n5r0K39l5r0j8J63J48j11k98K14m7J10j19K13
3354A84j61L89L3l04j71r1K69j64l1p0m2K35J57k38l1p3J69J8k58K92K6P4Ro34
3378d13M21J09k94J08L87l79j44K15j92L63k03K56J06k90J02j8j58O4j76p1K24
3399A7N0k56J68j31Q2r8L05k44j19J44N7J34r7k4p9L23j57j24M27m62L36l70K21
$$ plain form
3240 78 131 28 157 22 130 -153 96 49 -62 102 -105 -45 -66 57 -22 65 57 91 117 95 -39 -123 -6 152
3264 152 64 -51 152 -19 -318 -34 351 -148 -158 -14 -123 263 -157 98 124 51 252 11 166 -187 175
3285 175 -149 -18 -6 -41 -30 -274 126 124 169 -8 -199 -113 -247 -23 -277 -30 276 87 206 -264 80 14 -170
3308 -170 -95 -18 126 -216 -235 80 97 -121 155 58 -204 235 0 298 327 28 283 99 -127 -186 70 -92
3330 -92 33 -72 -147 67 10 -98 -74 -167 -40 -95 -185 54 19 -71 -89 74 222 111 -187 27 -20 90 -29 184
3354 184 23 412 445 141 -30 -121 148 -16 -47 -117 -159 76 233 -5 -36 -109 60 78 -180 112 138 212 221 -413
3378 -413 8 117 -177 -69 318 -61 -205 10 -182 181 -22 234 340 50 152 134 -24 40 -136 -207 17
3399 17 67 -189 -21 -152 -70 -168 137 -107 -226 -82 -25 109 12 -12 -91 232 75 -49 378 -84 252 -118 103
3422A03k2j04J49j17j67J15J66k56N0L02k82j78J26P8N2j5J38j07L06m17l3m7
3444a60P5J97O0j66o9P3%o0j8J02J8j60J19J32p7M0l83K96J29l48J68qQ0Pq8j7
3470e8o4L70k08o5j33K65q5M0R4n8j79nJ87J80l86J79J01j63J32j24R8j43p7J20
3494A8j84R5K33j72M9rmJ41r7Q5L6m17J53K44j45j45K98j34m6Q0Qp0l63K40K81
3519A75m8j24J99k57L7J51j91J60m3l29L97J13q1l40M17j62j34K20m47K09k77
3540c55N14l10J39J89k52K03j11Q2rk7k55L11n6j81P9LJ26q6l00M61k27j9K52
3563A71k92M56j59j30J45j19j32J98pK4o4n6j46J50j51L99j80k62p9K14j24o6
3585b10N9K58m27M92m17K98M6j46J86o0K7l51K75qK47j25k10J36l36J11K33p9
$$ plain form
3422 103 81 -23 126 9 -158 -43 123 -133 -83 219 -63 -241 -115 -37 15 0 138 31 337 -80 -113 -160
3444 -160 -85 112 172 6 -63 10 10 -50 -68 34 52 -108 11 143 66 106 -277 19 148 -200 -32 -40 40 47 -41 -58
3470 -58 -122 248 40 -25 -158 107 22 62 156 98 -81 -86 101 281 -105 74 175 12 144 20 118 -25 -102 18
3494 18 -166 -71 162 -10 39 30 26 167 70 155 191 -226 -73 171 26 -119 179 45 -1 79 87 17 -346 -106 175
3519 175 127 3 202 -55 -18 133 -58 102 59 -270 127 240 159 -181 236 74 -60 160 -287 -78 -355
3540 -355 159 -151 -12 177 -75 128 17 99 90 63 -192 119 63 -118 -39 -36 90 4 -296 165 -62 -81 171
3563 171 -121 335 176 46 191 72 -60 138 131 155 91 35 -111 39 -112 287 107 -155 -234 -20 -144 -210
3585 -210 -151 107 -320 172 -245 53 99 -47 139 79 106 -245 30 22 269 144 -66 70 -266 -155 78 -1
3607aJ37j93J03K30l81K84j91k37L83n5j35l4pQ0Q4j81J01J35k21r9J42J65j31
3630b2j97L27k37qJ23k0r2K42j95P8K5j39K26n6j19k28K12qMJ47j12j06Q2m7L99
3655B79k35j11r9J34L15l35J71p1l29N83k40j3q4o3j45J57J28r9k01K39q9P9R
3678b0m9J15k0l5o5l0J47J15j15j95L44j97r7L46l31J01r2K26K22k55k56P0j19
3701a90K13J14k77K20n3J26j86q9k02K23J96j48Q9Rn0m4K6p3j63K45K35R6j99
3724A18J94l03J0k03K43j24kN8L62l58J30k76J17J50j72j26L61j38m50N17o0J24
3746A72k2J35l76j54K26j49J28R1k28J98k83n1J57L2L25j62q0P6K62l72P5q2J85
3769A03l25L83k28p1K56p1J2k16J90J38k56J00j36J22Q9j8J23l89K16o9r4oQ9
$$ plain form
3607 -1 136 -57 46 276 -105 179 -12 -249 134 79 -56 -90 -97 -17 67 -114 -13 122 -99 -198 -56 109 -22
3630 -22 -219 108 -129 -137 -14 -34 -126 116 -79 -1 24 -115 111 55 -64 -292 -80 -88 -84 63 -49 -155 -73 -120 279
3655 279 44 -67 -166 -32 283 -52 119 48 -281 302 62 49 -35 -98 -243 -86 42 -57 -258 -19 -108 -29 -20
3678 -20 -69 46 26 -9 -74 -104 43 158 43 -152 192 -5 -102 244 -87 14 -78 148 370 115 -141 -71 -190
3701 -190 23 137 -140 80 27 153 -33 -122 -324 -101 95 -53 36 45 -5 -49 -23 -96 -259 -14 221 317 118
3724 118 312 9 19 -184 59 -65 -67 -9 353 -5 125 -151 -34 116 -56 -182 179 41 -409 108 48 172
3746 172 150 285 -91 -245 -19 -168 -40 51 -177 21 -262 -313 -156 -124 201 39 -41 35 297 -75 0 -82 103
3769 103 -222 161 -67 -138 118 47 59 -157 33 171 -85 15 -121 1 90 72 195 -194 22 -47 -141 -147 -58
3792e8q7M86l69j19m5J23j36J60j72J53J44k46M13j89l9J51o4J38K2j99P4l7j57
3815e3J6J40j18j70L36j08l77M89l40J43j66J80J1Rn7K25l28K25L44k64j96J40
3837H1M7k71K65N7j51jl8j80K16p7J44K5k19K17k9L1l10P10l80k74L15j4J01l25
3861f0J36N5O5m30J33rj05J23J46q4M3k23J84J19o6M5j7Jj65J28O8O6o7k5j6j31
3887h6o7J06J9l8o8J9kj10K03r8J97j44Q7L4j70J26j53R7J92O0k20P4k1j64J94
3912F7K25m82J22m7j90K47K50j94p2qK15k31O5KK1N3j2L1J56o8k47R0P4K61k85
3937D3j54K46r4j58r0L60k42J71j62L72k92j25L10k33J18j10N8L69l39k9p7M3
3959a5j25QL23k83J43J90j52j28l3P3j30K63j98l8J80j02n3O3J63l16O1j70L68
$$ plain form
3792 -58 -145 341 -28 -147 -192 -69 -205 -45 -217 -64 80 -166 247 58 19 170 106 244 266 67 141 104 -53
3815 -53 -37 103 -15 -185 151 43 -334 155 -185 -42 -208 -28 -17 -8 -65 160 -168 57 401 137 -59 81
3837 81 128 -143 122 179 28 27 -11 -191 25 -52 92 117 -102 115 86 117 -193 517 137 -137 178 164 265 -60
3861 -60 76 131 196 -234 -101 -110 -215 -92 54 -30 13 -210 -26 93 27 72 55 56 -109 19 87 153 86 61 45 -86
3887 -86 -153 -47 -28 -66 -134 -115 -117 -227 -24 -122 75 -69 18 52 -118 8 -145 -48 144 204 -16 58 37 -127 67
3912 67 292 -190 -68 -115 -305 -58 192 -2 -74 -82 133 -98 -33 -31 -10 43 31 62 218 150 -97 -7 67 328 43
3937 43 -111 135 41 -117 -207 153 -89 82 -80 292 0 -125 185 -48 70 -40 18 387 48 19 -58 -15
3959 -15 -140 -132 191 -92 51 241 89 -39 -72 1 -129 134 -64 -102 78 -24 -77 -14 149 -167 -106 -276 92
3982I2j41J10j00J75o4o8j31K73M4j95j35L00p4j08p7j13P6Q4l9J89Q1q6j80j16
4006b03N47k26k63J99j19M7K0j46L02k13p2l7M26l50k4j12L80j22J41j35j43K08
4028A05k61o9K70k54k0N8%P2j42K49j27J77j91J03k74M14r9j05j27M9J35J47l16
4051b06K35r2MK89j97PJ54j40N1l16M38m26Q0n1K14k05K13k11P0j25R4K8J27j40
4075a05J29l50ML33k23L34j43K5J51k8k81k9J65L7J2q1l3j2K33K85n03M9N3l05
4099b83K80J12n8J23k99J9J74j18K78k59O0j41K17j34P5q0L9P4P0oj83J59k02
4122h3K37j92j7l4J22j84K12R4k46K06k07LJ61j98J64L40j71l24J2K17N0l03J65
4145B4J32j25J1m5Q1k40K2j48K78j76Q6L5j68L27j96J29j28M5ml6O3J49J01k14
$$ plain form
3982 92 -49 61 -39 136 72 4 -127 146 190 -5 -140 160 86 -22 -99 -212 -136 -52 -91 98 179 93 -87 -203
4006 -203 344 118 -145 54 -65 -18 2 -144 158 -55 -127 -164 262 -88 -112 -224 156 34 175 40 -103 105
4028 105 -156 -225 45 -209 -229 -171 -171 -99 -241 8 -119 58 -133 -30 -304 110 11 -94 -221 -172 -37 110 -206
4051 -206 29 -63 -59 230 33 40 194 54 105 -211 227 -199 -119 -170 44 -161 52 -159 -89 -214 -120 -92 35 -105
4075 -105 24 -326 -322 11 -212 122 -21 4 155 127 -154 -183 -18 19 31 -50 -83 -95 138 423 -80 -31 22 -283
4099 -283 -3 109 51 174 -125 -106 68 -50 228 -31 29 -112 105 -29 46 -34 5 79 149 143 -40 119 -83
4122 -83 154 -38 -55 -89 33 -151 61 155 -91 115 -92 -89 72 -126 38 378 207 -117 -105 112 162 -141 24
4145 24 156 31 42 -3 78 -162 -140 -288 -10 -186 -100 -65 -233 94 -102 27 -101 -56 -60 -96 -33 116 217 3
4169CK01j8l7j27r0K61j23j25n1K96k36k21K87k4O1M9j02L9j05kK77m00K2J42
4193b3k25K27p7l0M89l59Q0k59L24j82O3Q8r6j64K96Q7j46j81J29j92Q8K95l40
4216a08J15m2k9K8K1o3O8Q7j04Q6j71J16J34k82L81j93Lk8M0M4n5k41J53r0J97
4241F7m3J12j54L8%j6j17O4J82q7K7p4J20k37L71m0m90K71L3p9l7J94m07L33k28
4266a97M59k88J8k4p6j32K67K01N0l69j81L36k8N3j55l6J89m1l10J55J88j92M05
4289B92k06j50J32K27l64J17J36k63j03K08JJ92l60J9J57Q4j19N4r9J11j71O1
4311d4pm1kJ3J35j8L37m95K58j12J37j44j93M70j63k81K72j15pN5J53n4j9k26
4335i1J25N8j06J58j46m3O2K29j19k65L05l39J06L38k46R0k03K03n69M80j54j56
$$ plain form
4169 3 204 186 149 22 -68 193 70 -55 -106 190 -46 -267 20 -4 57 106 4 43 -62 -64 213 -187 -165 -23
4193 -23 -248 -21 -98 -128 361 2 82 -177 147 -35 28 116 20 -144 152 239 93 -88 41 -151 -63 232 -108
4216 -108 7 -35 -64 -36 -15 -78 -10 77 -27 59 -112 4 138 -144 237 44 47 19 59 103 48 -193 -40 -130 67
4241 67 24 136 -18 20 20 4 -113 -49 133 46 73 -1 119 -118 253 213 -277 -6 27 -52 -89 105 -302 31 -197
4266 -197 262 -26 -8 -32 -108 -240 27 228 278 -91 -272 64 36 89 -66 -102 87 46 -264 -109 79 -113 292
4289 292 86 -64 68 295 -69 48 184 -79 -182 26 27 219 -141 -122 35 119 0 54 -45 66 -105 -44
4311 -44 -51 -92 -94 -81 54 36 373 -122 136 24 161 17 -176 294 131 -150 122 7 0 55 208 154 135 -91
4335 -91 34 92 -14 144 -2 -45 17 246 127 -138 167 -172 -66 272 26 116 -87 116 -453 27 -127 -283
4357b83N46k85J47n0k26J66M0j2j90J4J49R7l8O3k35J52j42N1j4K8j25lJ66j05
4381h9K8NQ2K13l41q8PJ94k43L8J74J13J0l38Q9K87L2j45q6N1K19j07p4j01nK77
4407B02j14j44M4J19k07K13R6p8q3L0K6n0r4J5K92k64j37j89L00j2j51J30R7K75
4431C16l79P2Q9Q1l67J27L7k7P3r2j3m0K20Qr8n4O40n99J73l03L60m31J84k73
4455b96L02o7J65j58O7j1n5R9J54k70K08k20n9J88k44J93l8Qk28O60l18o1j47
4478a28K0K48l59J79Q2n7q5pJ26J5j32Q2N03o67M5J56K07j83q0J3Q8k7J23L5l60
4503a63M6J76l61L01qOO9m0j49K31j68j21J35K28j7k68K91m22K68q2M7L37n05
4526a69L95j78k9Q0j94J19k7R9L1J23l80p6J92j10K37l0j07j49J77K88k58k0J6
$$ plain form
4357 -283 263 -22 125 75 -151 15 55 43 -147 -133 16 113 75 138 -97 55 -87 -36 -50 -22 -147 -150 16 -89
4381 -89 -61 -56 26 239 -102 -190 -183 11 -232 -194 -20 93 103 -235 -146 141 173 28 -58 -7 212 105 31 -70 -75 202
4407 202 88 -56 -12 107 -100 113 209 131 48 78 104 54 -40 -25 267 3 -134 -323 -23 -35 -186 -56 41 316
4431 316 -63 9 98 179 -188 -61 -24 -51 22 -70 -83 -123 97 105 7 -47 593 -6 167 -136 224 -207 -23 -296
4455 -296 6 -61 104 -54 13 2 -53 46 200 -70 138 -82 -141 47 -197 -4 -42 -34 -262 398 80 19 -128
4478 -128 -108 140 -219 -40 42 -15 -100 -107 19 34 -98 -16 487 -180 -135 21 228 45 -35 -22 66 39 162 197 -163
4503 -163 -117 59 -302 -1 -9 -3 66 26 -123 108 -60 -181 -46 182 165 -103 188 -234 34 -48 -1 336 -169
4526 -169 226 48 19 99 -95 24 -3 96 127 250 -130 -206 -14 -124 113 83 -24 -173 4 292 34 14 30
4549C0j27k19L55j61J88j12l0J07k56K00K8K0J6m3P0p5M8N6k46R8K55m80J88p8
4573a68K05J02p3j29J4j27L74j22r2k4j13J26j28R5N3J74p1j52J3m2j04M01k11
4596AL9j73J47p8M21n22pR0K22Qj59K27m5j54M1j5Q6n5J8j10j58m1J16J66N0l71
4622b56N4N5j02N10kk61jj20j64L38k25L8L58m78K17N4r2n0J25j6j39M16l69q3
4646a93J79L7J99n16M72j77K45k32r0J69J54p2j63O1K1Kj02j72J81j30J74l8J1
4669B0N4QQM8j04NM44n08j41J49J33k64J92J12k4k63N7pj1o4J70L4m15L10Q3L1
4695E7Q7m2l0j13K02l9j84J99qj47q9P5k25J52j67L70j89J09Q7k1k2l3J2j11P8
4720HM0j08MN0q8L07l75J4QO3J74J18k51J03o4rJ45m29M23p7j14K83n33J76k3
$$ plain form
4549 30 -97 -316 39 -122 66 -46 -76 31 -225 -25 3 23 39 -4 66 -9 39 95 -151 -53 202 -278 -90 -168
4573 -168 37 139 66 -63 -49 -176 198 76 -16 -40 -153 -27 -155 -60 -7 167 96 -56 -43 -85 -189 212 1
4596 1 40 -133 14 -64 357 -165 -172 -82 140 148 -11 216 171 17 58 43 129 74 92 -18 -176 -217 -101 65 115 -256
4622 -256 -202 -147 -249 261 259 -2 -3 -123 -287 51 -174 -136 222 -256 -39 15 -77 -127 -2 -18 -157 259 -110 -193
4646 -193 -14 23 222 -294 178 1 246 14 -76 93 247 175 12 73 94 96 -6 -178 3 -127 47 9 20
4669 20 74 82 90 138 34 39 483 -25 -166 -17 116 -148 44 156 132 -131 -74 -81 -92 -156 14 48 -367 -57 26 57
4695 57 144 102 72 -41 161 122 -62 137 129 -18 -107 -32 -257 -105 -272 98 -91 18 105 84 62 29 41 -70 8
4720 8 48 -60 -56 -6 -94 213 -162 -148 -140 -77 97 215 -36 67 3 -6 139 -290 133 56 -58 225 -308 -132 -155
4745a55L73K1j47m81K64n1J90Q6m23M36j6J13l82K20q6K70l98J56J65o7k02J72
4767E8k41k58N09n7j28J33K0j7J21k9j5J73l04o4j42k3J30K07j9k5j08J2j32K19
4791B0q0j07L48l6k37J59j56m5M00l33r5K4K74j74p0M8j30K82k12nJ72j47L05
4814B05j46n5R3J8n21M78j31J22L39o78M02k92L07k45R3n6L18m31K8P6K8o9K1
4837i6M6q3J31K2l6jJ05k8J5j58O5J4K10J45n02J48L7O9j56L73l90L51l45K2q7
4862a29L74k28J4P6N3k70J11J17Q2m95J0L84l19L53k82N1j46K03j35j9J02J08
4884A5O0o8j8J38q5j58L38j15k84L67k11j06K37J5J7j49l39K72q1K11l22L43n6
4907B1O9m09M82O4n49K71J2lk32K16O6Pm7K36j03n1K2J9J36j60j99M0J7J59p1
$$ plain form
4745 -155 218 239 92 -389 -125 -176 14 100 -323 113 97 210 -172 48 -38 232 -166 -10 155 88 -114 58
4767 58 -183 -441 68 11 -117 16 36 19 140 111 96 269 -35 -99 -241 -264 -134 73 54 29 -79 -67 -199 20
4791 20 -60 -167 181 145 -92 67 -89 -134 266 -67 -162 -138 136 -38 -108 -60 -190 92 -120 -125 47 -100 205
4814 205 59 4 97 115 -406 72 -59 63 402 -276 126 -166 141 -104 -11 -67 251 -180 -152 -76 -48 -117 -96
4837 -96 -50 -133 -2 20 -16 -17 88 60 75 -83 -18 -4 206 351 -151 -3 34 103 -53 320 -70 281 -64 -42 -129
4862 -129 245 17 31 107 160 -110 1 118 200 -295 -285 99 -220 133 -149 -98 -244 -41 -176 -195 -93 15
4884 15 75 7 -11 127 42 -116 222 107 -177 190 -21 -127 110 125 142 -7 -346 -74 -155 56 -266 77 21
4907 21 90 -319 163 227 -322 -51 -39 -42 -274 -58 8 15 -32 204 101 50 72 91 227 67 -132 -92 -75 84 13
4932A3p6k0R1k52L32k8M6k56J00j36J46j44M3J16R8o0o2R5Q7k20p7K60k38Q6N4
4957bNo9k4q8J94o5M7j76J01k9j63M04j84J78k2k7k32M1j13K36j32J16Jj30J47
4982A4j38K4j48MJ73n1o1M2K06o8K14p6j92l6Q5q8R8r1K01q3o6K44M9j29k22M7
5008d8J3j19J48j93K56j79J21k15J86L4k60K82j7q0j32K58k83L04r8nPj09K0J96
5032H7k22R4K55k74Q7J13j95n4J41K20l75K13l1k66P2J42j04P1J13j58L99l95
5054f7j26J68j03K67k18J21P3k86J51K04k99L00l51L2O6O5k1J9K7J08m57J63L02
5077A38j85J43j29J10r4L8J84N0l80p4K0J04j07K2K31l24L69k66M41j12q1j70
5099g2K3J40j42L19k23J4j11J03r2j08l3K76J12Qn6k32O8N3j30Np4K0J72j89L34
$$ plain form
4932 13 -63 -83 8 -244 88 60 106 -150 -50 -186 -40 -184 -141 -25 73 13 -49 46 133 -87 -164 96 -142 -56 -2
4957 -2 3 -66 -90 -178 16 -49 -2 -178 -77 -106 -269 135 -49 129 107 80 -152 -111 -224 12 -120 -4 -3 -133 14
4982 14 -124 -100 -248 -244 -71 -122 -183 -141 65 -3 211 135 -57 -93 -8 -96 2 -89 112 29 -37 207 256 127 -95 -48
5008 -48 -35 -154 -6 -199 57 -122 -1 -216 -30 4 -256 26 9 -71 -203 55 -228 76 -22 -27 -20 -129 -109 87
5032 87 -135 -41 214 -60 27 140 -55 -109 32 252 -123 90 59 -207 -135 7 -97 -26 87 -71 328 -67
5054 -67 -193 -25 -128 139 -79 42 115 -171 -20 184 -115 185 -166 -134 -68 -3 -24 -5 22 130 -327 -164 138
5077 138 -47 96 -33 77 -17 21 205 255 -125 -199 -179 -75 -182 -160 71 -253 116 -150 291 179 98 -72
5099 -72 -49 91 -51 268 45 59 -52 51 -41 -149 -182 94 206 214 158 -74 -6 47 -83 -78 -152 -132 40 -149 185
5124A85k35r5L28o2m14K97Q2j72M28k7j81l07L68k13j5N3q2M4Q7j9k22N58k73
5147A13N7k04k56K33j72J41J84p2L7Ln1J36j14J02k34K94l74Q1L68k51J37l71
5169b13J82J39q8J8o1K7p4J94j41J0O0oR6r5l8m6K67l70J97J56k76J2mP0L0j31
5195h5K60k18L38m83J04J69j28q5K71l33r9L04m7q8J77k25K10q8J72j73o2J08
5217an1Q4j01J19j39K32l6P7m3j43j40J97kj11J06m9Q8r7j76k61K32K55k43J28
5241g5J9o6J88o1q6L33m89M05j38j13j3o4r7J64K5M3L06l37k54M31k29K28l46
5264b26oM00Qo2k89K69k83J6j9K24j4J87n79L54q8n6k9K47k66K78j20r2L85k91
5288e2P4k98kM7K91m24L06N7P2l32J0M53k56j04L74n7k08J47m4L7j69K10j81M3
$$ plain form
5124 185 -50 -145 183 121 -293 4 86 -86 342 315 134 -173 195 -18 -33 20 -62 -18 69 50 -172 386 113
5147 113 170 -34 -290 -57 -229 -88 96 24 61 64 13 149 35 137 -97 197 -177 -96 272 21 158 -213
5169 -213 -31 108 20 38 -23 4 -70 124 -17 -7 53 47 143 48 10 -36 231 -139 58 214 -62 -50 -54 16 46 -85
5195 -85 175 -43 295 -188 -84 85 -43 -128 143 -190 -289 15 -32 -120 57 -168 42 -46 126 -47 -109 -1
5217 -1 -52 32 -69 50 -89 143 107 184 141 -2 -142 55 53 -58 48 -1 87 -10 -186 -447 -215 40 -203 -75
5241 -75 -56 -122 66 5 -81 252 -237 168 30 -83 -96 -160 -257 -93 -68 -25 281 -56 -310 121 -108 120 -226
5264 -226 -232 168 176 114 -175 94 -189 -173 -192 32 18 205 -374 -20 -108 -164 -193 54 -212 66 -54 -146 239 -52
5288 -52 22 -276 -278 -231 60 -364 -58 -1 71 -261 -251 202 -54 -158 216 159 -49 98 54 91 -78 132 -49 -6
5312fL09k55O5pm1m2q7K94n38L05J34j68j19Q2J97m1L4L8oO6j07k73K15p6lJj35
5339a64Q0L2j4J42j52J33l6q9J98j27j57K49q4N4J71k12j90j14K96L0j37j8K49
5362A40j08k55K04L29k29kk31K94r2l1j3j48L72j63k83J55J58j19J42J10l07l2
5384a09K53k43j17J48lM3J16p7J41l89j4K01jl75N73n4o7m07N33L0O8l80rL82
5408B43l45K29k34J71m08N25l06r2K09K1L2r8J94j76j23J34K85m13J18J63j3N5
5430A71j65O9j75J56K10l02q6J04K6j47K88PMj62j01J40n3J7o8k57J80L39J55
5453C50n03K03q6k70K82J9j8R4q1J71j7k37Q5l5j88J0L0K62o3J15l3k92K58l5
5477B1K8k33J47R3l2j97J43j42K12l8J28j11k85J59J37J13j32o2K1J06K26m48
$$ plain form
5312 -6 303 48 113 106 65 23 -64 230 -308 -3 131 -37 -156 -74 123 82 116 154 148 214 107 -166 49 -27 -30 -29 -164
5339 -164 -84 -52 -66 76 -76 57 21 -68 130 3 -154 95 11 65 236 24 -166 -280 16 46 -91 -109 140
5362 140 32 -223 -19 310 81 79 -152 142 50 19 6 -142 230 67 -216 -61 97 -22 120 230 -77 -109
5384 -109 144 -99 -216 -68 -71 -28 88 11 152 -237 -251 -50 -51 -426 147 93 26 -381 152 182 250 -130 -139 243
5408 243 -102 127 -107 64 -344 181 -125 -217 -8 13 45 -53 141 -35 -158 -24 261 -152 -34 129 116 171
5430 171 6 75 -100 56 266 -36 -122 -18 8 -139 149 156 160 -2 -103 37 -16 1 -67 -324 -144 195 350
5453 350 -153 50 -36 -306 -24 -5 -23 71 -10 161 144 -93 -8 -43 -231 -221 -191 71 8 123 90 -202 56 21
5477 21 49 -184 -37 56 24 -173 -30 -172 40 2 130 19 -266 -107 30 143 11 -51 -30 76 302 -146
5499a46J03o7K76k10J21M7j52k05L79j61m4q9K95m9k27O8P0J39k33r1K15K43l67
5522h5L06m59L03j04K35l98K02J10l4L20m35j29J41L42m39L50j20J34j10l3k8
5543F9pk24K11q1k1J49o1l93K92j7K87j38K7P6J04j8j26J3O8k82O3J10l23J2K4
5568a86K19k78M63n61K91n9Q9J51k42m0K37j80J31j8n0j36L27k79J15J15Q5j38
5590E6k78K8K42j74j04K40k56L16o7L21k19l76L32j65J4J7p7K70k66K32J39l02
5612g7J61q9k6J94j02K8k25j08K95q3Q5jRm3J76j14r3K6l1J16k24N7l4N1J67j52
5638c7K02m69J64j1k8J53n0Q9k6K79o3j09j61K60j17j63j38K53L6L5j76J41p8
5661a4j02M3k8j2J28j57L28K9k00j81J49j54k7O7J63J1M9k41Q9L7K28k21j82J85
$$ plain form
5499 -146 -43 -110 166 -44 77 124 -28 -233 146 -15 -59 -148 147 98 -129 -61 9 148 -85 -176 39 282 -85
5522 -85 221 -238 65 -39 196 -202 0 110 76 396 -39 -168 -27 315 -124 226 106 240 130 97 69
5543 69 62 -162 49 -32 -53 96 35 -358 -66 -83 204 66 93 169 273 255 129 142 210 -72 -9 101 -222 -210 -186
5568 -186 33 -245 218 -343 -52 -111 -22 129 -113 -153 84 -96 35 17 -33 -169 158 -121 -6 109 194 56
5590 56 -222 -194 48 -126 -230 10 -246 70 3 324 105 -271 61 -104 -90 -73 -150 120 -146 86 225 -77
5612 -77 84 -5 -31 163 61 89 -136 -244 51 -32 53 52 61 18 194 80 -13 13 -18 98 -126 -69 -103 -52 115 -37
5638 -37 165 -304 -140 -151 -179 -26 -76 13 -13 266 203 94 -67 193 76 -87 -225 28 64 99 -77 64 -14
5661 -14 -116 -73 -101 -113 15 -142 186 215 15 -166 -17 -171 -198 -131 32 43 92 -149 -60 -23 205 -16 -198 -13
5685a3oK95l10J42l30M25k4j28J72m50L53K78m86J08K49n3l08N5J27r0o8K25j94
5708c1k7j32K64J55l39J27q3K93K0j67l06L9L73n9j83K89k68P0l5o9j8J10j6J74
5732A81l12J25K01l07J11j51N15k87m8j1KK51n34J28K71j27p9K20j59m6J00J28
5754A72l44L80l47P5J30l7j96J20O6m02M83k61J5P3K9j74K1M07k48k90M55K1k99
5777a51O7k9N04l67k03L79j00m51K62K4J20m14N00m9k3p4K1k34L6K98l80K96M5
5800G7k57L16j70Rj0L13K5m60j27J14K53qq6L3K04j34n3Q9l37L94J5r8k41K21
5824H2l4J05j62j15J99q4j96q9N54k99Jm0K08jk71J89k52K32p8L0P5K77l22k00
5848a91M55l07M5n7J38Q6L1k72j43K16R4l57L44k66M00l0j40j08P2N0N0k8r5P9
$$ plain form
5685 -13 -19 276 -34 108 -222 203 179 51 223 -227 126 404 -82 26 275 222 -86 -31 96 6 -62 163 -31
5708 -31 -58 -190 74 229 -110 17 -66 227 247 80 -226 -187 186 127 -56 233 -35 35 0 -69 -87 23 7 181
5732 181 -131 -6 195 -112 -1 -152 363 76 28 17 19 270 -264 -136 135 8 -71 149 -10 -56 44 172
5754 172 -172 208 -139 -64 66 29 -167 -47 19 -383 100 -161 -146 -73 -44 -218 -197 210 -38 -328 127 148 -151
5777 -151 -84 -113 391 24 -179 200 100 -351 -89 -65 55 -359 141 92 69 -5 16 -218 -182 116 -264 32 77
5800 77 -180 136 -34 -25 -35 278 303 -157 -284 -170 83 75 -11 22 226 92 39 128 -209 185 200 102 -139 82
5824 82 48 153 -9 -124 75 -9 -205 -294 260 -39 -38 -78 130 129 -142 47 -205 27 -51 -21 54 331 9 -191
5848 -191 264 -43 2 -55 83 169 200 -72 -215 1 95 -262 82 -184 216 186 46 -62 10 60 110 82 -13 66
5872F6o4j19L67k45m4o2J20J04K6p4l99R1L50l03J10K68j73K10k69M2J0j4K43
5895B41J79m99P5k0P2l26J69L59j25m73L29K4p8K16J91J7k44ml77L85j90J31Q1
5918A33O9n43K98J89j71Kk3J0K16p6k60r0OK08k4Q7P8m15L08k3j55K62j21j5k6
5943g6k39M56L1o1j45P9j82J99J1k32L57l28J95J01j48K01l15l7J35m8L07n03
5965b42L13n7m1K08k23R6k6r4J23k28K09J72P4j68J3l02J70RK08l3l41j25K61
5988b4mK53l09k4J34j70K89j99J95j92M24o09K92K9L01l56N2J02j10n89K96K85
6010F6%o4j08J41R4j89q6K82l12J14j18K37M2k77J75J02k4j53J98J4K5j71N0j08
6034g0o5J53j34J5J5r0O11n39J98j8r9L40m04K01k07K45M6l69J78J66k02J66l36
$$ plain form
5872 66 2 -117 250 5 -39 -101 19 123 149 75 -324 -233 117 -186 -76 192 19 229 -40 2 12 -2 241
5895 241 420 -79 -4 -24 48 -278 -109 250 125 -348 -19 5 -73 143 334 351 107 103 -274 111 -79 52 133
5918 133 202 -341 -43 146 -25 -23 -46 -36 180 104 -156 -246 -240 -32 -56 31 109 -306 2 -21 -176 86 -35 -50 -76
5943 -76 -315 141 172 111 -34 45 -137 62 73 -159 198 -130 65 166 18 219 -96 -133 2 -46 261 -242
5965 -242 71 14 -27 181 -42 54 28 -66 57 -171 38 210 284 116 129 -173 -3 6 214 181 -160 -285 -24
5988 -24 -28 225 -84 -108 26 -144 145 -54 141 -51 373 -236 56 85 386 30 82 184 74 -515 -219 66
6010 66 66 2 -106 35 129 -60 -146 136 -176 -62 -180 57 99 -178 -3 99 75 -78 120 134 159 -12 38 -70
6034 -70 -135 18 -116 -101 -86 -176 435 -104 94 76 -23 317 -87 114 -93 152 198 -171 7 173 -29 137 -199
6057a99K82q%q0j98J53J66M1q2j41Q0P5M3k32J42k96J45Q3J41l10J54J96m00K29
6081a6o8J03j73J58J10j18j58M0N2j53J54m9M4K96l15ll7j67M19p3oj5j71K58
$$ plain form
6057 -199 83 75 75 -5 -203 -50 116 157 75 -66 14 89 132 -100 42 -254 -109 -26 115 -195 -41 155 -245 -16
6081 -16 -84 19 -154 4 114 -4 -162 -122 -70 -223 -69 -118 -74 222 -93 -96 -133 -300 119 46 40 25 -146 112
$$ [...]
8191B69
##END NTUPLES=NMR FID
##END=
