##TITLE=1H_Pr 13
 CDCl3
 8 sc, 
 6.04.2022
##JCAMPDX= 6.0         $$ Bruker NMR JCAMP-DX V2.0
##DATA TYPE= NMR FID
##DATA CLASS= NTUPLES
##ORIGIN= UXNMR, Bruker Analytische Messtechnik GmbH
##OWNER= root
$$ XWIN-NMR		Version 3.5
$$ Wed Apr  6 14:14:13 2022 Russian Standard Time (UT+4h)  she@DPX200
##.OBSERVE FREQUENCY= 200.131346
##.OBSERVE NUCLEUS= ^1H
##.DELAY= (6, 6)
##.ACQUISITION MODE= SIMULTANEOUS
##.ACQUISITION SCHEME= undefined
##.AVERAGES= 8
##.DIGITISER RES= 18
##SPECTROMETER/DATA SYSTEM= spect
##.PULSE SEQUENCE= zg30
##.SOLVENT NAME= CDCl3
##.SHIFT REFERENCE= (INTERNAL, CDCl3, 0, 15.7039)
##AUDIT TRAIL= $$ (NUMBER, WHEN, WHO, WHERE, WHAT)
$$ ##TITLE= Audit trail, XWIN-NMR		Version 3.5
$$ ##JCAMPDX= 5.01
$$ ##ORIGIN= Bruker BioSpin GmbH
$$ ##OWNER= she
$$ F:/spectra/data/she/nmr/H-F/1/audita.txt
$$ ##AUDIT TRAIL=  $$ (NUMBER, WHEN, WHO, WHERE, WHAT)
(   1,<2022-04-06 14:13:22.07 +0400>,<she>,<DPX200>,
      <created by zg, POWCHK disabled, PULCHK disabled
       configuration hash MD5:
       00 E9 B6 7A A2 85 ED C7 34 08 36 98 17 FE 4E 26
       data hash MD5: 16K
       E8 AF D8 9E 43 33 C5 58 DE 10 4F 9D 97 33 88 13>)
$$ ##END=
$$ 
$$ hash MD5
$$ 1D 10 B3 7A F2 6E 34 47 0F 43 B8 AA 92 3A 40 FB
##$RELAX= 
##$RELAX= 
##$RELAX= 
##$RELAX= 
##$RELAX= 
##$RELAX= 
$$ Bruker specific parameters
$$ --------------------------
##$DU= <F:/spectra>
##$EXPNO= 1
##$NAME= <H-F>
##$PROCNO= 1
##$TYPE= <nmr>
##$USER= <she>
##$AMP= (0..31)
100 100 100 100 100 100 100 100 100 100 100 100 100 100 100 100 100 100 
100 100 100 100 100 100 100 100 100 100 100 100 100 100 
##$AQSEQ= 0
##$AQ_mod= 1
##$AUNM= <au_zg>
##$AUTOPOS= <>
##$BF1= 200.13
##$BF2= 200.13
##$BF3= 200.13
##$BF4= 200.13
##$BF5= 200.13
##$BF6= 200.13
##$BF7= 200.13
##$BF8= 200.13
##$BYTORDA= 1
##$CFDGTYP= 0
##$CFRGTYP= 5
##$CHEMSTR= <none>
##$CNST= (0..31)
1 1 145 1 1 1 1 1 1 1 1 1 1 1 1 1 1 1 1 1 1 1 1 1 1 1 1 1 1 1 1 1 
##$CPDPRG= <>
##$CPDPRG1= <>
##$CPDPRG2= <>
##$CPDPRG3= <>
##$CPDPRG4= <mlev>
##$CPDPRG5= <mlev>
##$CPDPRG6= <mlev>
##$CPDPRG7= <mlev>
##$CPDPRG8= <mlev>
##$CPDPRGB= <>
##$CPDPRGT= <>
##$D= (0..31)
0 1.2 0 0 0 0 0 0 0 0.06 0 0.03 0 0 0 0 0.0002 0 0 0 0 0 0 0 0 0 0 0 0 
0 0 0 
##$DATE= 1649240001
##$DBL= (0..7)
120 120 120 120 120 120 120 120 
##$DBP= (0..7)
150 150 150 150 150 150 150 150 
##$DBP07= 0
##$DBPNAM0= <>
##$DBPNAM1= <>
##$DBPNAM2= <>
##$DBPNAM3= <>
##$DBPNAM4= <>
##$DBPNAM5= <>
##$DBPNAM6= <>
##$DBPNAM7= <>
##$DBPOAL= (0..7)
0.5 0.5 0.5 0.5 0.5 0.5 0.5 0.5 
##$DBPOFFS= (0..7)
0 0 0 0 0 0 0 0 
##$DE= 6
##$DECBNUC= <off>
##$DECIM= 32
##$DECNUC= <off>
##$DECSTAT= 4
##$DIGMOD= 1
##$DIGTYP= 9
##$DL= (0..7)
0 120 120 120 120 120 120 120 
##$DP= (0..7)
150 150 150 150 150 150 150 150 
##$DP07= 0
##$DPNAME0= <>
##$DPNAME1= <>
##$DPNAME2= <>
##$DPNAME3= <>
##$DPNAME4= <>
##$DPNAME5= <>
##$DPNAME6= <>
##$DPNAME7= <>
##$DPOAL= (0..7)
0.5 0.5 0.5 0.5 0.5 0.5 0.5 0.5 
##$DPOFFS= (0..7)
0 0 0 0 0 0 0 0 
##$DQDMODE= 0
##$DR= 18
##$DS= 0
##$DSLIST= <SSSSSSSSSSSSSSS>
$$ [...]
##$SUBNAM2= <"">
##$SUBNAM3= <"">
##$SUBNAM4= <"">
##$SUBNAM5= <"">
##$SUBNAM6= <"">
##$SUBNAM7= <"">
##$SUBNAM8= <"">
##$SUBNAM9= <"">
##$SW= 18.0517287032376
##$SWIBOX= (0..15)
0 0 2 0 0 0 0 0 0 0 0 0 0 0 0 0 
##$SW_h= 3612.71676300578
##$TD= 16384
##$TD0= 1
##$TE= 0
##$TE2= 300
##$TE3= 300
##$TEG= 300
##$TL= (0..7)
0 120 120 120 120 120 120 120 
##$TP= (0..7)
150 150 150 150 150 150 150 150 
##$TP07= 0
##$TPNAME0= <>
##$TPNAME1= <>
##$TPNAME2= <>
##$TPNAME3= <>
##$TPNAME4= <>
##$TPNAME5= <>
##$TPNAME6= <>
##$TPNAME7= <>
##$TPOAL= (0..7)
0.5 0.5 0.5 0.5 0.5 0.5 0.5 0.5 
##$TPOFFS= (0..7)
0 0 0 0 0 0 0 0 
##$TUNHIN= 0
##$TUNHOUT= 0
##$TUNXOUT= 0
##$USERA1= <user>
##$USERA2= <user>
##$USERA3= <user>
##$USERA4= <user>
##$USERA5= <user>
##$V9= 5
##$VALIST= <valist>
##$VCLIST= <CCCCCCCCCCCCCCC>
##$VD= 0
##$VDLIST= <DDDDDDDDDDDDDDD>
##$VPLIST= <PPPPPPPPPPPPPPP>
##$VTLIST= <TTTTTTTTTTTTTTT>
##$WBST= 1024
##$WBSW= 4
##$XGAIN= (0..3)
0 0 0 0 
##$XL= 0
##$YL= 0
##$YMAX_a= 292767
##$YMIN_a= -345097
##$ZGOPTNS= <>
##$ZL1= 120
##$ZL2= 120
##$ZL3= 120
##$ZL4= 120
##$ABSF1= 10
##$ABSF2= 0
##$ABSG= 5
##$ABSL= 3
##$ALPHA= 0
##$AQORDER= 0
##$ASSFAC= 0
##$ASSFACI= 0
##$ASSFACX= 0
##$ASSWID= 0
##$AUNMP= <proc_1d>
##$AZFE= 0.1
##$AZFW= 0.1
##$BCFW= 1
##$BC_mod= 2
##$BYTORDP= 1
##$COROFFS= 0
##$CY= 11.3945322036743
##$DATMOD= 1
##$DC= 2
##$DFILT= <>
##$DTYPP= 0
##$F1P= 2.36226072786647
##$F2P= -0.459571619588291
##$FCOR= 0.5
##$FTSIZE= 0
##$FT_mod= 4
##$GAMMA= 1
##$GB= 0.15
##$INTBC= 1
##$INTSCL= 1
##$ISEN= 128
##$LB= 0.24
##$LEV0= 0
##$LPBIN= 0
##$MAXI= 10000
##$MC2= 0
##$MEAN= 0
##$ME_mod= 0
##$MI= 1.114404
##$NCOEF= 0
##$NC_proc= 0
##$NLEV= 6
##$NOISF1= 3.799351
##$NOISF2= 2.8
##$NSP= 1
##$NTH_PI= 0
##$NZP= 0
##$OFFSET= 15.70392
##$PC= 1
##$PHC0= -18039.24
##$PHC1= 24.00078
##$PH_mod= 1
##$PKNL= yes
##$PPARMOD= 0
##$PSCAL= 0
##$PSIGN= 0
##$REVERSE= no
##$SF= 200.130013532006
##$SI= 16384
##$SIGF1= 3
##$SIGF2= 2
##$SINO= 400
##$SIOLD= 16384
##$SREGLST= <1H.CDCl3>
##$SSB= 0
##$STSI= 0
##$STSR= 0
##$SW_p= 3612.71676300578
##$SYMM= 0
##$S_DEV= 0
##$TDeff= 0
##$TDoff= 0
##$TI= <>
##$TILT= no
##$TM1= 0
##$TM2= 0
##$TOPLEV= 0
##$USERP1= <user>
##$USERP2= <user>
##$USERP3= <user>
##$USERP4= <user>
##$USERP5= <user>
##$WDW= 1
##$XDIM= 8192
##$YMAX_p= 0
##$YMIN_p= 0
$$ End of Bruker specific parameters
$$ ---------------------------------
##NTUPLES= NMR FID
##VAR_NAME=  TIME,          FID/REAL,        FID/IMAG
##SYMBOL=    X,             R,               I
##VAR_TYPE=  INDEPENDENT,   DEPENDENT,       DEPENDENT
##VAR_FORM=  AFFN,          ASDF,            ASDF
##VAR_DIM=   8192,          8192,            8192
##UNITS=     SECONDS,       ARBITRARY UNITS, ARBITRARY UNITS
##FACTOR=    0.0002768,     1,               1
##FIRST=     0,             0,               0
##LAST=      2.2672688,     0,               0
##MIN=       0,             -345097,         0
##MAX=       2.2672688,     292767,          0
$$ Real data points
##PAGE= N=1
##DATA TABLE= (X++(R..R)), XYDATA
0@%%%%%%%%%%pJ5j6J6j6K2l0L7m4N3o7P8r0J09j30J50j73K02k34K70l11L55m04
33b15M58n18N84o56P37q25R20j025J140j265J401j550J713j892K090k305K538
50A330k796L080l393L742m132M569n065N631o284P050p960R065j0436J2192j4537
65g944J7843k2889L1612n0822J70028j40789l40995K85008K99833p5319k94931
76a29365k3438J40922J08970M154p4259j69401r879K41581J59619k49325k88629
87b89050J65223L79678m9726l71239q5870K99641J67744j66498j79118L2820J07298
98A0903P6988J3268j12336j50330P1803K59989K9311l12819j45159K82504K41479
109B65601j89887k86580P0983K55102L2833j59407r2700L0666Q3633Q7801j1117
$$ y = [0, 0, 0, 0, 0, 0, 0, 0, 0, 0, 0, -7, 8, -8, 8, -8, 14, -16, 21, -23, 30, -37, 41, -49, 60, -70, 80, -93, 109, -125, 145, -166, 189, -215, 243, -275, 309, -347, 390, -435, 485, -540, 600, -665, 736, -814, 899, -993, 1097, -1208, 1330, -1466, 1614, -1779, 1963, -2169, 2400, -2665, 2966, -3318, 3732, -4228, 4837, -5599, 6593, -7944, 9899, -12990, 18622, -32200, 137828, -2961, -343956, -58948, 240885, 165566, -129365, -152803, -11881, 97089, 101243, 26984, -142417, -152296, 89285, 248904, -421, -289050, -123827, 255851, 206125, -165114, -250984, 48657, 216401, 49903, -129215, -96395, 10903, 87891, 101159, -11177, -161507, -89704, 170285, 199596, -113223, -258382, 24122, 265601, 75714, -210866, -139883, 115219, 148052, -11355, -104055, -73389, 10244, 98045, 86928]
120H6928j60542j00808J71865K09138j16011k75820J8603K85438Q7223k34718
130b8704j55193J36949J68894k6226j24127n7497L4897Q8079P0382o0034j61673
141a14253r198K00070R6375j83511j76203J23031K12078l9749j96210l9969J33799
152F260Q9020m6889q6729l5082L8182R4660L6084j06965j10614P5153J62801q968
164A06913j77898o1219J49892J09098q3513j28289J2656J02726M3660m8642o6957
175d1573k3356N4616Q1924j2635j11132m9883J06708J03804o9503j31379J6006
186g6403J25426L6658q6368p1487L6993P0582K0182m1970n9548p30O8468M8209
198G0012m8477q4700R892R6193L1827q0687o6607M4259P9919l659p0153l0397
$$ y = [86928, -73614, -174422, -2557, 206581, 90570, -185250, -166647, 118791, 206014, -28704, -183897, -46948, 121946, 95720, -28407, -85904, -51007, 37072, 107454, 47420, -114253, -123451, 76619, 172994, -10517, -186720, -63689, 148389, 108640, -87570, -127539, 6260, 95280, 48391, -38338, -73420, -35238, 59422, 95506, -11459, -122073, -46920, 115881, 106913, -70985, -132204, 17688, 126786, 43273, -85016, -72360, 30366, 74026, 25384, -41573, -64929, -10313, 71611, 58976, -52156, -102039, 4669, 108473, 38970, -92409, -76403, 49023, 85681, -687, -72174, -35181, 35401, 55583, 13613, -45935, -46665, 21803, 70012, 21535, -63165, -53273, 42920, 74747, -5940, -72547, -28288, 51631, 47972, -22181, -52578]
210e2578L6697N0309N53m5336l4728K0951N5088J5169n5939m4257L7942O4049
222D7920q366o5296k1010N0528L8641k0934m1791j1336L3896L0020j1947l6633
234a6308j6037K9662L5340j2649m2977j0096L5777K8503k0612l6726N98L2820
246G295J7621j9894k7690N311K6699J1453j5192k0608N42K3116J2154j4129k3100
259a6422L643K5938O743j9838j4626P505J7800K636j6850r536O818J3651K856
272A0318j4772r600R443J1538k60j1480o253R283Q822k081o608o015P845P294
286G474l051p025j444O379M723k884m309j231J938M015k737n725K5M107J710k157
302a92l740K286J021j99M22j831q42K887L81k136J327q59L748j411m23J331J10
$$ y = [-52578, -15881, 34428, 34981, -10355, -45083, -24132, 30956, 46125, -9814, -54071, -16129, 47920, 39554, -25742, -46752, 3776, 42417, 21483, -20308, -31644, 2252, 32272, 20325, -16308, -32345, -2683, 32657, 20008, -22969, -33065, 2712, 31215, 10603, -26123, -25525, 7295, 24916, 5022, -22668, -17357, 9342, 20795, 5603, -15005, -14463, 8653, 20807, 6678, -16422, -12779, 13159, 19902, 64, -14562, -7057, 10743, 13379, -3471, -13007, -6189, 7462, 10318, -4454, -14054, -4611, 6927, 6667, -4813, -11066, -1783, 7039, 4958, -1650, -7665, 180, 7474, 4423, -2602, -4046, 2333, 7056, 4172, -137, -1368, 570, 4585, 1848, -3877, -3852, 255, 1965, -192, -3932, -1646, -625, -824, -402, -2233, -3075, -188, 193, -1943, -616, -1475, 2273, 862, 439, 1770, 1880]
319A880n60R62j076O81k51o98R89p69p99K69k225Q13J072j268n64l26P32L53r88
338a773O56J38L33K73p4j557K482J857n56j817o65M579K59l085j673O12M49L830
356D268k205n126J376L656K221o186m223L199N100R26n591m299K815O956J805
371D692p856o096O934R805k058q475l037N645J0329k771j0742n098R466J1270
385A2008l526j4757m265J1929J2618p004j8454j283J5739J0246r179j7613k42
398a3783J8892Q734j0757j6342j664J9422J3367j2632k2013k02K6852J3748k1578
411B044k3019R705K8240N290k5033j7050J1183K3960N815k1079k2387Q331L0085
424A6085R014k8403k8675J8375L8642L26l9195k0356K9100L3940j0662l3991j1391
$$ y = [1880, 1320, 2282, 1206, 1887, 1636, 938, 1927, 1158, 359, 628, -1597, -784, 288, -980, -1544, -1870, -1138, -785, -1773, -1117, -979, -646, -373, -447, -2004, 478, 2335, 1779, -38, -703, 3876, 4135, 1050, -623, -11, 438, 4268, 2063, -3063, -1687, 1969, 4190, -1996, -6219, -3020, 2080, 3006, -2585, -6884, -4069, 2887, 4692, -3164, -9260, -2326, 7479, 5421, -3054, -6091, -446, 9883, 7112, -3630, -8728, 738, 12008, 8482, -6275, -10540, 1389, 14007, 7003, -11451, -12734, 3005, 13251, 4072, -13541, -13783, 5109, 13843, 3086, -13256, -14920, 4502, 17869, 5237, -16776, -16978, 9874, 23622, 2044, -20975, -11270, 16970, 22260, -2773, -19823, -8640, 15320, 21135, 56, -22331, -14000, 16085, 25099, -3304, -31979, -13604, 25038, 25364, -13831, -34187, -5087, 28853, 18191, -15800, -27191]
437b7191K4271K8143m313l0500k0629K1301M1687j467m9389k1651M0713M4617
449D5592k4292n4891k177N0540K3547l0061l5912R80L2918K5351j4853m1826j6262
462d1346M3789M4913k6158o5896o66O9382L2390n5330n2589K7560N8642L194m3792
475e907k7268J4711L8177J8200k4518n1363j282O5945L5114n9774o8563L5908
487c0620Q4691m039p8510k9197N4485M8111k0415m5344j5144K0661M1410J5976
499D2065m3926n6448K7654Q6217Q047r5770m3867P8757P2745m5007q3763Q674
511d4622O5871K4432l1869l8018j1395K6974M9077L473o9729m7169O7622Q5292
523G9939m0299j08486J494J05409L7960q0332n9498M0230N6644N187l2590l5222
$$ y = [-27191, -2920, 25223, 20910, -9590, -30219, -8918, 32769, 31302, -18087, -39738, 975, 45592, 21300, -33591, -35768, 14772, 38319, 8258, -27654, -26674, 6244, 31595, 16742, -25084, -41346, 2443, 47356, 21198, -44698, -45364, 24018, 56408, 1078, -51511, -23951, 34691, 37885, -5907, -33175, -18464, 19713, 37913, 13395, -37968, -39250, 26695, 61809, 2035, -66528, -30620, 54071, 50032, -28478, -57675, -3190, 44921, 24506, -20838, -35982, -15321, 26089, 42065, -1861, -58309, -30655, 55562, 63609, -32161, -76028, 2729, 75474, 30467, -53296, -44622, 21249, 45681, 13812, -24206, -35601, -8627, 40450, 43923, -25806, -72975, -5353, 79939, 39640, -68846, -67352, 38057, 76017, -4315, -63813, -23583, 33061, 38248, 5658, -29564]
535b9564r973M3150N6203k3658r1218j4383J04174N6521r0588r1833N7044J04678
547G0553j4596r1733k3358N3856M1953o873l3019l5874q49O2893M7877o3757r1788
560h4715L9359J17771L965j20131m4557R6880P0756n3056p3865P884N1049K3972
572C5312o280l4400m3352J9182Q0706J5868r6970o0857Q6330R5616n3452j11873
584g4170J2246R8895K7086o6327m5981K2682L7085K1429o638m8820l3717M8921
596g309P9701k8435j08021r200J14342M7882r2446p5707N2803Q2179j2575o0553
608a7339k2245K3257L3435K1847k2755n7827j1887P8020N2099p4574q4948M5767
620c7150J03946p644r6970k8817P1458M7731k9481m4309j0675K1679L4748J5961
$$ y = [-29564, -39537, 3613, 59816, 36158, -55060, -69443, 34731, 91252, 664, -91169, -34125, 70553, 55957, -35776, -59134, -5278, 36675, 29802, -3217, -39091, -39940, 22953, 70830, 7073, -84715, -45356, 72415, 76380, -43751, -88308, 8572, 79328, 26272, -47593, -39709, 11340, 35312, 29032, -5368, -48720, -29538, 51168, 67036, -29934, -90791, -4461, 91155, 37703, -74170, -61924, 36971, 64057, -2270, -48251, -25569, 11516, 32945, 26307, -22513, -56230, -7309, 72392, 43957, -64064, -73264, 41078, 88960, -3486, -79193, -26390, 55789, 43214, -17339, -39584, -16327, 17108, 38955, 16200, -41627, -53514, 24506, 76605, 2031, -82917, -37150, 66796, 59152, -37818, -66635, 4823, 52554, 23073, -21236, -31911, -10232, 24516, 40477]
632D0477l8730n4333K1506Q1756Q055q8058m1809P3460O7512m5181p4876R389
644d0832N9679J9204k9253l1558p542K4426L7948Q02n2377l5077N2274O2504l0935
657B9263p7820j476P9423K8159n6665m5960K4560M6603N758l0854k5170k321L3367
670F867L2013k2257n3114l041O0353L0587n3271n0500L0334N9159j709n2250k0635
683c7464L1522K9545l580k3843k1569R301L5522J2390l2005l6990K0212N1300
695C4341m06n0971k0671L7880L4735j7669l7033l257K5029J8455o917k3667j3169
708b3320J7694K8230l053l4973j5161K9810L0087j6050l6465j50L3247J5503k0480
721D919k3161L927K3265J0292j1597k1846j233J9821J8392j4648k6973K457K5908
$$ y = [40477, 1747, -52586, -31080, 50676, 58731, -29327, -71136, 2324, 69836, 24655, -50221, -40832, 18847, 38051, 8798, -22760, -30302, -5876, 32072, 32874, -19503, -54580, -2306, 60198, 29263, -48557, -50033, 29390, 57549, 884, -45076, -20516, 26087, 31845, 991, -24179, -26500, 6867, 38880, 16623, -36491, -39532, 20821, 51408, -1863, -52363, -22029, 37130, 35421, -16829, -37464, -5942, 23603, 20023, -3820, -25389, -16088, 19434, 31824, -181, -37171, -16959, 34341, 33935, -17036, -37707, 173, 34908, 17239, -19794, -23051, 1978, 20433, 13516, -10151, -23320, -5626, 22604, 19551, -15422, -30583, -773, 29314, 13264, -23201, -23351, 9896, 25399, 4919, -18242, -14315, 8950, 19242, 7645, -14201, -15434, 4387, 22779, 8131, -18842, -16385, 9523]
734I523J2256k1145k1931J0152K4147J295j6207j4234Q804J6192K560j1662j4006
747a4256N697J8158M715j6253j2738Q334J8033L05j6477p364J0454J2227j679
760I156j4617m105R237Q841j580j1938m733R140Q438l694r000n587J0484P052
774G094m080r547o77Q522N217n186n892N90N628M863m186o467P44N868K417k404
790B504n823P84N433K172m179m703R30M360J519l167l457L95L586J412l073j250
806b557Q04K075O50k379l69J628J001J414l647p91L458K73P8j687J76R59Q72j44
824A814j873l5j52K082k264l72j022J021J656j146p09l79j062K776l45j082J69
841i23L61P99j90j03p3O39O08L33k184Q19O69J074o7j088j877J930j79J09j518
$$ y = [9523, 21779, 634, -21297, -11145, 13002, 14297, -1910, -16144, -7340, 8852, 11412, -250, -14256, -8559, 9599, 14314, -1939, -14677, -6343, 11690, 11995, -4482, -11846, -1392, 10835, 9156, -5461, -9566, -329, 8512, 6932, -5006, -9739, -599, 7839, 4145, -4855, -10442, 42, 7094, 3014, -6533, -7210, 1312, 6529, 1343, -4549, -3959, 1669, 6532, 2346, -4121, -3377, 2491, 4908, 2504, -3319, -2535, 2898, 5070, 891, -3812, -2882, 1478, 2997, -170, -3627, -3232, 354, 1766, -1307, -2557, -1753, 322, 972, -1407, -1776, -148, 853, 2267, -1380, -2171, 1287, 1560, 1638, -49, 127, 1086, 1958, 1814, -59, -94, -246, 1836, -428, -800, -1822, -801, 855, -291, -1000, -1379, -2441, 335, -10, -1092, -923, -562, 237, 47, -56, -129, 510, 1118, 1451, -733, 86, 755, 1829, 1762, 674, -1203, 727, 548, 657, -861]
860h61n00J876J747l094m10k318L262K481k051k557m10K978J605q72l531J87M250
877A782K020k186k155q49M521J329k368n416Q05N652R00m695l211L37O931O86
893D083m959l874K038O590J045p017m454K934Q213P52p951m903O395Q084r97r243
909c264m167O365R111j295j0106l867O496R630j501j1720o319J1095J0293n654
923E097j3452j723J1997Q522o746j3191O7J0782P790l796j4417k121J3096J0673
937A2578o420j6703p64J8404J0265j3522j9177O117K0407L308j5594j1846N224
950g723J5894N203j2128j4395K317J8273J2339j9957k1770J0173K7260M035k6829
963g308j5043J8269K0752m635j9597p804J1344J6790J998j7658j6059R391K9219
$$ y = [-861, -1361, 515, 2262, -832, -1242, -3560, -298, 2183, 132, -2425, -2835, 143, 1748, 876, -2655, -2468, 1782, 3802, 1616, -539, -1388, 3133, 4462, 2094, -3322, -2517, 3135, 4035, -660, -3871, -3534, 3397, 4083, -876, -4750, -2712, 3878, 4923, -2094, -6548, -3614, 4599, 5351, -2600, -7503, -1108, 6976, 5979, -3264, -7431, -1066, 8045, 6750, -3356, -7223, -727, 8903, 7402, -4318, -10637, 458, 10751, 5097, -8355, -10078, 1919, 10441, 3695, -9496, -9429, 1353, 9143, 5347, -9070, -11191, 1905, 12578, 6158, -10545, -11309, 7095, 17360, 3838, -15339, -9222, 11185, 14493, -1101, -12947, -7723, 8171, 13374, 1246, -13149, -10832, 7441, 19780, -177, -21947, -11774, 15486, 19521, -7308, -22351, -4082, 16670, 12035, -7562, -15366, -4022, 12768, 14766, -2892, -18951, -9560, 19659]
976A9659K360l0677j7037K3362K9795j3582l2917k442K7999J3700j4040j9801
988a3621l585J6379J7453j146k7149j4698K4879L0037j1992m0962n246M2989J9744
1001C3082k9968l0218J1977L2188M054j9706j6750M9K1284J6869r844l4627n499
1014b7109L9601K4056l2984m2352J9596M6521N50m1374j5617K4115K5021m726
1026A5298j9443j3416M304K4881J5991k4191l5024J1246M8509O213m8808k5292
1038c9732L9735L9241k3868l9772K606K8622J4077q837k0928j1098R019L1811
1050B0876P624m0886k8464L3946M7609j9801n6213r5N2674J9074l6709k7773J4478
1063a3660K5410P340q482k2109j1998K1982L4063j0482m9498r470N3960L0014
$$ y = [19659, 22019, -8658, -25695, -2333, 27462, 13880, -19037, -21479, 6520, 20220, 6180, -13621, -17206, -827, 16626, 15480, -11669, -26367, -1488, 28549, 16557, -24405, -29651, 13338, 33082, 3114, -27104, -15127, 17061, 21115, 1409, -15341, -15292, 5992, 22861, 13017, -21610, -27109, 12492, 36548, 3564, -38788, -19192, 27329, 27879, -13495, -29112, -4997, 20024, 15298, -4145, -17561, -13257, 11624, 27615, 3424, -31600, -20354, 28155, 34368, -14440, -39732, 3, 39244, 15376, -24396, -21790, 6832, 20909, 12072, -8856, -19954, -10935, 20876, 28500, -12386, -40850, -6904, 40705, 20904, -35309, -35404, 17270, 36344, -365, -28138, -13660, 11750, 19090, 10608, -11501, -23499, -1517, 32546, 22064, -27434, -36904, 17056, 47070]
1075D7070m6111m5957K7925M8847o261l8027j2069J9061J7911N424j4655k2854
1087a9696n600L5308K8864l5018m5218J7632N8689R15n5943j9317M2474K9877
1099C2967k0616k8306p86J5642J5813M188j9448k5454R131M2531Q154m7758l0679
1112d4621M2386M4278k4702m9721N170M2880J0150k3591k0477L568J3993J8494
1124A7807J90k6319j9712K3239M1675j4338n2458l626N0605K1553l9445l2507
1136c3336K0052L2901r73k0093j5466L722J7963J5908r846l1009o681L7813K3692
1149C4647l2591l9183K1783M1364k69l8817j3319K3973K1047n936j7481j0076
1161a4858N176K0223J0215j9489k7132J2716L5972L286l8862j7030K9928K7351
$$ y = [47070, 959, -44998, -17073, 31774, 25513, -12514, -24583, -5522, 12389, 17813, 3158, -19696, -25296, 10012, 38876, 3858, -41360, -23728, 34961, 35876, -20067, -39384, 3090, 32967, 12351, -15955, -16741, -1099, 14714, 18902, -546, -26000, -16869, 25662, 33816, -13942, -44621, -2235, 42043, 17341, -32380, -27210, 15670, 25820, 2229, -18248, -14680, -687, 17807, 17997, -8322, -28034, -4795, 36880, 22542, -29916, -33542, 17063, 38616, -829, -33336, -13284, 19617, 18644, -1449, -16915, -13193, 4770, 20678, 10832, -20177, -26858, 10955, 34647, 2056, -37127, -15344, 26020, 25751, -13066, -26385, -2412, 18635, 12699, -4782, -14858, -9682, 10541, 20756, 1267, -25865, -13149, 22823, 26109, -12753, -29783, 145, 27496]
1173B7496j6851k9175J290K1087J2554q825j6714n388Q896K0529K927k7205j5029
1186b4408K3119K6461j1333l3357r24L1945J1874k0481j8451N049J8913M117r307
1199C217j2128k737J4247J5978j1178k2986k412K6650J2913k1975j9664J1780
1211h295K2162J44j7712r149P658J4313J425j2488j1222M995J6801M968j2333
1224A267j6934R899J8945m62j8288o998J2091J3072n664j4573k70O392R061k359
1238E179r929n832Q417J1250j511j4006n960J1340J1963n640j2071j730J1118
1251B588O464o795p726j021Q829O570m968r335k140R427O477n113j0616J512R391
1266C544M149p220p703L555P956J662p379m636J631O805K662n653m800K500O509
$$ y = [27496, 10645, -18530, -17240, 3847, 16401, 7576, -9138, -14526, -5630, 14899, 17826, -9379, -24408, -1289, 25172, 13839, -19518, -20442, 11503, 23377, 2896, -15555, -10506, 8407, 12524, 3217, -8911, -11648, 2599, 18577, 7399, -15587, -17999, 8651, 21564, -411, -20075, -8295, 13867, 14011, -3701, -12850, -5192, 9121, 10546, -1942, -13164, -8169, 8632, 13600, 1267, -15667, -5768, 13177, 12715, -5573, -12571, -480, 12592, 6928, -7645, -7915, -1523, 7538, 5179, -4750, -10582, -2165, 9085, 7574, -6432, -12392, -1052, 10911, 5271, -6800, -8530, 2588, 9052, 2257, -5469, -6490, 2339, 8909, 3941, -5394, -7534, 1893, 8370, 3257, -7359, -5847, 3544, 7693, 473, -7230, -3675, 4281, 5943, -1436, -6072, -4441, 2364, 5026, -627, -5427, -2927, 3582]
1281C582K294o721m320K988P145J03n969l127L184N392j872l614k828M156L175
1296C568k93m837o14J205K905K40n804J21L384K994j462l873o78L915K134j828
1312A077k850k65J829K304p90k833J146J462J921k353j583L02K404m80j59k902
1328a770n53K718J000k071j581M24L276j131j32o80q10J941l54r53p35Q63K77
1345b71J921j066j456P42R50M06q50j594J112J84P31j199l88J390R53K89k294
1362d40j554J630J278k46j704j449K256J821j312l56j535J344J294m87j641p09
1378a810K131J753r74k449L47J277J849P73l607j661K535K189j638k761K43J377
1394d26K743k072k969J85K613L255k720k906q09M712Q26k410k402k50M236K552
$$ y = [3582, 5876, -845, -5165, -2177, 4968, 5071, -898, -4025, -841, 4551, 2679, -935, -3763, 393, 3568, 3275, -1562, -2176, -971, 1934, 2174, -3630, -3509, -125, 2869, 1407, -2466, -3144, 771, 2905, 1077, -1773, -2038, -209, 2095, 1305, -1528, -382, 1080, 3001, 648, -935, -633, 1771, 1291, 1132, -1770, -2323, 395, 1395, -676, -2257, -1833, 1443, 312, 180, -500, -1310, 631, 277, -676, -1411, -548, -271, 1650, 584, -872, -130, 820, 1226, 376, -1218, -106, 78, 809, -390, -778, 612, 1565, 1854, -440, -1994, -364, 914, 668, -1036, -2485, -229, 1592, 280, -76, -1611, -267, 1027, 540, -1101, -1810, 321, 2074, 1100, -1349, -1002, 275, 2124, 2897, -710, -2371, 164, 2353, 715, -2046, -1803, -426, 2317, 245, -2724, -2539, 74, 3329, 609, -2297, -3106, 1606, 2432, 22, -2380, -2630, 1606, 4158]
1410D158l500l149M73M730K198m041m999J599N677J285l911n242L008M948O81
1425C915m083m292J722N978J685o072n241L496P693R02q247m247N511P154j144
1440D730q483k302O495N569p49p261m458N939P541l46j0973m944Q985R456m409
1455D790j1794j461J0286O592o725q068l96P512N758l770q349k900R797Q929n686
1470D515j4013n47J5785P439j1784j2615N043J3830J738r556q642L542J1459L573
1484I767p734j2143K044J5459O396j4005j5174P144J9434K065k0351o441J1979
1497a560J2548l775j1993n461P491J0579L429j2720j2838Q154J9850O62k1997
1510g631j0693J7994J7392r226k0343O49J5987P556q388j0583l203R298J2995
$$ y = [4158, 658, -2491, -2018, 2712, 4910, 869, -4130, -2531, 3146, 4431, 520, -4722, -1714, 3234, 3915, -168, -4460, -2738, 3240, 4925, -1147, -6388, -2892, 4801, 5703, -2544, -6791, -1280, 5874, 4730, -3753, -6055, 440, 6009, 5260, -2001, -6459, -520, 7021, 6675, -4298, -9242, -257, 9199, 4790, -7004, -8465, 1821, 8413, 1688, -6380, -6776, 736, 6494, 2724, -5625, -8525, 1272, 10201, 4515, -9498, -10045, 5740, 13179, 1395, -11220, -6177, 7653, 9391, -165, -8807, -5265, 6194, 9767, 2033, -10110, -8066, 7393, 13789, -216, -15390, -8246, 11188, 13253, -7098, -13539, -1560, 10988, 7213, -4780, -10241, -2750, 7829, 11258, -1462, -14300, -6146, 13704, 14366, -7631, -18324, -330, 17062, 7836, -12507, -11858, 4129, 11685, 3297, -7286, -10489, -1191, 11804]
1523A1804k030j7244j0639J7757K0294j0221k7480R79K6695R642j9502j5886Q992
1536f839J6638J383r731r586j600J2403J3568q581k4247j044K8269J3768k4623
1549b22k3543J4733K7492l673k3608p829J3624J4430k439j0796j1414L658J7092
1562G505J0783j7601k2379J0832L1589q43l2404j0447K5161J9012j4311k0877
1574a3980K541J3874Q117k518j0971j1647O718K2711K504k7289j5683K5247K6383
1587B6007j5318l1378K853K8029R384k0094j3531N043J3526P498l958j6100q579
1600a6618J7948J9881r453l1247j317L2883J2659k7197k2142J6046K4182k577
1612A3048j8729p532Q130J0924N225p714j7865J21K3363J3510k2609k3892J5835
$$ y = [11804, 9774, -7470, -18109, -352, 19942, 9721, -17759, -16780, 9915, 19557, 55, -15831, -6839, 9799, 11182, 1451, -8135, -9735, 2668, 16236, 7655, -16592, -17636, 10633, 24401, -222, -23765, -9032, 18460, 14787, -8821, -16650, -3026, 11404, 8965, -1831, -13245, -9587, 7505, 18288, 687, -21692, -10860, 20729, 19886, -12518, -22965, 2196, 21208, 6897, -13980, -11439, 2435, 10552, 8034, -2937, -14584, -7866, 14845, 17349, -9940, -25623, -376, 26007, 10689, -20689, -17836, 10193, 19577, -517, -14048, -9005, 4521, 12019, 8061, -8039, -16618, 1330, 21211, 11758, -19489, -20806, 12077, 24736, -2461, -24603, -8557, 15625, 13048, -5681, -13213, -5083, 5841, 11066, 3352, -14513, -14392, 8971, 22481, -128, -24020, -8185]
1625h185K9194l364k9273p690K1110J4555q397j5397k128P206J1015M047j4339
1638a646j5221Q076K5704J71k6932j3800K5525J9193j3872k2900K439K0766O493
1651A3996j1583j0636j957R589J2050n97j9028j0106K0088J9066j2639k5634K219
1664a5172K6392Q050k1614j3943J0102J4343J848r615j0637K186J0563J0345p632
1677E216j7963J62K0974Q674j8373j7672J2680J9971k451j7520n085R989J0903
1690I505j883j0527o090L029J3291L853j2268j2004O638J9596j329j9855n869
1703a3913J4916J2171q082j2282j380J0051O537l926q544l508N945J1022j414
1716G593j3591o227J3105J1699o249j4953R96J2449O146r476r250L321P063M521
$$ y = [-8185, 21009, 17645, -11628, -19318, 1792, 16347, 7950, -7447, -9575, -2369, 8646, 12693, -1646, -16867, -8791, 16913, 17084, -9848, -23648, 1877, 21070, 7198, -15702, -13263, 7503, 13996, 2413, -8223, -10180, -591, 11459, 10862, -8166, -18272, 1816, 20882, 8243, -17391, -15172, 11220, 19270, -2344, -16287, -6185, 8158, 10006, 391, -10246, -8060, 2503, 12848, 5216, -12747, -12585, 8389, 17063, -1310, -18982, -6302, 13669, 11218, -6302, -11387, -1398, 9505, 7622, -2905, -8995, -5966, 7325, 11178, -1090, -13094, -6456, 13140, 11811, -8044, -13913, 1003, 13174, 5092, -7190, -8570, 1481, 8018, 4092, -4452, -7960, -2015, 9007, 7593, -5998, -12225, 880, 12579, 6330, -8623, -7627, 4822, 10968, 1492, -7758, -4437, 2626, 7147]
1730G147m407r387J32Q496O804n291j1236N47J2095L462r000q047N211R325P42
1745F593q758n066M237Q188Q29p908l851L463O129K567o698o662N985O853k14
1760E687r684l143O978M637k034n669j600M244N161k650l512l380M358M997k188
1775B202m801k679N150N691k296o968q2N380K957k518m480R5L905K262l618k832
1791b632k66M445J352j005o331J932N224n3j822l050k89K821J571k383k888K072
1807a302J493K760l899j065L95L990N00m501O3J377K660N2l381j196J980J619
1823A545L03l527k57J873J141j68k786J42J035K075J01m163L59J870Q81p37n32
1840h45J03O78J647j093j242o12J570K451k031k739J185K167L44j128j132j348
$$ y = [7147, 2740, -6647, -6515, 1981, 8785, 3494, -7742, -7195, 4900, 8362, -638, -8685, -3474, 5851, 6593, -2165, -7231, -2994, 5194, 6023, -1885, -5736, -2273, 3856, 6423, -275, -6937, -952, 5901, 5687, -3997, -7140, -162, 4475, 2441, -3228, -4828, -584, 4577, 1927, -1585, -4965, -607, 4390, 2202, -2599, -5278, -128, 5563, 3267, -3701, -3783, 1597, 4554, 2036, -2444, -2349, 1556, 3818, 200, -2632, -2898, 1547, 2899, 1894, -4437, -2505, 2719, 2666, 844, -2206, -2495, 326, 1897, -486, -3374, -1302, 191, 2951, -948, -2013, -1618, 2372, 2872, -1629, -1566, -189, 2471, 2523, -858, -2054, -74, 1545, 1848, -1679, -1936, -63, 1078, 910, -1876, -1734, -699, 1376, 1477, -2686, -2327, -457, 424, -313, -845, -742, -64, 1583, 490, -752, -1364, 206, 2657, 626, -2113, -928, 1239, 1583, 455, -677, -2025]
1856b025K680R60j283j040q93N66K349k594n33N53K085L63j534j505K75K181Q54
1873A459j900k64m24J425J202j208j036K51J489K40r14j419KL067r30j398l60
1890g18J050O48J48j964j237k37L160k22j575j156J480K380j017k254J132j41
1906e23K382r67o10l114L274K053j420k494n37J645K828n26l101p23K017K928
1922C112j616k662j922K507K505j71o021J585L312K061k460k830o45M319J723
1937B797k332l605R65K777K303j818l313j036N545J621k994m770J67O780J315
1952D402n557k988J668M026K583m550l608J001N370J752n767m792M016O378l85
1967C549n460l909N157N866j069o176k375L969N088j478n135l306M203P298k124
$$ y = [-2025, 655, 1615, 332, -708, -1601, -1035, 1314, -1280, -1813, -1260, 825, 1188, -346, -1851, -1576, 605, 1459, -441, -705, -1129, 296, 1498, 290, -746, -495, 994, 1234, 320, -1099, -1097, 1970, 1040, -358, -718, 332, 980, 1128, -836, -2073, -2310, 850, 628, -947, -2103, -623, 1757, 740, -1514, -382, -523, 1859, 892, 282, -2832, 442, 2495, 1075, -1419, -1956, -311, 2517, 1991, -1110, -1833, 184, 3112, 1496, -1166, -3088, -581, 1924, 1753, -4268, -2683, 629, 2690, 230, -2600, -3245, 1074, 2797, 465, -3140, -2175, 602, 2905, 1087, -2226, -3262, 2283, 3904, 910, -3860, -3693, 3087, 4402, -1155, -4143, -2475, 1551, 4134, -416, -4024, -3023, 2347, 4099, -1668, -6460, -2444, 3934, 3549, -1911, -5820, -663, 5203, 4134, -2042, -4417, -448, 4640, 3162, -1973, -5279, -1076, 6222, 4098]
1982D098o652m438O305P151l527q294q81Q024M089m513o043k93P026K850j289
1997C613o861k237P179O481m877j1399J678J1482M295p426r283K714R447J792
2011F598o316o426K729N970K811l967q168m49J1151N480r647r845N351J2064L48
2026G684j1428m545O588Q285k259n828m366L926P627J190p290q832M741J4158
2040I651Q25j4871o384J1946J0021o073j3075K07J0034M077k868p250l493N402
2054a851Q766m51j2100n014J1658J1560p806j4972M71J4978O539j1760q544M094
2068d432Q641L519o341p453j427R442Q992p359j2757j197J6319O494j4077j1709
2082a3345Q937J2623j097j1588l980P300O865L80o839p368K045J0982O965j1666
$$ y = [4098, -2554, -6992, -687, 6464, 2937, -5357, -6238, 1786, 5875, 1362, -4681, -4974, 2052, 4902, 3613, -3248, -5485, 1694, 8175, 3298, -8101, -6423, 5059, 9354, 1928, -7355, -4641, 4806, 6598, 282, -6144, -3415, 2555, 5366, 1399, -6769, -7218, 3933, 9413, -234, -10079, -4728, 7336, 7684, -3744, -8289, -1701, 6584, 4325, -1503, -5869, -1943, 5684, 6874, -416, -9248, -4507, 9651, 10476, -4395, -10779, 1167, 11188, 5115, -7960, -7753, 2281, 6358, 3490, -3760, -7253, -1851, 6915, 6464, -5636, -10650, 1008, 12568, 4762, -10210, -9739, 5239, 11778, 18, -8526, -4432, 4209, 7728, 1387, -6066, -7493, 1949, 10941, 3582, -9175, -10372, 5947, 12441, -1636, -13345, -4408, 8215, 7118, -4470, -8450, -1150, 5715, 6095, -744, -8112, -6067, 4915, 11880, 214]
2096B14j3278O505J7095N98j7170o799J3719J1261p198j0903k47N902O328l10
2110E717q810p320O681J2816n8j5376p169J3491J3670r343j4620O39J5674L419
2124I411r037o820J550P086N241k298j0392m976J0376J1627n936j6946R10J6107
2138E903O497j3478j0305P692J0764M08j0155l266K747O073M025l937r744O0J2352
2153E636O080j1210j3670Q374J5163j459j4699m240R329Q038l022o498k158J765
2167b571O609K337p555q796N623J3135o72j3264n331J1396Q986n905j2009J569
2181f448R676K234l178o191j549N030N051J025j0272k851P746Q288m415j2033
2195g887K156J0073N353j0621o555L777N859L028n183m813o71P275N179m061j0617
$$ y = [214, -13064, -6559, 10536, 11134, -6036, -12835, 884, 12145, 4947, -5956, -6203, -301, 6027, 5717, -3093, -10413, -3732, 9084, 9026, -6350, -13519, -28, 13642, 4299, -10321, -9682, 5992, 9411, 374, -6446, -4896, 2190, 7431, 5133, -5259, -10235, 141, 11768, 5832, -11114, -10204, 5903, 12400, -1078, -11383, -3691, 7073, 7481, -2674, -5940, -3193, 2880, 6905, 2968, -6776, -6716, 5636, 11716, 506, -13164, -4790, 10373, 8914, -5785, -10025, -696, 7342, 4320, -2178, -4336, -2571, 4038, 6375, -1180, -9976, -4353, 8782, 8110, -5154, -10485, 911, 9897, 3992, -8017, -6448, 3228, 5462, 2284, -3907, -5456, -426, 4625, 5650, -4622, -7473, 273, 8561, 4146, -7887, -5731, 4342, 9695, -926, -7481, -3704, 2155, 5183, 0, -4813, -5484, 1791, 6970, 2909, -7708]
2210g708K282J0262L938r495p889N670R287j277p526l086O376L895p89m662l476
2225d198J034P302J879o951n684M280P766n80r011k616O672N403k699o826N74
2240c655M590L209k377l744k451M032M985j522o316p36M303M593l137m877o39
2255c742N184L285l915m828J378L431K822k378l451j495N627L240m218l990O59
2270b391M022K156l438m422J785N473j65l400j890J151L326M49k989l300J675
2285a958L704O98l271j945J917K988N00k645k468K436J727K78l884Q86j6K771
2301A718M43k820r04J040K070O28l362j181K377L193j713k758j67O48K650o87
2317A175l453J383Q86J865q07k900J436M58K154k667p47m1K310l27p22j784J26
$$ y = [-7708, -5426, 4836, 8774, -721, -8610, -2940, 6347, 5070, -2456, -5542, 834, 4729, 3940, -722, -4198, -3164, 4138, 6017, -934, -6618, -2338, 5428, 4848, -4163, -6779, -107, 5296, 2597, -4229, -3655, 935, 4144, 1767, -1977, -4428, -396, 4589, 3067, -3249, -3985, 318, 4911, 1774, -3103, -3742, 1442, 4727, 812, -4016, -2638, 793, 3615, 1237, -2214, -3709, 1918, 5158, 940, -3050, -2391, 1631, 3787, 349, -4073, -2288, 3185, 3020, -380, -2270, -1119, 2207, 2656, -333, -3633, -1958, 1746, 2444, -827, -2772, -855, 2133, 2633, -12, -2480, -44, 1683, 1961, -1923, -1037, -1053, 1718, 2161, -659, -1563, -523, 1547, 2175, -1187, -2368, 9, 3202, 1489, -1269, -1436, -788, 1862, 1175, -2278, -895, -9, 1856, 1049, -1851, -415, 43, 2197, -470, -1217, -1258, 1052, 725, 3, -1781, -1655]
2334a655L748n64p16k342L87J533J079k382r5J32J138Q57j377m44N70L84R14j118
2352D9j301R21J501J368l481q3Q48Q18J32j807k88P19J541j060J11j111O04J182
2370F63r54n08o56J681O20P60k416m44J667Q66k96j909O87J218R05j431j613P40
2388d20J45K336j421k407r8K435pl85q92l21K524m79m10n78n10Q69P19j485n77
2407i62J266K68J45J16k308R04N80M07P1j886L81K440o97P3k858Q77K552j942
2425e73N65m12L6K279j041j913r84J898J735r65n80k409R07L118O41k155k369
2442b222K709K254j919q42j867J987J365j001j492j084K323J916m40k965j525
2457b803L171K089j614k900m5K812J162j841j722K48K445J594k082j948O42K044
$$ y = [-1655, 2093, 1529, 813, -1529, -1142, 391, 1470, -912, -1007, -875, 263, 1120, -257, -701, -131, 253, 1167, 49, -1252, -331, 1170, 2538, -943, -1026, -178, 640, 772, -1035, -1323, -604, 937, -123, -12, -1123, -519, 663, -291, -799, -1455, 226, 846, 1606, -810, -1254, 413, 1279, 983, -926, -239, 979, 1884, 453, -1160, -420, -275, 2061, 640, -1767, -1865, 570, 563, 178, -714, -1035, 1489, 1010, 600, 22, -488, 381, 1100, -385, -962, 304, 572, 717, 833, -1475, -571, 9, 416, 487, -1399, -1018, 1422, 725, 798, -2060, -1183, 1369, -573, -8, -420, -384, 1895, 854, -1059, -2043, -145, 1590, 625, 45, -2364, -1457, 1661, 2302, 147, -2222, 487, 2741, 822, -20, -1887, 100, 1465, 464, -1028, -2112, 211, 2127, 1687, -1278, -2803, 368, 2457, 843, -2057, -2102, 710, 1872, 31, -1691, -1443, 1002, 2596, 514, -1434, -792, 1252]
2473A252P04j121l564P59L915R77k563l662K198K511R01l376j493K299J184J120
2489B041j219l824M39M582J846m593k965J614N460N90n009l145L938L343o30m226
2505a758k10J100M477j617k261l588J901N931j139n544j870M594M225j741n877
2520c377j13N229J676k325l664l80L649K170l70m841k811N311M627j963p103J201
2536c084N854L427n850m868K484N064M23k909m233J71M573L002k855o470J017
2551d254O255L981n805p041M155P155J409p245m313N841M031j324l408l040R65
2566b638O399J588m426n831J380Q970p08p036l965N738O083k920o988L06M878
2581H30K779j501m764j588K919N396O09q093l830O892P576m259p814n5P764L552
$$ y = [1252, 1956, 835, -2729, -1970, 1945, 2922, 359, -3303, -1105, 1406, 2307, -1069, -2562, -263, 921, 2041, 822, -3002, -2563, 2019, 3865, -728, -3693, -2079, 3381, 3971, -1038, -4183, -245, 3098, 2468, -1758, -1968, -868, 3609, 1992, -269, -3857, -1956, 3975, 2836, -2708, -4578, 16, 4241, 2500, -3377, -3490, 1739, 3415, 1090, -2574, -2954, 695, 2865, 2495, -2346, -5157, 154, 4781, 2818, -4285, -3084, 2770, 6197, 347, -4521, -2037, 3027, 3450, 541, -3692, -3521, 1052, 4054, 1199, -5271, -4254, 2001, 5982, 177, -6864, -2709, 4446, 5855, -1390, -5703, 138, 4169, 2845, -563, -3603, -2638, 3761, 5349, 923, -4908, -3528, 5442, 4734, -2302, -6267, -529, 5554, 2634, -4354, -4048, 830, 3609, 2108, -2656, -4244, -1325, 4071, 4680, -3413, -7243, -351, 7225, 2966, -4848, -4903, 2861, 6413]
2597F413n884m800K089L837K263k982l307k644N334N561l239p959J44P998K914
2612E738n651p651M132R487j735o090k730L269L026K223l642m175n84P426L124
2627F167o256p736N150R597o79r623k918O156N094k142n251k68K069L484P56m274
2643f74m332K926P242o3q609l065P245O106m523p365J404O368J445l111l678L79
2659b305K330M513j896n447j722M858O201l317q792P35P986J699n065m562K615
2674b169N595k64l709k703q9M929K636k220o374m75P123L103n468n580M188O543
2690E066q23o884j952M674K818j115l802j49J224K746J596m046l389K377N119
2705C460K68o312k528N923L143k538m315j079N675J411j233l220j990K458L800
$$ y = [6413, 529, -4271, -2182, 1655, 3918, 936, -2371, -5015, 319, 5880, 2641, -5318, -5174, 2824, 5738, 87, -7564, -3432, 6055, 4320, -1770, -4500, -1231, 1795, 4018, 376, -3799, -4383, 3043, 6167, -89, -7825, -2675, 6922, 6243, -3380, -6298, -142, 4952, 2810, -2441, -2709, -640, 2844, 3600, -674, -5006, -2080, 5162, 5099, -3510, -6575, 670, 6776, 2253, -5112, -3708, 2660, 4105, 994, -2684, -2305, 25, 4538, 2642, -2805, -4527, 331, 6532, 3215, -5577, -4842, 3144, 4843, -222, -4784, -2169, 3426, 3162, -547, -3250, -3339, 1590, 4226, 2006, -4368, -4843, 2280, 5383, -85, -5665, -1477, 5066, 4243, -2641, -4593, 81, 2899, 1784, -2018, -2167, -943, 1803, 3399, -647, -4036, -1659, 3460, 3728, -2584, -5112, 811, 3954, 1416, -2899, -3978, 1697, 3108, 1875, -1345, -3335, -877, 2923]
2720B923l85m488j890M714M089k334p186K081M278J604l047m250K363L330M78
2735B280j136l110l50K478L653l255l367o48N107K625n307k201J247M564j66k244
2751A70k228J398J547P48j888l398L065K863l43l282j720K257L189K90l278k198
2767b808J270M467k387j553k001K460R55O19j964q32R44K754K21l076j168J987
2783a12J924j48m225R15K674N02k55k489m88K310K832l093q20j8J312N46q94k269
2801a796Q17K591r5k293m69N96K875j317j057j637J131J506J46j260o42J30J392
2818F18o7j101j340J006J799M58j755j245R49K878j180j826n49N69J326j176r63
2835a599P0J457J088p48n20m15R92L17O6j747P46J552J13j803J94r70K969j220
$$ y = [2923, 2538, -1950, -3840, 874, 4963, 2629, -4557, -2476, 1802, 3406, 359, -3891, -1528, 1802, 2280, 1144, -1966, -2316, 162, 3815, 560, -2807, -3455, 1652, 4277, -1030, -3231, -1984, 2580, 2414, 170, -2058, -660, 887, 1635, -253, -3651, -586, 2277, 1934, -1348, -3068, -811, 2378, 2668, -610, -2808, -1538, 2929, 542, -1011, -3012, -552, 403, 1022, -942, -1774, -830, 1924, 2145, -931, -2099, -112, 1812, 1664, -2561, -1646, 1028, 1530, 1275, -1214, -1702, 608, 3440, 347, -473, -491, 821, 1367, 473, -1796, -979, 1612, 1517, -776, -1245, -649, 2226, 909, -148, -1785, -654, 852, 998, -262, -904, -774, 618, 551, -550, -1890, -884, 915, 1373, -382, -1627, -678, 2200, 1020, -806, -1355, -786, 540, -636, -1599, -1529, -72, 1016, 268, -252, -667, 325, 642, 708, -1039, -293, 1259, 1372, -431, -237, -1207, 1762, 542]
2853E42l19j178j42J789J96k48p98o09J442N33j770j04P26P33j19p83j327J664
2871B28M88J312j748n18k44J457L22k160k55R61J466k447Q64m92p83L484j708
2888B27l96p94J653n24Q01j528n98J720N85j021n20q19Q25P83J052j169r30P40
2906H7J714k748P65N08O21J13P38r02j625K102J8k42k809Q24l88L455j387j913
2924a069q08K728J269q39k226J3N86M17J05j788j225L633o79J565l471J037J544
2941G92N29r80j794L19J49K137j359j55j345K623j89r59k238K403N38k46J088
2958A313m096K696L70N46j098j126J417N59L49j956k39J700J473j045j450n41
2974a128J639O91p4k347L66J613j210J833j685j244J600k30P71j603j110J403
$$ y = [542, 223, -955, -1097, 692, 888, 640, -158, -767, 675, 1208, -562, -666, 60, 793, 674, -109, -1436, 228, 716, 2028, 280, -238, -482, 975, 1297, -863, -1118, -157, 1309, -1138, -274, -766, -1549, 1935, 227, -169, -963, 690, 166, 967, -561, -1159, 561, 1146, 125, -395, -1214, -389, 394, 1446, 277, -653, 87, 1801, -947, -182, 326, 947, 1060, 1798, 896, -729, 1373, 1391, 1149, -1660, -836, -1224, 2231, 844, -1069, -1877, 851, 2120, 1281, -945, -932, -346, 71, 176, -1612, -2837, 796, 117, 1682, -1789, -752, 792, 1321, 341, -1453, -1134, -985, 1152, -207, -362, -1707, 916, 727, -232, -2470, -67, 471, 225, 1313, -2783, -87, 283, 829, -269, -1395, 22, 581, 930, -1026, -1265, 435, 1908, 863, -587, -1128, 511, 1202, 1128, -1219, -853, 760, -450, 1383, -302, -1546, 54, -176, 595, -1008, -2118, -715]
2990g15J842l71k262O2K382q7j211j275m8K821O38k498r3j311J201K999j417k757
3008b100K95K124K677k265k432j03K935R39l038Q70l09J571J045k832j331J687
3024b67J737J28j806k371J055L353J288m998j201L060K025o4l475k01R15K041
3040A219P23k954j157K453J153J216l660j585L713J843j696l130j20K141J113
3055A272l40j573j203Q82K476k73j879j982K207K923j064l184n91L657M20j643
3071A05k863K084K406k24j362k066K45K483J049o88k376j121L096K255k835k584
3087b396K61O007j260m310k077L465K572j661j270j725J763J594J814k501m491
3102d215K878L281J011m406k730M359M226l224l485k02K042L098r9l726j294J394
$$ y = [-715, 1127, 756, -1506, -1444, 938, 851, -360, -1635, -1683, 1138, 1776, -722, -815, -2126, -925, 2074, 657, -2100, -1805, 319, 2996, 731, -1701, -1804, 1131, 2070, -968, -98, -407, 1164, 2209, -623, -1954, -267, 1470, 1598, -208, -2579, -1524, 1829, 3117, -1881, -3082, -22, 2003, 1939, -1536, -1737, -822, 1219, 1942, -1012, -2169, 284, 1437, 2653, -1007, -2592, 1121, 2964, 1268, -1862, -1982, 159, 1272, 932, -641, -1844, -962, 1514, 1241, -638, -2620, -413, 2510, 1446, -1738, -2329, 1328, 1748, 105, -2758, -674, 1732, 1508, 146, -1920, -1675, 808, 1857, 1169, -1207, -2328, 768, 3023, 188, -2396, -2135, 3872, 2612, -1698, -3775, -310, 2262, 601, -669, -2394, -631, 963, 2777, 276, -4215, -1337, 1944, 2955, -1451, -4181, 178, 4404, 1180, -2305, -2507, -465, 2633, 2534, -1192, -2486, -1092]
3118a092K610J231n211j508L036M351j729n459L98M381K439k275m300O21M383
3133A876L87m94k901j588L135K956k325l750j49N003J516l806l906J819N434j084
3149B123k757j301J201J721J489j110l909K89M414K146m500k852J189M985K07
3164C335n560j158L223K420j343k333r40M54L494J010k201k598M24M377L61l266
3180c01m137L838M511l503k341L8K073J477o73k270m74K002J453j331j006k130
3196b774K304K772p94m211O0M313P44k768q63l36L039j34k065r06N87J199J530
3213A697J25k385k33J463J962k801j874Q74K349J063l389r84K174J775j405q56
3229d45j821K863J27J044j816k167J569K460N19l937o76J838K301j353k073r47
$$ y = [-1092, 1518, 2749, -2462, -3970, -934, 3417, 1688, -3771, -3373, 1008, 3447, 1172, -3128, -2507, 1876, 2263, 1769, -1132, -2720, 415, 3371, 1046, -2704, -2853, 2150, 3666, -140, -4046, -2227, 3207, 2123, -634, -1935, -734, 987, 2476, 1366, -2543, -2254, 2160, 4306, -194, -3046, -1857, 3128, 3335, -2225, -3383, -160, 2260, 917, -1416, -2356, -1902, 1592, 2602, 401, -2197, -1773, 2604, 2965, -301, -4438, -600, 3911, 408, -1933, -1895, 178, 1655, 982, -1288, -1762, 240, 1693, 362, -644, -2774, -470, 2302, 1508, -2703, -2643, 1670, 2414, -354, -1217, -1553, 1486, 1352, -713, -1619, -1032, 167, 1697, 1822, -563, -796, 667, 2629, -172, -2046, -1172, 1177, 2240, -1149, -2133, 41, 1816, 411, -445, -2266, 597, 724, 1768, -48, -2215, -646, 1814, 2333, -1604, -2280, -442, 1859, 506, -1567, -2514]
3245b514K288J951j104j834p54J989K017L48j995k239K203J510m08j886p26K122
3261I68M63j814j927J829J222J176k302k49o01J299J253o77k692p09K146K211
3277A596j349j964J029J672K88j052j092k20K207m90j295q87O41J136J559k048
3293b69j767J671J143L73j973R0q34K553q04m66j79O65O31m24k66j007J226Q64
3311A227q83j424K49L71J980q66k916J835Q19P91j197j473R88O03O20m25q87O11
3329B3Q3K030k137n38r96K189l73m17o91m64J650K44j43o91P0J195J047j832m47
3348a98m03J843j006o32j269K017J216j367J47j258M11J142N19j558j240J221
3364d15J737p13k025M03J137J85J040k120P08j90L46J01n10n24j89K254o75n37
$$ y = [-2514, -226, 1725, 621, -1213, -1967, 22, 2039, 2387, 392, -1847, 356, 1866, 1458, -428, -1154, 968, 1431, -383, -2310, -481, 741, 1917, -385, -634, -1235, 64, 1317, 640, -2052, -2761, -615, 1596, 247, -1717, -688, 984, 1272, 220, -872, -1092, 1115, 625, -670, -1557, -916, 220, 1779, -269, -2036, -365, 778, 1151, -822, -732, -1566, 987, 183, -283, -462, 203, 834, 410, 144, -863, 363, 1227, 344, -1080, -831, -460, 1520, 654, -2262, -427, 392, 1183, -14, -1487, -499, 104, 724, 299, -588, 23, 106, 2136, -1, -539, -1535, 654, 281, -136, -827, -1291, 359, 603, 460, -231, -161, 1034, 2081, 249, -198, -601, 1242, 236, -396, -1665, 352, 1568, 201, 348, -910, -499, 643, 1162, -396, -1636, -415, 1322, 609, -1416, -1013, 124, 309, 1349, -771, -63, -253, 93, 194, -316, -840, -1029, 1225, 550, 13]
3382A3n39Q06R0k95j60Q70r60P30j267l79n6J132O37r64o9p46J424O48m72q76
3402d33L99M20J55j497J095O54P19j679Q4j968N25J728k15M22j210Q15m98q3N26
3421d1o50J022L65r47m22O85o30J124N83j595nN50Q94L03j071k8R84o20L26j526
3441f99j155J639L59J324j011r81k63K231j683m34p75J388m09N60m56n75P34J118
3459I12o42r66j40N01R75N67r66j616R90Q36m94l01N32o1M62O6q10l10J130j221
3479e56K75q64P26J218J75j400q28N16O78J453j826j311J634P96L12j715n41J709
3497D51n7o44P3j85l68K110j315n89r50P70J080K85j301M27P25n7L61j573j069
3516a826J462P50O69k093l51o7J876l11j619K72L48K017q23j747J045M41P48P52
$$ y = [13, -526, 280, 370, 75, -85, 785, -175, 555, -712, -1091, -1147, -15, 622, -342, -411, -1157, 267, 915, 443, -433, -34, 386, 541, -956, 139, 793, 1512, -167, -83, -2051, -1526, 202, -13, 409, -801, 14, -484, -567, -41, -691, 331, 696, -251, -673, 12, -618, 506, 1089, -506, -511, 39, 933, 1236, 165, 137, 1121, 501, 827, -699, -1854, -215, 144, 1468, 457, -524, -787, 1444, -239, -673, -1448, -60, -469, 91, -365, -940, -206, 912, 270, -696, -836, -335, 640, 1207, 241, -1375, -385, 451, -43, -344, 188, 127, 589, 655, -155, -465, 665, -556, -281, -1145, -419, 799, 974, -426, -1254, -738, -60, 1393, -433, -1744, -110, 686, 998, -717, -1258, 451, 394, -250, -177, -362, -730, 1380, 65, -524, -1474, -704, 376, 661, -640, -213, 512, 455, 816, -757, -1826, -364, 386, 1055, -1038, -1389, -1456, 420, 109, -1510, -1238, -890, 1127, 304, -1443, -398, 43, 791, 1543]
3534A543k000j7O41M45n96j670Q50J906l35n55j172N83J130L19q00p75J238L46
3552A081o59j086l5o37J387R3P99l184J612J686M15j762j51P02J75M50j599q9
3570h02J70J834o74j005j776K180j17K477l234J54J667J231k380j429K67K361
3586I24M01j050q84lL11J133o95j746n17J647K868j215j571p98J622J445q61k258
3604a247J73Q68K145j506k79o0O31l43J11j185p64J578L178j944l216J063K544
3621A747j231p07q18N17J201Q92k096O26l10J675L38j992k11l88K113m28m29j932
3639a433J053J344j04j882p12J390L13M51p43M2k20J454P29k558M7J525J578q60
3657A414j729k12J956m88j364l48J2Q39J322j865q29M98l53K532n67j422j261
$$ y = [1543, -457, -474, 167, 612, 16, -1654, -804, 1102, 767, 212, -960, -377, 753, 1072, 272, -503, 735, 1081, 422, -664, -699, -1336, 51, 144, 943, -2241, -629, 1057, 1472, -290, -441, 261, 436, 886, -713, -802, -632, 1202, 528, -477, -2253, -73, -190, 2287, -947, -793, 874, 2105, -275, -1704, -1437, 924, 1325, 275, -609, -612, -301, 832, 137, -1609, -2126, -479, 2389, 1174, -397, -1195, 427, 1872, 1011, -1247, -1074, -206, 1939, 433, 154, 94, 725, 382, 493, -692, -1456, 122, 3300, 1356, -1860, -797, 1747, 516, -191, -1009, -492, 709, 1601, -495, 131, -179, 1496, 1834, -158, -369, -757, 1356, 928, 499, -1433, -380, 964, 860, -1022, -1734, -344, -31, 420, -323, -281, -501, 953, 1682, -876, -829, 696, 2274, 1414, -315, -527, 1429, 941, -423, -771, -759, 80, 1402, -463, -1292, -794, -1147, 1385, 818, -604, -1865]
3674a865K640N42r53k177M94K733q16j383O66L92O1L01j69j797j48J232K390k577
3692d34p50Q17K245j394j738n41J876J776j792m89n63Q36J710j312j329p02J725
3709e9J421p17j541j196J744J664m91j886P32R1Q26o35j013R78k36J649j614L6
3727b47r75K337J32j303p70k97R17J516j589j162K131l80J211k553J616j332R99
3744B51R0l34j332J45J580K436k905j405J620J398l10j384J89j37Q68L39j002
3761A07J3j085J718P8j345R7L21J354o5k981K55P03J582j830O90M84m29K204j37
3780A734k341M48J048m72R43j615l9L85J338J95k619M70K23J123r80o53O43L57
3798A88J104q53m59p59J63J253j077K67j901K569j76K01r29R73P61q26k120J611
$$ y = [-1865, 775, 1317, 364, -1813, -1319, 1414, 598, -785, -119, 273, 334, 635, 466, -1331, -1479, -247, 2143, -434, -1184, -367, 1878, 484, -1254, -1795, 81, 1857, 65, -424, -987, -151, 1559, 247, -1082, -1784, -59, 1362, 645, -896, -2092, -348, 1316, 825, -1061, -329, -238, 588, -47, -1060, -82, -318, 1331, -283, -247, -1222, 1115, 1247, -56, -826, -1123, -206, 1310, -279, -1441, 690, 310, 1521, -1032, 584, -748, 251, 341, 7, -1325, -1180, 400, 2836, -69, -1474, 146, 1544, 1234, -150, 39, -98, 770, 1109, 107, 120, -965, 753, 831, -514, -417, -96, 1258, 1193, -1788, -1533, -830, 752, -1078, -388, 96, -333, 1871, 1734, -607, -159, 889, 417, 1360, -255, -294, 91, 1429, 1624, -995, -525, -302, 821, -159, -812, -169, 188, 1292, 439, -20, -779, -616, 637, -440, -173, -2074, 495, 319, 520, -409, 564, 1325, 499, -1621, -10]
3816a0m04J22l4R12j641J274J73j49M14j280O21l28J013r63r37Q44L71K10m22
3835b14M0J010m86k98j011Q51L00Q01j196Jj216K282K5K91j679k34N78N23o3k24
3855H1O03r25K52o39O61K07Q56p76r66O73j83O95Q93j224m99M70K28J272j205
3874D74n68n00J577k99m35m52P05m85J24p40N74R04k61j84L40k093N46K131j102
3893B56j234M0J213J34O44p03j665R07R64p51N17m85J22N95k62J54j706Q84J33
3912b43j86o14O89M07q49J099k867K093K69N03r95N60j174K778p81o47q94o60
3930a512m16J918o74J468j091N93J087j206k15r69J903j054J4J25j233J675N90
3947A003j912o49J744j168K305j45l240K248l43R76j385J097q97M71Q25j241n02
$$ y = [-10, -414, -292, -326, 586, -1055, 219, 392, 243, 657, -623, -2, -330, 683, -280, -1217, -373, -2, 208, -214, -174, 836, 350, 52, -959, -108, 192, 993, -203, -202, -1418, 864, 889, 1180, -499, -733, -155, 368, 305, 81, 684, -241, 11, -628, 33, 240, 1096, 320, -646, 27, -156, 539, 1432, 208, -291, 179, 407, 1679, 474, -94, -594, 983, 684, 249, -203, 502, 17, 141, -599, -25, 879, 618, 434, 774, -1319, -773, 1358, 256, -978, -938, 275, 409, 1053, 350, -1315, -408, 556, -195, 322, -163, -41, 554, 292, 446, -1260, -376, -243, -429, -1043, -354, 53, -796, 303, -2564, -471, -202, 301, -694, -134, -1308, 1470, 689, 42, -852, -1512, -1928, -10, -684, 784, -307, 286, 1373, 167, -48, -1017, 886, -168, -154, -29, -1262, 413, 1003, -909, -1558, 186, -982, 1323, 1178, -2062, 186, -157, 819, -566, 531, -366, 105, 930, -311, -813]
3964h13R88M3J64q27n05n69J525J239p62q03R58j638l03M70O39j84o80R07k78
3983d29J14o39K696j355M7o34n07J336p44l6O5r35J359m23l02J894j151L59p74
4002e9J360l471K768n53m86K14J39J44m06J455j527j175J891O71M8q34m85O11
4020C05P94p26j411J018L75J63n41j010J586k19K8j255J031j210J223J525k501
4037h25q36K091J189j70j415m49K44L01N0M23j823J455L84p40q17J108k66q6P60
4056E78j126N28P0J78K47L8n72M31L09n74J02q7r68K435j126j520l43K987q75
4075G12m38j652J262M17r0qo87L15Q44j148J574j598J43J153j52q63k39K54M66
4094B65J494j804q06J680j494J242r64O9O09K09r75J04j47M64L38N87j380k00
$$ y = [-813, 175, 218, 382, -445, -950, -1519, 6, 1245, 483, -320, 638, -1000, -1303, -833, -194, -378, -1058, -151, -429, -315, -954, 1742, 387, 434, -200, -707, 629, -115, -151, -86, -1021, 338, -85, -387, 1507, 356, 715, -59, 1301, -2170, 598, 45, -441, -227, -88, 56, -350, 1105, -422, -1597, 294, 965, 1013, 179, -306, 305, 1099, 373, -1038, -20, 355, 518, -23, -1033, 553, 334, 362, -893, 138, -1072, 151, 1676, -825, -1661, 430, 1619, 1449, 34, -415, -171, 130, 180, 603, -1220, 235, 619, -121, -938, 170, -96, -182, 578, -548, -20, 50, 228, 475, 513, -59, 372, 681, 107, 209, 122, -846, 1589, 463, -1057, -1400, 1587, 712, 274, -1378, -116, 301, 211, 203, -484, -169, 675, -473, 1101, -497, -354, 799, 647, -216, -455, -201, 265, 1759, -45, -851, 829, -665, 577, -387, -318, 291, 500, -475, -371, -518, -54, 284, 871, -509, -709]
4112g09J158m07J265n28j721J510Q56k034q29J174O70M8p42P60L98j722J856L90
4130A393q58L32j14o16p11M41k11j076K114p36j45j69M77M13m63n13j058J582
4148H2l28K8r10O15J722j209l4L20J6J311j133L25j802N67Q94Q03o85j141KJ516
4168I59p33j237l34L91J421j033P72o80J426l90p0j47Q1k72J316j606K31p05J016
4187D06J630k491j326J459J232j73m20n04m44J107N2K61j160M11Q97j572J273
4204F38j850J122L86P60m05j163m27R20N54q37k80L9J67J154k61q88L22Q58m09
4223D00j201l40Q25P93K44j334K2J336n03J00P17j903J637l34j97R5j755J897
4241D99N95q00L91n48m97P75p02Q67j257R29L16K99j290M99k42M10J202k785K98
$$ y = [-709, 449, 42, 1307, 779, -942, 568, 1424, -610, -1439, -265, 405, 453, -289, 471, 869, -853, 1003, 1393, 535, 867, 753, 137, -574, -133, -344, -1420, 694, -42, -187, -356, 121, 534, 71, -442, -1500, 82, -246, -218, -1128, -513, 1209, 0, -34, 286, 302, 1613, 480, 805, -997, -430, 464, 1267, 582, -559, -557, 959, 226, -1011, -1345, -954, 467, -566, 206, -474, 952, 562, 492, 345, 426, 154, 1470, -136, 95, -610, 406, 2036, -455, -1781, -322, 910, 737, 317, -187, -631, 476, 528, 789, -371, 40, 937, -635, 638, -1212, -90, 296, 1056, 651, -512, -939, -19, 535, -302, -582, -543, -376, 778, 517, -371, -49, 809, 400, -801, -1141, -316, 477, 721, -613, -591, 745, 242, 342, 1059, -844, 793, 459, 262, 357, -1398, 499, 1094, 294, 685, 137, -360, 415, -287, 580, -677, 252, 568, 867, -423, 76, -166, 244, 1446, -1339, -1041]
4260a041O83J497m96j281N35L27l80q14J458j760J375J67l16m05K58k84M18K80
4278B21k83l90R63m45o10N79p90J278M4p02j24J190j144j73k09j091K301o16J68
4297A67k36l24k43O00K24j5n26J383n19j36j563J621m99J577j984J289j360m23
4315i67q4J255m12o45Q84Q9O15j451M46k7M70m95K47j37O74o40n34o1P25K58j174
4336i64N52L58p2P50j703J615q78R75J26J95j403K43p5P43k44m08L16K75Q4N67
4356A052j459M33P76n63K94k68j690J533k01K51J624j868L96K68j185P92j0O9
4374B44m45O53o22m68R01k91q69m56J364K51j023J026m07j66J771j867Q10p3j162
4393h29P85k58M15J309j339p03J420j447M81k77O43j98J511k900P50J373j14N6
$$ y = [-1041, -358, 1139, 643, -638, -103, 224, -156, -970, 488, -1272, 103, 270, -46, -451, -193, -477, -59, 221, -62, -452, 511, 66, -544, 35, -755, 523, 567, -135, -259, 931, -213, -386, -595, -1686, 615, -1, 167, -69, -393, -636, -36, 188, 173, -353, 1030, 511, 375, -1188, 433, -66, 1511, -473, 816, -544, -967, -1051, 204, -208, -853, 31, 120, 735, -716, -270, -297, 173, -322, -75, -212, 462, -178, -712, -773, -48, 210, -964, -412, -54, -126, 624, -1079, 536, -342, 633, 759, 954, -449, -206, -281, 462, 218, -190, 126, 401, 485, 1052, -407, 26, 802, 239, 533, 265, -1425, 108, -93, 158, 1782, -86, 310, 578, -607, 185, 175, 244, -201, 452, -170, -638, 263, -28, -897, -1353, 11, 262, -761, 265, -142, -308, 1463, -404, 406, 333, -829, -44, -302, 113, 1422, 83, -620, 800, -647, -166, -443, 200, 2, 1513, -1387, -637, 736, 622, 678]
4411F78j241R85M3r01J5J059j602J477l31r82Q05j249J661Pj64j098J255k36j022
4430h41K72j025J750j87j42K86P1J91j046K62l99J558m09j579J287k9K16Q71n02
4449F05P74j789J969n62j337j553K019j083O32J032m32k34J168q38j07P63j391
4466c64N51L58j002k33J526j171J599j162K62n99j538K075r36j95N96J168j001
4483f6P86r30j468K152r31P53P7M14q64L62j251J982j223M36r6j313M39J359l21
4502B97o24M5L54p34N36J484q90l2P52j464m14P48O5o27j042Q65j369K709k39
4521D20n07k16M56j24j58o57J080M65j663K17O02L62j56k097J371J156m00k38
4539h7J322l68n34n0N45j993Q82j147K055j302J165L16m85p09K75L34o94J535
$$ y = [678, -563, 422, 465, -436, -421, 638, -964, 513, 182, -800, 5, -1244, 417, 424, 260, -838, 417, 181, -841, -569, -1594, 156, -31, -173, 113, 184, 375, -671, -409, -808, 750, 341, -1238, 49, 20, 236, 1107, 605, 1379, -410, 1559, 997, -340, -1893, 126, -957, -325, 707, 275, 41, 1209, 371, 264, 1027, -364, 187, 545, -457, -690, 836, -335, 1264, 102, 364, -235, -1773, 302, -634, -829, -233, 935, -66, 720, -210, -1678, 474, -457, 296, 373, 787, -77, 285, -966, 1016, -207, 229, 133, -1180, -741, 618, 297, -327, -282, 72, -662, -126, 1358, 468, 436, 1188, -276, -690, 58, 123, -504, -1546, -681, -2050, 659, 420, -87, -303, 153, 29, -129, -786, 294, 759, -904, -687, -85, 277, 121, -1976, -605, 551, 151, -87, 1235, 867, 333, 283, 828, -1165, -283, -1430, 625, -677, 488, 804, 319, -390, -115, 219, -475, 1060]
4557A060o18M67j143J37N45N58j64n34J36M25M09r31q37J180n61m46o4Q16n99
4576a64Q42J39n19p95J239P52j766K21n89P70J234l11q21l94L0J992k479L02j127
4595a444K232j27m27n67m96J303o42Q29m32Lk69M37m30j034M64N71J20p08J002
4614C85j632R79K33n29R27p01J273o86O90j51j193N52Q28n78j310Q09P30r45J20
4633a99R54M45j761J123J58j738Q14Q80N52k752k61K157m74o09L68L8K31N01j245
4652h18M21J534l81N42j313K64M18n6n43k88L42l25Q36P45j436l17J7M52L02k55
4672A41k58k20R65j113O45R30l98J232k742J418J88j301L77K49k03M04r04J837
4690A247K5j445l1k50n12P03K45q17P47J207l57r11n19k52J922r87m04n79J274
$$ y = [1060, 442, 909, -234, -97, 448, 1006, 842, 308, 444, 869, 1278, 347, -490, 690, 129, -317, -381, 435, -164, 678, 817, 298, -497, 742, 1494, -272, -51, -640, 130, 1364, 1053, 232, -162, -132, 1860, -619, -317, -1444, 788, 661, 234, -333, -829, 474, -168, 661, 229, 232, -37, 400, -30, -1064, -600, -29, 91, -617, 385, -1247, -268, -35, -564, 363, -338, 935, 249, 939, 788, -405, 147, 975, 397, -913, -104, 626, -319, -199, 755, 1200, -561, 562, 720, -1018, -204, 676, 1228, -1524, -1785, 372, -102, -711, -343, -305, -74, 427, -818, -397, 1137, 756, 1298, -15, 249, 667, 611, 68, -220, 122, -203, 633, 1378, -58, -375, -358, 94, 396, 141, -117, -337, 628, -485, 160, 1090, 692, 1924, -818, 600, 788, -513, -136, 113, -90, 314, -590, 1247, 1272, -173, -204, -454, -966, -263, -18, -835, -88, 1119, 762, -149, -668, -920, 1002, 15, -389, -968, 306]
4709C06p62P55m10J13j047O74o19P01K82p29L69M36r05J482j197k2NJ326q94M72
4729C36N78r18r64k8J765j412m18Q43Q75k17j477J288j448J913j073R44j503J083
4747A67o50J593k005J70J92P87L9q61p8K24l26M77k2r8O9P00n67Q29J22o36l10
4768a84o57K34P31K61q45R84p22j265M59J523P18j624Q14M42j114J253j04j469
4786e65L43J79j61m39L66J76Q83K59j629P06k63J82J396o62j117K05M51J147p64
4805F93k256J410J359j563p51M08k9J307p95J6K1l75M74j201J05J363P21k20l40
4824C47m00M61o64m18R33m32R80j037M10m5p01P01q89m4R9L42R57J79n79j073
4844h73J587n17M64r3k33r44Q75m10l55J191M65j132Q94Nj714J053m03k20K28
$$ y = [306, -456, 299, -111, 2, -1045, -371, -990, -289, -7, -736, -367, 69, -836, 646, -551, -573, -568, 758, -136, 336, 914, -4, -968, -996, 769, -643, -1061, -218, 657, 440, -1037, 251, -1197, 716, -357, 587, -916, 167, -483, 1110, -895, -725, -533, 254, 293, -568, -646, -422, -748, -271, -293, -391, -322, 378, -189, 640, 762, 126, -184, -841, -607, 124, 385, -460, 524, -198, -1463, -1004, 519, 1237, -387, 427, 869, -245, 1008, 904, -565, -222, -43, -204, -643, -277, -101, 782, 1041, -588, 118, -145, 37, 1433, 771, -346, -141, 310, 1457, 693, -1563, -153, 1206, -357, -1108, -700, -729, 578, -217, -201, -180, -555, -81, -1282, -1177, 186, 907, 687, 347, -53, 408, -256, -674, 259, -173, 807, -230, 180, 135, -566, 135, -754, -798, -699, -357, 600, 779, 200, -873, 714, 197, 661, 568, 335, -609, 266, -144, -499, 692, 1157, 25, 919, 924, -790, 263, -140, -360, -132]
4863a32j71l85P91k23J5m67Q79N10l49K20j979J458J076j308N98o49m97N98O43
4882F28l71k01J17j88R70q80qJ6k9P25q52O22J1j11p32J45M59p50J139j069M95
4903A36O7k96J00N29j433J611j272J104j53N01p11M49p63l03N83o87J85k06J238
4922F79n97m36M67j89J091j255N08N78j976J129O2pk86m8O37K04n08J47N86p71
4942A5p32N17L64j446L40Q52k35N84P03j418J007n59M05q56N08n82k96P96J051
4961A018j301J57O41p2M15n32j57J27k93N47l39J54j79K39p55M05N82q92P1j78
4981c42P74j22O6n06J53P1k14K46L38q52l05J190N27r36j75j61J70L53L09r11
5001c27M50j26O26q22N02l90p76J258K05j282O93k42N63p07Q71m99N76o64O88
$$ y = [-132, -303, -688, 103, -120, -105, -572, 307, 817, 468, 688, -1291, 167, 1243, -65, 533, -116, -613, -15, 628, 257, 56, 173, -15, 955, 75, 67, 83, 54, 779, -73, 549, 560, 449, -283, -138, 321, -429, 710, -359, 136, 203, -93, 7, 536, -897, 714, -558, 546, 393, 894, 183, 632, -131, -434, 149, -538, -353, -559, 679, 82, -354, 113, -76, 1015, -240, 268, 846, -1130, -1, 61, 54, -232, -280, 357, 561, 53, 200, 786, 15, -717, -200, 164, -1282, -942, -90, -325, 259, 962, -456, 551, -8, 397, -459, 49, -533, -829, -33, 1018, -283, -126, 515, 443, 858, 326, 169, 296, 3, 550, 211, 365, 186, 425, -330, 75, 657, -235, -164, -342, 432, 310, 376, -130, 23, 94, -120, 126, 464, -388, -693, 497, 1024, 88, -87, -248, -78, 275, 584, -327, 123, -3, 623, -199, 303, -87, -863, 395, 600, -682, 11, -231, 332, -375, 496, -3, 573, -91, 597]
5020E97q59J88m97P9J358r88K29p77J902j509J50n5n70MJ391l34m68J079p35j32
5040E3M02p31K13K97r0j229J462o8p33J042j95o02M45N12m91J5j27L82j45l89
5060B3o49J397j020q05K57J336k36n00M8J176q92l30M60J97m63n9o01L63J301
5079A003n98q81M30k35J25Q54j010L5L18L40j581n6O51l45J235m83M78j93J69
5098B56k06l99K11L33M38m63m41N29o49j29O88j02L19r44J289o0j142M79L80p65
5118c78K04j21o82J878q88O54o41k62j27J346j686p56J794R48j578l7l29J66J57
5137c38O35m22L35o74Q3N11m17L7M57j110J273n56j78O25n57J85j006J682n70
5156eN46j055J035j25j051L62j08R71p12k20K58K8j1N23j206J510j130p7m89N61
$$ y = [597, -262, -74, -571, -492, 866, -122, 107, -670, 1232, -277, -127, -182, -752, -748, 643, 309, -159, 920, 185, 53, 455, -276, -63, 234, 144, -1085, 377, 309, -424, 618, 423, -179, 266, 778, 287, 302, 175, 557, 412, 23, -626, 771, -249, -1054, -797, 539, 303, -197, -149, 1027, 135, -195, 265, 462, -1, -60, -661, -298, 1003, 405, -476, -46, -281, -156, 698, -312, -277, 41, 381, -1200, -1256, -605, -950, 285, -198, 280, 87, 256, 50, -349, -138, 195, 633, 170, -271, 258, -391, -520, 168, 66, 385, -559, 730, 670, -472, 7, 387, -378, -174, -295, -977, 901, 13, 667, 26, -236, -363, 983, -703, -1459, 335, 1283, -295, -332, -661, -495, -338, 297, -125, 210, -464, -381, 130, -287, -250, 207, -903, 370, -186, -364, 261, -296, -111, -1117, 565, -5, 541, -514, 521, 396, -655, -293, -401, 570, -142, -362, -104, -76, -87, 436, -770, 740, -390, -467, -956, -395]
5176c95N87j56m41P79p73K14J41j278J382O85j20p38K8r69J561m71q2J7P72j013
5196b70J153j48K89j662O23L29j199K08J509q05j68J96o00k7K49P38J87J248k728
5215h78P83N04o94K57r85J809O49j583m51J18L59K63j66o72J540J07q14L89J05
5234F40l93j680J449k09n32N86l6J07J288j100k72M75o25M41p32P91l09N0o22
5253f83J931l37m22K56q57n25J093k79K65J44j63j011r96J035N35Rm98K88M32
5272B17j53K62l65n89O35N73j425N87Q90n16r99M45N93j40o63L46M42k75K51O62
5292G78r22j65o0R48n19n07J00P7J86P1Q0p23J074k08k64k30J82J24J08J59n17
5313b28n36M95O52o00O36J62k19K03o13P05j244Q08N9p73j28O49n62L51M44J40
$$ y = [-395, 192, 36, -405, 374, -399, -185, -44, -1322, 60, 745, 625, -113, -85, -1054, 507, 36, -46, -29, 743, -270, 883, 735, 1024, -638, -15, 314, -885, -677, 832, 27, -141, 55, -545, -572, -323, 415, 602, 1850, -878, -95, 409, -285, -28, -1013, 796, 1445, -138, -589, -471, -112, 151, -15, -687, 853, 960, 146, 535, 640, 247, -1433, 16, -193, -725, -139, -175, -68, 1220, 120, -152, 323, -302, 139, -593, 198, -111, -61, -683, 1248, 911, 489, 745, -112, -637, 456, 177, 442, 586, 423, -588, -1584, -549, -14, -5, -503, -215, 217, 64, 326, -39, -628, 7, 580, -845, -258, 632, 116, -883, -438, 155, 15, -648, -302, 140, -135, 116, 778, -144, -309, -369, 579, 60, -447, -347, -270, -84, -13, 67, -656, 418, 210, -54, -284, -102, 22, 130, 289, -228, -764, -269, 383, -217, 419, 581, 362, 565, -48, 657, -587, 221, 280, -493, -621, 28, -534, -183, 261, 401]
5333D01p47J007r33m1L55m30N66j87k67J19r1J016j8p73N12p64O18o3m71l72K96
5354b67k81K93J57L25n39J85k08M74j63O82n31p50K29N44l64J93l4K64k67k02
5374b60o22K91k98N0J288r1J68l82P64j100N0j31L65R9o6P13l12o65m92Q88r35
5395f78L01K41K52j64N68m2l94o4K9l61R9j11Q61l73m44j05P48k16j81p50J042
5416B58K76j12J102j954L07J96n50O33J00l84q0Q9K00J42k47j138J474j26r39
5435g53M69O91m06M73m99m2M77R9q46N49J62k78O7k98J3M36j5J77o76J12J77Q
5457I7L37j00k59r9L99k3j64m62o4J75N96N00q97J73k40l5O35j46p77l46O12n57
5479f45Q15n1m69L40p29P40K77J62l59p74K46O99q31L95J148r04l72M60m22J24
$$ y = [401, -346, 661, -272, -313, 42, -388, 178, -9, -276, -157, -248, 768, 750, -23, 489, -275, 343, 280, -191, -563, -267, -548, -255, -98, 227, -312, -127, -335, 139, -24, 658, 127, -623, -394, 150, -214, -21, -55, 209, -58, -260, -882, -591, -889, -839, 449, 358, 526, 144, 908, -192, -142, -273, 92, 191, 125, 838, 526, -139, -631, 257, -678, -377, -136, 116, -48, 520, 478, 84, 20, 49, -312, -213, -324, 537, 164, -280, -385, 363, 147, -34, -784, 258, 534, 422, 1524, -430, -123, 73, -477, 156, 256, -128, -208, -119, 81, 223, -24, -1162, 312, 186, -753, -284, 407, 1, 474, -25, -67, 410, 509, -337, 212, 374, 96, 163, -135, -122, 314, 299, 476, -200, -88, 89, 97, 434, 334, 75, -24, 375, 352, 188, -274, -338, -163, 433, 933, 36, 209, -31, -66, 569, 423, -354, -700, -88, -645, 170, 119, -350, -10, -739, 1, 278, 440, 81, -693, -447, 252, -579, -184, 964, 60, -312, 148, -274, -150]
5499a50L6M87m40k02K2l5M28j46J45P03p65K03N1J65r96q74J700p02Q0k66M9O93
5521A86m17J334q89k48j024J312K4p92P65j12K13l78n82M81N4k85N3L25n04Q68
5541C84m97j74N73q20P87q04Q53o92K43J11O49m07L20n2o26q33J058K66k027J333
5561c55N14o88R18p78L66k43P26n06N14q66M34k90O79p33k17J876j387Q67j344
5580e13P5K10P52j369J072j378J307J495j809n11P36P58o42m56m08J088j096N37
5598a52r6J31j079J288l49j48J503j027j3m15P92N12P8j722N3K64Q68P23j755
5617e44J518q67K28Q05j192M27m48L03o37O65n49j25l39N50Kj64J06l78J190j77
5637C74N5r72P26L24M6m76q84J207m49p49J68o13J351J23N30j079N34j212J165
$$ y = [-150, -114, 373, -67, -269, -247, -282, 146, 0, 145, 848, 83, 286, 337, 502, -494, -1368, 332, -370, -290, -556, -507, 186, -231, 1103, 214, -34, -1058, 254, 278, -514, 251, 139, 352, -26, -608, -127, -73, -358, -305, 20, -484, 384, -113, -287, 286, -534, 253, -551, 302, -390, -147, -36, 613, 206, 526, 474, -152, -985, 73, 339, -1688, -355, 159, -529, 389, -389, -23, -266, 460, -46, 468, -398, 36, -254, 425, -308, -525, 1351, -36, 831, -513, -438, -228, 524, -845, 227, -1151, 156, 1651, -158, -669, 67, 825, 183, -273, -681, 407, -689, -152, -248, -117, -1196, 92, -257, -405, 1098, 71, 58, -357, 435, 947, 1025, -697, -644, -380, 488, 1211, -544, 974, 107, 335, 1140, -52, 375, -73, 230, -407, 258, -291, -416, -755, -205, -203, -367, -261, -639, 551, 374, 429, -543, 183, 507, 553, 77, -807, 400, -49, -798, -630, -1243, 108, 231, 761, -318, 216, -996, 169]
5656A69l22j09O11j78m34K52l16L72L77jj035O10R19j181J21r54J192p31N53J98
5676A13O9K55m26p68J53Q00m89O09J95J22j34q75P9N97j266Q92R80q96k87j4q86
5697a177P71J278l80m75n44p2L87J55J22j071N66R20k20j029L66k51n0R61m53
5716a96O91m51L46J085j832K88J157j608m18J907n32o88K58n1r0R02o23o78m86
5735a019P96J20m62J011j04m41l43J351j446K97N60l42r1R39j088o0J299p07K17
5754D87j044k06P72k10J80R44j585n71J357M92j008j27P74l13L33n97J590j286
5772a8J31k37O15m05r97M10O20m0N71j6L22J62j134J50n13l41K24N21j235R26
5792b84N34Jj091P73j00R71o49p7P4r77J016p97K03P53j244p8n37J277J07K43
$$ y = [169, -153, -262, 349, 171, -263, -11, -327, 45, 422, 421, -614, -4, 915, -266, -145, -1099, 93, -638, -85, 113, 182, 437, 11, -757, -604, 196, -293, 316, 511, 633, 499, -376, -297, 300, -966, -74, 906, 10, -277, -291, -1177, -406, 872, 492, 17, -527, -599, -212, -57, 65, -1006, -440, 480, 260, -769, -403, -654, -704, 257, -196, 495, 44, 390, 1475, -357, -69, 1088, -520, -938, 969, 437, -251, 7, -44, -134, 768, 145, -533, -1019, -223, -103, -565, 446, 342, -99, -442, 909, -537, -240, 320, -22, -113, 826, -262, -322, 977, 270, 487, -557, -763, 9, -201, -21, 923, -662, -1233, 124, 616, -392, -519, 255, -58, 275, -322, 1268, -18, 113, -124, 491, 86, -911, -501, 119, 79, 650, 634, 956, 1118, -16, 134, -379, -720, -496, 25, -1210, -284, 250, 251, -840, -67, -167, 804, 155, 78, 152, -825, 191, -606, -403, 350, -894, -972, -1509, -232, -125, 118]
5812A18m83M06n43K23J380J07n74J32o11J09J43J11o10R78j066l37J303k246O02
5831h58N36J774j478p27P25J09P6K35r37J097q33Q6J034J9m35l5j657J604o31
5850b96J53j81J65j15J26M24k33j97O58K39n25k4r3M70R38j399j27l74J264j169
5870b96O38j002J26J732j815J081j90N57r48K53O52j97j352L14J129O0m59O79
5888I62r74J00m53Q9L97N2k8J077j084k34n71Q22k91l24J47N74o22J81R93n17
5908B96j65r84R35r51J236r85M18r62R4J16N98o19pQ78O62Q01k86l50n54K76r44
5929d97J312j240Q79J24o57P1j013J92P90J064o08p0J62n82P31j324J062r43P58
5948B11J18n50P68k09o83LJ318n47n40J39O89j738R66q82M45M98j52N51m34K8
$$ y = [118, -365, 41, -502, -279, 1101, 1208, 634, 766, 155, 264, 407, 518, -92, 886, -180, -517, 786, -1460, -858, -322, 1452, -26, -753, -28, 81, 157, 392, -545, 552, -281, -195, 839, 858, 423, 388, -1269, 335, -296, -143, -324, -159, -274, -148, 276, 43, -154, 504, 743, 218, 194, 101, 571, 1509, 110, -17, -391, 873, -296, 342, -660, -534, 1198, -617, 464, 274, 831, -117, 136, 788, 591, -761, -447, 682, 742, 283, 962, -12, 88, -365, -276, 121, 173, 145, 1222, 138, -96, -667, 155, -136, -460, -313, 261, -361, -180, 813, 296, 131, -853, 82, -869, 367, -618, -200, -1162, -1068, -952, -354, -973, -980, -102, 560, 1361, 1075, 725, 171, 447, -497, 815, -425, 454, 578, -79, -8, -1021, -829, -39, 1025, 417, 347, 509, -73, 658, -666, 396, -547, 211, 329, -221, 547, 338, -345, -342, 976, 429, -111, 28, 717, -1021, -55, -937, -492, 6, -146, 405, -29, -1]
5968ak66K008j813O58j224J128n03j74j78J10m0P2M64p85J91J857j871P28N74
5987I35j587J410o29j283J878q87K85M26P71n36j117j163J671N8J2o09J001j295
6005f59J041q39R38r27l43k41R13Q3N98j094J50K15P41j123J717p68p05L38r49
6024i14J914o06j0p18R0r26J256r57J497O3l01r90Q24q33M78k66R03j10O79j445
6044c72o71J719k6m86p2J131j481K13N25j105M18r5R99J6j421J004j102N33O09
6063C36j101L13l22J342J4j205O90J755j745l89J463l17o04r37J47O59j89o92
6081g82K100j106l40m64r9R95J08j091N84K91M66m36p95O72j72J0J51m01M39j120
6101i90J847j698J933j314M48k94j82R6N64q97K76m84N71o73k16P94K54m04L89
$$ y = [-1, -267, 1741, -72, 586, -638, 490, -13, -187, -365, -255, -295, -223, 241, -544, -353, 1504, -367, 361, 935, -652, 758, 129, -1154, 724, -163, 122, 548, 1319, 783, -334, -1497, 174, 232, 244, -365, 636, -659, 382, -457, 481, -446, -789, -1030, -117, -34, 564, -530, -380, -165, 576, -547, 1170, 402, -303, 35, -914, 1000, 394, 384, -334, -244, -1170, 86, -871, 626, 689, 388, -602, 222, -611, -133, -399, 504, 394, 1073, -372, -1043, 676, 650, 164, 92, 1223, -258, -45, 480, -625, -207, -302, 697, 713, -708, 296, -806, -273, 336, -765, -452, -774, 568, 582, -623, 67, 1822, 77, -312, 1151, 834, 230, -707, -560, 99, -90, -782, 1318, 212, -128, -592, -691, 304, 412, -679, -95, 196, 662, 226, -569, 103, -69, -59, 92, -309, 130, -990, 857, -841, 1092, -222, 226, -68, -250, -154, 410, -487, -211, -695, -124, -797, -1013, -219, 35, -369, 20]
6120B0L91k44M0k98j74O38r5M77r35J51p84J392j86k24j440J882j41j79j31j275
6140a115J466j333P68O9O44j054J156j528P15J97j58n6O07J53j88L6l66M44N4
6159E11J63l35j5j92j66L99R6q40O11p43J724j404j93n2J20N40j37mJ40J34J111
6180A468j664J39L22l64r58J483j234J503M1p39m19P15K81p22k5J000q9n77ko82
6200e23O51R81p19p77o9n27O46Q0O60m20k58k36J9O19q75J434k07R20j889J880
6220A390j104n07J418j751R56J240j434l78J29O62L57j676K97m2l50J595q54j194
6238a246J431J075j858L11P37m90J101n58J45K8l83q08J469q53J04m01P90K92
6256H86k274K306l23l90n68l7J33J159p61L67J33o94L49J107j772k74K16Q49r5
$$ y = [20, 411, 167, 207, -91, -265, 373, 278, 755, -180, -29, -813, 579, 393, 169, -1271, 611, 470, 291, 160, -1115, 351, -982, -214, -145, 499, -555, 601, -927, -212, -15, -173, -229, 378, 531, 343, 379, 13, 457, 511, 674, 339, 324, 132, -34, 365, 461, -379, 232, -511, 1213, -191, -384, -436, -316, 224, 87, 83, 223, 357, 1468, -196, -57, 265, -99, -1057, 426, -808, 695, 736, -3, -422, 293, 574, -148, -173, 827, 738, 161, 159, -523, 128, 1109, 390, -387, -456, -983, -337, -257, 403, -17, -275, -511, -492, 127, -748, 686, 479, 1399, -490, 1390, 286, -221, 1197, -554, 402, 1642, 208, -170, -41, 621, 978, -698, -401, -443, -793, 802, -52, -1246, 185, 1260, -598, -287, 450, -40, 1061, 503, 648, 676, 293, -515, 954, 101, 205, -196, 594, 886, -1388, 918, 595, 205, -363, -400, -267, 892, 131, 498, 631, -63, 286, 1393, -379, -653, -437, 412, 317]
6275C17j165Q90m0j07K21o89M21j331K217K18j850M07o24J656P06j593P06K65
6293F25n33J44j28K76q17R70j041R26r28J01j43J000o26p90J734k71r7K92k076
6312a382J423q3r50P33O54Q2m38N4P7R1m05n8J179M8m28K79j113R25O5o68K20
6333C05M00r09j45O21K75l01J581j958k26M24k47j60J183j732Q55l5mj62k46N05
6353B4J63P91r41M36q25J70J155k140J461m25J3n9o65N31L82m12Q12m96j138J123
6373d0j48L43J73J47p77m81J87J005o23k85l65K284j741Q07j54k75j730J863L14
6392E04j017mJ387N80j091m39j53P77j362J067p75M07j68l53J157Q19j747L67
6410d4o18N01J79k78K72q87J261j27J72q31l46O26P28k3n83n64j80J094l84l44
$$ y = [317, -848, 42, 2, -105, 116, -573, -152, -1483, 734, 952, -898, -491, -1115, 541, 1247, -346, 360, 625, 92, 236, 108, 384, -433, 537, -504, 422, -506, -405, -548, 452, -174, -964, 770, 499, 402, 694, -1382, 41, -42, -992, -259, 395, 477, 39, 93, 170, 261, -144, -202, 977, 1025, 597, 876, -237, 688, 753, 85, 305, 705, -204, -349, 272, 547, 246, 1827, -131, -357, 67, -180, -340, 843, -889, -34, -69, -73, -235, -481, 24, 187, 978, 37, 473, -352, -182, 973, -1167, 294, -131, -118, -177, -842, -311, 71, -341, 471, -25, -1163, -40, -188, 155, 328, 475, -302, -783, -596, 409, -214, -499, -864, 1420, -321, 486, 332, 57, -1673, 190, 504, -513, -517, 870, 1450, 359, -80, -233, 544, -818, 249, -526, -119, -287, -640, 517, 1336, -411, -44, -662, -161, 18, -260, 12, -875, 386, 259, 431, -400, -746, -120, 608, 585, 2, -562, -742, 352, -32, -376]
6430c76N59J64J579l206O72M78k21M45r54Q08k46N18m62q91N10J487r82K85j033
6449h66J134p31K37J583o67r88k52J515l69j746J144M14k61j365J280M65q84n74
6467i31M22M06M05l76J036j115P37j221Q82Q3j194R48q67J429j058k82O69P87
6485G60q43o25j81J058q7L93j28j231K38J212m41K55l70J01J06J6K28j289J361
6504E33p07J17R80n95K77p74k15N30P3j746K166j343J204K01n54M10m7J12r80
6523c58N58m92Q25Q06j056j76k17P48m8j355J387n6L5m26K04K9n83L14P5O07n32
6544B89r43Q45r29N3O38Q89m71R2j109M89L49K45j016K51K60J552j854J67L1K7
6564a45j2J123K64r46Q20n73k72p62J507j006L64j70l05O51j445J417j126N75
$$ y = [-376, 183, 347, 1926, -1280, -608, -130, -351, 94, -860, -52, -298, 220, -242, -1133, -623, 864, -118, 167, -866, 268, -463, -226, 1357, 690, -298, -550, 965, 596, -1150, -6, 408, 147, -1218, 62, 527, -357, -931, -509, -103, 302, -74, 962, -153, 584, -637, 245, 328, -866, 82, -785, 644, -414, -696, -27, 760, -83, -708, -889, 169, 82, 475, 347, -884, -646, 566, 125, 380, 10, 111, 217, 233, 461, -828, 533, -174, -57, 923, 328, 605, -169, -384, 146, 219, -1527, 639, -704, 500, 701, 147, 557, 510, 622, -358, 200, -292, 533, 1339, 283, 107, -110, 638, 590, -765, 622, 566, 601, 175, 379, 408, -175, 139, 214, 821, 289, -654, 191, -738, -685, -47, 842, 371, 463, -646, -157, 192, 437, -579, -328, -68, 1484, -370, -203, -172, -145, -157, 966, 1230, 284, 1104, 531, 259, -503, 1004, -2, 362, 192, -113, 538, -907, 510, -616, -41]
6582d1M39m75m26P57O60p81n76k91l7N85JP01r51K58m85K98N64Q4O41L33q35N16
6604I39Q3o09j241K09J098r1j00j307N9O90k90R03m15j40N79k26L00q04r8J212
6624G51o34l11K49M64r1j484M62O03J52O24p32Q71n86m75O65j139R39K56j098
6643e14Q14M35j3K76j058N33k45K38j155m45J573j008N82o91O54k66K41P81j120
6662c88K48P80o42p80J176P5j973J719L35o22P80r81O62n17k049K784O7l71M07
6681G10J98p27J72q11N77l72J85J73P87j31k5j199N80m55R53r40J248j238p7J049
6701F57j243J508j285R35k20J89j632J761o37m17l03J376o48o53P73K31r77O72
6719H7n60r9n46N14Q45q43Q20J82l71j55N87j51k68k4j88j71J183m49o13Q02r03
$$ y = [-41, 398, -77, -503, 254, 914, 133, -443, -734, -771, -186, -185, 516, -435, -177, -662, -364, 200, 284, 925, 1258, 423, 939, 1022, 413, -828, -619, 479, 388, 288, -1019, -960, -270, -560, 343, -72, -212, 367, 141, 441, -363, -461, 751, 117, -194, 55, 519, 428, -1056, -594, 9, 161, 785, 53, 924, 338, -137, 528, -611, 328, 584, -514, 300, 735, 722, 998, -60, 473, 228, 466, -689, -1134, 439, -569, 13, -678, -24, -290, -49, 732, -388, -140, 640, -2, -782, 394, 469, -1504, 215, 550, -72, 708, -273, 389, -128, -2177, 607, 674, 303, 710, 908, 181, 353, -458, 119, -253, -68, 105, 892, 761, 736, -463, 117, -338, 615, -325, 923, -315, -392, 657, -586, 922, -363, 572, 352, 541, -1091, 670, 33, -384, -687, 689, 41, -612, 161, 392, -585, 87, -473, -572, -1118, -604, 241, -602, 218, 400, 29, -126, 461, 310, 42, 18, -170, -341, 842, 393, -220, 582, -321]
6740c21J598j245N67j694R23l5j83K62J079j021P2j176P60N31j56m03k80R4l72
6759a000J034L23o88o1R2O28m12J46q73M76J66P31l11l38R1P83n96p03P69p3k03
6780a9o36J475j034M8L35m36k41K69m45J99L58o99J207j163M50J031o20k98M18
6799A99m56M64l79J098o37n20o3J78P88r83N15L64p8r91k77P53O17K07k79q64
6819c44Q19M86j386M08P70o66J34k47q51P71K72j76K37n85k98J269m42K09p36
6838c56k17L6J127j477P68J12l13J057p57n46J170R1j516J515j046j64j027J210
6856c33O50j50L53p41J47k04P4R33l03q78J629j088P4l08L18o94L69m70J004L60
6876G42j446J425r29q4J26R8M93J90q77N44l57m83O72k83N9J67r47J065p51Q41
$$ y = [-321, 1277, 32, 599, -1095, -172, -207, -390, -128, 951, -70, 2, -1174, -414, 117, -39, -442, -722, -628, -1000, 34, 357, -331, -392, -300, 328, -84, 62, -811, -335, -169, 562, 251, -87, 4, 787, 191, -512, 257, 184, -19, -655, 820, -214, -166, 169, -267, -508, -239, -684, -485, -127, -826, 381, -782, -332, 699, 79, -219, 199, -257, 207, -172, 926, 289, -231, -294, -116, 672, -311, 204, 568, 490, -501, -778, -25, 592, 799, 520, -344, 475, 961, -425, -17, 753, 87, 221, -26, -877, -106, 166, -10, 227, -358, -656, 613, 171, 380, -356, -573, -537, 590, -887, -119, -7, -320, 737, -20, -566, 604, 695, -821, 694, -352, -516, -1543, -333, 317, 167, 520, -221, -74, -278, -204, 729, 426, -452, 1177, 89, 163, -145, 173, -521, -152, -622, 382, 742, -704, 721, -208, -292, -166, -68, 425, 615, -262, 282, -75, -558, 114, -169, -110, 57, -890, 175, -576, 265]
6896B65n68P5j7m59P85K00N27o60j00O08n0r50Q16m03j59k7N78l76o23O57j88
6917f9j51N49M35j069K98k53O58m04R9L07k57m77R74j413N33n22L22l56Q50M86
6937E40j180K5J205j105J08Q01q99P4l95J357r30M34%j062J302L27k89Q97j161
6956D9P9j218J024l1l39j95K00P73o22n56N54J3j40Q20j259N98M32j520J598J07
6976C67k97J81j66J04l35p59N61N78L84K52j009J69l8K7O8l91O79m06l74k14J542
6997I23l24p58l64N13j36K63p1j253M50L36k1P75l06m63M1k6O45p80O63L23p49
7018c19M70K32m37m2J75Q78j781J105K22r33L62O11k46m40R08j070J85L19J82
7037C81J95q37M75l40o12R32n19R16r5k67k51n47O06O7n94R02o34J90O62l74o64
$$ y = [265, -303, -228, -245, -704, 81, 281, 808, 148, 48, 656, 606, -344, 472, 69, -90, -117, 461, 85, -538, 119, -69, -220, 329, 764, -305, -7, -260, 398, -6, 93, 400, 143, -334, 640, -773, -240, -762, -440, -796, 54, 540, -640, -615, 590, -515, -407, 394, -505, -431, -826, 531, -399, 35, 35, -1027, 275, 602, 313, 1210, 49, 128, -1090, -66, -97, -436, -631, -431, 342, -280, -836, -282, -269, -409, 411, -848, -250, 182, -1338, 260, 367, 70, 251, 85, 189, -146, -905, -344, 234, 618, 870, -139, 30, -8, 19, 87, -304, 375, -31, -405, -619, 923, 599, -159, -523, -10, -146, 117, 46, -1207, -757, -421, -442, 333, 27, -436, -395, -421, 224, -556, 107, 430, -319, 151, 383, -54, -96, 79, 957, -824, 281, 503, -430, -68, 543, 297, -143, 765, -305, -120, 199, 381, 576, -261, 214, -126, -738, 194, -325, 591, 496, 229, -22, -569, 37, 104, -490, 412, -222, -32, 630, 256, -408]
7058d08K43N65l32J145j867j6J054q32P03j248Q90p33J081J054p82p19L49O4l44
7077a33M25Q37r61%P19K8l89r90J087m96Q66j830J604j187J237J68j225L53k13
7096a00O35J17P7o96K61oL1M49k36o38P26M3j776Q08L91k56l58P55n85j89P90
7117B43l16Q02o63l77O34m8j188O68J86p66L90Q35l33L2k83Q5N34m99k93K87Q94
7138H24j112o22J059J27q80N26n77J310Q0o08p26N75M43p90L38n62k9J567p81
7157A62q10P55j040N23O34n13q60J075o85J058N55K72j440P43r89J504o76K11
7175D79m93M75o81P53n12k64M39r2M9l96m20l52M44L35j35K95Q04r24R22k11n05
7196A0O0L4k72m64J074m94M43o28j029N19J368n80o15J146m08M05n15l0O65j3
$$ y = [-408, -165, 400, 68, 1213, -654, -670, 384, -448, 255, -993, -103, -836, 245, 1299, 517, -202, 147, 211, -133, 292, 1129, 168, 168, 887, 915, 526, -464, 623, 127, 993, -837, 767, -420, 817, 985, -240, 113, -100, 535, 652, 729, 33, 294, 288, 319, 768, 532, -106, 620, 663, -1113, -305, 86, -170, -528, 227, -358, -547, 243, -73, 729, 66, -311, 323, 275, -913, -245, -59, -825, -435, 400, 67, 99, -184, -99, 435, -64, -357, -70, 824, -288, -910, 149, 276, -604, -78, -655, 655, 735, 127, -599, -24, 419, -371, -33, -595, -624, 943, 162, -648, 107, -933, -410, 224, -289, -1149, -74, -759, 299, 854, 1126, -314, 429, -560, 944, 268, 479, -14, 461, -220, 533, 21, -243, 196, 104, 153, -243, -663, -1015, -571, -236, -371, -76, 728, -196, 726, 515, 10, 70, 104, -168, -632, 442, -52, 391, -237, -1266, -747, 621, 41, -574, 572, 164, 569, 54, 24, 689, 676]
7216F76k21k02p68P33m1J73j07J41q9O43l51j184L87K22m66J68L14k19J004j204
7236c91m99P87k2j7p51O31N81l19K06p47o6J202j086M34J48p2k39q0L99J69M28
7257F96j350N54m46J105l63K68l54J61o60J40j99k32J054r48P12j86o01Q63M41
7276F55j290J711j325Q08K45j215O63o77n89Q39M17l65o4O01j120K55J3M9k90
7295f79K16O66j399J354l50L06l11m95N54R5j075J496r93J001j70r40O23P65m32
7314B32M28o59k33N68r56Q75q21M39J29J260j040m5k1K23p0J94j399J335n33R82
7334H88o44K66p77l35J191p99J066j355R80p69O06l98l86Q11p77k47N06j259O36
7353g96N58M47k9P83k55o77l15m77Q09J63L62j047n56N98J39R61m51j70k15M04
$$ y = [676, 455, 253, -515, 218, 177, 350, 243, 384, 295, 938, 587, -597, -210, 12, -454, -286, 28, -191, 813, -391, -890, -103, -125, -142, -893, -262, 319, 0, 206, -541, -607, 595, -491, -57, 91, 19, -220, -300, 99, 268, 696, -654, -100, -546, 559, 196, 464, 110, 271, -389, -249, -448, -680, 374, -574, 138, -48, -649, 214, 655, -635, 1076, -249, 559, 804, -411, 252, -425, -1014, -175, 242, -123, -187, 414, -706, -451, -438, -389, -679, -463, 203, -1196, 158, -192, 114, -197, -692, -138, -43, -1118, 378, -615, 386, 216, -724, -101, 664, 232, 660, 1, -232, 336, -620, 255, -566, -127, 2, 1262, 222, 177, 156, 379, 309, 503, -896, 439, -94, 888, 244, 510, -267, -602, 589, -210, 856, -499, 481, -288, 318, -80, -466, 345, -432, -679, -173, -1432, -796, -238, 209, 180, 963, 708, 31, -284, -761, 48, 211, 573, -474, -1030, -432, -293, 668, 217, 47, -168, 236]
7373B36p09J111q19R40p30l11M66j12K17j095N89r45J247K8j140J248k36p54N71
7392a98L00r99J565j063Q73L17p60l77R7M66r71J86M4Q28m67q4L61o19P5Q30K65
7413F69q31q39J361r40P62k07n65J216Pj127j9J71O07K04o86j54j31K44N33J42
7433D17n04J04r5Q2o73J4J48L54p36O71O65N98o53n68k32R05q94J343o41lm40
7454a38O30j77J0J69M9j71q93J07N93R39j849J222m55k76J82j48j39M16n82M43
7474f8L84K17j202O95J778k404R51J14p91kN85J4j0m38J58k86N69l58k62P28n98
7495b26J21k86K23k44Q02o67K35j038J045L95l35j59P10m38m2p13N34j42k64N18
7515B9l56J247j325N13M0O3k21n77Q5l5P52o9m29P6j076R65M37N02o25j77L00
$$ y = [236, -473, 638, -181, 759, 29, -282, 184, 72, 289, -806, -217, -1162, 85, 113, -1027, 221, -15, -769, -198, 102, -897, 668, -395, 478, 795, 35, -342, -245, 221, -750, -564, -520, 308, -159, -243, 118, -501, -426, 404, 669, -162, -1001, 360, -580, 182, -25, -590, 626, 633, -494, -513, -342, 265, 469, -217, -371, -502, -258, 275, 417, -87, 17, -78, 4, -669, -655, -507, -153, -889, -218, 447, 1045, 392, -176, -408, 497, -397, 946, 305, 302, -138, 492, 315, 325, 494, 543, 372, -521, -414, 179, 1118, -731, 491, 36, -240, -58, -206, -345, 71, -511, -68, 316, 533, -669, 26, 1804, -600, 351, 465, -326, -328, 257, 271, 261, -177, -19, -305, 264, -94, -356, 372, -226, -105, -391, -168, -412, 390, -277, -42, -1080, -35, 360, 25, -134, 576, 138, 96, -617, -83, -225, -489, 29, -327, 920, -405, 108, 148, 211, -10, -587, -502, -537, 215, 146, -283, -207, -1283, -318, 119, 621, -4, -181, 119]
7536A19j6p52R12O13j138O64q17O69p18J059p04k3j15p70O43Q19p22J24q9j038
7556a280J542l65L26r87J644j030m62k10l58J181K80l46M4J061q90k03p00P3Q54
7575A74j08K74m99l01O77R0N6l75J097j519N80o74N9J35L81l34Nn8R51j581P44
7596b26j9N84n83k77Q41r70R13q45J302k21r61M10J79m22J048j509R11Q11j114
7615a48m2J64P21l04n23J81P6r62J288J10l37m76N9M9N19r92N46N04m89Q38j347
7636e65k04J216L96m71pj85q6N3l79J33o66O01r2R5Q49o39M69j40o22Q67p83N8
7658a02l8Q2m00k5L85j72J45o38Q83k00N04p5m59j23m93M56j44K18m1P72j96k20
7680A19J9K01N71j287M56N10o26J30K80l75k32P07M34p04j90J555k383M34L84
$$ y = [119, 103, -649, 263, 876, -262, 402, -415, 254, -464, 595, -109, -132, -247, -1017, -374, 445, -277, -153, -242, -1280, 262, -103, 223, -764, 880, -150, -612, -822, -1180, 1, 281, -65, -21, 1040, 150, -53, -753, -680, 174, 66, 340, -159, -460, 217, 307, 363, -12, 1085, -434, 146, -528, -469, -334, 47, -287, -282, -340, 611, -970, -226, -245, 339, -244, -521, 320, -650, 263, -582, 720, 499, -462, -52, 127, -295, 753, -756, 155, 966, -148, -190, -26, 695, 391, -132, 49, 125, -837, 451, 561, 224, -252, -193, -144, 375, -617, -71, 433, -56, 782, -565, -769, 447, 843, 372, 365, 180, 94, 147, -232, -99, -765, -164, -256, -161, 688, 49, 518, 378, -244, 623, -160, -102, -140, -58, -458, -483, -98, -270, -125, -763, 120, -80, 424, 349, -110, -233, -726, -270, -414, -196, -237, 535, 339, 119, 138, 339, 910, -377, 79, 589, -37, 93, 373, -2, -234, 473, 907, 203, 13, 1568, -815, -381, 3]
7699Cl68l80R31M81o02K1l24j56Q46q27M96K08k88K08K55k56j56K17j53n4l21
7720b19K58j10K9j92P02j34j34q10l63J106r13J135k42M5J13j70J79L23r74L37
7740c4J21O97o89o22N51L36m73P75j063J2k51J222q77K34j6J027j005L7M51n9
7760C74r4n19q84J084L76j08r77J247o93j15Q66n60J81O0J61l88k00J51L94n25
7780a69J97J221j073k77n41Q18k68KQ85j121r1N33K40N91j767J449k24r12O00
7799I3J28K05j487R43l3N37K5l24k77q2K43j37P28p13N34K65r16K93m76N36L92
7820D77k70p1P2j08K27j86O93j087O13r34K15M31m33P75m42n16M38M2P01r14L25
7841D8L35l60Q25r39m4L18m8q10L55J27k82J48P23m27J51K7k66O51o71k34k08
$$ y = [3, -365, -745, 186, 667, 65, 86, -238, -394, 452, -375, 121, 329, 41, 249, 504, 248, 92, 309, 156, 102, -219, 39, -71, -42, -234, 468, 334, 200, -610, -973, 133, -780, 355, 113, 158, 271, 101, 280, 603, -371, -34, 87, 784, 95, -527, 24, 360, -113, 662, -401, -389, -640, 582, -295, -61, -77, 950, -55, -18, 433, 374, 280, -239, -1123, -39, 337, 229, -748, 499, -194, -309, 557, -3, 178, 238, 399, 11, -189, -38, 356, -169, 28, 1249, 176, -101, -642, 176, -92, -90, 795, -326, -417, 116, 356, 947, -820, 629, 405, -507, 93, 221, 426, -1061, -118, -151, 386, 411, 87, -190, -272, -29, -166, 562, -151, 383, 648, -268, 25, -451, 85, 477, 207, 136, 208, 100, 327, 141, 834, -253, 360, -574, -359, 72, -361, 414, -28, -544, -106, -64, 637, -277, 48, 383, 23, 848, -91, -135, 183, 135, -675, -320, -193, -475, -327, 396, -31, 120, 147, -119, 532, -139, -373, -581]
7862e81J031n3r66L47k78L19L70J17J46l64L61p11J84O8K78n40J46O37n22L82
7882C71r28O10M38l46r69R87j94L9k21j28L80m33P86l10l23O26p2m51M58K63J78
7903G61n62j92O60o74L79p44K53O47o90L01J17M45o99J19l87L68n56J188j030
7922b96Q25k11o87N05m20J65L5J250j104J19N3j32Q3j31K04j83J036k015J371
7941D67n10j24L21o93N11r16M02Q84j21o2m05n58J709j074N60j436P6N09R27q85
7961d18M60M15o60O65n65J87o37J257j17k39r33M03P64j278q5L88j70M61L07j70
7981C5o27L90M75K30j43l73N56m30j22Nk94Q78l1q29K73O5j45rM89j191R15R7
8003B14p1J56K32j279K48N44J2K55j32m63P15j195J209L63l80k04j024Q34q8M7
$$ y = [-581, 450, 397, -569, -222, -500, -181, 189, 306, 452, 88, 449, -262, -78, -10, 268, -272, -126, 511, -11, 371, -557, 53, 491, 145, -824, 163, -31, 8, -213, -341, 39, -394, 392, 82, -241, 385, 313, -138, 320, 583, 761, 199, 7, 667, -7, 372, -372, -119, 528, -162, 139, 256, 701, 2, 121, -266, 102, -454, 734, -296, 529, 318, -369, 136, -284, -119, -84, 1166, 62, 181, 234, 102, 185, 54, 258, 75, 1111, -904, 467, -43, -167, 154, -539, -28, -944, -542, 342, 221, 159, -246, -804, 905, -169, 391, -1045, -969, -460, 467, -418, 42, 457, -203, 462, -103, 84, -553, 704, 587, 348, -585, -182, 582, -696, -781, -393, -563, -102, 205, 35, -592, -202, 273, 503, 360, -13, 543, 113, -9, -4, -298, 580, 549, -280, -7, 58, -87, -96, 393, -798, 117, 214, 143, 299, 531, -748, -500, 44, 56, 311, 179, -284, 431, -764, 445, 808, 428, 224, -800, 34, -54, -7]
8023gK01K38j066N07L68K47K39j041R49p31o0M89M54j119J33j16J491m38j251
8042e13Q40l88m7M35o22O40n61N20j4n0l90K22J48n84O38r06K26K81k44J141n25
8063B47j16j67o0l38L09m90N61l41J231J16n25j90r48J247p73P4Q96j66l56J164
8083A375r09q57k18M03K97n15Q86j73K12m25N35j137J325j043j01P06n42n3r7
8102c31q2m12O00M3k64L83K81Q46k41n34j122J110n50j06r40K092j007j07L67
8121B6P10n86q73J408R2l37o93J149j236J423m97j270j11J055m28j48m85J609
8139H08j008L91p33N52p6K10l92Q7l06L94L41r3J75M2l2j00O66r22R26q27J54
8160B57p74P14k0l84o70K1J555K33j172R69j111K3O10J41R7q24J34j197J352K26
$$ y = [-7, 194, 432, -634, -127, 241, 488, 727, -314, 635, -96, -156, 333, 787, -332, -199, -315, 1176, 738, -513, 327, -61, -108, 327, -295, 345, -216, 304, 290, 240, -150, 72, 220, -364, 274, -632, -406, -125, -369, 772, 247, 131, -36, -96, -434, -125, -615, -54, -395, 836, 952, 427, 237, -711, 536, -237, -163, 733, 567, 211, 1375, 466, -391, -609, -206, 91, -424, 462, 289, 501, 76, 611, -526, 799, -244, -345, 361, -181, -234, -331, -413, -825, -225, -182, -446, -63, 218, 1064, 823, 289, -833, 277, -273, -379, -1319, 773, -234, -341, 26, 736, 150, -723, 685, 777, 440, -253, 896, -340, 1083, 586, -684, -795, 260, -168, -316, -801, 808, -200, 191, -542, 10, -66, 144, -248, -161, -467, -73, 268, 175, 350, 392, 360, 260, 926, 4, 930, 103, 257, -517, 197, 177, -207, -877, -856, 699, 932, -240, 729, -382, -359, 251, 392, 489, -335, -201, -1398, -46, 180]
8180A80o27r9J327j006O89o40P23r28kK336k754
$$ y = [180, -447, -546, 781, -225, 464, -176, 547, -381, -383, 1953, -801]
8191h01
$$ Imaginary data points
##PAGE= N=2
##DATA TABLE= (X++(I..I)), XYDATA
0@%%%%%%%%%%%%%mJ1j5J6j6J6k3L1l2L9m7M9n6P0q4R2j02J19j36J56j76J97k22
36a17K49k79L12l49L88m30M76n29N85o42P10p86Q65r52J048j153J271j405J554
55H16j722J914k136K393k700L073l532M117m890N964p557J0161j5123K7791j16865
70i8296k46801L31158L06706j66578l14805K5949K20767Q0807p4098r8868r5341
81a29400M3681K12409Q3687k59985k25873K14196L43914j14319l85746k2022L44615
92A05157J34638k38248j85072J00010J51549L0217n1906j04013q2153J02513K11598
103A74290k6917k94815q6339L07283J99641k41295k72151J29922K79217j3267
113A55569k14222p2022R5898R7647L1421n7558j29877m3360J73928J58323j53013
$$ y = [0, 0, 0, 0, 0, 0, 0, 0, 0, 0, 0, 0, 0, 0, -4, 7, -8, 8, -8, 8, -15, 16, -16, 23, -24, 25, -31, 39, -45, 47, -55, 64, -72, 84, -92, 105, -117, 132, -147, 165, -184, 204, -226, 250, -279, 306, -336, 374, -412, 453, -499, 549, -604, 667, -738, 816, -906, 1008, -1128, 1265, -1435, 1638, -1894, 2223, -2667, 3297, -4260, 5901, -9222, 18569, -98296, -345097, -13939, 292767, 126189, -188616, -162667, 58100, 138907, 64809, -34059, -129400, -85719, 126690, 210377, -49608, -275481, -61285, 282629, 168310, -217436, -239458, 105157, 239795, 1547, -183525, -83515, 68034, 98251, 46345, -57668, -139821, -37308, 174290, 147373, -147442, -233781, 73502, 273143, 31848, -240303, -110381, 168836, 155569, -58653, -130675, -34777, 62870, 94291, 36733, -93144, -136504, 37424, 195747, 42734]
124D2734k48074P0407K87687L8137k68185j27184J90703J69674q0052j53209j9472
135i6834Q4666Q0447J7896q1620j19124L1876J86541N1498j98971j38866J57187
146b5304K00375q2699k12848k428J67047O9678r2143r2762K338O7185O9357j536
158F6260j07288p5081R5934J41785m2298j76213k6555J69002Q8969j18154j23713
169a07352M8253J22504J7389p9758n9198J2398O4664N5798l7094j02100j7841
180h2337J11920P8952r2324j21263M3446J31748J2027j10075n7469O4448P3593
191E2666n232o1435m0765K2999O8434K4743o2351o7391L1756R4858J1149r3098
203b3667m9939O3855P7313k3463q1022j3807N4674M3703j9880n2624j7886L4000
$$ y = [42734, -205340, -134933, 152754, 190891, -77294, -204478, -13775, 155899, 75847, -77362, -96834, -12168, 68279, 86175, 4555, -114569, -82693, 103848, 155346, -43625, -182491, -25304, 175071, 92372, -120476, -122904, 44143, 113821, 21678, -71084, -68746, -1561, 67796, 66260, -41028, -116109, -20175, 121610, 79312, -96901, -123456, 45546, 134515, 16361, -107352, -59099, 63405, 80794, 1036, -58162, -45764, 18900, 74698, 37604, -64496, -82337, 29583, 108535, 16211, -105052, -61606, 70142, 82169, -27906, -85375, -20927, 52666, 47434, -14001, -54766, -31767, 36667, 61410, -941, -68332, -36576, 58282, 69431, -23667, -73606, -9751, 67562, 44099, -36923, -50730, 3944, 47647, 27767, -24857, -42743, -8743]
215h743M5709l334n8127l0160M8915N6109k3673o6102q300O1092L2755l6277m3720
228c3856P100L9768K1598k3671l2908m562L5815K7597k3368m0979K447L9174K0416
241C4571k9047l4796R894L5917R143k7373k4196J2048K8047L178k1234j6720P312
254a3256K5510N582j9700j8174J0777K5845P38k3191j0690J4295J7836k749j7451
267d628p047J0875J3763k480j4474p419J1969R649l623j2731n231J1546O868n774
281A263q831j548Q140Q015o610p280J666P585M199n252m424J946L408K963k092
296C148n733K909L211M77k496k569J823J628j730j318J22k919M836k220k497J339
312a989n10K310k02k271J822M90p27R31o35K40J012k87J008n91J163N39j188L8
$$ y = [-8743, 36966, 33632, -24495, -54655, -5740, 50369, 26696, -39406, -47706, 13386, 46141, 9864, -33856, -26756, 13012, 34610, 10939, -21969, -26531, 9284, 36881, 13513, -27466, -25019, 14155, 34571, 5524, -29272, -19378, 16539, 25682, -1691, -25887, -13839, 14208, 17386, -3848, -20568, -13256, 12254, 17836, -1864, -20038, -9261, 16584, 17322, -5869, -16559, -2264, 15572, 12823, -4628, -11675, -800, 12963, 10483, -3991, -11410, 559, 10208, 6585, -6146, -11377, 169, 7037, 1263, -7568, -9116, -976, 7039, 429, -6851, -5185, 2400, 6599, 1347, -3077, -1131, 2277, 5240, 3148, -2585, 324, 3535, 4012, 1516, -1053, 770, 2398, 668, -650, -528, -3447, 1389, -831, -3328, -1989, -2499, -189, -391, -2662, -840, -350, -1077, -146, -781, -541, 471, 184, 1192, 601, 1764, 2303, 1115, 1153]
330A153J551k262N7q59J470K70k496P8P69p51m11L97j778K172J180j394j530j093
348c477M489J393l153j359J907J529L050m197l161K672M149J486n315l605L681
363H9N115j476n241l791M095P290j977q054m641N886J0009m308j0786k19P439
378e70Q683n607j0077m39R588R211m802j5656J633J3779Q531j0203j6254L637
392h546J7083O911j3693j4770L989J9340M310j3993j6014M293K0103P796j8434
405a625j8105O669K5512P158k5980j8355J6552K7615k333k6828j3367K0829K0882
418A8624k182k4008j2998J6286K6528r28k9015k2371K5555L4741r375m1164j1748
431c2055L6170K7355k0379l5813n25L0666J9446j4892l0432o522K7809L1151j1845
$$ y = [1153, 2704, 442, 499, -360, 1110, 1380, -1116, -1038, -269, -1020, -1431, -1034, -2812, -640, 540, -854, -2384, -3477, 1012, 2405, -748, -2107, -200, 1329, 4379, 182, -2979, -307, 3842, 5328, 13, -3592, 89, 5204, 3728, -1513, -5304, -1209, 6081, 4104, -3950, -8591, -2705, 7304, 2996, -7790, -8009, -570, 8113, 2506, -7571, -8010, 1578, 10789, 5987, -9669, -8036, 5743, 14274, 4071, -12183, -8546, 8537, 15448, 1755, -13015, -9026, 10314, 14624, 631, -15383, -11090, 9013, 16809, -1625, -19730, -13061, 12451, 19609, -6371, -24726, -8174, 19441, 17108, -9720, -23087, -2258, 18624, 16442, -7566, -20564, -4278, 22250, 21322, -7693, -30064, -4509, 30232, 20857, -20307, -32055, 4115, 31470, 11091, -24722, -25247, 5419, 24865, 9973, -20459, -26981, 828, 31979, 20134]
444B0134m5767j1423M7741L4847l4299n0967J1714N4892J2373m0730l2016J6963
456a6538L4754J3903k5336l5327j233M3665L2052l6743n9036J4224O9497J6910
468E0792o3088m5339M3752N6664j0884n3405j8058L2176L4943K903l3148l6504
480c9196J3435O0989J9001o4972n4760N0768P8967k2018q3823j4262O9618L9592
492E3339l9274m7397O21L4091L0732j731m7474l8387M1336P1850j0379r3769k7104
505g3546R1561O0453o4530q0599K6610P9859R556n1992l3604J0374L6799L2266
517D3207j4562o3062k5810P1933O8631n6453j00250K1238J08579J8835r4179n1565
529g3458O1345O1521j6941m8431k2247J3108M2455L3144l5167p5220O725J01230
$$ y = [20134, -25633, -37056, 10685, 45532, 11233, -39734, -28020, 26872, 39245, -1485, -33501, -16538, 18216, 32119, 6783, -28544, -29777, 13888, 45940, 9197, -49839, -35615, 33882, 50792, -12296, -57635, -13883, 42781, 31897, -21508, -39566, -7390, 27553, 30456, -2692, -39196, -25761, 35228, 54229, -10743, -65503, -14735, 64232, 42214, -41609, -55871, 13747, 53339, 14065, -33332, -32711, 1380, 32112, 30381, -17093, -55480, -14144, 57706, 47327, -46442, -73546, 18015, 78468, 13938, -66661, -40051, 39808, 49364, -2628, -36232, -25858, 10941, 43207, 28645, -34417, -60227, 11706, 80337, 23884, -76366, -55128, 53451, 72286, -21893, -73458, -12113, 49408, 32467, -15964, -38211, -25103, 17352, 50496, 15329, -59891, -53166, 48064]
541D8064L5199j00982p5117P6601J00418l5201j00787o254P4313L4503l0148m2250
553b1641j5106J7606N2599K3874o7069p2439N4938J08086j8895j24374k4597J13039
565B6021O0303p7693p4399L0325O4403J1461k9013l2036j9443L0002O3075k460
577E0546r0833l9516R3718Q1211p3025j08046L4419J08506J0057q7585l9359M5917
589a3990M5378l24k4190l8241j4140N2791N8628m1872r6097J2067J14320K9220
601H3550j06269o3048P4183Q2289l2581p5399m538M3003K9156J004l1251m3837
613d3738R983P0642L0255p8335p0024O1184R6560k8070j02029j3013Q5587M0536
625E9538n0838m9159J0648L4991K5410l445m0848l4938L2165P1113q787q6393
$$ y = [48064, 83263, -17719, -92836, -16235, 84183, 48982, -51805, -58059, 16254, 50757, 20609, -21641, -36747, -19141, 33458, 57332, -9737, -82176, -27238, 80848, 61953, -62421, -87018, 26021, 86324, 8631, -65768, -35443, 28960, 40421, 11408, -20628, -40071, -10069, 53006, 50546, -40287, -79803, 13915, 95126, 22101, -85945, -51526, 56980, 67037, -20548, -59907, -13990, 31388, 31064, 6874, -31367, -45507, 7284, 65912, 24040, -72057, -59990, 54330, 83550, -22719, -85767, -11584, 70705, 38124, -37275, -41813, 1190, 30346, 31350, 99, -43738, -33755, 36887, 67142, -11193, -81217, -20033, 76527, 48457, -53572, -66585, 19002, 59538, 8700, -40459, -29811, 5180, 30590, 27145, -13703, -48641, -16476, 54637, 45850, -40543]
637d0543k5382Q2953N6559n9416p4103K6833O7908P494m6052k8393J1712K9430
649I000K2606j2120m8265j6877N3369M9805m0650p4055J4496Q1229J5318o8557
661a4701l8923M2826M6964p609l9999j7626J5441L0488J8623l0231m3717R827
673b8637O0084J6306n7764m3899M2747N8215j8207n6267j0272M1868K6861j7148
685A3887l0260q585J6420L0122K680l6220k4644K8364M3981r974n2259r722M5056
698H846K8477k7383l6834O203L3453J1419j6653k3530l950K4174K0448j0444l2968
711a8742p412L3846K3605k5278l4335P543L7055Q338k9427j9424J1737K4776M544
724A6826j7445j7529N987K1978J0385j8404k2535Q726K7947N844k5319j6836J4886
$$ y = [-40543, -65925, 17028, 73587, 14171, -59932, -33099, 34809, 42303, -3749, -32142, -20430, 9000, 31606, 19486, -28779, -45656, 7713, 57518, 16868, -57187, -42691, 38538, 53856, -14701, -53624, -10798, 36166, 28557, -11442, -29068, -13627, 16861, 35484, 5253, -38464, -28637, 31447, 47753, -10011, -53910, -11163, 47052, 28845, -27422, -37694, 4174, 31035, 13887, -16373, -24958, -8538, 21584, 24264, -11956, -36600, -8236, 35745, 25771, -26488, -36210, 8846, 37323, 9940, -26894, -20691, 12762, 24181, 7528, -16002, -19952, 4222, 24670, 14226, -18742, -26154, 7692, 31297, 6019, -28316, -20773, 16282, 24620, -4807, -24231, -12494, 12282, 16826, -619, -18148, -12161, 9817, 20202, 1798, -20737, -12011, 15936, 21780, -3539, -20375, -5489]
737e489K3235l948k0461q226J2330J5304j659j6876r261J0067J6572j54j8764
750g330q378J2588J5619n290j5992l656J4158J1030p249j2586k601J3359P151
763A0823n814r926k260J0179P293n871j0292n62Q977O323o984r608J453R265L323
778F319o873o168J926Q189J380n609m262J677N812K730m737n314L024N963R5l209
794I43l761K150L873R35m786j546K428J984M54l767j127J894K603j050l686j22
810b581J737K584j664k487m87K134J609j244j518Q50K365L79j175l72O75j8J500
827B287j375j330J50J406P7j222j067J129l60M55L04j456M81K88k96N94q10O10
845a35Q28M30r07j27q13J988q40P07j493q33K234L98j948l25J033J082R98p16
$$ y = [-5489, 17746, 13798, -6663, -14889, -2559, 12745, 11086, -5790, -15051, -4984, 11588, 11434, -7330, -15708, -3120, 12499, 7209, -8783, -12439, 1719, 12749, 5500, -7086, -9687, 3672, 10823, 5009, -4917, -7177, 3002, 10295, 4424, -5868, -6430, 2547, 8870, 1886, -7722, -6269, 2996, 6319, -554, -6722, -4796, 3393, 4773, -836, -5098, -3421, 2391, 5121, 384, -4930, -1906, 4057, 4152, 943, -2818, -668, 3205, 4140, -646, -2192, 236, 2220, 2674, -1093, -2220, -326, 2277, 1227, -2459, -2581, -844, 1740, 76, -2411, -2898, -764, 845, -399, -1917, -1067, 1298, 1677, 502, 130, 805, 787, 2287, 912, -418, -268, 1138, 1215, -7, -1074, 55, -305, 150, 454, -1002, -521, -233, -529, 65, -745, -135, 693, 1123, 216, 89, -724, 1264, 424, 1131, -362, -1195, 1039, 1437, -511, -836, 197, 1279, 2277, 1561]
863A561k872L75K144J446l725j593N47K564J814k406l451K67N093m29j967l407
879d039L214L362l69k804l213J524O668o41m716k754L084O410l57p358k754L526
895a217N456O11p853l212O233N747o60r205m058P430N949k115r818j049Q064Q286
911H589o079p433k496R046O696m045r829k689J1760Q346p616j3402Q78J4586O187
926A2499j1290j1802N337J0869M520q493j2086K601J2655O536r762j5675K686
939a1405K0729N332j7110j4048R442J9203J662j9393q826J1427J4820Q40j4679
952b006j1684Q018J7786L189j8741j6864J5167K4331l991k7219r826K3064J8569
965A9793j0968k2053l414J8113J3511o728j7755q979J5972K2428m773l0485q337
$$ y = [1561, -1311, -936, 1208, 2654, -1071, -2664, -2117, 447, 2261, -145, -3596, -3329, 1764, 1335, -632, -4039, -825, 2537, 2168, -636, -3849, -2325, 4343, 3702, -1014, -3768, -684, 5726, 5369, -1989, -4743, -1217, 4239, 4850, -3003, -6215, 18, 5765, 5105, -4100, -8158, -728, 5221, 3106, -6712, -7761, 303, 8589, 2510, -4923, -7419, 1627, 8323, 4278, -5551, -8240, 3520, 11866, 4250, -9152, -8274, 6312, 12499, 1209, -10593, -5256, 5613, 10133, 1640, -10446, -7845, 4810, 11346, 1584, -14091, -11405, 9324, 14656, -2454, -16502, -7060, 12143, 13805, -5588, -14414, -2987, 11833, 12673, -2006, -13690, -5672, 12114, 15303, -3438, -20302, -5135, 19196, 15205, -12014, -21840, 1224, 19793, 8825, -13228, -16642, 1471, 14982, 8254, -9501, -18480, -2508, 19920, 15147, -15338, -23675]
978b3675K7525K3423j7854l1827M808L0448J0363k2081j9349N804J9788J0839
990A8212r527k3946o830K7256K2401j7866l7836L669M2451J3070l8187k3841J9649
1003a1325L4199l787k6776j2177J1905J8859R605j6767k7854M933L7742J5460
1015C4017l7851l2649K5895M5009r308m4420j0968L4078K1876j5326k4427m026
1027a8100J3007K0909M193k6003k4526J8363M3588l389n1931j4078M5824L2489
1039D0346l2040l9466J1249L6400N871j8612j7739j516J5332K2823m743l7592
1051a9687j4945L8202L8202k8303n2097Q744N6482J0149m6833k4530K3698L0683
1063A9765k575k0321j3701j311K3889K5181j7963m6386L536N3584J9194n0648
$$ y = [-23675, 3850, 27273, 9419, -22408, -17600, 12848, 23211, 1130, -18219, -12415, 7373, 18212, 8685, -15261, -22091, 5165, 27566, 9700, -28136, -24467, 17984, 31054, -7133, -30974, -11325, 22874, 19087, -7689, -19866, -7961, 10898, 20503, 3736, -24118, -19185, 18557, 34017, -3834, -36483, -10588, 34421, 25113, -19307, -30275, 3803, 25679, 10353, -14074, -18100, -5093, 15816, 20009, -5994, -30520, -12157, 31431, 28042, -23889, -37967, 7857, 40346, 8306, -31160, -19911, 16489, 22360, 3748, -13991, -15507, -175, 22648, 17905, -19687, -34632, 3570, 41772, 13469, -38628, -29884, 26598, 36747, -10086, -34616, -10918, 19765, 17190, -3131, -16832, -18143, 5746, 30927, 12964, -33422, -29886, 23698, 42892, -7756]
1075g756l9222L7950M7718j6682m3486m810K9880J7465q023j5934j7188L853L2375
1088A6140J5693l5987l8898K8216N4190q322n9677j1868M9367K7339k9117l3541
1100b6465J0277K3032J0404o792j8625j6784J7144L7395k002m8410j9652M7056
1112F578L9008l6234m7155J4393M7416M867l3005j8628J3086J8763O891p615k4407
1125a6042q931K6493L3411k2446m7316P043N1045J4496m4565l0278L1259L4358
1137B8527j2402k5113q930J3148J5838P127j4329k4818J322L6027J5461l7574
1149e716l0119K5701M3496j1351m2446r753L5404J7752j5660k1591j640J4218
1161a705J5143J524j9991k0578J8380L4356q299l7545r525L5325K4398k4655l1583
$$ y = [-7756, -46978, -9028, 38690, 22008, -21478, -26288, 3592, 21057, 13034, -2900, -20088, -16235, 16140, 31833, -4154, -43052, -14836, 39354, 31032, -28645, -40513, 8854, 36193, 7076, -26465, -16188, 6844, 17248, 10456, -8169, -24953, -7809, 29586, 27584, -20826, -40478, 6578, 45586, 9352, -37803, -23410, 24006, 28873, -4132, -22760, -9674, 9089, 15980, 8365, -16042, -24973, 1520, 34931, 12485, -34831, -27788, 23257, 37753, -6812, -37090, -5831, 28527, 16125, -8988, -17918, -4770, 11068, 18195, 3866, -20952, -19630, 16397, 31858, -5716, -35835, -10134, 33362, 22011, -20435, -30188, 5216, 22968, 7308, -14283, -15923, -1705, 13438, 14962, -5029, -25607, -7227, 27129, 18830, -18715, -28240, 7085, 31483, 6828, -24755]
1174b4755R090K7995N163j6251j5403J597J4141J3761m503k4398p832K4915K2466
1187B5986j9328l0290O065L1876P361k5688j5657J3650J8038M80j3665j0876K708
1200i340J6609Q305j1908k1437N451K5840O338k3735j8951J7417K3397n779k1431
1213i224n403J3893J0762k133j4738n206P459J4613N76j6756q782J2418J7809
1226A5288m623k0487l996J7145J1500j0145j3615M87J2117O558m578j2794j251
1239h394Q890R458l523j3830l058J4326Q045q883j4079K929J2198M512q710q394
1253h513L266R493K837n831q341K375Q293M495o650r963M375J0000J710r131m824
1268f409L904P730J80p453m314M615O082l40n325m659M620O338k028n439l652
$$ y = [-24755, -15665, 12330, 17493, 1242, -14161, -12564, 1577, 15338, 10835, -13563, -21395, 3520, 25986, 6658, -23632, -17567, 14309, 21670, -4018, -19675, -6025, 12013, 12493, -1172, -12048, -9340, 7269, 15574, 3666, -17771, -12320, 13520, 19858, -3877, -22828, -5411, 17986, 12207, -9224, -14627, -734, 10028, 7895, -6843, -12049, -4590, 10023, 10599, -6157, -14939, -2521, 15288, 10665, -9822, -13818, 3327, 14827, 4682, -8933, -8446, 3671, 10229, 5651, -7143, -8394, 496, 9954, 6431, -7399, -10457, 3869, 11914, 3031, -11048, -8119, 4079, 8591, -119, -8513, -5247, 4246, 7083, 1252, -7089, -4714, 3579, 8074, 1424, -8539, -4164, 5836, 7546, -1585, -6409, -2505, 5225, 5405, -2048, -6362, -1747, 4335, 3995, -1330, -5989, -1369, 4969, 2941, -2498, -6150]
1283f150M188P613k355o396j228M722L844k397m086K4L717J743j358l864j135
1298c118L916K343j062l991p32L743J756k567k865L7L086K210l198j904K96J860
1314a90K536l370j761J593L033L20j804j160J440k87J764k034j570K036O14n20
1330F40j417k8Q67j86J306k003j119L43J792k44K13j523R19Q61j89q09K34M88
1348A45l99R49j124o83K153o04P53j866j221K613j20N69j183n30J634P43r19j353
1366d43m73L86J964j183j479j848L290J366o86k289n55K287J407o08k963M40J286
1383a01J989j597j463K4K219K413k677j990j217M101J309k678l026J259L458N76
$$ y = [-6150, -1962, 5651, 3296, -3100, -4328, 394, 4238, 1841, -2245, -2221, 1496, 3239, 1881, -1983, -3118, 798, 3141, 2079, -1912, -2644, 1099, 2855, 288, -2577, -2540, 546, 2756, -442, -2346, -2050, -190, 2346, -1024, -2785, -1192, 1841, 2161, 357, -803, 637, 350, 2114, 80, -1490, 546, 1160, 640, -777, -805, 62, -124, 1182, -821, -1940, -1597, 195, -49, 164, -1359, -440, 421, 232, -577, -343, 145, -254, 695, -429, -1112, 1041, 437, 1190, -676, -1897, 716, 596, 1165, -18, -548, 1086, 1829, 910, -443, -916, -530, 1434, 251, -1228, -3076, 214, 1580, 894, -1395, -1950, 337, 1744, 1136, -1827, -1387, -101, 1888, 291, -1172, -1148, 1071, 3484, 807, -1183, -2400, 1701, 3010, 332, -2694, -1435, 2023, 2599]
$$ [...]
8191a95
##END NTUPLES=NMR FID
##END=
