##TITLE=1H_Pr 1240
 CDCl3, 8 sc, 
 9.07.2021
##JCAMPDX= 6.0         $$ Bruker NMR JCAMP-DX V2.0
##DATA TYPE= NMR FID
##DATA CLASS= NTUPLES
##ORIGIN= UXNMR, Bruker Analytische Messtechnik GmbH
##OWNER= root
$$ XWIN-NMR		Version 3.5
$$ Fri Jul  9 12:30:47 2021 Russian Standard Time (UT+4h)  she@DPX200
##.OBSERVE FREQUENCY= 200.131506
##.OBSERVE NUCLEUS= ^1H
##.DELAY= (6, 6)
##.ACQUISITION MODE= SIMULTANEOUS
##.ACQUISITION SCHEME= undefined
##.AVERAGES= 8
##.DIGITISER RES= 18
##SPECTROMETER/DATA SYSTEM= spect
##.PULSE SEQUENCE= zg30
##.SOLVENT NAME= CDCl3
##.SHIFT REFERENCE= (INTERNAL, CDCl3, 0, 15.7039)
##AUDIT TRAIL= $$ (NUMBER, WHEN, WHO, WHERE, WHAT)
$$ ##TITLE= Audit trail, XWIN-NMR		Version 3.5
$$ ##JCAMPDX= 5.01
$$ ##ORIGIN= Bruker BioSpin GmbH
$$ ##OWNER= she
$$ F:/spectra/data/she/nmr/H-F/1/audita.txt
$$ ##AUDIT TRAIL=  $$ (NUMBER, WHEN, WHO, WHERE, WHAT)
(   1,<2021-07-09 12:28:16.68 +0400>,<she>,<DPX200>,
      <created by zg, POWCHK disabled, PULCHK disabled
       configuration hash MD5:
       00 E9 B6 7A A2 85 ED C7 34 08 36 98 17 FE 4E 26
       data hash MD5: 16K
       23 99 B2 51 DF E8 A9 5A DD 92 0B 22 40 4F 26 00>)
$$ ##END=
$$ 
$$ hash MD5
$$ B5 A2 90 30 17 B0 17 8A D3 B6 94 FD F9 C8 F3 52
##$RELAX= 
##$RELAX= 
##$RELAX= 
##$RELAX= 
##$RELAX= 
##$RELAX= 
$$ Bruker specific parameters
$$ --------------------------
##$DU= <F:/spectra>
##$EXPNO= 1
##$NAME= <H-F>
##$PROCNO= 1
##$TYPE= <nmr>
##$USER= <she>
##$AMP= (0..31)
100 100 100 100 100 100 100 100 100 100 100 100 100 100 100 100 100 100 
100 100 100 100 100 100 100 100 100 100 100 100 100 100 
##$AQSEQ= 0
##$AQ_mod= 1
##$AUNM= <au_zg>
##$AUTOPOS= <>
##$BF1= 200.13
##$BF2= 200.13
##$BF3= 200.13
##$BF4= 200.13
##$BF5= 200.13
##$BF6= 200.13
##$BF7= 200.13
##$BF8= 200.13
##$BYTORDA= 1
##$CFDGTYP= 0
##$CFRGTYP= 5
##$CHEMSTR= <none>
##$CNST= (0..31)
1 1 145 1 1 1 1 1 1 1 1 1 1 1 1 1 1 1 1 1 1 1 1 1 1 1 1 1 1 1 1 1 
##$CPDPRG= <>
##$CPDPRG1= <>
##$CPDPRG2= <>
##$CPDPRG3= <>
##$CPDPRG4= <mlev>
##$CPDPRG5= <mlev>
##$CPDPRG6= <mlev>
##$CPDPRG7= <mlev>
##$CPDPRG8= <mlev>
##$CPDPRGB= <>
##$CPDPRGT= <>
##$D= (0..31)
0 1.2 0 0 0 0 0 0 0 0.06 0 0.03 0 0 0 0 0.0002 0 0 0 0 0 0 0 0 0 0 0 0 
0 0 0 
##$DATE= 1625819296
##$DBL= (0..7)
120 120 120 120 120 120 120 120 
##$DBP= (0..7)
150 150 150 150 150 150 150 150 
##$DBP07= 0
##$DBPNAM0= <>
##$DBPNAM1= <>
##$DBPNAM2= <>
##$DBPNAM3= <>
##$DBPNAM4= <>
##$DBPNAM5= <>
##$DBPNAM6= <>
##$DBPNAM7= <>
##$DBPOAL= (0..7)
0.5 0.5 0.5 0.5 0.5 0.5 0.5 0.5 
##$DBPOFFS= (0..7)
0 0 0 0 0 0 0 0 
##$DE= 6
##$DECBNUC= <off>
##$DECIM= 32
##$DECNUC= <off>
##$DECSTAT= 4
##$DIGMOD= 1
##$DIGTYP= 9
##$DL= (0..7)
0 120 120 120 120 120 120 120 
##$DP= (0..7)
150 150 150 150 150 150 150 150 
##$DP07= 0
##$DPNAME0= <>
##$DPNAME1= <>
##$DPNAME2= <>
##$DPNAME3= <>
##$DPNAME4= <>
##$DPNAME5= <>
##$DPNAME6= <>
##$DPNAME7= <>
##$DPOAL= (0..7)
0.5 0.5 0.5 0.5 0.5 0.5 0.5 0.5 
##$DPOFFS= (0..7)
0 0 0 0 0 0 0 0 
##$DQDMODE= 0
##$DR= 18
##$DS= 0
##$DSLIST= <SSSSSSSSSSSSSSS>
$$ [...]
##$SUBNAM2= <"">
##$SUBNAM3= <"">
##$SUBNAM4= <"">
##$SUBNAM5= <"">
##$SUBNAM6= <"">
##$SUBNAM7= <"">
##$SUBNAM8= <"">
##$SUBNAM9= <"">
##$SW= 20.0188882624521
##$SWIBOX= (0..15)
0 0 2 0 0 0 0 0 0 0 0 0 0 0 0 0 
##$SW_h= 4006.41025641026
##$TD= 16384
##$TD0= 1
##$TE= 0
##$TE2= 300
##$TE3= 300
##$TEG= 300
##$TL= (0..7)
0 120 120 120 120 120 120 120 
##$TP= (0..7)
150 150 150 150 150 150 150 150 
##$TP07= 0
##$TPNAME0= <>
##$TPNAME1= <>
##$TPNAME2= <>
##$TPNAME3= <>
##$TPNAME4= <>
##$TPNAME5= <>
##$TPNAME6= <>
##$TPNAME7= <>
##$TPOAL= (0..7)
0.5 0.5 0.5 0.5 0.5 0.5 0.5 0.5 
##$TPOFFS= (0..7)
0 0 0 0 0 0 0 0 
##$TUNHIN= 0
##$TUNHOUT= 0
##$TUNXOUT= 0
##$USERA1= <user>
##$USERA2= <user>
##$USERA3= <user>
##$USERA4= <user>
##$USERA5= <user>
##$V9= 5
##$VALIST= <valist>
##$VCLIST= <CCCCCCCCCCCCCCC>
##$VD= 0
##$VDLIST= <DDDDDDDDDDDDDDD>
##$VPLIST= <PPPPPPPPPPPPPPP>
##$VTLIST= <TTTTTTTTTTTTTTT>
##$WBST= 1024
##$WBSW= 4
##$XGAIN= (0..3)
0 0 0 0 
##$XL= 0
##$YL= 0
##$YMAX_a= 337358
##$YMIN_a= -415561
##$ZGOPTNS= <>
##$ZL1= 120
##$ZL2= 120
##$ZL3= 120
##$ZL4= 120
##$ABSF1= 10
##$ABSF2= 0
##$ABSG= 5
##$ABSL= 3
##$ALPHA= 0
##$AQORDER= 0
##$ASSFAC= 0
##$ASSFACI= 0
##$ASSFACX= 0
##$ASSWID= 0
##$AUNMP= <proc_1d>
##$AZFE= 0.1
##$AZFW= 0.1
##$BCFW= 1
##$BC_mod= 2
##$BYTORDP= 1
##$COROFFS= 0
##$CY= 11.3945322036743
##$DATMOD= 1
##$DC= 2
##$DFILT= <>
##$DTYPP= 0
##$F1P= 17.5019972093344
##$F2P= -2.517084195857
##$FCOR= 0.5
##$FTSIZE= 0
##$FT_mod= 4
##$GAMMA= 1
##$GB= 0.15
##$INTBC= 1
##$INTSCL= 1
##$ISEN= 128
##$LB= 0.24
##$LEV0= 0
##$LPBIN= 0
##$MAXI= 10000
##$MC2= 0
##$MEAN= 0
##$ME_mod= 0
##$MI= 1.114404
##$NCOEF= 0
##$NC_proc= 0
##$NLEV= 6
##$NOISF1= 3.799351
##$NOISF2= 2.8
##$NSP= 1
##$NTH_PI= 0
##$NZP= 0
##$OFFSET= 15.70392
##$PC= 1
##$PHC0= -12274.54
##$PHC1= 9.601009
##$PH_mod= 1
##$PKNL= yes
##$PPARMOD= 0
##$PSCAL= 0
##$PSIGN= 0
##$REVERSE= no
##$SF= 200.130013532006
##$SI= 16384
##$SIGF1= 3
##$SIGF2= 2
##$SINO= 400
##$SIOLD= 16384
##$SREGLST= <1H.CDCl3>
##$SSB= 0
##$STSI= 0
##$STSR= 0
##$SW_p= 3612.71676300578
##$SYMM= 0
##$S_DEV= 0
##$TDeff= 0
##$TDoff= 0
##$TI= <>
##$TILT= no
##$TM1= 0
##$TM2= 0
##$TOPLEV= 0
##$USERP1= <user>
##$USERP2= <user>
##$USERP3= <user>
##$USERP4= <user>
##$USERP5= <user>
##$WDW= 1
##$XDIM= 8192
##$YMAX_p= 0
##$YMIN_p= 0
$$ End of Bruker specific parameters
$$ ---------------------------------
##NTUPLES= NMR FID
##VAR_NAME=  TIME,          FID/REAL,        FID/IMAG
##SYMBOL=    X,             R,               I
##VAR_TYPE=  INDEPENDENT,   DEPENDENT,       DEPENDENT
##VAR_FORM=  AFFN,          ASDF,            ASDF
##VAR_DIM=   8192,          8192,            8192
##UNITS=     SECONDS,       ARBITRARY UNITS, ARBITRARY UNITS
##FACTOR=    0.0002496,     1,               1
##FIRST=     0,             0,               0
##LAST=      2.0444736,     0,               0
##MIN=       0,             -415561,         0
##MAX=       2.0444736,     337358,          0
$$ Real data points
##PAGE= N=1
##DATA TABLE= (X++(R..R)), XYDATA
$$ [...]
$$ plain form
1857 1060 3609 -3422 91 4392 -2254 -322 3601 -2745 -16 4026 -2577 -699 3919 -2052 -1266
1872 -1266 3381 -1689 -894 3792 -2027 -2400 3760 -1074 -2555 3319 -1090 -2686 3435 -1160 -3046
1887 -3046 3580 -288 -3279 2388 -763 -3007 2832 -313 -3529 2463 227 -3705 1969 705 -3402
1902 -3402 2136 634 -4157 1763 1475 -3716 1550 1257 -3627 1519 1316 -3681 1560 2064 -3551 690
1918 690 1922 -3047 1023 2539 -3272 274 2800 -3040 98 2999 -2477 136 3063 -2700 -106
1933 -106 3299 -2120 -235 3345 -2081 -843 3240 -1475 -776 3084 -1511 -1386 3436 -940 -1297 3201
1949 3201 -1145 -1735 3254 -712 -1757 3156 -570 -2078 2845 -357 -2219 2794 135 -2485 2267
1964 2267 121 -2607 2304 732 -2713 1704 360 -2823 2096 808 -2947 1546 920 -2765 1447
$$ packed form
1857A060K549p031L513M301o646J932L923o346K729M042o603J878M618n971P86
1872a266M647n070P95M686n819l73O160m834j481N874m409j596O121m595j886
1887c046O626l868k991N667l151k244N839l145l216N992k236l932N674j264m107
1902c402N538j502m791N920k88n191N266k93m884N146k03m997N241N04n615M241
1918F90J232m969M070J516n811L546K526n840L138K901n476K613K927n763K594
1933a06L405n419J885L580n426J238M083m715O99L860m595J25M822m376l57M498
1949C201m346n90M989l966j045M913l726j508M923l202j862N013k659k620M752
1964B267k146k728M911j572l445M417j344l183M919j288l755M493o26l685M212
$$ plain form
1979 1447 1086 -2700 1206 1006 -2769 535 1262 -2498 401 1608 -2800 -64 1522 -2663 218 1906
1995 1906 -2668 -431 1376 -2339 -11 1494 -2637 -621 1976 -2000 -1003 1652 -1726 -739 1951
2010 1951 -1893 -1276 2375 -1020 -1111 2048 -1403 -1154 2357 -819 -1163 2148 -897 -1404 2077 -231
2026 -231 -1118 1925 -387 -1278 2224 306 -1705 1936 841 -1040 1895 287 -1634 2417 1189 -1459
2042 -1459 1436 839 -1074 1909 989 -1524 1498 1543 -1102 1035 1482 -961 1107 1377 -1464 862
2058 862 1723 -1128 647 1753 -1075 308 1170 -1202 681 1638 -1318 -600 1188 -369 -56 803 -1287
2075 -1287 -442 1522 -957 -1012 1145 -591 -473 743 -1407 -821 1256 -675 -1226 459 -758 -994 414
2092 414 -799 -850 815 -553 -1643 417 -206 -1023 189 -733 -1159 1040 -459 -1510 495 -38 -781
$$ packed form
1979A447l61l786L906k00l775L304P27l760K899J207m408K736J586m185K881J688
1995A906m574K237J807l715K328J505m131K016K597l976R97K655l378R87K690
2010A951l844O17L651l395r1L159l451K49L511l176l44L311l045n07L481k308
2026b31q87L043k312q91L502j918k011L641j095j881K935j608j921M051j228k648
2042a459K895n97j913K983r20k513L022M5k645K137M47k443K068K70k841K326
2058H62Q61k851J775J106k828J383Q62k372J883R57k956P18J788j557L13Q59k090
2075a287Q45J964k479n5K157j736J18J216k150N86K077j931n51J685j217k36J408
2092D14j213n1J665j368j090K060o23q17J212r22m26K199j499j051K005n33p43
$$ plain form
2109 -781 112 -426 -799 822 235 -1431 -81 551 -535 257 134 -862 511 720 -1076 76 821 -311
2127 -311 27 69 -471 572 613 -672 -61 610 -18 -211 77 -174 465 544 -413 -327 792 236 -80 -5 -378
2148 -378 227 576 -565 -348 715 427 -259 -200 -91 215 509 -57 -541 295 627 -203 -370 63 470 377
2168 377 -203 -530 371 476 140 -181 -55 431 325 -213 -66 133 701 139 -501 58 523 337 55 -117
2188 -117 -17 646 334 -232 11 713 359 -115 -45 197 449 692 -378 -367 915 337 -75 179 51 294
2208 294 581 -303 -394 530 421 -436 -57 68 61 531 -226 -774 506 498 -747 -38 56 -395 489 -193 -1242
2229 -1242 268 365 -856 -353 -100 -350 -4 -149 -1225 11 590 -898 -601 198 -521 -5 67 -1251
2247 -1251 86 652 -1036 -440 226 -426 32 261 -1089 -210 1108 -586 -797 575 -337 -271 754 -821
$$ packed form
2109g81Q93n38l73J621n87j666J350O32j086P92j23r96J373K09j796J152P45j132
2127c11L38M2n40J043M1j285O11O71o28j93K88k51O39P9r57Q6J119n56l16P5l73
2148c78O05L49j141K17J063k88o86N9J09L06K94n66m84Q36L32q30j67M33M07r3
2168C77n80l27R01J05l36l21J26M86j06n38J47J99N68n62o40N59M65j86k82j72
2188a17J00O63l12n66K43P02l54m74P0K42K52K43j070J1J282n78m12K54j28K43
2208B94K87q84r1R24j09q57L79J25pM70p57n48J280qj245P09R4m51Q84o82j049
2229a242J510R7j221N03K53k50L46j45j076J236N79j488K97P99p19N16P2j318
2247a251J337N66j688N96O66o52M58K29j350Q79J318j694k11J372r12O6J025j575
$$ plain form
2265 -821 -507 1375 -342 -880 952 -118 -241 922 -698 -377 1249 34 -666 763 407 -477 906
2282 906 -134 -699 1450 508 -1115 893 568 -528 1102 187 -934 1233 725 -1329 681 804 -627
2299 -627 653 486 -1016 728 1067 -1141 252 1240 -744 337 765 -1126 776 1203 -1328 -75
2315 -75 1082 -986 23 654 -1153 39 1195 -1212 -561 1134 -692 -697 883 -1057 -470 1315 -1133
2332 -1133 -1076 1211 -676 -1001 865 -887 -809 1358 -772 -1258 1089 -225 -1236 756 -282 -1126 1152
2349 1152 -258 -1508 1159 291 -1467 970 8 -1275 1377 165 -1651 1072 623 -1161 737 468
2365 468 -1099 1003 417 -1579 817 1060 -1182 548 813 -1299 888 1232 -1517 583 1523 -1184
2381 -1184 301 1198 -1044 461 1500 -1185 30 1738 -1016 7 1370 -777 15 1718 -1073
$$ packed form
2265h21L14J882j717n38J832j070j23J163j620L21J626j215p00J429l56q84J383
2282I06j040n65K149r42j623K008l25j096J630r15j121K167n08k054K010J23j431
2299f27J280j67j502J744L39k208J393R88j984J081M28j891J902M27k531J253
2315g5J157k068J009O31j807J192J156k407O51J695j826nJ580j940N87J785k448
2332a133N7K287j887l25J866j752P8K167k130m86K347j314j011J992j038q44K278
2349A152j410j250K667q68j758K437r62j283K652j212j816K723m49j784J898k69
2365D68j567K102n86j996K396K43k242J730K65k112K187L44k749K100R40k707
2381a184J485Q97k242J505J039k685J215J708k754J023J363k147P92J703k791
$$ plain form
2396 -1073 -402 1817 -869 -664 1480 -620 -529 1588 -868 -794 1552 -647 -1065 1304 -435 -956 1374
2413 1374 -446 -1406 1473 -43 -1478 1137 -210 -1264 1163 -199 -1449 985 -76 -1596 788
2428 788 135 -1424 734 203 -1641 727 596 -1738 574 607 -1583 519 510 -1729 548 850 -1805
2445 -1805 391 703 -1544 400 954 -1561 149 1051 -1378 -186 1288 -1162 26 1377 -1234 -161
2461 -161 1598 -1033 -255 1611 -902 -273 1519 -916 -329 1452 -728 -519 1514 -504 -733 1575
2477 1575 -412 -763 1456 -214 -969 1634 -143 -1122 1403 -191 -1169 1382 -132 -994 1446 124
2493 124 -1205 1077 181 -1274 1058 457 -1260 854 499 -1437 870 397 -1455 758 704 -1307 677
2510 677 645 -1366 438 769 -1238 378 741 -1112 277 853 -1099 259 1136 -1178 -91 1174 -1040
$$ packed form
2396a073O71K219k686K05K144k100R1K117k456P4K346k199m18K369j739n21K330
2413A374j820r60K879j516j435K615j347j054K427j362j250K434j061j520K384
2428G88o53j559K158n31j844K368j31k334K312L3k190K102rk239K277L02k655
2445a805K196L12k247J944N54k515J710R02k429J192J474k450J188J351k611J073
2461a61J759k631P78J866k513O29J792k435N87J781k180K09K033k018k29K308
2477A575j987l51K219j670p55K603j777r79K525j594r78K551j514q62K440j322
2493A24j329K282q96j455K332o01j717K114l55j936K307m73j852K213n4k011J984
2510F77l2k011J804L31k007J616L63j853J389N76j952J358Q77k314J087J265k214
$$ plain form
2527 -1040 -48 1053 -1072 -112 1121 -1033 -228 1282 -880 -209 1115 -730 -527 1195 -597 -680 1028
2544 1028 -527 -658 1250 -571 -722 1211 -364 -859 1120 -346 -849 935 -365 -857 915 -157
2560 -157 -1008 782 125 -891 858 81 -1169 955 297 -1287 742 324 -1288 742 340 -1239 738
2577 738 492 -1195 517 555 -830 448 670 -985 440 795 -1068 128 814 -839 170 843 -1032
2594 -1032 192 954 -1059 -7 825 -688 -143 780 -749 -229 956 -749 -537 1011 -289 -465 713
2611 713 -598 -334 1040 -564 -661 958 -377 -442 785 -369 -438 1003 -187 -778 754 53 -720 740
2629 740 4 -583 697 235 -913 578 250 -666 476 -58 -659 646 126 -765 493 440 -425 341
2647 341 232 -521 399 451 -848 251 649 -468 76 348 -548 302 584 -678 90 542 -424 -61 367
$$ packed form
2527a040R92J101k125R60J233k154Q05J510k162O71J324j845K03J722j792q3J708
2544A028j555j31J908j821j51J933j575m95J979j466n03J784j300m92J772j072
2560a57q51J790o57j016J749p77j250K124o58j584K029m18j612K030m02j579J977
2577G38k46j687J712L8j385J278K22j655J425L55j863J196O86j653J009O73j875
2594a032J224P62k013J052Q32j513N45R23j529N20J185j705K12J548j300j76J178
2611G13j311K64J374j604r7J619j335o5J227j154o9J441j190n91J532p01p73J460
2629G40p36n87J280m62j148J491l28r16J142n34o01J305n20q91J258n3q65P66
2647C41j09p53R20N2j299J099L98j117N44K72q96Q50K82j262P68M52r66L63M28
$$ plain form
2666 367 -378 102 591 -395 -54 791 -303 -155 367 -391 -92 638 -455 -318 662 -272 -502 370 -335
2685 -335 -142 417 -427 -394 448 -42 -481 167 -46 -308 342 -142 -670 295 1 -557 117 -198 -376 371
2705 371 -86 -539 266 109 -432 24 64 -207 124 102 -453 80 505 -291 73 261 -227 207 107 -329 223
2726 223 450 -50 -49 200 7 263 163 -181 116 420 -8 -89 185 167 47 233 -285 -2 588 -60 -184
2747 -184 234 134 52 118 -274 101 140 109 -207 42 241 -88 -98 -44 -28 188 -24 -400 17 100 6 -101 -238
2770 -238 -77 101 -33 -242 -186 -25 70 -292 -318 -130 -139 -31 -220 -398 28 -66 -307 -217 -177 -107 -127 -168 -351 -173
2794 -173 218 -167 -358 166 -72 -142 -41 -198 48 203 -55 -128 127 27 71 224 -68 -15 485 314 -85
2815 -85 187 340 -67 261 165 -19 422 383 -257 327 328 12 344 192 -24 436 399 -116 115 516 -56 -31
$$ packed form
2666C67p45M80M89r86L41Q45j094J48N22p58K99P30j093J37R80r34k30Q72p05
2685c35J93N59q44L3Q42m90m39O48k13k62O50m84n28R65k94n58O74l15j78P47
2705C71m57m53Q05j57n41M56M0k71L31k2n55N33M25p96L64J88m88M34j00m36N52
2726B23K27n00JK49j93K56j00l44K97L04m28q1K74j8j20J86n18K83N90o48j24
2747a84M18j00q2O6l92L75L9l1l16K49J99l29j0N4J6K16k12l76M17Q3r4j07j37
2770b38J61J78j34k09N6J61R5l62k6J88rJ08j89j78M26r4k41R0M0P0k0m1j83J78
2794a73L91l85j91N24k38p0J01j57K46J55k58p3K55j00M4J53k92N3N00j71l99
2815h5K72J53m07L28r6j84M41l9o40N84Jl16L32j52k16M60l7n15K31M01n72K5
$$ plain form
2837 -31 263 -125 197 492 -216 -81 399 -223 40 231 -286 83 335 -260 -230 412 -237 -127 140 -242 -232
2858 -232 282 -311 -340 400 -138 -476 280 -281 -248 467 -325 -509 314 -50 -518 108 -171 -291 148 -239 -492
2879 -492 175 40 -629 97 -125 -577 371 61 -748 391 108 -587 125 36 -550 269 195 -449 209 400
2899 400 -435 136 344 -527 101 486 -510 189 615 -516 68 638 -489 263 574 -474 206 787 -355
2918 -355 132 724 -229 53 781 -303 -103 840 -157 -263 770 -176 -62 781 -296 -221 747 -188 -211 601
2938 601 -71 -351 585 -136 -411 671 -57 -586 484 -48 -607 640 37 -772 522 -18 -820 492
2956 492 123 -604 252 109 -711 388 155 -754 206 219 -761 67 352 -828 179 398 -853 2 434
2975 434 -937 58 429 -831 12 537 -672 -150 458 -601 -154 584 -510 -300 678 -578 -358 634
$$ packed form
2837c1K94l88L22K95p08J35M80o22K63J91n17L69K52n95L0O42o49J10K67l82J0
2858b32N14n93k9P40n38l38P56n61L3P15p92j84Q23l64m68O26k79j20M39l87k53
2879d92O67j35o69P26k22m52R48l10q09J139k83o95P12q9n86Q19p4o44O58J91
2899D00q35N71K08q71O28L85r96O99M26j131N84N70j127P52L11j048O80N81j142
2918c55M87N92r53K82P28j084K00R43r97j06J033r46J14Q43j077P5R68r35k3Q12
2938F01o72k80R36p21k75J082p28n29J070n32n59J247o03q09J294n40q02J312
2956D92l69p27Q56j43q20J099k33r09R60J3r80Q28K85j180J007K19j251Q55M32
2975D34j371R95L71j260Q43N25j209N22O08j059M47P38j094K10R78j256K20R92
$$ plain form
2993 634 -406 -254 799 -546 -347 820 -361 -390 742 -269 -343 824 -175 -378 754 -125 -404 857
3011 857 237 -447 670 63 -504 685 36 -515 774 180 -546 596 127 -552 635 261 -680 469
3029 469 400 -618 488 347 -595 474 484 -742 404 430 -859 315 506 -752 131 372 -628 203
3047 203 494 -690 31 517 -662 -190 572 -559 -161 589 -712 -309 585 -575 -222 530 -607 -446
3065 -446 716 -678 -245 664 -429 -401 732 -326 -488 639 -331 -500 624 -325 -567 779 -104 -697
3083 -697 539 -56 -494 752 68 -561 563 117 -605 560 142 -521 641 345 -655 478 454 -470
3101 -470 492 354 -740 365 412 -564 531 562 -422 427 423 -580 418 531 -548 272 620 -552 118
3120 118 600 -494 177 655 -458 -2 722 -282 -11 588 -483 53 595 -466 -301 684 -420 -295
$$ packed form
2993F34j040J52J053j345J99J167j181k9J132j011p4J167r99k03J132q79k79J261
3011H57o20o84J117o07n67J189o49n51J289n94p26J142m69o79J187l74r41J149
3029D69o9j018J106j41r42J069J0j226J146K6j289J174J91j258Q83K41j000Q31
3047B03K91j184P21M86j179M72P62j131L98P50j301M03Q94j160L53P52j137J61
3065d46J162j394M33R09j093K8J133j058j62J127r70j69J124r49k42J346q83n93
3083f97J236n95m38J246o84o29J124m46p22J165m18o63J162k96j000J133k4r24
3101d70R62j38j094J105M7r76J095L1r84Q49mj003R98J13j079Q20L48j172O70
3120A18M82j094O71M78j113M56P24j004K71N99j071N36N42j061J65R85j104J25
$$ plain form
3138 -295 520 -390 -473 534 -344 -488 558 -217 -599 430 -160 -568 493 -317 -632 553 -158 -650 232
3157 232 -127 -679 422 -48 -863 253 -7 -672 213 47 -550 369 215 -834 207 88 -684 194 173
3176 173 -520 300 368 -665 168 341 -504 136 367 -421 132 536 -525 92 524 -414 157 548 -250 184
3196 184 553 -460 216 685 -280 -53 435 -110 10 671 -263 -171 654 -134 -164 606 -124 44 684 -346
3216 -346 -326 607 -55 -252 463 -11 -330 391 -81 -484 353 174 -431 347 139 -411 340 -71 -495 289
3236 289 129 -366 96 -53 -504 327 -14 -503 82 57 -444 -34 74 -390 22 131 -430 -34 227 -444
3256 -444 -77 274 -402 57 46 -473 19 297 -344 -92 139 -291 -59 129 -285 -34 436 -219 -269 274 -24
3277 -24 -51 549 -203 -155 395 -88 -150 286 94 -55 365 -42 -321 437 138 -228 184 65 -71 243 -24
$$ packed form
3138b95Q15r10q3J007q78j44J046p75l82J029n90m08J061q10l15J185p11m92Q82
3157B32l59n52J101m70q15J116k60o65Q85j66n97R19j54j049J041j19p72Q78k1
3176A73o93Q20O8j033Q33J73q45O40K31p88N53M04j061O17M32r38N71L91p98M34
3196A84L69j013O76M69r65K27M88n45J20O61r34R2Q25p88l0P70p30J68O40j030
3216c46K0R33o62j97P15m74l19P21m72m03Q37j79o05P78k08n50P51m11m24P84
3236B89j60m95M62j49m51Q31l41m89N85k5n01M10J08m64M12J09n61L96K61o71
3256d44L67L51o76M59j1n19M92K78o41K52K31m30K32J88m14K51M70o55n0N43k98
3277b4k7O00p52M8N50m83o2M36j92j49M20m07k79P58k99l66M12j19j36L14k67
$$ plain form
3298 -24 -189 241 97 -233 235 89 -252 137 21 -129 98 178 -49 50 197 -157 -39 20 -181 171 149 -297
3320 -297 -10 210 -224 -55 51 -260 -4 137 -318 -133 176 -63 -126 -38 -201 -216 -25 -161 -90 31 -110
3341 -110 -49 -46 -167 -121 73 -56 -274 -41 -93 85 -104 80 -59 13 -144 -60 94 61 -110 44 -9 -59 152
3364 152 83 -112 30 46 11 53 -14 -38 -34 -40 41 -136 211 62 -60 7 85 36 -3 30 71 158 -60 -95 90 45 51
3391 51 63 61 -55 -18 64 50 42 270 92 -32 104 66 159 197 -95 -44 46 140 -18 -88 -59 -37 183 177 -184 313 168
3418 168 -233 239 6 -100 179 40 -203 176 96 -150 -18 -20 -159 75 -38 -109 -139 207 22 -77 15 -188
3440 -188 -115 105 -357 -2 17 -291 -66 129 -242 -20 122 -324 -44 182 -145 -179 173 -97 -40 216 -58
3461 -58 -12 231 22 -140 258 -113 -289 321 -55 -90 243 37 -264 48 133 -286 222 -17 -247 294 86
$$ packed form
3298b4j65M30j44l30M68j46l41L89j16j50K27Q0k27R9J47l54J18N9k01L52k2m46
3320b97K87K20m34J69J06l11K56J41m55J85L09k39o3Q8j63j5J91j36P1J21j41
3341a10O1Lj21M6J94j29k18K33n2J78j89J84j39P2j57Q4J54l3j71J54n3n0K11
3364A52o9j95J42J6l5M2o7k4MoQ1j77L47j49j22O7P8m9l9L3M1Q7k18l5J85m5O
3391E1J2kj16L7Q2j4qK28j78j24J36l8R3L8k92N1R0R4j58p0K9K2K20ol61M97j45
3418A68m01M72k33j06K79j39k43L79q0k46J32kj39K34j13p1l0L46j85r9R2k03
3440a88P3K20m62L55J9l08K25J95l71K22J42m46K80K26l27l4L52k70N7K56k74
3461e8M6K43k09j62L98l71j76O10l76l5L33k06l01L12Q5m19N08k39k30N41k08
$$ plain form
3482 86 -340 193 117 -244 249 129 -204 260 65 -347 69 191 -78 136 -20 -217 62 272 -242 223 264
3503 264 -288 -1 248 -313 110 359 -177 71 282 -244 59 408 -276 149 378 -180 -165 333 -232 -160 328
3524 328 -215 -209 318 -270 -249 359 -65 -183 256 -205 -281 235 -219 -258 386 -11 -262 266 2 -349 290 -66
3546 -66 -334 231 46 -317 402 118 -280 246 71 -267 304 210 -341 217 215 -159 152 364 -395 28 330
3567 330 -428 9 250 -411 59 283 -453 71 311 -152 58 346 -485 49 297 -289 14 172 -224 -186
3587 -186 460 -344 -161 397 -185 -194 376 -219 -212 406 -317 -200 442 -160 -83 300 -216 -208 525 -244 -347 284
3609 284 -38 -222 382 37 -303 491 -64 -338 474 107 -310 403 119 -436 373 -37 -542 165 157 -352 241
3630 241 164 -419 299 250 -493 167 327 -496 220 250 -156 255 253 -431 -35 225 -310 167 363 -258 -39 497
$$ packed form
3482H6m26N33p6l61M93j20l33M64j95m12M16J22k69K14j56j97K79K10n14M65M1
3503B64n52K87K49n61M23K49n36K48K11n26L03L49o84M25K29n58J5M98n65P2M88
3524C28n43ON27n88K1O08m24j18M39m61p6N16m54l9O44l97k51N28k64l51O39l56
3546f6k68N65j85l63P19k84l98N26j75l38N71r4n51N58kl74L11K12p59M23L02
3567C30p58M37K41o61M70K24p36N24K40m63K10K88q31N34K48n86L03J58l96L8
3587a86O46q04J83N58n82rN70n95PO18p23J17O42o02P7L83n16QP33p69j03O31
3609B84l22j84O04l45l40P94n55k74Q12l67m17P13k84n55Q09m10n05P07qn09N93
3630B41p7n83P18m9p43O60J60q23P16L0m06M11ko84L96K60n35M77J96o21K19N36
$$ plain form
3652 497 -197 -18 466 -347 -217 441 -435 -129 518 -331 -158 526 -240 -166 365 -224 -120 565 -194 -362
3672 -362 335 -192 -339 240 -90 -365 268 -179 -389 467 -125 -415 268 -67 -463 305 -21 -382 248 82
3692 82 -377 169 128 -375 248 189 -495 247 359 -403 159 108 -369 302 205 -411 295 256 -385 -48 316 -228
3714 -228 45 395 -274 165 469 -293 62 410 -167 39 359 -280 129 472 -124 -49 450 -142 -105 429 -276
3735 -276 -213 304 -161 -195 401 -17 -155 334 -149 -319 483 -99 -86 404 14 -207 233 -47 -186 297 144
3756 144 -388 331 90 -256 342 92 -273 156 -48 -393 93 157 -335 81 118 -454 165 113 -516 134 94
3777 94 -307 165 143 -278 36 214 -395 -90 354 -255 -47 174 -370 69 235 -426 -141 285 -132 38 158
3798 158 -105 73 323 -142 49 275 -63 -114 194 -307 -89 340 -170 -261 253 -30 -182 287 -198 -302 234
$$ packed form
3652D97o94J79M84q13J30O58q76L06O47q49J73O84p66P4N31n89J04O85p59j68
3672c62O97n27j47N79l30k75O33m47k10Q56n92k90O83l35l96P68l26l61O30j66
3692H2m59N46m1n03O23n9o84P42J12p62N62n1m77O71r7o16P06l9o41L37L64n44
3714b28K73L50o69M39L04p62L55L48n77K06L20o39M09L43n96P5M99n92L7N34p05
3735b76O3N17m65l4N96m18j38M89m83j70Q02n82J3M90l90k21M40k80j39M83j53
3756A44n32P19k41l46N98k50l65M29k04l45M86O4m92M16L7n72O19n2o29O50m0
3777I4m01M72k2m21L14J78o09L05M44o09K08K21n44M39J66o61K85M26m17J70J20
3798A58k63J78K50m65J91K26l38n1L08n01K18M29n10r1N14k83j52M69m85j04N36
$$ plain form
3819 234 -49 -254 263 185 -153 172 81 -169 326 165 -326 284 120 -102 347 -85 -219 384 134 -105 269
3840 269 182 -190 264 70 -160 99 137 -191 12 204 -74 -47 75 -124 88 322 -175 13 175 -298 37
3861 37 37 -191 68 69 -13 -107 243 -74 -57 186 -107 146 206 -215 -360 228 -91 -182 123 -91 -108 334 -154 -194
3885 -194 131 15 -214 56 49 -3 102 -112 -154 101 26 -231 209 -4 -78 172 -171 -175 125 35 -144 175 -9
3908 -9 -62 78 20 -198 -55 125 -281 12 -10 -178 -34 44 -143 -54 50 -203 -78 -77 -28 -43 72 -168 -100 -53
3932 -53 -28 -127 235 -45 -44 65 -149 75 56 -54 112 174 -112 74 -32 -79 -82 5 -74 50 -199 33 -7 -116
3956 -116 -5 -57 96 -18 -187 -7 2 55 123 103 -87 18 76 -11 -118 130 115 35 23 215 44 87 60 43 283
3981 283 123 29 -23 39 159 2 -134 16 69 91 -109 2 28 131 -141 155 -6 15 52 -9 77 158 25 -65
$$ packed form
3819B34k83k05N17p8l38L25r1k50M95j61m91O10j64k22M49m32j34O03k50k39L74
3840B69q7l72M54j94k30K59L8l28K03J92k78K7J22j99K12K34m97J88J62m73L35
3861C7%k28K59Jq2r4L50l17J7K43k93K53O0m21j45N88l19r1L05k14j7M42m88m0
3885a94L25j16k29K70pn2J05k14m2K55p5k57M40k13p4K50l43mL00r0j79L19j84
3908in3J40n8k18J43J80m06K93k2j68J44P8j87Q9J04k53J25JM9j5J15k40O8M7
3932e3K5r9L62k80JJ09k14K24j9j10J66O2k86J86j06m7lQ7p9J24k49K32m0j09
3956a16J11n2J53j14j69J80RN3O8k0j90J05N8q7j07K48j5q0j2J92j71M3k7j7K40
3981B83j60r4n2O2J20j57j36J50N3K2k00J11K6J03k72K96j61K1L7o1Q6Q1j33r0
$$ plain form
4005 -65 22 85 -91 -76 142 -5 43 -14 -160 69 12 -149 71 35 -102 3 6 -217 135 -135 -231 16 3 -65
4029 -65 -44 -21 -299 -30 5 1 18 54 -83 -122 128 -42 56 22 -166 -86 77 -154 29 11 -114 -35 64 -48 -46 -30
4055 -30 -149 -18 103 -85 -86 196 -176 -12 62 -151 -34 68 -61 -90 157 -7 53 25 89 -129 205 113 -161
4078 -161 230 -10 -75 268 -36 -69 239 73 -58 153 189 -54 75 125 -145 165 61 -112 159 31 -289
4099 -289 10 177 -181 71 118 -144 -18 104 -212 201 100 -118 53 156 -135 -15 209 -61 -24 99 27
4120 27 -105 120 -162 -38 145 -42 -300 170 -265 -340 97 -229 -211 167 -213 -212 130 -99 -278 76 -155 -365
4142 -365 120 -38 -333 197 54 -257 -47 -36 -377 200 -53 -182 133 -38 -153 166 127 -233 178 55 -444
4163 -444 43 322 -293 142 110 -5 233 243 -161 63 173 -135 161 239 -139 141 285 -179 7 261 -86
$$ packed form
4005f5Q7O3j76J5K18j47M8n7j46K29n7j61K20l6j37J05Lk23L52k70r6K47j3o8
4029f5K1K3k78K69L5mJ7L6j37l9K50j70R8l4j88Q0J63k31J83j8j25P9R9j12KJ6
4055c0j19J31J21j88jK82l72J64P4k13J17J02j29k9K47j64O0k8O4k18L34r2k74
4078a61L91k40o5L43l04l3L08j66j31K11L6k43J29N0k70L10j04j73K71j28l20
4099b89K99J67l58K52M7k62J26J22l16M13j01k18J71J03k91J20K24k70L7J23p2
4120B7j32K25k82J24J83j87k58M70m35p5M37l26J8L78l80JL42k29j79L54k31k10
4142c65M85j58k95N30j43l11K10J1l41N77k53j29L15j71j15L19l9l60M11j23m99
4163d44M87K79o15M35l2j15K38J0m04K24J10l08K96P8l78K80J44m64J86K54l47
$$ plain form
4184 -86 -19 375 3 -95 318 -261 -10 351 -162 24 356 -121 -41 354 -32 0 354 -99 -92 198 60 -121
4206 -121 209 -16 -257 277 -54 -267 262 5 -358 287 -38 -328 234 -58 -218 151 -71 -381 111 77
4226 77 -402 20 37 -406 -27 -60 -329 85 84 -401 81 111 -393 53 167 -273 12 286 -285 -141 31 -222
4248 -222 -9 104 -199 -10 192 -341 -51 220 -233 -94 283 -225 -157 381 -151 86 282 -322 -20 371
4268 371 -123 -195 343 -64 -169 412 -57 -232 311 54 -240 351 -123 -205 330 -109 -185 236 116 -264 116
4289 116 -7 -114 302 16 -242 284 203 -231 206 163 -238 254 120 -264 180 -25 -198 171 70 -188 202
4310 202 238 -149 7 108 -220 -4 96 -168 8 117 -298 24 307 -295 -132 263 -283 -148 195 -312
4330 -312 -204 204 -89 -227 205 -189 -223 129 -190 -275 339 -115 -134 238 -160 -145 295 -75 -225 303 -29
$$ packed form
4184h6O7L94l72r8M13n79K51L61n13J86L32m77Q0L95l86L2L54m53PK90j38j81
4206a21L30k25k41N34l31k13N29k57l63O45l25k90N62k92j60L69k22l10M92l4
4226G7m79M22J7m43L79l3k69M14jm85M82L0n04M46J14m40K85K74n71J44J72k53
4248b22K13J13l03J89K02n33K90K71m53J39L77n08O8N38n32K37J96o04L02L91
4268C71m94p2N38m07j05N81m69j75N43k57k94N91m74q2N35m39p6M21j20l80L80
4289A16j23j07M16k86k58N26q1m34M37m3m01M92j34l84M44k05j73L69j01k58L90
4310B02L6l87J56J01l28K16J00k64J76J09m15L22K83o02J63L95n46J35L43n07
4330c12J08M08k93j38M32l94l4L52l19q5O14m54j9L72l98J5M40l70j50N28l32
$$ plain form
4351 -29 -169 288 -169 -96 189 111 -270 73 133 -138 239 -29 -217 155 128 -313 274 120 -289 -37 -28 -181
4373 -181 53 81 -155 93 200 -258 37 180 -173 80 199 -230 74 283 -299 98 176 -164 45 237 -258
4394 -258 92 199 -184 -111 164 -23 46 216 -158 -26 290 -53 -41 255 -39 -105 179 -231 -76 227 -187
4415 -187 -189 96 -211 -173 191 -70 -137 203 76 -289 138 -16 -152 190 -183 -87 124 -75 -170 170 -95 -96 68
4438 68 -144 -178 142 84 -305 11 79 -10 87 68 -164 77 62 -214 65 97 -170 264 41 -225 -19 67 -44
4461 -44 -44 179 63 40 149 -105 118 205 59 -48 156 -133 94 185 -66 68 220 -47 -90 222 -88 138
4483 138 164 -78 -67 -32 94 -168 140 63 -79 165 -63 -136 212 -32 -129 171 130 -102 169 -76 -116 -74 -79 -220
4507 -220 -22 113 -130 -49 63 -274 -12 155 -138 127 35 -192 -14 2 -228 63 -9 -149 61 4 -87 122
$$ packed form
4351b9j40M57m57P3K85p8l81L43O0k71L77k68j88L72k7m41N87j54m09K52Rj53
4373a81K34K8k36K48J07m58K95J43l53K53J19m29L04K09n82L97P8l40K09J92m95
4394b58L50J07l83P3K75j87O9J70l74J32L16l43J2K96k94o6K84m10J55L03m14
4415a87kK85l07L8L64k61o7L40j27l65M27j54j36L42l73R6K11j99r5L40k65jJ64
4438F8k12l4L20n8l89L16O8q9R7j9k32K41j5k76K79L2k67M34k23k66K06Q6j11
4461d4%K23j16k3J09k54K23Q7j46j07K04k89K27R1k51J34J52k67m3L12l10K26
4483A38K6k42J1L5J26k62L08p7j42K44k28p3L48k44r7L00m1k32K71k45m0M2nj41
4507b20J98J35k43Q1J12l37K62J67k93K65r2k27J78J6k30K91p2j40K10n7r1K09
$$ plain form
4529 122 -67 -171 -166 146 -66 -152 -2 -19 -138 154 -76 -36 88 -143 -43 -14 -59 29 -43 115 -114 39 14
4552 14 -31 -116 -26 -102 -4 -12 -111 30 -24 -127 44 3 -46 65 -14 -151 70 -42 -183 -56 -36 7 27 35 9 0 -74
4579 -74 34 27 28 -40 -10 112 -16 -24 119 -102 -24 -30 96 3 97 71 118 41 105 14 48 37 5 -2 27 30 32 184 57 -19
4609 -19 -32 159 -31 139 99 -6 11 92 78 -58 -70 -117 101 99 72 115 -15 -50 -62 -8 -19 -36 -28 -92 36 58 -268
4636 -268 -118 -26 -94 -81 11 -180 -115 47 -146 -49 -78 -75 -53 -82 5 -62 33 -86 -115 0 -52 -45 85 -160 -170 -108 -69
4663 -69 -12 108 -61 106 54 -122 -111 37 -12 -78 19 38 -65 122 57 -59 182 158 -10 12 19 -105 274 58
4687 58 27 209 113 -42 211 112 -178 42 131 -84 108 244 -132 32 178 -80 84 100 -27 198 192 -133 122
4710 122 58 -75 76 33 -110 119 239 -42 224 199 -64 -72 270 -87 -45 200 -73 -20 175 -71 -88 69 12
$$ packed form
4529A22j89j04NL12k12q6J50j7j19K92k30M0J24k31J00K9m5Q8p2J58k29J53k5
4552A4m5q5R0p6R8qr9J41n4j03J71m1m9J11p9j37K21j12j41J27K0M3K0Qk6rp4
4579g4J08pJo8L0J22j28qJ43k21P8oJ26r3R4k6M7p7O4r1L4j1l2pK9LKJ52j27p6
4609a9j3J91j90J70m0j05J7Q1j4j36j2m7K18kk7M3j30l5j2N4j1j7Qo4J28K2l26
4636b68J50R2o8J3R2j91O5J62j93R7k9LK2k9Q7o7R5j19k9J15n2PJ30k45j0O2L9
4663f9N7J20j69J67n2j76J1J48m9o6R7J9j03J87o5j16K41k4j68K2Pj24L79k16
4687E8l1J82r6j55K53r9k90K20Q9k15J92J36l76J64J46k58J64J6j27K25ol25K55
4710A22o4j33J51m3j43K29J20k81K66k5k63qL42l57M2K45k73N3J95k46j7J57n7
$$ plain form
4733 12 -35 39 -35 -128 16 -6 -78 30 -65 -266 229 -62 -126 104 46 -176 233 -129 -88 15 -54 -168 98 25
4757 25 -279 38 55 -184 88 97 -261 113 195 -365 22 -60 -207 91 41 -145 35 32 -161 111 63 -110 26
4780 26 190 -51 22 231 -270 26 198 -164 17 231 -264 3 171 -105 212 168 -17 43 244 33 48 199
4802 199 -38 -67 417 5 -59 274 98 -160 289 1 -168 287 -10 -125 145 62 -32 265 32 -62 136 83
4824 83 -37 80 2 -221 93 8 -125 98 20 -209 125 -35 -291 184 37 -193 132 13 -205 -68 -9 -126
4846 -126 74 90 -171 54 80 -256 -259 1 -321 -27 114 -294 19 149 -149 32 74 -243 40 124 -189 -39
4868 -39 101 -163 -133 198 28 -144 220 -184 -20 236 -33 -47 201 29 107 185 -38 -16 214 172 -220 124
4890 124 -27 -67 176 89 -277 169 88 -165 248 -30 -216 183 121 -114 174 62 -158 43 89 -146 108 114
$$ packed form
4733A2m7P4p4r3J44k2p2J08r5k01M95k91o4K30n8k22M09l62M1J03o9j14K66p3
4757B5l04L17J7k39K72Rl58L74Q2n60L87q2j47K98n0j86J80lj93K72m8j73J36
4780B6J64k41P3K09n01K96J72l62J81K14m95K67J68k76L17m4j85O0K01k11J5J51
4802A99k37k9M84m12o4L33j76k58M49k88j69M55k97j15K70q3r4K97k33r4J98n3
4824H3j20J17p8k23L14q5j33K23p8k29L34j60k56M75j47k30L25j19k18J37N9j17
4846a26K00J6k61K25K6l36lK60l22K94J41m08L13J30k98J81M2l17K83Q4l13J50
4868c9J40k64L0L31j70j72L64m04J64K56k69j4K48j72P8P8k23K2K30m2l92L44
4890A24j51m0K43q7l66M46q1k53M13k78j86L99o2k35K88j12k20K01M6k35K54O
$$ plain form
4912 114 -147 114 159 -157 118 73 -320 101 151 -206 -27 127 -130 -19 28 -69 -25 165 -209 -66 65 -179
4934 -179 -163 79 -117 -183 119 -217 -201 179 -234 -149 67 -73 -150 94 -8 -139 143 -155 -121 195 2 -140
4956 -140 133 65 -61 129 29 -62 246 44 -114 274 -92 -249 185 16 -42 203 85 -84 136 -148 -171
4977 -171 65 167 -237 15 116 -103 -72 -32 -98 144 140 -210 196 43 -37 30 129 -111 36 150 -41 -37 165
5000 165 -124 114 247 -103 40 168 -214 -115 264 -137 33 126 -43 -62 70 -56 -46 80 -176 -98 4 -120
5022 -120 -15 155 -37 -154 -36 10 -4 112 -138 -77 103 -143 -154 10 4 -261 54 -55 -153 -19 153 -139
5044 -139 -30 53 -203 77 15 -167 34 118 12 154 85 -226 84 10 -299 98 108 -44 52 69 47 102 23 23
5068 23 40 79 23 79 167 -204 31 120 -1 136 225 -84 -67 239 105 60 250 105 -32 98 3 -31 97 91 -28
$$ packed form
4912A14k61K61M5l16K75m5l93M21N0l57J79J54k57J11M7r7M4J90l74J43J31k44
4934a79J6K42j96o6L02l36J6L80m13Q5K16j40p7K44j02j31K82k98L4L16j93j42
4956a40K73o8j26J90j00r1L08k02j58L88l66j57M34j69n8K45j18j69K20k84k3
4977a71K36J02m04K52J01k19L1M0o6K42ml50M06j53q0O7R9k40J47J14j91MK02
5000A65k89K38J33l50J43J28l82R9L79m01J70R3j69j9J32j26J0J26k56P8J02j24
5022a20J05J70j92j17J18M6j4J16k50O1J80k46j1J64ok65L15j09r8J34J72k92
5044a39J09Q3k56K80o2j82K01Q4j06J42o9l11L10p4l09L97J0j52R6J7k2N5p9%
5068B3J7L9n6N6Q8l71K35Q9j21J37Q9l09J7L06j34m5J90j45j37J30r5l4J28oj19
$$ plain form
5093 -28 222 -45 -70 155 78 -5 119 155 -119 33 147 -92 -53 70 15 -13 71 -58 128 -66 -30 -101 -109 -24 -40
5118 -40 -61 -190 96 -124 -162 -133 -103 -44 -38 39 33 53 116 -155 -222 49 40 -161 -32 -107 -52 106 18 -40 52 -80 16
5145 16 56 -38 1 -1 -168 -38 -4 -163 -29 2 29 -128 52 121 -186 24 0 99 22 33 -37 66 105 -2 -45 120
5171 120 39 -47 121 -1 -45 15 101 51 82 27 165 152 73 151 -22 98 84 -21 44 68 154 71 -102 190 -26
5196 -26 31 75 106 38 118 75 -100 -50 1 -29 -119 50 -6 -15 84 127 -76 65 7 -77 7 -56 -64 133 80 51 28 -129
5224 -129 -209 -84 -47 -130 -71 44 -50 90 -86 -69 -99 -75 -238 -181 4 -8 0 -120 -150 107 -103 -103 -8 52 5 -101
5250 -101 -30 -159 -97 -6 -44 -70 95 -161 -18 46 -81 6 77 -19 37 31 58 64 102 86 34 55 -100 5 25 21 27 58
5278 58 46 40 107 -44 5 114 67 -45 191 21 32 237 -167 -37 112 50 27 124 47 -174 114 77 -105 31
$$ packed form
5093b8K50k67k5K25p7q3J24L6k74J52J14k39L9J23n5k8Q4j29J86j94L6p1qQ5j6
5118d0k1j29K86k20l8K9L0N9OP7oK0O3k71o7K71rk01J29p5N5J58q8n8R2j32R6
5145A6M0r4L9kj67J30L4j59J34L1K7j57J80O9l07K10k4R9p7J1p0J03L9j07m3J65
5171A20q1q6J68j22m4O0Q6n0L1n5J38j3p9P8j73J20j4j05O5K4Q6q3j73K92k16
5196b6N7M4L1o8Q0m3j75N0N1l0r0J69n6rR9M3k03J41n8q4Q4o3qJ97n3k9k3j57
5224a29q0J25L7q3N9J15r4J40j76J7l0K4j63N7J85j2Qj20l0K57k10%R5O0m7j06
5250a01P1j29O2R1l8k6J65k56J43O4j27Q7P1r6N6oK7OL8j6n2K1j55J05K0mOL1
5278E8j2oO7j51M9J09m7j12K36j70J1K05m04J30J49o2k3R7p7k21K88l7j82J36
$$ plain form
5302 31 44 -36 138 8 -172 92 -94 -53 -25 35 -108 -51 85 -118 -39 131 -142 -73 82 -62 63 41 -133
5325 -133 -32 58 -177 120 130 -44 -64 227 -17 10 15 -42 0 67 19 -10 227 -62 9 209 -61 -49 100 9 14
5350 14 241 41 -9 171 -104 38 152 -59 -235 145 34 -91 -5 125 -69 -4 -72 -113 145 -49 -171 123
5372 123 82 -54 96 0 -192 40 137 -132 57 98 -13 19 154 -122 -47 107 -308 42 114 11 139 184 -144
5395 -144 -2 146 -223 20 163 -66 -106 163 -146 -126 46 -6 -111 203 0 -20 177 -198 -56 182 -87
5416 -87 -150 102 154 -94 232 -76 -38 158 103 -55 65 -77 -168 187 28 -145 47 5 -140 101 6 -105 225
5439 225 -55 -132 310 -21 -186 229 46 -327 -25 -36 -152 -17 -34 -224 47 27 -110 14 -111 -143 52 137
5461 137 -90 23 92 -161 27 115 -80 -157 67 -8 -81 156 -71 28 167 -138 51 152 -58 9 194 -107
$$ packed form
5302C1J3q0J74j30j80K64j86M1K8O0j43N7J36k03P9J70k73O9J55j44J25k2j74
5325a33J01R0k35K97J0j74k0K91k44K7Nn7M2O7m8k9K37k89P1K00k70J2J49r1N
5350A4K27k00n0J80k75J42J14k11j76L80j11j25Q6J30j94O5o8m1K58j94j22K94
5372A23m1j36J50r6j92K32R7k69J89M1j11L2J35k76P5J54m15L50P2j03J28M5l28
5395a44J42J48l69K43J43k29m0K69l09K0J72n2j05L14k03k0J97l75J42K38k69
5416h7o3K52N2k48L26l08L8J96n5j58J20j42r1L55j59j73J92m2j45K41r5j11L30
5439B25k80p7M42l31j65M15j83l73L02j1j16J35j7j90K71k0j37J24j25l2J95Q5
5461A37k27J13O9k53J88Q8j95p7K24p5p3K37k27R9J39l05J89J01k10O7J85l01
$$ plain form
5483 -107 -21 186 4 -122 116 14 -64 228 -27 -54 149 20 20 275 101 -143 140 -75 55 210 -7 -182
5505 -182 244 175 -90 216 116 22 142 67 -126 207 105 -74 156 -18 -154 162 37 -148 59 211 -35
5526 -35 -133 4 -111 -48 16 -65 -92 39 -103 67 -39 -170 -91 172 -76 -60 174 -250 -65 152 -85 -36 24
5549 24 -236 -94 -65 -100 -188 188 -51 -73 149 -44 -51 41 -91 -108 184 -228 -133 145 -69 -62 31 24 56 173 48
5574 48 -82 87 -85 -84 75 62 -166 188 249 -126 113 133 -56 62 150 -18 41 67 -135 107 157 10 146
5597 146 51 -88 60 163 -55 57 144 -86 -54 176 -64 -129 129 6 79 121 -135 -84 90 -22 -112 -73 -54
5620 -54 -103 -3 -111 -186 129 -173 -77 5 17 -135 29 125 -183 98 -173 -75 48 -47 -84 -39 -10 -109 -7 -28 -146
5645 -146 -6 36 -204 103 -38 -121 -40 -64 -103 179 -17 -151 -56 72 -78 -27 141 -12 9 104 -49 -9 -2 -87
$$ packed form
5483a07Q6K07j82j26K38j02p8K92k55k7K03j29%K55j74k44K83k15J30J55k17j75
5505a82M26o9k65L06j00r4J20p5j93L33j02j79K30j74j36L16j25j85K07J52k46
5526c5r8J37j15O3O4q1k7J31j42J70j06j31P9K63k48J6K34m24J85K17k37M9O0
5549B4k60J42K9l5q8L76k39k2K22j93pR2j32j7K92m12R5K78k14PR3pL2J17j25
5574D8j30J69j72JJ59j3k28L54O1l75K39K0j89J18Q8j68N9K6k02K42N0j47J36
5597A46r5j39J48J03k18J12Q7k30L2K30k40o5K58j23P3M2k56N1J74j12r0L9J9
5620e4m9J00j08p5L15l02R6Q2J2j52J64R6l08K81k71R8J23r5l7M5K9r9J02k1j18
5645a46J40M2k40L07j41q3Q1k4l9K82j96j34R5J28j50N1J68j53K1R5j53M0Pq5
$$ plain form
5669 -87 62 112 8 11 -32 -160 35 -12 -2 19 9 -97 98 -4 96 5 63 -53 -40 74 22 63 113 -12 60
5694 60 231 -45 -14 63 -74 64 -8 -36 -25 46 122 35 103 107 -139 94 113 38 4 56 -19 -59 20 -28 58 -9 87 90
5722 90 4 -22 -78 -153 -61 -78 11 -127 -122 -42 -249 -94 6 -173 -119 -108 -219 -47 20 89 10 41 59 -84 -94 -143 -53
5749 -53 -8 70 -133 115 -65 -142 18 -17 17 -34 -72 -60 9 -35 62 24 13 -118 57 -32 28 29 -49 65 -148 102
5775 102 133 73 105 89 71 -126 71 -59 -74 -10 -32 22 91 -58 79 9 -24 9 27 53 109 16 -21 -13 -10 123 5
5802 5 -34 -42 25 35 1 18 142 68 30 55 -20 -135 54 -79 -81 -71 -125 -12 -87 -141 -38 -53 113 -55 -4 48 -5 -38
5830 -38 30 -106 -26 -130 -164 -43 -231 -225 -58 -50 -9 56 -169 -11 -5 51 52 -29 -67 -27 -115 1 4 -59 -49 -149 12 -3
5858 -3 -115 189 71 -73 130 42 -135 -4 -27 6 -47 -11 42 -50 18 46 -40 210 -109 -1 139 62 58 91 56 67
$$ packed form
5669h7J49N0j04Lm3j28J95m7J0K1j0j06J95j02J00r1N8j16J3J14n2M1N0j25P2
5694F0J71k76L1P7j37J38p2k8J1P1P6q7O8Mk46K33J9p5l4N2p5m0P9m8Q6o7R6L
5722I0q6k6n6p5R2j7Q9j38NQ0k07J55J00j79N4J1j11J72O7O9p9L1J8j43j0m9R0
5749e3M5P8k03K48j80p7J60l5L4n1l8J2O9m4R7l8j1j31J75q9O0Jp8J14k13K50
5775A02L1o0L2j6j8j97J97j30j5O4k2N4O9j49J37p0l3L3J8K6N6r3l7QLJ33j18
5802El9qO7J0l4J7J24p4l8K5p5j15J89j33kJ0n4J13p5n4J03j5J66j68N1N2n3l3
5830c8O8j36Q0j04l4J21j88OJ67QM1O5k25J58ON6Jq1l8M0q8J16Lo3J0j00J61j5
5858cj12L04j18j44K03q8j77J31k3L3n3L6N3r2O8K8q6K50l19J08J40p7mL3l5J1
$$ plain form
5884 67 158 -75 91 30 31 139 89 98 -13 7 102 -207 -30 121 18 29 -59 66 171 19 -110 64 13 -106
5908 -106 -34 -9 -4 42 32 -72 -13 60 -151 -109 -54 -150 -29 6 -76 -5 -110 -72 -41 65 -57 -75 -73 -236 -135 68
5934 68 14 -68 124 -56 -197 63 -103 -7 177 -109 -41 75 -107 45 39 -168 65 119 -15 -146 173 52 -68
5957 -68 53 142 -99 175 -51 22 82 102 -5 124 32 92 115 44 -141 53 -1 66 30 191 -147 41 148 -71
5981 -71 151 89 -31 21 115 -124 118 163 -67 -22 158 -77 140 136 -93 34 70 -94 -46 129 -155 -133 56 -87
6005 -87 -59 75 -128 -4 -53 -176 37 56 -172 -133 104 -191 -75 -17 -60 22 92 86 -134 120 25 -184 75 -194
6029 -194 -219 211 7 -33 115 -21 -65 -64 -28 -94 86 96 -185 54 -31 17 -2 45 -152 -68 -17 -105 69 174 53
6054 53 177 -61 -107 109 88 -120 82 156 11 144 105 -72 95 164 -6 36 256 -91 100 260 -14 54 133
$$ packed form
5884F7R1k33J66o1JJ08n0Rj11K0R5l09J77J51j03J1q8J25J05j52j29J74n1j19
5908a06P2K5NM6j0j04N9P3k11M2N5r6J21L5q2P1j05L8L1J06j22j8Kj63J01K03
5934F8n4q2J92j80j41K60j66R6J84k86O8J16j82J52ok07K33N4j34j31L19j21j20
5957f8J21Q9k41K74k26P3O0K0j07J29r2O0K3p1j85J94n4O7l6J61l38J88J07k19
5981g1K22o2j20N2R4k39K42M5k30M5J80k35K17mk29J27L6j64M8J75k84K2J89j43
6005h7K8J34k03J24m9j23K13J9k28L9K37k95J16N8m3Q2P0ok20K54r5k09K59k69
6029a94k5M30k04m0J48j36m4JL6o6J80J0k81K39q5M8j9M7j97Q4N1q8J74J05j21
6054E3J24k38m6K16k1k08K02P4j45J33l9j77J67O9j70M2K20l47J91J60k74O8P9
$$ plain form
6077 133 -98 -54 60 -79 21 116 -47 -32 85 -167 -109 140 -113 -75 205 58 -161 30 -61 82 83 -12 -152
6100 -152 13 -33 -127 116 -122 -205 57 -67 -181 24 -99 -141 7 -127 -130 128 53 -160 65 65 -45 54 -60
6123 -60 -96 -66 -9 -39 39 90 -60 90 142 -30 52 7 -98 110 146 -91 57 149 -152 33 41 6 6 122 -54 -8
6149 -8 145 -145 -110 100 -73 -5 109 -115 -22 180 -118 36 168 -21 -115 139 -123 -135 65 -49 90 -53
6171 -53 30 -108 68 53 -118 46 55 -99 180 -29 -40 191 20 -73 44 -17 -127 125 -124 -26 146 -75 -61
6194 -61 2 -8 121 -100 -11 -21 -105 125 -94 -53 2 -69 -36 -42 -74 7 77 48 -38 101 18 75 -2 42 3 85 52 -102
6222 -102 118 -7 -152 167 -112 6 9 -120 -29 46 7 -84 32 -72 -32 27 13 122 34 -57 -117 24 -73 -51 81
6247 81 66 -116 161 67 -49 74 -39 57 -8 69 -4 146 86 -65 -42 -82 -8 73 -78 32 -4 110 -67 124
$$ packed form
6077A33k31M4J14j39J00R5j63J5J17k52N8K49k53L8K80j47k19J91r1J43Jr5j40
6100a52J65m6r4K43k38q3K62j24j14K05j23m2J48j34lK58p5k13K25%j10R9j14
6123f0l6L0N7l0P8N1j50J50N2j72Q2m5j05K08L6k37J48R2l01J85Ql5%J16j76M6
6149hJ53k90L5K10j73O8J14k24R3K02k98J54J32j89r4K54k62j2K00j14J39j43
6171e3Q3j38J76j5j71J64Rj54K79k09j1K31j71r3J17o1j10K52k49R8J72k21J4
6194f1O3j0J29k21Q9j0q4K30k19M1N5p1L3ol2Q1P0k9q6J39q3N7p7M4l9Q2l3j54
6222a02K20j25j45L19k79J18Lj29R1P5l9r1J16j04M0N9j4J09q8r1o0J41r7K2J32
6247H1j5j82K77r4j16J23j13R6o5P7p3J50o0j51K3m0P4Q1j51J10l6J14j77J91
$$ plain form
6271 124 18 1 123 74 8 -78 1 -50 -126 39 -13 -87 -97 96 51 -110 -188 -66 -31 -82 -22 129 -94 -24 -11 -14
6297 -14 -29 89 -95 -28 74 174 -53 -86 -72 -61 117 -183 -73 90 89 60 111 -14 -120 88 -123 -17 46 -23
6321 -23 96 -95 -21 -112 -80 -38 -65 155 13 90 -17 34 6 17 -92 -15 -54 -86 -29 7 -31 -46 -121 -16 -112 -205 54
6348 54 -4 -3 19 -36 -33 50 -63 14 117 -98 -41 39 -28 18 13 -77 87 31 76 2 23 -17 -40 147 -14 -156 2 24
6376 24 -26 10 21 56 -57 -54 72 -23 -67 -20 -65 -17 79 -92 79 38 -70 74 112 54 39 86 -24 -139 8 127
6402 127 61 88 -42 -23 73 34 65 86 101 71 179 -87 293 -75 -41 -47 -25 -43 92 15 -31 -33 -133 65 -82 -76 79
6429 79 -34 48 -12 -72 40 -17 -132 -114 -16 56 -16 43 -2 -36 9 91 24 3 -13 -139 21 -12 -3 59 -101 -118 1
6456 1 -59 100 19 5 46 4 -16 23 -104 -31 -52 -39 87 1 129 47 -58 115 -18 37 -2 39 -75 55 10 24
$$ packed form
6271A24j06j7J22m9o6q6P9n1p6J65n2p4j0J93m5j61p8J22L5n1O0J51k23P0J3l
6297a4j5J18j84O7J02J00k27l3J4J1J78l00J10J63jk9N1j25j06K08k11J06O3o9
6321b3J19j91P4r1L2M2k7K20j42P7j07N1k8J1j09P7l9l2N7L6l8j5p5J05r6r3K59
6348E4n8JK2n5LQ3j13P7J03k15N7Q0o7M6nr0J64n6M5p4K1m0k3J87j61j42J58K2
6376B4n0L6J1L5j13LJ26r5m4M7m5M8R6j71J71m1j08J44L8n8j5M7j10j15J47J19
6402A27o6K7j30J9R6l9L1K1J5l0J08k66L80l68L4oK2j8J35p7m6kj00J98j47OJ55
6429G9j13Q2o0o0J12n7j15J8R8P2p2N9m5l4M5Q2o7k1j6j26J60l3RO2j60j7J19
6456Ao0J59q1j4M1m2k0L9j27P3k1J3J26q6J28q2j05J73j33N5l9M1j14J30m5J4
$$ plain form
6482 24 89 70 42 -25 5 101 30 9 109 117 -73 -142 139 -27 -13 104 55 -53 83 -98 32 -85 -26 -54 77
6507 77 -26 -48 9 -45 130 157 84 -6 38 -22 -186 40 58 -92 46 89 -53 -69 40 -49 -79 48 -41 -80 -101 -71
6533 -71 41 -56 -34 5 55 17 -29 -62 -18 -164 -66 -93 102 29 -79 7 78 -38 44 34 -41 -43 49 -60 -11 -62 94
6560 94 38 21 79 -93 -113 8 -116 -43 -19 -64 99 19 -92 54 -9 -1 78 7 7 19 139 -166 88 163 83 109 119
6587 119 -26 -35 157 -138 91 92 -114 113 25 -53 -80 126 -83 -62 -32 -24 -70 132 48 85 -68 -16 -29 50 20 -97
6613 -97 -17 -34 24 20 34 -39 55 -19 -41 -31 -72 -32 31 -77 -136 7 -94 -96 83 -45 -56 77 -41 18 65 -5 -153
6640 -153 10 85 105 170 -88 -20 69 15 -241 77 120 -88 91 -24 65 -12 36 -151 79 116 -36 46 -27 -131
6664 -131 -12 10 -94 -115 66 -104 30 202 94 26 128 -179 6 203 21 12 92 24 -151 180 13 39 -5
$$ packed form
6482B4O5j9k8o7L0R6p1k1J00Qj90o9K81j66J4J17m9j08J36j81J30j17N9k8J31
6507G7j03k2N7n4J75K7p3r0M4o0j64K26J8j50J38M3j42j6J09q9l0J27q9l9k1L0
6533g1J12r7K2L9N0l8m6l3M4j46R8k7J95p3j08Q6P1j16Q2j0p5kR2j09M9n1J56
6560I4n6j7N8j72k0J21j24P3K4m5J63q0j11J46o3QP9p1%J2J20l05K54P5q0K6J0
6587A19j45rJ92k95K29Jk06K27q8p8k7K06k09K1L0Qm6K02q4L7j53N2j3P9l0j17
6613i7Q0j7N8mJ4p3R4p4k2J0m1M0O3j08n9J43j01kJ79j28j1J33j18N9M7p0j48
6640a53J63P5K0O5k58O8Q9n4k56L18M3k08J79j15Q9p7M8j87K30L7j52Q2p3j04
6664a31J19K2j04k1J81j70J34J72j08o8J02l07J85J97j82rQ0o8j75L31j67K6m4
$$ plain form
6687 -5 -51 103 156 94 -17 36 29 27 59 -88 -82 70 59 -11 -7 -29 53 57 -122 67 125 4 -150 -2 -15 19 38 -27 -116
6716 -116 36 -3 -46 50 -3 -51 -24 -37 -41 -38 99 -81 129 41 -191 44 41 -59 34 193 -129 9 -40 -19 78 -73
6742 -73 -75 -3 55 -218 -43 -13 -119 -92 106 31 -3 94 -163 3 45 -90 -59 27 37 0 72 -80 -29 53 84 -138
6768 -138 46 -22 4 91 95 -11 32 1 -89 101 98 15 179 -3 -95 86 10 -103 69 4 69 65 -53 33 82 -8 18
6795 18 42 100 -121 107 53 10 141 -2 -108 -19 101 -125 48 -92 -55 -63 7 -112 21 37 -81 -89 6 -22 -9
6820 -9 87 -121 -4 3 8 -100 124 19 -127 -18 -90 140 -27 -49 -30 -58 -34 -36 47 118 11 4 -8 -4 -77 -127 -75 -50
6848 -50 -52 0 -85 -34 -9 -37 77 74 1 -7 -150 20 -12 -191 34 36 100 -50 62 -119 14 98 50 -10 73 24 -44 29
6876 29 -15 40 -26 -33 -24 148 -82 -142 36 38 -81 -40 -22 103 -9 -51 -7 86 -55 -16 -79 -192 12 6 46 -4 -86 -85
$$ packed form
6687em6J54N3o2j11N3pkL2j47OJ52j1p0Mk2Q2Mj79J89N8j21j54J48j3L4J9o5q9
6716a16J52l9m3R6n3m8K7j3mLJ37j80K10q8k32K35lj00R3J59l22J38m9K1R7j51
6742g3kP2N8k73J75L0j06K7J98p5l4R7k57J66M2j35L1Q6J0l7P2j52N1Q2L1k22
6768a38J84o8K6Q7Mj06M3l1r0J90lq3J64j82r2J81p6j13J72o5O5mj18Q6M9r0K6
6795A8K4N8k21K28n4m3J31j43j06Q9J20k26J73j40L7qP0j19J33J6j18qR5k8J3
6820iR6k08J17PNj08K24j05j46J09p2K30j67k2J9k8K4kQ3P1j07pj2Mp3n0N2K5
6848e0kN2q5N1K5k8J14lp3qj43J70l2j79K25KO4j50J12j81J33Q4m8o0Q3m9o8P3
6876B9m4N5o6pRJ72k30o0J78Kj19M1J8J25j12m2M4R3j41L9o3j13K04oM0n0q2J
$$ plain form
6904 -85 -62 2 4 29 38 43 25 85 -9 -82 -43 36 85 -9 -4 -23 18 -17 18 -41 34 111 -23 10 -78 22 -6 -51 -68 -91 -30
6935 -30 -39 -104 -72 -73 43 -41 -135 54 86 -12 -100 90 -23 -120 -61 -66 138 18 -188 84 -36 -6 40 20 -50 -4 15
6962 15 -4 78 63 139 18 35 -49 76 136 -53 74 43 39 52 72 -20 -60 32 -110 111 9 129 -57 39 141 3
6988 3 47 207 -51 -19 -81 -138 -103 -116 48 -60 51 -39 -65 99 6 -10 -64 4 -165 112 27 87 47 -132 88 17
7014 17 58 99 193 58 64 87 33 171 195 -101 63 -61 -25 46 18 7 8 -27 159 -73 -28 -130 127 -103 -13 48
7040 48 26 108 -132 -8 68 -67 20 -22 -73 18 15 23 59 67 117 47 42 -66 -102 10 -87 -29 -173 36 -58 33 -49 34 15
7069 15 -117 -36 166 -64 -134 46 -133 -130 -25 -130 50 65 34 -52 -128 -139 -33 55 -67 -53 31 32 35 42 46 17 118
7096 118 134 72 16 -60 56 -70 -40 -54 -36 59 9 82 30 -163 -65 12 -31 38 -103 79 157 135 39 150 130 37 -14
$$ packed form
6904h5K3O4KK5RNj8O0r4p3L9P9M9r4Nj9M1l5L5n9P5P7j34L3q8J00k8m5j7k3O1
6935c0ro5L2jJ16q4r4J89L2r8q8J90j13r7N9nK04j20k06K72j20L0M6k0p0M6J9
6962A5j9Q2j5P6j21J7q4J25O0j89J27l1mJ3K0r2m0R2j42K21j02J20j86R6J02j38
6988CM4J60k58L2o2n7L5j3J64j08J11r0k6J64r3j6n4O8j69K77q5O0m0j79K20p1
7014A7M1M1R4j35OK3n4J38K4k96J64j24L6P1k8j1Jl5J86k32M5j02K57k30R0O1
7040D8k2Q2k40J24P6j35Q7m2n1R1lQL6QN0p0nj08l6J12r7N8j44K09r4R1q2Q3j9
7069A5j32Q1K02k30p0J80j79LJ05j05J80J5l1q6p6j1J06Q8j22J4Q4JLPMk9J01
7096A18J6o2n6p6J16j26L0j4J8R5n0P3n2j93R8P7m3O9j41J82P8k2r6J11k0r3n1
$$ plain form
7123 -14 129 -111 100 -14 35 10 -58 -41 40 32 57 -44 24 -71 6 76 -90 -49 -18 -32 -113 -7 -17 98 72 -78
7149 -78 -41 96 50 -71 91 -189 -80 -109 48 -63 12 -57 -36 67 -21 -24 -27 -9 -25 -93 -117 -80 -24 70 -77 -106 -18
7176 -18 9 -9 99 -51 -82 -110 -136 103 11 -10 14 160 -47 23 -78 -2 127 86 23 110 -61 45 66 196 30
7201 30 89 149 -28 102 135 -71 32 -24 56 -201 135 -10 -69 -21 -15 -4 -32 -18 -35 -60 40 -92 72 77 -52 154
7227 154 38 35 66 -123 -14 75 -81 -194 9 29 -14 90 -40 -43 48 122 -125 12 11 -154 -15 -41 -25 -14 -62
7252 -62 -112 28 21 -44 47 23 -101 28 -13 78 35 -97 -43 71 105 -126 14 -55 -160 -9 89 50 20 129 -93
7277 -93 41 36 -99 54 -58 62 201 47 23 17 60 -13 2 -62 -80 -8 -6 107 137 124 28 38 -10 3 -52 147 61
7304 61 -65 56 136 -117 56 30 90 39 -7 -38 -102 -16 -18 -3 -72 -160 6 85 -20 59 57 0 131 -25 -23 -33 -22 -33
$$ packed form
7123a4J43k40K11j14M9k5o8J7Q1qK5j01O8r5P7P0j66M1L1j4q1J06j0J15k6j50
7149g8L7J37m6j21J62k80J09k9J57j11P5o9K1J03q8llJ8j6o8k4L7N6R4j47k9Q8
7176a8K7j8J08j50l1k8k6K39r2k1K4J46k07P0j01P6J29m1o3Q7j71J06K1J30j66
7201C0N9O0j77J30L3k06J03n6Q0k57L36j45n9M8OJ1k8J4j7k5J00j32J64Nj29K06
7227A54j16lL1j89J09Q9j56j13K03K0m3J04j30lR1P4k47J37jj65J39k6J6J1m8
7252f2n0J40po5R1k4j24J29m1R1m3j32N4J14L4k31J40o9j05J51R8l9l0J09k22
7277i3J34nj35J53j12J20J39j54k4oM3p3J5o4j8P2KJ13L0j3r6J0m8J3n5J99q6
7304F1j26J21Q0k53J73k6O0n1m6l1o4Q6kJ5o9q8J66P9j05P9kn7J31j56Kj0J1j1
$$ plain form
7332 -33 36 79 -71 -102 74 16 35 66 5 -20 56 -100 3 -48 -94 75 25 -43 38 139 49 64 13 -120 -12 55
7358 55 16 16 62 -36 -63 -20 -84 -167 -2 -38 -67 -61 31 -15 16 -110 -55 97 -82 42 155 56 -25 29 -122 -3 25
7385 25 31 27 68 87 -9 45 213 -96 -2 -79 77 86 159 -89 -56 42 -4 29 25 -35 78 53 3 -75 -19 -72 64 -18 -89
7414 -89 34 -2 -118 76 54 -29 12 88 46 -125 2 -109 -67 -2 -94 -42 52 5 -96 -64 -49 -57 -11 52 -5 237 -32
7441 -32 -69 104 -102 -149 0 -48 -62 104 -66 1 95 70 31 50 102 15 0 0 -64 90 -24 -104 4 203 -16 36
7467 36 39 29 6 -39 -51 34 128 -68 8 130 -65 104 -26 86 50 -20 -18 -189 17 11 -122 94 33 -76 50 -18
7493 -18 150 16 -2 161 -26 -96 -23 89 -51 11 149 11 67 -122 48 -29 -9 76 -175 10 41 3 -33 26
7517 26 144 -39 -85 41 -28 20 84 54 -25 -101 -33 182 -83 62 163 19 -31 117 -7 -124 12 -7 -8 -108
$$ packed form
7332c3O9M3j50l1J76n8J9L1o1k5P6j56J03n1m6J69n0o8Q1J01r0J5n1j33J08O7
7358E5l9%M6r8k7M3o4q3J65l6k9OR2m6L1j26N5J52j79J24J13r9q1N4j51J19K8
7385B5OmM1J9r6N4J68l09R4p7J56RP3k48L3R8m6L3mo0J13k5n0p8N6n3J36q2p1
7414h9J23l6j16J94k2q3M1P6m2j71J27j11M2O5r2N2R4m7j01L2J5qM6O3n7K42k69
7441c2l7J73k06m7J49m8j4J66j70O7R4k5l9J9N2q7j5%o4J54j14q0J08J99k19N2
7467C6Lj0k3m5j2Q5R4j96P6J22j95J69j30J12l6p0Kj71K06oj33K16o1j09J26o8
7493a8J68j34j8J63j87p0P3J12j40O2J38j38N6j89J70p7K0Q5k51J85L1l8l6N9
7517B6J18j83m6J26o9M8O4l0p9p6O8K15k65J45J01j44n0J48j24j17J36j9jj00
$$ plain form
7541 -108 -81 -35 82 89 110 42 -28 -48 -14 -177 17 84 -1 -100 19 36 38 170 -64 56 -20 -38 82 86 -34 67
7567 67 22 98 79 103 76 57 -19 -35 94 53 -13 58 94 64 14 -22 218 8 2 115 -46 8 137 -83 132 -101
7593 -101 -125 -72 -22 -124 19 76 36 -82 -20 -8 -30 -154 138 48 -215 -20 -106 -165 48 -14 -25 81 -119 1
7617 1 78 24 43 -87 89 50 -9 4 -86 -15 105 -42 -11 12 98 3 -62 -12 -70 -30 -27 49 92 -25 -116 -75 90 67
7645 67 -48 -150 134 -27 73 -30 103 -47 -41 18 -75 83 131 -32 30 103 -39 -32 -36 -89 -73 21 -118 50 -48
7670 -48 -74 16 142 21 -27 -21 -15 -131 -13 -86 62 -51 -39 -191 50 -58 22 26 -114 -39 -37 -21 -183 59 -119 -115
7696 -115 21 -108 9 -110 86 18 145 -66 93 -10 22 84 -67 38 -39 89 101 -166 32 66 -165 121
7718 121 -9 -105 -74 15 -15 36 177 -12 -7 -126 -106 -30 -31 -67 -194 71 -79 110 118 -83 -33 -122 -56 23 -109 32
$$ packed form
7541a08K7M6J17PK1o8p0k0L4j63J94O7q5r9J19J7KJ32k34J20p6j8J20Mj20J01
7567F7m5P6j9K4k7j9p6j6J29m1o6P1L6l0n0l6K40k10oJ13j61N4J29k20K15k33
7593a01k4N3N0j02J43N7m0j18O2J2k2j24K92r0k63J95q6n9K13o2j1J06k00J20
7617AP7n4J9j30J76l9n9J3r0P1J20j47L1K3Q6r5o5N0n8M0LP6M3j17r1M1J65k3
7645F7j15j02K84j61J00j03J33j50ON9r3J58M8j63O2P3j42Pmn3J6R4j39J68r8
7670d8k6R0J26j21m8OOj16J18p3J48j13J2j52K41j08Q0Mj40P5KJ6j62K42j78M
7696a15J36j29J17j19J96o8J27k11J59j03L2O2j51J05p7J28J2k67J98L4k31K86
7718A21j30r6L1Q9l0N1J41j89Nj19K0P6jl6j27K65j50J89Qk01N0q9O6P9j32J41
$$ plain form
7744 32 -71 103 5 22 -45 20 -4 34 271 86 44 22 68 118 68 62 153 97 -4 214 60 83 92 -78 77 40 56
7771 56 -155 -35 128 16 74 -61 -112 -14 0 -36 152 -110 -133 127 46 -117 -93 -62 -143 -48 -32 31 -120 -46 132
7796 132 -91 54 11 -75 62 -61 -37 125 20 49 -150 -50 63 7 -49 128 -76 13 120 15 31 20 -11
7819 -11 185 -36 -68 59 -2 134 69 -105 69 -1 -40 11 3 -56 -87 7 -30 -116 143 86 25 45 18 4 76 112 64
7846 64 4 -60 -11 99 -21 -9 -68 27 43 -53 103 63 55 -47 2 -30 137 39 22 -73 92 -95 -62 42 -60 -21
7872 -21 88 -21 23 -99 -25 37 -45 -107 1 -31 88 -67 -46 -22 -2 39 59 -131 60 -33 -35 -93 -100 20 -64 -30 10
7899 10 -86 -34 -13 -45 111 -62 4 -47 8 -97 -43 47 -7 71 -205 82 187 100 -111 -23 -90 -99 79 -69 53 36
7925 36 93 -83 138 113 -190 20 123 -72 157 -2 -42 86 9 7 4 -8 53 -44 -35 4 12 116 99 -34 -13 14 -121
$$ packed form
7744C2j03J74r8J7o7O5k4L8K37j85m2k2M6N0n0oR1n6j01K18j54K3Rj70J55l7J6
7771E6k11J20J63j12N8j35n1R8J4l6J88k62k3K60q1j63K4L1q1R5J6O3j51P4J78
7796A32k23J45m3q6J37j23K4J62j05K9j99J00J13n6n6J77k04Q9J07j05J6j1l1
7819a1J96k21l2J27o1J36o5j74J74p0l9N1qn9l1R4l7q6K59n7o1K0k7j4P2L6m8
7846F4o0o4M9J10j20J2n9R5J6r6J56m0qj02M9l2J67r8j7r5J65j87L3J04j02L9
7872b1J09j09M4j22P4O2q2o2J08l2J19j55K1K4K0M1K0j90J91r3kn8pJ20q4L4M0
7899A0r6N2K1l2J56j73O6n1N5j05N4R0n4P8k76K87J05q7k11Q8o7rJ78j48J22j7
7925C6N7j76K21k5l03K10J03j95K29j59m0J28p7klj2O1r7RL9QJ04j7j33K1K7j35
$$ plain form
7952 -121 64 70 -21 26 140 -22 -2 20 86 -12 -3 -12 26 -17 34 73 26 -137 5 153 -56 122 46 -27 86 0 113
7979 113 81 -27 57 -34 11 -33 40 107 -26 -10 100 -50 -72 24 -108 -55 -109 -7 -53 -69 -108 -83 -21 -146 -33 132
8005 132 54 -69 -94 53 -103 3 -85 -46 56 78 21 20 -23 14 24 95 9 47 62 121 36 83 43 -38 112 -52 -24
8032 -24 41 158 98 66 56 -57 7 -117 -108 109 68 129 43 -17 30 76 4 -66 56 85 -33 -9 -5 51 123 -25 -62 23
8060 23 -79 67 -74 7 -3 -127 126 -97 32 -39 -40 -13 -67 -150 96 -34 -26 73 -11 12 132 38 -72 0 -8 -30
8086 -30 36 59 -27 -106 -62 -68 -153 52 15 59 -125 -31 -8 77 6 99 -12 55 -84 101 -29 118 -64 -53 104 -169
8112 -169 56 53 14 49 -47 -100 96 101 23 80 33 79 9 -39 2 121 153 69 -76 58 45 -8 77 37 200 -36 161
8139 161 103 140 24 -58 -30 12 -129 -61 -10 -36 -5 7 -20 -9 129 -73 10 -97 -68 86 58 48 91 -33 -91 145
$$ packed form
7952a21J85Or1M7J14j62K0K2O6r8RrL8m3N1L9m7j63J42J48k09J78p6p3J13q6J13
7979A13l2j08Q4r1M5m4P3O7j33J6J10j50k2R6j32N3n4J02m6j6l9K5O2j25J13J65
8005A32p8j23k5J47j56J06q8L9J02K2n7jm3L7J0P1q6L8J5N9q5M7m0q1J50j64K8
8032b4O5J17o0l2j0j13O4j24RK17m1O1q6o0M7M6p2p0J22K9j18K4MN6P2j48l7Q5
8060B3j02J46j41Q1j0j24K53k23J29p1jK7n4q3K46j30QR9q4K3J20r4j10P2qk2
8086c0O6K3q6p9M4oq5K05l7M4j84R4K3Q5p1R3j11O7j39J85j30J47j82J1J57k73
8112a69K25ll9L5r6n3J96Np8N7m7M6p0m8M1J19L2q4j45J34j3n3Q5m0J63k36J97
8139A61n8L7j16q2K8M2j41O8N1k6L1J2k7J1J38k02Q3j07K9J54k8j0M3j24n8K36
$$ plain form
8165 145 -40 34 -85 7 72 10 -75 -21 -6 52 15 -48 -47 -108 73 -19 74 133 40 128 62 22 -129 29 95 36
$$ packed form
8165A45j85P4j19R2O5o2q5N4J5N8l7o3Jo1J81r2R3N9r3Q8o6m0j51J58O6n9
8191C6
$$ Imaginary data points
##PAGE= N=2
##DATA TABLE= (X++(I..I)), XYDATA
$$ plain form
0 0 0 0 0 0 0 0 0 0 0 0 0 -8 8 -8 8 -10 16 -16 24 -24 32 -40 48 -55 64 -72 85 -96 111 -126 144 -165 186
33 186 -208 237 -264 296 -331 369 -411 456 -506 558 -619 683 -754 833 -917 1011 -1113 1225
51 1225 -1351 1489 -1644 1822 -2019 2247 -2513 2826 -3198 3653 -4222 4957 -5941 7331 -9433
66 -9433 12957 -19892 38394 -183630 -415561 209642 13020 -256521 123844 -1867 -335152
77 -335152 -6653 29051 -216840 -30569 23825 -172943 -95978 -114240 -149954 55925 -42212
88 -42212 -224433 -8146 -40430 -218916 -1951 26541 -152277 -1806 -22876 -209291 -5920
99 -5920 87083 -97872 -25603 -3608 -120430 53251 73485 -151291 17986 156608 -75789
110 -75789 -37783 83743 -56155 41990 167675 -30840 -32533 96899 6716 36624 114722
$$ packed form
0@%%%%%%%%%%%qJ6j6J6j8K6l2M0m8N6p2Q8j03J19j36J57j81K07k37K70l09L51
33A86l94M45n01N60o27P00p80Q67r62J064j177J302j437J587j750J928k124K338
51A225k576K840l133L466l841M266m760N339o024O851p875R179j0898J3272j6764
66i433K2390l2849N8286k22024k31931O25203j96622k69541L80365j25711l33285
77c35152L28499L5704k45891J86271N4394j96768P6965j8262l5714K05879r8137
88d2212j82221K16287l2284j78486K16965K8492j78818J50471k1070j86415K03371
99e920R3003j84955P2269K1995j16822J73681K0234k24776J69277J38622k32397
110g5789L8006J21526j39898R8145J25685j98515j693J29432r0183K9908P8098
$$ plain form
121 114722 19712 68274 90032 -76351 42048 201468 9168 5533 139703 -39449 -24216
132 -24216 190508 27422 -45984 165008 44895 -115173 59138 103192 28326 69815 -1917
143 -1917 -72191 32935 59306 27212 37007 -33629 -29599 47657 -43246 -40676 106448 -81
155 -81 -102727 20178 -19963 -67740 75505 6801 -112348 19763 9796 -103093 7128
166 7128 34934 -57173 5368 -17626 -114156 14046 62711 -67513 -24085 16388 -67476 -6751
178 -6751 21163 -64349 15239 54946 -64147 -38910 12661 -30128 36220 46248 -68302 -13621
190 -13621 44897 -52749 -3580 79706 -18672 -17507 31963 -62550 -11672 106162 1118 -42600
202 -42600 30948 -23614 -20921 59594 4258 -8280 47323 -29319 -53573 38338 26949 10305
$$ packed form
121A14722r5010M8562K1758j66383J18399J59420j92300l635J34170j79152J5233
132b4216K14724j63086p3406K10992j20113j60068J74311M4054p4866M1489p1732
143a917p0274J05126K6371l2094R795p0636M030P7256r0903K570J47124j06529
155h1j02646J22905m0141m7777J43245o8704j19149J32111r967j12889J10221
166G128K7806r2107O2541k2994r6530J28202M8665j30224M3428M0473q3864O0725
178f751K7914q5512P9588L9707j19093K5237N1571m2789O6348J0028j14550N4681
190a3621N8518r7646M9169Q3286r8378J165M9470r4513N0878J17834j05044m3718
202d2600P3548n4562K693Q0515n5336j2538N5603p6642k4254R1911j1389j6644
$$ plain form
214 10305 35700 -44822 -52284 50892 11179 -24440 47469 -7036 -55903 20388 -7218 -28858
226 -28858 63134 14078 -72249 -3603 10742 -23514 32967 14177 -46513 7795 4933 -50586
238 -50586 16686 40371 -21699 541 -7937 -50863 23089 41442 -27807 4869 15799 -40235
250 -40235 -196 24388 -15591 26747 33270 -49085 -21838 34642 -1300 15333 35129 -30286
262 -30286 -16002 27578 -16635 6090 52874 -5840 -20429 8406 -20734 8679 55806 -1082
274 -1082 -24826 11423 -11381 -11008 34312 12611 -5662 12028 -24889 -26679 31251 16710 -3544
287 -3544 14823 -26572 -33649 26759 8912 -15479 24779 -594 -44332 -4968 12345 -5586
299 -5586 17059 8000 -34986 -17727 3902 -4421 12980 8583 -19163 -7816 -12054 -21973 18744
$$ packed form
214A0305K5395q0522p462J03176l9713l5619P1909n4505m8867P6291k7606k1640
226b8858R1992m9056q6327O8646J4345l4256N6481j8790o0690N4308k862n5519
238e0586O7272K3685o2070K2240q478m2926P3952J8353o9249L2676J0930n6034
250d0235M0039K4584l9979M2338O523q2355K7247N6480l5942J6633J9796o5415
262c0286J4284M3580m4213K2725M6784n8714j4589K8835k9140K9413M7127n6888
274a082k3744L6249k2804L73M5320k1701j8273J7690l6917j790N7930j4541k0254
287c544J8367m1395p077O0408j7847k4391M0258k5373m3738L9364J7313j7931
299e586K2645r059m2986J7259K1629q323J7401m397k7746J1347m238r919M0717
$$ plain form
312 18744 22601 -15094 -8914 -7890 -24568 5677 25981 -1617 -6674 -886 -20178 -10220 18610
325 18610 12209 5710 654 -21227 -10616 12818 8093 14184 12505 -16336 -13865 6415 4451 13381
339 13381 22291 -2843 -18137 -1254 5348 7229 22037 11815 -11579 -7271 -1994 1769 21674
352 21674 18114 -5059 -6923 -3764 -5177 9732 22331 6246 -7538 -1364 -8464 -10054 21380
365 21380 23000 -8856 -8527 -2127 -13247 1960 21644 6104 -7748 -4334 -13483 -12874 12694 17015
379 17015 -46 -8967 -18980 -12747 8756 5203 533 5467 -13869 -22216 -3742 30 5384 14016
393 14016 -9617 -28802 -11151 1872 3621 9828 -4664 -18805 -6390 -10271 -11021 18343 10246
406 10246 -17118 -7323 -12732 -15623 21155 14960 -17991 -1029 2383 -20382 2238 18604 -1080
$$ packed form
312A8744L857l7695O180J024j6678L0245K0304k7598n057N788j9292R958K8830
325A8610o401o499n056k1881J0611K3434m725O091j679k8841K471K0280j964Q930
339A3381Q910k5134j5294J6883O602J881J4808j0222k3394M308N277L763J9905
352B1674l560k3173j864L159j413J4909J2599j6085j3784O174p100j590L1434
365B1380J620l1856L29O400j1120J5207J9684j5540j3852L414r149O09K5568M321
379A7015j7061q921j0013O233K1503l553m670M934j9336q347J8474L772N354Q632
393A4016k3633j9185J7651J3023J749O207j4492j4141J2415l881p50K9364q097
406A0246k7364R795n409k891L6778o195l2951J6962L412k2765K2620J6366j9684
$$ plain form
419 -1080 7834 6023 -27838 -5257 29735 5802 2289 11373 -14400 -3274 19715 -1865 7526
432 7526 28922 -2645 -14448 6407 4915 15471 28154 -2416 -11723 11466 2152 1554 24011
445 24011 10025 361 7108 -16898 -6451 35177 14538 -8224 2866 -12785 -8206 22816 4054
458 4054 -8354 15012 -5974 -27971 1565 8680 1989 13902 -15748 -36537 4674 8108 -13320
471 -13320 6890 -4272 -27138 -3909 -10033 -21882 16082 9292 -32024 -18400 -7639 -14017 10191
484 10191 2177 -28362 -4116 1691 -28841 -5426 13134 -8699 2160 -6024 -35602 3431 24802
497 24802 -11734 -2157 7245 -18626 1659 12694 -14430 13735 30927 -19256 -15667 18259 1384
510 1384 14887 29514 -15669 -6260 29247 -5383 -705 37051 7510 -537 15528 -15176 3671
$$ packed form
419a080Q914j811l3861K2581L4992k3933l513R084k5773J1126K2989k1580R391
432G526K1396l1567j1803K0855j492J0556J2683l0570r307K3189r314n98K2457
445B4011j3986r664O747k4006J0447M1628k0639k2762J1090j5651M579L1022j8762
458D054j2408K3366k0986k1997K9536P115o691J1913k9650k0789M1211L434k1428
471a3320K0210j1162k2866K3229o124j1849L7964o790m1316J3624J0761o378K4208
484A0191q014l0539K4246N807l0532K3415J8560k1833J0859q184k9578L9033K1371
497B4802l6536R577R402k5871K0285J1035k7124K8165J7192n0183L589L3926j6875
510A384J3503J4627m5183R409L5507l4630M678L7756k9541q047J6065l0704J8847
$$ plain form
523 3671 49695 9677 -13419 16829 -434 -2584 31669 5623 -4259 30290 -5386 -27383 23837
536 23837 18514 -710 20762 -14019 -28296 27902 12189 -21102 17106 7103 -26137 3221
548 3221 -1349 -18254 24612 10515 -39832 -7122 7453 -17631 10704 3162 -33088 6197 5796
561 5796 -40899 -23 22536 -20299 -6134 -2373 -36110 3639 24441 -25959 -10993 14689
573 14689 -24026 -11339 11958 -18996 6852 25905 -35041 -22747 25624 -6080 -2431 21470
585 21470 -21180 -12277 24144 -14797 -10481 34048 537 -16231 8303 -14515 573 42141
597 42141 -6313 -25168 22887 -2273 -16742 28663 4707 -12394 25713 -8641 -31290 26761
609 26761 21172 -11389 9770 -7653 -19711 25277 7224 -22491 21800 10669 -30866 5870
$$ packed form
523C671M6024m0018k3096L0248j7263k150L4253k6046r882L4549l5676k1997N1220
536B3837n323j9224K1472l4781j4277N6198j5713l3291L8208j0003l3240K9358
548C221m570j6905M2866j4097n0347L2710J4575k5084K8335p542l6250L9285m01
561E796m6695M0876K2559m2835J4165L761l3737L9749K0802n0400J4966K5682
573A4689l8715J2687K3297l0954K5848J9053o0946J2294M8371l1704L649K3901
585B1470m2650Q903L6421l8941M316M4529l3511j6768K4534k2818J5088M1568
597D2141m8454j8855M8055k5160j4469M5405k3956j7101L8107l4354k2649N8051
609B6761n589l2561K1159j7423j2058M4988j8053k9715M4291j1131m1535L6736
$$ plain form
621 5870 8701 -16280 24797 11091 -39897 2284 19516 -17784 6584 11005 -20809 7454 5845
634 5845 -32026 10522 29247 -20790 -6114 9314 -25295 7387 29036 -23791 -6096 25790
646 25790 -19882 -12546 20538 -5080 7479 18941 -28808 -9938 31307 -5016 -3511 23892
658 23892 -14908 -10274 26515 -11337 -9417 39373 6 -25706 13306 845 -1107 30578 -5496
671 -5496 -19428 22005 -1275 -15266 24920 5962 -12432 18321 -8420 -25837 28970 18142
683 18142 -22746 6217 2944 -19888 14719 7124 -19816 16367 6166 -31050 3572 9647 -14470
696 -14470 14656 2821 -35583 3962 16392 -23715 -24 14598 -21232 -5264 4481 -25213
708 -25213 5387 21578 -23758 -11647 7651 -20431 1917 17252 -22816 -4874 17494 -24657
$$ packed form
621E870K831k4981M1077j3706n0988M2181J7232l7300K4368M421l1814K8263j609
634E845l7871M2548J8725n0037J4676J5428l4609L2682K1649n2827J7695L1886
646B5790m5672P336L3084k5618J2559J1462m7749J8870M1245l6323J505K7403
658B3892l8800M634L6789l7852J920M8790l9367k5712L9012j2461j952L1685l6074
671e496j3932M1433k3280j3991M0186j8958j8394L0753k6741j7417N4807j0828
683A8142m0888K8963l273k2832L4607p595k6940L6183j0201l7216L4622O075k4117
696a4470K9126j1835l8404L9545J2430m0107K3691J4622l5830J5968R745k9694
708b5213L0600J6191m5336J2111J9298k8082K2348J5335m0068J7942K2368m2151
$$ plain form
720 -24657 -14019 22004 -5516 -6204 11430 -21515 -11905 24970 -5388 -11008 18087 -9354 -13226
733 -13226 16507 -7234 -4714 29087 -6375 -22571 15447 4125 -4755 21850 -1080 -15680
745 -15680 17690 2638 -13614 21749 12034 -11865 11170 -271 -13807 24965 14453 -16557
757 -16557 10771 7972 -14435 13224 12208 -9546 14428 7890 -21703 6388 17788 -6856 8421
770 8421 7605 -19738 5153 15551 -14528 4817 17091 -15510 -4952 8217 -12496 6183 16991
783 16991 -16338 -9377 9095 -10896 -1849 13638 -10415 -6565 8079 -16569 -8943 17604 -4671
796 -4671 -10002 5348 -14346 -9436 14504 -6084 -9652 9827 -9711 -14437 7867 -3155 -5127
809 -5127 12255 -8899 -18492 8290 1543 -8362 11206 -1967 -15473 6595 -588 -10625 13726
$$ packed form
720b4657J0638L6023k7520o88J7634l2945R610L6875l0358n620K9095k7441l872
733a3226K9733k3741K520L3801l5462j6196L8018j1322q880K6605k2930j4600
745a5680L3370j5052j6252L5363r715k3899K3035j1441j3536L8772j0512l1010
757a6557K7328k799k2407K7659j016k1754K3974o538k9593K8091J1400k4644J5277
770H421q16k7343K4891J0398l0079J9345J2274l2601J0558J3169k0713J8679J0808
783A6991l3329O961J8472j9991R047J5487k4053L850J4644k4648P626K6547k2275
796d671n331J5350j9694M910K3940k0588l568J9479j9538m726K2304j1022j972
809e127J7382k1154r593K6782o747r905J9568j3173j3506K2068p183j0037K4351
$$ plain form
822 13726 5373 -13565 3036 -133 -8310 13075 7194 -11293 4896 3665 -11199 7885 11652
835 11652 -5861 5639 4990 -13365 5412 14589 -3890 4529 7258 -10123 2261 11079 -2583
848 -2583 6201 9912 -8153 -2039 8185 -1119 5529 10490 -6678 -3031 7063 -3981 2444 11960
862 11960 -4474 -3266 5087 -7790 -335 12667 -3021 -4481 4411 -8104 -4879 10251 -939
875 -939 -5522 4441 -7119 -9867 7300 639 -6397 4612 -4726 -11991 3085 -370 -5923 5507
889 5507 -2570 -12138 -648 -1270 -5238 5103 169 -10382 -1894 -1107 -6924 4448 4606 -8240 -2522
904 -2522 -454 -7177 3504 6487 -5596 -1089 1661 -6206 149 5772 463 2041 1688 -6040 -1331
919 -1331 6604 3717 2920 2405 -4176 -8 6206 1164 3873 7496 -1975 -2176 4055 1284 4583 8470
$$ packed form
822A3726q353j8938J6601l169q177K1385n881j8487J6189j231j4864J9084L767
835A1652j7513J1500o49j8355J8777R177j8479Q419K729j7381J2384Q818j3662
848b583Q784L711j8065O114J0224r304O648M961j7168L647J0094j1044O425R516
862A1960j6434J208Q353j2877P455J3002j5688j460Q892j2515L225J5130j1190
875i39m583R963j1560k748J7167o661p036J1009r338p265J5076l455n553J1430
889E507q077r568J1490o22l968J0341m934j0551Q488P87n817J1372J58j2846N718
904b522K068o723J0681K983j2083M507K750p867O355N623n309J578l53p728M709
919a331P935k887p97n15o581M168O214n042K709L623r471k01O231k771L299L887
$$ plain form
935 8470 -130 -3056 3188 2658 1179 5569 4785 -88 -102 -1059 -252 6302 5760 -118 -1916 -2301 779
952 779 4546 1238 -102 1743 -1338 -3690 -1064 1308 2688 1744 -2979 -6083 -2207 1942 51 -961
968 -961 -488 -3406 -4361 -2967 -1746 1170 1858 -2809 -7750 -4716 1473 600 -2304 -1300 -3324 -4407
984 -4407 -1553 -2509 -1441 2904 162 -6348 -6202 -565 3169 1305 -2164 -2912 -1856 -1568 -814 1335
1000 1335 1122 826 565 -5307 -3850 6891 4487 -2839 246 -531 -2056 3638 2489 -924 4433 3358
1016 3358 -4655 -1637 4527 3860 4225 963 -4945 1931 5657 -919 2108 5420 -706 1010 1086 -3414
1032 -3414 5157 8909 -2349 -3299 2163 -40 2562 4974 -2053 307 5375 -4318 -4154 6696 2673
1047 2673 -164 2161 -6412 -2979 8216 199 -3874 3555 -1069 -3939 1226 -2423 -480 7369 -2665
$$ packed form
935H470q600k926O244n30j479M390p84m873j4r57Q07O554n42n878j798l85L080
952G79L767l308j340J845l081k352K626K372J380r44m723l104L876M149j891j012
968i61M73k918r55J394J221K916O88m667m941L034O189q73k904J004k024j083
984d407K854r56J068M345k742o510J46N637L734j864l469p48J056K88P54K149
1000A335k13k96k61n872J457J0741k404p326L085p77j525N694j149l413N357j075
1016C358q013L018O164o67L65l262n908O876L726o576L027L312o126J716P6m500
1032c414Q571L752j1258r50N462k203K602K412p027K360N068r693J64J0850m023
1047B673k837K325q573L433J1195q017m073P429m624k870N165l649J943P849j0034
$$ plain form
1062 -2665 -9477 1484 1368 -1943 4594 -2702 -7853 4650 -390 -8877 4817 4561 -6197 -1019
1076 -1019 -2483 -5814 6248 4077 -8328 -1134 2570 -5161 564 1902 -4225 4388 2353 -11548
1090 -11548 -628 7711 -2763 1187 1273 -8557 2177 6379 -6740 188 7667 -4190 -2740 2820
1104 2820 -4289 3352 9122 -7016 -4680 7467 -2678 -1830 7704 -3123 -1142 7304 -7107 -4959
1118 -4959 11795 1880 -4833 2901 -3661 -2041 9730 -1176 -6114 7470 790 -6930 4211 453
1132 453 -2310 9526 -2134 -11075 6178 4201 -4901 4974 383 -6661 4617 117 -7016 7335
1146 7335 4901 -8371 129 1155 -4493 7089 2849 -10522 3823 5811 -8901 995 4964 -4573
1160 -4573 4761 1955 -12363 2540 9418 -5091 321 2967 -8375 2782 7441 -8783 796
$$ packed form
1062b665o812J0961j16l311O537p296n151J2503n040q487J3694k56j0758N178
1076a019j464l331J2062k171j2405P194L704p731N725J338o127Q613k035j3901
1090a1548J0920Q339j0474L950Q6r830J0734M202j3119O928P479j1857J450N560
1104B820p109P641N770j6138K336J2147j0145Q48R534j0827J981Q446j4411K148
1118d959J6754r915o713P734o562J620J1771j0906m938J3584o680p720J1141l758
1132D53k763J1836j1660q941J7253j977r102R875m591p044J1278m500p133J4351
1146G335k434j3272Q500J026n648J1582m240j3371J4345J988j4712R896L969r537
1160d573R334k806j4318J4903O878j4509N412K646j1342J1157M659j6224R579
$$ plain form
1173 796 10332 -8259 -4461 7715 -4691 341 8983 -8135 -4088 9555 -4847 -4189 8755 -2323
1187 -2323 -2901 5224 -7727 -3848 13293 -896 -9044 4542 -1829 -4179 8742 -2807 -7455 8662
1201 8662 -1176 -9014 5577 317 -3597 7771 -4311 -10162 8697 1993 -8544 6490 1841
1214 1841 -9685 4509 1465 -8401 8296 4609 -12337 1847 4539 -6556 5882 2976 -10886
1227 -10886 5511 6357 -11614 1747 9162 -6026 1183 4827 -9976 1830 11432 -5905 -2198
1240 -2198 6904 -5646 65 7733 -5669 1518 9450 -8173 -3302 9789 -2906 -707 8185 -5689
1254 -5689 -2982 9656 -3578 -4084 9796 -909 -4651 5566 -4246 -2031 11995 -2803 -7840
1267 -7840 7740 -1372 -5041 8599 -1666 -6273 8292 -1703 -9056 6878 2549 -5900 4833
$$ packed form
1173G96R536j8591L798J2176j2406N032Q642j7118M047J3643j4402O58J2944j1078
1187b323n78Q125j2951L879J7141j4189q148J3586o371k350J2921j1549m648J6117
1201H662r838p838J4591n260l914J1368j2082n851J8859o704j0537J5034m649
1214A841j1526J4194l044r866J6697l687j6946J4184K692j1095J2438k906j3862
1227a0886J6397Q46j7971J3361P415j5188P209L644j4803J1806R602j7337L707
1240b198R102j2550N711P668j3402P187P932j7623M871J3091j2695K199Q892j3874
1254e689K707J2638j3234n06J3880j0705l742J0217r812K215J4026j4798n037
1267g840J5580r112l669J3640j0265m607J4565r995p353J5934m329q449J0733
$$ plain form
1280 4833 -1693 -8252 6971 1472 -8996 5854 1908 -10061 3648 1705 -8048 6235 2712
1293 2712 -11880 1852 4618 -7202 2346 3215 -8444 1958 3662 -9693 1594 7172 -7439
1306 -7439 -645 3890 -8429 1704 7831 -7993 -1236 6687 -6876 -1662 6794 -4606 -50 6668
1320 6668 -7277 -3117 8658 -2991 -2452 7229 -4607 -3319 8236 -3622 -3302 9736 -2363
1333 -2363 -5500 6525 -1950 -2642 9229 -2027 -5761 7155 -548 -4990 7550 884 -5234 6166
1347 6166 -554 -7007 7840 3127 -6633 4918 971 -6877 5955 2796 -6354 5146 2471 -7649
1361 -7649 3107 3524 -5071 4140 3000 -7902 1963 4840 -5948 2460 4989 -6882 774 4287
1375 4287 -6492 2001 6537 -6321 -1013 4592 -5357 377 6302 -4667 -1526 5109 -4814 -2067
$$ packed form
1280D833o526o559J5223n499j0468J4850l946j1969J3709j943r753J4283l523
1293B712j4592J3732K766j1820R548Q69j1659J0402J704j3355J1287N578j4611
1306g439O794M535j2319J0133O127j5824O757P923j3563N214Q456j1400M556O718
1320F668j3945M160J1775j1649N39R681j1836J288J1555j1858L20J3038j2099
1333b363l137J2025q475o92J1871j1256l734J2916p703m442J2540o666o118J1400
1347F166o720o453J4847m713r760J1551l947p848J2832l159r150J1500k675j0120
1361g649J0756M17q595R211j140j0902R865K877j0788Q408K529j1871P656L513
1375D287j0779Q493M536j2858N308N605r949N734N925j0969L141O635r923K747
$$ plain form
1389 -2067 6488 -2587 -2237 5082 -4352 -2964 6529 -2176 -2613 5305 -3248 -3568 5286 -1685 -2210 5429
1405 5429 -2213 -4399 4417 -853 -2948 5271 -887 -4875 4046 -484 -4004 5523 317 -5187 3628
1420 3628 -222 -4650 4678 1180 -4778 2996 201 -5381 3342 2457 -4383 2001 1289 -5548 1942
1435 1942 3313 -4532 1694 2680 -5431 633 2921 -3784 1604 2986 -5018 -229 3216 -3085 471
1450 471 3200 -3288 -856 2768 -3104 -232 4484 -2394 -1689 2689 -2828 -415 4476 -2287 -1422 3494
1466 3494 -2379 -1802 3615 -624 -761 2944 -2090 -2473 3897 496 -1704 2768 -680 -2326 2950 -303
1482 -303 -1948 3865 242 -3336 1641 178 -1076 3107 -174 -2884 1970 585 -2429 1730 1418
1497 1418 -1807 975 -119 -3277 2086 2603 -2705 -133 837 -2236 873 1233 -2276 1043 1219 -2852
$$ packed form
1389b067Q555r075L50P319r434J388R493q705m37P918q553l20Q854o971n25P639
1405E429p642k186Q816n270k095Q219o158l988Q921m530l520R527n206n504Q815
1420C628l850m428R328l498n958P774k795n582Q723q85o840O384p12o837P490
1435A942J371p845O226R86q111O064K288o705N388J382q004M789L445o301L556
1450D71K729o488K432L624n872K872M716o878P05M378n517K413M891o763Q65M916
1466C494n873N77N417m239j37L705n034l83O370l401k200M472l448j646N276l253
1482c03j645N813l623l578M977j463j254M183l281k710M854j385l014M159l12
1497A418l225K782j094l158N363N17n308K572R70l073L109L60l509L319J76m071
$$ plain form
1513 -2852 -1082 1469 -455 582 463 -2631 -369 1872 -1060 -640 1533 -1041 -759 325 -1843 763
1529 763 2600 -1529 -1485 695 -321 461 1220 -844 -350 1481 -816 -1372 1652 1337 -20 278 -1158
1546 -1158 -380 2497 823 -942 1060 586 -220 613 -9 758 1923 517 -1376 -23 1840 1184 271
1563 271 119 -108 907 829 -740 439 1642 534 -915 -1023 190 1581 879 -685 -1277 -56 720
1580 720 -751 -805 631 88 -685 -1465 -1638 677 1218 -1189 -1998 -803 -179 -543 -576 -1177 -571 463 -1555
1599 -1555 -2742 318 898 -1120 -918 -1888 -1414 1283 -413 -2268 198 387 -1579 -771 -732 -310 1525
1616 1525 223 -2775 -527 1746 -454 -238 563 -966 1159 971 -2160 831 2872 -250 -171 377
1632 377 -343 1996 2356 -1161 242 2808 186 -359 1839 348 1526 2641 -2045 -667 3896 482
$$ packed form
1513b852J770K551j924J037j19l094K262K241k932M20K173k574K82J084k168K606
1529G63J837m129M4K180j016P82P59k064M94J831k297n56L024l15j357K98j436
1546a158P78K877j674j765K002m74q06Q33o22P67J165j406j893J353J863o56r13
1563B71j52k27J015p8j569J179J203j108j449j08J213J391p02j564n92J221P76
1580G20j471n4J436n43p73p80j73K315N41k407q09J195O24l64l3o01O06J034k018
1599a555j187L060N80k018K02r70M74K697j696j855K466J89j966Q08L9M22J835
1616A525j302k998K248K273k200K16Q01j529K125j88l131K991K041l122P9N48
1632C77p20K339L60l517J403K566k622n45K198j491J178J115m686J378M563l414
$$ plain form
1648 482 -416 1840 -634 456 2791 -1182 -795 3685 582 -2011 1074 46 -74 2867 -990 -2784
1664 -2784 2317 666 -2631 1213 294 -1687 1708 -1474 -3577 2431 1355 -3234 -179 -349 -2333
1679 -2333 1238 -199 -3823 1096 1264 -4090 -845 871 -2248 925 200 -4802 291 2308 -3206
1694 -3206 -728 1360 -2433 148 735 -3592 521 3321 -2818 -1756 1985 -1432 215 2769 -2784
1709 -2784 -517 4013 -2206 -1758 3587 -425 -7 2894 -2296 -758 4684 -310 -1817 3228 55
1724 55 -823 3263 -663 -1090 5001 317 -3051 3117 1201 -895 3658 -444 -2247 4258 739 -3106
1740 -3106 3064 1559 -1899 2393 16 -2822 3812 2158 -3962 1361 1853 -2861 1720 1223 -3582
1755 -3582 2385 1851 -4890 687 2483 -2991 763 1079 -4448 840 2728 -4268 -793 2818 -3273
$$ packed form
1648D82q98K256k474J090K335l973L87M480l103k593L085j028j20K941l857j794
1664b784N101j651l297L844r19j981L395l182k103O008j076m589L055j70j984
1679b333L571j437l624M919J68n354L245J716l119L173p25n002N093K017n514
1694c206K478K088l793K581N87m327M113K800o139J062L741l417J647K554n553
1709b784K267M530o219M48N345m012M18K901n190J538N442m994j507N045l173
1724E5q78M086l926m27O091m684l368O168j916k096M553m102j803O505l519l845
1740c106O170j505l458M292k377k838O634j654o120N323M92m714M581m97m805
1755c582N967n34o741N577J796n474L754L16n527N288J888o996L475L611o091
$$ plain form
1770 -3273 -1139 1799 -3754 -207 3432 -4329 -2298 3118 -2879 -1498 2539 -3503 -1452 3239 -3604
1785 -3604 -2836 3630 -1408 -2565 2185 -2301 -2126 3731 -1671 -3354 3454 -862 -3117 3127 -966
1800 -966 -2321 4174 -1087 -3962 3517 899 -2769 2806 176 -2971 3432 677 -3431 3193 2123
1815 2123 -3215 2273 1296 -2855 3733 2113 -4032 2534 2905 -3400 1989 2737 -2713 2310 2555 -3579
1831 -3579 1503 3955 -2579 888 2938 -2955 1096 3724 -3334 437 4436 -2964 -622 3588 -2498
1846 -2498 333 3805 -3170 -1047 3904 -1983 -1183 3255 -2043 -1232 3484 -2642 -2173 4251 -1511 -2852
1862 -2852 3279 -1710 -2445 3648 -1590 -3161 3414 -1060 -3449 2678 -580 -2751 2785 -1035 -3928
1877 -3928 2935 440 -3793 2119 369 -3923 2198 479 -4067 2314 1330 -4165 1379 1277 -3294
$$ packed form
1770c273K134K938n553L547L639p761K031N416n997J381M037o042K051M691o843
1785c604P68O466n038j157M750m486J75N857n402j683O808m316k255O244m093
1800i66j355O495n261k875P479k618l668N575k630l147O403k755m108O624j070
1815B123n338N488r77m151O588j620o145O566L71o305N389P48n450N023K45o134
1831c579N082K452o534L467K050n893M051K628p058L771L999p400K342M210o086
1846b498K831L472o975K123M951n887Q00M438n298Q11M716o126M69O424n762j341
1862b852O131m989p35O093n238j571O575m474k389O127l258k171N536l820k893
1877c928O863k495m233N912j750m292O121j719m546O381r84n495N544j02m571
$$ plain form
1892 -3294 1961 1284 -3693 1450 2010 -3516 949 2496 -2997 736 2327 -3357 796 3182 -2839
1907 -2839 159 2855 -2873 386 3131 -2711 430 3416 -2726 -419 3488 -1837 -203 3463 -2302
1922 -2302 -1055 3656 -1474 -1288 3639 -1330 -1511 3320 -1374 -1377 3628 -1108 -1826 3216 -983 -2040
1938 -2040 3212 -394 -2223 2720 -380 -2797 2769 272 -2825 2353 83 -2902 2534 409 -2902
1953 -2902 2073 350 -3260 1702 736 -3016 1548 974 -3100 983 1031 -2895 1030 1725 -3242 192
1969 192 1443 -2911 618 1823 -3031 122 1919 -2763 83 1876 -2630 -53 1951 -2574 -472
1984 -472 2245 -1937 -623 2125 -2035 -842 2232 -1515 -777 2550 -1750 -1236 2570 -1131 -802 2497
2000 2497 -1372 -1081 2727 -591 -1331 2423 -193 -1052 2285 -352 -1562 2701 511 -1625 2078 216
$$ packed form
1892c294N255o77m977N143N60n526M465J547n493L733J591n684M153K386o021
1907b839K998K696n728L259K745n842L141K986o142K307L907n325J634L666n765
1922b302J247M711n130J86M927m969j81M831m694lN005m736p18N042m199j057
1938b040N252l606j829M943l100k417N566k497l097N178k270k985N436k125l311
1953b902M975j723l610M962r66l752M564n74m074M083M8l926L925O95m967L434
1969A92J251m354L529J205m854L153J797m682K846J793m506K577K004m525K102
1984d72K717m182J314K748m160J193L074l747P38L327m300N14L806l701L29L299
2000B497l869K91L808l318p40L754k616q59L337k637j210M263k190k136L703j862
$$ plain form
2016 216 -1514 2491 513 -1503 2179 569 -1548 1930 1021 -1449 1712 941 -1628 1694 1443 -1759
2032 -1759 1214 1675 -1504 920 1138 -1759 1480 1723 -2120 338 1400 -1259 742 1116 -1926 284
2048 284 1640 -1555 -432 1404 -1377 -396 974 -1630 -680 1498 -1515 -1051 1232 -1385 -1174 981
2064 981 -1192 -691 1250 -1473 -1585 1033 -407 -1116 360 -1011 -1124 1100 -716 -1868 747 -157
2080 -157 -1288 343 -948 -1064 1294 -421 -1685 527 -49 -868 475 -30 -840 709 29 -1437 586
2097 586 822 -854 132 268 -680 880 530 -1341 672 916 -631 251 372 -496 980 754 -947 69
2115 69 1276 0 25 570 -240 352 1044 -632 -173 1289 48 -197 491 -250 504 652 -375 -193 763
2134 763 64 -291 79 286 208 354 -402 -561 960 316 -372 42 -254 56 616 -432 -502 676 399 -478
$$ packed form
2016B16j730M005j978k016L682j610k117L478r09k470L161p71k569L322k51l202
2032a759K973M61l179K424K18k897L239K43l843K458J062k659K001L74l042K210
2048B84J356l195J123J836k781R81J370k604R50K178l013M64K283k617K11K155
2064I81k173N01J941k723j12K618j440p09J476j371j13K224j816j152K615r04
2080a57j131J631j291j16K358j715j264K212n76q19J343n05q10J549o80j466K023
2097E86K36j676R86J36r48J560l50j871K013K44j547Q82J21q68J476k26j701J016
2115F9J207j276K5N45q10N92O92j676M59J462j241k45O88p41P54J48j027J82R56
2134G63o99l55L70K07p8J46p56j59J521o44o88M14k96L10N60j048p0J178k77q77
$$ plain form
2154 -478 -115 -37 269 307 -81 -471 107 579 -111 -370 261 395 197 -231 -390 455 578 -18 -200 -20 486
2175 486 271 -197 -1 114 294 67 -512 -46 602 164 -292 -202 -114 468 166 -405 -139 531 109 -607 -158
2196 -158 149 23 275 -494 -648 594 188 -652 -65 -100 -117 10 -693 -731 435 166 -750 -427 -43 -293
2216 -293 60 -241 -860 238 488 -900 -397 199 -451 18 -162 -1148 295 565 -815 -431 331 -300 -91
2235 -91 165 -588 120 975 -442 -679 732 -44 49 386 -740 -47 1060 -495 -507 858 42 25 732
2254 732 -375 -71 1375 -17 -715 929 540 -419 794 -69 -513 1488 259 -961 995 713 -346
2271 -346 609 -62 -487 1328 563 -974 654 709 -600 373 470 -678 884 793 -1444 329 1050 -927
2289 -927 262 543 -1187 489 752 -1281 0 942 -748 -319 409 -1041 -21 1191 -1367 -611 1095
$$ packed form
2154d78L63P8L06L8l88l90N78M72o90k59O31J34j98m28j59Q45J23n96j82J80N06
2175D86k15m68J96J15J80k27n79M66O48m38m56R0Q8N82l02n71K66O70m22p16M49
2196a58L07j26K52p69j54J242m06q40N87l5j7J27p03l8J166k69r16L23L84k50
2216b93L53l01o19J098K50j388N03N96o50M69j80r86J443K70j380L84P62o31K09
2235i1K56p53P08Q55j417k37J411p76R3L37j126O93J107j555j2J365q16j7P07
2254G32j107L04J446j392o98J644l89r59J213q63m44K001j229j220J956k82j059
2271c46R55o71m25J815p65j537J628N5j309R73R7j148J562r1k237J773P21j977
2289i27J189K81j730J676K63k033J281R42j690M29P28j450J020J212k558P56J706
$$ plain form
2306 1095 -795 -518 733 -1007 -275 1169 -1284 -788 1365 -606 -680 711 -759 -424 1262 -812
2322 -812 -1259 1070 -220 -1155 733 -403 -863 1321 -485 -1508 1247 33 -1254 1049 -65 -965
2338 -965 1271 -9 -1355 1140 662 -1242 794 557 -1213 1144 647 -1436 905 1260 -1396 590
2354 590 963 -1089 844 986 -1504 630 1359 -1064 217 1140 -876 538 1175 -1082 141 1630
2370 1630 -982 -255 1434 -862 -40 1447 -1283 -299 1763 -1090 -486 1365 -790 -445 1252 -831
2386 -831 -709 1381 -532 -1081 1361 -508 -1116 1346 -689 -1250 1487 -495 -1466 1185 -293 -1266 1009
2403 1009 -498 -1516 1090 -111 -1633 700 126 -1459 898 59 -1826 977 448 -1805 539 630
2419 630 -1598 713 562 -1598 646 564 -1551 335 904 -1290 504 947 -1388 252 1210 -1330 157
$$ packed form
2306A095j890K77J251j740P32J444k453M96K153j971p4J391j470L35J686k074
2322h12m47K329j290r35J888j136m60K184j806j023K755j214j287K303j114r00
2338i65K236j280j346K495m78j904K036k37j770K357m97k083K341L55k656J986
2354E90L73k052J933J42k490K134P29k423J281R23k016J414O37k257J223J489
2370A630k612P27J689k296Q22J487k730R84K062k853O04J851k155L45J697k083
2386h31J22K090j913n49K442j869o08K462k035n61K737j982r71K651j478r73K275
2403A009j507j018K606j201j522K333n74j585K357q39j885K803n29k253K344R1
2419F30k228K311j51k160K244q2k115J886N69k194J794M43k335J640R58k540J487
$$ plain form
2436 157 1324 -1199 147 1369 -1200 133 1454 -1181 -129 1521 -941 -131 1462 -813 -292 1601
2452 1601 -726 -614 1693 -553 -787 1614 -440 -729 1708 -355 -935 1575 -390 -888 1396 -210
2468 -210 -923 1453 -144 -1099 1312 108 -1168 1063 260 -1237 1161 284 -1440 1063 416 -1610
2484 -1610 1052 456 -1389 822 562 -1468 595 692 -1472 567 801 -1481 455 876 -1408 405
2500 405 1006 -1311 162 1163 -1295 -104 1095 -1293 17 1161 -1193 3 1213 -1009 -250 1110
2516 1110 -905 -226 1230 -674 -474 1208 -843 -617 1307 -527 -647 1257 -655 -774 1375 -624
2532 -624 -775 1115 -298 -848 1126 -385 -917 1076 51 -1128 978 183 -990 851 5 -1167
2548 -1167 1091 135 -1332 925 413 -974 814 275 -1134 712 282 -1134 456 658 -1018 636
$$ packed form
2436A57J167k523J346J222k569J333J321k635J052J650k462Q10J593k275N21J893
2452A601k327J12K307k246k34K401k054k89K437k063n80K510j965m98K284j606
2468b10p13K376j597r55K411j204j276K231q03j497K398q77j724K503o47k026
2484a610K662n96j845K211k60k030K063R7k164K039K34k282J936M21k284J813
2500D05O01k317J473J001k458J191J199k388J310J144k354J196J210k222P59J360
2516A110k015O79J456j904K00J682k051K26J924j834j20J904j912j19K149j999
2532f24j51J890j413n50J974j511n32J993j025j179K106p95j173J841q46j172
2548a167K258r56j467K257n12j387J788n39j409J846m30j416J590K02j676J654
$$ plain form
2564 636 691 -1050 524 881 -1257 314 864 -1146 225 784 -1076 223 931 -908 58 983 -786
2581 -786 32 908 -815 33 1084 -803 -412 1147 -597 -528 1043 -721 -490 1088 -561 -645 1077
2598 1077 -304 -597 822 -321 -472 988 -413 -787 908 82 -773 848 -22 -680 965 -122 -761
2615 -761 800 187 -781 551 -37 -647 801 234 -863 542 491 -629 219 354 -759 462 544 -1006
2633 -1006 341 700 -763 165 532 -624 402 505 -898 238 571 -640 -28 614 -416 210 598
2650 598 -709 -3 783 -488 -216 573 -419 -147 762 -630 -299 820 -487 -302 518 -354 -110 553
2668 553 -497 -431 560 -234 -562 275 -73 -512 516 -311 -540 567 -93 -553 330 -33 -388 456 -358
2687 -358 -581 330 84 -483 324 173 -165 349 76 -481 339 314 -420 90 263 -309 258 82 -451 295
$$ packed form
2564F36N5j741J574L57k138J571N50k010J371N59j860J299P08j839R66R25j769
2581g86Q18Q76j723Q48J051j887L91J559j744O9J571j764K31J578j649q4J722
2598A077j381k93J419j143j51J460j401l74J695q26q55J621q70o58J645j087o39
2615g61J561o13r68J332n88o10J448n67j097J405n1j120Q48J35j113J221Q2j550
2633a006J347L59j463R28L67j156J026J03j403J136L33j211O12O42j030O26L88
2650E98j307P06P86j271K72P89r92K72R09j392L31J119j307J85Q20q72K44O63
2668E53j050O6R91p94l28Q37l48m39J028q27k29J107o60m60Q83l63l55Q44q14
2687c58k23R11k46n67Q07j51l38N14k73n57Q20k5p34N10J73n72N67j76n33P46
$$ plain form
2707 295 508 -210 32 246 -140 260 253 -425 117 440 -238 -307 342 8 53 394 -235 69 535 -94 -232
2728 -232 324 79 153 126 -206 29 375 -56 -308 155 79 -27 32 -70 -97 326 -49 -465 71 -126 -182 10
2750 10 -385 -270 53 20 -254 -130 106 -7 -176 -210 -26 -99 -51 -373 -190 -11 -168 -94 -235 -233 159 -155 -211
2773 -211 -75 58 137 -90 -157 42 -13 206 -96 -217 83 246 -26 -15 66 95 195 112 29 21 309 249 -143 219
2797 219 303 134 226 82 80 410 193 -65 353 314 -13 38 104 81 342 234 -14 170 443 -158 55 200 -114
2820 -114 153 267 -401 163 323 -46 -35 29 -253 145 122 -335 -204 190 -134 -166 22 -205 -161 181 -456 -353
2842 -353 229 -291 -316 170 -356 -238 125 -485 -421 179 -119 -530 -77 -228 -225 114 -181 -480 162 23 -681
2863 -681 82 -99 -459 172 -64 -367 308 45 -303 300 37 -367 235 92 -465 373 457 -424 205 336
$$ packed form
2707B95K13p18K42K14l86M00po78N42L23o78o9O49l34M5L41o29L04M66o29j38
2728b32N56k45P4k7l32K35L46m31k52M63p6j06N9j02k7M23l75m16N36j97n6J92
2750A0l95J15L23l3k74J24K36j13j69l4J84p3M8l22J83J79j57P4j41KL92l14n6
2773b11J36J33P9k27o7J99n5K19l02j21L00J63k72J1Q1K9J00q3q3qK88o0l92L62
2797B19Q4j69R2j44kL30k17k58M18l9l27N1O6k3K61j08k48J84K73o01K13J45l14
2820a14K67J14o68N64J60l69J1O4k82L98k3m57J31L94l24l2J88k27M4L42o37J03
2842c53N82n20k5M86n26J18L63o10O4O00k98m11M53j51LL39k95k99O42j39p04
2863f81P63j81l60O31k36l03O75k63l48O03k63m04O02j43n57Q38Q4q81O29J31
$$ plain form
2883 336 -301 331 439 -477 153 366 -464 244 562 -214 274 553 -273 228 571 -149 -51 683 -100 148
2903 148 767 -266 -124 808 -228 -182 727 -186 -188 761 -223 -313 830 -191 -419 655 -12 -218 470 -123
2923 -123 -422 601 -75 -619 560 -29 -566 512 -190 -616 566 -50 -640 482 48 -627 312 72
2941 72 -786 139 195 -832 105 240 -701 280 212 -694 204 248 -865 173 419 -630 70 137 -566 41
2961 41 515 -652 -37 504 -522 -35 581 -537 -114 600 -577 -71 735 -471 -239 613 -596 -175
2979 -175 847 -451 -296 696 -299 -303 562 -152 -300 839 -88 -445 869 -27 -509 867 -139 -448 803
2998 803 44 -447 756 116 -412 665 224 -619 617 276 -700 451 224 -607 504 314 -651 520
3016 520 403 -737 348 488 -878 329 316 -754 149 450 -790 209 508 -722 37 583 -786 -92
$$ packed form
2883C36o37O32J08r16O30K13q30P08L18p76M88K79q26N01L43p20R8P34p83K48
2903A48O19j033J42R32j036M6R09r13kR49r84r0J143j021k28J074o67k06O88n93
2923a23k99J023o76n44J179n89n37J078p02m26J182o16n90J122m34o75R39k40
2941G2q58R25N6j027R37J35r41R81o8r06Q98M4j113J038K46j049P00O7p03O07
2961D1M74j167O15N41j026M87O16j118M23P14j177N06Q06j206K32Q52j209M21
2979a75J022j298J55R92r95mQ65p14j48J139r27l57J314q96m82J376j006l09J251
2998H03p59m91J203o40n28J077m41q43J236l41r76J151k27q31J111j90r65J171
3016E20j17j140J085J40j366J207j3j070R03L01j240R99K99j230P59N46j369O94
$$ plain form
3034 -92 743 -792 -216 658 -817 -209 764 -554 -232 612 -624 -276 511 -536 -213 659 -387 -373 603
3053 603 -326 -548 592 -368 -577 784 -248 -581 717 -310 -610 603 16 -473 751 29 -637 633
3071 633 76 -573 589 112 -654 651 252 -612 567 413 -694 536 366 -540 418 375 -797 514
3089 514 490 -632 395 313 -568 272 567 -632 151 563 -370 103 653 -588 83 697 -676 -101 717
3108 717 -603 -77 572 -481 -95 619 -532 -237 649 -367 -478 473 -338 -462 545 -430 -573 696
3126 696 -388 -651 435 -367 -564 562 -376 -598 494 -156 -621 439 -180 -704 551 -65 -612 435
3144 435 49 -590 502 121 -791 392 84 -660 353 177 -713 295 349 -434 254 255 -511 241 609 -564
3164 -564 164 574 -555 399 592 -540 270 828 -535 206 466 -473 252 536 -274 139 607 -228 -121
$$ packed form
3034i2Q35j535N76Q74j475O08R73j318L22Q44j236L48P87j047L23Q72j046J4R76
3053F03r29k22J140r60k09J361j032l33J298j027l00J213n87m89J224p22o66J270
3071F33n57o49J162m77p66J305l99q64J179j54j107J230j70r06R58m3j172J311
3089E14k4j122J027q2q81Q40K95j199P83M12r33M73N50j241O71O14j373N75Q18
3108G17j320N26O49j053L86P14j151K95Q86j016j11R51q11j24J007r75j43J269
3126F96j084k63J086q02j97J126r38k22J092o50m65J060o19n24J255o16n47J047
3144D35l86o39J092l81r12J183l08p44J013j76q90J008N4p83O88Jp66P52L68j173
3164e64P28M10j129R54J93j132Q10N58j363P41K60r39P25K84q10M13M68q35J07
$$ plain form
3183 -121 653 -221 -169 755 -274 -187 760 -221 -105 758 -143 -88 475 -262 -243 565 -149 -408 587 12 -178
3204 -178 567 -181 -470 415 38 -664 266 -10 -433 345 27 -554 291 -65 -658 36 21 -563 101 -16
3224 -16 -553 92 259 -505 -42 214 -396 77 118 -473 109 372 -663 -21 225 -349 -20 185 -520 -22
3244 -22 237 -390 -31 280 -261 -171 399 -256 -143 538 -237 -29 492 -116 -55 395 -101 9 405 -165 -296
3265 -296 315 203 -128 317 -98 -232 431 -5 -141 454 104 -251 249 2 -121 398 46 -180 306 50
3285 50 -108 174 18 -91 223 238 -264 85 3 -209 -25 97 -222 153 81 -303 5 77 -289 40 75 -287
3307 -287 92 2 -211 -137 27 -218 -264 104 -183 -113 163 -280 -246 209 -128 -140 -25 -268 -49 123 -269 -23
3329 -23 129 40 -63 211 27 -111 150 -126 -178 199 184 -119 -46 180 79 168 21 -159 266 84 -4 -36 145
$$ packed form
3183a21P74q74N2R24j029Q7R47r81J16Q63r01N5N63p37J9Q08p14k59R95n75j90
3204a78P45p48k89Q85l77p02R30k76m23P78l18n81Q45l56n93O94j5n84O64j17
3224a6n37O45J67p64M63K56o10M73M1n91N82K63j035O42K46n74L29K05p05M98
3244b2K59o27L59L11n41R0N70o55J13O81p75K08N21o08O1M50m96J10L96n70j31
3265b96O11j12l31M45m15j34O63m36j36N95l50l55N00k47j23N19l52k26M86k56
3285E0j58K82j56j09L14J5n02L49q2k12J84J22l19L75p2l84L08P2l66L29L5l62
3307b87L79r0k13P4J64k45m6L68k87P0K76m43L4M55l37j2J15k43K19J72l92K46
3329b3J52q9j03K74j84j38K61k76n2L77j5l03P3K26j01Q9j47j80M25j82q8l2J81
$$ plain form
3352 145 -24 96 12 -57 85 268 -14 59 174 123 75 114 -72 131 103 -52 151 62 201 20 15 -25 112 148
3376 148 84 -77 -15 77 89 -7 137 35 166 72 -71 -152 117 60 -76 -86 50 -98 -40 -55 -139 53 86 -208
3400 -208 6 31 -126 112 -203 -198 59 71 -155 -89 -104 -65 -116 -89 -221 71 179 -197 -90 88 -272 -141 79
3423 79 -256 33 96 -211 -75 135 -141 3 91 -202 -87 112 -131 -179 138 20 22 218 -224 43 250 38
3445 38 -92 159 -157 -66 130 -108 85 116 24 -137 261 120 -126 260 136 -164 315 102 -330 240 64
3466 64 -207 143 -64 -82 187 113 -168 124 -45 -116 237 123 -169 92 351 -388 71 283 -239 107 189 -283
3488 -283 234 303 -254 46 189 -218 -33 190 -299 9 257 -165 -169 256 -127 -203 257 -244 -100 244 -256
3509 -256 -120 177 -300 -212 201 -145 -266 265 -118 -121 197 -90 -242 344 -98 -339 333 -84 -359 345 -92
$$ packed form
3352A45j69J20q4o9J42J83k82P3J15n1m8L9j86K03k8j55K03q9J39j81nm0J37L6
3376A48o4j61O2R2J2r6J44j02J31r4j43q1K69n7j36j0J36j48N8j5q4J92L3k94
3400b08K14K5j57K38l15NK57J2k26O6j5L9n1K7j32K92J08l76J07J78l60J31K20
3423G9l35K89O3l07J36K10k76J44Q8k93J15J99k43m8L17j18KJ96m42K67K07k12
3445C8j30K51l16R1J96k38J93L1r2j61L98j41k46L86j24l00M79k13m32N70j76
3466F4k71L50k07j8K69p4k81K92j69p1L53j14k92K61K59p39M59K12n22L46Q2m72
3488b83N17O9n57L00J43m07J85K23m89L08K48m22mM25l83p6M60n01J44L44n00
3509b56J36K97m77Q8M13l46j21N31l83lL18k87j52N86m42k41O72m17k75P04m37
$$ plain form
3530 -92 -258 395 -44 -353 324 139 -329 175 185 -290 257 111 -226 137 101 -232 268 169 -348 146 252
3551 252 -352 199 385 -514 70 148 -394 70 297 -272 -13 248 -222 -144 267 -270 -39 410 -352 -16 457
3572 457 -380 -60 347 -314 -86 408 -199 -135 305 -118 -250 247 -179 -231 333 -148 -361 445 -84 -312 358
3593 358 70 -242 377 4 -333 478 119 -302 378 15 -381 326 103 -382 219 155 -337 234 107 -424
3613 -424 297 135 -359 200 256 -424 96 96 -359 162 191 -325 76 350 -282 67 293 -324 74 235 -274
3634 -274 -52 390 -346 -90 360 -312 -114 317 -227 -212 243 -352 -197 416 -169 -163 383 -124 -303 269 -253
3655 -253 -340 444 -132 -344 368 -242 -295 358 -167 -268 348 -64 -264 315 -91 -376 420 32 -421 280 73
3676 73 -481 342 134 -416 272 161 -525 261 236 -264 250 275 -446 145 151 -460 165 472 -306 227 288 -290
$$ packed form
3530i2j66O53m39l09O77j85m68N04J0m75N47j46l37L63l6l33N00r9n17M94J06
3551B52o04N51J86q99N84P8n42M64K27n69K59K61m70P8M11n37K31M49p62L36M73
3572D57q37L20M07o61K28M94o07O4M40m23j32M97m26n2N64m81k13Q06n29k28O70
3593C58k88l12O19l73l37Q11l59m21O80l63l96P07k23m85O01o4m92N71j27n31
3613d24P21j62m94N59N6o80N20%m55N21K9n16M01K74o32L49K26o17L98J61n09
3634b74K22M42p36K56M50o72J98M31n44J5M55n95J55O13n85ON46n07j79N72n22
3655b53q7P84n76k12P12o10n3O53n25j01O16m12k00N79m06k85P96l88m53P01k07
3676G3n54Q23k08n50O88j11o86P86k5n00N14K5p21N91Oo11O25L07p78N33O1n78
$$ plain form
3698 -290 186 402 -372 84 463 -408 14 337 -324 -31 357 -339 -98 291 -313 -59 337 -129 -125 547 -257
3719 -257 -220 446 -57 -209 433 -156 -261 441 -109 -208 373 -174 -325 388 -37 -303 285 -17 -358 255 -31
3740 -31 -306 318 -99 -279 270 30 -461 164 84 -395 75 8 -447 262 187 -519 -141 174 -368 138 72 -414
3762 -414 39 325 -423 -42 295 -289 99 32 -392 10 444 -441 -74 339 -403 -79 186 -223 19 313
3782 313 -159 -241 184 -100 -130 228 -119 -196 341 -124 -256 318 -6 -98 157 91 -123 248 38 -140 208 47
3804 47 -134 255 87 -323 483 150 -331 391 169 -269 256 138 -294 304 -2 -156 141 86 -160 119 41
3825 41 -225 210 92 -306 32 214 -320 102 95 -353 36 64 -242 66 212 -239 -2 60 -228 45 207 -199
3847 -199 -1 244 -289 -56 170 -167 -64 293 -189 -4 204 -117 11 163 -43 -153 45 -97 -67 339
$$ packed form
3698b90M76K16p74M56L79q71M22L23o61K93L88o96K41L89o04K54L96m66MO72q04
3719b57L7O66n03j52O42n89j05P02n50r9N81n47j51P13m25k66N88l02l41O13k86
3740c1k75O24m17j80N49k40m91O25q0m79M70o7m55P09p5p06L78L15n42N06o6m86
3762d14M53K86p48L81L37n84L88o7m24M02M34q85L67M13p42L24K65m09K42K94
3782C13m72q2M25k84l0L58l47p7N37m65j32N74l24r2K55o6k14L71k10j78L48j61
3804D7j81L89j68m10Q06l33m81P22k22m38N25j18m32N98l06j54K97n5k46K79p8
3825D1k66M35j18l98L38J82n34M22pm48L89K8l06L08J46m51K37O2k88K73J62m06
3847a99J98K45n33K33K26l37J03L57m82J85K08l21J28J52k06j10J98j42L0M06
$$ plain form
3867 339 -35 -179 84 -59 -100 126 -49 -296 152 48 -95 224 25 -196 -3 42 -296 79 8 -97 -50
3888 -50 -6 -211 -55 114 -202 105 20 -153 150 32 -206 203 32 -222 -19 90 -159 -41 69 -90 -50
3909 -50 87 7 59 36 -6 5 -32 22 39 67 -100 49 18 -72 20 157 2 -129 132 -75 5 221 89 0 110
3934 110 26 44 24 -12 -15 53 -53 -119 150 -14 138 57 -29 92 116 4 -26 51 43 2 12 156 -27 75 130 -11
3960 -11 -10 99 4 108 109 -20 37 136 -102 125 87 160 -91 74 72 -56 47 147 -75 -49 -39 -5 67 188 -88
3985 -88 114 -112 -45 16 -1 -88 -8 -39 -74 -142 48 -152 8 99 81 4 143 -5 55 7 59 -110 -130 -73 -94 -48
4011 -48 31 -146 0 6 -178 101 -40 -239 -32 33 -112 39 72 -62 19 -30 -87 9 110 -80 -84 97 2 -70 199
4036 199 -139 -36 236 21 152 -28 50 -12 -17 -75 58 32 41 -95 108 19 88 174 148 -32 223 40 -118 282
$$ packed form
3867C39l74j44K63j43m1K26j75k47M48j04j43L19j99k21J93M5l38L75p1j05M7
3888e0M4k05J56J69l16L07q5j73L03j18k38M09j71k54K03J09k49J18J10j59M0
3909e0J37q0N2k3m2J1l7N4J7K8j67J49l1r0R2J37j55j31K61k07Q0K16j32q9J10
3934A10q4J8k0l6lO8j06o6K69j64J52q1q6J21K4j12l0P7qm1J0J44j83J02N5j41
3960a1JJ09r5J04Jj29N7R9k38K27l8P3k51J65kj28J03J00k22K6J0L4P2J21k76
3985h8K02k26O7O1j7q7Q0l1l5o8J90k00J60R1j8p7J39j48O0m8N2j69k0N7k1M6
4011d8P9j77J46Oj84K79j41j99K07O5j45J51L3j34Q1m9n7R6J01j90mJ81r5p2K69
4036A99l38J03K72k15J31j80P8o2nn8J33k6Rj36K03q9O9Q6k6j80K55j83j58M00
$$ plain form
4060 282 168 -29 140 100 -47 308 40 -18 127 159 -97 63 150 -172 45 265 -135 90 49 -37 -44 133 -169
4083 -169 101 93 -148 -21 117 -107 84 56 -225 33 31 -160 -13 208 -182 -64 169 -111 -196 248 -155 -142
4105 -142 36 -249 -174 108 -247 -283 168 -187 -119 161 -87 -164 218 -184 -112 106 -140 -408 122 -225 -255 170
4127 170 -36 -80 192 115 -156 86 80 -159 182 -50 -248 178 155 -251 150 76 -229 170 208 -357 240 75
4149 75 -110 98 213 -165 168 128 -168 58 229 3 188 197 -107 119 377 -120 70 299 -184 60 259
4170 259 -29 -15 349 -191 -19 254 -4 38 219 -149 -3 359 -127 -76 304 -118 -93 140 -90 -222 168
4191 168 -107 -186 236 -126 -306 227 -79 -170 143 -131 -228 193 -125 -405 143 -102 -389 88 31 -378 52
4212 52 55 -404 159 -97 -441 5 107 -288 89 74 -243 -70 55 -281 -17 169 -426 -61 211 -361 73
$$ packed form
4060B82j14j97J69m0j47L55k68n8J45L2k56J60Q7l22K17K20m00K25m1q6pJ77l02
4083a69K70qk41J27J38k24J91k8k81K58kj91J47K21l90J18K33k80q5M44m03J3
4105a42J78k85P5K82l55l6M51l55O8K80k48p7L82m02P2K18k46k68N30l47l0M25
4127A70k06m4K72p7k71K42ok39L41k32j98M26k3m06M01p4l05L99L8n65N97j65
4149G5j85K08J15l78L33m0k96K26J71k26J85Rl04K26K58m97J90K29m83K44J99
4170B59k88J4L64n40J72K73k58M2J81l68J46L62m86N1L80m22K5K33k30j32L90
4191A68k75p9M22l62j80N33l06r1L13k74r7M21l18k80N48k45k87M77n7m09M30
4212E2Lm59N63k56l44M46J02l95L77j5l17J73J25l36K64J86n95L65K72n72M34
$$ plain form
4233 73 215 -238 95 285 -250 -5 300 -141 23 261 -72 1 279 -113 -68 390 -31 -14 336 -42 -59 311
4255 311 -13 -107 384 18 -40 368 -41 -139 491 61 -129 320 79 -184 256 -66 -224 211 0 -214 154
4276 154 242 -270 245 58 -199 293 -40 -372 257 95 -120 225 -114 -213 58 124 -365 -10 106 -295 -41
4297 -41 181 -385 -56 167 -353 -56 192 -235 95 96 -150 -141 329 -208 -47 195 -114 -94 275 -195 -168 256
4319 256 -131 -249 461 -16 -186 239 -112 50 353 -192 -198 239 -67 -188 175 -70 -233 246 7 -236 156
4340 156 45 -151 227 156 -214 179 -31 -272 230 -18 -346 82 124 -87 179 60 -280 137 167 -204 90
4361 90 175 -253 179 312 -169 190 249 -247 -34 179 -242 61 135 -303 113 204 -86 -30 278 -171 -58 307
4383 307 -223 60 271 -129 -149 276 -141 -169 228 -118 7 100 -212 -103 75 22 -55 152 -69 -337 214 -3
$$ packed form
4233G3J42m53L33J90n35K45L05m41J64K38l33P3K78l92M5M58m21J7L50l78j7L70
4255C11l24r4M91l66n8M08m09r8O30m30j90M49k41k63M40l22j58M35k11k14L68
4276A54Q8n12N15j87k57M92l33l32O29j62k15L45l39r9K71O6m89L55J16m01K54
4297d1K22n66L29K23n20K97K48m27L30Jk46RM70n37J61K42l09K0L69m70K7M24
4319B56l87j18P10m77j70M25l51J62L03n45oM37l06j21L63k45j63M79k39k43L92
4340A56j11j96L78p1l70L93k10k41N02k48l28M28M2k11K66j19l40M17L0l71K94
4361I0Q5m28M32J33m81L59N9m96K13K13m21L03P4m38M16R1k90N6L08m49J13L65
4383C07n30K83K11m00k0M25m17k8L97l46J25R3l12J09J78n3p7K07k21k68N51k17
$$ plain form
4405 -3 -265 285 -24 -279 284 29 -91 143 2 -186 116 30 -84 125 -51 -237 61 126 -132 -14 89
4426 89 -182 97 12 -204 25 157 -305 -4 103 -47 95 127 -145 200 95 -93 -96 305 -135 -89 237 -84
4448 -84 120 192 -50 31 279 -171 82 239 -126 26 166 -21 17 41 -77 -151 81 130 -108 90 55 -120 113
4471 113 43 5 161 -119 -229 112 93 -71 132 28 -154 98 -123 -53 84 131 -93 152 -34 -153 2 111
4493 111 -219 23 -80 -169 73 -14 -51 63 -4 -119 -67 102 -14 3 -33 -145 62 5 -204 88 172 -107 -69
4516 -69 67 13 28 111 -149 49 83 -11 16 28 -124 7 -74 58 -46 75 -58 -82 48 44 33 126 -46 -42 68
4541 68 33 -84 10 53 -85 97 7 -2 2 39 -72 -44 107 12 58 52 -71 52 -88 -67 0 81 -63 44 -9 63 41
4568 41 130 -20 -33 34 16 14 -58 107 -53 21 72 137 54 -47 148 133 -24 -94 68 -66 156 27 -12 43 107 -40
$$ packed form
4405ck62N50l09k55N63k55j20K34j41j88L02q6j14K09j76j86K98O5k58J18J03
4426H9k71K79q5k16K29J32m62L01J07j50J42L2k72L45j05j88lM01m40M6L26l21
4448h4K04P2k42Q1K48m50K53J57l65J52J40j87L8K4j18p4K32M9k38J98l5j75K33
4471A13p0l8J56k80j10L41j9j64K03j04j82K52k21P0J37M7k24K45j86j19J55J09
4493A11l30K42j03q9K42q7l7J14o7j15N2J69j16J7l6j12K07n7k09K92Q4k79L8
4516f9J36n4J5Q3k60J98L4r4K7J2j52J31q1J32j04J21j33k4J30mj1R3j72MJ10
4541F8l5j17R4M3j38J82r0rML7j11K8J51r5M6oj23J23j40K1O7Q1j44J07n3P2k2
4568D1Q9j50j3O7j8kp2J65j60P4N1O5q3j01J95j5j57p0J62j34K22j29l9N5O4j47
$$ plain form
4594 -40 87 -73 57 42 57 197 24 3 34 -47 -84 -22 -16 106 -184 -93 -51 -36 -92 -179 -22 -16 -176 10 7 -177
4620 -177 31 -56 -145 -43 -142 -15 8 -69 -99 -42 -30 -110 -17 -81 -149 -63 -41 -113 -111 32 -232 -56 2 -71 32 42 46
4647 46 -138 54 -129 25 34 144 19 153 48 -82 184 67 4 11 -96 -50 287 -83 -37 218 61 -44 175
4670 175 34 -55 159 14 -36 101 22 -121 173 149 -282 98 151 14 50 104 -165 326 99 -37 55 132 -31
4693 -31 15 20 -100 74 138 -139 -27 7 -107 -8 202 -195 41 24 -207 -74 80 -196 -114 122 -239 -48 79
4716 79 -103 -117 153 -69 -206 64 -91 -255 68 -80 -143 123 -138 -213 78 -165 -171 146 -65 -277 21 -51
4738 -51 -209 104 96 -140 -44 68 -193 114 15 -231 217 6 -239 106 -56 -61 44 -38 -201 40 179 -128 63
4761 63 116 -42 64 313 -172 9 178 -88 172 252 12 51 202 -159 -50 148 -73 18 186 -88 -132 270
$$ packed form
4594d0J27j60J30j5J5J40j73k1L1q1l7O2OJ22k90R1M2J5n6q7J57Oj60J86lj84
4620a77K08q7q9J02r9J27K3p7l0N7J2q0R3o4o8Q6K2p2KJ43k64J76N8p3J03J0M
4647D6j84J92j83J54RJ10j25J34j05j30K66j17o3Pj07M6L37l70M6K55j57j05K19
4670A75j41q9K14j45n0J37p9j43K94k4m31L80N3j37L6N4k69M91k27j36R2P7j63
4693c1M6Nj20J74O4k77J12L4j14R9K10l97K36j7k31J33J54k76Q2K36l61J91J27
4716G9j82j4K70k22j37K70j55j64L23j48o3K66k61p5K91k43oL17k11k12K98p2
4738e1j58L13qk36R6J12k61L07r9k46M48k11k45L45j62nJ05q2j63K41J39l07J91
4761F3N3j58J06K49m85J81J69k66K60Q0k40L9J51l61J09J98k21R1J68k74m4M02
$$ plain form
4783 270 80 -33 271 122 -51 301 -99 37 241 -82 -82 286 -77 -87 123 -19 -76 115 -134 -190 216 134
4805 134 -181 152 -175 -158 80 -40 -422 274 -61 -349 165 -70 -265 -13 78 -218 62 13 -206 28 -53
4826 -53 -214 82 93 -247 -11 113 -273 -151 66 -222 85 172 -337 56 26 -114 -90 194 -219 122 137 12
4848 12 -21 314 -21 -208 225 -96 45 295 -149 4 254 -58 -88 273 -20 -66 263 -3 113 160 99 -148
4870 -148 319 11 -166 295 53 -255 354 51 -202 257 -4 -181 248 68 -135 133 25 -55 25 97 -113
4891 -113 48 207 -174 160 54 -306 63 112 -121 87 102 -239 15 25 -224 -71 59 -174 -19 117 -253
4912 -253 -111 276 -233 -127 153 -192 -140 160 -166 -95 314 -222 -53 67 -13 -207 -28 -149 -46 166 -84
4933 -84 -168 190 -4 -137 215 70 -166 280 83 -181 165 -112 -204 147 -46 -24 222 63 -126 122 95 -173
$$ packed form
4783B70j90j13L04j49j73L52m00J36K04l23%L68l63j0K10j42n7J91k49n6M06q2
4805A34l15L33l27J7K38j20l82O96l35k88N14k35j95K52R1k96K80m9k19K34q1
4826e3j61K96J1l40K36J24l86J22K17k88L07Q7n09L93l0j40K4K84m13L41J5j25
4848A2l3L35l35j87M33l21J41K50m44J53K50l12l0L61k93m6L29k66J16M7o1k47
4870a48M67l08j77M61k42l08O09l03k53M59k61j77M29j80k03K68j08q0Q0P2k10
4891a13J61J59l81L34j06l60L69M9k33K08J5l41K54J0k49J53J30k33J55J36l70
4912b53J42L87n09J06K80l45N2L00l26P1M09n36J69J20q0j94J79j21J03K12k50
4933h4q4L58j94j33L52j45k36M46j97k64L46k77r2L51j93K2K46j59j89K48k7k68
$$ plain form
4955 -173 90 50 -157 156 203 -224 182 223 -206 202 134 -129 154 141 -7 110 74 -44 70 58 -124 53
4977 53 34 -160 -97 171 -112 37 250 -174 57 202 -79 -62 54 -126 2 53 -74 -2 116 -138 -64 330
4999 330 -116 -63 96 13 -108 148 -45 -162 100 -79 -46 64 -102 -198 85 -58 -100 75 -26 -41 83 97
5021 97 -161 33 -52 -199 66 43 -118 59 0 11 134 106 -196 -51 10 -79 95 132 -124 29 89 -30 87
5044 87 141 16 94 73 125 77 66 -150 106 250 24 84 234 -37 148 204 -77 138 174 151 30 151 87 -45
5068 -45 137 20 -26 162 10 -58 139 36 -137 52 -75 -134 108 71 -30 190 38 -133 83 101 -203 133
$$ packed form
4955a73K63m0k07L13M7m27M06M1m29M08o8k63K83j3j48J17l6j18J14j2j82J77
4977E3j9j94O3K68k83J49K13m24K31J45k81J7J16j80J28N1j27P2J18k54P4L94
4999C30m46N3J59q3j21K56j93j17K62j79L3J10j66r6K83j43m2J75j01j5J24J4
5021I7k58J94q5j47K65k3j61J77n9J1J23k8l02J45O1q9J74L7k56J53O0j19J17
5044H7N4j25P8k1N2m8j1k16K56J44k26O0J50k71J85N6k81K15L6k3j21J21o4j32
5068d5J82j17m6J88j52o8J97j03j73J89j27n9K42l7j01K20j52j71K16J8l04L36
$$ [...]
8191F
##END NTUPLES=NMR FID
##END=
