##TITLE=1H_Pr 12
 CDCl3
 8 sc, 
 6.04.2022
##JCAMPDX= 6.0         $$ Bruker NMR JCAMP-DX V2.0
##DATA TYPE= NMR FID
##DATA CLASS= NTUPLES
##ORIGIN= UXNMR, Bruker Analytische Messtechnik GmbH
##OWNER= root
$$ XWIN-NMR		Version 3.5
$$ Wed Apr  6 13:54:38 2022 Russian Standard Time (UT+4h)  she@DPX200
##.OBSERVE FREQUENCY= 200.131346
##.OBSERVE NUCLEUS= ^1H
##.DELAY= (6, 6)
##.ACQUISITION MODE= SIMULTANEOUS
##.ACQUISITION SCHEME= undefined
##.AVERAGES= 8
##.DIGITISER RES= 18
##SPECTROMETER/DATA SYSTEM= spect
##.PULSE SEQUENCE= zg30
##.SOLVENT NAME= CDCl3
##.SHIFT REFERENCE= (INTERNAL, CDCl3, 0, 15.7039)
##AUDIT TRAIL= $$ (NUMBER, WHEN, WHO, WHERE, WHAT)
$$ ##TITLE= Audit trail, XWIN-NMR		Version 3.5
$$ ##JCAMPDX= 5.01
$$ ##ORIGIN= Bruker BioSpin GmbH
$$ ##OWNER= she
$$ F:/spectra/data/she/nmr/H-F/1/audita.txt
$$ ##AUDIT TRAIL=  $$ (NUMBER, WHEN, WHO, WHERE, WHAT)
(   1,<2022-04-06 13:53:19.00 +0400>,<she>,<DPX200>,
      <created by zg, POWCHK disabled, PULCHK disabled
       configuration hash MD5:
       00 E9 B6 7A A2 85 ED C7 34 08 36 98 17 FE 4E 26
       data hash MD5: 16K
       34 CC 32 D7 4B CA DE 37 08 3A C0 F1 FE E6 54 D7>)
$$ ##END=
$$ 
$$ hash MD5
$$ 5A B8 61 F8 43 B4 09 B0 8F C4 79 86 81 2F C9 2D
##$RELAX= 
##$RELAX= 
##$RELAX= 
##$RELAX= 
##$RELAX= 
##$RELAX= 
$$ Bruker specific parameters
$$ --------------------------
##$DU= <F:/spectra>
##$EXPNO= 1
##$NAME= <H-F>
##$PROCNO= 1
##$TYPE= <nmr>
##$USER= <she>
##$AMP= (0..31)
100 100 100 100 100 100 100 100 100 100 100 100 100 100 100 100 100 100 
100 100 100 100 100 100 100 100 100 100 100 100 100 100 
##$AQSEQ= 0
##$AQ_mod= 1
##$AUNM= <au_zg>
##$AUTOPOS= <>
##$BF1= 200.13
##$BF2= 200.13
##$BF3= 200.13
##$BF4= 200.13
##$BF5= 200.13
##$BF6= 200.13
##$BF7= 200.13
##$BF8= 200.13
##$BYTORDA= 1
##$CFDGTYP= 0
##$CFRGTYP= 5
##$CHEMSTR= <none>
##$CNST= (0..31)
1 1 145 1 1 1 1 1 1 1 1 1 1 1 1 1 1 1 1 1 1 1 1 1 1 1 1 1 1 1 1 1 
##$CPDPRG= <>
##$CPDPRG1= <>
##$CPDPRG2= <>
##$CPDPRG3= <>
##$CPDPRG4= <mlev>
##$CPDPRG5= <mlev>
##$CPDPRG6= <mlev>
##$CPDPRG7= <mlev>
##$CPDPRG8= <mlev>
##$CPDPRGB= <>
##$CPDPRGT= <>
##$D= (0..31)
0 1.2 0 0 0 0 0 0 0 0.06 0 0.03 0 0 0 0 0.0002 0 0 0 0 0 0 0 0 0 0 0 0 
0 0 0 
##$DATE= 1649238798
##$DBL= (0..7)
120 120 120 120 120 120 120 120 
##$DBP= (0..7)
150 150 150 150 150 150 150 150 
##$DBP07= 0
##$DBPNAM0= <>
##$DBPNAM1= <>
##$DBPNAM2= <>
##$DBPNAM3= <>
##$DBPNAM4= <>
##$DBPNAM5= <>
##$DBPNAM6= <>
##$DBPNAM7= <>
##$DBPOAL= (0..7)
0.5 0.5 0.5 0.5 0.5 0.5 0.5 0.5 
##$DBPOFFS= (0..7)
0 0 0 0 0 0 0 0 
##$DE= 6
##$DECBNUC= <off>
##$DECIM= 32
##$DECNUC= <off>
##$DECSTAT= 4
##$DIGMOD= 1
##$DIGTYP= 9
##$DL= (0..7)
0 120 120 120 120 120 120 120 
##$DP= (0..7)
150 150 150 150 150 150 150 150 
##$DP07= 0
##$DPNAME0= <>
##$DPNAME1= <>
##$DPNAME2= <>
##$DPNAME3= <>
##$DPNAME4= <>
##$DPNAME5= <>
##$DPNAME6= <>
##$DPNAME7= <>
##$DPOAL= (0..7)
0.5 0.5 0.5 0.5 0.5 0.5 0.5 0.5 
##$DPOFFS= (0..7)
0 0 0 0 0 0 0 0 
##$DQDMODE= 0
##$DR= 18
##$DS= 0
##$DSLIST= <SSSSSSSSSSSSSSS>
$$ [...]
##$SUBNAM2= <"">
##$SUBNAM3= <"">
##$SUBNAM4= <"">
##$SUBNAM5= <"">
##$SUBNAM6= <"">
##$SUBNAM7= <"">
##$SUBNAM8= <"">
##$SUBNAM9= <"">
##$SW= 18.0517287032376
##$SWIBOX= (0..15)
0 0 2 0 0 0 0 0 0 0 0 0 0 0 0 0 
##$SW_h= 3612.71676300578
##$TD= 16384
##$TD0= 1
##$TE= 0
##$TE2= 300
##$TE3= 300
##$TEG= 300
##$TL= (0..7)
0 120 120 120 120 120 120 120 
##$TP= (0..7)
150 150 150 150 150 150 150 150 
##$TP07= 0
##$TPNAME0= <>
##$TPNAME1= <>
##$TPNAME2= <>
##$TPNAME3= <>
##$TPNAME4= <>
##$TPNAME5= <>
##$TPNAME6= <>
##$TPNAME7= <>
##$TPOAL= (0..7)
0.5 0.5 0.5 0.5 0.5 0.5 0.5 0.5 
##$TPOFFS= (0..7)
0 0 0 0 0 0 0 0 
##$TUNHIN= 0
##$TUNHOUT= 0
##$TUNXOUT= 0
##$USERA1= <user>
##$USERA2= <user>
##$USERA3= <user>
##$USERA4= <user>
##$USERA5= <user>
##$V9= 5
##$VALIST= <valist>
##$VCLIST= <CCCCCCCCCCCCCCC>
##$VD= 0
##$VDLIST= <DDDDDDDDDDDDDDD>
##$VPLIST= <PPPPPPPPPPPPPPP>
##$VTLIST= <TTTTTTTTTTTTTTT>
##$WBST= 1024
##$WBSW= 4
##$XGAIN= (0..3)
0 0 0 0 
##$XL= 0
##$YL= 0
##$YMAX_a= 187037
##$YMIN_a= -196167
##$ZGOPTNS= <>
##$ZL1= 120
##$ZL2= 120
##$ZL3= 120
##$ZL4= 120
##$ABSF1= 10
##$ABSF2= 0
##$ABSG= 5
##$ABSL= 3
##$ALPHA= 0
##$AQORDER= 0
##$ASSFAC= 0
##$ASSFACI= 0
##$ASSFACX= 0
##$ASSWID= 0
##$AUNMP= <proc_1d>
##$AZFE= 0.1
##$AZFW= 0.1
##$BCFW= 1
##$BC_mod= 2
##$BYTORDP= 1
##$COROFFS= 0
##$CY= 11.3945322036743
##$DATMOD= 1
##$DC= 2
##$DFILT= <>
##$DTYPP= 0
##$F1P= 2.36226072786647
##$F2P= -0.459571619588291
##$FCOR= 0.5
##$FTSIZE= 0
##$FT_mod= 4
##$GAMMA= 1
##$GB= 0.15
##$INTBC= 1
##$INTSCL= 1
##$ISEN= 128
##$LB= 0.24
##$LEV0= 0
##$LPBIN= 0
##$MAXI= 10000
##$MC2= 0
##$MEAN= 0
##$ME_mod= 0
##$MI= 1.114404
##$NCOEF= 0
##$NC_proc= 0
##$NLEV= 6
##$NOISF1= 3.799351
##$NOISF2= 2.8
##$NSP= 1
##$NTH_PI= 0
##$NZP= 0
##$OFFSET= 15.70392
##$PC= 1
##$PHC0= -18026.87
##$PHC1= 6.00078
##$PH_mod= 1
##$PKNL= yes
##$PPARMOD= 0
##$PSCAL= 0
##$PSIGN= 0
##$REVERSE= no
##$SF= 200.130013532006
##$SI= 16384
##$SIGF1= 3
##$SIGF2= 2
##$SINO= 400
##$SIOLD= 16384
##$SREGLST= <1H.CDCl3>
##$SSB= 0
##$STSI= 0
##$STSR= 0
##$SW_p= 3612.71676300578
##$SYMM= 0
##$S_DEV= 0
##$TDeff= 0
##$TDoff= 0
##$TI= <>
##$TILT= no
##$TM1= 0
##$TM2= 0
##$TOPLEV= 0
##$USERP1= <user>
##$USERP2= <user>
##$USERP3= <user>
##$USERP4= <user>
##$USERP5= <user>
##$WDW= 1
##$XDIM= 8192
##$YMAX_p= 0
##$YMIN_p= 0
$$ End of Bruker specific parameters
$$ ---------------------------------
##NTUPLES= NMR FID
##VAR_NAME=  TIME,          FID/REAL,        FID/IMAG
##SYMBOL=    X,             R,               I
##VAR_TYPE=  INDEPENDENT,   DEPENDENT,       DEPENDENT
##VAR_FORM=  AFFN,          ASDF,            ASDF
##VAR_DIM=   8192,          8192,            8192
##UNITS=     SECONDS,       ARBITRARY UNITS, ARBITRARY UNITS
##FACTOR=    0.0002768,     1,               1
##FIRST=     0,             0,               0
##LAST=      2.2672688,     0,               0
##MIN=       0,             -196167,         0
##MAX=       2.2672688,     187037,          0
$$ Real data points
##PAGE= N=1
##DATA TABLE= (X++(R..R)), XYDATA
0@%%%%%%%%%%%%jRj6J6j6J7k4L1l6M3n2O1o9Q2r7J13j30J48j70J95k24K53k83
35a50L21l63M07m53N04n63O26o93P68q51R38j035J144j260J387j528J683j856
53i74K048k260K499k771L080l439L862m362M970n730O706q014R869j2724J7731
68A0491k9055J03497k9609k13460J2201J52124J62979m3318j66305j20090O5802
79i4743J56354Q6685q1202j41798o3487Q5734J27814M2782q4880j15153l6690
90a18584Q7215J13088K3538q7049j09635j4258J01708J06099j798j10450j01269
101a11395K7833J23999Q3496m9201j30681o1348P1474J21974L9002r1400j12042
112h8289j0989R3345R4250p337r8123p4349K5154R0645N8668l8308q3186l9485
$$ y = [0, 0, 0, 0, 0, 0, 0, 0, 0, 0, 0, 0, 0, -1, 8, -8, 8, -8, 9, -15, 16, -20, 23, -29, 32, -37, 45, -52, 61, -69, 79, -91, 104, -120, 133, -150, 171, -192, 215, -238, 266, -297, 329, -364, 404, -447, 491, -544, 600, -660, 727, -801, 882, -974, 1074, -1186, 1313, -1458, 1622, -1817, 2045, -2317, 2653, -3077, 3629, -4385, 5484, -7240, 10491, -18564, 84933, 55324, -158136, -145935, 6189, 169168, 125850, -40455, -160545, -94743, 61611, 148296, 67094, -74704, -138191, -52457, 75357, 118139, 33259, -81894, -118584, -31369, 81719, 105257, 18208, -91427, -105685, -3977, 102122, 100324, -10126, -111395, -83562, 40437, 123933, 74732, -55949, -117297, -45823, 76151, 115153, 23753, -88289, -99278, -5933, 88317, 80980, -17143, -91492, -66338, 24307, 82975, 44667, -38519, -78004]
124g8004M1309P7882L0128m4509o8133k2156M5729O3514J3407m5098n4960r206
136e0097M7798M9644J06m8820m6579O997N1660L6423j3863n0615l0426J8268M6414
149A6910K4596k2081m5100j8483K8248M1561J1863l0182l6109k755K9412L3179
161C1059j272l2380k4393P341L0569J6751j2931k2563j0805J0363J8041N568r800
174E548j2180l396K654P916M567m52m306q020k698M098J2356N504r391j3755j539
189a3094J1839J4675j442j3246j0740L749J5004R679q483j0477n729M012J1923
202G670O81m659n924n363J809M541N670J858p468r364k816J0686J4034j087j5208
217d940j1789N619J9012J3371j2415k0539o761J5366K2010P64j9976j5009J745
$$ y = [-78004, -36695, 41187, 71315, 26806, -41327, -63483, -17754, 45760, 59167, 14069, -40891, -50097, -2299, 47345, 47451, -1369, -47948, -40951, 10709, 47132, 33269, -17346, -47772, -29504, 16910, 41506, 19425, -25675, -44158, -15910, 25651, 37514, 7332, -28777, -31532, -2120, 31059, 29787, -2593, -26986, -19645, 10924, 27675, 14744, -7819, -18624, -8261, 9780, 15348, 5548, -6632, -10028, -7374, 542, 5109, 4657, 351, -7669, -10367, -6269, 6087, 11591, 2200, -11555, -13094, -1255, 13420, 11978, -1268, -12008, -8259, 6745, 16424, 7941, -2536, -8265, -4253, 7670, 8351, 3692, -2232, -7595, -5786, -1245, 4425, 6283, -1185, -10549, -13365, -2679, 11355, 10268, -4940, -16729, -11110, 7902, 21273, 8858, -11681, -18442, -3076, 18934, 19698, -278, -15287, -13542]
230a3542K1723J3285j1767j7808q716J0078J6754L736j1864j3734n028J1107J3182
243G406K532p766j4913j926J2657J2330J973j2448j3581K820J3763J3243l236
256A2854j8036r392P795J5874R847j0005k0208m015J1601J4797L554j6158j3787
269a5279J80J5550J2953l266j6955r315O734J4271Q344r106j3292m661R284J5404
283A0846K495j1098j1196j621J1634J1907p51j2195j0583K345J3934O287m935
296G069j2315p122P665J2514K967p130j3899k077J0570R851r13r566j0433L812
310i007R727R933k836j2795o242P414J0601O923p888j2621j630N969J2489K607
324A2644j0497j0334l37Q219J1422k927j2303p647K089J2346O259m287j0832o392
$$ y = [-13542, 8181, 21466, 9699, -8109, -16825, -6747, 10007, 13743, 1879, -11855, -16883, -5776, 7406, 9938, 2172, -12741, -14667, -2010, 10320, 12293, -155, -13736, -10916, 2847, 16090, 12854, -5182, -14574, -6779, 9095, 18942, 8937, -11271, -15286, -3685, 11112, 14666, -1492, -15279, -15099, 451, 13404, 10138, -6817, -16132, -9398, 4873, 13217, 4111, -9181, -13842, -4558, 10846, 13341, 2243, -8953, -10574, 1060, 12967, 12216, 21, -10562, -8217, 5717, 12004, 7069, -5246, -12368, -4703, 7811, 10778, 3648, -10251, -12328, -1758, 8093, 7180, -2386, -12819, -9007, 720, 10653, 7817, -4978, -11220, -3806, 6795, 13718, 5830, -6791, -8421, -2452, 10037, 12644, 2147, -8187, -8524, -305, 11117, 8190, -4113, -11760, -9671, 2675, 8934, 4647, -6185, -12577]
338a2577O645J1933K497n936j0749k435J0607J0217o0r826r762L027Q792Q822
352A1195k803j1815n210N378R206L200o102j0692k134Q586Q302J411r073r668
366a0219N68R053Q412j866j0891o705M151J1978N756n786q972m930P562Q567K391
381I069n014r197k370P691O631K128o618j0121L07J0890M864k326j0847n500M849
396e564Q258L418n286q438k30O386O208K132r287n997L542O959M601j800o578
411a676k941L691O214J034l919n772p18M013M323K076m810n772j620K962Q261
426E346j76o720n836K6P336M529k136n551n146N775P413N33m537n829J3O281N553
443F874j481o245l034L352N580k10j901o350n75N976J471l06k751o778J419M316
$$ y = [-12577, -5932, 6001, 8498, 2562, -8187, -10622, -15, 10202, 10142, 316, -9446, -6419, 2373, 11195, 8392, -3423, -8633, -3255, 5951, 9151, 3049, -7643, -9777, -1191, 7111, 8522, -551, -10219, -9651, -598, 7814, 5948, -4943, -11648, -7497, 4481, 10237, 4451, -4521, -9451, -1889, 6678, 9069, 4055, -5142, -7512, 179, 6810, 8938, 2320, -7801, -7494, 3396, 8260, 5934, -4913, -10413, -5564, 2694, 6112, 826, -7612, -7842, -1456, 4752, 6884, -2403, -8400, -4858, 2101, 6702, 4902, -1676, -4617, -926, 5288, 6322, 2403, -3369, -4087, -74, 4249, 6325, 1515, -4257, -5877, -2915, 5346, 5170, -1550, -7386, -7360, -24, 4505, 2369, -3182, -8328, -2553, 4860, 5393, 856, -4973, -4960, 1321, 6874, 5393, -852, -3886, -534, 5046, 4836, 2935, -3415, -3990, 1986, 3457, 3151, 400, -6378, -4959, -643]
459f43L255J172o758l513J578O131R97K15m587l440L340M416M869m106n377j576
475d027K874O329K797n489n696k590N989O639l67o127q254m0R310N454j998q710
491c906n388L914J0539K973o660r355p30Q979O696p02p871n657L125Q622J529
506F108R6p721l326J924M146N041l91n943p510P23O967Q699k483j1653q794O400
522g717J5896N719j2015j4181m244J6590J5171l014j8862j1703J0057J7811Q565
535A8073j1997j7219k824J5287J3220j814j4566q978K981J1055P576k830j0233
548b269q754L423P374Q864l57j0166j1244o38J3970J4614l500j7959j3980R995
562a0627K2372R743j6033k2001l677K0894K2554m775k3868j5903R671K4945Q937
$$ y = [-643, 2612, 3784, -2974, -6487, -4909, 1222, 2219, 2434, -2153, -5593, -2253, 2163, 7032, 2926, -2451, -4027, -1153, 5176, 7973, 2484, -3212, -5802, 187, 6826, 6459, 332, -7922, -7962, 1348, 6802, 4804, -3906, -9294, -5380, 5159, 8132, 1472, -7883, -8613, 366, 7062, 6360, -1511, -7168, -4043, 4579, 6108, 6204, -1517, -4843, -2919, 1227, 6268, 5877, -66, -7576, -6853, 114, 8813, 6330, -5323, -14117, -7717, 8179, 13898, 1883, -12298, -16542, 48, 15219, 12205, -6657, -18360, -8303, 9508, 18073, 6076, -11143, -13967, 1320, 14540, 12726, -1840, -10818, -7837, 3218, 10794, 7964, -2269, -11023, -7600, -226, 8638, 8281, -1885, -13129, -13767, 203, 14817, 11317, -6642, -20622, -10627, 11745, 21488, 5455, -16546, -20223, 671, 23225, 18450, -5418, -21321, -11650, 13295, 22232]
575B2232j3916k3074l481J6251J7744r13j6871j3663K115J5485J1585m380j4094
588d980j0423M700J3004J0198k570j5127r220N215J5491J1349o752k0064q453
601a7632J2179J9853O783j6924k1036J3J7996J8453l268k4194j4886J0766K1717
614I820J0971j4592k2171m756J6815J9906j71j7471j5350J077J9237J5339n939
627A2715j8744j0568Q445J8457Q038j2430j6074o344J3220J7515R47j3486j5309
640a3618m55J4896J3509l160j3549j2593K523J6319J0330m908j6633r618O453
653a0504J9107Q795j0720j8855n458J3761K2102O39j8430j8153L526K2472J3870
666B2152j0355k0892r699J2263K1758K399j6838j7331L223J6432J2269m864j7646
$$ y = [22232, 8316, -14758, -18239, -1988, 15756, 14843, -2028, -15691, -13576, 1909, 13494, 9114, -4980, -15403, -10703, 2301, 12499, 9929, -5198, -14418, -9203, 6288, 17637, 10885, -9179, -17632, -5453, 14400, 21183, 4259, -16777, -16764, 1232, 19685, 16417, -7777, -22663, -11897, 9820, 20791, 6199, -15972, -20728, -3913, 15993, 15822, -1649, -16999, -15922, 3315, 18654, 12715, -6029, -16597, -8152, 10305, 18343, 5913, -10161, -16505, -3285, 14230, 15177, 1691, -13618, -14073, 823, 14332, 11172, -2377, -14970, -12447, 3872, 14202, 9294, -7339, -16957, -10504, 8603, 17398, 6678, -12177, -17635, -3874, 18228, 18867, 437, -17716, -14190, 8282, 22152, 11797, -9095, -18794, -6531, 15227, 17626, 788, -16543, -13320, 3112, 15381, 10517, -7129]
679g129p901O192J4259O546p037j0131p467P526J2086M595o041j2310m016P353
693c475J3062N217r434j7039j983J3832J4327k78j8903j3153O559J9054R832j1213
707F405j9105m500J3501J7685O7j5100j4395M248J4730R657o674j2665n028O505
721d669J1156L688n937q567l191M085R094J976l670q718k910N186Q761J365o956
736F93p404k318P713J0564k941j0278n899L561R768N786n529j0876j728Q312P525
751F949R10q400o285K858O257M536l273n958j140K689M327J203n829j369j28K407
767b46K195r37k436r43j78J565J002j551m44J252M30R48p69k33m2K82J874l38
785A431j862O64J712j093J293l375q14K648J490P64j983l785N56Q62L699K52m358
$$ y = [-7129, -15030, -8838, 5421, 11967, 4930, -5201, -12668, -5142, 6944, 11539, 5498, -6812, -10828, -3475, 9587, 14804, 5370, -11669, -13652, 180, 14507, 14229, -4674, -17827, -11268, 7786, 17618, 6405, -12700, -17200, -3699, 13986, 14053, -1047, -15442, -11194, 3536, 13193, 6519, -6146, -11174, -4669, 6487, 10175, 4238, -4329, -7520, -3435, 5659, 7635, 3965, -4753, -7663, -2477, 6284, 7649, 693, -6711, -9029, -1316, 9248, 6307, -3971, -9870, -6309, 3459, 9245, 3716, -7160, -8888, -576, 6949, 7859, -541, -6826, -3968, 2289, 6825, 3552, -2406, -3546, -857, 3470, 4673, -1156, -2525, -2653, -246, 1949, 1012, -1424, -2367, -2545, -980, 22, -1529, -1973, -721, -291, 657, -112, -345, -387, -105, 1769, 1431, -431, 233, 1945, 852, 2145, -1230, -2044, 604, 2094, 2858, 875, -2910, -2354, -1492, 2207, 2459, -1899]
802a899l945J641M404M364k040o585l496M103P676K189m737q986J606O316P385
817G996n26q536o366J482J0842N634m988r699n859O690R793M469r055j0134k758
832a1015J0294R918j239r618r641J631J1737R137l903j2302p926P327J2281O219
846A2900o483j4346m291J0100J2782K725j1608j3781P89J2925J1383j727j4924
859c556j0560M743J4546R724q551j6289n728Q433J6799L869j2006j3890k041J3052
873a455J5244r03j5294j1632L281J6508J0048p071j5111q057P896J6378N703j0025
887E510j6646k689J1167J5719L0j3780j3853K511J3666J1144l281j5545r771O961
901h857J5552P324r082j3553n299J0158J4311L627j1666j2458p12J1896J1610
$$ y = [-1899, -5844, -4203, 201, 4565, 2525, -4060, -7556, -3453, 4223, 6412, 1675, -7311, -5705, 611, 7996, 7470, -1066, -7432, -5950, 4892, 10526, 5538, -4161, -10020, -3330, 6463, 10932, 1877, -8257, -11015, -721, 9197, 7958, -1660, -11301, -9670, 2067, 11204, 7301, -5001, -12927, -5600, 6681, 12900, 6417, -7929, -12220, -2120, 10662, 13387, 1779, -12002, -11213, 1712, 13095, 11368, -3556, -14116, -9373, 5173, 14897, 6346, -9943, -15671, -7238, 9561, 13430, 1424, -12466, -14507, -1455, 13789, 12886, -2408, -14040, -10759, 5749, 15797, 8726, -6385, -14442, -6546, 9832, 15535, 5510, -11136, -13825, -2658, 13061, 13091, -689, -14542, -12031, 1635, 12779, 9498, -6047, -15818, -8857, 6695, 14019, 4937, -8616, -13915, -3757, 10554, 14181, 2515, -9943, -10655, 1241, 12851]
914A2851j863j3484r749M095J3289Q346n872j4463n466P373J2154N112j0283j1529
928i489l004J0984J1637r79j0079j0181K247J1462P707k168j1187p516N831J0901
942F166M785o394j0543l422Q266Q954J148q136q402N50Q656P218k326r650n797
957h927L275Q360N265n282p321k884M973P391J325n196o726n5N840P050j728n574
973b14m395J364N343L357q17n442l921J646N361K996l918m911j996M353M801J055
989D662m294m007M8L625L563j124n632j465K535M495J699l807l453K231J149J310
1005A535K69j494j850K085q84J542k38m13K5p16r61M22R48J454k488k118J455
1022a427J252K083j716k763j27L510K13p47k027p54L810J512j320j282j079L179
$$ y = [12851, 10988, -2496, -12245, -8150, 5139, 13485, 7613, -6850, -12316, -4943, 7211, 12323, 2040, -9489, -12493, -1509, 10128, 9149, -930, -11111, -8864, 2598, 10305, 8137, -3050, -10566, -4735, 6166, 10951, 4557, -5986, -9408, -1142, 7812, 8960, 824, -7578, -7028, 1628, 8846, 6520, -3130, -8927, -5652, 2708, 7973, 2691, -4630, -7514, -2541, 4850, 6175, 979, -5747, -5802, 38, 7088, 5360, -214, -4609, -3245, 2098, 5455, 4638, -804, -4725, -3079, 2282, 5278, 1360, -3551, -5547, -1194, 3607, 4662, 368, -3639, -3591, 34, 3597, 2473, -3159, -4624, -2089, 2406, 4105, 298, -3155, -924, 225, 1535, 1804, 310, -1540, 545, -339, 1203, 965, 552, 577, -139, -1100, -678, 270, 1724, -764, -2882, -1427, -175, 1908, 192, -2571, -2698, 812, 1025, 278, -1749, -2503, 1307, 2819, 1499, 217, -862, 2317]
1038B317Q8k317j491o31L841K402l940k867N07L571K578m045l808j69L255L824
1054C115k260m129k41K362K548J209l219k360K587K734n75j099j137k13L11L29
1070c8R03p50L31k14j810R99K351J635k473l725j137M764K717j498m972j396K076
1087b237M330J776k367m822L45L035L485j390l079j350O63L934K206k708l060
1102a239j251K702R31K170j154m722L85J102K584j64j562j855J257K48Q23l5n17
1119b97q22o12J394J17R16J120k683o18q67L111K370j773l110O41K713J275J5
1136B890m624p43N49L453J954l493m244K472K210J865r40l368q0Q58Q78M44j249
1153a168O40J596q83k067R12J739K605j786l745r12K874M573Jn260m680K972O495
$$ y = [2317, 2405, 88, -1403, -2034, 1807, 4209, 269, -2598, -2091, 1480, 4058, 13, -3795, -3964, -709, 3115, 855, -3274, -3515, -1153, 1395, 2604, -615, -2975, -388, 2346, 1771, 672, -465, -678, -367, -38, 865, 115, 446, 232, -1578, -579, 1772, 3407, 934, -2791, -3928, 836, 3553, 2055, -2917, -4313, -2237, 2093, 3869, 1502, -3320, -2975, 60, 3545, 2155, -924, -2274, -1611, 2323, 4529, 1821, -1239, -2490, 212, 1143, 3313, 2159, -2563, -2178, -1076, 1508, 1344, -218, -2073, -816, -568, 255, 220, -297, -1119, -1731, -337, -220, 696, 1816, -867, -1485, -2352, 759, 3129, 1356, -1754, -1113, 1600, 2875, 2890, -1734, -2477, -1928, 1525, 3479, -14, -4258, -1786, 424, 2289, 1349, -2019, -2099, -1241, -363, 81, -1168, -528, 1068, 185, -1882, -970, 769, 3374, 1588, -2157, -3069, -195, 4378, 4379, -881, -5561, -2589, 3906]
1170C906J880n401m273j160N643L725k639m689l562M032M314K486l773l499J30
1185b880K346L013j908O52o28k575M06K122L385M22n409m464K764M596M973k733
1201D082q547k585N024Q037J201q439p092K971P679O165n031q541k777N641Q440
1216F228j2o851m952j86P057M723j182n586m154J35N728N728j080o219n540K221
1232c942N789N479l547p614m114M478Q243L224p176q160j232P869P140J023r175
1247a715p138K207R464P320l847j1669l014M849R819L202q360p439k468R606O613
1262G430r76q279n447J112P195O080k162q637l957L303P327M321m777p291l345
1277h103N918P576m10m282n548j577O800N457n26n402m771M21P567M205k715o710
$$ y = [3906, 5786, 385, -3888, -5048, 595, 4320, 1681, -3008, -6570, -2538, 1776, 4262, 489, -3010, -2880, -534, 2479, 571, 1223, 595, -1980, -1574, 548, 3933, 4355, -1054, -5518, -2754, 1842, 6815, 4082, -4465, -7050, -2026, 6011, 7212, -1227, -8319, -5348, 2331, 8496, 3465, -5076, -7853, -2212, 6228, 6216, -635, -5587, -5773, 1284, 6007, 4825, -761, -4915, -4780, 948, 6676, 5596, -623, -6163, -3942, 1847, 7326, 3779, -3835, -7949, -3471, 4772, 7996, 820, -7340, -8572, -703, 6437, 7460, -1715, -8853, -6646, 2818, 10138, 6291, -5378, -8392, -3543, 6276, 9478, 1118, -6321, -8789, 817, 7430, 6454, -1825, -7272, -6160, 1035, 7115, 4953, -3684, -7641, -4338, 2989, 7310, 2533, -4758, -8103, -2185, 5391, 4981, 699, -4849, -6426, 374, 5831, 5305, -97, -4868, -4447, 3120, 7325, 4610, -2100]
1293b100l947L873N133K163l645o698q39O152L973J87n402m758J245O496K823
1308D656k138m953k614L795L459J564l148l044k62K735K678R1l136m82k54L296
1324B243m32j70j050k005j102J838P22J666j210k090m31O72K255j29j133q62J136
1341h2q45R85k94o2J258l99p18L42P40J169k802J136j089J346K139k47k477j895
1359a795M8J853L102q68n400o14L72O244J677m197m017p45L251M373N25l259l994
1376c444O48L153M532j201m643l577K115N039L038k515o703o92L466M023K886
1391F125m806o715o22N730N309n23n200n719J533N618N132j950o947l659M633
1406b061O485L066n703o663j81M983N097K371n841p308K5O676O715k307p140n346
$$ y = [-2100, -6047, -2174, 2959, 5122, 1477, -5221, -6060, 92, 4065, 4252, -1150, -5908, -4663, 1833, 4656, 2518, -2435, -5049, -1254, 2205, 3769, 621, -2423, -2685, 50, 2728, 2819, -317, -799, -1053, 2243, 1811, 1641, 591, -1414, -2516, -678, 44, 1710, 500, -1590, -2021, -1349, 906, 777, -356, -1218, -82, -927, 58, -236, -298, 960, 561, -157, 185, 925, 2094, -708, 428, -661, 685, 2824, 2577, 100, -1795, -1747, 106, 3208, 2340, -3060, -3674, -3302, 2942, 4619, 422, -3595, -4340, -1089, 3284, 3809, 550, -3444, -2796, 357, 4889, 3688, -955, -4532, -2417, 2622, 5660, 3145, -3558, -4250, -784, 3239, 6125, 1319, -5396, -6018, -288, 5021, 4498, -702, -6421, -4888, 730, 5862, 3912, -3035, -6694, -2061, 4424, 7490, 1787, -4876, -5057, -74, 5023, 7394, 1553, -5755, -5730, 946, 7661, 5354, -1786, -7132]
1422g132L487N765N289m917q128j045M468N697K251n619n742j62M882O251P34
1437F079p889m469K520N858L633k752m540l244L259M990K261l518n362r62L262
1452h74O053o33o038k957j063N256M659j938m846k513K250N635Qj853m959j34
1468c947L028M459O62l844l652L20L844K709j11l708l580J624L031K158j22l856
1484i85k624J535K854L573m121l571j172M356M037k069k873k427L06L459K268
1499B546o78m809k83K784K842M18p71m337j05K555K057o65k578l82m64L236lM05
1517A768j822k427j10L662J299j610j393k390J327K131K398k668k113j45K256
1532A63L621j279k177k942K75L850J583r65l150j453K650J364J606l461j833J99
$$ y = [-7132, -3645, 2120, 7409, 2492, -5636, -6681, -2213, 3484, 5735, 116, -5626, -5788, -906, 5345, 6079, -1810, -6279, -3759, 2099, 5732, 2980, -1560, -4804, -1545, 3445, 5706, 2188, -3174, -4136, -874, 5179, 4546, -1492, -4449, -5512, -256, 4403, 2465, -2381, -4894, -2644, 2991, 2999, 1146, -3813, -3947, -919, 3540, 4202, 358, -3294, -2974, 870, 3579, 3468, -240, -3820, -2196, 835, 2993, 2871, -985, -3609, -2074, 780, 4353, 232, -3339, -4511, -155, 3882, 1813, -1060, -3487, -3181, 278, 2546, 1868, -2941, -3224, -440, 2402, 2820, 2049, -2288, -2393, 162, 2219, 1554, -1024, -1406, -1870, 1366, 1363, 1768, -54, -2481, -2591, 1071, 2370, 760, -633, -3023, -1696, 435, 2833, 165, -1948, -2093, 163, 3784, 2505, 328, -2614, -2339, 1511, 3094, 2129, -1021, -2474, 176, 1540, 3146, -315, -2148, -1949]
1548a949M64L353r19k082j106P46J681J525m71k295o69J048R89J707o56j753l195
1565c582K857L040k13r26j857j780L220J709j75k462k996P90L453J787l068j354
1581a557k629K618K752M16k408j606J114J93K942n12j771k066M70K674J809j170
1597A269j339j310J01J545K917j714k077j185N72J576J704j946j104m23j71K362
1613G77M36q31j826rq82K392K109j699k969j87K278K504j75k822j090K701M21
1630A128J034j398n48j662K283k99L01j416O23J65N67j291k21N40O39j305r87
1647a847O5K814J476k553j512j535K644K986o07l308j802J828L236J49r43l876
1663b785K605N20K791k538j081n69R07j21L69J368j220j423p24l23J622J623J628
$$ y = [-1949, -1485, 1868, 949, -1133, -2239, -1493, 188, 1713, 1242, -1053, -1722, -674, 315, 2022, 1366, -387, -3582, -725, 2315, 2102, 1176, -681, -2461, 759, 2468, 2293, -169, -3165, -2375, 1078, 2865, -203, -1557, -4186, -1568, 1184, 1600, -808, -2414, -1300, -1107, 1835, 1323, -448, -2514, -2044, 630, 2439, 1269, -70, -1380, -1279, 266, 3183, 1469, -608, -1793, -1221, 355, 2059, 113, -991, -1414, -1585, 777, 1213, 382, -1444, -1453, -2335, 57, 2166, 467, -2502, -2689, -411, 2093, 1918, -904, -1994, 707, 1128, 2162, 764, 216, -1446, 837, 538, 839, -577, 46, 211, 778, -513, -734, -194, 445, -860, -1847, -1782, 1032, 2508, -45, -1557, -3092, -448, 2538, 1931, -1377, -3179, -1351, 1885, 2034, 1091, -2785, -180, 340, 3131, 593, -488, -1057, -150, -271, 98, 1466, 246, -1177, -1901, -2224, -602, 1021, 2649]
1680B649n412j715K899N029M27k844m961P62M750K996r87m864l588L058M119L280
1696E598m375m223j056M116L395o31l987l153K002K303K350j374k257l371K378
1711b285L050K153j794k117k396K95L434L720k004k938l443L352M680n24j625
1726A558n168q12M648L853n45m450m522K620M059K283p07n042j418K758K570O46
1742B331l062l061R06K254K283O54k474j877J500J011J528l36j153r97j62J464
1758H09J629j151j541k117J997J113J101p66k140n45J540J488r63n08k031Q26
1774a259J147J522p11l64j845R27J219J452j278j815r41K390O69l50n87n30J022
1791F68o26P90k078O10O95k55J65k298J819K006r96j656l41l28J267K682k041
$$ y = [2649, -2763, -4478, -1579, 3450, 3877, 1033, -3928, -3166, 1584, 4580, 3593, -1271, -4859, -1801, 2318, 5598, 1223, -3000, -4056, 60, 3455, 2824, -1163, -4316, -2314, -11, 2339, 965, -1292, -4663, -2285, 765, 2918, 1124, -993, -3389, -3094, 340, 4060, 2056, -882, -4325, -973, 3707, 3183, 1558, -3610, -4422, 226, 4079, 3534, -916, -5438, -2818, 1241, 3524, 2817, -2225, -3643, -885, 1685, 2331, -731, -3792, -2886, -632, 1651, 2305, -169, -2046, -546, 465, 1993, 1657, 504, -493, -655, 809, 2438, 1287, -254, -2371, -374, 739, 1840, 1074, -1066, -1611, -71, 1417, 454, -54, -2085, -1259, -112, 1410, 699, 335, -1510, -583, 636, 2088, 810, -1005, -1946, 444, 1113, 763, 176, -354, 668, 42, 832, -1246, -636, 59, -196, -31, -2329, -510, 1496, 500, -1156, -1497, -1825, -558, 2124, 83]
1808H3k114o77K916R50J903l237p53r00J091K742m97j720j013l1J748R89n2m45
1826I83l062R17K940J118j672n37l140j97M055J388j759m001o65L467L151m71
1842B515k723l832J111K421M712m56n027j631P75L625K246k686l299j878J918
1857b209N874k31l233k763j507M196J691L27j853l899J213M339J133n59l403l585
1873d469L128L564J453k165m400m96L103L691o12k420m091O53M586K266j597l530
1889a336k495J068M325K372k935m120j199L511L199L55k841l250N11K997K465
1904B627K31m213j571N22M395K044k377k844j941K079K603J290j525k517j819
1919c016K832J986J83k331j947j465L797J856L41k906k045J113K080J327j366
$$ y = [83, -2031, -2708, 208, 1158, 3061, -176, -929, -1829, -738, 2004, 1507, -213, -1226, -1257, 491, 1480, 1428, 983, -2079, -1162, 1778, 2896, 1224, 687, -2453, -2650, 1405, 2793, 1034, -2967, -3632, -165, 2986, 2515, -208, -4040, -2929, -508, 4204, 3748, -1279, -2910, -2135, 1490, 3736, 1050, -2249, -4127, -2209, 3665, 3434, 201, -2562, -4069, 127, 1818, 2145, 292, -3607, -2394, 1945, 3078, 2519, -884, -4469, -1341, 2223, 3676, 1511, -2889, -3385, -282, 3409, 2797, 377, -3714, -3061, 1525, 3791, 2194, -1336, -3831, -2763, 1562, 3934, 999, -3121, -4320, -809, 2390, 2745, -96, -3346, -2835, 162, 2627, 2858, -1355, -2926, -2404, 1991, 4035, 1658, -1186, -3127, -1048, 1555, 2845, 1320, -1197, -3016, -184, 1802, 1985, -346, -2293, -3758, 39, 1895, 2236, -670, -2715, -1602, 478, 1805, 439]
1934D39k148o1Q00L465k34r37k903n30J835K009J06k431j383L81K411R18j144
1951E93k182J95n3K282N49p74j603Q4O85J236P37l055Q58o91J022J907j619o66
1969d95k09R53N09N41q74m52j026R79Q82K88j483k25L94J391n31R9j562J53O09
1988e9J58n3m66J49o59O05p11J274n80k3Q2m63R97K57K66L41O5k02r73o9L06R99
2010A241j297j039l10M25J640l10p67n6p38P53J553p54k53j218n70J764L80l09
2028A35o77j120J195Q69J109n23j889n06J480J552O1j208j982n68L231M84p34
2045I09j818k91M84R37R22o53j334j666J923J440J214k829n17j191J986K250o65
2062A101j324j477Q13J341K032q16k890j507J796K356R63r26l247l23J974J970
$$ y = [439, -1709, -1770, -970, 2495, 2261, 1324, -1579, -2109, -274, 1735, 1841, -590, -1973, -1592, 819, 1737, 593, -1589, -1394, -1447, 835, 1384, 610, -993, -909, -224, 1012, 1749, -1306, -448, -1139, -117, 1790, 171, -495, -704, 249, 758, 1299, 425, -27, -1053, -74, 808, 1096, -387, -612, -218, 1173, 642, 741, -821, -668, -59, 99, 46, -420, -271, -930, -325, -1036, 238, -342, -365, -283, -746, 251, 508, 774, 1115, 1180, 978, 5, -64, 242, 1241, -56, -1095, -1405, -980, 660, 350, -417, -473, -1211, -458, 1095, 341, 88, -1130, -1700, 64, 444, 135, -542, -1662, -467, 402, 1511, 988, -901, -1407, 73, 1625, 1686, 478, -1504, -2072, 1159, 1643, 909, -909, -1200, -716, 221, 1143, 490, -844, -2510, -587, 853, 2067, -762, -1279, -2470, -484, 1766, 1101, -223, -1700, -887, 454, 2486, 1670, -1220, -2727, -931, 1425, 2388, 1462, -1785, -2108, -134, 1836]
2078A836kj589k564m73K200K252M31k602j501M27J984J956j755j811j325K668
2094A32J176O40j851j673m45K249K218m86j781j383K2J378J120j71j713r28K4
2111a472J706N42j18j436j385J343J852N06m19k091j330K030J757O84j772j532
2127a135q17K844J424j334j903k21J557K37L72j056n00Q9J117q29J66m11j50J43
2145d07j98N83k80K7O97l74p74R8J150m4r06o90J298N76K52n68j063N38R23j60
2165F78L83j460j08O01K44N31j104l40O31J108j442J0J24N97p8p72p95J085M50
2184C43J56q99n21OJ317O21J37k313J36J464O98L28j372o39j48R96J79J41j238
2203f08k85J93J531m15J30j425k9Q15L20O54j66q99j593J324Q32N28k68p40j036
$$ y = [1836, 1834, 245, -2319, -2792, -592, 1660, 2091, -511, -2012, -1585, 399, 2355, 600, -1211, -2536, 132, 1308, 1948, 97, -1576, -2021, 228, 2446, 1960, 179, -1204, -1182, 196, 1316, 1145, -568, -1496, -1472, 234, 776, 658, -778, -2163, -820, 1032, 1538, 1119, -972, -2302, -272, 1485, 2169, 397, -1135, -1952, 892, 2316, 982, -921, -1142, 415, 652, 1024, -32, -532, -443, 674, -155, 11, -400, -550, -407, -605, -22, -302, -275, 422, 48, -726, -628, 522, 478, -428, -1118, 180, 756, 1008, 440, -623, -85, 838, 678, 1061, -399, -507, 94, 338, 869, -235, -575, 56, 1164, -278, -268, -144, 453, 375, -397, -1192, -107, 343, 499, -400, -921, -915, 402, 1023, 1160, -1153, -1017, 447, 1145, 1473, 101, -538, -686, 310, 489, 630, -608, -893, -700, 831, 416, 546, -879, -908, -93, 227, 881, 715, -184, -1777, -453, 379, 907, 639, -101, -1137]
2222a137J147P32r0n78j279O7J329J254m55j450p67R97M12R08k2k191j45q3J907
2241E56O40j541j207O32J034Q76n1j567l82N22J133N4P63j339LO06j075Q56K32
2260G45n57l10n94R36L05j08k79r74l0Q64Q61j97j398j88l3J605M01j688m16J95
2280h60J471k30P7k71q87P11N78J23q8m15n92Q21m15k51R4J064j602j13O27P73
2300F15k28J00j293k44O36J398J65k431j50P84J939j90l38j237k56R49Q86N48
2318A653k618Q96J10K07M47n47l17n50M83M21N71p99Q35j103m8k51J028L89k238
2337a431M21K27Q10Q50L37j630l83M17J902n14r61j309K96N85K561j213j508j354
2355a897J292K013o38j10n97r11P16R89j345J009j291o69J306Q64n27j059L00
$$ y = [-1137, 10, 742, 652, 74, -1205, -1138, 191, 1445, 990, -460, -1227, -230, 182, 1090, 1068, -1123, -1268, -1351, 556, 1196, -345, -1552, -920, 114, 990, 939, -628, -1010, -488, 645, 699, 1462, 123, 126, 732, -343, 513, 745, 188, -122, -716, 220, 525, 417, 138, -836, -866, -2, 859, 662, -736, -924, -957, 648, 1049, -639, -1055, -860, 611, 381, 458, 187, -700, 11, 589, 712, 624, 209, -383, 438, 23, -228, -134, 930, -672, -785, -158, 615, 387, 487, -806, -1050, -414, 984, 1149, -1282, -1432, -648, 1291, 1101, 763, -474, -730, 219, 1105, 1653, -965, -69, 41, 248, 695, 148, -169, -719, -236, 185, 756, -43, 792, -311, -359, -610, 418, 807, -1431, -1010, -783, 27, 877, 1214, -416, -799, -382, 1520, 1006, 45, -1264, -968, -383, 2178, 965, -543, -1897, -605, 1408, 770, 660, 63, -848, -132, 857, -488, 521, -770, -1439, -133, 731, 204, -855, -555]
2372e55p05J541K22l90j182K54L3R95J245o03j51j525N53O96K291k417j244P13
2390b29Q01j36J330k503j582P01K016J049j137j140j154J617K045o31o16j649
2406a218p08J920J130J84j026j894P53J020J907r08j476j920J456J575O81q38
2422F38k302j190J780J088J108j252j326j512K679J795l13k733q48J348J509J625
2438B094j832k825J044K266J681o85q23k605q3J976K325k91l168q25J047K547
2454A843j93m42l573J84J581K287R20k668j733K8J149K640N43k648k439Q09K091
2471C79K066q60j742k404J896K674P23k461k266R52O04L090q23k147k620L86K016
2488e37L010j233k591j687J462K666J340j616l553J8K134K654K46k159j425q30
$$ y = [-555, -1260, 281, 503, 113, -1069, -815, -782, 213, 1458, 855, 704, -821, -268, 428, 2719, 302, -942, -229, 572, 436, 1766, -737, -2319, -1618, 398, 1447, 310, -830, -1984, -367, 1678, 1047, 431, -1218, -1926, -6, 1124, 1308, 282, -1612, -859, 161, 2068, 1160, -316, -2236, -780, 795, 1476, 638, -1664, -2854, -1074, 14, 1122, -130, -1456, -2968, -289, 1506, 1193, -1540, -2388, -1040, 469, 2094, 262, -2563, -1519, 747, 2428, 1743, 920, -1685, -1768, 208, 2533, 2242, -926, -1751, -704, 1843, 1650, 1208, -2365, -2181, -600, 1687, 2607, -61, -1794, -1766, -617, 2023, 2566, -82, -2521, -1712, 379, 2445, 1585, -157, -2561, -665, 2009, 2732, 271, -1995, -1043, -439, 2651, 1828, -319, -2939, -2553, -537, 2473, 1240, -1351, -3038, -1576, 1090, 2430, 814, -2739, -2721, -587, 2067, 2313, 154, -1271, -2101]
2504b101K445K070K03l475m85M73P31J571L3j846j601J332K941j283r64k407l19
2521b682K711J105Rp32k659J064J873J519j243k147p15J115K145K58r08j533o79
2538a499J920J707n26j559k541J242J429J639p40j848n65J211R58N77r65j081
2554f41n07L45J938q91l71p36q41K068Q20p98j40l79N56K73R40m29j461o63J115
2573A98M75P75j332p91M10k9L17K43p6j104N05N43k23L74N9RR5q11Q48k19o32
2594c66J383k40j34p83P76M96%o32k47K04q11K59o21j69P90L94m20L06q53Q36
2614A68k46q50Q57M3m60K89n34N18K80J036j242J21p1O1N02J68n34j114L79J812
2634A183n52q8j056k20J415J99m71j291o37J366Q77r27m56J91q36P53Q73k75M95
$$ y = [-2101, 344, 2414, 2617, -858, -1343, -870, -139, 1432, 1465, -381, -1982, -650, 2291, 1008, 44, -2363, -2682, 29, 1134, 1143, 411, -2248, -1184, 689, 2208, 965, -1182, -1897, -782, 1363, 1621, 713, -820, -1499, 421, 2128, 1602, 43, -2498, -1256, 173, 1812, 1072, -776, -1341, -130, 828, 1405, 440, -641, -1148, -803, 1135, 244, -127, -863, -1704, 364, 1184, 386, 246, -133, 423, 696, 1636, 1207, -254, -917, 198, 673, 1448, 116, -675, -265, -294, 23, 266, 190, -914, -409, 134, -89, 285, 344, 353, 448, -363, 485, 266, -366, 1017, 777, 643, -140, 636, 1132, 1132, 500, 253, 457, -354, -95, -716, -885, -95, 299, -121, 185, -668, 168, -78, -928, -71, -28, -488, -199, -733, -215, 65, 1101, -141, -20, -91, -30, 472, 640, 106, -1008, -629, 1183, 631, 543, -513, -733, 682, 881, 410, -881, -1518, -152, 725, -202, -658, -467, -1303, -550, 323, 48, 543]
2653E43o95K08j11J541q19r97n68M64k51K498j074j141l60R69J91P22j043j447
2671a370O28M85R88Q9n08j522j021J793M38K21j912L08J547L48Q72j783M14m80
2689d65O33J370m51r14r51Q2Q47Q19m6m72j189k15J739L94j323r53j107K055J066
2708I19O61k001q80l64O82K009j33r33j458J203P26J109n8k118m80j18J410J124
2726A300m18k015q69J814J641M71j740k338K09K564P87j50k261k81P27J47K049
2743A637q36k397k57J260J949Q8j159k511J093Q02J751Q42j927j613p72J756K066
2760A772P3k199k680J474J947J133j065j476k168K318K494L83j713j993j235K601
2776c34L324j922j927j367O06L231N56q63k271j065Q89K787K47j208k835K95J993
$$ y = [543, -152, 56, -55, 1486, 667, -330, -898, -434, -685, 1813, 739, -402, -762, 207, 398, 1120, 77, -1370, -742, -257, 731, 820, 312, -1210, -2231, -438, 0, 221, -1691, -1383, 164, 512, 1384, -399, 15, -465, 168, 1538, 1087, 173, -778, -696, 151, 970, 924, 452, -737, -952, 787, 1181, -142, -1095, -2202, -147, 919, 1580, -421, -1301, -1665, -983, 1026, 893, -40, -1498, -295, 431, 1540, 1482, -636, -1116, -1234, 176, 1300, 882, -1133, -2002, -188, 1453, 1924, 184, -2154, -1945, 619, 1406, 1256, -1005, -1286, -559, -412, 1637, 801, -1596, -1853, -593, 1356, 1444, 285, -2226, -1133, -331, 1420, 2262, 335, -1278, -2050, -294, 1772, 1845, -354, -3034, -1560, 387, 1520, 455, -1021, -3189, -871, 1623, 2006, 293, -1700, -2935, -334, 2990, 1068, -859, -2226, -1620, 1611, 2167, 1304, -967, -2032, -1143, 1644, 1891, 683, -2152, -1857, 136]
2793A36K136k53k951j213J66J103L025M25l630j917P60K936J210k7l970P91J159
2810a14K377n92j548j006r11K019K166r95j681j528L54K237J361r35j535j404
2826a735Q78K071R32k441j142m01J578K312p09j389k158j08K769J409n00j982
2842f16j842J750K252K94j575j417M19Q17J335N14j831j096N7J568M88l45j947
2859a175m01R29N88J797k045r83N81R3Q86M48j90K0m32P05l28Nm34r90R61r9N12
2880D48R86j818M56j462J002J155n06o51N00o68J036Q7r53k08j37N99K55p72L80
2899b71L58q94J292j129J797q59o11Q83l94L89M38n92p34P23q39K45l1J247p40
2918B78r01L42o25R87p19Q43J46n35O36o65L14o52L60q5J316j749J044k90r7p06
$$ y = [136, 2272, 2019, -932, -2145, -1979, -876, 2149, 2574, -1056, -2973, -2213, 723, 1933, 1906, -2064, -1273, -114, 2263, 1671, 123, -883, -1794, 225, 2391, 1396, -285, -1813, -1459, 778, 2139, 1204, -331, -1735, -857, 1214, 2146, -295, -1437, -1838, -260, 2052, 1343, -46, -2204, -2312, 457, 1866, 1366, -616, -2458, -708, 1544, 1838, 263, -1154, -735, 82, 1417, 1931, 100, -996, -939, 629, 1117, 772, -1175, -1576, -647, -59, 1738, -307, -1290, -709, -616, 270, 718, 528, 548, 116, 821, 493, 498, 64, -926, 35, -64, 448, 1434, -384, 72, -1390, -388, 767, 261, -390, 110, -558, 478, 565, -388, -596, -733, -134, 121, -651, -271, 87, -807, 485, -644, 1153, 294, -317, 566, 172, 561, 999, 407, -327, 396, -443, -198, -229, 1018, 278, -623, -281, -906, 81, -638, 205, 351, -184, 452, -213, 101, -551, -191, -276, 1040, -709, 335, 45, -52, -758]
2938g58J161j130O06M71j139J343n94j82o97R89n85L67k15J148q66j01K22q6q80
2957i26J536j319N75J25N24k08q62K70n03J229J31q5q1r29O90M72k65j151J266
2976D89k31k89N95r54P62j650J460j36k22q5q9M98p44L57j58J91N8Q31l52j124
2996g93J84n23J871m61m15O49n90m70J354o64K7r92k1Q18N66M64j307N62j009
3015g50J5J500r59L4n94O95j20M83m73l33L21Q16K37R3l71j508J50J499K97o13
3035D19j538n84J167J496L73q12j385m2J442p50J202j541Q68r26J164K97j054
3052b04K96r65K18P19N06j437m31N03J2J405n5J309l177l67L004j042Q80j284
3070a10j010O45J294O50m98j555n19Q45P55J102k262p36M5J346Q13k42p39j031
$$ y = [-758, 403, -727, -121, 350, -789, 554, -40, -222, -919, 70, -515, -148, -363, 785, -81, -182, 40, -46, -926, 610, -709, -134, -9, 515, 307, -555, -285, -788, 441, 572, 487, 406, -523, 167, 639, 374, -777, 489, 258, -31, 564, -390, 372, -1278, 182, 46, -176, -261, -350, 148, -596, -239, -397, -206, -148, 683, 331, -793, -609, -1132, 739, 278, -137, 512, -78, -548, 806, 142, 169, -823, -844, -26, 540, 1004, -303, 259, -750, -735, 765, -194, -160, -754, -59, -179, 304, -169, -502, -181, 635, 872, 965, 594, -914, -764, 735, 1032, 419, -1119, -1703, -536, 960, 1333, 521, -864, -906, 536, -214, 988, -553, 315, -611, 553, 850, -204, 92, -873, -655, 64, 570, -867, -1298, -795, -783, 622, 567, 1876, -1301, -1668, 1336, 294, 1174, -110, -1120, -475, 819, 1469, 971, -584, -1103, -258, 497, 1599, -663, -1399, -1354, -8, 805, 563, -176, -1207]
3088a207N17Q56O67n81j55m85O78O98N22j835N5L90M48N9l9m72L24k113J607K91
3108B25l36l79j46Q19n42L89l14j22p95R07J103L85n70j250L00L45J12N93j523
3127g99O76k01R46n34j18N12J60q83jR00j335P22n72J003p21L28l53Q88j506O63
3147b25L5j63Q79q21j11K30O2J20k59P02p33J323n98M0J126q98j068m72J029m60
3167b62P43M09j116L97k43K3O43o89K34q80J154m44k33m2J96M49K05J130q17r30
3187g3j320J478L92R9J038j601j044P11N35k55q58J256j393L42J521N18j587o81
3205i22O77O82N54j294m72j181K275m7K78l08j180J403p35J449j310j28N10j244
3223i93J043J513k16j905o22J788k58M40n2k47j244J122Q41j129k02l73n43J611
$$ y = [-1207, -690, 166, 833, 252, 97, -388, 290, 988, 1510, -325, -270, 120, 568, 627, 588, 116, 440, -1673, -66, 225, -111, -490, -636, 183, -359, 30, -284, -406, -1201, -294, 809, 1194, 624, -626, -326, 19, 131, 724, -799, -123, -324, 622, 88, -30, 482, 642, -241, -242, 658, -677, 45, -527, 476, -245, 83, -270, 618, -888, -225, -190, -353, 526, -295, -406, -176, -114, 6, -253, 449, -284, 1039, 441, 481, 1607, 709, -359, -831, 198, -262, 481, 890, -226, 171, -72, -49, 594, -95, 139, -741, 413, -31, -264, -306, -110, 339, 544, 1674, 857, -73, -1393, 85, 477, 576, 1614, 13, -1031, -320, 215, -40, -898, 358, -1035, -693, 828, 1346, -241, -922, -245, 437, 991, -303, -775, -1956, 319, 272, 550, 242, -938, 465, -270, 1179, -131, -259, 251, -993, 50, 1563, 1347, -558, -1180, 608, 350, 790, 738, 491, -753, 369, 1210, 81, -121, -494, -1037, 574]
3241E74k21R83j317j823J171M77P98m4q14j415J182J509L80j412p68n27J390J904
3259B027j271M25k489p41K394O17l69j940q16J838L83K237j162k592J586j417
3275a290K695j386r3k345J168J411J163j50p68j675k6J900O97n11j183j034l19
3292a746J902P79j112j040P4J529K206q82j615j095j226L553L93p88j008j126
3308a202k46J460O29l65J34j861O60K535K59j756r70p77K439N86o66o63j540j55
3326a499K225J601p80k105j624J714M62J314j191k344K84K651L09J125j293l116
3342b267QK561K648j566j757j096R12M82K000k277m66j97K21Q18J313q50j105
3359f18O7Q10K199q02r26j898o77K369R56j097k187K8J076J600K1o63r06q64J885
$$ y = [574, 353, 1336, 19, -1804, -633, -156, 642, 598, -216, -1631, -449, 1060, 1440, 28, -740, -1267, 123, 2027, 756, 1181, -1308, -2049, 345, 962, 593, -1347, -2163, -325, 58, 2295, 1133, -1459, 127, -1290, 1405, 19, -74, -2419, -1251, 160, 1323, 1173, 405, -1270, -1296, 604, 1301, 790, -393, -1427, -1746, 156, 935, -177, -1217, -1143, 386, 2592, 1710, 95, -1000, -2226, 1327, 1720, 932, -76, -1202, -1448, 12, 641, 276, 410, -1451, -791, 1744, 2003, 247, -723, -1500, 939, 1525, 859, 196, -1344, -1499, 726, 2327, 1547, -558, -2182, -468, -6, 1308, 117, -2227, -1943, 708, 1017, 2142, 849, -2267, -2259, 302, 2950, 1384, -373, -1469, -557, -75, 1925, -352, -818, -1015, -794, 24, 1337, 487, -618, -551, 259, 2458, 1656, 730, -1168, -1845, 524, 1480, 383, -1804, -1776, -700, 900, 921, 258, -648, -1512, 373]
3378C73M73r5k019n19P61Q92K207j59l558R23o64K862j085q61l42k52N67J280
3396G84j73j234j163N72O54K312j212J02j798L86J750p28M34j045J16O53R0J408
3414A908j456j981j57K633J254j647k109j31J956K94n09R21j767K67M63J245q57
3431C27j93q42o46J175R14P74j702q14j42K397j97j211k35q07J619n78Q63j26
3449E76j343n62K007j07n84k27j099J173p75J656r70O8j394j7J021P22j130j1
3467i96J34M5R83P49r37m41K29J36K24j82L52o52Q95n57K54J88m65p5J74m89J004
3488E73o65n89L53P92j116L65o0K01J086r17j12L18l22k42k8Q29Q98o83l63R5
3508D13p41N91j205M15j011J406N00n22j10M12J44j57m29p65P34k82O85K70M23
$$ y = [373, 846, 751, -1268, -1787, -1026, -134, 2073, 1914, -1644, -721, -1385, 1477, 392, -469, -811, -1063, -496, 784, 611, -623, -1786, -1214, -560, 1752, 540, 642, -1156, -770, 980, 252, 686, -359, -243, 410, 500, 1908, 452, -1529, -1686, 947, 2201, 554, -1555, -1686, 270, 564, 55, 976, -791, -524, -61, 1184, 327, 134, -708, -1354, -179, 735, 1509, -193, -1007, -1149, 1248, 1051, -160, -395, -1202, 417, -161, 702, 576, -767, -1329, 678, 571, -13, -240, -1339, -166, -941, 715, -255, -187, -1581, -1598, -577, 145, -985, -996, -862, -817, 166, 915, -22, -463, -234, -98, 126, -56, 296, -356, 539, -18, 236, 424, -41, -116, 58, -431, 573, -92, -681, -328, 464, -652, -287, -347, -146, 940, 23, -89, 229, -93, -335, -363, 466, 1364, 681, 318, 413, -328, 263, -942, -527, -1538, -132, 368, -154, -264, 148, 292, 135, -294, -1059, -325, -607, 78, 348, 771]
3527G71j123j362K382j320R40q28J183j13J8n94j035J016L26k54O96l18j142J066
3545C09J25j07k40k14j399O67N59J648m98J05j955k30J493n51O15r7j515R15N82
3564B12Q80j120j346Q94J162l1j738J47J62N53j42J086m28n28j166J007Q40J86
3582F30l88n01o19J08R82M18o84j61j213J439Q56l31p49q30M61L20R63p72m48
3601e19J48J04R08qK10j739r12K104l58J032q59r13l27J319N12j69j132k46K77
3620e68J536K0l29j188q45J511j74n28J336j729j98J099M36P68k016K25M32N59
3638C47m74m12j51N72K30J080l52j92j374Q0M39J120j111k98n44J217m95J729
3656A411q62p70m43J395l67M99q68r16O56N39J8M03p68r29N54Q82m26R9p4m64
$$ y = [771, -352, -1714, 668, -652, 288, -540, 643, 530, 548, -46, -1081, -65, 261, 7, 703, 385, -757, 309, 434, 327, 87, -127, -1526, -859, -300, 1348, 850, 955, -1000, -1230, 263, -288, 327, 230, -1285, -370, 212, 1092, -28, -1374, -480, 682, 651, -1087, -940, -778, -225, -367, 719, 291, -237, -1403, -396, 444, 630, 242, -259, -878, -770, 212, 630, -54, -215, -1428, 11, 867, 536, -213, -1043, -582, -262, 701, -71, -519, -371, -267, 641, 633, 843, -896, -1808, 296, -62, 970, 111, -802, -1129, 190, 702, 533, -599, -845, -568, 968, 988, 659, -529, -1374, 137, -37, -565, 771, -958, -1156, -57, 379, 1147, -869, -644, -212, 347, -127, -539, -690, -118, 112, 1192, 840, 648, -726, -646, -207, 913, -198, -496, -1040, 177, -318, 1411, 549, -221, -664, 731, 364, 863, -5, -921, -265, 274, 292, 695, -73, -1002, -448, 434, 8, 107, 33, -431]
3676d31N89k20J433j450J98k99N46j433N70M30j516J721p93J547j38p38Q46p24
3694A38k42P0N30J05r77J94J08Q73j291p3j42Q30j71m38R94n20P16j278O87r21
3714h08M99K69K01k8j242O28P32r13Q22l9r5K03K98J0l86k61m18L7L29m3n53J271
3736E13p89q91K224j822k08J156L61m41m46J033j202J20Q94m90k31M72j56l63
3754b66n41k74K66N72M76j73l16R37j62M43r86J67l4r47J26J155j609O94K56n62
3774g78N35R47j865M26O77N34l80L9q61K62J202p33M65P6j321N72k93P98o58J9
3794c37O82j257R38L93M32l46j362K27M03R09j543R55m48L24m42N82k06P31k35
3813D00n87P50L25q61j87Q4N1L08n17k06J74K10M97m44K20j48k42q77J184J38
$$ y = [-431, 158, -62, 1371, -79, 119, -180, 366, -1067, -497, -67, -1583, 138, -655, 892, 754, 16, 862, 138, -104, -34, 496, 601, -376, -182, -74, 799, -492, -565, -707, 123, -48, -486, 508, -12, 704, -574, 113, -808, -309, -40, 161, 133, -1109, -481, 251, -662, 160, 121, 26, 229, 527, 537, 151, -110, -528, -491, -162, -205, -758, 513, -276, -1167, 1057, -765, -973, 183, 544, 103, -343, 690, -512, -392, 502, 12, -219, 253, 97, -266, -807, -1081, -815, -243, 233, 60, -256, 681, 519, 962, -24, 143, 109, -838, -712, 443, -1166, -472, -216, -778, -243, 704, -1161, -735, -58, 476, 96, 135, -726, -464, 738, 5, 470, 546, -775, -203, -496, 302, -356, -337, 345, -912, 26, 419, 851, 505, -857, -630, -227, 682, -861, 94, -354, -30, -472, 110, -96, 635, 400, -187, 563, 888, 27, -160, -76, -25, 283, -234, -440, -266, -56, 441, -3, 217, 69, -173, -1050, 134, 272]
3833B72k42K96j053M98K73P8j11n28p97J067k59N80j98K48q18K011k20j354l02
3852e59j00O50J080n15m77n84o50J466R12p10n58q42K45K55J296j221n91r51J965
3871A11N34k74Q47j290n25L35oJ346j458L19l01O4J271q48K06j67n79P29J099
3890A413o55q60R3r21J594Q9k1q92n47N47J580j178r98k71K93J185n30J29n59
3909e09k56K43P33pj13M03k95j84J483j000j656M36q95J357J560j073q85j041
3927a699J741M3J207k115J18OR43R39p89M63q85K19k65Q46o81j122R21j066J764
3946E88n13K16q41M93O7M05j61J66m32o61N07P46l79p0k48m06J060k95p21l9P69
3967B51N98r28J0J43p51p4J017K52m80O59j002o76O46jR36k092J57O99J073M86
$$ y = [272, 30, 326, -727, -229, 44, 122, 11, -517, -1314, -247, -506, 74, -124, 124, -694, 1317, 1097, -257, -559, -659, -9, 1071, 556, 79, -505, -1155, 311, 1223, 513, -45, -887, -642, -387, 909, -312, -903, -1854, 111, 645, 371, 1218, -72, -597, -262, -268, 1078, -380, -61, -362, -298, 973, 125, 331, 164, -415, 314, 1413, 758, -102, -9, -930, 664, 753, 732, -160, -707, -160, 1420, 242, -756, -1027, -734, 451, -79, 50, -509, -765, -522, 211, 204, 91, 494, 199, 15, 1498, 498, -1158, -722, -1617, -260, 1300, 227, -658, -1699, 42, 85, 1292, -823, -705, -699, 244, 1183, 394, 857, -28, 191, -74, 772, 91, -1031, -110, -1176, 588, 75, 291, -550, -57, 10, 415, 254, 420, -12, -673, -166, 580, 201, 131, -117, -523, 537, 242, -479, -518, 251, 849, -79, -69, 74, -677, -751, 266, 518, 38, 697, -305, -981, -335, -336, 600, -1492, -1335, -636, 437, 923]
3987I23q08m57J50l42J99J324p06p18o37J134J234j421M29r09M79O47L09n18o62
4006c50n10R84M18p21P88k33j35k96J305q66m22l06N2N4K09J023q26r39j6J297
4026E10o02L76l70o41M91O07o24R39lr89K70J34L13o11o12J222o34N15j17Q0j474
4047a220J389K8P35m64j122N86k06j20R28j990J166Q37Om89r85J083l07O57k80
4066B32p1K72o95q3J195p50n35j10Q88K39j125r2L15O06l73K9j49L15Ll9n29Q83
4088D26j135Q28l53O70J91q57K43K43N59n60P97j801k5l17J441k34J99r1l25J27
4108B6J7P3N8p14q07J043J185m55m22m17p40J173k17O3j27l5K31J175r1j211o13
4129h05N47K33J004k15n9j506N82L37N51J90j546l99J391O42p27q35k31O8J49
$$ y = [923, 115, -342, -192, -534, -335, 989, 283, -435, -1072, 62, 1296, -125, 304, -605, -126, 521, 830, 312, -350, -860, 124, 542, -179, 609, 376, 241, -55, 1250, 384, -38, -344, -292, -238, -29, 994, 168, -771, -787, 510, -92, 284, -86, -727, -236, 371, -253, 686, 683, -306, -36, 98, 411, -200, -812, 410, -224, 291, 174, 254, -1220, 169, 197, 932, 468, -654, -68, -274, -394, 534, -1456, -290, 547, 553, 64, -921, 162, -145, 512, 232, 161, 433, -262, -345, 850, 100, -435, -545, 343, 582, -543, -635, -320, 286, -87, -58, -207, 108, 111, 72, -457, 426, -709, 119, -234, 436, 627, -230, 13, 256, 815, 255, 1052, -749, -774, -1091, 350, 116, 315, 224, -101, 26, 43, 116, 174, -540, -1347, -304, 881, 426, 4, -413, -1153, 20, -197, -134, -261, -296, -65, 1110, 1019, -192, -805, -258, -25, 979, 764, 705, -801, -219, 118, 669, 859, -687, -1086, 305, 947, 220, -615, -846, -778, -629]
4148f29J485q57p09p60N52O72J606r17o05o81J696j1l03n68p5j253P26J734r10
4167A93j278N75L9J518o36R84j030l61J60O47N63q74n84q36N97R67j89J23m84
4186I4n69P15R44o9j591o22J445P8J059m30q58o01n78J120J58m60K01q21J006
4205B21K96l68Q5n33j65J9K21J075j568J13j01N99K95K06p51j65J020n57O02l78
4225A66j033O46k03JJ090k13m29r4J38J62p19o08M7L62J595L74k350J334q41N03
4245g2R20q53m85K22J78N64q44o6M89K34k70O00M18j079k33O86o82P96q90j01
4265d68o44L66L79L50j90O5K87K3k05N61p52J020k14l03m5j363J266J428j732
4284a71R8P11r27k48M83J22q83M99m92P61R87j474J82n2m61J657k146J759n13
$$ y = [-629, 856, -1, -710, -1470, -918, -246, 1360, 443, -162, -843, 853, 842, 539, -29, -104, -1357, -631, 1103, 193, -1085, -510, -471, 1047, 411, 1395, 365, 4, 164, 811, 1374, 500, -84, -920, -323, 644, 455, 578, 94, -475, 240, 1184, 1115, -476, -1098, 347, 425, 1484, 1054, 196, -405, -983, 137, 295, -165, 36, -785, 221, 517, 149, 234, -299, -464, -445, -224, 851, -717, -604, -705, -106, 189, 395, -356, -521, 499, -58, 544, 166, -867, -221, -424, -423, 667, 454, 25, -69, 69, 231, -488, -1096, -1049, -687, 908, 1282, -1068, 266, -575, -72, 848, -5, -490, -268, -90, 474, -370, -436, 53, 287, 17, 617, 1035, -44, -277, 409, -273, 523, -367, -468, -1112, -746, -367, -17, -207, -142, 145, 168, -37, 524, -228, 792, 578, 275, 230, -1133, 133, 1561, -171, -73, 638, -289, -537, -54, 68, -815, -316, -808, -47, 940, -534, -352, -404, -865, 792, -1354, 405, -108]
4303a08j38l72P10m10K44J330j214j011J04K004r22m25p21P68j63M51k85J31J37
4322A10J585k374J936j624j46N01l14O22M05j416Q34k97k82J10J28K8o93O53O25
4341C91K10k37L04q32M63o25J675j592J076k84L0o96O34l94j93P5j68L97J9j382
4361a129R15k47M82K14L16K07l2K76q31m99J096j865J653q41k32J063l38j61m47
4380d00K19m66J220j644Q95l48K97P0j230J530l11R44r60M11q99q10J679J91j303
4399i15J136K53j146M69o52J798m01j038N24n78k67L92J647j495L93j045J40R84
4417A99m65R00K48n24r31O4j79J253J48n1p99m6O10j236J291k55m82J002j003
4436b56p1J685j833J126mj345M63Q3O44j185m56J130n72N99n44l66J06J053m36
$$ y = [-108, -246, -618, 92, -318, -74, 1256, 42, -969, -865, 1139, 217, -208, -929, -161, -324, 127, -158, -27, 110, 1695, -679, 1257, -367, -513, -12, -326, 296, 701, -715, 119, -178, -460, -350, -222, -194, -887, -234, 391, 601, 364, 668, -164, 299, -326, 1349, -243, 833, 549, 579, -117, 517, 123, -70, 5, -163, 234, 253, -1129, -214, -461, 21, 235, 551, 758, 726, 1002, 171, -328, 768, -1097, 556, -285, -517, 546, 208, 47, -400, -181, -647, 573, -1071, -176, -524, -227, -157, -1387, 143, -168, 776, -184, 227, -672, -1482, 197, 388, -915, 221, 474, -672, -203, -855, 943, 542, -496, 28, -550, -817, -425, 1222, -273, 120, -925, -785, 199, -266, 634, 882, 358, -573, -509, -688, 565, 713, 662, -137, -183, 427, -809, 482, 227, -255, 747, -256, -327, 1358, -475, 651, 647, -698, -235, -152, 492, -693, -1149, -19, -591, 8, -536, -902, -796, 257, -179]
4455a79M34q0r67J002O30q45Nq76M32N51L05M18j756J276l68M8n71p78J653j604
4475a270J795o89j173K508j678l86P0M58J097j365j8P05jN82j179N60R52k294
4493a326J692j259R37M04K35n65L23N79n05j183O77k45J197j331M58k2m42Q24
4511D48p33K69m54n85J624p58K22q60j08J990n28j930J006M04j36N09j3k50O21
4530G38J21j72j094P52j01l65R18k14R3j563J663j42l04n67m50K15n32J222O96
4549I14k694J266j7R37ML4j105j002P14J787j812K133r90k571K628K99k70P01
4567I56j258q1M82N06N6L17j091m40J642m61P27k212J062l71J68j62L57q4j489
4586a376K116j516J686k035k32J127o80J574k21q24R01L73q09m20l94J290O25
$$ y = [-179, 255, 175, -792, 210, 840, -5, 0, -876, -444, 107, 412, 830, -926, 350, -18, 30, -541, -1319, 334, -1270, 525, -164, -1337, 1171, -507, -893, -823, -365, 732, -633, -651, 54, 53, 635, -544, 16, 968, -1326, 366, -893, 44, 448, 683, 118, 441, 1020, 515, -668, 9, -236, 961, -370, 88, 66, -376, 448, -285, -16, -470, -1055, 569, -189, 33, -827, -935, 1055, 527, -1403, -397, 7, -129, 380, 367, 117, 738, 859, 687, -407, 345, 244, -121, 797, 583, 676, -887, 776, 634, 330, -237, -687, -472, -1004, 218, 914, -1780, -514, -531, 406, 410, 444, -661, -1663, -949, 838, -974, 1159, 169, -2402, 226, 525, 255, 956, -302, -383, 99, 605, 661, 978, -113, -553, 1089, 628, 1355, -857, 205, -166, 2, -160, 197, 113, -1376, 740, -776, 910, -1125, -1357, -230, -910, 664, 443, -381, 520, 893, 84, -336, -730, 560, 1185]
4603A185o77J92n11k40j294R44j1o28R74P66j622j356J181J608k187J748n86j78
4621f92L42j000K683k035J154p28j52L38M04q9k10j585J778n87J505j430O65r9
4639B62K68j23p57J184K3j201J099R39p98j025M86p53J122Mk084J771r99J683
4657A101k72q97p04M00J29Q51K90j331O8O09r12N10l75N44l07j67M43o22R30L10
4677E98n78P7j326J223P66m87j379J423r18k19K76L57L70o80M5K48J271j503Q68
4696D32K91l08m59N05n09q94N51P91k84K78j37J86p65R68n10L82j268p74P18J642
4716H36k09O50j276J14N30o72M7l53J273m90n33N77p74q3o36Q28N02J22m55n44
4736e46M50k02J374m22r17l34K11O80j39K60o16J00j83Q47q22J149j654O60M02
$$ y = [1185, 508, 700, 189, -51, -1345, -401, -412, -1040, -66, 700, -922, -2278, -1097, 511, -1676, 72, -514, -692, -350, -1350, 1333, -702, 452, -276, -428, -90, 314, 225, 15, -1570, 208, -379, 1126, -304, 361, 262, 530, 407, -350, 834, 857, -344, 755, 1694, 896, -129, 357, -396, 726, 730, -1354, 417, -582, 1101, 829, -68, -772, -372, -243, 608, 898, -433, -365, 244, -668, -158, -533, 11, -296, -463, -20, -642, 288, 598, 20, 97, -1229, -6, 760, 273, -1106, 317, -601, -820, -544, -187, 183, -497, -452, -204, 1067, -436, 432, 723, 415, -44, 461, -48, -942, -391, 400, 116, 394, 257, 443, -322, 646, 136, 518, -750, -1524, -806, 836, 627, 1277, 1, 115, 645, -27, 20, -333, 940, 450, -83, 494, -280, -363, -999, -171, 331, 453, -2, -546, -96, -298, 1076, 654, -263, -597, -386, 294, 155, 415, -201, -101, -284, 563, -259, 890, -764, -104, 298]
4755B98M80P88j752L05K0j39L05q4j58k47o48P41L74J02j711L95M61J83P67o54
4775a74j38m28O43p72K511j529k91n05R79P52l08k78j326J2N45L69K4J2p68L42
4795c28l08J449J73o27j7M21k23r58L12o23j14J695m59j99j234J193n66J542l69
4814G60m7r99J04M73r7J91p02o03P45L12j91O13q69j2n7M89M25K91k001Q06J130
4835G61r52L29j308J393n35J191k44n66K13r22OJ28N49M19J39n31n78q9M75R9
4855b3kn98K94K17r83R63K73q98N54j93l07Q50o92O52Q1n30M96j84L73q63N66
4876D6p63Q15J82n01J72l36J07M63k50J60R1l54j86J204j390L99m14Q52j6l54
4896g3J99pj028J068r0n44R06n04j78M20n95K78n85N08J83j15P55p14l51O46k78
$$ y = [298, 778, 1566, -186, 119, 139, 0, 305, 221, 63, -184, -832, -91, 283, 385, -1326, -931, -470, -287, 480, -174, -312, -740, -97, -869, 1642, 113, -178, -683, 296, 1048, 740, 462, -864, -852, -307, 62, 86, 98, -670, -328, -636, 813, 986, 359, 342, 763, 540, -418, -106, -729, -843, 852, 393, 194, -1040, 153, -413, 1129, 760, 713, -286, -182, 291, 194, 385, -317, -920, -175, 137, -54, 559, -310, -322, -379, 110, 535, 826, -1175, -369, 761, -191, 138, -1170, 223, -312, 879, 635, 69, 282, -640, -634, -506, 43, 462, 601, 70, -508, -597, -122, -23, -25, -623, -329, -112, -1095, -132, 141, -757, -203, -396, -703, 147, -545, 107, 188, -342, 154, -30, 343, -520, 46, -717, 98, 280, -221, -49, -385, -278, 185, -65, 95, 186, -168, -354, 850, -540, -141, -555, 297, 281, -73, 126, 119, -909, 159, 69, -475, 431, -73, -251, 169, -426, -148, -733, -225, -42, -157, 598, -116, -467, 179, -99]
4917i9J93N95k89m36J93o29K63K94R36j472q59N08M52J790o45j073l90O34L51
4936C17j49n3r93L91J423k55R1n75p14R47p94J042O9j228q15J121R21o30o8p11
4956f63J062K86j127P65J8j165J039J79M4j049O29J70j52L83L44L28j146J74l58
4975b39J91J267j434R69j659J125r4M28o69p29J505l81N8J095j532k25m20J781
4993A037p78n46k90k08J178l41M91r99j76M77J32J31j24k09K41o6rM02j542J349
5013A50J33r9j35K91p46l62j44L08j70J471j725R64J98o62J245j70p72m17J98
5032d44J445n68o33j8k17J152j739K89O22P25o12o82Q15o01M02K74m07R17M40
5051A160q95m13L83k82N37j09j195P45q97J384k48J31K98R35j278q81j86J379
$$ y = [-99, 94, 689, 400, -36, 157, -472, -209, 85, 1021, -451, -1310, -802, -350, 1440, 795, -278, -668, -34, 317, 168, 115, -878, -487, 936, 681, 772, 197, -517, 430, -364, 678, 747, -481, -1296, -175, 746, 116, 48, -663, 399, 685, -442, 323, 341, -824, 215, 394, 438, -611, 18, 188, 36, 419, 763, 1091, -55, 119, -239, -48, 1219, -215, 754, -905, 220, 126, 554, -115, -844, 661, 280, 338, 1433, -99, -324, -744, 1037, 259, -287, -577, -785, 393, 52, 543, -456, -632, -155, -23, 108, -16, -225, 16, -50, -59, 343, -1199, 150, 283, 184, 49, 340, -406, -768, -912, -604, -774, 697, -1028, -64, 134, -528, 717, 547, -225, -642, -444, 1001, 433, -200, -218, -435, 717, -1022, -733, -111, 614, 2, -680, 135, -466, -64, 210, -197, 720, 1160, 265, -148, 235, -47, 490, 381, -814, -69, -966, 418, 170, 301, 599, 1534, 256, -625, -811, 568]
5069E68p49L67Q21n14j55L1m22K01K00q35O03j37q90J628l89J57o27k11L64J72
5089A83o84p6J22R75l79j22j116R50L80O6j73M5k75O5Q75j114Q76q80R8J664j377
5110A03K68j64j141J652j185Q08J41n38j258J539o24J288l05j393k13J414l47
5127D5M89J56j643k12J591N29r40m84l15L28J476r21l45r1m10N58P22m81o65P14
5147A01j075O87M68n28N17j576J113J535j045r69J133p80J420n67j344R84j06
5164c2J0M42k50Q64o78M33j378J429m35j382J471p59l92M88n95J080l05q64J007
5183A54j03J88P5p69m07J034N17l73p01J609j513J10J045n40p54N31p20J20L02
5202a95L4J84j74N21k43O43n91J29n30M07j26p25J398p96k56m5O83o13J03o0J09
$$ y = [568, -181, 186, 1007, 493, 338, 369, -53, 148, 348, -487, 116, -21, -911, 717, 328, 485, -142, -353, 11, 183, -501, -577, -455, 520, 141, 19, -1097, -147, 233, 299, 126, 171, -104, -39, 836, -278, 598, -282, -184, 1480, 103, 371, 207, -934, 718, -467, 341, 482, -56, -1314, 225, -399, 889, 584, -809, -1022, 392, 45, 534, 690, -953, -1165, 426, 955, 15, -469, -784, -456, 1020, 99, -246, -337, -747, -189, 533, 52, -613, 101, -974, -287, 181, -347, 170, -1406, -293, 1242, 197, -772, 361, -419, 1001, 434, -910, 74, -32, -22, 420, 170, 1034, 356, 789, -589, 840, 405, -977, 494, -265, -657, -169, -764, 316, 11, -853, 154, 51, 239, 314, -455, -862, 172, 689, 316, -385, 1224, -289, -179, 866, 326, -428, 103, -617, -497, -195, -161, 23, -151, 370, 127, 770, 179, 308, -222, 185, 59, -666, 732, -64, -320, -365, 318, -295, -192, -252, -143]
5223a43L91O79m74p97M94n43R11L4q61J79l33J388j031L86Q91j207k94M24P87
5242H81r91N14p78j20j91M17j64M8L63r27J214R06j605m7K72j26J227n46k10l15
5262a78J21J873j688q86O11j86Q55j66O6r41M55j048J307q72R21N56j541Q74p34
5281f01J220o87J84L12n40R07p73k31Q11j049N9Q2K28Q95j614P03j391O89M89
5300c07J024Q4o35r06R42P2J55l33k71M03o63J328o14r19K58j048N14K244q49
5319D79r84J421p57l61P91j847J200r4N51p74P1L12j198J540j43J68M12n78o21
5338d12m00O45N4J030j445L87N52o26p86J183p42K4L92R08K41n87r95M9L53J7
5358a58J129q45L33m50m99K322k556Q39j034O3J436q05J236j648N67o31K330o44
$$ y = [-143, 248, 927, 453, -344, 150, -393, 518, 552, -309, -130, -463, 925, -106, 280, 1171, -36, -330, 94, 881, -110, 404, -374, -494, -685, -268, -432, -384, -21, -948, 266, 1172, -433, -480, -208, -334, 893, 347, 137, -178, -57, 1816, 128, -758, -147, -333, 522, 356, 422, -519, -64, -1112, 195, -677, 244, 800, -741, 133, -601, 619, -68, 116, 428, -112, 795, 22, -209, 602, -447, -388, -306, -78, 817, -797, -94, -1485, -796, -307, 717, 801, 166, -740, 202, 274, 429, 96, -175, 228, -435, 893, 279, -640, -382, -1430, -916, 1328, 479, -505, 916, 159, -202, 589, -1258, -58, -152, 399, -375, -304, 8, -1190, 350, 207, 375, 787, 209, -412, -812, -167, -113, 917, -528, -141, 411, -215, -1001, 182, -560, -536, -144, 764, 1005, 418, -577, -528, -175, -158, 971, 126, 459, 9, -490, 1832, -724, 115, -919, -856, 580, -225, 1011, -637, -70, -701, 1629, 985]
5376I85p56p29O04j432K066J51l58j570N55K64R04j58j244J66m09L36L69P86m54
5395G6q81J414j234J74p86J140j39r92K391m76j051J446J12k21m68k09j87j337
5413a228J660k19L80O05k231P19N21K33J303j443O78o20O59q86K76P60m56j031
5431c20J333r08n53L63M49m19j21P81j469P31jq7L27Q99k946K056k76n9R4J61
5451C5j849K832m53q40J307j357L34M08r01J149k71l99N96j185Q96j253N97L14
5469d0L34R69j544l97J113K99q23l53n79J086Q31j363J090j772J009R26o35k95
5487a44R04k018J082n94J47Q27n91j004P52J17J860k259Q77M9j177J903m95M80
5505G16j047k91O29M20k58P42r29o14j4L92k52L20p45L60J247j613J054J63j6
$$ y = [985, 229, -500, 104, -1328, 738, 889, 531, -1039, -484, -220, 684, 526, -718, -552, -961, -625, -256, 530, 76, -805, 609, -625, -451, -1237, -97, -236, -1228, 1163, 687, -364, 1082, 1194, 973, 505, 296, 109, -1228, 432, 213, 593, 1198, -1033, -314, 207, 440, 1743, 300, 978, 358, 1017, 131, 407, 1167, 711, -320, 1013, 105, -448, -85, 364, -55, -176, 605, -864, -133, -134, -221, 106, 1005, -1941, 115, -161, -220, -126, 35, -1814, 1018, 565, -275, 1032, -325, 9, 417, -484, 665, 394, -5, 591, -594, 302, -951, -354, -40, 294, 1263, -281, -678, 435, 734, -89, -442, -1021, 65, 896, -467, 623, -1149, -140, 786, 151, -144, 760, -1258, -176, -770, -623, 204, -387, -1391, -639, -522, 1338, -921, -44, 5, -1172, 731, 236, 716, -331, -622, 7, 427, 169, 911, -18, -632, -646, -254, -506, -186, -931, -571, 676, -937, 117, 280, 264]
5524B64M22m35o62J494k851J132o31J193n3k50n06N54r26J248L38j104k5Q69Q70
5543I41j176n08J069r98J149N50j960K121k229o23J119J182j036o7R82j99J5k066
5561a734J449J223j147J69J141q53o63J489p55M81j356R82j708K371k266J242
5577F5J15q11J144q89J96J052p34l99l51j80n04J290n4n58J41P7Q81m46N09j248
5597g04o81J218r72K083n67j461J165M31j014J233o67J14j84p88N44J618q97j292
5615h21J334K9j68p45L29P0J59r07M20n01l46N9J026k11Q38m36j36j03l53J041
5635E78j610M04J386n68j57O13j249P39L58j179L49mJ07P77q22L34j35j10l82
5654e71N45m04n53J123Q9n97l08J82K27M09K71n46n15J094l75q31m04J191J78
$$ y = [264, 686, 251, -411, 1083, -1768, -636, -1267, -74, -127, -377, -883, -329, -1255, -7, 331, -773, -798, 71, 941, -235, -743, 326, -672, 477, 1027, -933, 1188, -1041, -1664, -545, 637, -399, -466, 516, 317, 332, -1734, -285, 938, -209, -40, 1101, 248, -415, 1074, 319, 800, -556, 426, -1282, 1089, -1177, 65, 180, -631, 513, -376, -180, 872, 138, -261, -612, -792, -1296, -6, -60, -618, -477, -400, 481, 35, 544, -704, -1385, -167, -1139, 944, 377, -1084, 81, 512, -502, 731, 64, 178, -6, -794, -250, 1368, 471, -821, 513, 542, 374, -371, -42, 28, 187, -720, -300, -801, -1147, -1088, -62, -273, 565, 129, -7, -110, -463, 578, -1032, -628, 758, 190, 33, 646, -603, 136, 494, -685, -336, -340, -233, 544, -278, 56, -79, -189, -571, -26, -430, -983, 140, 229, -368, -676, -494, -267, 142, 413, -133, -648, 446, 71, -760, -1164, 27, 205]
5673B05K6J5L87j645J094p10L75M2L4L34L60m66k61R82j912J862r18L96j214J817
5693H03o07P77j386R8j473J441n5J343j804K46O32m1J032j045N67j823J898q82
5711b79J415j605O7m67P72j52j8N52m04n34J283n38J03J1ll25%R08q57p26K70
5732e27O26n36P29L6o76M49r19J114J81q1J24k282J094J102n84k12M45O3p31J727
5752A142n06r69N81J030j240O38l42q96l10Q11Q64m52q59m51L25O63P24m40K6
5771C39p35l92J262q6K59r20l86J00P14K99l38m63M13j03K76L94o17q03J266j60
5791C19N39m41j020m96O09M38j65N40n89q62Q59L40O96j205l93M2J309J59o45
5810C4M18j102Q47o93M44r1l47N64R4M85n62J45r10K39J176N16q71k51r78J86
$$ y = [205, 231, 246, 633, -1012, 82, -628, -253, -211, -177, 157, 517, 51, -210, 772, -1140, 722, -196, 200, -1014, 803, 196, 973, -413, -315, -1788, -347, -402, 941, -863, -617, 15, -26, 1006, -39, 528, -1295, 603, -279, 1136, -469, -402, -869, -97, -249, -267, 285, -119, -653, 630, 92, 195, 206, 203, -122, -122, 786, -71, -797, -527, 99, -437, 292, 328, -348, 101, -818, 296, 477, 396, 520, -1762, -668, 434, -150, -362, 83, 146, -585, 1142, 636, -333, 248, 1278, 38, 676, 334, -562, -872, -61, 803, 351, -508, -959, -634, 29, 753, 313, 339, -396, -788, 474, 388, 647, -273, -659, -559, 155, 454, 116, -347, 66, -37, 239, 633, 16, -787, 479, 319, 858, 417, -603, -1099, -490, -52, -217, 323, -266, -1128, -269, 71, 767, -438, -831, -789, 520, 679, 34, 452, -650, 197, -496, -52, -143, -490, 74, 168, 653, 91, 236, -674, -435, 741, 1257, 386, 135, -843, -657]
5830f57J155k31P4r3j188P02N80j42m91L55L2j9L50n77l90P8L05K87K29K97p57
5851a01K11Ko7l46O27m17k62m0l99Q31L30j95j27n47K60j65P21L16p50O51m93
5872D0J50L42j011J360q85m4j22J103p60k75L30M8k7K4m96J95J29L14o57K04k96
5893c34j71J66k19P56N59q67J81l34o14J233r39m1J88m57J268L14m82l23l76k25
5913g17J155K13m89L4r95J368L38o47q05k96J72J105K09j87m96j41L12p3O00j368
5933g08j33Q10k32R00k78j36j77j026J223j92Q36j536R86p77R04o22N23l78k11
5952b24N46o13J183o08o84P29O4J68J33O51k400P95K60M91j21j167M45K75M81
5971D04n69K12m47j86O92K08m7m91o26P49j8R93n29n90j097P98Q14L11r5l68r36
$$ y = [-657, 498, 267, 341, 248, -940, -238, 342, 200, -291, 64, 96, 77, 427, -150, -540, -462, -157, 130, 359, 656, -101, 110, 112, 45, -301, 326, -91, -353, -393, -792, 39, 369, 174, 47, -500, -240, -405, 316, 632, -118, 533, 40, 190, 532, -479, 881, -4, -48, -170, 933, 173, -102, 228, 276, 249, 273, -223, -28, 101, 415, -242, -38, -334, -505, -339, -558, 198, 757, -110, 71, -263, -877, 356, -583, -624, -436, -893, 375, 689, 207, -116, -492, -717, 438, 651, 162, 196, -799, 569, 907, 260, -545, -841, -669, 436, 645, 458, -38, -179, 133, 60, 660, -708, -841, -31, -263, 637, 359, 223, 46, -980, 243, 51, 887, -649, 337, -440, 464, -158, 365, -13, -224, 322, -291, 892, 284, -400, 329, 393, 561, 694, 1345, -1055, -260, 0, 491, 370, -797, -352, -77, 404, -165, 47, -400, -586, 106, 314, 267, -224, -850, -101, -119, 874, 345, -245, -1342, -544, 270, 581, 486, 118, -818]
5992h18j65J078l05R33j334M54k30N49L69r89k85J43J201l96L88j369P61M07k7
6011C65k79j97M4l54J56N89q41N80p54K60Q21j03N13j349O41p78P14J15n48K06
6031a99k5O14M37l83n16k10m91M02O48O70p38q0k69m64J129K36p25NL48n72L15
6052A32m71J122j194K2Q08L33j179Q36n06L71L09p81O95o60j25L16L68o2l04k75
6072b45M25K53J10J25j018l52J26O79Q5m03Q59p85P90r0o18PN18r20R54m29j67
6093i6j95P24q39Q60N1l40K38l76o04O50o85Q02%k23j65M9P31k8j404L04P04N81
6115G39p23Lm11P37k8j099J697o13k05L08o85k33r7Q15m65K57M70o68Q09n19J10
6136A99j72L50l89J68l46m12Q14m95M51m83n4M70m16M67l80m00J668j586K18N89
$$ y = [-818, -983, 95, -210, 723, -611, -157, -387, 162, 531, -458, -743, -600, 601, 205, 593, -776, -15, 392, 365, 86, -111, -67, -421, -265, 324, -517, 63, -691, -431, 390, 287, 800, -549, 92, -686, 28, 143, -405, -199, -224, 390, 827, 444, -72, -282, -773, -371, 277, 947, 209, 129, -140, -604, 525, 761, 36, 41, 389, -183, 132, -339, 783, -411, -389, 419, 752, -427, 409, -97, 274, 583, -198, 497, -163, -288, 28, 396, 334, 30, -245, 180, 433, 543, 668, -350, -702, -576, 103, 188, -215, 644, -141, 649, 559, -59, -52, 466, -454, 500, 71, -96, -291, 433, -406, 454, 505, 165, 403, 27, -577, 73, -612, 190, 190, -33, -198, -149, 582, 554, -850, -546, 158, 739, 16, 19, -392, 345, 317, -782, 915, 302, 97, 405, -280, -513, -610, 205, -260, -3, 467, -201, 608, 89, 199, 27, 377, -12, 156, -190, -602, 212, -283, 168, -315, -369, 101, -315, 152, -228, -628, 1040, -546, -328, 261]
6156B61m46n0j85P63o50Q37j92K42n81J44o4r06J013l42J53k58J094p19l8k95
6176b19j51M69o02O48Oj259P86O10k84l8r5o81J631m91K78K61j298K39J032o58
6196A84k12L61K15l41j27r15P17L72p87P22K5j019J152j071j85J811j140M6J03
6215h9n69K8O87k36K5N32L10J38j635R17o51K43Q90r00Q16K64l66l82J2K37M12
6236F83o17M9N74o02J46l42P76p63Q62q29Q82p47J98n82K52J16P45q46k23JJ34
6257a33N13n96K01P35k57p73J146j350L21J42O12j176N62m46M01m6q9k08O05j139
6277i75K051j025Q84O65j412L76m4q45N1k36N12k09P78j94n11N88l58j85j84P19
6297D46q17O77J78K5j225P54l61P98n83K71M7L49j70Q2q15M81j79K77o33M62P81
$$ y = [261, -185, -235, -420, 343, -307, 530, 338, 580, -1, 143, 79, -827, 186, -156, -3, -261, 833, 114, 76, -219, -370, 99, -503, 145, 151, -1108, -322, 288, 4, -34, -129, -810, 821, 330, 608, 869, -429, -190, 842, 184, -28, 333, 548, 207, 80, -835, -118, 254, -533, 189, 214, -805, 347, -724, -909, 902, -238, -192, -89, -658, -630, 57, -179, -154, 378, 688, 826, -809, 108, -543, -300, 590, -310, 506, 770, 404, 22, 34, 271, 683, 66, 115, 689, 87, 233, -109, 667, -96, 766, -63, 819, 72, 270, -312, -60, 56, 801, -45, -268, -267, -133, 380, -216, -15, 720, 463, -310, 836, -514, -193, -51, 561, -615, -53, -499, -98, -144, -233, -441, 164, -975, 1076, 51, 935, 1600, 188, 564, 520, -325, -274, -510, 2, -207, 571, 377, -134, 454, 96, -89, -273, 446, -371, 306, 484, 509, -716, 38, -323, 475, -108, 163, 210, 559, 389, 471, -344, 137, -42, 235, -398, 64, 845]
6318H45p59L14k80q89R81r17J791j796R09J599p30r46K25o12M4J9P2k36J744j053
6338C25l77K48R26k90p05o55k52K13k11J224l60M97p7p95O73O8L26R1l19n53N38
6359E35j72q17J49n28O94Q75p33Q44j785P10Q49p83m6j69L63j207J765j728J218
6378C4L8p64J820r11J61j69k64L3r8j97l19R39L58o33N93o53K48J92r28m91R98
6399a3J086j169n90J58j64J042l54J145m26l56k52O52m62o77mO80l72O87l61o39
6419c89L21l52J211J46r30K70N00q80P6k09j33K44N58j7q14R33r20L73j20K58
6439A26j007K19N80L64k93o12K42Q27j21J91k07k16J62j7Qn06n54J472m63m39
6459b44o4j63M13j10k5J236m6j279K77j88J6q93J823k25m1q95Q01m79K68M30m17
$$ y = [845, 86, 400, 120, -769, 212, -705, 1086, -710, 199, 1798, 1068, 122, 347, -265, -221, -202, -130, -366, 1378, 325, -52, 196, 1122, 832, 127, -528, -780, -567, -778, 446, 86, 583, 506, -289, 384, 452, 778, 869, 550, -3, 535, 363, -454, -305, -833, -139, 736, 3, 847, -938, -228, 621, -162, -208, -377, -14, -1221, 544, -1184, 34, 72, -692, 1128, 217, 378, 209, -55, -22, -120, -317, -636, 303, 661, 28, 621, -32, 216, 408, -520, -1011, -13, 1073, -96, -686, -528, -692, 350, -4, 1141, 715, 359, 107, 759, 297, -380, -384, 296, -76, 611, 250, -389, -68, -420, 791, 937, 7, 277, 777, -103, -27, -236, -369, -125, 433, 416, -398, 535, -385, -12, -132, 126, -881, -662, -82, 282, -11, -623, -381, 446, 325, 516, 309, 93, 255, 238, 246, -260, -814, 658, 195, -244, -308, -471, -58, -168, -193, 1043, 997, -282, -5, -193, -177, -1070, 753, 528, 487, -408, 393, -86, 182, 612, 195]
6480A95J51J09L53p39r93OJ058j83J90m86Oj40R09p24o6p18N62M40j93R92r31
6501b02K83q42Q18N1R37q53n21M09k59m04J059k44n03j15O06k19n93p06P23m59
6521a034P05O98j211P6N61k57Q25l58j150Q37k1J86O19m74m1M99j002J568M80
6540A506j642k53K53m52J129k75l94M66j99M73J199j879q39L71J040p66Q11o6
6558D83p75K1M58L41p5j270P46Q0P03n1q81j45Q4j027K471q16L0m53o16L87J630
6579A325j508N30j156J375j008R45m04o54L79k86J276o07n83j26P55n58L82M00
6597D77l60m08l98J483N19q92j385P05M9k59Q88K29p85N2j7J46J444j292j518
6616a322M7J013J356m09j067M08q46J348q42q6L79m96M73J086m59J58o98O52j135
$$ y = [195, 346, 455, 808, 69, -924, -918, 140, -43, 147, -339, -333, -473, 436, -288, -354, -1072, -510, -70, -263, 729, -202, 81, -761, 57, 108, 1045, 192, -329, 80, -179, -583, 476, 232, -271, -386, 220, 1, -592, -1298, -575, -1034, -329, 369, -842, -766, -205, -462, 363, 5, -1145, -308, -329, -143, 476, 2, -39, 460, -542, 1026, 1506, -136, -389, -136, -588, 541, 266, -128, 338, 139, 612, 1811, -68, -907, -536, 504, -262, 549, 483, -292, -271, 187, 528, 453, -817, -71, 9, 712, 661, -220, -365, -281, -1308, 1163, 347, 377, -76, -692, -305, 1325, -183, 347, -809, 566, -442, 503, 99, -555, -176, -462, 814, 207, -376, -502, 253, -305, 77, 477, 117, -291, -689, 794, 1313, 421, -964, -259, -210, -469, 419, 648, -137, -85, -102, 44, 1488, 196, -1322, -1275, -262, 1094, 685, -382, 26, -820, 528, -314, -400, -21, -517, -44, 1042, 583, 741, 43, 695, -440]
6635d40Q4O12p44m16K53J777j222J13J032p13j083P61L98R98j882M82l59N45j036
6654h40J349j397r00K745j435Q62j365J97N49P82J55o43n37K69R5L20K9m91l06
6673e62O94j061J355o93O42q74P00n9j21L00j07p03J64J041M5j588k72P14J00
6692b85J50M47L72j822J475L77j541k41J052j24o25K36Q66o50k13K47J098o20
6710A99L95j801Q13K69p86P11j141J469J13q13N54o24k27N17M79J036j150n92
6728e79P36r31M08M89k28J09j70M96q7k68o37L95N46L25j346Q62j221Q10M03n03
6748c91L68j22L21m89N25J56k08k88M10M83j231L99n19l91O3M66P50m2m59p62
6768i61P60R53o59n10R12p0J28K20n63r43J705K65j519N05m41j25Q93k084J071
$$ y = [-440, -356, 256, -488, -904, -651, 1126, -96, 17, 1049, 336, -747, 14, 412, 1410, -472, 10, -349, 196, -840, 509, -888, -1788, 957, -478, 384, -981, -784, -235, 547, 702, 59, -478, -209, -114, 206, 235, -256, -562, 132, -929, 426, -267, 375, -499, 201, 142, 21, 321, 214, -489, -325, 716, 761, -827, -1099, -385, -285, -135, 312, 684, -1138, 337, 714, -827, -1068, -16, -140, -765, -529, 337, -313, -526, -279, 819, 199, 594, -1207, -394, -125, -911, -200, -1341, 128, 241, -572, -18, -642, -869, -352, 127, 1163, 13, -579, 157, -774, -366, 123, -105, 4, -166, 330, 243, -25, -662, -267, 279, 604, -742, 120, -1101, -291, 112, -391, -23, -145, 176, -313, 212, 368, 160, -128, 282, 765, -466, -67, -586, -977, -914, -448, 302, 260, -199, -961, -201, 752, 93, -417, 495, 425, 553, 773, 210, -733, 972, 1237, -282, 223, -218, -343, 550, -1534, -463]
6787d63L29k62J44k41Q56l75P87j00j027K10J410j452P78m46m54Q40j08kj88M67
6807G03p1j042k44j62J628j417L17Q7P84n66J426r74j264L26O15q03P92j397J349
6826H7O76j323Q80k008J329k6l70K70Q43l93l32l10L62M6Qr69P31O00P45j466
6846f20O71L37j118j3R40J76j65L95j73j79J45k56O67r93L18J74p24P97j970R18
6866f73J521l98j160P95m37k74O04J51n24j87J47P21j26r28J650p25P87n84K6
6885C86j030N58n93J132l12K24m80l30J05j088K587O3j539q16J092Q51O7j204
6903c27L7l7J020j493J239k4p4o76P35m41L30k97M62q41K23M72p80M30k88J8Q2
6924b30o56N55p4R86p22K2l9P7o09J439r21k28n60M28l21j23J196r32J451R57
$$ y = [-463, -134, -396, -252, -493, 363, -12, 775, 675, -352, -142, 1268, -184, 594, 148, -306, 534, 426, 424, 236, 703, 632, -410, -654, -816, 812, -605, -288, -201, 583, 17, 1443, 469, -795, -469, 146, -657, 135, -1262, 87, 763, -560, 320, -1688, -359, -385, -755, -485, 358, -35, -367, -677, -315, -269, -261, -1230, -499, 101, 846, -620, 51, 388, -730, -743, 197, 373, 208, 603, 430, 251, 396, 140, 807, -186, 132, 306, -418, 379, -1591, -673, 848, 450, -710, 85, -352, -626, -22, 129, -395, -582, -435, 286, 160, -768, 882, 157, 944, 360, 386, -644, -86, -679, 453, 141, 365, -115, -445, -340, -1428, 1159, 1222, -317, -1133, -41, 810, 877, -327, -290, -327, 693, -800, 439, 415, 341, -335, 400, -41, 289, -8, 454, -387, -164, 308, -472, -42, -330, -312, -230, -886, -331, -405, 581, -141, -119, -158, -81, -690, 749, -172, -400, -960, -532, -853, -976, 220, -712, 739, 1696]
6944A696j848j60J089K4N73j452m25N98J7n14p6Q21O10r87j190J998o76l29l12
6963e43R19J02m37n43O69j04L67q91R1K19L8M72o36O30k82J95j028N11J34r3L66
6984A56J63K86j098J47k19Q50l13O26K02j683K14J036n77J94K95k19j1J129j165
7003A3k95M53N82m56l43o61N90L53j69o34O12l98q22R19n10R39K41M20n79q1j086
7024i12Q03J257l03j741Q41R7n02r9N90J141j684K36O00j25k78L35o00P3K61j056
7044a066P81J166j079m02o6O25K4k38J35K50j76K30l24n76J379m87n19J737j653
7063b59M71j145J535l54N20j139L05k29P01n69K85n40L12Q74j38j060M67q51R09
7082I5p22O85L11n75p25K56Q27j412J059l78L34J126j826J756p46K55j573J014
$$ y = [1696, -152, -312, 777, 801, 1374, -78, -503, 95, 112, -402, -478, 343, 953, -34, -1224, 774, 98, -231, -543, 376, 478, 41, -502, 167, 63, 430, -461, -370, -151, -113, 359, -277, 353, 71, 266, -762, -251, -117, -210, 156, 319, 605, -493, -346, -565, 285, -28, 598, 800, -883, -669, 367, -210, -16, 279, 60, 49, 1178, 13, -282, 171, 753, 297, -46, -707, -117, 236, 67, -567, 45, -353, -1175, -256, -766, 173, 414, 834, 255, 174, -912, -109, 1148, 845, -896, -55, 42, -460, -559, 31, 1172, -512, -276, 324, 199, -79, 256, -344, -271, -10, -1066, -285, 881, -198, -600, -666, -41, -17, -255, -120, 130, -46, 184, -140, -716, 663, 176, -343, 1394, -259, 212, -933, 602, 248, 768, -371, -66, -295, 406, -163, 122, -418, -106, 768, 630, -430, 37, -814, 95, -627, 58, 369, -206, -931, -675, 152, -1260, -201, -579, -245, 881, -945, 811, 65, 320, -1253, -239]
7100b39K13R30l47j775R96M39M59j74j108j80R15p0p41M68P99j014P59O0q3M27
7120G34j312P19r30M67N64m42l25P81p08R78j14l16j94j58K5L20m63l01L35J4
7140c26J197p89p15N34p55J067L77q35K85k95M93j40K30o58M96p28L78J111R0
7159A017q27m59Q92o36L56j93L05j695J721N65r04l88N51K60o44O15m02j59m05
7178d30O7R68q05R38m94j383J397j97j52K07j418O49O41k97L88j69P5P1J103q63
7198B96l05m17l6k11O52M75o32j65M56L20m09n53L96p07L12J31N10N93l96j382
7218a072M35L07O24L50j585K62J30P94K38m69Q50P4p93n43L88J58O7n79L58J48
7238A42m36L47j017j7R03O9n86N02m68L35Ln45N55P19o27P40j476O63N72m91m09
$$ y = [-239, -26, 904, 557, -1218, -222, 217, 676, 502, -606, -786, 129, 59, -682, -214, 585, -429, 330, 390, 307, 734, -578, 141, -789, -322, 242, -200, -525, 256, -452, 526, 412, 96, -98, -256, -231, 89, -374, -675, -340, -326, 871, 82, -633, -99, -854, 213, 590, -245, 40, -255, 238, 98, 328, -330, 166, -562, -184, 927, 1017, 190, -269, 623, -13, 343, 150, 455, -1240, 481, 1046, 142, -246, 305, 565, -79, 536, 134, -25, -430, -363, 605, -200, 738, 244, -1139, 258, 61, -91, 116, -1302, -653, -12, -309, 79, -90, -15, 56, 1159, 296, -9, -426, -462, -673, -21, 454, -178, -343, 113, 433, 24, -529, -133, -840, -528, -397, 113, 706, 310, -1072, -637, -330, 294, 644, -941, -679, -549, 245, 483, 14, 864, 938, 145, -398, -10, 148, 215, -364, -6, 142, -294, 53, -964, -981, -78, -9, -595, -93, -561, -226, -223, -768, -213, 506, -121, 619, -857, -194, 378, -113, -522]
7259e22pJ138K5p38j95J32l03l27K00Q08l87n37M11l4Q50q26J74M19l45K67N99
7280H02o79K95j192R4P86n28R20j154P58Q5j39K95QK25j224KQ32j036J561j425
7300g14J86K55O01k85l45k81p24J140L1P40J34j082J57O40l3j49o43K80k26J05
7320b13P51p9k77o8m85M64q31K07O57N01n00j02L97l07q94k2M13R44J20m23r52
7341f99LO87N9K70k37q11L22J088q87l24rP79K00m36L77j9j90J9K64m28M9P68
7363H45r23k83N67J35o0j170k43Q81MM54n16k86J66j19J017q70N6J093j477k45
7383i74K160j545P5n61J034J31l64o14N90n63L74j54m68R69m54j83J684j270k39
7402c72J254r30qp63R49n82J82j92O77j19N50k89j015P84n1k15Q72j236Q45k90
$$ y = [-522, -529, 609, 634, -104, -299, -167, -470, -797, -597, 211, -176, -713, -302, -336, 514, -312, -138, 281, -64, 203, 802, 123, 418, -774, -680, 106, -422, 498, -656, 102, 187, 48, 343, 351, 576, -648, -646, 186, -850, 711, -714, -528, -273, 328, 43, -302, -583, -1307, -167, -136, 604, 738, -344, -187, 453, 420, 271, -372, -92, -318, -213, 538, 459, 182, 114, -371, 93, -738, -531, 126, 627, 127, 25, 422, 115, -779, -801, -388, 556, 676, 253, -699, -696, -9, 50, 320, 83, -728, -406, 682, -205, -529, -538, 241, 441, 5, 382, 363, 173, 192, 456, 28, 77, 845, -78, -361, 206, 341, 281, -889, -1132, -251, -247, 207, -309, -595, -429, -548, 469, -401, -345, 748, -729, -974, 1186, -359, -284, -845, 189, 320, -44, -658, -68, -631, -257, -411, -879, 90, -364, -547, 1137, -133, -372, 882, -48, -56, -819, 130, -452, -270, -462, 215, 96, 646, 357, -658, 126, 75, -140, 732, -504, 341, 51]
7422E1L12m29p73M02K4M02J66K65k07j38j182O06L10o83O66r7L83p01N79j44J45
7443d3n7J68Q0L73N14j154p57Q18M63l59O21j080Nm70J532j051p27O25P89m05
7463a15q94J218q33L78j159J282j190J370q22J127o3o11J039j099n70Q4J156K19
7481E17m22n42P34N77m76J40m21p16n7L03Q53m76O7L01o38M94o43j64K41n9J132
7502G45l38j382J032r60J110j033O67j20n89J770j270k30K57M08O31q08o39K88
7520d61N27r6q41Q91l24j48j16j24Q96k51j86J278j281l75J300r53q5O24j44Q6
7540B17L73r4j155o23J066k58R81q07j84M42J14n51N29P96j893J661k80N5n43
7559a54m80j75Q73m67K13l71N51p07J253k28k46K23m59o2N50L60j513P5L61P99
$$ y = [51, 363, -66, -839, -437, -413, -11, 155, 420, 213, 75, -1107, -501, -191, -874, -208, -305, 78, -623, -44, -188, -43, -100, 68, 148, 521, 1035, -119, -876, -58, 405, 46, 667, -413, -408, -878, 654, -397, -1124, -499, 290, -115, -1009, 209, -624, -246, -1405, -123, -1313, 57, -765, 362, 299, -312, 727, -372, -942, -858, 298, 517, 95, -447, 287, 864, 388, 528, 107, -609, -666, -363, 490, 14, 81, 382, -256, 238, -405, -569, -328, -387, 745, 407, -975, 57, -903, 207, -826, -159, -279, -868, 902, -368, -598, -341, 67, 698, -110, -749, -461, 66, -30, -871, 20, -304, -452, -568, -692, 204, -47, -233, 1045, -236, -611, 689, -264, -349, 275, 131, 217, 590, 496, -659, -1282, -216, -474, 507, -300, -484, -42, 72, -479, 50, 846, -1047, 614, 334, 389, -154, -634, -809, 64, -403, -190, -561, -10, -717, 536, 308, 62, 285, -174, -236, 314, 674, -839, -764, -403, 396]
7579C96j109O15K57j60p38J034j071M64J230p13K17J06j037M12K7j87M65m9R7
7598B56L60l44j008J039j71J69l24m86K67P91j06j237O73oo15O44M29p48l55J644
7618H72j108M32K58j147R98l95J1M26l2k90n25M94k62K82M55j99m10M89k4k93
7638C2j89L44l03K08Q7k31o67J176o34K51O76p55Q1r2l27P53p4q53M84m8k48M86
7660A57m6l95J58N7k39J0O34j00k6j15K64o73j37N76j5p1j23L01L30l72k44QO4
7683CM65k74l96K61l3J03m91N75o54N17K88k78j03L8J9O4O78o28p3L7j66K67m99
7706b80j17N4M19k05K30q37N86J20R2k22Q6K17r7L8k75L84J20l14r6M97l80j38
7728a18K05K05k77K19K33k46m3k7l99l2N32l78l45P13oj23m28J7L15L01l62L50
$$ y = [396, -713, -98, 159, -1, -739, 295, -776, -312, 918, 205, 422, 528, -509, -97, -70, -257, 208, 159, 256, 616, 272, -736, 303, 132, 301, -23, -509, -242, 549, 443, -794, -121, -127, -742, -98, 331, -417, -772, 872, -236, 196, 454, -693, 305, -90, -79, 347, 315, 25, -500, -6, -268, 14, 469, 270, -140, 349, 325, 32, -157, 187, -116, 92, 179, -52, -719, 457, -177, 74, 750, -5, 76, -16, -343, 410, 336, -517, -33, -81, -329, 157, 111, -284, -126, -69, -308, -298, 336, 236, 210, 95, 359, -314, -451, 125, 110, 39, -84, 217, 547, 175, -69, -61, 3, 468, 194, -202, 59, 26, 129, -362, 213, -441, 76, 364, 86, -17, 21, 40, 104, 782, 154, 81, 118, -48, 219, -280, -397, -343, 76, -129, 101, -736, -150, -30, 62, -160, -74, 143, 46, 84, -191, 193, 313, -1, -97, 400, 20, -118, 87, 292, 15, 234, 467, 221, 178, 151, -248, -280, 252, -126, -471, 242, 236, 113, -315, -298, 17, 318, -44, 306]
7750C06n03jK75j3j93Q9l47r8N74J37Oj3r45R20l78P13m63m92P07l48O47m05j88
7773a3k75K95K35k24K13m8l06K47l18M86m10N28j68k12L73l05K53n20j96K84j66
7794b47Q29m90k2k48L43p4l4J66p78RJ003k76M18m03p01N84M85q73J6j31L94r6
7816a26j68P4R4k2l41P15l35O8k31J90k9J92j29P8j28J22K36r53J170m05j46o05
7838f79Q87l70j16j69N73O12q82L01l08K49m36J077l37j072R61J57j00k50m66
7857c68K58O43l49l10M6k73o2j06J29P44r74L27K69Q4l16J10M20J44k27J26p20
7878d05K41L37j64m17P34J9k99p9L13p04M95n53M19o3q6K41Q7k70O4N81l73k46
7900a28O5m8k86K29J77P64r43JJ60k09J71N52m33k52L02K47r58j4Q56q7k37J97
$$ y = [306, -197, -198, 77, 64, -129, -40, -387, -485, 89, 226, 232, 219, -726, 194, -184, 529, 66, -426, 281, -67, 580, 175, -13, -288, 7, 242, 18, 231, 183, -123, 124, -194, 292, -118, 410, 242, 30, 403, 98, 351, -169, -365, -81, -247, 582, 92, 70, -178, 165, 91, 57, 223, -555, -546, 457, 181, 599, 196, -505, 79, 564, -309, -293, -424, -30, -126, -294, -220, -126, -148, -489, 226, -109, -41, -272, -82, -111, 81, -48, 30, -98, 24, 260, -693, 477, 72, -74, -679, 208, -162, -278, -447, 126, 738, -144, 157, -151, 98, -338, 739, 402, -670, 291, 448, 348, 98, -368, -110, 533, 184, -126, -80, -353, -415, -521, -392, 352, -622, -295, -26, 58, -258, -148, 272, 416, 189, 315, -405, -164, 173, 9, -408, 326, 345, 46, -33, 280, -424, 71, -482, -63, -126, -212, 29, 116, -154, -90, 491, 118, -128, -63, -111, -397, -168, 9, 773, -170, -169, -9, -218, -47, 505, 72, -180, 122, 369, -589, -603, 253, 166, -71, 126]
7922A26J16j68p8k43P85p69J69l01O6J64L52l46L72K2o68q5k63J082r05J13J019
7943E60j179K12Q18m97o9q18Q31J107o72k79Oj97M61L01p28L17j34k69J2O34m74
7964e7Q34p99L5k90R78j334M36L76m79L92m10n58N41o1O58n57k48N03N7J23L44
7985D84k43q73k4L57J41Q35k08p78J4J10L23k5M92r58K66L80L67Pn92m26P13j105
8007g43J472o16k45J33p24J211r68P58n40J64P65k69k69m26k77o14J151k3l50
8026d10O25m59Q01j30k0k12L8k55L33o95R3n91K27R58j329J543p90J437j505r2
8046d33J086j254P68k76j04L56L77n13m78N7l18Q97M79p96m49K35N4l66J689q05
8066B06l76K93k6m96l47M36p7j5Q82r74N07R2q85P23r2M45K23p52N05n85K91l34
$$ y = [126, 242, 74, -4, -247, 538, -231, -62, -363, -297, -133, 219, -127, 245, 267, -401, -486, -749, 333, -572, -459, 560, -619, -407, 411, -86, -155, -973, -142, 965, 293, 14, 20, -177, 284, 585, -143, 174, 40, -229, -217, 417, -57, 777, -22, 13, -277, 701, -633, -197, 179, -300, 92, -318, -876, -335, -396, 262, -295, -543, -40, 17, 140, 484, 241, -632, -656, -299, -158, 677, 469, -309, -295, -185, 138, 113, 605, -353, -87, 293, 660, 667, 75, -351, 362, -743, 729, 113, -132, 1, -723, 488, -480, 278, -262, -98, 667, 398, 129, -297, -574, -1188, -37, -60, -410, 215, -244, 557, 427, 407, 195, 233, -22, 311, -384, -291, -882, -655, 303, -1026, 517, -273, 1164, -341, -433, 653, -601, 167, -109, -213, 143, 520, 7, -471, -414, -732, 165, 644, -152, -601, -366, -312, -678, 1011, 206, -170, 123, 97, -399, -746, -310, -387, -402, 480, -494, 13, 105, -780, -57, -149, 296, 519, -233, 272, -313, -22, -356]
8088c56Q32j044Q31J96o74MN67J82o23N06j506J022K9o4j06P11j487R41J32p3
8108B0P75r41N63m71K41j417J793q90K75j7r54J060K04M79j80o41q18M27L14n13
8128f91P51l70o83J311o94O55l12l70k9J179k14N20j359P48J6j687J016N02j007
8147g18J541o06p51R83q33J281j292M74m07O40j160J933k73j561J465j114p17
8164a115J636K49o98J126j875J010n68J850j781nK70J93K71n2m8p33m53K96N32
8183A05J17j275J137o14Q05p27R41j092
$$ y = [-356, 476, -568, 263, 459, -215, -211, 356, 538, -85, 421, -1085, -63, -34, -98, -204, 507, -980, -39, 93, 20, 795, -146, 417, -54, 187, -1230, 563, -327, -52, -69, -1023, 37, 241, 720, 540, -101, -919, -492, -178, -691, 60, -310, -993, 318, -376, 279, -33, -403, -432, 747, 533, 1053, -306, 442, 458, -1229, -213, 289, -718, 823, 217, -534, 449, -384, 897, -395, 79, -328, 312, -848, 1085, 812, -749, 716, -398, -1115, 521, 770, 72, 1198, -677, 333, -235, 1615, -166, -171, 99, 292, 563, 511, 463, -270, -723, -427, 105, 222, -1053, 84, -530, 275, -452, 489, -603]
8191f03
$$ Imaginary data points
##PAGE= N=2
##DATA TABLE= (X++(I..I)), XYDATA
0@%%%%%%%%%%%%%%%%JpJ4j6J6j6J9k5K9l3M0m5N0n8O6p7Q7r7J09j22J40j58J74
39I1j96K18k41K69k96L27l62M01m42M85n35N92o53P19p93Q75r72J082j203J345
59G11j516J722j975K295k714L294m143N519q113J4675o1174j44748R7538J90801
73I2172R4865j13571j81562n1127J26686J54997J7856j35710j26443J0027J25918
84A4108J07927k1459j24018q8782K2243J15957Q5570l5630j14320p5284L8928
95g4760J21842O6983n9049j20945n4936P8876J24064L2967r2822j20207p898J13310
107G425J04623j9465j17444q5129M3378J14283N9820n4481j11154l8254O9139
118b7259R0487K0398p1563q2784n43O8157O5700k665p0029n6783J2872O1598N2028
$$ y = [0, 0, 0, 0, 0, 0, 0, 0, 0, 0, 0, 0, 0, 0, 0, 0, 0, 1, -6, 8, -8, 8, -8, 11, -14, 15, -18, 22, -23, 27, -31, 35, -42, 45, -52, 57, -65, 75, -83, 91, -105, 113, -128, 141, -155, 172, -190, 211, -231, 254, -281, 311, -342, 377, -416, 459, -513, 569, -634, 711, -805, 917, -1058, 1237, -1477, 1817, -2326, 3193, -4920, 9755, -51419, -196167, -98629, 92172, 187037, 73466, -108096, -159223, -32537, 122460, 140316, 4606, -121837, -111810, 14108, 122035, 100576, -23442, -112224, -89981, 25976, 111546, 75916, -38404, -113688, -74760, 47082, 114065, 55016, -65929, -120865, -41989, 82075, 115042, 22220, -97987, -105885, 7425, 112048, 92583, -24861, -109990, -66612, 47671, 107491, 53010, -58144, -96398, -27259, 63228, 83626, 12063, -70721, -71264, -3107, 62593, 59928, -10101, -66884, -54012, 7586, 59614]
131E9614j4134o2354l9365J9768O0315L2908k7957n4655k3122L0499N1947J9106
143E2570l6099n0178j2160L9415M4994K840l9098m1896J712M1907L1747o565m1713
156a2524k8338J4985L9220J9901j6974l6764j1031K1740K6884R005k0638k3102
168a7636k97J8608J6484l59j5111r851J213Q809N254J311m545n918n562J244O632
183B76P188N62j2400r677L170J3525R937o638j6423m163Q678J6539J881j1087
197A368j0452r4R810R238j666p548m474m86M819M821K852k253q372o763L705J1789
213F294N512n558j7522n658J2288J6812L434j8660j6180K731J9545J5966p684
226A1320k2390q814J3153K1670N753j7365j6998P21J6228J4828m584j6690r089
$$ y = [59614, 45480, -16874, -56239, -36471, 23844, 56752, 28795, -25860, -48982, -18483, 33464, 52570, 16471, -33707, -45867, -6452, 38542, 41382, 2284, -39612, -37900, 4007, 35754, 29189, -12524, -40862, -25877, 13343, 33244, 16270, -20494, -31525, -9785, 17099, 26104, 5466, -17636, -17933, 675, 17159, 16800, 1689, -8162, -6949, 1860, 7114, 8425, 3880, -2038, -7600, -6356, 276, 7464, 8026, -4374, -14051, -10881, 2644, 12581, 5943, -10480, -14643, -5965, 10574, 12455, 1368, -9084, -9178, 632, 9870, 8204, 656, -3818, -4304, 515, 5336, 8188, 5935, -2437, -9200, -5495, 6294, 11806, 6248, -11274, -16932, -4644, 12168, 15602, -3058, -19238, -16507, 3038, 19004, 11320, -11070, -19884, -6731, 14939, 20692, 3327, -13671, -12950, 3278, 18106, 13522, -3168, -12257]
239a2257L872J3708R150p051j2086p822J252J5543P283m758j4070r517P671J6899
253G817M678q628j7377m856J5387J8358M79j4378j7100L554J8860J0695m570j9174
267f255p781R284J3554P036j0252j7030k399J2468J1504K975j4512j2391L542
280a0257J0498J1522l766j3297p699L317J3506R645q539j1603l799O486J2581
293H595L954r618j1021k207J1986J0123j360j1751r956K811J3450O961o588j3126
307g747m894O602J1943K930o998j2677j373R851J0795N46j0764r537L078J0683
321B438Q150k711j2517o261O915R420O157o106j0770k437O585J0208K398j0172
335A297j0074K75Q035R742k869r931r290L401J1024O480m187j0974m762O618J1142
$$ y = [-12257, -8385, 5323, 14473, 7422, -4664, -12486, -11234, 4309, 11592, 6834, -7236, -16753, -9082, 7817, 12495, 3867, -13510, -18366, -2979, 15379, 15858, 1480, -15620, -12066, 6794, 17489, 12919, -6255, -14036, -4752, 8802, 15838, 5586, -11444, -13843, -1375, 10129, 13104, -1408, -13799, -10257, 241, 11763, 7997, -5300, -12999, -9682, 3824, 13469, 4930, -6673, -10472, -3986, 8595, 12549, 2931, -8090, -10297, 1689, 11812, 10452, -1299, -11255, -8444, 5006, 11967, 5379, -7747, -12641, -6039, 5904, 8834, 1836, -10841, -12214, -2363, 8432, 8978, -1786, -11323, -8245, 2438, 10588, 7877, -4640, -10901, -3986, 5434, 11591, 5485, -5285, -7722, -1137, 9071, 11469, 1297, -8777, -8502, -467, 9275, 6406, -3525, -12815, -9414, 1610, 8090, 3903, -7071, -11833, -5215, 5927]
350E927L089o108q974j982J0173P380n62q446r346J542J0838Q716n209j0701n471
365i134N354J0618K166n118j1123l180P491P792L349q607r800J453O630R328o82
380F537q914o902J001J0552P072m595q596k828L679R652L097m950j0358k449Q645
395F43P444j575q733o256J916J0466J843l395q886j244N038P071K28n331n647
410f418J07N751M528R88n627m905K463M281M601q40m805m142J715N631M070l607
426C791o607j957L860M504L554p358o311J010M371O493j361p034m265L154N724
441A568M060m830n264j086N347O166k320m723j949K7N682K694j519m842l392L107
457a274N824Q65l215n409j045L109L810K168n177n126j76L894M459K020n207o485
$$ y = [5927, 9016, 2908, -6066, -8048, 2125, 9505, 8943, 497, -8849, -7307, 3531, 12247, 7038, -3663, -9134, -3780, 6838, 9004, 3886, -7237, -10417, -2926, 4866, 8215, -392, -10192, -8739, -2109, 7219, 6537, -2377, -9279, -8278, 2274, 9346, 4751, -3845, -6673, -2994, 6658, 9755, 4805, -5553, -8002, 643, 8087, 6512, -2221, -8477, -6561, 3905, 5748, 2353, -6533, -7777, -2739, 4332, 4560, -771, -6418, -6311, -560, 3968, 4956, -671, -5576, -3113, 1168, 5769, 4929, 124, -4018, -2303, 3328, 7398, 3791, -2816, -4773, -913, 3591, 7145, -213, -6524, -5514, -1143, 5350, 3989, -3045, -7310, -4156, 1568, 5628, 798, -4466, -5552, -205, 5961, 3641, -1082, -3031, -3004, 2678, 5372, 3853, -989, -4381, -1274, 4550, 5415, 2200, -3209, -4254, -1145, 2665, 4833, -344, -5470, -5646, -1752, 2707, 4727, -480, -6965]
473f965J361M864P009j94o466m955R04O048O376l374o273l717L297P145L049n858
489B251p015l076P960R720k392r041q101K959J0855K612m023q113l418N911O175
504C264J312k877o298J17N449K846L653l059p088k618L084P340O158p392j1321
519g430l691J1761R900J490j4362j2484M224J5914J0757j0779j8201n559J5370
532c090J7131o89j7690j2905N170J7584J0853r287j4713n204R545J2818K635o385
546E773j1221l986P430Q437M938n309j0997p058P354J3132O079r866j7900n034
560a8228J6451J9884j485k1917j6920O683K4038J6206j6315k4234n995J7189K4425
573A9782J1k2804j5879O630K1607J2080j0623k0317p196J0756J7451M213j2152
$$ y = [-6965, -5604, -740, 6269, 6075, -391, -5346, -4442, 1606, 7982, 4608, -1665, -5382, -2085, 5060, 8109, 2251, -4764, -7840, 120, 9840, 7448, -1593, -9694, -6735, 4120, 6732, 2709, -5404, -8822, -2911, 3264, 4576, 1699, -4599, -4482, 967, 3813, 7466, 4407, -2681, -5299, -2215, 5125, 11283, 3891, -7430, -11121, 640, 10540, 12030, -2332, -14816, -10592, 5322, 16079, 5300, -12901, -18460, -3090, 14041, 13352, -4338, -17243, -12073, 5511, 16364, 7077, -7636, -12840, -3295, 9523, 12158, 5773, -5448, -9434, -2004, 6433, 11371, 6062, -4935, -11993, -4639, 8493, 14572, 4706, -13194, -18228, -1777, 18107, 16622, -5295, -22215, -15532, 8506, 24712, 8397, -15837, -21832, -4643, 19782, 19793, -3011, -18890, -12260, 9347, 21427, 10804, -9513, -16709, -5953, 11498, 15711, 3559]
586C559j2926n400J1054J2481L738j0600j4236k776J0870J5270J808j1791j5603
599a4552j421J7052J4358K03k0297j4903J0371K0431J0459j3344k3240l831J7425
612a289J9865J407k1177j8280N505K1370J0802o530k1303j1313J0760K0612O385
625A6814j2960j8522k785J4556J7241J92j6444j4152K439J7864J2029n895j5282
638d905j0749P680J6794Q643j0165j3960q099Q623J6808L602j0270j7131k727
651a5856J4288J5586J94j6660j5966L144J8804J5926p207k3098r579J3379K0107
664A3062P205j7220k0411J292J8932J6776m298k2714j1092J1036J8323P661j3884
677D668j5440k200J1655J3333q56j1586r969J44R738Q232O88j1095r436L33J2615
$$ y = [3559, -9367, -14767, -3713, 8768, 12506, 1906, -12330, -15106, -4236, 11034, 12842, 1051, -14552, -15973, 1079, 15437, 15640, -4657, -19560, -9189, 11242, 21701, 8357, -14883, -18714, -1289, 18576, 19983, -1194, -19474, -13969, 7401, 18203, 11673, -9630, -20943, -10183, 10429, 16814, 3854, -14668, -17453, -2897, 14344, 14536, -1908, -16060, -13621, 4243, 16272, 10377, -4905, -15654, -7974, 8820, 17463, 7298, -6662, -14761, -6138, 10670, 14272, 4002, -13129, -15856, -1568, 14018, 14212, -2448, -18414, -15270, 3534, 19460, 12253, -10845, -20424, -7045, 13062, 20267, 3047, -17364, -16072, 2860, 19636, 15338, -7376, -18468, -7432, 10891, 18552, 4668, -10772, -12972, -1317, 12016, 11160, -426, -10395, -10251, -513, 7719, 8407, -2688, -12124, -11791, 824]
692H24J1219k642j2722j0652L811J8321Q879p939j7206q220J3079J7906K561j6644
706E75j6857L439J8592J0519n788j9018q095J0717J5365K781j0843j2751q3J0589
720h58P955M74q922p096J636P595O722j423o951m976O43P357O853k802p974o438
736h205K922J0891M748o221j1001k558Q069Q793j47r316p482K233J0068N409n090
751C113q241l712M967Q358J876n073n806n1N597L452j784l750j626J383L899R70
767C572j51n025o94K263R61J66j152o07j208J420L82k35k082J151P98K47N74j761
785a381Q06J791l59o53j601j905L663K579k45k149j827K48L081K254j923m308
801a929j620K202M342J839m133n522o63M824N356r3q169n492M758P225M439m655
$$ y = [824, 12043, 9401, -3321, -13973, -10162, 8159, 17038, 9099, -8107, -16327, -3248, 14658, 17219, 575, -16282, -12843, 5749, 16268, 10480, -8538, -16633, -5916, 9449, 12230, 1387, -11364, -11447, -858, 7097, 7571, -1351, -8447, -6811, 784, 7506, 6083, -868, -5844, -5201, 2156, 9009, 6207, -1767, -8205, -5283, 5608, 10356, 4135, -6866, -9424, -1355, 7438, 7291, -2025, -9507, -7274, 2794, 8203, 3113, -5128, -8840, -3873, 4485, 6361, 1288, -4518, -4569, 1028, 4480, 2696, -1054, -2680, -1297, 2602, 3572, 3421, -1604, -2298, -35, 926, 1092, -60, -667, -1875, -455, -73, -308, -2390, -1239, -441, -194, 380, -1381, -575, 1216, 857, 204, -1397, -3302, 361, 2940, 2695, 546, -1281, -1033, 2048, 4302, 2379, -1929, -3549, -1347, 2995, 4834, 701, -4821, -5484, -660, 4696, 4603, -3566, -9058, -4300, 2925, 7364, 2709]
817B709r662j801O166R220K550p938q505j663R529J1201l848j0028p310K838J1629
832E087O799n610j2868m913O516J3112L404r428j2297j952J0624J1637M16j1921
846a394j1368J656J4590R311m543j2763r631P579J4974N940q235j4381n309J0780
860b794J4926K435j3014j5209J728J3397J2160j982j6815j1297O467J6374P554
873A3930q051j5679n663J0086J5121M827j2962j3587k455J4473J3922j368j4665
886b071j1655L887J5142J1107o696j5236q421P904J4651O397r664j5466l838J1492
900b467J4359M71j4084j1625J420J3392R517j619j4899r193O772J4952O556p764
914E788j4179m335R561J3064L161j0816j2397J89J0658J0935r05j1865j0460L448
$$ y = [2709, -6953, -8754, -2588, 6632, 9182, 1244, -7261, -8924, 605, 11806, 7958, -2070, -9380, -6542, 5087, 11886, 6276, -6592, -11505, -4989, 8123, 11527, 2099, -10198, -12150, -1526, 10111, 10527, -1394, -12762, -11106, 3484, 12795, 8252, -4511, -14142, -6563, 8411, 14351, 6116, -8265, -13574, -2794, 12132, 14567, 1553, -13656, -11928, 1469, 13629, 11647, -5168, -16465, -9998, 6376, 13930, 5879, -9800, -15463, -5377, 9744, 14571, 1609, -11978, -14433, 40, 13962, 12594, -2071, -13726, -9839, 5303, 16410, 9714, -5522, -13943, -6039, 8612, 15009, 5345, -10121, -13959, -2467, 11892, 12363, -1721, -13346, -11926, 1466, 10983, 9364, -5535, -14728, -7956, 6996, 13552, 5788, -8391, -12726, -3165, 9899, 13060, 2244, -10153, -9964, 694, 11629, 10724, -1141, -11601, -8153]
928h153J2517O890n434j2069n472P169J1361L853q866j0651k870R399J0620L98
942H692r895r067K035J0679P707l760r319o319N637R451M006n753r703k529O703
957a435Q474O53o834p298K89O976M520r29o882n112L124O504L612k765p109j845
973f057L596N791J354l270n171p87M695M588J6l617n766J084N314L783j778n194
989a419l247J436N645K683l543m631j891M641M194j649m071k797J854L993Q94
1004B092j493j888l25J476P57p7j12k50L27l07m47J306J272n06k749j165J633
1021d56J815l3j310l040J614J574M00j387j843LL605J046l192k58M61K204J87
1038A390k799m99K057J803R24l420j323J898L193J80l175l112J223M110R91k626
$$ y = [-8153, 4364, 11254, 5820, -6249, -11721, -4552, 6809, 10662, 1796, -8855, -11725, -2326, 8294, 8692, -1203, -10270, -8235, 2444, 10151, 6391, -2928, -9247, -3610, 5841, 9847, 4094, -5609, -8138, -1435, 7039, 7692, 858, -6440, -6151, 825, 5345, 4416, -2466, -7578, -4454, 2050, 5662, 2897, -4212, -6057, -2461, 3330, 4684, 1414, -3757, -4544, 151, 4739, 4755, 1138, -4628, -3544, 1770, 5553, 3775, -1419, -4666, -3230, 2415, 5098, 1555, -3076, -4967, -326, 3868, 2219, -1852, -4649, -2795, 1198, 2092, 599, -1289, -1614, -138, 619, 542, 430, 180, 507, 200, -247, 1059, 2331, 1825, -924, -2089, -456, 1359, 1326, 16, -3024, -1410, 164, 564, -823, -2666, -2663, 942, 1988, -1204, -1462, -1001, 1203, 1390, -1409, -1908, 149, 1952, 2876, -544, -1867, 31, 3224, 3404, 229, -2883, -1660, 2450, 3441, 815]
1054H15m220K58M523J648k039l029p49J946K241j62j280k369J202Q00O31N68K
1071G86q82j57o08J163J443L23j451l041J543K732K509k712l461l575L874L978
1087B464J301m565k997m3N430K427k188m519j641K806N214k11l087k959n96L742
1103E78K548jk470l240J692L102J169k848j368j49J245J732M12j835p84l37j130
1120a684J633Q74j07j107q56j010J048K505P57l139j942J603K133K796k274l809
1136b579m90L507L648j449l858k184K656K792J487k848j665o0K229P58j259k427
1152a742Q28K382n96k343L83J548R24j589l836Q96M667L725k599o032p42M483
1168C57M949Qo383m766L955M673L193m988n006J079L006M461j647m290k333J975
$$ y = [815, -3405, -3147, 1376, 3024, 985, -2044, -2793, -847, 1394, 1232, -48, -2417, -1215, -415, 216, 784, 786, -96, -253, -861, 302, 1745, 2068, 617, -2424, -881, 1851, 4360, 1648, -1813, -5388, -1514, 2464, 3765, -800, -3797, -3840, 1590, 4017, 1829, -2690, -4331, -1525, 3689, 3478, 391, -2568, -3164, 578, 3126, 3125, 655, -2585, -893, 2209, 3378, 530, -838, -987, 258, 1990, 2402, 567, -217, -554, -1684, -51, 823, 716, -391, -1247, -2257, -1209, 1296, 2053, -1086, -3028, -1425, 708, 3504, 1230, -2579, -3069, 438, 4086, 2637, -1221, -3405, -749, 2043, 3530, 682, -983, -1043, 1186, 1944, 685, -1742, -914, 1468, 872, -1471, -1088, 460, 1384, -205, -4041, -3145, 1522, 5247, 2648, -3384, -4126, 357, 5306, 5314, -1069, -5835, -1880, 2793, 5986, 998, -4008, -2929, 77, 4538, 2891, -1399, -3732, -1757]
1184a757K020J735k133q02j299J69L07L035K016k045l014l258L837O442Q28n457
1200F24o929J036O651O836k524r479l745N436Q273J685o219r171Q69Q213M607
1215F163k09q915m844L707P179L741n268n293j774L347O339J184m569l928l356
1230f496N199O439J307l871q003q20P161Q022k374p500o709K294R260M379l353
1245D935r650n693O497R500L289q586r265J610P893P286j503q610o776L511R381
1260C819M293k689j0234l429N744P766L396o445q390K40O769M364J548p647m987
1275e882L23O894M622j935p178m714K744P373N173n252m585m267M485P475J628
1290F904o432m799k614P611N807j139n696m169J173O924K349k794o152k944M506
$$ y = [-1757, 263, 1998, -135, -937, -2236, -2067, -1760, 1275, 3291, 1246, -1768, -5026, -1189, 5253, 6081, 624, -6305, -5269, 1382, 8218, 5694, -3785, -7530, -2094, 6179, 7864, 1645, -7526, -6657, 1556, 6163, 5954, -2961, -7805, -4098, 3081, 6822, 1554, -3739, -5513, -2166, 4173, 5357, 788, -3140, -6496, -1297, 5142, 6449, 2578, -5425, -6245, 916, 8938, 6564, -936, -7645, -5351, 3909, 8288, 4935, -4715, -10408, -3911, 5589, 8878, 292, -8973, -7363, 530, 7816, 6313, -2297, -9073, -5562, 3819, 8112, 5423, -4811, -8240, -2496, 5270, 8666, 2221, -6169, -5929, 840, 5204, 6752, -895, -5882, -5559, 1335, 5957, 4022, -3156, -7870, -5126, 2247, 7420, 2168, -2417, -6684, -2199, 5276, 6904, 472, -4327, -6941, 670, 6477, 5338, -358, -4527, -3354, 3570, 5919, 3125, -3027, -5971, -1465]
1305a465M743J84k539n862J200L694L445q12m058j288j08L321J454o61j595j618
1321a965k72L300R46r99j217J88j695K244K115k227j453P8l47K578k36p25j546
1338a233o19O90N78N61n62o82N15R6j011J329P51J380k195p03r48L220J407r71
1356A603l740K05R07K780J880l675j283m42J623L004j43l134l415M24L616K932
1372C142j539l831l401K978N233K188m083n105MM022L687J46k513n607M38M126
1388a15O638k003n022m099J212M968M821k400p140k968K984O602J823m282o052
1403e033k237P295M873P98q196l758K174N497L805q88p268l649K724Q114K888
1418G139m140p239j511M434N994J091n918n403J515N264O075k714o861n555M185
$$ y = [-1465, 3278, 3462, 923, -4939, -3739, -45, 3400, 2588, -1470, -2758, -2866, 455, 1909, 1248, -347, -1965, -2237, 1063, 2009, 1010, -207, -19, -1714, 530, 2645, 418, -1035, -957, -1304, 1274, 1038, 313, -1233, -1852, -1162, -584, -23, -585, -1267, -752, -656, -1667, -338, 413, 1793, -402, -1105, -2053, 1167, 2574, 1603, -2137, -1932, -1025, 1755, 3635, -40, -1323, -1765, -142, 2862, 2719, -415, -3830, -3406, 210, 3142, 1603, -2228, -5629, -2651, 2582, 4770, 687, -4418, -4414, -392, 3295, 3441, 928, -4679, -4241, -115, 6523, 4520, -502, -4601, -3389, 1579, 6400, 4000, -3140, -6108, -3124, 3478, 5301, 1019, -5033, -7270, 25, 4898, 5696, -2500, -6258, -4084, 1413, 5218, 4330, -2938, -6587, -3863, 4251, 7139, 2999, -4240, -5751, -1317, 4677, 5768, -150, -5553, -4038, 1226, 7301, 4587, -2274, -7829, -3644]
1433c644N096L727l125o146k732M226N921J278m376n868m95O472O613k725m548
1448c26l960J251O260J567j556n705j466J646N485J595l345n933n90L812M263
1463B998J165n618k269m41L756M533k638m006j650L076K727K327l216l229k057
1478d542K742M642J450l715l063k37K785K624J871m625l696J272M362J599j425
1493B044l761k348J757M251L67l114k917O74L954J328p40m464o95L114J507L178
1509D135k960p23k599K065K851j163j60k200k96J97L366J17k872q17k201K701
1525e59K976r96j759j954P3K572J476j210j386k388J997K887J064l235l068J037
1541b473L678J788q65k435j622J117L513l96r91k683k11Q80K683r10M36l175j326
$$ y = [-3644, 1452, 5179, 2054, -4092, -6824, -2598, 3323, 4601, 225, -5643, -6138, 334, 6947, 4222, -326, -4286, -3035, 3225, 4792, 3236, -2469, -3935, -2289, 3196, 4791, 1446, -4487, -5077, -1265, 2998, 4163, -1455, -3724, -4165, -409, 4124, 1486, -2520, -4170, -1094, 1633, 3960, 744, -2485, -4542, -1800, 2842, 4292, 577, -2486, -2723, 62, 2686, 4557, -68, -3764, -2492, 1870, 3469, 2044, -1717, -4065, -2308, 1943, 2310, -804, -3721, -3047, 907, 2235, 1495, -2969, -3664, -550, 957, 4135, 1175, 452, -2147, -82, 2769, 1606, 1446, -754, -1050, -853, 2513, 2630, -242, -1059, -3260, -559, 2417, 1421, -338, -2292, -2219, 353, 1829, 619, -767, -3155, -1158, 1729, 2793, -442, -3510, -2473, 1205, 2993, 2128, -307, -1929, -812, 2701, 2305, 1314, -1369, -1580, -700, 1983, 1073, 1509, -1666, -2992]
1558b992K620J172M18j447k072j26K111J674K9j759k431J088K439K402k130k202
1574a206n75Q38L864O5r43l757r8J422L108ok890k229J36L157J174j151k883j043
1592c017J375K337J824k393k498J56J958J826K76j974k153K157P56J811k32p42
1608A467l494J456J407J710j333j477j166M50J019R13N41k283j630O02K879R77
1624B038j650k559l1J394J660J091j721j749M00K126J201j261o99M47J267j702
1640B52l01N08N09j07j555j381J307J252J122j599j764o61K786J825j063l489
1656b359j144M048Q70K52k568j356J253J221K404j328j807j300J313J038J002
1671A539p45o66n74r51O86K237N91j686m018P24L487K206N31n513l049L645L405
$$ y = [-2992, -372, 800, 1218, -229, -2301, -2427, -316, 1358, 1387, -372, -2803, -1715, 724, 3126, 996, -1206, -1781, -943, 2921, 2986, 2043, -1714, -1812, -390, 2718, 2712, -178, -2407, -2271, 886, 2060, 909, -1974, -3017, -1642, 695, 2519, 126, -2372, -2216, -258, 1568, 1844, -130, -2283, -126, 630, 2441, 2209, 1467, -2027, -571, 836, 2546, 1213, -264, -1430, -980, 39, 952, 1493, -790, -2420, -1818, 1061, 2038, 388, -2171, -2202, -808, 852, 1943, 222, -1527, -1127, 999, 2200, 939, 240, 687, 1954, 252, -49, 459, 968, 861, -694, -2075, -768, 484, 1606, 7, -1757, -2418, 368, 2193, 1130, -2359, -3503, 545, 1415, 1667, -901, -2257, -1004, 217, 2621, 1293, -514, -1814, -501, 537, 1539, 794, 128, -446, -1397, -711, 1526, 2117, 431, -3587, -2863, 624, 2830, 3361, -2152, -5201, -1556, 1849]
1688A849K233m006l464j820N454L346j651l608j687J517M288K307j599m395j998
1703c234K578M071L81l026l513K86K051K209R27q94m160j222J071M565J416l016
1719D90m335n31M495L826J46o037j728J677L646K113k208l407j798L133L650J090
1735D222l996m320J211K563J921K48l427k511J582N159j294Pl772K84J395L070
1751B342j03j727k124n31K452M78J723k955r39L43J673J731k15j444k321j025
1767b642K527J996Q82k728j084m53J428K328r43k277j726K097J693M7j597o18
1783a070p63J456R37L27j348j045J089J646j847J297q86J523j81p93n23k77K079
1800A621j285n80n60K68K630p45j187k274N13K442J006o03k329k122J651J163
$$ y = [1849, 4082, 76, -3388, -5208, 246, 3592, 1941, -1667, -3354, -1837, 2451, 4758, 3159, -1236, -3234, -656, 3415, 3796, 770, -2743, -2457, -406, 1803, 2730, 1836, -2324, -3546, -2475, 2090, 3506, 490, -3845, -4376, 119, 3945, 4091, -1946, -3674, -1997, 1649, 3762, 1554, -1853, -3651, -518, 3132, 4222, 226, -4094, -2883, -320, 1601, 1849, -1578, -4089, -2507, 2652, 1358, 1365, -2407, -2123, -728, 2342, 2239, 512, -1612, -2143, 309, 787, 2510, -445, -1384, -1041, 632, 2363, 2148, 704, -1617, -2642, -115, 1881, 2763, 35, -1049, -1502, -74, 2254, 1311, -966, -2692, -595, 1098, 1145, -452, -1070, -1833, -377, 560, 887, -461, -1506, -417, 1229, -618, 679, -207, 1316, 1135, 342, -181, -458, 1621, 336, -244, -804, -536, 2094, 1349, 162, -2112, -1599, 843, 1849, 1246, -1083, -3205, -1554, -391]
1816c91K636j484k614p2J2K215K074k488j218l8Q58K170J007k745j507n58J255
1833h88K910O39l200j859L02K011L594q82l544m336L272L178J942k427l132j210
1849c630K725L750M75l465l459J09N413J04J128m213k641J866L706J720j921l181
$$ y = [-391, 2245, 761, -1853, -1925, -1913, 302, 2376, -112, -1330, -1368, -510, 1660, 2667, -78, -1585, -2143, -888, 2022, 2661, -539, -2398, -2096, -85, 3509, 2627, -917, -5253, -1981, 1197, 3139, 712, -2420, -3630, -905, 2845, 3320, -145, -3604, -3495, 1918, 2022, 3150, -1063, -3704, -1838, 1868, 3588, 1667, -1514]
$$ [...]
8191b66
##END NTUPLES=NMR FID
##END=
