##TITLE=1H_Pr 11g-X
 200.13Hz, CDCl3.
 8 sc
 
 13.4.2026
##JCAMPDX= 6.0         $$ Bruker NMR JCAMP-DX V2.0
##DATA TYPE= NMR FID
##DATA CLASS= NTUPLES
##ORIGIN= UXNMR, Bruker Analytische Messtechnik GmbH
##OWNER= pz
$$ XWIN-NMR		Version 3.5
$$ Mon Apr 13 13:49:11 2026 Russian Standard Time (UT+4h)  she@DPX200
##.OBSERVE FREQUENCY= 200.1313
##.OBSERVE NUCLEUS= ^1H
##.DELAY= (6, 6)
##.ACQUISITION MODE= SIMULTANEOUS
##.ACQUISITION SCHEME= undefined
##.AVERAGES= 8
##.DIGITISER RES= 18
##SPECTROMETER/DATA SYSTEM= spect
##.PULSE SEQUENCE= zg30
##.SOLVENT NAME= CDCl3
##.SHIFT REFERENCE= (INTERNAL, CDCl3, 0, 14.3821)
##AUDIT TRAIL= $$ (NUMBER, WHEN, WHO, WHERE, WHAT)
$$ ##TITLE= Audit trail, XWIN-NMR		Version 3.5
$$ ##JCAMPDX= 5.01
$$ ##ORIGIN= Bruker BioSpin GmbH
$$ ##OWNER= she
$$ F:/spectra/data/she/nmr/H-C/1/audita.txt
$$ ##AUDIT TRAIL=  $$ (NUMBER, WHEN, WHO, WHERE, WHAT)
(   1,<2026-04-13 13:47:20.93 +0400>,<she>,<DPX200>,
      <created by zg, POWCHK disabled, PULCHK disabled
       configuration hash MD5:
       00 E9 B6 7A A2 85 ED C7 34 08 36 98 17 FE 4E 26
       data hash MD5: 16K
       1A C7 B8 AA 77 7C 40 5C 3E 7B A5 ED 1C 39 4D 59>)
$$ ##END=
$$ 
$$ hash MD5
$$ 1C 2C 28 B9 E7 A7 93 DF 06 CA F2 E4 51 66 A1 F9
##$RELAX= 
##$RELAX= 
##$RELAX= 
##$RELAX= 
##$RELAX= 
##$RELAX= 
$$ Bruker specific parameters
$$ --------------------------
##$DU= <F:/spectra>
##$EXPNO= 1
##$NAME= <H-C>
##$PROCNO= 1
##$TYPE= <nmr>
##$USER= <she>
##$AMP= (0..31)
100 100 100 100 100 100 100 100 100 100 100 100 100 100 100 100 100 100 
100 100 100 100 100 100 100 100 100 100 100 100 100 100 
##$AQSEQ= 0
##$AQ_mod= 1
##$AUNM= <au_zg>
##$AUTOPOS= <>
##$BF1= 200.13
##$BF2= 200.13
##$BF3= 200.13
##$BF4= 200.13
##$BF5= 200.13
##$BF6= 200.13
##$BF7= 200.13
##$BF8= 200.13
##$BYTORDA= 1
##$CFDGTYP= 0
##$CFRGTYP= 5
##$CHEMSTR= <none>
##$CNST= (0..31)
1 1 145 1 1 1 1 1 1 1 1 1 1 1 1 1 1 1 1 1 1 1 1 1 1 1 1 1 1 1 1 1 
##$CPDPRG= <>
##$CPDPRG1= <>
##$CPDPRG2= <>
##$CPDPRG3= <>
##$CPDPRG4= <mlev>
##$CPDPRG5= <mlev>
##$CPDPRG6= <mlev>
##$CPDPRG7= <mlev>
##$CPDPRG8= <mlev>
##$CPDPRGB= <>
##$CPDPRGT= <>
##$D= (0..31)
0 0.7 0 0 0 0 0 0 0 0 0 0.03 0 0 0 0 0 0 0 0 0 0 0 0 0 0 0 0 0 0 0 0 
##$DATE= 1776073640
##$DBL= (0..7)
120 120 120 120 120 120 120 120 
##$DBP= (0..7)
150 150 150 150 150 150 150 150 
##$DBP07= 0
##$DBPNAM0= <>
##$DBPNAM1= <>
##$DBPNAM2= <>
##$DBPNAM3= <>
##$DBPNAM4= <>
##$DBPNAM5= <>
##$DBPNAM6= <>
##$DBPNAM7= <>
##$DBPOAL= (0..7)
0.5 0.5 0.5 0.5 0.5 0.5 0.5 0.5 
##$DBPOFFS= (0..7)
0 0 0 0 0 0 0 0 
##$DE= 6
##$DECBNUC= <off>
##$DECIM= 32
##$DECNUC= <off>
##$DECSTAT= 4
##$DIGMOD= 1
##$DIGTYP= 9
##$DL= (0..7)
0 120 120 120 120 120 120 120 
##$DP= (0..7)
150 150 150 150 150 150 150 150 
##$DP07= 0
##$DPNAME0= <>
##$DPNAME1= <>
##$DPNAME2= <>
##$DPNAME3= <>
##$DPNAME4= <>
##$DPNAME5= <>
##$DPNAME6= <>
##$DPNAME7= <>
##$DPOAL= (0..7)
0.5 0.5 0.5 0.5 0.5 0.5 0.5 0.5 
##$DPOFFS= (0..7)
0 0 0 0 0 0 0 0 
##$DQDMODE= 0
##$DR= 18
##$DS= 0
##$DSLIST= <SSSSSSSSSSSSSSS>
$$ [...]
##$SUBNAM0= <"">
##$SUBNAM1= <"">
##$SUBNAM2= <"">
##$SUBNAM3= <"">
##$SUBNAM4= <"">
##$SUBNAM5= <"">
##$SUBNAM6= <"">
##$SUBNAM7= <"">
##$SUBNAM8= <"">
##$SUBNAM9= <"">
##$SW= 18.0517328524113
##$SWIBOX= (0..15)
0 0 2 0 0 0 0 0 0 0 0 0 0 0 0 0 
##$SW_h= 3612.71676300578
##$TD= 16384
##$TD0= 1
##$TE= 0
##$TE2= 300
##$TE3= 300
##$TEG= 300
##$TL= (0..7)
0 120 120 120 120 120 120 120 
##$TP= (0..7)
150 150 150 150 150 150 150 150 
##$TP07= 0
##$TPNAME0= <>
##$TPNAME1= <>
##$TPNAME2= <>
##$TPNAME3= <>
##$TPNAME4= <>
##$TPNAME5= <>
##$TPNAME6= <>
##$TPNAME7= <>
##$TPOAL= (0..7)
0.5 0.5 0.5 0.5 0.5 0.5 0.5 0.5 
##$TPOFFS= (0..7)
0 0 0 0 0 0 0 0 
##$TUNHIN= 0
##$TUNHOUT= 0
##$TUNXOUT= 0
##$USERA1= <user>
##$USERA2= <user>
##$USERA3= <user>
##$USERA4= <user>
##$USERA5= <user>
##$V9= 5
##$VALIST= <valist>
##$VCLIST= <CCCCCCCCCCCCCCC>
##$VD= 0
##$VDLIST= <DDDDDDDDDDDDDDD>
##$VPLIST= <PPPPPPPPPPPPPPP>
##$VTLIST= <TTTTTTTTTTTTTTT>
##$WBST= 1024
##$WBSW= 4
##$XGAIN= (0..3)
0 0 0 0 
##$XL= 0
##$YL= 0
##$YMAX_a= 578229
##$YMIN_a= -604844
##$ZGOPTNS= <>
##$ZL1= 120
##$ZL2= 120
##$ZL3= 120
##$ZL4= 120
##$ABSF1= 10
##$ABSF2= 0
##$ABSG= 5
##$ABSL= 3
##$ALPHA= 0
##$AQORDER= 0
##$ASSFAC= 0
##$ASSFACI= 0
##$ASSFACX= 0
##$ASSWID= 0
##$AUNMP= <proc_1d>
##$AZFE= 0.1
##$AZFW= 0.1
##$BCFW= 1
##$BC_mod= 2
##$BYTORDP= 1
##$COROFFS= 0
##$CY= -3
##$DATMOD= 1
##$DC= 2
##$DFILT= <>
##$DTYPP= 0
##$F1P= 0
##$F2P= 0
##$FCOR= 0.5
##$FTSIZE= 0
##$FT_mod= 4
##$GAMMA= 1
##$GB= 0.15
##$INTBC= 1
##$INTSCL= 1
##$ISEN= 128
##$LB= 0.25
##$LEV0= 0
##$LPBIN= 0
##$MAXI= 10000
##$MC2= 0
##$MEAN= 0
##$ME_mod= 0
##$MI= 1.114404
##$NCOEF= 0
##$NC_proc= 0
##$NLEV= 6
##$NOISF1= 3.799351
##$NOISF2= 2.8
##$NSP= 1
##$NTH_PI= 0
##$NZP= 0
##$OFFSET= 14.38212
##$PC= 1
##$PHC0= -3704.972
##$PHC1= 9.792311
##$PH_mod= 1
##$PKNL= yes
##$PPARMOD= 0
##$PSCAL= 0
##$PSIGN= 0
##$REVERSE= no
##$SF= 200.129724274929
##$SI= 16384
##$SIGF1= 3
##$SIGF2= 2
##$SINO= 400
##$SIOLD= 16384
##$SREGLST= <1H.CDCl3>
##$SSB= 0
##$STSI= 0
##$STSR= 0
##$SW_p= 3205.1282051282
##$SYMM= 0
##$S_DEV= 0
##$TDeff= 0
##$TDoff= 0
##$TI= <>
##$TILT= no
##$TM1= 0
##$TM2= 0
##$TOPLEV= 0
##$USERP1= <user>
##$USERP2= <user>
##$USERP3= <user>
##$USERP4= <user>
##$USERP5= <user>
##$WDW= 1
##$XDIM= 8192
##$YMAX_p= 0
##$YMIN_p= 0
$$ End of Bruker specific parameters
$$ ---------------------------------
##NTUPLES= NMR FID
##VAR_NAME=  TIME,          FID/REAL,        FID/IMAG
##SYMBOL=    X,             R,               I
##VAR_TYPE=  INDEPENDENT,   DEPENDENT,       DEPENDENT
##VAR_FORM=  AFFN,          ASDF,            ASDF
##VAR_DIM=   8192,          8192,            8192
##UNITS=     SECONDS,       ARBITRARY UNITS, ARBITRARY UNITS
##FACTOR=    0.0002768,     1,               1
##FIRST=     0,             0,               0
##LAST=      2.2672688,     0,               0
##MIN=       0,             -604844,         0
##MAX=       2.2672688,     578229,          0
$$ Real data points
##PAGE= N=1
##DATA TABLE= (X++(R..R)), XYDATA
0@%%%%%%%%%%%%%%%mQj1J5j6J6j6K0k7L1l6M1m6N3o0O8p9Q8r7J11j25J39j54J71
$$ 0 0 0 0 0 0 0 0 0 0 0 0 0 0 0 0 -4 4 -7 8 -8 8 -8 12 -15 16 -20 21 -25 28 -32 36 -43 45 -52 59 -66 73 -81 90
39I0j91K11k32K59k88L19l50L83m23M66n14N67o25O89p61Q44r38J048j176J329
$$ 90 -101 110 -122 137 -151 168 -182 201 -222 244 -270 297 -328 361 -400 444 -494 554 -622 707
59G07j514J742k034K417k946L720m939P087j1598K4620j29917m92189L93757O72361
$$ 707 -807 935 -1099 1318 -1628 2092 -2847 4240 -7358 17262 -112655 -604844 -211087 461274
73D61274j99938m28566M1139J36359J1136L6229R5703j45050k52928Q6030L18691
$$ 461274 261336 -167230 -126091 10268 21404 57633 153336 8286 -244642 -158612 160079
84A60079N4407k78830j68139J48948J76481o2529q2951N2407j7422o3894Q3537
$$ 160079 214486 -64344 -232483 -83535 92946 30417 -52534 -127 -17549 -81443 2094
95B094J44510j00715j72392J06622J25011j20939p2355J72961J6631k37668O875
$$ 2094 146604 45889 -126503 -19881 105130 -15809 -88164 84797 101428 -136240 -129365
106a29365K53053j2407k85163l955K72022K8333k02358k9496J72886K0016j49468
$$ -129365 123688 111281 -173882 -177837 94185 122518 -79840 -109336 63550 83566 -65902
117f5902j0861J39803K5762j18277J6764J06921p2824j38820Q8161J78203j09371
$$ -65902 -76763 63040 88802 -29475 -12711 94210 21386 -117434 -29273 148930 39559
128C9559k07260Q6514K02613m5982j68251J5910Q4090l118R043M6851m7340r2515
$$ 39559 -167701 -81187 121426 75444 -92807 -76897 7193 4075 13118 59969 12629 -79886
140g9886P9766J27923o2639j34596L2187J17042l6682r8246M3722R9480o4629
$$ -79886 -120 127803 65164 -69432 -37245 79797 43115 -55131 -11409 88071 23442
151B3442j35594N2878J32961l0932j21113L1322J07504m2802o5190P7220N1140
$$ 23442 -112152 -59274 73687 42755 -78358 -47036 60468 17666 -47524 29696 80836
162H0836j18598n4451J57371Q9881j40055j24961R1593J03986n9888o6172K7549
$$ 80836 -37762 -92213 65158 155039 14984 -109977 -18384 85602 25714 -40458 -12909
173a2909J4638m4654J7818P1668k9810r3252J8116J05743l743p8635J8871O5657
$$ -12909 1729 -42925 -25107 46561 16751 -76501 -58385 47358 43615 -35020 -16149 49508
185D9508k8782o3753N5625P7378o9790j03909M3929J09124j7691r2412j5560M3464
$$ 49508 20726 -43027 12598 89976 20186 -83723 -39794 69330 51639 -40773 -56333 -12869
197a2869M388j4326L0578j920o1316J903R6181L3097j00364n5276Q8024P2775
$$ -12869 -8481 -22807 7771 5851 -55465 -53562 42619 75716 -24648 -79924 8100 80875
209H0875n3869n5966L0190J8859k3371p75J8169k3133l5292K8096L5963k6601
$$ 80875 27006 -28960 1230 20089 -3282 -4057 14112 -9021 -44313 -16217 19746 -6855
221f855l8319J9108L7969p465k3550Q873K9623n021k0246J7820K0236j8541k2891
$$ -6855 -45174 -26066 11903 4438 -19112 -10239 19384 14363 -5883 11937 32173 13632 -9259
234i259J8383J6163k7149j5630K3356J348l5633P330L5072j9995l8907K3552N3823
$$ -9259 9124 25287 -1862 -17492 5864 7212 -28421 -21091 13981 -6014 -44921 -21369 32454
247C2454j1828m7163R425M2145O709k0952m412M173j476N075J1244r041l7504
$$ 32454 20626 -26537 -17112 25033 31742 10790 6378 10551 9075 14150 25394 16353 -21151
260b1151p403M1609J5193m4414l2002L5594L3799k5327k2768K6503J6507k2425
$$ -21151 -28554 13055 28248 -16166 -48168 -12574 21225 -4102 -26870 -367 16140 -6285
272f285M879L1189m591l2324N700L6123p829l6246K055K4391j0703k8020O693
$$ -6285 -1406 29783 25192 -7132 -1432 34691 26862 -9384 -7329 17062 6359 -21661 -14968
285a4968K3248j0813l2215J0034L7461n052l0547N721L2489J958j9538Q005J5991
$$ -14968 8280 -2533 -34748 -24714 12747 7695 -22852 -17131 15358 17316 -2222 5783 21774
298B1774j4490j1965K4183Q840l4182j9352K4942K0818k6573k8825J4174K1985
$$ 21774 7284 -4681 19502 28342 -5840 -25192 -250 20568 -6005 -34830 -20656 1329
310A329o330j5198N642J1636p24j273J2624P026j3935j640J8103L483j6335p347
$$ 1329 -5001 -20199 -14557 -2921 -3645 -4918 7706 14732 797 -843 17260 20743 4408 -2939
324b939J1618N61j6736m349R906l065j2479k33Q449L844l872k469O444O407M735
$$ -2939 8679 9240 -7496 -11845 -1939 -5004 -17483 -17716 -9267 -5423 -9295 -11764 -5320 1087 5822
339E822K409q48m9L370L624m76n475o930J358J860n725n380m510j435L445L331
$$ 5822 8231 7383 7334 10704 14328 13852 8377 1447 2805 4665 -1060 -6440 -10950 -12385 -8940 -5609
355e609l360o281M764J4808K806j0374K783J4483K147o166j138L948k643o333
$$ -5609 -8969 -15250 -10486 4322 7128 -3246 -463 14020 16167 10001 8863 12811 10168 3835
369C835L960J619j2422j0108N239P626o459j0858L716J2971k825q407J0644J3560
$$ 3835 7795 9414 -3008 -13116 -7877 -251 -6710 -17568 -13852 -881 -3706 -12113 -1469 12091
383A2091n949j0381J1014J8091o590j7283K190Q934m657n797J408l881j2283m917
$$ 12091 6142 -4239 6775 24866 18276 993 3183 12117 7460 1663 3071 -810 -13093 -18010
397a8010J2996Q921j3040j4466O690J8985P027p312m444L531K406P924J3339p582
$$ -18010 -5014 3907 -9133 -23599 -16909 2076 9103 1791 -2653 878 3284 11208 24547 16965
411A6965k2786l794K1224J0897j7041k0215l068N309O965O169n342j3761m859
$$ 16965 -5821 -9615 11609 22506 5465 -14750 -17818 -12509 -5544 625 -4717 -18478 -23337
424b3337J3429K2861K831k4700j2775K5577K9230r386k6202r24J2246k726k782
$$ -23337 -9908 12953 15784 -8916 -21691 3886 33116 23730 -2472 -3396 8850 6124 3342
437C342O417q469j9534L63J6552O353j4850j4652N989K0094P046j5631n410K4297
$$ 3342 9759 1290 -18244 -17881 -1329 5024 -9826 -24478 -18489 1605 8651 -6980 -12390 11907
451A1907J1991k4104q281K6135P598k2223q723J2142K454q250p67m682j3919j252
$$ 11907 23898 -206 -8487 17648 25246 3023 -5700 6442 8896 646 -121 -4803 -18722 -19974
465a9974J1848R878O298j0301k6225N843M2091J4776l3765k1240K1683K5236K610
$$ -19974 -8126 1752 8050 -2251 -28476 -22633 19458 34234 469 -20771 912 26148 28758
478B8758j0156k4160j7963K1471K9315j1305k8734j0109N64J1057K6099L581m1250
$$ 28758 18602 -5558 -23521 -2050 27265 15960 -12774 -22883 -22319 -11262 14837 18418 -22832
491b2832k4759L8769M4170p615l1195j4058J2852L0245O993l0437j7050J9653
$$ -22832 -47591 -8822 35348 27733 -3462 -17520 -4668 25577 32570 2133 -14917 4736
503D736J1002j4314J323Q524k7766k6531L0092L5786j7344k7761N894J6822L239
$$ 4736 15738 1424 2747 11271 -16495 -43026 -12934 22852 5508 -22253 -16359 463 3702
516C702m876j694R618J2221p414j7897J3499K5080k2407l6264J6374L0494j3510
$$ 3702 -1174 -2868 6750 18971 11557 -6340 7159 32239 9832 -26432 -10058 20436 6926
529F926k1292M716J661j0515O887J7757l239j4507n335N113K2559K5292j5995
$$ 6926 -14366 -9650 -7989 -18504 -11617 6140 2901 -11606 -16941 -11828 10731 36023 20028
542B0028l9211K727L5182Q365j8494j2374k653J080J3766O396k5469k3451J0023
$$ 20028 -19183 -16456 18726 27091 8597 -3777 -6430 -5350 8416 14812 -10657 -34108 -24085
555b4085K0037J3366P559j8182l1464P915M5353J3705l2742j7270K1388J8821
$$ -24085 -4048 9318 16877 -1305 -32769 -24854 20499 34204 1462 -15808 5580 24401
567B4401m786j4728j2320J849J1196k460j0227K948M265j4726p665K0335J3545
$$ 24401 19615 4887 -7433 -5584 5612 3152 -7075 -4127 138 -14588 -22253 -1918 11627
580A1627j9727j3379J9490J5174q254m071J3535P196j7540j8194J2274K6527j855
$$ 11627 -8100 -21479 -1989 13185 4931 860 14395 21591 4051 -14143 -1869 24658 22803
593B2803k9097j3390J9001J2434j8861j6866R925J1713j773K886J0108m314k2136
$$ 22803 -6294 -19684 -683 11751 -7110 -23976 -14051 -2338 -4111 -1225 8883 4569 -17567
606a7567l87L1624J8509j7703k0861K881J3995N464m877j1553j3066O47J5973
$$ -17567 -17954 13670 32179 14476 -6385 -3504 10491 15955 11078 -475 -13541 -12894 3079
619C079N653j4168j3098K46J0814J1868Q16j1592p928Q466K0003R800r617j8014
$$ 3079 8732 -5436 -18534 -18288 -7474 4394 5210 -6382 -14310 -5844 14159 23959 14342 -3672
633c672n986J6482J5040j4393j7308R509R501j2816j1002O991J386r799N174J7038
$$ -3672 -9658 6824 21864 7471 -9837 -328 9173 -3643 -14645 -7654 -6268 -16067 -10893 6145
647F145j706j3093R2Q432O135J691k284Q49P530j411j3022k290J2310j072j6696
$$ 6145 4439 -8654 -8562 -130 6005 7696 5412 6261 13791 12380 -642 -2932 9378 8306 -8390
662h390j166J0550n294q715N248M833m186J39K902Q11N222N696m405k608J2355
$$ -8390 -9556 994 -4300 -13015 -7767 -2934 -7120 -6981 -4079 -3268 1954 7650 3245 637 12992
677A2992M825j6818n193J1955p28p211M655j08j5303n330J1821L346r494k78P689
$$ 12992 17817 999 -4194 7761 7033 -178 4477 4369 -10934 -16264 -4443 -1097 -10591 -10869 -3180
692c180K135K157Q38m732K379R236J283k554L089k417r944K227J0813q067j6111
$$ -3180 -1045 1112 1950 -2782 -403 8833 10116 7562 10651 8234 -1710 517 11330 3263 -12848
707a2848O319J1184j1760q619J1255M467r501o22J1628K763o083J826P779K112
$$ -12848 -6529 4655 -7105 -15724 -4469 -2 -9503 -10125 1503 4266 -1817 9 7788 9900
721I900j370l015j118L376k076p170K323M437q591r466O494O614r623o309J2903
$$ 9900 8530 5515 4397 7773 5697 -1473 850 5287 -3304 -12770 -6276 338 -9285 -15594 -2691
736b691P262j0140j650J1520L344o034K58P382J960n802k721L129l78m793m519
$$ -2691 4571 -5569 -7219 4301 7645 1611 1869 9251 11211 5409 2688 5817 5439 646 -3873
751c873J136K043n470n156N134L898n714j490P278N471m025j705P649M780l904
$$ -3873 -2737 -694 -6164 -11320 -6186 -2288 -8002 -9492 -2214 3257 -768 -2473 5176 9956 6052
766F052j412K466L6k632k171K7j018m460k510J564n02k739k711K958N414l53k885
$$ 6052 4640 7106 7142 4510 2339 2366 1348 -3112 -5622 -4058 -4560 -7299 -10010 -7052 -1638 -1991 -4876
783d876L302N705J411j954J67M313J081m199j219J347j749l731k537N24n37m082
$$ -4876 -1574 4131 5542 3588 3755 8068 9149 4950 3731 5078 3329 -402 -2939 -2415 -2952 -7034
799g034j661L370Q12k081L27N024L779k448m66P051K798n371j049N186J104o448
$$ -7034 -8695 -5325 -4513 -6594 -6267 -1243 2536 88 -378 6673 9471 4100 3051 8237 9341 2893
815B893m449L730K3o861j855L135q84m943N79O023K063n633M09R701L573m884
$$ 2893 -1556 2174 2197 -4664 -6519 -3384 -4268 -9211 -8632 -2609 -546 -6179 -5770 3931 7504 2620
831B620k235O788L558o054k614N590j488r394m89N706j370r501k002P403J398
$$ 2620 385 7173 10731 4677 2063 7653 6165 -3229 -3718 1988 618 -8883 -10885 -3482 -2084
846b084n863L47O869J028k773K305P346J117o372JQ025J64p892k345L621m23p291
$$ -2084 -7947 -7600 -731 297 -2476 -171 7175 8292 1920 1921 9946 10110 2218 -127 3494 3071 -4220
863d220j743M515k260o276J683N302N60l361J491N878J282j703K432M823j234
$$ -4220 -5963 -1448 -3708 -9984 -8301 -2999 -2439 -5800 -4309 1569 2851 1148 3580 8403 7169
878G169l799n04L679J241o481m705J253J393k266k651r60N28j507J271N729J906
$$ 7169 3370 2866 6545 7786 1305 -3400 -2147 -754 -3020 -5671 -6631 -6103 -7610 -6339 -610 1296
894A296m169o77N379O805K11n860j905M382L357k483n085j256k8m960n87N295
$$ 1296 -2873 -3550 1829 8634 8845 2985 1080 5462 8819 6336 1251 -5 -33 -4993 -5580 -285
910b85j554q357k45Q378L676n011j962N094L428P44K852N33l143j210J245K306
$$ -285 -1839 -10196 -10441 -2063 1613 -3398 -5360 -266 3162 3906 6758 7291 4148 2938 4183 6489
926F489n29n769l415J601L17l125j799L237k148o218N466J0724m177p696Q434
$$ 6489 5960 191 -3224 -1623 -1306 -4431 -6230 -2993 -5141 -11359 -5893 4831 654 -7042 1392
941A392Q312n893n025R169M180j1411m442J0948M575j0756j1045J451R146O32
$$ 1392 9704 3811 -1214 7955 12135 724 -3718 7230 11805 1049 -9996 -8545 601 1233
955A233q937j422P643p41p405N400J2788m931j3690R275J8559n431j4688J327
$$ 1233 -7704 -9126 -1483 -2224 -9629 -4229 8559 3628 -10062 -787 17772 12341 -2347 -1020
969a020P678j90l149j631l976l185J661J797j679Q5k095n072M398R649K71n338
$$ -1020 6658 6468 3319 1688 -2288 -5473 -3812 -2015 -3694 -3609 -5704 -10776 -6378 3271 3542 -1796
985a796Q42N091L129p77l357l016L604O079m381p761K960J477j0690l218J0399
$$ -1796 -954 4137 7266 6489 3132 116 3720 9799 5418 -2343 617 2094 -8596 -11814 -1415
1000a415L955q238l196O084J977k865J825M187J626J417q96j077L804J545p385
$$ -1415 2540 -5698 -8894 -2810 -833 -3698 -1873 2314 3940 5357 4461 3384 7188 8733 1348
1015A348m768M959M781n114q277r39M455L628k699n739O74O759j522k046J0104
$$ 1348 -3420 1539 6320 1206 -7071 -8010 -3555 73 -2626 -8365 -7691 -932 -2454 -4500 5604
1030E604O878j1014r601J2187J2715j1111j3400Q660J2187o910j2965m51N705
$$ 5604 12482 1468 -8133 4054 16769 5658 -7742 918 13105 6195 -6770 -7221 -1516
1043a516l507o199P820J0281q124j2680O256J5256j658j1240L903J1731j501p089
$$ -1516 -5023 -11222 -3402 6879 -1245 -13925 -7669 7587 5929 -5311 -1408 10323 8822 1733
1057A733K367K744m727l679K840J641n683m642L632L061l630k329K382K007m182
$$ 1733 4100 6844 2117 -1562 1278 2919 -2764 -7406 -3774 -713 -4343 -6672 -4290 -2283 -6465
1072f465J396J0687K674q078R66P908m473q791O417R255o045r349M219L762q473
$$ -6465 -5069 5618 8292 214 1180 9088 4615 -4176 2241 11496 5451 -3898 321 4083 -4390
1087d390o270M080M857M46k276j189L236J060l649J361R570K561q610j026R175
$$ -4390 -10660 -6580 -1723 -1277 -3553 -4742 -1506 -446 -4095 -2734 6836 9397 787 -239 8936
1102H936j168q042K734K252p139j528M806k874n757M167M015o036j566O681j816
$$ 8936 7768 -274 2460 4712 -2427 -3955 851 -2023 -7780 -3613 402 -5634 -7200 -519 -2335
1117b335m439R345P989n932m940M038J368l335O9K564n7j627k963m631J96K327
$$ -2335 -6774 2571 10560 4628 -312 3726 5094 1759 1828 4392 4335 2708 -255 -4886 -4690 -2363
1133b363m877j237R964P92j0568K541J0962m022p606R791R553r606o307J0281
$$ -2363 -7240 -8477 1487 2279 -8289 -5748 5214 1192 -6414 3377 12930 3324 -2983 7298
1147G298K138j0304r14O447l148o944J60L307M30k862j469K353L676l255m661
$$ 7298 9436 -868 -1782 4665 1517 -5427 -5267 -1960 -1530 -4392 -5861 -3508 168 -3087 -7748
1162g748P673R022o521m499J0300K207j2931j276J2728p86j2454J904Q696p218
$$ -7748 -75 8947 2426 -2073 8227 10434 -2497 -3773 8955 8169 -4285 -2381 6315 -903
1176i03j0041N441N963m528k875M390L638j651k437J646N401J707l941p03O364
$$ -903 -10944 -5503 460 -4068 -6943 -2553 1085 -566 -3003 -1357 4044 5751 1810 1107 7471
1191G471Lq333J57P134m435q317L293M678n626m107N535L064n794l58N704J89
$$ 7471 7474 -859 -702 6432 1997 -6320 -3027 1651 -3975 -8082 -2547 517 -5277 -5635 69 258
1207B58j107K981K724j045k02M49o35j435M87j56j634o60q73k528q09R4j071J427
$$ 258 -849 2132 4856 3811 3609 4058 3423 1988 2475 2319 685 25 -848 -3376 -4185 -4091 -5162 -3735
1225c735K043j168J75K916J359j571J285M174j039l415L248K497m515l631L108
$$ -3735 -1692 -2860 -2685 231 1590 19 1304 5478 4439 1024 4272 6769 2254 -1377 1731
1240A731J047n571k460L222J118m873m59M746N79l215O45N476J973l360k01N914
$$ 1731 2778 -2793 -5253 -2031 -913 -5786 -6245 -1499 -920 -4135 -3490 1986 3959 599 398 6312
1256F312N15n808k85M512n65o286j195N207j688p393P90N426j471m951K023O228
$$ 6312 6827 1019 734 5246 4681 -1605 -2800 2407 719 -6674 -5884 -458 -1929 -6880 -4857 1371
1272A371n88m615L093O477j380n072L364N056k766n800J687M379l765o243K084
$$ 1371 783 -3832 -739 5738 4358 -714 2650 7706 4940 -860 827 5206 1441 -4802 -2718
1287b718L467l472m135K531M373k407l598M035M665j681j999L270L583j976k882
$$ -2718 749 -2723 -6858 -4327 46 -2361 -5959 -1924 2741 1060 -939 2331 5914 3938 1056
1302A056K565J806l038k942J180M89k449k426P00Q37j163j447J797J629l77L81
$$ 1056 3621 5427 2389 -553 627 1116 -1333 -3759 -3059 -2222 -3385 -4832 -3035 -1406 -1783 -1402
1318a402J855J861J20l55J305P52p51l94q93m75o92j488r52l01j032o31m14M47
$$ -1402 453 2314 2434 2079 3384 4136 3385 2991 2098 1623 931 -557 -1509 -1810 -2842 -3473 -3887 -3440
1336c440P82M06l10J671K106K51r9Q25K015l14j865R78J486k403l217O21J365
$$ -3440 -2658 -2252 -2562 -891 1215 1466 1367 2192 4207 3893 2028 3006 4492 2089 -1128 -507 858
1353H58k002l536R21K575j919j621J817K975r13j552K861L691p76k849K017L167
$$ 858 -1144 -4680 -3759 -1184 -3103 -4724 -2907 68 -845 -2397 464 4155 3379 530 2547 5714
1369E714j430l913M89K959l124m416J987K423l958k830K642L083k199j596L006
$$ 5714 4284 371 860 3819 695 -3721 -1734 689 -3269 -6099 -3457 -374 -2573 -4169 -1163
1384a163K690j174o05K966K035k247j599K314K450l240m232K144J749l670l504
$$ -1163 1527 353 -252 2714 4749 2502 903 3217 5667 2427 -1805 339 2088 -1582 -5086
1399e086K602K193m055j712M615K050l296m87M301K170j112j259J628J781p59
$$ -5086 -2484 -291 -4346 -6058 -1443 607 -2689 -3176 1125 3295 2183 924 2552 4333 3574
1414C574j783j25J230j116l969m14K991j511l747Q64K259j010p72K040J622K67
$$ 3574 1791 1666 2896 1780 -2189 -2603 388 -1123 -4870 -4006 -1747 -2757 -3529 -1489 133 400
1430D00M50J427Q6N25P79j331o73J836m71k999p32j6j433r57J006J04j767N07
$$ 400 850 2277 2363 2888 3667 2336 1663 3499 3028 29 -703 -719 -2152 -3109 -2103 -1999 -3766 -3259
1448c259K106p80K97J572J080N4J119J072J39o35m77Q4L05n64k850k061K282N80
$$ -3259 -1153 -1933 -1636 -64 1016 1070 2189 3261 3400 2765 2288 2372 2677 2113 -737 -2798 -516 64
1466F4l794r37L651j01l784Q75M628J245k791M95M552J049m209j221L151K550
$$ 64 -3730 -4667 -1016 -1117 -4901 -4026 602 1847 -944 -449 4103 5152 943 -278 2873 5423
1482E423l513k997K900J040n611l156M144K272l972j925L787K331k701r66L524
$$ 5423 1910 -1087 1813 2853 -2758 -5914 -1770 502 -3470 -5395 -1608 723 -1978 -2944 580
1497E80K403j159j055J452K529j303k761R54J400k214k897P47P39k679j80K804
$$ 580 2983 1824 769 2221 4750 3447 686 1640 3040 826 -2071 -1324 -585 -3264 -3444 -640
1513f40j233k813J375L167q41J04K791J769j781m94J116kp44J39n6M13m70l823
$$ -640 -1873 -4686 -3311 -144 -985 -881 1910 3679 1898 1404 2520 2518 1774 1913 1857 2270 1800 -2023
1531b023k163K595M81l734J384L784j236l382K428M037j516q68K708O37o35N49
$$ -2023 -4186 -1591 -1110 -4844 -3460 324 -912 -4294 -1866 2171 655 -213 2495 3132 2497 3046
1547C046m61j364J597k01m067j680L195n38m129J963L407l033k938L110J508n02
$$ 3046 2585 1221 2818 2617 -1450 -3130 65 -473 -4602 -2639 768 -2265 -5203 -2093 -585 -1087
1563a087J849J946k30N30j03k543j25M404j307n103K652L100o561m064N815J440
$$ -1087 762 2708 2478 3008 2905 362 237 4641 3334 -1769 883 3983 -2578 -6642 -827 613
1579F13n517P36N162j672l782L413L457j872J64K068p45J20R85j637K9J934k148
$$ 613 -4904 -4168 994 -678 -4460 -1047 2410 538 702 2770 2025 2145 3130 1493 1522 3456 1308
1596A308m611J488K767m588j824O202P54o982P94O344k166l436N646M493m069
$$ 1308 -3303 -1815 952 -3636 -5460 742 1496 -5486 -4692 1652 -514 -3950 1696 6189 2120
1611B120k458L408J36k805L96J637l80p45k101k536J348J351l350o20M804J98
$$ 2120 -338 3070 3206 401 797 2434 2054 1309 -792 -3328 -1980 -629 -3979 -4599 205 403
1627D03m881J845N828j920l585M726L114m433j038L481R3k945j35L86k106r93
$$ 403 -4478 -2633 3195 1275 -2310 2416 5530 1097 59 3540 3633 688 553 939 -1167 -2160
1643b160L28j029N40J673q11j817J751J281j500J318K736L81j017J012M1j382
$$ -2160 -1832 -2861 -2321 -648 -1459 -3276 -1525 -244 -1744 -426 2310 2691 1674 2686 2727 1345
1659A345k09J145j351j021J348j665k970P60J568j774r26L044O62k295Q53K942
$$ 1345 1136 2281 930 -91 1257 -408 -3378 -2618 -1050 -2824 -3750 -706 -44 -2339 -1486 1456
1675A456O2j303J430J189l67j122P0R91k70k130j324R18o18k179r3K505M28l120
$$ 1456 1518 215 1645 2834 2467 1345 1415 2406 2136 6 -1318 -400 -1018 -3197 -3290 -785 -357 -3477
1693c477N34L518n02k551K706L591j079k482J663K036j816k777J291K365k323
$$ -3477 -2943 575 73 -2478 228 3819 2740 258 1921 3957 2141 -636 655 3020 697
1708F97l060J52K577k143l185K019L421j712k314K539L514j813j926K787K663
$$ 697 -2363 -2211 366 -1777 -4962 -2943 478 -1234 -3548 -1009 2505 692 -1234 1553 4216
1723D216k358j080J443J223k171j887P63J126k619k411J669J871j820j603K176
$$ 4216 1858 778 2221 3444 1273 -614 149 1275 -1344 -3755 -2086 -215 -2035 -3638 -1462
1738a462J937j634j093L060J937j750j76K409l07j767j13Q68p92j398j90k53o76
$$ -1462 475 -1159 -2252 808 2745 995 819 3228 2921 1154 1041 1909 1117 -281 -471 -724 -1400
1755a400n80m79K7Q22j86r0J186O43J92K46J501K74l84M28l9n79o48O03j291q51
$$ -1400 -1980 -2459 -2432 -1610 -1796 -1886 -700 -57 135 381 1882 2156 1772 2200 2161 1582 934 1537 246 -605
1775f05K50p04j274j85J182L3j474J133J851m92r08J950J371o66l99R23J355j469
$$ -605 -355 -1059 -2333 -2518 -1336 -1303 -2777 -1644 207 -285 -1193 757 2128 1462 1063 1986 3341 1872
1793A872j505O46O32j591j498K14R65j349j989J478K220j590j334K397K571j678
$$ 1872 367 1013 1645 54 -1444 -1230 -265 -1614 -3603 -2125 95 -1495 -2829 -432 2139 461
1809D61j444K768J854k068j468K244R37k602j696J431Q88k196k295J593R70j743
$$ 461 -983 1785 3639 1571 103 2347 3284 682 -1014 417 1305 -891 -3186 -1593 -623 -2366
1825b366j196K104J607j351o40K691J853k084l06K175P42j981q78J311J64k495
$$ -2366 -3562 -1458 149 -1202 -1842 849 2702 618 312 2487 3229 1248 370 1681 1845 -650
1841f50r06J612l58k230j24J225N40j143l9J723R72r29M20J757O28q96l84J110
$$ -650 -1556 56 -302 -2532 -2656 -1431 -891 -2034 -2073 -350 622 -307 113 1870 2498 1602 1218 2328
1859B328J08j786l47L51l95j215q85P44J10j057r9P52N32j26L01O91J302k5j88
$$ 2328 2436 650 303 654 259 -956 -1841 -1097 -987 -2044 -2143 -1391 -859 -985 -684 7 1309 1284 1096
1878A096M45P76j47q03p33O84n46j331m69J29j64p00o46N67J017o11k77J433R37
$$ 1096 1541 2317 2170 1367 634 1318 772 -559 -1028 -899 -1063 -1763 -2409 -1842 -825 -1436 -1713 -280 657
1897F57l51M82P10J022q74o41J021j87j422n98N38k70j809j43J018l7j514j70
$$ 657 306 788 1498 2520 1646 1005 2026 1839 417 -181 357 87 -1722 -1865 -847 -884 -2398 -2568
1915b568J794L76q31J85K216J120k030j4K278L55k284K0J734n44k837j90J511
$$ -2568 -774 -398 -1229 -1044 1172 2292 262 248 2526 2881 597 617 2351 1807 -1030 -1220 291
1932B91n15j759p59J544P01j372p67K413J310j650l15K970L15j395k26J613P2
$$ 291 -224 -1983 -2742 -1198 -497 -1869 -2636 -223 1087 -563 -878 2092 2407 1012 786 2399 2471
1949B471j874k99M97p17j364k38K68j30o20j60Q68N34k58K88J031J167n34k22
$$ 2471 597 298 795 78 -1286 -1524 -1256 -1386 -2006 -2166 -1298 -764 -1022 -734 297 1464 930 708
1967G08J420m8j561L82J367j046j606M53N5j301j140J127J16n71nM38R1J132K56
$$ 708 2128 2080 519 901 2268 1222 -384 69 124 -1177 -2317 -1190 -1074 -1645 -1650 -1212 -1121 11 267
1986B67q14J563J273q96j159J803Q52j934r94J549p91k169K7O09o12J89k99n61
$$ 267 -547 1016 2289 1393 234 2037 2889 955 -39 1510 719 -1450 -1423 -814 -1426 -1237 -1536 -2097
2004b097N61Q84p51j31K905J290k075n49L104j194k611J472K195k203j898J021
$$ -2097 -1536 -652 -1403 -1534 1371 2661 586 37 3141 1947 -664 808 3003 800 -1098 -77
2020g7n3j550k67O49m7P7N23p10M54J564j93q87K228J102k195n15K437j13k768
$$ -77 -130 -1680 -1947 -1298 -1345 -1268 -745 -1455 -1001 563 370 -517 1711 2813 618 103 2540 2427 -341
2039c41O79J636k330k659K123P22j723qJ727q06o41L85P69M29J397K75o65J133
$$ -341 338 1974 -356 -3015 -892 -170 -1893 -1901 -174 -980 -1621 -1236 -467 -38 1359 1634 969 2102
2057B102J83k454j40K677n45l089J106J531k368k262K134J413k091k82J943j86
$$ 2102 2285 -169 -309 2368 1823 -1266 -160 1371 -997 -3259 -1125 288 -1803 -2085 -142 -328
2073c28o38Q79O59N14M92l6r72P77R02j360p47J156j29k866l69J601p69q92J352
$$ -328 -966 -87 572 1086 1578 1542 570 1347 2249 889 142 1298 1169 -1697 -2066 -465 -1234 -2126 -774
2092g74M72r76k91J040K17K98J658K43p59P26o3j335j90J655o34j718J83J67j189
$$ -774 -302 -1278 -1569 -529 -312 -14 1644 1887 1128 1854 1791 456 266 1921 1287 -431 -248 -81 -1270
2111a270j067J217R5o06K10O93L36M20j85M13J245J68r08K94J089p97r24L35O74
$$ -1270 -2337 -1120 -1025 -1631 -1421 -728 -392 28 -157 256 1501 1669 761 1055 2144 1347 423 758 1432
2130A432j692j585M71R35j312j67J356O98j215q02J160J677m36m33J388J193q45
$$ 1432 -260 -1845 -1374 -439 -1751 -1918 -562 136 -1079 -1881 -721 956 520 87 1475 2668 1823
2147A823j849P45J493j570j879J657M60k238j060J285P99j300k33J303K45j50
$$ 1823 -26 719 2212 642 -1237 420 880 -1358 -2418 -1133 -334 -1634 -1867 -564 -319 -469
2163d69M9P94J148k39o10K20J150j006j013R19O69j771j409O49M25j672K85J499
$$ -469 -420 374 1522 1283 673 893 2043 1037 24 943 1612 -159 -1568 -919 -494 -2166 -1881 -382
2181c82m45q17N77O66O6M76M50N68O13J99r04j39N65k85j670M77N51j242p89L65
$$ -382 -827 -1644 -1067 -401 -335 141 591 1159 1772 1971 1067 928 1493 1208 -462 15 566 -676 -1465 -1100
2201a100J00j045O14N68J05j72R23L54J63P30K92p66L38Q63j100q12J013K68k030
$$ -1100 -1000 -2045 -1431 -863 -758 -930 -7 347 510 1240 1532 766 1104 1967 867 55 1068 1336 -694
2220f94p33Q43m72j108O45P83O4m94L90N19L85M07N4O06R69p04j057L23J273j577
$$ -694 -1427 -584 -1056 -2164 -1519 -736 -672 -1166 -776 -257 128 535 589 1195 2164 1460 403 726 1999 422
2240D22j475J274N68k183n83J532J04j498n3J554N42j102N87J030O53p26j17R22
$$ 422 -1053 221 789 -1394 -1977 -445 -341 -1839 -1892 -338 204 -898 -311 719 1372 646 529 1451
2258A451O78j159q36J172j6j731p14Q62N3j266p63K008Q6j419J66J777R2q62M31
$$ 1451 2129 970 134 1306 1290 -441 -1155 -293 -240 -1506 -2269 -261 -175 -1594 -1428 349 441 -421 10
2277A0J356Q4o16K0O89k29r55j87P6k12j068n39Q11N8j037R7J050K71n14L81J299
$$ 10 1366 1450 834 854 1543 1314 359 172 248 36 -1032 -1571 -760 -702 -1739 -1642 -592 -321 -835 -454 845
2298H45P6l00K10O74j04o16J51mo1r99k00j06j76n78l78K19Q44m96l50O81Q72
$$ 845 921 621 831 1505 1401 785 936 932 871 -128 -328 -434 -610 -1188 -1566 -1347 -503 -999 -1349 -668 204
2319B04J4Q2M31M48M17r23K49N40m28o87n23M92m03j265N9L91N3o04l79J071O66
$$ 204 218 300 731 1179 1596 673 922 1462 1034 347 -176 316 -87 -1352 -1293 -902 -849 -1453 -1832 -761 -95
2340i5p44K87J186Q46j085L29R22R3j204J23N97n21j383k20Q40p27r56J1J195
$$ -95 -839 -552 634 1480 395 724 1646 1739 535 658 1255 734 -649 -869 -29 -756 -1712 -1701 -506
2359e06k3j006O31R87M45o95L95J292j92r15N16Q89o65j197K9R44q10j624K08
$$ -506 -529 -1535 -904 83 528 -167 228 1520 1328 413 929 1818 1153 -44 -15 929 119 -1505 -1297
2378a297J246p75j230Q15R58l57m21Q44J061L09r53L25Q54M05r66M0L87m31j075
$$ -1297 -51 -826 -2056 -1241 -283 -640 -1061 -217 844 1153 200 525 1379 1784 818 858 1245 814 -261
2397b61m98P64n31p29rM06J02o57N34Q09J06l44P72O85J39m18K30k3J97m24l41
$$ -261 -759 5 -526 -1255 -1264 -858 -756 -1413 -879 -70 36 -308 464 1149 1288 870 1100 1077 1274 850 509
2418E09j85k67p41l56J53J20m51k14N91M67l11L18O58L09k00M23K47J97n80L37
$$ 509 324 57 -684 -1040 -887 -767 -1218 -1432 -841 -374 -685 -367 291 600 400 823 1070 1267 687 1024
2438A024r8k76k98p54k24M04q29n23L71P99m42r17J506P92n21m61J326N92o14
$$ 1024 926 650 352 -402 -626 -222 -1051 -1574 -1203 -404 -846 -1763 -257 535 14 -447 879 1471 857
2457H57l30L15L59m25n65K71N3m83j196j27J212k76j500M92J433p08p62J180J218
$$ 857 527 842 1201 776 211 482 535 52 -1144 -1271 -59 -335 -1835 -1343 90 -618 -1380 -200 1018
2476A018l19p57J410K6m38n54O16j30n54n01k28r3K2q28j78J201m48n11k1J382
$$ 1018 699 -58 1352 1378 940 386 1002 872 318 -183 -411 -504 -482 -1310 -1488 -287 -735 -1246 -1267 115
2496A15l90n70J343J266q66q24J045M14j365J34P24o12j008J91m85R3Q9n41l39
$$ 115 -275 -845 498 1764 898 74 1119 1533 168 302 1026 414 -594 -403 -888 -795 -706 -1247 -1586
2515a586J040L95j182N79J656K4q07O43P31o98k90P33o9n68l18j37o22m30l86
$$ -1586 -546 -151 -1333 -754 902 926 119 762 1493 795 505 1238 1169 601 283 146 -476 -906 -1292
2534a292J6L27P28m43p26Q24M56j17q3J420N46r64r8P59o92l13J79q7j16q13k12
$$ -1292 -1276 -949 -221 -664 -1390 -566 -110 -227 -310 1110 1656 692 594 1353 661 348 527 440 324 -489 -701
2555g01l31J98j15m78N94O91n59l62J113J009p05j91J327pj267P7Q71K1j069J77
$$ -701 -1032 -834 -949 -1427 -833 -142 -701 -1063 50 1059 354 163 1490 1483 216 293 1164 1185 116 293
2575B93j82n69o54n86O15R71p29o12R55Q69p98o02J673J407j285k91J145m38j080
$$ 293 111 -458 -1112 -1698 -1083 -112 -841 -1453 -498 371 -427 -1029 644 2051 766 475 1620 1182 102
2594A02J17Q11l55q94n73J50K96m14n63Q3R43k09q52J063J256q12J60J058J19
$$ 102 219 1030 675 -219 -792 -642 -346 -760 -1323 -1240 -297 -506 -1358 -295 961 149 309 1367 1486
2613A486r76j08Q04K7q19j86K57q35n32j10K0M9M34m81J34P30m1o92J020J395
$$ 1486 510 402 1206 1233 414 228 485 -350 -882 -992 -972 -923 -489 -970 -836 -106 -147 -839 181 1576
2633A576r93l29J116M7j110j30Q82o92o39K80k63o77q5K91m76K48M83l18k14J362
$$ 1576 583 254 1370 1417 307 177 1059 367 -272 8 -255 -932 -1017 -726 -1202 -954 -471 -789 -1003 359
2653C59M88r41N14J238q76o89N24N74o63l98L21k85q22J79m88m44J057lp96N11
$$ 359 847 -94 420 1658 782 93 617 1191 528 130 451 166 -656 -477 -965 -1409 -352 -355 -1151 -640
2673f40J068r69l03J348P49q12l6J091j80j386M98P53r39m76J34j42m93j89j46
$$ -640 428 -541 -844 504 1253 441 405 1496 1316 -70 428 1181 242 -234 -100 -242 -735 -924 -1070
2692a070L85J53l17j01O65P85p46J23J445M37j473j94J417p26j132M71N58r15
$$ -1070 -685 -532 -849 -950 -285 500 -246 -123 1322 1759 286 92 1509 783 -349 122 680 -235
2710b35j068O04K31j58l24P5N69j31J59N2J95J094o00j58N55N23j109L2M82l03
$$ -235 -1303 -699 -468 -626 -950 -875 -306 -437 -278 -226 -31 1063 463 305 860 1383 274 306 788 485
2730D85r63l8N27o40n86K47M68n37K34R8O05L60j44J46L18L20q7m9J22O0n99m5
$$ 485 -478 -516 11 -629 -1215 -968 -500 -1037 -803 -705 -100 260 116 262 580 900 813 764 886 946 347 302
2752C02J32k87n62m41M61o1m12K1J67K64n9L3L26N90K43l33L45P65n38m19J74
$$ 302 434 147 -415 -856 -395 -456 -868 -847 -680 -416 -475 -442 -116 474 717 384 729 1494 956 537 711
2773G11%m08l99m51N70q35l34K22P79l96m34K16R57K3m91O95O42L0q05M04N50
$$ 711 711 303 -96 -547 23 -812 -1146 -924 -145 -541 -975 -759 198 221 -270 425 1067 1097 292 696 1246
2794A246m98r13L31L07n95p72J5M40k50l15L0Q03m44j65P32R47m79l73O91M08
$$ 1246 748 -165 166 473 -122 -894 -879 -439 -689 -1004 -974 -171 -615 -780 -48 899 420 47 738 1146
2814A146l11n34L31Q2k75p39L25Mm50n75L42J93k83l16N14M83K6k60N37R54o17
$$ 1146 835 301 632 714 439 -300 25 29 -421 -996 -654 -461 -744 -1060 -546 -63 -37 -297 240 1194 577
2835E77q2N37K22o00o27J53J40l91o61K10L09m67o81N55J49q1K08L17L27L77j1
$$ 577 495 1032 1254 654 27 180 320 -71 -732 -522 -213 -680 -1361 -806 -657 -738 -530 -213 114 491 480
2856D80K01K36q4k05r9R1k96l48m2j5R1n03j51J47m15P9J17K59M28L0J24L50L60
$$ 480 681 917 833 628 529 620 324 -24 -66 -81 10 -493 -644 -497 -912 -833 -716 -457 -29 1 125 475 835
2879H35m21M9L17K19l62l02Q1lo89n23L67K24n18l15M67j1J26l20P81P22l93k39
$$ 835 414 463 780 999 637 335 416 413 -276 -799 -432 -208 -726 -1041 -574 -585 -459 -779 2 724 331 92
2901I2N90J34k30k58L34L33o30j055O23M92j048k51M25n0j70j10N54R5o0j19N87
$$ 92 682 816 586 328 662 995 365 -690 -67 425 -623 -874 -449 -499 -669 -779 -225 -130 -190 -309 278
2922B78Q61o50j06L49M17o04l48R4M75j004m55L49o9m03k80P33J38m40N9O50m6
$$ 278 1139 489 383 732 1149 545 197 291 766 -238 -693 -344 -413 -816 -1096 -363 -225 -665 -606 44 -2
2943bJ75K30M41r4M8j27k11N69p13l15R3J61q53j94L63M7k67k97N92K96k40M25
$$ -2 173 403 844 750 798 671 460 1029 316 1 94 255 -598 -792 -429 -382 -649 -946 -354 -58 -298 127
2965A27L12L4K91O2k29j0L47m23k56J53l90p50L05J83Q2n35r3O06l28j87M39K19
$$ 127 439 473 764 826 597 587 934 511 255 408 18 -732 -427 -244 -162 -697 -790 -184 -512 -699 -260 -41
2987d1J67jL44L07j41j05l7P1m3m24n02M00k25n19n3O66j11o80P7N84o3l44O47
$$ -41 126 125 469 776 635 530 493 564 521 97 -405 -5 -230 -749 -802 -136 -247 -927 -850 -266 -329 -673 -26
3010b6N44J54j90k55O84j30p1m58O29r4j089L5K0o3n42K48K51q8k70K58L73K95
$$ -26 518 672 482 227 911 781 710 252 881 787 -302 -267 -247 -310 -852 -604 -353 -441 -711 -453 -80 215
3032B15q4L18K7K22j06o32Q31J22o11n22M12J2q85%N60k13o22K74M62l36J18K19
$$ 215 131 449 476 698 592 -40 791 913 302 -220 192 204 -681 -681 -121 -334 -956 -682 -220 -556 -438 -219
3054b19N69l97K88J57R5K42k07k29q8M65l12q98L84N6q14J79O15j71m38N1L82
$$ -219 350 -47 241 398 493 735 528 299 211 676 364 -534 -150 -94 -908 -729 -114 -285 -723 -672 -290
3075b90M0qQ06k54L74Q8l11j32N27k74o14q1N07m95r01Q87K97r49m0Q10o8n93
$$ -290 -250 -258 548 294 668 756 445 313 840 566 -48 -129 378 -117 -1018 -131 166 -783 -823 -13 -81 -674
3097f74K87O15J16Q7J89l98l6O21l25o24Q21j3j081J65K52k93p80P84K28l74k98
$$ -674 -387 228 344 431 620 222 186 807 482 -142 679 666 -415 -250 2 -291 -1071 -287 -59 -433 -731
3118g31P86J50p31N76N01j06n1L55j00q7l8m29j07m8J18n33m62O90p0p52M07O45
$$ -731 55 205 -526 50 551 445 394 749 649 562 524 95 -12 -60 58 -475 -937 -247 -317 -1069 -662 -17
3140a7n81j67R11K31j13J26L45j03m25K82ql16K59k19n36L42m01m77J71O40k54
$$ -17 -598 -765 146 377 264 390 735 632 207 489 481 165 424 205 -331 11 -390 -867 -696 -56 -310
3161c10q01L75J058n90m35R91K35j23j71L64l17M3p4J04k62P9k62o49L77K60l18
$$ -310 -1111 -736 322 -268 -703 288 523 400 229 593 276 319 245 349 87 166 -96 -745 -368 -108 -426
3182d26m40M66K29n22L34O03j14R0J83K73k20l23L61o8J24k32l98k46n6k75n4
$$ -426 -866 -400 -171 -693 -359 244 130 220 403 676 456 133 494 426 550 318 -80 -326 -382 -657 -711
3203g11L28l4k44J07M04J19l34O2O60J17l10K49M8J6l42K56p8p1k18m32J66P7
$$ -711 -383 -417 -661 -554 -150 -31 -365 -303 357 474 164 413 461 477 135 391 313 242 24 -408 -242 -165
3225a65k31m15O13r4k10L4N47J52k7J35K20K45l48n0Q8K75n58o01M97j94m85k89
$$ -165 -396 -811 -198 -292 -502 -468 79 231 204 339 559 804 456 406 494 769 211 -390 107 -87 -572 -861
3247h61N68L7m77j12N23M92m35p0L64O46o33K37J29K15L0l72J58j90l12k39RK82
$$ -861 -293 -256 -733 -845 -322 170 -265 -335 29 675 42 279 408 623 653 281 439 249 -63 -302 -293 -11
3269a1l98k64K82L91n86k1N70K12k45M07L05j60n8K1m4J70j37l40q3q5l7l16k07
$$ -11 -409 -673 -391 0 -586 -607 -37 175 -70 337 642 482 424 445 401 571 434 94 11 -74 -111 -427 -634
3292f34K33k28K86j50M66k76J67L32q1L15k05K09J6P5J48m39O4k93J38l43j96
$$ -634 -401 -629 -343 -493 -27 -303 -136 196 115 430 225 434 450 525 673 234 298 5 143 -200 -396
3313c96K78l78k07K23Q4Q7L0L99O8m01N26N7J45j12j37J02R6m50k36M62k78l22
$$ -396 -118 -496 -703 -480 -396 -309 -279 120 188 -213 313 370 515 403 266 368 464 14 -222 240 -38 -360
3335c60m18O38j86j59j1K80L4k98M54M62lj75J98jL13n24k1L07l01k79l3N7l60
$$ -360 -778 -140 -326 -485 -496 -216 -182 -480 -26 436 433 258 456 455 768 244 223 530 229 -50 -83 -26 -386
3358c86j43J80j59L24k99K24L05n2K3J26OM37j54j90L34j84m1P3k41k33l14N1
$$ -386 -529 -349 -508 -184 -483 -259 46 -6 17 143 149 586 432 242 576 392 351 424 183 -50 -364 -313
3380c13k14K05k94J12L32J20l75Q7L13M92m45J77M79k97o7l32Q56o79k79j82L17
$$ -313 -527 -322 -616 -504 -172 -52 -427 -340 -27 465 20 197 676 379 312 -20 836 157 -122 -304 13
3401A3J6l62j40J49k04J71kJ00K60p1N1M03N7j21P5j48M43n08p2J50k7l57j42
$$ 13 29 -333 -473 -324 -528 -357 -359 -259 1 -70 -19 384 441 320 395 247 690 182 110 260 233 -124 -266
3424b66m63N46J12m63P0L00k01k25L95J70J99k49K88L33m06Q3K70k06k36l37K42
$$ -266 -729 -183 -71 -534 -464 -164 -365 -590 -195 -25 174 -75 213 546 140 223 493 287 51 -286 -44
3445d4M5m7o11M03J27n60K99J3N16k27n0K28L21M1n34O56N3m04j58Q2J85n71j43
$$ -44 1 -46 -657 -254 -127 -687 -388 -375 141 -86 -136 92 413 454 -80 576 629 225 67 149 334 -237 -380
3468c80q7L93K13n85L44k79M00l20J81L84k08k02L98N14l28k70L00J08k11k01
$$ -380 -467 -74 139 -446 -102 -381 19 -301 -120 264 56 -146 252 766 438 168 468 576 365 164
3488A64J04k4o82p5N0k54J52J35j23N45j92m7L69J04Q3j53J27J32n2l07M81p2
$$ 164 268 244 -438 -513 -463 -717 -565 -430 -553 -8 -200 -247 122 226 309 156 283 415 363 56 537 465
3510D65p24L71l44j42L2J5q6j49J36m2J85M03K12k67j51M25N02o20P5L99q02L33
$$ 465 -259 112 -232 -374 -342 -327 -413 -562 -426 -468 -283 120 332 65 -86 339 841 221 296 695 -107 226
3532B26j86k6o1n7q7J14m74M51o35K83M60L59l58j38N35l12j25P46l8l86m0M74
$$ 226 40 14 -47 -104 -191 -77 -551 -100 -735 -452 8 367 9 -129 406 94 -31 715 677 291 251 725
3554G25n51l08r5P0j66j65K55k77L20J51m16L27oK67j01R8M44k77k40O28o4o15
$$ 725 174 -134 -229 -159 -325 -490 -235 -512 -192 -41 -457 -130 -136 131 30 128 572 295 55 683 619 4
3576DmL13k17l77P3L43l93j40J16p4L28j9M7%L45P8n77J75M33k53j48L98j10m62
$$ 4 0 313 96 -281 -208 135 -258 -398 -282 -356 -28 -47 0 0 345 423 -154 21 454 201 53 451 341 -121
3600a21o2K27j74n33L55J76k64r5K04j76N12l6J16q6L24LL5L5K31l43l38J76k9
$$ -121 -183 44 -130 -663 -308 -132 -396 -491 -287 -463 49 13 129 43 367 370 405 440 671 328 -10 166 137
3623A37m08k17L70j03l03L20j9k10K97R5j04L12j82J11k03L94Q0k8j47J15k20
$$ 137 -271 -488 -118 -221 -524 -204 -223 -433 -136 -41 -145 167 -15 96 -107 287 367 339 192 307 87
3644H7l00L06r1k43j34L17k30K8m38M17L46o3K2j1J47K94l63K90R5K4l12Kj06
$$ 87 -213 93 2 -241 -375 -58 -288 -260 -698 -281 65 2 24 13 160 454 91 381 476 500 188 190 84
3667H4p7k27M3K37m95q2L81k17L0K9j49P89j49j41P3K98R3m25J72J00o9l75R4
$$ 84 7 -220 -177 60 -435 -517 -136 -353 -323 -294 -443 346 197 56 129 427 520 95 267 367 298 -77 17
3690A7K19n29M9K39j38r8j92K24l70O08k02K44K28j22R5m5K04K58q43J43J97j4
$$ 17 236 -293 -244 -5 -143 -241 -433 -209 -579 29 -173 71 299 177 272 227 431 689 -154 -11 186 172
3712A72k34k97J97q0pl63N38k71K9L01J81p5l01M47k75M96j77k07M96K2n11o2
$$ 172 -62 -359 -162 -242 -249 -612 -74 -345 -316 -15 166 91 -210 237 -38 458 281 74 570 592 81 19
3734A9O8k22J61l76K50l70j4M02k24L17l1l5j11M90p2J36j77N71o83K23k96J51
$$ 19 87 -135 26 -350 -100 -470 -484 -82 -306 11 -20 -55 -166 324 252 388 211 782 99 322 26 177
3756A77l49k17J71J78m33KJ09J02j33R1M5L98k44J21K06M1m9j03Q6K74j37l80
$$ 177 -172 -389 -218 -40 -473 -471 -362 -260 -393 -302 -257 141 -103 18 224 265 216 113 199 473 336 -44
3778d4l30nL23j99P8j4P7j13K25j05R3J3q0L49m5k33M7L17k58J50Pk59Q9l16K15
$$ -44 -374 -379 -56 -255 -177 -191 -114 -227 -2 -107 -14 -1 -81 268 223 -10 37 354 96 246 253 -6 83 -233 -18
3803a8n4m31P3j7K85r1pK14M80m99k50N67nJ66k63O1K11l54n8o2M2K44m59p8J72
$$ -18 -72 -503 -430 -447 -162 -253 -260 -46 434 -65 -315 252 247 413 150 211 422 68 10 -52 -10 234 -225 -303 -131
3828a31r7k4j44K55K0L17k95J46Q5j29J1L25p8J06j5j93o8j39j69K71k76K57l88
$$ -131 -228 -252 -396 -141 -121 196 -99 47 132 3 14 339 261 367 352 159 91 -48 -217 54 -222 35 -353
3851c53M10r5m41K6K75K06NJ86j82J30P6k99L89k50Q9r3q7K21m40J85k79J52p9
$$ -353 57 -38 -479 -453 -178 28 33 219 37 167 243 -56 333 83 172 79 -8 213 -227 -42 -321 -169 -248
3874b48Pm4K7j55J14O43k37J67k98K40J54l45L92l38L0o1l7K63k85J5j93k51J70
$$ -248 -241 -285 -258 -413 -299 344 107 274 -24 216 370 25 417 79 109 48 11 274 -11 4 -189 -440 -270
3897b70K4N1J81R8j89r1J70K26k54K36J86J06K7k89j62m6K49l50q2j4j30o2J66
$$ -270 -246 -195 -14 84 -105 -196 -26 200 -54 182 368 474 501 212 50 4 253 -97 -179 -193 -323 -385 -219
3920b19L26k56j19J55K54j03K3J91p0J13M8r0r7m27J79J31m18J69j65M12O7n29
$$ -219 107 -149 -268 -113 141 38 61 252 182 295 343 253 156 -271 -92 39 -379 -210 -375 37 104 -425
3942d25j2M7K46j86K24J66Q1k21L03J17n2j24J07k46%r2j8P5k11K03n12P98j32
$$ -425 -437 -390 -144 -330 -106 60 141 -80 223 340 288 164 271 25 25 -67 -85 -10 -221 -18 -530 268 136
3965A36n20Q1K74N79m35j28J02M26j67k38O9Qj85J66j98J54K4m43J46mr4j24K90
$$ 136 -384 -303 -29 550 115 -13 89 515 348 110 179 187 2 168 -30 124 148 -295 -149 -153 -247 -371 -81
3988h1M4J2l27L25K02J35O7j1j16l01J99Lm7q1m6n3K9K8p41K00K52J3k13L01J41
$$ -81 -37 -25 -352 -27 175 310 377 366 250 -51 148 151 104 23 -23 -76 -47 -19 -760 -560 -308 -295 -508 -207 -66
4013f6k8J19J76p2L45l42R0M5r5k34J98k04P4R5n25L33K6r8l97N26o5k55L31m9
$$ -66 -94 25 201 129 474 132 222 267 172 -62 136 -68 6 101 -424 -91 -65 -163 -560 -34 -99 -354 -23 -72
4037g2J96K15j46r3J91L16p06L74k26L4j57j19J21j56j82Q7K69k42l2M14K64j99
$$ -72 124 339 193 100 291 607 -99 275 49 83 -74 -193 -72 -228 -410 -323 -54 -296 -328 86 350 151
4059A51J26l3J9j0J07j74K4j34l11O8l7R1k1p7o7k03j2L06Q8J15qK39j64n0Q4
$$ 151 277 244 263 253 360 186 210 76 -235 -167 -204 -113 -134 -211 -278 -481 -493 -187 -99 16 8 247 83 33 117
4084A17L44k18O1n3R4j22k33j6n0j03N0r2J25J87m87J49L67l00N8J08M53j64q1
$$ 117 461 243 304 251 345 223 -10 -26 -76 -179 -129 -221 -96 91 -396 -247 120 -180 -122 -14 439 275 194
4107A94j28j6j70J59L0k70J56J19J98m12l1k7j32J59K39j24k8N5K17j31j07M8
$$ 194 66 50 -120 39 69 -201 -45 74 272 -140 -171 -198 -330 -171 68 -56 -84 -29 188 57 -50 -2
4129bK79k01M45m25o3K21j8k83j67K02j65LqK83J6j10J12q0j91K21R0q2l0K59
$$ -2 277 76 521 96 33 254 236 -47 -214 -12 -177 -174 -182 101 117 7 119 39 -152 69 159 77 47 306
4153C06r2L6j34j75J0L47r7l92r7Q8k30J20M48k02l38N05k5P4r4LL14l75J93k2
$$ 306 214 250 116 -59 -49 298 201 -191 -288 -200 -430 -310 138 -64 -402 103 78 152 58 61 375 0 193 171
4177A71O2j38j05O3K0l70N1j47K71Q7k50jL75j37K2l8J20L91k89K21j66jJ08k08
$$ 171 233 95 -10 53 73 -297 -246 -393 -122 -35 -285 -286 89 -48 -26 -64 56 447 158 379 213 212 320 112
4201A12j78k11L16J2k33J63j42j71M9L93j49k25L71o7j8K10L5k1j31J18j84L75
$$ 112 -66 -277 39 51 -182 -19 -161 -332 -283 110 -39 -264 107 40 22 232 267 246 115 233 49 424
4223D24j97k06j53Q8k13M1J65L3q8j18J41R9j9j05Q6J78jJ43j52j01j81J91J73
$$ 424 227 21 -132 -44 -257 -216 -51 -18 -106 -224 -83 16 -3 -108 -22 156 155 298 146 45 -136 55 228
4246B28k33j61L01l31J64j59N0j21r0J95p4n5K02R2o0K67J04l07n9J92N7p5j85
$$ 228 -5 -166 135 -196 -32 -191 -141 -262 -352 -157 -231 -286 -84 8 -52 215 319 12 -47 145 202 127 -58
4269e8J19j96L24l65k14K28L7P1j6j07K43j36k4K65j7j53k57N11o9n3j4j60J47
$$ -58 61 -135 189 -176 -390 -162 -125 -54 -70 -177 66 -70 -94 171 154 1 -256 255 186 133 119 -41 106
4292A06o5j65L74k35j20k40L96l48J96M0J83k78M76j84N4J8J6K37j84k90p9R6
$$ 106 41 -124 250 15 -105 -345 51 -297 -101 -61 122 -156 320 136 190 208 224 461 277 -13 -92 4
4314Dk56J12J5j64K61o2q5J17OQ1j58jL47M7k08j96N42j53j88L15o7l20o4K33
$$ 4 -252 -140 -125 -289 -28 -90 -175 -58 -52 29 -129 -130 217 264 56 -140 402 249 61 376 309 -11 -75 158
4338A58k60j0p3r7QK04r3j77P3K3L43k72N68m82L74K2j18k5J64j71k26l7R6K9
$$ 158 -102 -112 -185 -282 -274 -70 -163 -340 -267 -244 99 -173 395 -87 287 309 191 166 330 159 -67 -104 -8 21
4362B1j02L1k17O8j64N59l33J92p7j5J36J60j10J7n9O3J32j65j62Qj0Q5m03J82
$$ 21 -81 -50 -267 -199 -363 196 -137 55 -22 -37 99 259 149 166 107 170 302 137 -25 -17 -27 58 -345 -163
4386a63Q1k41K36P9Q9Jk18K81k71J28M2K45n0k28L05k07m6k40K0J44o0k41j00
$$ -163 -82 -323 -87 -8 81 82 -136 145 -126 2 44 289 239 11 316 109 63 -177 -157 -13 -73 -314 -414
4409d14J86nM84m59N9j36N22l94L07J9L80m22k9n4L33l22k00J85j86k28M63k83
$$ -414 -228 -233 251 -208 -149 -285 237 -157 150 169 549 127 98 44 377 55 -145 40 -146 -374 89 -194
4431a94n9L81o02N04J56p2r6K0l3p0K40J4m7k12p4K25j27k49m8L94k31j68J30
$$ -194 -253 128 -474 30 186 114 18 38 5 -65 175 189 142 -70 -144 81 -46 -295 -343 51 -180 -348 -218
4454b18Q6M01n93K78j27J64N6L9J91J74k44p0j53K67j46O7n8l1N4l95qM6M6j94
$$ -218 -132 269 -324 -46 -173 -9 47 86 277 451 207 137 -16 251 105 172 114 83 137 -258 -266 -220 -174 -368
4478c68L96l8O9o6m5Q7L36m87L09J65p0k59J29J19m56K37r3J21k27k78J78r1K45
$$ -368 28 -10 59 -7 -52 35 371 -116 193 358 288 29 158 277 -179 58 -35 86 -141 -419 -241 -332 -87
4501h7o0J35P3Q5k71L34j69K71q9j85M69j14m82K22K9m0q3n6Mj42J36j77L46j93
$$ -87 -147 -12 61 146 -125 209 40 311 222 37 506 392 -90 132 161 121 38 -18 -14 -156 -20 -197 149 -44
4525d4J38m9j07K36n5K3K24l7l17J85p1L1K6j94j13o0L7j08L11r8N2p2K6J37J50
$$ -44 94 45 -62 174 119 142 366 329 12 197 126 157 183 -11 -124 -184 -147 -255 56 -42 10 -62 -36 101 251
4550B51l62L04P7m68M27q8J74m80k5L11o4QK0J26k83k82R2Q0J8J94n5K3KK0K13
$$ 251 -111 193 270 -198 229 141 315 -165 -190 121 57 65 85 211 -72 -354 -262 -182 -164 30 -25 -2 0 20 233
4575B33j65K76k62K2L63m98n8kj49K68k19nK35m62L93r7L73q3n5K2j89K09OJ43
$$ 233 68 344 82 104 467 -31 -89 -91 -240 28 -191 -196 39 -423 -30 -127 246 163 108 130 -59 150 156 299
4599B99l21R5j0j06J45j45K90l36M2k10R2j24Q2M5oR1J55P6K40l39Q0R7K08l90
$$ 299 -22 73 63 -43 102 -43 247 -89 -47 -257 -165 -289 -207 -162 -168 -77 78 154 394 55 135 232 440 50
4623E0m2J53j69j82K29j3j46j52k2j96L21J28j90L58j89J99J64J5J48l90n0J49
$$ 50 8 161 -8 -190 39 26 -120 -272 -294 -490 -169 -41 -231 127 -62 137 301 316 464 74 24 173
4645A73j32k05L49m5n21P4J64K4m8o3J75K38J54p45M19J39R2p1j30L88k45m05
$$ 173 41 -164 185 140 -381 -307 -143 -119 -167 -230 -55 183 337 -408 11 150 242 171 41 429 184 -221
4667b21J32K45j81kk27K96J14m83J18K06j73J7M9J34J12M6k20m5K44O5lj56L8
$$ -221 -89 156 -25 -27 -254 42 156 -327 -209 -3 -176 -159 -110 24 136 182 -38 -83 161 226 223 67 105
4690A05J66l15J00L0n02L10P3m79N9K07K63p6j31L13n6J40l0j03J16j48J96j45
$$ 105 271 -44 56 86 -416 -106 -33 -512 -453 -246 17 -59 -190 123 67 207 177 74 190 42 238 93
4712I3K06o5j75j92Q0K27k80q1m1J0j21J87J18o9J61NJ46O3J68q4n4N7k32k98
$$ 93 299 234 59 -133 -53 174 -106 -187 -228 -218 -339 -152 -34 -103 58 63 209 272 440 356 302 359 127 -171
4736a71J04J59J18k89Q0k1k57JL8L42r9l6J16O8l25R8K67p6Q1k76K21M9J37l91
$$ -171 -67 92 210 -79 1 -20 -277 -276 -238 104 5 -31 85 153 -172 -74 193 117 198 -78 143 192 329 -62
4760f2m3Q9R2j61J18O4k25o7N7j08K89j08q4K34J2k6J67J00q7k95j46J86j64l4
$$ -62 -105 -16 76 -85 33 97 -128 -195 -138 -246 43 -65 -149 85 97 71 238 338 251 -44 -190 -4 -168 -202
4784b02J11P6j84r4O2m6JK10O0r3J96k31K82J66j81k7j0k36K73K8k72L4o9j64
$$ -202 -91 -15 -199 -293 -231 -277 -276 -66 -6 -99 97 -134 148 314 133 106 96 -140 133 161 -111 -77 -146 -310
4808c10J78n5k27L47j60L0K85k09J84L1p4n9L06R7j65J2M5K0l15J13P2j64j46
$$ -310 -132 -187 -414 -67 -227 -197 88 -121 63 94 20 -39 267 364 199 211 256 276 -39 74 146 -18 -164
4831a64k31J85K3J44k37L24j27Q7k1K45j58K69j48j33j7J00J4m90L98Q7l44J72
$$ -164 -395 -210 -187 -43 -280 44 -83 4 -17 228 70 339 191 58 41 141 155 -335 63 150 -194 -22
4853b2R8J80o05ML9R9O1j03K19K34L1k65J41j77M16m07r4J27J28l22K6j2lm0P5
$$ -22 76 256 -349 -345 -306 -207 -146 -249 -30 204 235 -30 111 -66 350 -57 -151 -24 104 -218 -192 -204 -207 -247 -172
4878a72N4J0k69M49p4j3j48L84j99mJ36nJ33k05j31j24m9j39M17k91K17j87r8
$$ -172 -118 -108 -377 72 -2 -15 -163 221 22 18 154 149 282 77 -54 -178 -227 -366 51 -240 -23 -210 -308
4901c08P8K35o5r4K58q5q6Q6M05j0l53j19J81R3k3k66r4L5K10j2k07P5j06p1k43
$$ -308 -230 5 -60 -154 104 19 -67 19 424 414 61 -58 123 216 193 -73 -167 -132 78 66 -141 -66 -172 -243 -486
4926d86M20l1m2K23J55l2l31K90J95k55J15p6m3q8J09n4J08n24K81j1j05J62k59
$$ -486 -66 -97 -139 84 239 207 -124 166 361 106 221 145 102 14 123 69 177 -347 -66 -77 -182 -20 -279
4949b79J54J52j24M7J51J33l52K06O6k87K33k1L9J52k19k49pm6K39N0l02K31%
$$ -279 -125 27 -97 -50 101 234 -118 88 154 -133 100 79 118 270 51 -198 -205 -251 -12 38 -264 -33 -33
4972c3k93M57k6j45P8J77M6J19l35j98M05j50r0q7pP5k87M51l14J49l71L33J30
$$ -33 -326 131 105 -40 38 215 261 380 45 -153 252 102 12 -75 -82 -7 -294 157 -157 -8 -379 -46 84
4995H4J03n1j67J19J05J25k49r6K15j35j75O5J99M0n99J83J22j61J78L1o5L36
$$ 84 187 136 -31 88 193 318 69 -27 188 53 -122 -57 142 182 -417 -234 -112 -273 -95 -64 -129 207
5017B07j79K76m59K37K48m27J23p2J97j13J04j1j40K16k43j36j0J41r7j58P7J07
$$ 207 28 304 -155 82 330 -97 26 -46 151 38 142 131 -9 207 -36 -172 -182 -41 -138 -296 -219 -112
5039a12K86j47n1K23j39J04k3k5J60m78J02K2L3J44k15k44r2K75l2L09Kk52J77
$$ -112 174 27 -24 199 60 164 141 116 276 -202 -100 -78 -45 99 -116 -360 -452 -177 -209 100 102 -150 27
5062B7K16k47K09o2j56K71Q2l53J44j20l1l78R6M64l02L52m97Q4J75k27K41L5
$$ 27 243 -4 205 143 -13 258 340 -13 131 11 -20 -398 -302 162 -140 212 -285 -201 -26 -253 -12 23
5084B3k14J40M25j44J06l37K20oj21J2k54K08M8k14r3J96J61j37l27L06j99j41
$$ 23 -191 -51 374 230 336 -1 219 213 92 104 -150 58 106 -108 -201 -5 156 19 -308 -2 -201 -342
5106c42N53L88l10j13j34L61k85J57k10Qo6k77K87j01p1j73K9J8K06j6J05k60
$$ -342 211 599 289 176 42 403 118 275 65 73 7 -270 17 -84 -155 -328 -299 -281 -75 -91 14 -246
5128b46J5k2K48L01l62K30M2j37q0L14j29k75K17k15nL0N0o3j24K86l0k9j34J44
$$ -246 -231 -253 -5 296 -66 164 206 69 -11 303 174 -101 116 -99 -104 -74 -24 -87 -211 75 45 16 -118 26
5152B6O7K38k63L12l26j90L33l04K78j47o3J46j17j97j3J77j02n7j20L32Q5l98
$$ 26 93 331 68 380 54 -136 197 -107 171 24 -39 107 -10 -207 -220 -43 -145 -202 -322 10 95 -303
5174c03K04J15Q3J4J51l41L16j12L10m91J95l4k17J05j81J45j31N1K89j25m70
$$ -303 -99 16 99 113 264 -77 239 127 437 -54 141 107 -110 -5 -186 -41 -172 -121 168 43 -427
5195d27L71K32m45N07q7J32l99j4L20R0k39l8n3J16j5k38l0J92Qk8l3L8j48L23
$$ -427 -56 176 -269 238 151 283 -116 -130 190 280 41 3 -50 66 51 -187 -217 -25 -17 -45 -78 -40 -188 135
5219A35N5j60J18k71K24P2L0j72J83j21j72j75k16K79k27J94P5K16k03j37L73
$$ 135 190 30 148 -123 101 173 203 31 214 93 -79 -254 -470 -191 -418 -224 -149 67 -136 -273 100
5240A00p4RL4R4p5j51J37M0O7l93J99k47LJ23n4J60k05K07k23m9M69m88J68K00
$$ 100 26 35 69 163 88 -63 74 114 181 -212 -13 -260 -257 -134 -188 -28 -233 -26 -249 -298 171 -317 -149 51
5264E1K12ml01J19J46k93M5L35j89k27j2K02k77K6O6J00q4J82l03L42j23j08J5
$$ 51 263 259 -42 77 223 -70 -25 310 121 -106 -118 84 -193 -167 -101 -1 -85 97 -206 136 13 -95 -80
5287h0K02J64o6m6kQ9j58k69L71l01j13J01Q6j60j74l1J56R4J49p1jJ72J1q3k0
$$ -80 122 286 220 174 172 261 103 -166 205 -96 -209 -108 -22 -182 -356 -387 -231 -137 12 -59 -60 112 123 40 20
5312B0J79k5j8j99J27r3q1j79J98j62R7l3j53j17K50j6L59j49J48j87N9J75k05
$$ 20 199 174 156 -43 84 -9 -90 -269 -71 -233 -136 -169 -322 -439 -189 -205 154 5 153 -34 25 200 -5
5335el6m4NJ89Q1k91j3l1j89L0Q4Q9k84L24K39k78k04N19j94J90q5J16J03k69
$$ -5 -41 -85 -80 109 190 -101 -114 -145 -334 -304 -220 -131 -415 -91 148 -130 -334 185 -9 181 96 212 315 46
5359D6j78K09K08m45JJ44Q5k79L09R5m40J69k2K57L0l08J92j02L53l15J73J0j3
$$ 46 -132 77 285 -160 -159 -15 70 -209 100 195 -245 -76 -98 159 189 -119 73 -29 324 9 182 192 179
5382A79o5lj01Oj8p0K1J9j17j11J87jJ84J04j49J7N5J2K8Q2k49K16k15L09k59
$$ 179 114 111 10 16 -2 -72 -51 -32 -149 -260 -73 -74 110 214 65 82 137 149 177 259 10 226 11 320 61
5407F1j54J26k98K06K6j41J11O1m15K15J47o5J03L40k98K11k60L35j76q9N9p5
$$ 61 -93 33 -265 -59 -33 -174 -63 -2 -417 -202 -55 -120 -17 323 25 236 -24 311 135 46 105 30
5429C0n5m9q2N1r6O1k10Q1J73J52N9j59K77l5k1J10j47R4j69L0K7p2j42J42r6
$$ 30 -25 -74 -156 -105 -201 -140 -350 -269 -96 56 115 -44 233 198 177 287 140 234 65 95 122 50 -92 50 -46
5454d6j07q3K76j48k55J60L3K68j01o4n0L29k55J16K59L8l7j95q5q5K52n32L00
$$ -46 -153 -236 40 -108 -363 -203 -170 98 -3 -67 -117 212 -43 73 332 370 333 138 53 -32 220 -312 -12
5477a2l9J37r4k91l6L75q2J43l75L49l2j16K97m6j46n9Q0j17p9K09p9m0k82K99
$$ -12 -51 86 -8 -299 -335 40 -42 101 -274 75 43 -73 224 178 32 -27 53 -64 -143 66 -13 -53 -335 -36
5501c6J50k81P2m2j19K52J47j65mjK07N1o2k00Q5r6K45j48k44j1p6Q2J47p3q9
$$ -36 114 -167 -95 -137 -256 -4 143 -22 -26 -27 180 231 169 -31 54 -42 203 55 -189 -200 -276 -194 -47 -120 -209
5526b09k6N8KL05Q5j70K47Mk03J48J7j50K21l22k6j26j62O9R0J98k09K2j9M9p4
$$ -209 -235 -177 -175 130 215 45 292 296 93 241 258 108 329 7 -19 -145 -307 -238 -148 50 -159 -137 -156 -107 -181
5551a81L87k51J50j59K05K32m45K40K02j46l08L14k95J06J63j6l19m1J90j91l9
$$ -181 206 -45 105 -54 151 383 -62 178 380 234 -74 240 -55 51 214 198 -121 -162 28 -163 -202
5572b02K37l6L0k01K59n5J73k92J95J05k00N7ok7K90n59K44rQ7O8l83o9M57n10
$$ -202 35 -1 29 -172 87 32 205 -87 108 213 13 70 64 37 327 -232 12 3 90 158 -225 -294 163 -347
5596c47Q5K60N9n5K50n6j85K9K68l54N0p2J36j5l13K25k00M9J1r9J9N08m86O2
$$ -347 -262 -2 57 2 252 196 11 40 308 -46 4 -68 68 53 -260 -35 -235 -186 -175 -274 -255 253 -233 -171
5620a71J25J31J75j43j67L71j77K69n45P2l3J49n8k05J99k42J71R7J9j62J85J67
$$ -171 -46 85 260 117 -50 321 144 413 -132 -60 -93 56 -2 -207 -8 -250 -79 18 37 -125 60 227
5642B27J76l78Q1P6q1O7M9l09J7J38n0l3m3j02K28l38K99N4r7J9j0j59J82l6q0
$$ 227 403 25 106 182 101 168 217 -92 -75 63 13 -20 -63 -165 63 -275 24 78 -19 0 -10 -169 13 -23 -103
5667a03M72o5l56K30N3P7k74pJ21l92K6L41m85J66Q8R3k85K10n2O9K55P7j17j57
$$ -103 369 304 -52 178 231 308 34 27 148 -244 -218 123 -362 -196 -108 -15 -300 -90 -142 -73 182 259 142 -15
5691a5J42J33L5m50M24j85l52L83j44k91M06k04K7k39J84K58k25R1J37JN9N4Q4
$$ -15 127 260 295 -155 269 84 -268 115 -29 -320 86 -118 -91 -330 -146 112 -113 -22 115 116 175 229 313
5714C13j74J33l3p6m8K58k08k40l0K87m18O2L09l15K46J12l11j12J85M84n7k63
$$ 313 139 272 239 163 115 373 165 -75 -105 182 -236 -174 135 -180 66 178 -133 -245 -60 424 367 104
5736A04J62k34m9K87K5k35j76%M2j61K72j54j13j30J95M6RM7J72J05k66L24k85
$$ 104 266 32 -17 270 295 60 -116 -116 -74 -235 37 -117 -230 -360 -165 -119 -110 -63 109 214 -52 272 -13
5759a3L83m28l3j64K47Q8l03K75q1Q8n97O19n1j98M0L1J76jp1M09k39q7MO2K79
$$ -13 370 -58 -91 -255 -8 80 -223 52 -29 59 -538 81 30 -168 -128 -97 79 78 7 416 177 90 94 156 435
5784D35o42L44j85M4R1j43k98J87QK32j97N3J5j9k46M37m0j38K84K48m63K38P7
$$ 435 -207 137 -48 -4 87 -56 -354 -167 -159 73 -124 -71 -56 -75 -321 116 76 -62 222 470 7 245 322
5807C22l55j62r2L62k65K44K43l92j41K64O9l24K73k59J33K59j19MO9j11m9P7
$$ 322 -33 -195 -287 75 -190 54 297 -95 -236 28 97 -227 46 -213 -80 179 60 64 133 22 -27 50
5829E0K23l87R2j48j06J36j77K26K12l43m0J81J41k25J55J8J1k6L3J48J04j73
$$ 50 273 -114 -22 -170 -276 -140 -317 -91 121 -222 -262 -81 60 -165 -10 8 19 -7 26 174 278 105
5851A05M9K8k74J69j46p9j49O0N9K24k21j84M10Q3p7J91J1J49k02j70m2K69j08
$$ 105 154 182 -92 77 -69 -148 -297 -237 -178 46 -175 -359 51 134 57 248 259 408 206 36 -6 263 155
5874A55j64N0K2k31K6j2M3j32j46K54J11p5P9K39k03J32r6J01m2m8J37k71J55
$$ 155 -9 41 63 -168 -142 -154 -111 -243 -389 -135 -24 -99 -20 219 16 148 52 153 111 63 200 -71 84
5897H4m52M5L89l41K87j11n9J25j8j33L42k17n9L59k20K42j28k7j58L29j15k16
$$ 84 -368 -323 66 -275 12 -99 -158 -33 -51 -184 158 -59 -118 241 21 263 135 108 -50 279 164 -52
5919e2L96m77N8j13J03O9m8k15m3L26j35J83j21K9l5R5L34m90N09m2m61K48k0
$$ -52 344 -133 -75 -188 -85 -16 -64 -279 -322 4 -131 52 -69 -40 -75 20 354 -136 373 331 -130 118 98
5942I8l07K86l0J23m79L06k74K57j69J72p9J92p8J74K8p9k0J74kjj40p3j30j36
$$ 98 -209 77 47 170 -309 -3 -277 -20 -189 -17 -96 96 18 192 220 141 121 295 293 292 152 79 -51 -187
5966a87L2Q7o8K53k73L1M25k41J16j51Q0l7J21p5l4J68o9j84K60q2o8pl1j63K58
$$ -187 -155 -68 -136 117 -156 -125 300 59 175 24 104 67 188 113 79 247 178 -6 254 172 104 97 66 -97 161
5991A61l20J27J9J7j46J59m3P2m4K31j21k02J86q7q0J91j00jj06P9l17J33J84
$$ 161 -159 -32 -13 4 -142 17 -26 46 2 233 112 -90 96 9 -71 120 20 19 -87 -8 -325 -192 -8
6014hP9m01M03q2jM7N5k55O0L14o0no9L2L06m58K58l30L03l48l8K54k63K15j45
$$ -8 71 -330 73 -9 -10 37 92 -163 -103 211 151 146 77 109 415 -43 215 -115 188 -160 -198 56 -207 8 -137
6039a37Q2m58O74L4j25j17k06L55K69q5J0k18r6m8J39J29j48l20L2P3O9p3k27
$$ -137 -55 -513 161 195 70 -47 -253 102 371 286 296 78 -18 -66 73 202 54 -266 -234 -161 -92 -165 -392
6062c92M31k19J38Q9n2o7K71N2k40L20l13P3O5k59J4O0l11K77j25j17L50r3m51
$$ -392 39 -180 -42 47 -5 -72 199 251 11 331 18 91 156 -103 -89 -29 -340 -63 -188 -305 45 -48 -499
6085d99N98lK5J07J93n26K11o8K97l71K87L0l81N8o7QJ4J96j33o0p0K26j72M7
$$ -499 99 96 121 228 421 -105 106 38 335 -36 251 281 -100 -42 -109 -101 -87 109 -24 -84 -154 72 -100 -53
6109e3J04k29J68K10J51l56L92j84j36M8l55K23J96l64J13L5L95m89O6J33m38
$$ -53 51 -178 -10 200 351 -5 387 203 67 115 -240 -17 179 -185 -72 -37 358 -131 -65 68 -370
6130c70M26O7M4k3Qnp4L77l09j65J60k10j1N3p2K9K3Q1k19M7q8l5P8O7P6M46j74
$$ -370 56 123 167 144 152 147 73 450 141 -24 136 -74 -85 -32 -104 -75 -52 29 -190 -143 -231 -266 -188 -121 -45 401 227
6157B27k4L0q1J60j20j53K3p3O0m8j53J86k77K06l3J51j03J93qM7k06J01K6j9
$$ 227 203 233 152 312 192 39 62 -11 49 1 -152 34 -243 -37 -70 81 -22 171 163 210 4 105 131 112
6181A12P1r1P9o1Q1j82k45O9J11n1l2M7N8p4j54K47j75J71j7J5K3J48N9k19L20
$$ 112 183 92 171 110 191 9 -236 -167 -56 -107 -139 -92 -34 -108 -262 -15 -190 -19 -36 -21 2 150 209 -10 310
6206C10J26k86J5L3k79l17J79L3rK87j30p6k71L48K3k66L07P6j92K09l8O8n4Q8
$$ 310 436 150 165 198 -81 -398 -219 -186 -195 92 -38 -114 -385 -37 -14 -280 27 103 -89 120 82 150 96 184
6230A84j13j1j95J00l00R4J45j08k12K87R8j37r8M80r2j52L4N4k50J98J20J9r1
$$ 184 71 60 -135 -35 -335 -241 -96 -204 -416 -129 -31 -168 -266 214 122 -30 4 58 -192 6 126 145 54
6253E4j21q3k5J53j99K25l17J67P7o0J07j04K00j31K7k9N06n09K95k49n2K78L06
$$ 54 -67 -150 -175 -22 -221 4 -313 -146 -69 -129 -22 -126 74 -57 -30 -59 447 -62 233 -16 -68 210 516
6276E16p38%K79j58k3J24o9M8r8N1Q1j43P7J06K12l03J85j52L30nl94j25L11n1
$$ 516 -222 -222 57 -101 -124 0 -69 -21 -119 -68 13 -130 -53 53 265 -38 147 -5 325 320 -74 -199 112 61
6300F1o3jj40M5J97r5p0l7j00J54N5qK80j12l1k6q4J46Jl13L40k32K78l63p2J21
$$ 61 -2 -3 -143 -98 99 4 -66 -103 -203 -49 6 -2 278 166 135 109 25 171 172 -141 199 -33 245 -118 -190 -69
6326f9j89q6Q8J63J66K6j5k14J84K04k12l3L71l03K24l94J52M3k82r5M15l60J38
$$ -69 -258 -344 -256 -93 73 99 84 -130 54 258 46 13 384 81 305 -89 63 106 -176 -271 144 -216 -78
6349g8J58k05k39J04M69j25l3J8K8j19m3J0J56j22M81k54l0k23L54m28J25l10
$$ -78 80 -125 -364 -260 209 84 51 69 97 -22 -65 -55 101 -21 460 206 176 -47 307 -121 4 -306
6371c06J79K6q3M8J88o33N39J72j16l3M5j39L25P1m26J16j72J07q8j27M20j94
$$ -306 -127 -101 -184 -136 52 -581 -42 130 14 -19 26 -113 212 283 -143 -27 -199 -92 -180 -307 113 -81
6393h1k10L67K05l02k34K78k60J84N5J64J0R4j52Q4j12J04k14K2j02N8l26J57
$$ -81 -291 76 281 -21 -255 23 -237 -53 2 166 176 270 118 202 90 194 -20 2 -100 -42 -368 -211
6415b11N4k70N59m9k64J36J74j24L43k02k39K04J09J39m09J23J48j93j68Pj02
$$ -211 -157 -427 132 83 -181 -45 129 5 348 146 -93 111 220 359 -50 73 221 28 -140 -133 -235
6436b35J99K7J96k44jo1J20j83L17qK27k45l56K42Q6j12K25j76j7j71J11j05m7
$$ -235 -36 -9 187 -57 -58 -119 1 -182 135 127 354 109 -247 -5 81 -31 194 18 1 -170 -59 -164 -211
6459b11K86k71J32J94k09Q6L9j06j7M47o4m28K68K07k19L4l6l98L87r4l08M5K21
$$ -211 75 -196 -64 130 -79 7 46 -60 -77 370 306 -122 146 353 134 168 132 -266 121 27 -281 -236 -15
6482a5k41p4K08j23K61j72K01j49K29K9k43J62j76L09j57J00Qj39M5J5n4j76J88
$$ -15 -256 -330 -122 -245 16 -156 45 -104 125 154 -89 73 -103 206 49 149 157 18 63 78 24 -152 36
6505C6l24J56j17K90l61J89K5j14L90k95K10m0J90j09k22J37j41k7O9M06o85J30
$$ 36 -288 -132 -249 41 -320 -131 -106 -220 170 -125 85 45 235 126 -96 41 -100 -127 -58 348 -337 -207
6527b07O9J50j20j1M1K81kL2l01J70Q7Q1O1l04j64J31J44l34P0jm5Q0K31m03J28
$$ -207 -138 12 -108 -119 -78 203 201 233 -68 102 189 270 331 27 -137 -6 138 -196 -126 -127 -172 -92 139 -264 -136
6552a36K47j5l80L76K18l70K56j53j32J19K6k1n6M1J31k95J13r5r5K31j43q3J2
$$ -136 111 96 -284 92 310 -60 196 43 -89 30 56 35 -21 20 151 -144 -31 -126 -221 10 -133 -216 -204
6575b04P6J01Q9l26K65j25M3K83m21O30l13p4Kl8r2J21j80K31l1k02R1k72L72
$$ -204 -128 -27 62 -264 1 -124 -81 202 -219 411 98 24 26 -12 -104 17 -163 68 37 -165 -74 -346 26
6598B6L2J46k70o1L5K15P5l27K09L2m6J70j61R2l57R8j23L2j71k7K34J81Q2k73
$$ 26 58 204 -66 -127 -92 123 198 -129 80 112 66 236 75 167 -190 -92 -215 -183 -354 -381 -147 34 116 -157
6622a57M3M3K17O3n5J54J0j01k16j03L2K6q6l4J03J65R6l77K03l12L16P5j14r4
$$ -157 -114 -71 146 209 154 308 318 217 1 -102 -70 -44 -130 -164 -61 104 200 -177 26 -286 30 105 -9 -103
6646a03K80j87R5K67j20J15k80J21k05j33K54j36j66q2K1L6J21j30K27j82M14
$$ -103 177 -10 85 352 232 347 67 188 -17 -150 104 -32 -198 -280 -259 -223 -102 -232 -5 -187 227
6667B27k27j90L25p7J51l06J13J08k52Mj28J60J38Oj54o6q9l6L40k12ml2K70Q5
$$ 227 0 -190 135 58 209 -97 16 124 -128 -124 -252 -92 46 52 -102 -168 -257 -293 47 -165 -169 -201 69 154
6691A54R3j39K27k60QN3j26J64k11r0J65P4m50K68Rm9k87J65K21J00m51M63n0
$$ 154 247 108 335 75 83 136 10 174 -37 -127 38 112 -338 -70 -61 -110 -397 -232 -11 89 -362 101 51
6714E1j73K81O1l4J26l54J36n5n37K51L79j49j2j3Q5K19m48J52J02n7j10J96j04
$$ 51 -122 159 220 186 312 -42 94 39 -498 -247 132 -17 -29 -42 43 262 -186 -34 68 11 -99 97 -7
6737gK55k72p5K19J08k12J02k42J07j7q7j06J61k28J13K94k79K39M6Nl74O3K65
$$ -7 248 -24 -99 120 228 16 118 -124 -17 -34 -121 -227 -66 -294 -181 113 -166 73 119 124 -250 -187 78
6760G8R5k62n1K51p8k28K03N7j14N3p2K0j11l4K10j63R4N4J69k65K66J76j96R7
$$ 78 173 -89 -140 111 33 -195 8 65 -49 4 -68 -48 -159 -193 17 -146 -52 2 171 -94 172 348 152 249
6784B49j46J23m41K79k09K40k07Q3k89j01J36J39J64j33J18p1P9R3l5R9l38M22
$$ 249 103 226 -215 64 -145 95 -112 -29 -318 -419 -283 -144 20 -113 5 -66 13 106 71 170 -168 254
6806B54l93K68j31M6j73L62k87J17j3l12j1N7K21l0o8L75l91J63J1J8J05j5K4
$$ 254 -139 129 -2 44 -129 233 -54 63 50 -262 -273 -216 5 -25 -93 282 -109 54 65 83 188 173 197
6829A97j31J79j05j66m6J05r9j71O42n95J03k95L30J49l00n5L68m7M2k5k1L75
$$ 197 66 245 140 -26 -72 33 -66 -237 405 -190 -87 -382 -52 97 -203 -258 110 63 105 80 59 434
6851D34l01K00m79J55lJ17l8j67j6J3K44k32Qq9q9M3K19j08L33k87K17j10R8k65
$$ 434 133 333 -146 9 6 123 85 -82 -98 -85 159 -73 -65 -154 -243 -200 19 -89 244 -43 174 64 162 -103
6875a03M28m60J50K9q9j31K69k88Ro5J53J83j25J20k06K51L5n1k45R8J11R9p2
$$ -103 325 -135 15 44 -45 -176 93 -195 -186 -251 -98 85 -40 80 -126 125 160 109 -136 -38 73 172 100
6898A00j31mJ49p9K10l04k7j05j31K61o4J07R3l88K86p0L14K16m51j2K31j5j13
$$ 100 -31 -35 114 35 245 -59 -86 -191 -322 -61 -125 -18 75 -313 -27 -97 217 433 -18 -30 201 186 73
6921G3J48k28K97l29K9L20k81m37L29N4j83L73j23O1p9l1n4n8K40Jj12K24q3L0
$$ 73 221 -7 290 -39 -10 310 29 -408 -79 -25 -208 165 42 103 24 -7 -61 -119 121 122 10 234 151 181
6945A81j05k00J87q2q1O5j58J96qR6k07K59j81K24j56K9Q0M5r5M5j69P8N1j68
$$ 181 76 -124 63 -19 -100 -35 -193 3 -5 91 -116 143 -38 186 30 59 139 184 89 134 -35 43 94 -74
6969g4J59j98R2j65J03j72J8K15m5Q0j38K26j03k19J39L48j66j0j18j23K81n84
$$ -74 85 -113 -21 -186 -83 -255 -237 -22 -67 13 -125 101 -2 -221 -82 266 100 90 -28 -151 130 -454
6991d54O17k74M5k79J99p7J3K17J40k40J55j26J39o2NK34k25K93k72J06J8j96
$$ -454 163 -111 -66 -345 -146 -223 -210 7 147 -93 62 -64 75 13 18 252 27 320 48 154 172 -24
7013b4j54N8J50n2j95K15j23J3J48k56K42r1j67O06k28l24L58l0l36J10k06O5
$$ -24 -178 -120 30 -22 -217 -2 -125 -112 36 -220 22 -69 -236 370 142 -182 176 146 -190 -80 -286 -221
7035b21K89j25p4O9J50l09K28K1l52L02l8M63n39K28j57j4%L4L97k46n6K8j61
$$ -221 68 -57 -131 -62 88 -221 7 28 -324 -22 -60 403 -136 92 -65 -79 -79 -45 352 106 50 78 -83
7058h3P3o2k17J64N7K70k39l1K03j41J73k7K1Q2m7k02J63q9j16n9q9p0Q4K86m52
$$ -83 -10 -72 -289 -125 -68 202 -37 -68 135 -6 167 140 161 243 196 -6 157 68 -48 -107 -196 -266 -182 104 -348
7083c48K49M8J8nJ56q4r4MK79n3r0j08L04J42m79J0O9j59J93p7o3l4N6j62M84
$$ -348 -99 -51 -33 -38 118 34 -60 -56 223 170 80 -28 276 418 -61 -51 18 -141 52 -25 -88 -122 -66 -228 256
7108B56l45N4J4J55q6JJ43k1K36K2k96k69L77m63kK96J3P9k00j34K3M13m06K06
$$ 256 -89 -35 -21 134 48 49 192 171 407 429 133 -136 241 -222 -224 72 85 164 -36 -170 -147 266 -140 66
7132F6j63K20m8n1k3J49n2n5O4o7J83K3j55l18K26O2j77p7O2K41k18K5K40k17
$$ 66 -97 123 75 24 1 150 98 43 107 40 223 246 91 -227 -1 61 -116 -193 -131 110 -108 -83 157 -60
7156f0n1N0R5K77j93J65nj05j99Q6J0J11n9j84j02K15P5j87j5j12J38L03k47N7
$$ -60 -111 -61 34 311 118 283 278 173 -26 60 70 181 122 -62 -164 51 126 -61 -76 -188 -50 253 6 63
7180F3R9k8K41k56l0J11o7k19J14J84k88J93j47M1L8j1j59K16m0M2l6n1O7J20
$$ 63 162 134 375 119 89 200 133 -86 28 212 -76 117 -30 11 49 38 -121 95 55 97 61 10 77 197
7204A97m1n5l04K92L2r2n0RJ5l8m4K10j93k62L33K2l07J03J56N8k01L48k53J90
$$ 197 156 101 -203 89 121 29 -21 -12 3 -35 -79 131 -62 -324 9 31 -276 -173 -17 41 -160 188 -65 125
7228A25O1K7p5n9M1j83M4j11qk3j8p3K38k4k8J43j20M5J16j07J8L02k13j93K10
$$ 125 186 213 138 79 120 -63 -19 -130 -138 -161 -179 -252 -14 -38 -66 77 -43 2 118 11 29 331 118 -75 135
7253A35j85jm3J35j14j4K5j58N40n85l0J51K44N9j53L35k83J40j24J54N3j07j61
$$ 135 -50 -51 -94 41 -73 -87 -62 -220 320 -265 -295 -144 100 159 6 341 58 198 74 228 281 174 13
7276A3m0K13M5j68j64%k02K41j00J09l24Q5N2K99o5j2Op3J05L30k21j59k5K11
$$ 13 -27 186 231 63 -101 -101 -303 -62 -162 -53 -377 -292 -240 59 -6 -18 -12 -85 20 350 129 -30 -55 156
7300A56r6l67L47k81L20J2j26J21p8n2Q2Q2J0l4l14N04q5j74N4j41J85O9j51l
$$ 156 60 -307 40 -241 79 91 -35 86 8 -44 38 120 130 96 -218 286 201 27 81 -60 125 194 43 40
7324D0k00K28l09j50P7L56Q9k86K22j24K59n62L27J83qK0q3l3k40J90J14K43j86
$$ 40 -160 68 -241 -391 -314 42 131 -155 67 -57 202 -360 -33 150 142 162 79 46 -194 -4 110 353 167
7347A67j14R9k35j1%K01o3N9Q5k94J0j33L26q0J25j88J80l7J6j63K9M8K67m37
$$ 167 53 152 -83 -94 -94 107 44 103 188 -106 -96 -229 97 17 142 -46 134 97 113 -50 -21 27 294 -143
7371a43R4K73k63l4L13n56L62j52J13k2j0m6L17k35k51L10Rm5j30j73J69k01R8
$$ -143 -49 224 -39 -73 240 -316 46 -106 7 -15 -25 -71 246 11 -240 70 79 34 -96 -269 -100 -301 -203
7394b03j2J13R1LP3m08L39k42J85p6Q1k12K83o6J2r7J70j73M2k08L93l98J08K51
$$ -203 -215 -102 -11 -8 65 -343 -4 -246 -61 -137 -56 -268 15 -51 -39 -136 34 -139 -97 -305 88 -310 -202 49
7418D9j92M24n11L0L53j46k18J98J79l00J37K0Q0N4j38L04k98k09J47j06J97l14
$$ 49 -143 281 -230 -200 153 7 -211 -13 166 -134 3 23 103 157 19 323 25 -184 -37 -143 54 -260
7440b60O0L13l56L86k70N2l44M11K77l18J04P2J5j0o9OM6k26L80N2o52K79J37
$$ -260 -200 113 -243 143 -127 -75 -419 -8 269 -49 55 127 142 132 63 69 115 -111 269 321 -331 -52 85
7463H5j43L3N4k9n6j15P1o4JJ58q2K22q5K37m50R4J45q4J0k71J60j33J71L22l64
$$ 85 -58 -25 29 0 -56 -171 -100 -164 -163 -5 -87 135 50 287 -163 -69 76 -8 2 -269 -109 -242 -71 251 -113
7488a13j50K2M53l27NJ07j63K35p0M96m20o0k29K13K05m06J23Mj01J78j51P5j86
$$ -113 -263 -241 212 -115 -110 -3 -166 69 -1 495 75 15 -214 -1 204 -202 -79 -75 -176 2 -149 -74 -260
7511b60J93j43J49k60J10J20L85k38j06J61krp4l8q1%N5k50K23j20O4j68lK36
$$ -260 -67 -210 -61 -321 -211 -91 294 56 -50 111 109 100 26 -12 -93 -93 -38 -288 -65 -185 -121 -289 -292 -56
7535e6j5K5K47l03m7K27m6m4K7K00k36n6q9P1K4j5l6J34k21J54J31r8j01j54K37
$$ -56 -71 -46 201 -102 -149 78 32 -12 15 215 -21 -77 -166 -95 -71 -86 -122 12 -209 -55 76 -22 -123 -277 -40
7560d0L21j64J23k9l37K58Rj18N9k6k15m12L24J07j66K40J95J3k50mr2P5L02O4
$$ -40 281 117 240 211 -126 132 141 23 82 56 -159 -571 -247 -140 -306 -66 129 142 -108 -112 -204 -129 173 237
7584B37j84L8P6R4k43k52o2J64J02J22j06p2J90m64L59j10O3J92j85L2L9O5km0
$$ 237 53 91 167 261 18 -234 -296 -132 -30 92 -14 -86 104 -360 -1 -111 -48 144 -41 -9 30 95 93 53
7608E3M4j33k21K33j4l2J81K4r3k99N9KL5K2M9L39k13j7J96j54N4O4l32j59M77
$$ 53 97 -36 -257 -24 -38 -70 111 135 42 -257 -198 -196 -161 -139 -90 249 36 19 215 61 115 179 -153 -312 165
7633A65Q5j85j42Q1j92K27m1J08k50M3K49J14l75L26m44L20q1M34n46k07N57j79
$$ 165 250 65 -77 4 -188 39 -2 106 -144 -101 148 262 -113 213 -231 89 8 442 -104 -311 246 67
7655F7J77l66Q2j48J98lj9n0j02o3L18l32J33J55k28J11O2Q0Q1qj27m31L94R4
$$ 67 244 -122 -40 -188 10 7 -12 -62 -164 -227 91 -241 -108 47 -181 -70 -8 72 153 145 18 -413 -19 75
7679G5m2J01J64n83J80o6P1M9O7k11o0K12qp3J71k8J69j41j7O4M2N6l40K8M0N6
$$ 75 33 134 298 -285 -105 -171 -100 -51 16 -195 -255 -43 -51 -124 47 19 188 47 30 94 136 192 -148 -120 -80 -24
7705b4j50J26n1J75k05L24j34q2L6J83j4q5l23J75L26p9n8j37rq1J61j21k15L54
$$ -24 -174 -48 -99 76 -129 195 61 -21 15 198 184 99 -224 -49 277 198 140 3 -6 -87 74 -47 -262 92
7729I2L5l99L11j12j01L8j41K78j39J11L68k23j33O6j35K70k32p3nQ0j89L5J36
$$ 92 127 -272 39 -73 -174 -136 -277 1 -138 -27 341 118 -15 51 -84 186 -46 -119 -124 -44 -233 -198 -62
7752f2J03k16L19l28J67r9O4L66r4j74n7K71p5r0o1m0Q9M9l1j76N8j40J53k90
$$ -62 41 -175 144 -184 -17 -116 -52 314 220 46 -11 260 185 95 34 -6 83 132 101 -75 -17 -157 -4 -294
7776b94J50J60j26L21j49j7LK19j23O2l50K84j55K42k81j41P6l4K83k34K31j56
$$ -294 -144 16 -110 211 62 45 48 267 144 206 -144 140 -15 227 -54 -195 -119 -153 130 -104 127 -29
7798b9k01O4J75K45l62N9o2K36o9j07L52l55J42p3J93j08j00k05J37j67J4J64
$$ -29 -230 -166 9 254 -108 -49 -111 125 56 -51 301 -54 88 15 208 100 0 -205 -68 -235 -221 -57
7820e7j70L04k77L11j68o8M2J7K71k35J01k11j3J72J46m68O11k52l1k3j62K97
$$ -57 -227 77 -200 111 -57 -125 -83 -66 205 -30 71 -140 -153 19 165 -303 308 56 25 2 -160 137
7842A37j87O9k02M21r7k48r5L23o4N0K69l77r9L7N2Jrk7O9n1j74J43j78K69k06
$$ 137 -50 19 -183 238 141 -107 -202 121 57 107 376 -1 -100 -63 -11 -10 -19 -46 23 -28 -202 -59 -237 32 -174
7867a74L24P4j71Rk82K30J16l81L99J05l14k79L69k49K66n7j46j01K95l05J78
$$ -174 150 224 53 62 -220 10 126 -255 144 249 -65 -344 25 -224 42 -15 -161 -262 33 -272 -94
7888i4r8M37k27o0Q8j4m4q9M7O6K87l7l00j41K04p6j32L57l62j15K68J84n78P5
$$ -94 -192 245 18 -42 46 32 -12 -101 -54 12 299 262 -38 -179 25 -51 -183 174 -188 -303 -35 149 -429 -354
7912c54M14k20J68L3K0j23M1KJ20k25K40L58j50m27J83m4l4m9J2m5R2l47J89J83
$$ -354 60 -160 8 41 61 -62 -21 -19 101 -124 116 474 324 -103 80 36 2 -47 -35 -80 12 -335 -146 37
7936C7l5Mk0m1k05K64J39k36J47PJ05k99K72K4n16J65K02J75o80M24J36n0l55
$$ 37 2 6 -14 -55 -260 4 143 -93 54 61 166 -133 139 163 -353 -188 14 189 -491 -67 69 19 -336
7959c36M14o8N2pK42j77J35l5j17j6k75J86J70l27Q6O8J99j28l1r7j60J88j80
$$ -336 78 10 62 55 297 120 255 220 103 87 -188 -2 168 -159 -73 -5 194 66 35 -62 -222 -34 -214
7982b14N05n67K95J56m48N43l84J83q5J84j07p3J19k99J12J4l6J87q4j01J26R1
$$ -214 291 -276 19 175 -273 270 -114 69 -16 168 61 -12 107 -192 -80 -66 -102 85 1 -100 26 117
8004A17k9K4J83k56k3kJ70k29KL58m55j7K16l42M41m0k30kJ46n9k16M56k14K12
$$ 117 88 112 295 39 16 14 184 -45 -43 315 -140 -157 59 -283 158 118 -112 -114 32 -27 -243 213 -1 211
8028B11j36k41L96o6o4K83m41P5r9k0P0p0R9q3O9J79q7j32K87q5j67J08K24k91
$$ 211 75 -166 230 164 100 383 -58 17 -82 -102 -32 -102 -3 -86 -17 162 75 -57 230 145 -22 86 310 19
8052A9q2K4j33P0l4R5K0M2l06L33k1q4j5K07k98J57m8p3M29n84L04l5J78o4n5
$$ 19 -63 -39 -172 -102 -136 -41 -21 21 -285 48 27 -57 -72 135 -163 -6 -54 -127 302 -282 22 -13 165 101 46
8077D6mJ14k15qM7K95n65P2L09j99l6J10pN3L75k51k99L29L2m04J49J23k19l5
$$ 46 42 156 -59 -67 -20 275 -290 -218 91 -108 -144 -34 -41 12 387 136 -163 166 198 -206 -57 66 -153 -188
8101a88J52K52m4J14j96j81m8P5J22rk4J08k14J93K7k28Qj12J68K26j41j37p1
$$ -188 -36 216 172 286 90 -91 -139 -64 58 49 25 133 -81 112 139 -89 -81 -193 -25 201 60 -77 -148
8124a48K66j98J93r5K03k13J19k38l4J16j66l3L65k27J74O2j49J47j31J37k66
$$ -148 118 -80 113 18 221 8 127 -111 -145 -29 -195 -228 137 -90 84 146 -3 144 13 150 -116
8145a16o9J13J1K36P7o38K51J93q3L6j00m3J71J21k39K69J2M5j30l4k57J66J78
$$ -116 -185 -72 -61 175 252 -386 -135 58 -25 11 -89 -132 39 160 -79 190 202 247 117 83 -174 -8 170
8168A70j55J59k44ol6K8Q9j35K15k10Q1R7k14k1J26J08q7J36j54J16J77k58l0
$$ 170 15 174 -70 -76 -112 -84 5 -130 85 -125 -44 53 -161 -182 -56 52 -35 101 -53 63 240 -18 -48
8191d8
$$ Imaginary data points
##PAGE= N=2
##DATA TABLE= (X++(I..I)), XYDATA
0@%%%%%%%qQqJ6j6K4l2M0n6P2q8J04j28J53j78K17k61L05l56M16m81N54o39P33
$$ 0 0 0 0 0 0 0 0 -8 0 -8 8 -8 16 -16 24 -32 40 -48 56 -72 81 -97 120 -141 164 -192 224 -257 297 -342 391
31C91q36R50j079J221j375J547j737J943k168K416k688K985l308L662m050M470
$$ 391 -445 505 -574 647 -728 819 -918 1025 -1143 1273 -1415 1570 -1738 1924 -2126 2344
47B344m928N433n985O593p266Q008q832R752j0784J1952j3290J4836j6643J8791
$$ 2344 -2584 2849 -3136 3457 -3809 4199 -4633 5119 -5665 6287 -7003 7833 -8810 9981
61I981k1398K4640k8799L4353m2190N4170p4978J21223m05636J55744P51119m04718
$$ 9981 -11417 13223 -15576 18777 -23413 30757 -44221 77002 -328634 -172890 578229 173511
73A73511m50301N766L69175k5024l6617M2743r5895j81624J45756K77918n247
$$ 173511 -276790 -271024 98151 73127 36510 79253 -16642 -198266 -52510 225408 220161
84B20161l23606j31394K04729J91534j14331j24254K2823M5709n7476N7634J10654
$$ 220161 -103445 -234839 -30110 161424 47093 -77161 -54338 -8629 -66105 -8471 102183
95A02183r9089j50263J05496J60654r7797r9155J60592L1817j98133q118K47129
$$ 102183 3094 -147169 -41673 118981 21184 -77971 82621 114438 -83695 -91813 155316
106A55316j7161k83571R234K73280J7630k49504l6777J85675J6135j51156j7499
$$ 155316 138155 -145416 -136182 137098 154728 -94776 -131553 54122 70257 -80899 -98398
117i8398J58482K5439j25855M28J08170l3789j22001Q9869J61480j02754j93497
$$ -98398 60084 85523 -40332 -39904 68266 34477 -87524 2345 163825 61071 -132426
128a32426Q9163K10075p8315j96132K2459J21428j403m3926K3177l6798o6314
$$ -132426 -43263 166812 88497 -107635 -85176 36252 34849 -9077 14100 -22698 -89012
139h9012P2699J13007o4154j33427N7407J29021k7296r9754L6733R9442o4458
$$ -89012 -16313 96694 32540 -100887 -43480 85541 58245 -41509 -4776 94666 30208
150C0208j17219N5934J30609m5062j38755K9505J06930l6368q9914N5277O0494
$$ 30208 -87011 -31077 99532 54470 -84285 -54780 52150 15782 -74132 -18855 41639
161D1639r9635m0120J45656P8369j49693j09871J25231J19835o8584r0072M1074
$$ 41639 -57996 -98116 47540 125909 -23784 -133655 -8424 111411 42827 -47245 -6171
172f171L8839l9238J937M6737k9107r1082K0736J01076j2663r0500N800P4595
$$ -6171 32668 -6570 -4633 42104 12997 -78085 -57349 43727 31064 -59436 -53636 20959
184B0959j9657n7172M9076P1126n6505q8596O5366J10946l2100j01906o697O7780
$$ 20959 1302 -55870 -6794 64332 7827 -80769 -15403 95543 63443 -38463 -45160 22620
196B2620P967l0368O296l411m8388l42Q0968J0851j01213m2422R9746P3416o8840
$$ 22620 30587 219 6515 3104 -45284 -45626 35342 46193 -55020 -97442 2304 75720 6880
209F880n9434M5454M2200k1405q140K3743j4638k6721K3667L2610l1039m6132
$$ 6880 -52554 -7100 35100 13695 5555 29298 14660 -12061 11606 44216 13177 -32955
221c2955J9523L2722j4179l3880N338K8510n847k1107J2201K5210j2435j7184
$$ -32955 -13432 19290 5111 -28769 -23431 5079 -768 -21875 -9674 15536 3101 -14083
233a4083K4200K2225j7545j6967K5203P761l2404J353K8841j8096m2541J8948
$$ -14083 10117 32342 14797 -2170 23033 30794 -1610 -257 28584 10488 -32053 -13105
245a3105M2357k3266n1024J0037M7264L22k8679j315J4890Q305N334J0407n360
$$ -13105 29252 5986 -45038 -35001 12263 12585 -16094 -17409 -2519 5786 11120 21527 16167
258A6167k4598K572L9359J0611m9002k7856L6283K9311l4129l5877K3664J7638
$$ 16167 -8431 -5859 33500 44111 -4891 -32747 3536 32847 -1282 -37159 -13495 4143
270D143k4540m612K8154j554k9370J0021L8452j628l1227O536L2879o038k5645
$$ 4143 -20397 -25009 3145 1591 -27779 -17758 20694 19066 -12161 -5625 27254 21216 -4429
283d429O374K1743j1713l1818P134K9270j1091l7885L008L0715j367k2781L845
$$ -4429 1945 23688 11975 -19843 -12709 16561 5470 -32415 -29407 1308 -59 -22840 -18995
296a8995K0811o972q970K5100J2458k6073j1167L2130J9677k8164k7183J7222
$$ -18995 1816 -5156 -14126 10974 23432 -2641 -13808 18322 37999 9835 -17348 -126
308a26K2939j5379k2531J987Q851m563q267P708N180j2104n49K0429P406j4169
$$ -126 22813 7434 -15097 -13110 -4259 -8822 -17089 -9381 -4201 -16305 -16854 3575 10981 -3188
322c188j503J7517P582j2642l033J3010j969j4507j581O631j285j0611o792J701
$$ -3188 -4691 12826 20408 7766 4733 17743 15774 1267 -314 6317 5032 -5579 -12371 -10670
336a0670L613p72k162j037J737P115M887K144r43L92O880O071k643m549r88j427
$$ -10670 -7057 -7829 -9991 -11028 -9291 -2176 2711 4855 3912 4304 11184 17255 14612 10063 9075 7648
352G648O37j098p948q604M04Q186k744j4846M45J4630K957p718J555R228L120
$$ 7648 8285 7187 -761 -9365 -8961 -775 -3519 -18365 -17920 -3290 -333 -8051 -6496 2732 5852
367E852j147N177O030o693o205P489O108q240j3350K34P939n988j3341L980R180
$$ 5852 4705 9882 15912 9219 3014 10503 16611 8371 -4979 -4745 3194 -2794 -16135 -12155 -2975
382b975q453j0131J1096J7006n066j4114P696J6627j05m132L483K32p373j453
$$ -2975 -11428 -21559 -10463 6543 1477 -12637 -4941 11686 11581 7449 10932 11164 3791 2338
396B338R643K680j7850j5633P676J4141j652j5101p686O416N862N768Q879m960
$$ 2338 11981 14661 -3189 -18822 -11146 2995 1343 -13758 -21444 -15028 -9166 -3398 5481 521
410E21j4877O137K6886R708j8677j6818P047J2540L160k228j1425j4989l074J1868
$$ 521 -14356 -8219 18667 28375 9698 -7120 -73 12467 15627 13399 1974 -13015 -16089 -4221
424d221J2010p319k5755p892K8523K4148j4304k5769O708K4129L992n192N589
$$ -4221 7789 470 -25285 -33177 -4654 19494 5190 -20579 -13871 10258 14250 9058 14647
437A4647l112j2764L475J7061k19k0281j4534O570J5110j541j9251q276J9455
$$ 14647 11535 -1229 2246 19307 19088 -1193 -15727 -9157 5953 4412 -14839 -23115 -3660
450c660J0564k2718p723K9156J2428k0532n193K0052P715r524k462j56q450P24
$$ -3660 6904 -15814 -23537 5619 18047 -2485 -7678 12374 20089 10565 8103 7947 -503 221
464B21J1441J787q021j5022j9343P249L4834M541l8773j7702L1196K8442o310
$$ 221 11662 13449 5428 -9594 -28937 -21688 13146 17687 -21086 -38788 -7592 20850 14540
477A4540j6355j1643m22K7603K7197j7792l2764j236J3726R692R512r353l9711
$$ 14540 -1815 -13458 -13880 13723 40920 23128 -9636 -10872 2854 12546 22058 12705 -27006
490b7006j7148M1166L5789k4875m0054l284K4611K7368M77k7415j0023K9427J7601
$$ -27006 -44154 -2988 32801 7926 -32128 -35412 -10801 16567 17044 -10371 -20394 9033 26634
503B6634j5124n955Q942j6702j8975K9624L0311k8874l7866P555J9697j945j0367
$$ 26634 11510 5555 14497 -2205 -21180 8444 38755 9881 -27985 -20430 -733 -2678 -13045
516a3045j846Q578Q740o240j1995J3574K4384j5292k8398K2357L5858j5502k8005
$$ -13045 -14891 -6313 2427 -3813 -15808 -2234 22150 6858 -21540 817 36675 21173 -6832
529f832O174R170r832N67J0456r193k0168j895J0979J5028J0961k0306l2644J3303
$$ -6832 -658 8512 -1320 -753 9703 510 -19658 -21553 -10574 4454 15415 -4891 -37535 -24232
543b4232M3419P061k4373q757R706Q175R105N98k2878j7429J7453K1743r23j1818
$$ -24232 19187 26248 1875 -6882 2824 10999 20104 20702 -2176 -19605 -2152 19591 18668 6850
557F850k1947k3242J3969M0892M265l8446j4919L0473K1697j0748j4123j842J0371
$$ 6850 -15097 -38339 -24370 16522 20787 -17659 -32578 -2105 19592 8844 -5279 -7121 3250
570C250J4695o25j1425N58L996j1779p628J5015P567k3795j6092J8934J4250j3383
$$ 3250 17945 17320 5895 6453 10449 -1330 -8958 6057 13624 -10171 -26263 -7329 6921 -6462
584f462q075J1985O185j3316q699J9874K6299n263k7361n930K3831J2337k1347
$$ -6462 -14537 -2552 3633 -9683 -18382 1492 27791 22528 -4833 -10763 13068 25405 4058
597D058j7239J1928J2747p796p653J716p147j7047L906K9929J1874k4366j8618
$$ 4058 -13181 -1253 11494 3698 -3955 -2239 -9386 -26433 -22527 7402 19276 -5090 -23708
610b3708J3294K1040M701p259p463l304P034J5385J071j8707j3416M637R828L817
$$ -23708 -10414 10626 15327 8068 605 -2699 4335 19720 20791 2084 -11332 -6695 3133 6950
624F950p715j5106n708J1659J5909J500j4787j2164M546K1272J4610j2453j4970
$$ 6950 -765 -15871 -21579 -9920 5989 7489 -7298 -19462 -14916 6356 20966 8513 -6457
637f457J2324J4029j2083j1847P906M064j0308J08J0629o995j8547k10J0441L675
$$ -6457 5867 19896 7813 -4034 3872 7936 -2372 -2264 8365 1370 -17177 -17387 -6946 -3271
651c271j304j771J009P469J296p693K503J4890K084j3469m30J2793l494j2721
$$ -3271 -4575 -6346 -5337 2132 3428 -4265 -1762 13128 15212 1743 1313 14106 10612 -2109
665b109L099L776p933m975J865m99O2K603l810k495R778O041j1767k228J7244
$$ -2109 990 4766 -3167 -8142 -6277 -6776 -6714 -4111 -7921 -10416 -638 5403 -6364 -8592 8652
680H652M969p989L723K938j1426l699J2228J999j3669m595O368j463m847j786
$$ 8652 13621 5632 9355 12293 867 -2832 9396 11395 -2274 -6869 -501 -1964 -6811 -8597
694h597l944J658R259J491l840L751K056m022M854J2230l931j3432O620J2760
$$ -8597 -12541 -10883 -1624 -133 -3973 -222 1834 -2188 2666 14896 10965 -2467 4153 16913
708A6913j0896j2201Q802M018j3256m883Q970N51q833p12P955J930k546j04L005
$$ 16913 6017 -6184 2618 6636 -6620 -11503 -2533 -1982 -10815 -11527 -3572 -1642 -4188 -4292 -1287
723a287N402K403l013L292O344n995q276O257N687j0341q899Q775M534j3605n760
$$ -1287 4115 6518 3505 6797 13141 7146 -1130 5127 10814 473 -8426 349 4883 -8722 -14482
738a4482R982K612q024N73Q217L135m042L43P027K791k719q85K649K565m246n522
$$ -14482 -4500 -1888 -9912 -9339 -1122 2013 -2029 -1686 5341 8132 5413 4528 7177 9742 5496 -26
754b6L405J654q260n179M606K013o383l634O271M377m012q22N748L185K47J117
$$ -26 3379 5033 -3227 -8406 -3800 -1787 -8170 -11804 -5533 -1156 -5168 -5990 -242 2943 3190 4307
770D307K243J640k298r74J809m99m217l715L69J589l504o075P82M197p72k229
$$ 4307 6550 8190 5892 4918 6727 6228 2011 -1704 -1335 254 -3250 -9325 -8543 -4346 -5118 -7347
786g347P31N226K939k350J671M966J193j593L25J735O9l642k704J423j058n362
$$ -7347 -6616 -1390 1549 -801 870 5836 7029 5436 5761 7496 7565 3923 1219 2642 1584 -3778
802c778k340J735N36l819k114N261L816m978K68P599L990m046j061O475K950n456
$$ -3778 -6118 -4383 -3847 -7666 -9780 -4519 -703 -5681 -5413 2186 6176 2130 1069 7544 10494 5038
818E038k204M073j318o057j733L087j082q022k223O953J997o924j724P616M914
$$ 5038 2834 6907 5589 -468 -2201 886 -196 -8218 -10441 -3488 -1491 -8415 -10139 -2523 2391
833B391l711j340Q152K453o239J382P521j084q580j664O374o38q988k653M268
$$ 2391 -1320 -2660 5492 7945 1706 3088 10609 9525 945 -719 5655 5017 -3971 -6624 -2356
848b356j222n098L16N181O85n605J608R705K119n805O11P219K038m994j197M916
$$ -2356 -3578 -8676 -8360 -3179 -2494 -8099 -6491 3214 5333 -472 139 7358 9396 4402 3205 8121
864H121j654p477N1L678k885o520q06L427k19l914K221M304n61j762K521N943
$$ 8121 6467 -1010 -959 2719 -166 -6686 -7492 -4065 -4284 -8198 -5977 -1673 -2234 -3996 -1475 4468
880D468L042l992k468M966K883k012l785j448k85k475j657K161j492o487j578
$$ 4468 7510 3518 1050 6016 8899 6887 3102 1654 1369 -1106 -2763 -602 -2094 -8581 -10159
895a0159M838M416j391m762R24P613M890j386k808J104L156j456k18L656k315
$$ -10159 -5321 -905 -2296 -7058 -6134 1479 6369 4983 2175 3279 6435 4979 4761 8417 6102
910F102r062j555O619M20q590m598M684K631j382J032P27j073J313M045L979P66
$$ 6102 -2960 -4515 2104 2524 -6066 -10664 -5980 -3349 -4731 -3699 -2972 -4045 -2732 1313 5292 6058
926F058k451j290M200J922l231k799J096k410o791K137P222o235j0600O023P979
$$ 6058 3607 2317 6517 8439 5208 2409 3505 1095 -5696 -3559 3663 -2572 -13172 -7149 830
941H30n725n525R409O546q103k261J3460N486j1200p251O166J0177j343j1068
$$ 830 -4895 -10420 -1011 5535 -2568 -4829 8631 14117 2917 -4334 1832 12009 10666 -402
955d02l570O321j606q892J549Q928n514j3533Q466J7458n922j5299M992J3351
$$ -402 -3972 2349 743 -8149 -6600 2328 -3186 -16719 -8253 9205 3283 -12016 -7024 6327
969F327K109m046k12j29j010K627J967l695l242j944n126K302O558l465q149o6
$$ 6327 8436 4390 4178 4049 3039 5666 7633 3938 696 -1248 -6374 -4072 2486 -979 -9128 -9194
985i194N768K043j756j372J077N833O735k850o425L890M868p420k496R985J430
$$ -9194 -3426 -1383 -3139 -4511 -3434 2399 9134 6284 -141 3749 8617 1197 -1299 8686 10116
1000A0116j1024o377N354N51n448k50L497j05q0j10R8M091L021l788j069P615
$$ 10116 -908 -7285 -1931 -1380 -6828 -7078 -3581 -3686 -3766 -3876 -3778 313 3334 -454 -1523 6092
1016F092N596m702p673J770N042P46n568o630n74N008j518m829N154M498j0782
$$ 6092 11688 6986 -687 1083 6125 6871 1303 -5327 -5901 -893 -2411 -7240 -2086 2412 -8370
1031h370p210J3568J2757r200j1330J2013J4145p743j2447K690Q536j814o344
$$ -8370 -15580 -2012 10745 1545 -9785 2228 16373 8630 -3817 -1127 7409 5595 -749
1044g49L892N913j0335j3519N880J3540m025j3726L756J2903j534p879L382O770
$$ -749 3143 9056 -1279 -14798 -8918 4622 597 -13129 -9373 3530 1996 -5883 -2501 4269
1058D269k325j517N326K786m219l566L675K494n028m846O20J001m150r32O778
$$ 4269 1944 427 5753 8539 4320 754 4429 6923 1895 -2951 -2331 -1330 -5480 -6412 366
1073C66Q32r767n40R241j123o121Q115J0541n025q731N274O527o946n443N442
$$ 366 1198 -8569 -9109 132 -991 -7112 1003 11544 6519 -2212 3062 9589 2643 -2800 2642
1088B642M468l090n258l083P29M0l806K26P187J046p884m77J0144K078o977K889
$$ 2642 7110 4020 -1238 -4321 -3592 -3552 -7358 -7132 55 1101 -6783 -7260 2884 4962 -2015 874
1104H74O467m257j883O571j160o688K064L195o996m694N157j109n899N608O467
$$ 874 7341 3084 1201 7772 6612 -76 1988 5183 -1813 -6507 -1350 -2459 -8358 -2750 3717
1119C717p799n992O245M677j832J736M716J227j514j825k170P29L336l414k843
$$ 3717 -4082 -10074 -3829 848 -984 752 5468 6695 5181 3356 1186 1915 5251 1837 -1006
1134a006N894q54j2178q38R825l390r123P841R690q778o745J1597N862q883j44
$$ -1006 4888 4034 -8144 -8982 843 -2547 -11670 -3829 5861 -2917 -9662 1935 7797 -1086 -1230
1149a230Q867q29o265J237M596j035m859k517Q74J316m118m715M948O939o866
$$ -1230 7637 6808 543 1780 6376 5341 482 -2035 -1161 155 -3963 -8678 -3730 3209 -3657
1164c657o741R306N153j0093j40J4598J883j1745J577J0473n351r900N475P408
$$ -3657 -10398 -1092 4061 -6032 -6172 8426 10309 -1436 141 10614 5263 -4637 838 8246
1178H246o320o007K610J599m024l676J735M196O06l455q1O368J994n877J192Q952
$$ 8246 1926 -4081 -1471 128 -3896 -7572 -5837 -1641 -1035 -4490 -4571 1797 3791 -2086 -894 8058
1194H058j645p538L779O456n749n854M557J782p629k917N054j08l873J761K189
$$ 8058 6413 -1125 2654 9110 3361 -2493 2064 3846 -3783 -6700 -1646 -1754 -5627 -3866 -1677
1209a677j690k66K373R67J048J992J775l47l99L85j569o35N05j149j001p9k562
$$ -1677 -3367 -3633 -1260 -293 755 2747 4522 4175 3776 4161 2592 1957 2462 1313 312 233 -2329
1226b329k278J479nk295M83L784nk382L156M507k750j840M766K490l839k327L654
$$ -2329 -4607 -3128 -3133 -5428 -4945 -1161 -1166 -3548 -392 4115 1365 -475 4291 6781 2942 615 4269
1243D269Q94m988k395L260q12n281p07L968R71m444j63N148J420m291P45O834
$$ 4269 5163 175 -2220 1040 228 -5053 -5760 -1792 -821 -5265 -5428 -280 1140 -3151 -2406 4428
1259D428P53m141J09N960p32o540J45N307k300o987N36M401k011o273J660N657
$$ 4428 5181 1040 1149 7109 6377 -163 -18 5289 2989 -3998 -3462 939 -1072 -7345 -5685 -28
1275b8j845m438L359N800j285l815L169O171k373m757K931L957l186n179J700
$$ -28 -1873 -6311 -2952 2848 1563 -2252 917 7088 4715 -42 2889 6846 3660 -1519 181
1290A81K941l434n375K126L357l324l153L383L347j609k003L147M181j551j506
$$ 181 3122 -312 -5687 -3561 -204 -3528 -6681 -3298 49 -1560 -3563 -416 3765 2214 708
1305G08K709K152k216j466R96J004k534k696Q37o50k123q45N68O48m68n79J793
$$ 708 3417 5569 3353 1887 2883 3887 1353 -1343 -506 -1156 -3279 -4124 -3556 -2908 -3376 -3955 -2162
1322b162J719L46P76R16R89O43J63P3K3p76r45n63r91n75j420j554K23Q08j085
$$ -2162 -443 -97 679 1595 2584 3227 3390 3463 3486 2710 1765 1202 211 -364 -1784 -3338 -3115 -2307 -3392
1341c392p32N42K237M85p08J733K930m80j459K051K237j366l315O94K078k221
$$ -3392 -4124 -3582 -1345 -860 -1568 165 3095 2615 1156 3207 5444 4078 763 1457 3535 1314
1357A314m127J161J479k373k694J435K783j098k807K397M621n39k583K191L982
$$ 1314 -2813 -1652 -173 -2546 -5240 -3805 -1022 -2120 -4927 -2530 2091 1552 -1031 1160 5142
1372E142j227k984K182K715l606l368J692J906l466l592K058J427k531j583K541
$$ 5142 3915 931 3113 5828 2222 -1146 546 2452 -1014 -4606 -2548 -1121 -3652 -5235 -2694
1387b694J986j557n41L313L629k314k373L262L513l003l030K360K403m605l323
$$ -2694 -708 -2265 -2806 507 4136 1822 -551 2711 6224 3221 191 2551 4954 349 -2974
1402b974L341Q74n333j768M002R33k322j427K551K722k24r56J440K704K34k473
$$ -2974 367 1241 -4092 -5860 -1858 -925 -3247 -4674 -2123 599 375 -581 859 3563 3797 1324
1418A324P83L091j271m073M37J448j958k543M01P72j382m92Q45p8M24J469J39
$$ 1324 2107 5198 3927 -146 291 1739 -219 -2762 -2361 -1589 -2971 -3463 -2618 -2696 -2272 -803 -664
1435f64L17L081P33j533j48J507n2j181M92l64k212p63O98j731j958Q63N03j135
$$ -664 -347 2734 3467 1934 1786 3293 3241 2060 2552 2188 -24 -787 -89 -1820 -3778 -2915 -2412 -3547
1453c547Q92J237L00k52R43J834J361K40j173n61K736J091l689j962K848j474
$$ -3547 -2655 -1418 -1118 -1370 -427 1407 2768 3008 1835 1274 4010 5101 1412 -550 2298 824
1469H24l978p14L673q7m543k11M252O79l541M8M723K997k392k131L728K320m320
$$ 824 -3154 -3868 -195 -282 -4825 -5036 -784 -105 -3646 -3598 1125 4122 1730 -401 3327 5647 1327
1486A327k214M083K412m935l406K378J423m386j828K873J504j590j150J786K454
$$ 1327 -887 3196 5608 673 -2733 -355 1068 -3318 -5146 -2273 -769 -2359 -3509 -1723 731
1501G31j74j670K256K584r87j723J928J595k449j086J552j381m475O61K304j781
$$ 731 557 -1113 1143 3727 2740 1017 2945 4540 2091 1005 2557 1176 -3299 -2638 -334 -2115
1517b115j361J684P41k336j85K150J701k43J391J115P42M21k564r89L074P37l907
$$ -2115 -3476 -1792 -1051 -3387 -3572 -1422 279 36 1427 2542 3284 3705 1141 152 3226 3963 56
1534E6q93K870j966m886J252L356k168k005K263J221j044J347J122j33J792J610
$$ 56 -837 2033 67 -4819 -3567 -211 -2379 -4384 -2121 -900 -1944 -597 525 392 2184 3794
1550C794k516p36L853L30m415N13L091m234l826J963J741k139L45O39m69m87J018
$$ 3794 1278 542 4395 4725 310 823 3914 -320 -4146 -2183 -442 -2581 -2236 -1597 -2066 -2553 -1535
1567a535r83J313M892J71l740J754M098m541l981N743K119o287j099M181k064
$$ -1535 -2518 -1205 3687 3858 118 1872 5970 1429 -2552 3191 5310 -977 -2076 2105 41
1582D1n500J949L672k881j173K140L67L2J784L8Q5K998r31l066K324L483l551
$$ 41 -5459 -3510 162 -2719 -3892 -1752 -1385 -1353 431 469 554 3552 2621 -445 1879 5362 1811
1599A811l163M930R1p922q59O199k079n264M616L984m828k650M178J801k045J875
$$ 1811 -1352 3578 3669 -4253 -5112 1087 -992 -6256 -1640 2344 -2484 -5134 -956 845 -1200 675
1615F75K773o2r25n76j377J398J414k818j774L110m33o118L73N019k254m246L675
$$ 675 3448 3386 2461 1885 508 1906 3320 502 -1272 1838 1405 -4713 -4340 679 -1575 -5821 -2146
1632b146M082l666j624M929J398k382O29J813p54j033J055j21r45O82j805k689
$$ -2146 1936 -1730 -3354 1575 2973 591 1220 3033 2279 1246 2301 2180 1235 1917 112 -2577
1648b577N30Q97j531j07K237m14j773O89J620l21N44K568L83j054J619n98k175
$$ -2577 -2047 -1150 -2681 -2788 -551 -965 -2738 -2049 -429 -750 -206 2362 2745 1691 3310 2712 537
1665E37M85J711k095j968J540M6l044r66K564l53j853J233K038m97k28J178J777
$$ 537 1022 2733 638 -1330 210 256 -2788 -3754 -1190 -1543 -3396 -2163 -125 -622 -850 328 2105
1682B105O50j317j81J419M6j630o42J901k46m130j003K814j055l330J679L139
$$ 2105 2755 1438 1257 2676 2722 1092 450 2351 2105 -2025 -3028 -214 -1269 -4599 -2920 219
1698B19j343k341J753K884l35j963K517K971j459k843J223K352j596l368J166
$$ 219 -1124 -3465 -1712 1172 837 -1126 1391 4362 2903 60 1283 3635 2039 -1329 -163
1713a63K364k783l377J898K164k318k344K790K582k172j181K890K165j126j183
$$ -163 2201 -582 -3959 -2061 103 -2215 -4559 -1769 813 -1359 -2540 350 2515 1389 206
1728B06J732K012j872k174J769J199k302k292P66J504k889j771K442J488k345
$$ 206 1938 3950 2078 -96 1673 2872 570 -1722 -956 548 -2341 -4112 -1670 -182 -2527
1743b527k69K647M53j152Q33J988L33q49L24N85k70p77l38m28k38q23j018K4J30
$$ -2527 -2796 -149 304 -848 -15 1973 2306 1457 1781 2366 2096 1319 981 553 315 -508 -1526 -1502 -1372
1762a372o08p16P92K00L43M58J298L97J52Q13J78n82N92O32j361n19M94p16j573
$$ -1372 -1980 -2696 -1904 -1704 -1361 -903 395 792 944 1757 1935 1353 1945 2577 1216 697 1191 475 -1098
1781a098k35N75q53j432Q25J461r67n34J465J680m63n04J370J687q42j099J030
$$ -1098 -1333 -758 -1611 -3043 -2218 -757 -1724 -2258 -793 887 424 -80 1290 2977 2135 1036 2066
1798B066P21j078k539Q39J523k125k509J604J356k051j834K174K668j802j017
$$ 2066 2787 1709 -830 9 1532 -593 -3102 -1498 -142 -2193 -4027 -1853 815 -987 -2004
1813b004K919J824k033q88K873R10j556k267J693J114k581j749J237O88j926j920
$$ -2004 915 2739 706 -182 2691 3601 2045 -222 1471 2585 4 -1745 -508 180 -1746 -3666
1829c666J962J402j986m52K378J217j475n3K402Q40j386l53J997k1k188l17R14
$$ -3666 -1704 -302 -2288 -2740 -362 855 -620 -673 1729 2569 1183 830 2827 2806 618 301 1215
1846A215l69k075o48J222n9k367N1J744P10j160K58J980R53j129N24J372N19j484
$$ 1215 846 -1229 -1877 -655 -714 -3081 -3030 -1286 -576 -1736 -1478 502 1455 326 850 2222 2741 1257
1864A257k9P91l05j283q06J33j52p89r42M9O98l23l29N35J202M33j88N42J075
$$ 1257 1228 2019 1714 431 -375 -242 -394 -1183 -2125 -2076 -1378 -1701 -2030 -1495 -293 140 -48 494 1569
1883A569N47p22J34P07m89j050m53M9K2j062j410O07N35j125l24J201N89k87k1
$$ 1569 2116 1394 1528 2235 1746 696 243 292 314 -748 -2158 -1551 -1016 -2141 -2465 -1264 -675 -962 -983
1902i83J748Q33p62M05R54L1r38k4N07k97j858o28R63k43k045j07J577R9j681
$$ -983 765 1598 836 1241 2195 2226 1288 1264 1771 1474 -384 -1012 -49 -292 -2337 -2444 -867 -768 -2449
1921b449K14K592J33j453N06K696P7j857l2J872O52k629l33J314m07k211j041
$$ -2449 -2235 357 490 -963 -457 2239 2316 459 427 2299 2951 322 -11 1303 896 -1315 -2356
1938b356J609N37k190p74K483O97j972M43K441O74j373J75K186m73j189O33M16
$$ -2356 -747 -210 -2400 -3174 -691 6 -1966 -1523 918 1592 219 394 2580 2107 918 1551 1967
1955A967l25j148q06o7l42j006l30N43O14p79m62J451M72p92J174J935l52j228
$$ 1967 1642 494 -312 -379 -721 -1727 -2057 -1514 -900 -1679 -2141 -690 -218 -1010 164 2099 1747 519
1973E19R06J149j438o40J053j25j572m18j90o14m0or07K95J769p17j013K010J627
$$ 519 1425 2574 1136 496 1549 1424 -148 -566 -756 -1370 -1410 -1416 -2323 -2028 -259 -976 -1989 21 1648
1992A648j531l94K658m1j702K69J372m38j140j64j271l62N67j235p79J865O56
$$ 1648 117 -277 2381 2340 638 907 2279 1841 701 537 -734 -1096 -529 -1764 -2543 -678 -22
2009b2k057p14L286J27k179J390L361j363j789J492J151j529p11O91l40p74n05
$$ -22 -2079 -2793 493 620 -1559 -169 3192 1829 40 1532 2683 1154 443 1134 794 20 -485
2026d85p83m93J207o91j544J701J243k075m0L364O37k213O36K715j557k253K113
$$ -485 -1268 -1761 -554 -1245 -2789 -1088 155 -1920 -1960 1404 2041 -172 464 3179 1622 -631 1482
2043A482J676k542j016J607j596j574k0Q29j06L15j28q40R66J111r44j85L124
$$ 1482 3158 616 -400 1207 -389 -1963 -1983 -1154 -1260 -945 -1073 -1913 -947 164 -780 -965 2159
2060B159O78k619R62K114k176k104K278J292k903j084J469n06j639M94L36j22
$$ 2159 2837 218 1180 3294 1118 -986 1292 2584 -319 -1403 66 -440 -2079 -1585 -1249 -1371
2076a371P6J51l02J182J546m22n17J432Q14k301l21K388r88j345M60J42j978m34
$$ -1371 -1295 -1144 -1446 -264 1282 860 343 1775 2589 288 -33 2355 1367 22 482 624 -1354 -1788
2094a788N91k04k14Q36Pp45N51O18l57Q53K019j52j106N3J192j258r56P57M80
$$ -1788 -1197 -1401 -1615 -779 -772 -1517 -966 -348 -705 148 2167 2015 909 962 2154 896 -60 697 1177
2113A177j639n17L37n96k10l32N8P66K20n88O33J458J68o94J067J152j078j544
$$ 1177 -462 -979 -642 -1238 -1448 -1780 -1722 -956 -736 -1324 -691 767 935 241 1308 2460 1382 -162
2131a62J395Q64j194j008N00k33j625r48R05R76j98j318J247J214j198p51J582
$$ -162 1233 2097 903 -105 395 162 -1463 -2411 -1506 -530 -728 -2046 -799 415 -783 -1534 48
2148D8K048n40j342J475J137k307p66J195N40j781p56P00L70j413o71N88P14r5
$$ 48 2096 1556 214 1689 2826 519 -247 948 1488 -293 -1049 -349 21 -1392 -2063 -1475 -761 -856
2166h56p11M63J712o7q67J338J344j120j226J293O98j753j01J115q08j977j84
$$ -856 -1567 -1104 608 541 -326 1012 2356 1236 10 1303 2001 248 147 1262 454 -1523 -1707
2183a707N43l00J84N6J80O90j58k51N55Q28M97k21L24R54j022p89Q06N2j469k47
$$ -1707 -1164 -1464 -1280 -1224 -1044 -354 -512 -763 -208 620 1117 896 1220 2174 1152 363 1169 1221 -248 -495
2203d95L70n41p14L83L9o08N77K07m50L93J656n17q6R77R32j197l99J020J7j474
$$ -495 -125 -666 -1380 -997 -958 -1566 -989 -782 -1232 -839 817 300 214 1191 2123 926 527 1547 1564 90
2223I0j04P54j207p33l5J98M7j13p0J29O76m0l92O42J667m24j089J426J054j537
$$ 90 -14 740 -467 -1200 -1235 -1037 -990 -1103 -1173 -1044 -368 -408 -800 -158 1509 1085 -4 1422 2476 939
2243I39j069J564O9j900n85J117l15j474j95J173J2o90j63J300P49m64j36J259
$$ 939 -130 1434 1503 -397 -982 135 -180 -1654 -1849 -676 -664 -1354 -1517 -217 532 68 -68 1191
2261A191Q83j342o16J022R94j844r51J407N3j839o13R89J07j250J9J193K61o14
$$ 1191 2074 732 116 1138 2132 288 -663 744 797 -1042 -1655 -666 -559 -1809 -1790 -597 -336 -950
2279i50L75J385m7n28M54Q87J85p41k85K04m4j240k25O06q10o91j79J001J04j168
$$ -950 -575 810 763 235 689 1576 1761 1020 735 939 895 -345 -570 36 -774 -1465 -1644 -643 -539 -1707
2299a707Q15R59l54Q0J58J044K99n93K81N18p3o97k52k17K07n02q46j56J77k15
$$ -1707 -892 67 -287 -207 -49 995 1294 701 982 1500 1427 730 478 261 468 -34 -880 -1036 -859 -1074
2319a074l77M03P34l41m5Q20N78P6n9J64N53K85m63p77M52L4j521j15L77P9j073
$$ -1074 -1451 -1048 -314 -655 -700 120 698 774 715 879 1432 1717 1254 477 929 963 -558 -673 -296 -217 -1290
2340a290l23R33K71j022R4J211O05m10M0J036J54j049N36J072m94j164n6M29k42
$$ -1290 -1613 -680 -409 -1431 -1337 -126 479 69 109 1145 1299 250 786 1858 1364 200 144 573 331
2359C31j355l62R96n42o87Q2J391m62p38P24J541J07r69O39R80j80j245K58J045
$$ 331 -1024 -1386 -390 -932 -1619 -1537 -146 -608 -1346 -622 919 1026 57 696 1676 1496 251 509 1554
2378A554n31j480J27M58o07j229L18Q80m5j350O78J086J60j90K60J092L69r38
$$ 1554 1023 -457 -330 128 -479 -1708 -1390 -510 -555 -1905 -1227 -141 19 -171 89 1181 1550 612
2396F12J17J086k78j131j80N28o04p99k88L28l18o12K78M26O9k89N55O74J07M11
$$ 612 729 1815 1537 406 226 754 150 -649 -937 -609 -927 -1539 -1261 -835 -766 -1055 -500 174 281 692
2416F92j84N77K15k45k92l3J97o55l70j53J06q27j37J09K68n30L08P76j00k84
$$ 692 508 1085 1300 1055 763 730 927 272 -98 -251 -145 -972 -1109 -1000 -732 -1262 -954 -178 -278 -562
2436e62Q26N21L9J21l15J10O87l05r20K90M56j105r41J88O90o60j030J227L71
$$ -562 264 785 824 945 630 740 1427 1122 202 492 948 -157 -1098 -910 -220 -880 -1910 -683 -312
$$ [...]
8191A27
##END NTUPLES=NMR FID
##END=
