##TITLE=1H_Pr 11g-2
 200.13Hz, CDCl3.
 8 sc
 
 13.4.2026
##JCAMPDX= 6.0         $$ Bruker NMR JCAMP-DX V2.0
##DATA TYPE= NMR FID
##DATA CLASS= NTUPLES
##ORIGIN= UXNMR, Bruker Analytische Messtechnik GmbH
##OWNER= pz
$$ XWIN-NMR		Version 3.5
$$ Mon Apr 13 13:55:31 2026 Russian Standard Time (UT+4h)  she@DPX200
##.OBSERVE FREQUENCY= 200.1313
##.OBSERVE NUCLEUS= ^1H
##.DELAY= (6, 6)
##.ACQUISITION MODE= SIMULTANEOUS
##.ACQUISITION SCHEME= undefined
##.AVERAGES= 8
##.DIGITISER RES= 18
##SPECTROMETER/DATA SYSTEM= spect
##.PULSE SEQUENCE= zg30
##.SOLVENT NAME= CDCl3
##.SHIFT REFERENCE= (INTERNAL, CDCl3, 0, 14.3821)
##AUDIT TRAIL= $$ (NUMBER, WHEN, WHO, WHERE, WHAT)
$$ ##TITLE= Audit trail, XWIN-NMR		Version 3.5
$$ ##JCAMPDX= 5.01
$$ ##ORIGIN= Bruker BioSpin GmbH
$$ ##OWNER= she
$$ F:/spectra/data/she/nmr/H-C/1/audita.txt
$$ ##AUDIT TRAIL=  $$ (NUMBER, WHEN, WHO, WHERE, WHAT)
(   1,<2026-04-13 13:54:22.06 +0400>,<she>,<DPX200>,
      <created by zg, POWCHK disabled, PULCHK disabled
       configuration hash MD5:
       00 E9 B6 7A A2 85 ED C7 34 08 36 98 17 FE 4E 26
       data hash MD5: 16K
       AC 67 ED F1 B6 C1 10 46 59 C8 1C 43 F0 18 8A A8>)
$$ ##END=
$$ 
$$ hash MD5
$$ 70 07 F4 3A E8 BE 06 77 78 4A 20 E1 0B D3 FB EA
##$RELAX= 
##$RELAX= 
##$RELAX= 
##$RELAX= 
##$RELAX= 
##$RELAX= 
$$ Bruker specific parameters
$$ --------------------------
##$DU= <F:/spectra>
##$EXPNO= 1
##$NAME= <H-C>
##$PROCNO= 1
##$TYPE= <nmr>
##$USER= <she>
##$AMP= (0..31)
100 100 100 100 100 100 100 100 100 100 100 100 100 100 100 100 100 100 
100 100 100 100 100 100 100 100 100 100 100 100 100 100 
##$AQSEQ= 0
##$AQ_mod= 1
##$AUNM= <au_zg>
##$AUTOPOS= <>
##$BF1= 200.13
##$BF2= 200.13
##$BF3= 200.13
##$BF4= 200.13
##$BF5= 200.13
##$BF6= 200.13
##$BF7= 200.13
##$BF8= 200.13
##$BYTORDA= 1
##$CFDGTYP= 0
##$CFRGTYP= 5
##$CHEMSTR= <none>
##$CNST= (0..31)
1 1 145 1 1 1 1 1 1 1 1 1 1 1 1 1 1 1 1 1 1 1 1 1 1 1 1 1 1 1 1 1 
##$CPDPRG= <>
##$CPDPRG1= <>
##$CPDPRG2= <>
##$CPDPRG3= <>
##$CPDPRG4= <mlev>
##$CPDPRG5= <mlev>
##$CPDPRG6= <mlev>
##$CPDPRG7= <mlev>
##$CPDPRG8= <mlev>
##$CPDPRGB= <>
##$CPDPRGT= <>
##$D= (0..31)
0 0.7 0 0 0 0 0 0 0 0 0 0.03 0 0 0 0 0 0 0 0 0 0 0 0 0 0 0 0 0 0 0 0 
##$DATE= 1776074061
##$DBL= (0..7)
120 120 120 120 120 120 120 120 
##$DBP= (0..7)
150 150 150 150 150 150 150 150 
##$DBP07= 0
##$DBPNAM0= <>
##$DBPNAM1= <>
##$DBPNAM2= <>
##$DBPNAM3= <>
##$DBPNAM4= <>
##$DBPNAM5= <>
##$DBPNAM6= <>
##$DBPNAM7= <>
##$DBPOAL= (0..7)
0.5 0.5 0.5 0.5 0.5 0.5 0.5 0.5 
##$DBPOFFS= (0..7)
0 0 0 0 0 0 0 0 
##$DE= 6
##$DECBNUC= <off>
##$DECIM= 32
##$DECNUC= <off>
##$DECSTAT= 4
##$DIGMOD= 1
##$DIGTYP= 9
##$DL= (0..7)
0 120 120 120 120 120 120 120 
##$DP= (0..7)
150 150 150 150 150 150 150 150 
##$DP07= 0
##$DPNAME0= <>
##$DPNAME1= <>
##$DPNAME2= <>
##$DPNAME3= <>
##$DPNAME4= <>
##$DPNAME5= <>
##$DPNAME6= <>
##$DPNAME7= <>
##$DPOAL= (0..7)
0.5 0.5 0.5 0.5 0.5 0.5 0.5 0.5 
##$DPOFFS= (0..7)
0 0 0 0 0 0 0 0 
##$DQDMODE= 0
##$DR= 18
##$DS= 0
##$DSLIST= <SSSSSSSSSSSSSSS>
$$ [...]
##$SUBNAM0= <"">
##$SUBNAM1= <"">
##$SUBNAM2= <"">
##$SUBNAM3= <"">
##$SUBNAM4= <"">
##$SUBNAM5= <"">
##$SUBNAM6= <"">
##$SUBNAM7= <"">
##$SUBNAM8= <"">
##$SUBNAM9= <"">
##$SW= 18.0517328524113
##$SWIBOX= (0..15)
0 0 2 0 0 0 0 0 0 0 0 0 0 0 0 0 
##$SW_h= 3612.71676300578
##$TD= 16384
##$TD0= 1
##$TE= 0
##$TE2= 300
##$TE3= 300
##$TEG= 300
##$TL= (0..7)
0 120 120 120 120 120 120 120 
##$TP= (0..7)
150 150 150 150 150 150 150 150 
##$TP07= 0
##$TPNAME0= <>
##$TPNAME1= <>
##$TPNAME2= <>
##$TPNAME3= <>
##$TPNAME4= <>
##$TPNAME5= <>
##$TPNAME6= <>
##$TPNAME7= <>
##$TPOAL= (0..7)
0.5 0.5 0.5 0.5 0.5 0.5 0.5 0.5 
##$TPOFFS= (0..7)
0 0 0 0 0 0 0 0 
##$TUNHIN= 0
##$TUNHOUT= 0
##$TUNXOUT= 0
##$USERA1= <user>
##$USERA2= <user>
##$USERA3= <user>
##$USERA4= <user>
##$USERA5= <user>
##$V9= 5
##$VALIST= <valist>
##$VCLIST= <CCCCCCCCCCCCCCC>
##$VD= 0
##$VDLIST= <DDDDDDDDDDDDDDD>
##$VPLIST= <PPPPPPPPPPPPPPP>
##$VTLIST= <TTTTTTTTTTTTTTT>
##$WBST= 1024
##$WBSW= 4
##$XGAIN= (0..3)
0 0 0 0 
##$XL= 0
##$YL= 0
##$YMAX_a= 899490
##$YMIN_a= -900873
##$ZGOPTNS= <>
##$ZL1= 120
##$ZL2= 120
##$ZL3= 120
##$ZL4= 120
##$ABSF1= 10
##$ABSF2= 0
##$ABSG= 5
##$ABSL= 3
##$ALPHA= 0
##$AQORDER= 0
##$ASSFAC= 0
##$ASSFACI= 0
##$ASSFACX= 0
##$ASSWID= 0
##$AUNMP= <proc_1d>
##$AZFE= 0.1
##$AZFW= 0.1
##$BCFW= 1
##$BC_mod= 2
##$BYTORDP= 1
##$COROFFS= 0
##$CY= -3
##$DATMOD= 1
##$DC= 2
##$DFILT= <>
##$DTYPP= 0
##$F1P= 0
##$F2P= 0
##$FCOR= 0.5
##$FTSIZE= 0
##$FT_mod= 4
##$GAMMA= 1
##$GB= 0.15
##$INTBC= 1
##$INTSCL= 1
##$ISEN= 128
##$LB= 0.25
##$LEV0= 0
##$LPBIN= 0
##$MAXI= 10000
##$MC2= 0
##$MEAN= 0
##$ME_mod= 0
##$MI= 1.114404
##$NCOEF= 0
##$NC_proc= 0
##$NLEV= 6
##$NOISF1= 3.799351
##$NOISF2= 2.8
##$NSP= 1
##$NTH_PI= 0
##$NZP= 0
##$OFFSET= 14.38212
##$PC= 1
##$PHC0= -3705.872
##$PHC1= 11.59231
##$PH_mod= 1
##$PKNL= yes
##$PPARMOD= 0
##$PSCAL= 0
##$PSIGN= 0
##$REVERSE= no
##$SF= 200.129724274929
##$SI= 16384
##$SIGF1= 3
##$SIGF2= 2
##$SINO= 400
##$SIOLD= 16384
##$SREGLST= <1H.CDCl3>
##$SSB= 0
##$STSI= 0
##$STSR= 0
##$SW_p= 3205.1282051282
##$SYMM= 0
##$S_DEV= 0
##$TDeff= 0
##$TDoff= 0
##$TI= <>
##$TILT= no
##$TM1= 0
##$TM2= 0
##$TOPLEV= 0
##$USERP1= <user>
##$USERP2= <user>
##$USERP3= <user>
##$USERP4= <user>
##$USERP5= <user>
##$WDW= 1
##$XDIM= 8192
##$YMAX_p= 0
##$YMIN_p= 0
$$ End of Bruker specific parameters
$$ ---------------------------------
##NTUPLES= NMR FID
##VAR_NAME=  TIME,          FID/REAL,        FID/IMAG
##SYMBOL=    X,             R,               I
##VAR_TYPE=  INDEPENDENT,   DEPENDENT,       DEPENDENT
##VAR_FORM=  AFFN,          ASDF,            ASDF
##VAR_DIM=   8192,          8192,            8192
##UNITS=     SECONDS,       ARBITRARY UNITS, ARBITRARY UNITS
##FACTOR=    0.0002768,     1,               1
##FIRST=     0,             0,               0
##LAST=      2.2672688,     0,               0
##MIN=       0,             -900873,         0
##MAX=       2.2672688,     899490,          0
$$ Real data points
##PAGE= N=1
##DATA TABLE= (X++(R..R)), XYDATA
$$ [...]
2069C20j581J323n03j443J728K26q39J470J513j902k002J872J662m023l67N905
2085C359n84n464J767M031k932m383K283M279j716l152L000J548k140j052L6J612
2101D92N47j640n68L516M86m191k42K829K53m148J18N375j239m141K438K115l460
2118a460j332L081J164k587N35L377j587k743K228O69l245J025K811m99j798j42
2134e03J419o75k164L47J645J06k9m01N32J490k601j760L519J273l636l95M272
2151B439J179n390j040N115r35m969K230L995k525k089K320J527k585j895K662
2166C9J266j673L03J453p32k54n62n19Q71m32m78J214N48j364o69Q66O48j961
2184a436m54L556m66l111K036K547k955k047K838K166l424j752M443J159m814
$$ plain form
2069 320 -1261 62 -441 -1884 -156 70 -769 701 2214 312 -1690 182 1844 -2179 -2546 3359
2085 3359 2775 -2689 -922 3109 177 -4206 -1923 2356 640 -2512 488 2036 -104 -1156 -1120 492
2101 492 1039 -601 -1169 2347 2833 -1358 -1600 1229 1482 -2666 -2548 2827 1588 -2553 -115 2000 -1460
2118 -1460 -2792 289 1453 -1134 -599 2778 1191 -1552 676 1345 -1900 -875 1936 1437 -361 -503
2134 -503 916 241 -1923 -1576 69 175 146 -255 277 1767 -834 -2594 925 2198 -1438 -1833 2439
2151 2439 3618 -1772 -2812 2303 1368 -3601 -1371 2624 99 -1990 330 1857 -728 -2623 39
2166 39 1305 -368 -65 1388 656 402 -160 -679 192 -240 -718 496 1044 -320 -989 -123 525 -1436
2184 -1436 -1890 1666 1200 -1911 125 2672 -283 -2330 508 2674 -750 -2502 1941 3100 -1714
2199a714j53K882n44k395N63K416J08k689N27K572j271j759N13J631Q90j617j069
2216a109K733L7l044M52J685o47j762J631K045k196k327K741J493l499J08L062
2232A403o92j658O23K205j165k565J694K458k293j680K091J235j597j580Q02J836
2248A117j581j402J654J680j763j045J627J657k068k079L450J245l214k82K407
2263A403K01k670l33K360k17k801J295K403j966j371J749J425j550j239J406J750
2279A845j993m50J800l27j370j08J565M43k130j035K635M34k626k3J940L94k146
2296a152l04K591k4k505J225K044j389j725J504J350j133j536J115J439k016p77
2312a293K087n63j046N6J044K32j621M31J781p92j827J313J359p85j024N83J451
$$ plain form
2199 -1714 -1867 1015 471 -1924 -1361 1055 1163 -1526 -999 1573 302 -1457 -944 687 1577 -40 -1109
2216 -1109 1624 1661 -1383 -931 754 107 -1655 -24 2021 -175 -2502 239 1732 -1767 -1659 1403
2232 1403 711 -947 -324 1881 716 -1849 -155 2303 10 -1670 421 1656 59 -1521 -719 1117
2248 1117 -464 -1866 -212 1468 -295 -1340 287 1944 -124 -2203 1247 2492 -722 -1004 1403
2263 1403 1604 -1066 -1399 961 744 -2057 -762 1641 -325 -1696 53 1478 -72 -1311 95 1845
2279 1845 -148 -598 1202 875 -495 -603 962 1405 -725 -1760 875 1309 -1317 -1340 600 994 -1152
2296 -1152 -1456 1135 1111 -1394 -169 1875 486 -1239 265 1615 482 -1054 61 1500 -516 -1293
2312 -1293 794 231 -815 -759 285 517 -1104 -673 1108 316 -1511 -198 1161 376 -648 -65 1386
2329A386q53j929J584J378k155q45J700J127j915j458K291J497k365r75K543L14
2345A325j646n22J400P21j681o1J507l33j413M54P02q1j004l39J491l57j218R31
2363a24L17m31J05L70J89m15k76J009L15j982O97J538j000j333Q18R93j044j357
2381a611J464J453k067q17J695J319j335j438J313J728j398j756J722J112q75
2396E09r07J52J138k55k148J290J097j341p81R11J044q57p54N84J186o27r6L6
2414A81m72N54N77j021l71P64J23k67n71P14N32j426n63J617J00j377J07R94P74
2433I69p76j280R68J516j114j013L72J519l08k118Q37J842j423j410J388J162
2449A131j067j480P29J819p76j357N69Q64L19n00n44O10Q68j313l62L97O35l22
$$ plain form
2329 1386 533 -1396 188 1566 -589 -1434 266 1393 -522 -1980 311 1808 -557 -1532 1011 1325
2345 1325 -321 -843 557 1278 -403 -464 1043 710 -703 -249 453 372 -632 -971 520 163 -1055 -124
2363 -124 193 -238 -133 237 426 11 -265 744 1059 -923 -226 1312 312 -1021 -203 790 -254 -1611
2381 -1611 -147 1306 -761 -1578 117 1436 101 -1337 -24 1704 306 -1450 272 1384 509
2396 509 -398 -246 892 637 -1511 -221 876 -465 -1246 -335 709 -148 -902 -318 868 241 145 181
2414 181 -291 263 840 -181 -552 212 335 68 -503 211 743 -683 -1246 371 471 -906 -799 195 969
2433 969 193 -1087 -119 1397 283 -730 -358 1161 853 -1265 -428 1414 -9 -1419 -31 1131
2449 1131 64 -1416 -687 1132 356 -1001 -432 432 751 251 -293 317 1185 -128 -490 -93 542 220
2467B20j346P92J438j457j068J235O43p50m25K69Q24M16r26k04O05N66p69j079
2485a016J006J389j387r77J568j2j430q38J433J507j589q19J566N21j200j85j12
2502e75P05Q32j010k53Q36L95j094j095J040R87j642l30J914J80j670k09J103
2519A14L47p41q01J330O83l04l65p62J091J39j290m55K093m59j321L99J143m54
2537C87j939J74K016m35j250J471K07n56N3n69Q8J86K94Q2m63Q22L18j312l27
2556g53J041n11p02P30P20m42n31K56K85j2k98J54k51O43J449j641r29J979j85
2575A002k159M67J590j91k032R45J992j537k124J585J077p17n81Q72O64j30j002
2592b79J6L13K05j62m74Q33O77j248o77J288l34j491P63Q87k47l61N38K87r98
$$ plain form
2467 220 -1126 -334 1104 -353 -1421 -186 457 -293 -718 -449 375 791 -135 -339 266 832 63 -1016
2485 -1016 -10 1379 -8 -985 583 571 -859 -1697 -264 1243 -346 -1165 401 922 -278 -463 -575
2502 -575 130 962 -48 -301 535 930 -164 -1259 -219 768 -874 -1204 710 890 -780 -989 114
2519 114 461 -280 -1081 249 932 628 263 -499 592 731 -559 -1014 1079 620 -701 -302 841 387
2537 387 -1552 -1378 638 203 -1047 424 631 75 128 -441 -353 -167 127 209 -254 568 886 -426 -753
2556 -753 288 -223 -925 -195 525 83 -448 -192 93 81 -217 -63 -314 329 1778 137 -792 1187 1002
2575 1002 -1157 -690 900 709 -1323 -378 1614 77 -2047 -462 615 -102 -683 189 853 723 -279
2592 -279 -263 50 255 93 -381 452 1129 -119 -796 492 158 -1333 -570 317 70 -291 247 534 -464
2611d64p3J170p32q85J839P53j721o65J185O6j473p3J879m14j272Q98L83n31q24
2630i54j30J114N86j071P0J311M61j591o15J006Q63j690l67K298j48k105L99J237
2648F74q72j529R54J474n55j221J776L90j389o2Q40n79J9M16L26k54n25O7J07
2667E7k32k50L70qO1o0O0N29p44q00J082P46r03m01O76J236j399j532J825J020
2687A333k094r5J792q2j809n4J679m44j486L22J709n88o80O50K57Q3j193J98O98
2706A96J87m93L10M34k64r52J93Q32o14j077J406P16j188j00R47j88j220M65J237
2725H27l49j338J331P37j511m14R18O77j051q17Q64R08j066o68J021M10o15m22
2743e58L28J082o01j101J233N21j126o07J129L60j113k64J234K32j567K49J066
$$ plain form
2611 -464 -537 633 -99 -984 855 1608 -113 -778 407 473 -1000 -1073 806 392 -880 18 401 -130 -954
2630 -954 -1084 30 616 -455 -385 926 1387 -204 -819 187 1050 -640 -1007 1291 1143 -962 -563 674
2648 674 -198 -1727 -773 701 146 -1075 701 1091 -298 -360 480 -99 -80 336 662 408 -117 -50 57
2667 57 -175 -425 -55 -63 -2 -62 -2 527 -217 -1017 65 811 -92 -493 183 1419 20 -1512 313 1333
2687 1333 -761 -856 936 854 -955 -1009 670 226 -1260 -938 771 183 -497 153 410 493 -700 -502 196
2706 196 383 -110 200 634 370 -582 -389 443 -171 -1248 158 874 -314 -414 533 345 -875 -410 827
2725 827 478 -860 471 1208 -303 -717 201 878 -173 -990 -126 782 -284 -952 69 479 -136 -558
2743 -558 -230 852 251 -850 383 904 -222 -829 300 660 -453 -717 517 749 -818 -569 497
2760D97n68n96O34N90o23r50J160N05j146J90P52j21q12O37K48J19r46k38J007
2779C39K2q91J6Q13N1r67o5J374j52j332O98R50m80r57P73N52o81q57J204O42
2799A052j259n97J008P9n08l48L51O37j141K90J041n54o38P83M16j86p18k1J027
2818G14l78j127P30N68o60m59P50O86j161n84J210L25q14p85J264M44r84k57J083
2837E65M80j257k78J092l34o16O3N01J02o60j60O85o9n48k5Q10n45r0M01L37m80
2858b6k76N86M0o34M1N22j82m08L06L89j80r22O04Q69j214n50R38R11n72r08Q95
2879B29P01j045o76J426R8j005k76R16N42j031q16Q97P30r46k41K43O88m43o38
2898f47J039M47q39l53O32K38m43l62K49O88n45j92K74j42j36K22m17j01P7M87
$$ plain form
2760 497 -71 -667 -33 557 -66 -1016 144 649 -497 -307 445 324 -488 149 397 516 -430 -668 339
2779 339 361 -530 -514 299 350 -617 -682 692 540 -792 -94 856 376 -581 192 744 63 -794 410 1052
2799 1052 -207 -804 204 283 -225 -573 -222 415 -726 -436 605 51 -587 196 612 426 -292 -313 714
2818 714 336 -791 -61 507 -153 -612 138 824 -337 -921 289 614 -200 -985 279 723 -261 -518 565
2837 565 1045 -212 -490 602 268 -348 -285 216 318 -342 -502 183 114 -434 -459 351 -194 -284 117 454 -26
2858 -26 -302 284 324 -310 -269 253 71 -337 -31 358 178 -744 -140 729 -485 -1035 -97 814 242 -666 229
2879 229 930 -115 -791 635 733 -272 -548 368 910 -121 -937 -40 690 -256 -497 -254 434 -9 -647
2898 -647 392 839 0 -353 279 517 74 -288 -39 649 104 -88 186 44 -92 130 -287 -388 -311 176
2918A76q4p09K53O83k90p25R37J75j41m94K77M61n20o87Q09P11r75p19O47Q58
2938F43m19j435P97J201q45p59R71M63o57l44N34L87n68k08O47J40l87l16l87
2957e42L06L16m08j0L69K5o1k67J9M81j48j47M28l90M44j69q2j66M75o43l11K84
2979a97O28k58j062N01J248j041p47J006P3l80K22O4M25j32l97QL44j78l4l86
2999b93M39P72j449j66P34N85p78l55P47J91p05k6M87l48k83O18j3pJ07k46l55
3020c44M67j37k15l92N54Q02p99n26J078l39l30l46L00J78L49k20m3N47l31j68
3040H5n57O26J39o29m15J385k00n72l47O52j27o81K96Q81k42m83N38m76P7N41
3060D91o08l23R06K47o50l08N20K80j258k75J469k57p91O60P6k50P9l36N82j36
$$ plain form
2918 176 92 -617 -364 319 29 -696 241 416 275 -219 58 519 -1 -688 121 832 -143 -862 -215 643
2938 643 224 -1211 -414 787 -58 -817 154 617 -40 -384 150 537 -31 -239 408 548 161 -155 -542
2957 -542 -236 80 -328 -338 31 56 -5 -272 -253 228 80 -67 361 -29 415 246 164 -2 473 -170 -481 -197
2979 -197 431 173 -889 -388 860 -181 -928 78 151 -229 -7 57 482 350 -47 -39 305 127 93 -293
2999 -293 146 918 -531 -697 37 622 -156 -511 236 427 -278 -304 183 -165 -448 170 157 150 257 11 -344
3020 -344 123 -14 -229 -621 -67 735 -64 -590 488 149 -181 -527 -227 -49 300 80 37 584 253 85
3040 85 -472 154 293 -336 -751 634 434 -138 -485 167 40 -641 -345 536 294 -189 349 -127 -50 491
3060 491 -117 -440 466 713 63 -245 275 555 -703 -978 491 234 -557 103 179 -71 8 -328 254 118
3080A18j54K92O0J56J45q22j63P59N5j075M21P70m70m59p7O91n14j32N61k86P0
3101e4P57n41l53L44l27K1p1P03O1r14n8J442o84j227M89P36m31l43J79P45K0
3122D94n67j22K70j65O47p05L55P24r93m51O69L20q56m57P25Q91p46m37O85j30
3142A51p52O92J38l89K28K83j43j42q7O1j07k16J093n35q53O46M13o05o23N99
3162a48L92k46l7P0K33L15m38m35K25N62n18k39N86M64j017n99J140N1j054j28
3182h21J400j62p40L94L99l47m83J54M13K53m53j10M55P3l87l70R7L04J93p55
3202d93P25J12o44L30l82J56j93L08N26m48l49Q90m24n76L77P73p48j41M85K97
3222E81q21m91P36L64r31J80O94k1k51JJ78K59o97l87P60J79j51k74J88L90j005
$$ plain form
3080 118 -36 256 316 472 617 -205 -368 391 446 -629 -208 562 92 -367 -444 247 -267 -399 162 -124 -54
3101 -54 703 162 -191 153 -174 -153 -224 479 540 -374 -432 1010 326 -901 -412 324 -107 -450 -271 474 494
3122 494 -73 -195 75 -90 557 -148 207 931 -62 -513 156 476 -380 -837 -112 779 33 -404 281 151
3142 151 -601 91 229 -160 68 351 208 66 -21 40 -67 -283 810 275 -578 68 481 -124 -747 -148
3162 -148 244 -2 -39 31 264 579 141 -294 -69 493 -25 -264 322 786 -231 -830 310 361 -693 -821
3182 -821 579 417 -323 71 470 123 -360 -206 207 460 7 -103 352 425 38 -332 -235 69 262 -493
3202 -493 232 344 -300 30 -352 -196 -389 -81 445 -3 -352 538 114 -462 -85 688 -60 -201 284 581
3222 581 -240 -731 5 369 -562 -382 312 291 40 41 219 478 -219 -606 154 333 182 -92 96 486 -519
3243e19j2P05k8m56k4N76r5o83M10R6J86n06N03L25l84l4L09j82q2q6J82J10n33
3266b22O4K71j52k80o6M65Lk65J21K41j46n70N28K36j5m07K16N79m69l21K35M82
3288E28n17l68J91L33j12l21J81o4j67m2N73M0o80M89L5K56l19RL44n00j13J23
3310a01J87k44j23J92K69j52j56K2M13o68j5O88L8l43m13P19n4l43K2L23j38n55
3332d32L76J31j58j01l80O84J64n38L36m3k27k56M65K89l36j42J82K03j18j19
3352b0K20j11m68K59K3J85m38K35M46l25n13M63L84k85o72N89L86k53m10O67o2
3373C00k61l06N85L0l59m13O53M5n88J37P6K06k01k78K24J70l45P6K03M01k18
3394A37l12L76J98m16J39J4k18l13L37M0j31j28N98L3o70K91J58k32j0K68J35
$$ plain form
3243 -519 -531 174 146 -310 -334 242 147 -536 -126 -30 156 -350 153 478 94 60 369 187 105 19 201 311 -222
3266 -222 -158 113 -39 -319 -385 80 83 -182 -61 180 34 -536 -8 228 213 -194 22 601 132 -189 46 528
3288 528 11 -357 -166 167 55 -266 -85 -149 -316 -358 215 255 -425 64 99 355 36 45 389 -111 -224 -101
3310 -101 86 -158 -281 -89 180 28 -128 -106 307 -361 -376 312 350 7 -406 313 259 -84 -62 261 123 -432
3332 -432 -56 75 -83 -184 -564 120 284 -254 82 39 -188 -444 21 310 -26 -168 14 217 99 -20
3352 -20 200 89 -379 -120 -97 88 -350 -115 331 6 -507 -44 340 55 -617 -28 358 105 -305 362 300
3373 300 39 -267 318 348 -11 -424 229 274 -314 -177 -101 105 -96 -374 -150 20 -325 -249 -46 355 137
3394 137 -175 201 399 -17 122 136 -82 -395 -58 -18 -149 -277 321 354 -316 -25 133 -99 -109 159 294
3415B94k69Q4o6L07l84k98L37L95o32K73o1J68m1m96L04K21l17l56O47O0o1m19
3437c10L64L05l42k92M56m4p31N74m1K29n36J92L15j82K1L3k4Q3J05r6k74N17
3459C22n76M03K7j63m04L60K74k61n4J95L7n40J64M40j06n52N96K5l95n0J42N54
3481D38m21N4K43k80NK72o72K68K96n53M16j1j21J78l68L62K94o87O4L62n5k70
3503a86M18l86L72j25p2j51K68J21j68m76L28K52l38k08J32M03m25J23K11K88
3523C81n04j1J74J26J48k31o6P0N79q88J4J49R9j90k08M24K73k98k32L94l94r4
3545b85M4L86M8ll66L03J69k6m64j26J95O63n36k83N14j81j86l22N11J68l12j75
3567b64M07O7n08L19J12k99K39N5k31O33k85r9m01K24K81p51K61P10l35n02L51
$$ plain form
3415 294 25 109 43 350 -34 -332 5 400 -232 41 -20 148 107 -389 -85 136 -181 -537 110 170 109 -310
3437 -310 54 359 17 -275 181 137 -594 -20 -61 168 -368 -176 139 -43 -22 11 -13 70 175 79 -195 322
3459 322 -254 149 176 13 -391 -31 243 -18 -72 123 160 -380 -216 224 118 -434 162 187 -208 -258 -116 438
3481 438 17 71 314 34 39 311 -361 -93 203 -350 66 55 -66 112 -256 106 400 -287 -223 139 84 -186
3503 -186 232 -154 218 93 21 -130 138 259 91 -385 -57 195 -143 -351 -219 184 -241 -118 93 381
3523 381 -123 -134 40 166 314 83 17 87 666 -222 -208 -59 40 -150 -358 66 339 41 -191 203 -191 -285
3545 -285 -241 145 193 190 -176 127 296 270 -194 -320 -125 538 2 -281 233 52 -134 -456 55 223 -89 -264
3567 -264 143 210 -298 21 133 -166 73 128 -103 530 245 146 -255 -31 250 -501 -240 470 135 -367 -16
3588a6M47m23j58L40n8k51L43j97p8J09j4j27l15O90K5n81K69K39k61n32N09L13
3610B73m39p3M84m5l20L52rm69J93J3l9j23L60K6n95NO27l94l05M23J32m05L63
3633C5R7j28o0k60M48k26k86P49k38l46M42j7q42L70M93l36qJ58K59l96k52M26
3655H2Q9m18M40J21m30N77j96j66l70O92n38k17K89K96j70m06N20J02o06l6M30
3676H5J67p05P78r3r1o1LJ17n0K00k56j68l9l9k4J9L10j99k11L02K56k67k16J13
3700f9K70k44qK26j37q2M30r1n59K35J38l09p2L78r1l50J48N14j75k67J90P0J53
3723B98l98L11k47k5J92K2q6o9J8j00M48l08k39j62M53P6j03k58m3L63k41K17
3745A19J31l36J31n1J50j87K73J91m50j62L40k19p4J57kj27K23m9K3r3P3l54J94
$$ plain form
3588 -16 431 8 -150 190 132 -119 224 27 -51 58 44 -83 -398 292 317 -264 5 244 -17 -549 -40 273
3610 273 -166 -239 245 200 -120 232 223 -246 -53 -40 -79 -202 158 184 -411 -406 221 -173 -478 -55 77 -328 35
3633 35 132 4 -56 -316 132 -94 -380 369 131 -215 227 210 -632 -262 231 -105 -113 45 304 -92 -344 82
3655 82 171 -247 193 314 -116 461 265 99 -271 421 -117 -334 -45 251 81 -325 195 297 -309 -345 85
3676 85 252 -453 325 232 141 80 83 200 150 350 94 -74 -113 -152 -176 -157 153 -46 -257 45 301 34 -182 -69
3700 -69 201 -43 -51 175 38 -44 386 295 -264 -29 109 -200 -272 106 15 -335 -187 327 152 -115 75 145 298
3723 298 -100 211 -36 -61 131 153 67 -2 16 -84 364 56 -183 -345 108 184 81 -177 -220 143 -98 119
3745 119 250 -86 45 -6 144 -43 230 421 -29 -191 149 -70 -144 13 11 -116 107 58 81 -12 61 -293 -99
3768i9J82L74n20j31J49M02l15o9R6K23k35K70k83N3n09M23l9j60L70j1N1l01
3790g9J82p6J29l28L70k70N6J9K71l35L33m52j08J62J38k71K62m0%j94L42n2m9
3813A0r4K23K53n61Q5K63j24n3l17L09j00j96K33O3L4l53K63K34o3l09M23P1l89
3836i5M0K77l00K43k81p1O0M56n33J38J67j10J01m4J3j65n1M99l41j79J79M80
3858D83m48j33L27m05L52j03j2R4k63Q8J44m35L39k47J25J52m3pP7P0k13M0P6
3881E8P1o4J57KJ52o34K70K24k49L3j35M1J98k76N4K35j45Q2l07J46PJ0Q3m1q
3906c6J04O5m01n1N66rm60J78j63J86J13l97L45k3j98Q6J84j48J49N2ok2k18O6
3930c8J98l02j16K92L8l29J41K8RMj32K81k07r3M29n5K3k58Oj43K11O0j1j80R
$$ plain form
3768 -99 83 457 -63 -194 -45 357 42 -27 69 292 57 327 44 97 -412 11 -28 -188 182 171 222 -79
3790 -79 103 27 156 -172 198 -72 -16 3 274 -61 272 -180 -288 -126 12 -259 3 -37 -37 -231 111 59 10
3813 10 -84 139 392 -169 -84 179 55 2 -315 -6 -106 -302 -69 -6 28 -325 -62 172 109 -200 223 294 -95
3836 -95 -55 222 -78 165 -116 -187 -127 329 -204 -66 101 -9 92 48 61 -104 -155 344 3 -176 3 483
3858 483 35 -98 229 -176 176 73 61 155 -108 -20 124 -311 28 -219 -94 58 15 8 85 155 -58 -18 58
3881 58 129 65 222 224 376 -258 12 236 -13 20 -115 -74 124 -152 -98 137 -8 74 -233 -87 -80 -70 13 -28 -36
3906 -36 68 133 -268 -319 247 238 -222 -44 -207 -21 92 -305 40 17 -181 -95 89 -59 90 142 136 114 -104 -38
3930 -38 160 -142 -258 34 72 -257 -116 -88 -79 -75 -207 74 -133 -226 203 148 171 -87 -81 -224 -13 47 36 -144 -135
3955a35J54m2K20j15l50K39J40m35J66o7L26Q4k53K30j10K04n48L93k37L45j8
3976A91j29J51q9J08J38k91j85J95k95K37q8j57J13J56p9j32J16o7K61k13K38
3997A79j60q2K61J7m30Q0J60j92L44j10K89k65l47K04J42j77M8Q0O7m1j11J81
4019A37O6l30M8L56m16K81j49l14J20L16l20K23m0p0J63l42M06pj95MK3j76J44
4042g2K46k75J06L4m39k7P31k02j12j39J76K96k18k79O1L3P3J04M5l16K87N9l35
4065a63J23Q3K7l29M04k9j56k36M96j02k60j56L43O0j57j16J85mJ7L5R9j79J30
4088A15l01J47J4Q2j08j69J23K05j49kK13j18N1K5L7n45O29j96L81l66K76j16
4110B28l11J29p6K04l92M16j63m16N38j98M4k44L2L21k24J71K15J1l82K28j87
$$ plain form
3955 -135 19 -23 197 82 -268 -29 111 -324 -158 -225 101 185 -68 162 52 256 -292 101 -136 209 191
3976 191 62 213 124 232 370 79 -106 89 -206 31 -57 -214 -101 55 -24 -156 -40 -107 154 -59 179
3997 179 19 -63 198 215 -215 -135 25 -167 177 67 356 91 -256 -52 90 -87 -39 41 108 67 -44 137
4019 137 203 -127 -79 277 -139 142 -7 -321 -201 115 -205 18 -22 -92 71 -271 135 128 -67 -63 -40 -216 -72
4042 -72 174 -101 5 39 -400 -427 304 102 -10 -149 27 323 105 -174 -113 -80 -7 97 142 -174 113 172 -163
4065 -163 -40 43 70 -259 145 116 -40 -276 220 118 -142 -298 45 105 -52 -168 17 13 30 65 164 -15 115
4088 115 -186 -39 -25 57 -51 -220 -97 108 -41 -43 170 52 103 128 165 -380 249 53 434 68 344 228
4110 228 -83 46 -30 174 -218 198 35 -381 157 -41 3 -241 -209 112 -112 59 274 285 -97 131 -56
4131e6m1J51J2J00j05q7J08n2k2n8o9J78j11M00j49J1k21K21k78J94o3j75P8L98
4155C64l76k30L48k80j23J28L26j00p3K16l60P2L00Q1k71N1p4Q1J76k49M5k40
4177a88N5N0K21N3j09Rl3k18M88m57N5N9O18o87k34K73m7K09k29Nj24M11M9p18
4201d89J71N95l06k79M98N7m93J47JJn4K58j93J80l57oM13Nl9k34P8Q7j17K40
4225A64j25j39J89k61J10L81k92j92J5J55R6J70j67K5j83L2L79l50l7L05k13o1
4247Aj93q3J41K90j34k64L61k65M01o8j73L6l8K18K3j73k18K33j09jPK09l79L95
4271B17l32q6L35j79R8N3L9k07N0K82k69r5J38J9R8j24j63J42k03J2L3j72N66
4294B52j80J23j46j61q9J61Q2j03Q9M0J0K8j22n2K74o7k07K67J39l61j51L73m07
$$ plain form
4131 -56 -97 54 66 166 61 -26 82 30 8 -50 -119 59 -52 348 199 210 -11 210 -68 126 63 -112 -34 364
4155 364 -12 -242 106 -174 -297 -169 157 57 -16 200 -160 -88 212 293 22 73 -1 80 256 7 52 -188
4177 -188 -133 -83 138 191 82 91 58 -160 328 -129 -74 -15 603 -84 -318 -45 -92 117 -112 -107 -231 180 229 -489
4201 -489 -318 277 -29 -308 190 247 -246 -99 -98 -97 -151 107 -86 94 -263 -269 144 149 110 -124 -46 41 -76 164
4225 164 39 -100 89 -172 -62 319 27 -165 -150 5 101 271 104 129 -54 -22 357 7 -30 275 62 1
4247 1 -192 -275 -134 156 22 -242 119 -146 255 187 14 50 12 230 253 80 -138 95 -14 -15 -8 201 -178 217
4271 217 -115 -201 134 -45 53 106 145 -62 -12 270 1 -94 44 63 161 37 -126 16 -187 -175 -142 -314 252
4294 252 72 195 49 -112 -201 -40 42 -61 28 68 78 106 -16 -68 206 139 -68 199 338 -23 -174 199 -208
4317b08j67L94R0j91K0k22L85RN5k4R2l18L32n78M18K60o69J87K16p6j51J55j42
4340a33Q6k02K61k2p2K85j40P6j44n7l4K90l41L14m57K23Jj0J67l32L03j49n2
4363a39N3J58m0j58J02K00p2j83J79j30k0K8J75m93j6L43J44m58L24J36l42K74
4385F5M3j67m2K81j17P2j97K15j53M82r9j03m87Q6L07J27m77P2l1K56l09q4L42
4408H2k4k7l6N7p7J29j66L57l17K02k65M4o6J70R4kPk52J90k65R3l1K20J52j01
4433A68l45J27P8j02PL22k66J34n6J79j08j35j51Q3R4j64N5J87Oj91K34k47J41
4456E0m06K54K97k42J31j78Q8j24M3K59k79lQ6l5K30l09J20K09l49L11k21J12
4478D4P0k25K27J61m61M10j82n0l8j25K57l36K78J98k93o7k06N73l96L10l2n12
$$ plain form
4317 -208 -375 19 109 -82 -62 -284 101 110 165 141 233 -85 247 -331 87 347 -322 -135 81 5 -146 9 -133
4340 -133 -47 -249 12 -10 -82 203 63 139 -5 -62 -96 194 -147 167 -290 -67 -66 -76 91 -241 62 -87 -139
4363 -139 -86 72 32 -126 -24 176 104 -79 100 -30 -50 -22 153 -340 -356 -13 131 -327 -3 133 -209 65
4385 65 108 -59 -101 180 63 135 -62 153 0 482 383 280 -207 -121 186 313 -164 -92 -123 133 -176 -260 82
4408 82 58 31 -5 52 -25 104 -62 295 -22 180 -85 -41 -107 63 157 155 162 -90 100 -165 -72 -103 117 269 168
4433 168 -177 -50 28 -74 -67 255 -11 123 67 246 138 3 -148 -65 29 -135 -80 107 113 -78 156 -91 50
4456 50 -356 -102 195 -47 84 -94 -6 -130 -87 172 -107 -110 -24 -59 171 -138 -18 191 -158 153 -68 44
4478 44 114 -111 116 277 -184 226 44 -6 -44 -169 88 -248 30 228 -65 -132 -338 235 -161 149 117 -395
4500c95O85j13m77N70k86N8r8q1mK14k34k00J56K61j00n5J9K85j41k17J75J2J21
4523A55j87j05J67NK37k23j78k4K26k07lk31N03J19l90K58k92J32K44j22m2Mj98
4546a52K30q8j81J75L67k53p4k0Q8j62P4j90K14J20J17l6n18K83J23N7k24R3k12
4569a69M7L33K3k85J30R9N4k62j98L42j69j9M0%M73k59j16k92R9qN3P2M6J41j76
4594aON2j55R0np2M1K11k45J57j00N4J16k50j8K85j50j34J73J7k57n5K51N2q6
4619b3L5K23k40j96K20k47K74m19N84k19P6p0Om5OJ23j9j75L12l51N2nJ93k41
4643a46J78J35l6j59m4L7K2r3J28j42K96k39K27j79J31j29r7J51k51L73l23K42
4665H2M9p0k42J54k02K15j49j43R4K92J17j42J28j41j18N1k7P6J62k24J64q5P
$$ plain form
4500 -395 290 177 -300 270 -16 42 -56 -137 -141 73 -161 -361 -205 56 -44 -99 -80 205 64 -153 22 34 155
4523 155 -32 -137 30 35 272 49 -129 -153 73 -134 -137 -368 135 254 -136 122 -170 -38 206 84 42 46 -152
4546 -152 78 -10 -191 -16 351 98 24 4 92 -70 4 -186 28 148 265 229 -289 -6 117 174 -50 43 -169
4569 -169 -122 211 234 -51 79 178 232 -30 -228 114 -55 -74 -34 -34 439 180 64 -228 -129 -137 -84 -12 34 175 -1
4594 -1 5 57 -98 -8 -13 -85 -44 167 -78 79 -21 33 149 -101 -119 166 16 -118 55 72 -185 -240 11 63 -23
4619 -23 12 235 -5 -201 19 -228 46 -373 211 -8 68 -2 4 -41 -35 88 69 -106 206 -145 -93 -98 95 -146
4643 -146 32 167 131 -28 -72 -35 -13 -106 22 -120 176 -63 164 -15 116 -13 -110 41 -210 163 -160 82
4665 82 131 61 -181 -27 -229 -14 -163 -306 -212 80 197 55 183 42 -76 -25 -52 24 186 -38 126 41 48
4688D8q5O8j72K85k79K37m7K73o20mL01j37k5L84j55j22J54j57p3K98j7k91M27
4711B91k04j30J23J06k52J30M5m3q3M0L18m92K78m8n3l17Q4L85J14k95J51k19
4733g1k09L30j82J68l76K15jK23r5P9q2L8R5l6J51k42K7l5K32k07j83K26j65J44
4757D4P6r9Q6k52L31m22K6K15R2N2j33j45K06j48N7o7J33j92J48RMk19L0j7L06
4782A21j02j94p3J79K4J7K48j11j04J70n1J27k05k7k4l0n8O9j83L86k70L7N1j03
4806a06p9n9O5k8K13o7N9qr2L6K7K15m18L88q8R7k14N7p4r7L01j2l4j8J52l35
4832a19j2L7J69P4j2j5j85M62o63L22nj04J4m8j32pL62k39Q3R7l9l02L68l36M9
4857a81L9J74j37K41k99K22M9j51j07J38j01K75k2l36jR2L07l76K34r1J15k57
$$ plain form
4688 48 -37 31 -141 144 -135 102 55 328 -292 -296 5 -132 -157 227 72 -50 104 -53 -126 172 155 -136 291
4711 291 87 -43 80 186 -66 64 109 66 -17 23 341 -151 127 79 26 -291 -207 178 292 -3 148 -71
4733 -71 -280 50 -132 36 -340 -125 -126 97 2 81 -1 37 132 96 247 5 32 -3 229 22 -161 65 -100 44
4757 44 120 21 107 -145 186 -236 -210 5 97 149 16 -129 77 -71 -14 -81 52 -140 8 17 21 -198 -168 -185 121
4782 121 19 -175 -248 -69 -45 -28 220 109 5 175 124 251 46 19 -5 -35 -93 -24 -207 179 -91 -54 -3 -106
4806 -106 -185 -244 -179 -207 6 -61 -2 -10 -102 -66 -39 176 -242 146 58 155 -59 -2 -76 -173 128 116 82 64 216 -119
4832 -119 -131 -94 75 149 137 122 -63 399 -264 58 53 -51 -37 -85 -217 -224 138 -101 -18 79 40 -262 106 -230 -181
4857 -181 -142 32 -105 136 -163 59 108 -43 -150 -12 -113 162 140 -196 -197 -105 202 -174 60 -31 84 -173
4879a73J05J72l34K70J03j46J40l29J73J55K60l22L9k38J07Oooq3K38j4j0l53
4902b46J18J51K73m06J15k10N0J62j68R6N1qL2K7K16k98r1Q8J52k90j2K20j06
4925h4R8O7p8j11j5J13j51J49j19q4L58k94O7M30l51K43k87J25k01K64J5k0J18
4948B52k02k6q9K58k22j0J38j41M3P0n8J9j0l24K08J27J06j73P6J8j84j61K16
4971f9K39j68k1J30j85J40kr9qJ59L8k90L1k10M01K3j14j68K93k47J04Q5J05j90
4995b3J42n4j66p4QN48j17j80j31R3L4J49j24k40j23K51o9m7N1K80m82J9M35j24
5019E6p2j26N7J58L1L2j11j35j6J28j00q4j5K11J5O5k65K12m1J57K8j92J9M8j24
5044f4n7Q6P0P0q2k1j13K79m96M97k96O3N9K6j28M06j50k60M5J54q2j01L58K64
$$ plain form
4879 -173 -68 104 -230 40 143 -3 137 -192 -19 136 396 74 113 -125 -18 -12 -18 -24 -107 131 117 107 -246
4902 -246 -128 23 296 -110 5 -205 -155 7 -161 -65 -14 -22 10 37 253 -45 -136 -48 104 -186 -198 22 -84
4925 -84 14 81 3 -108 -123 -10 -161 -12 -131 -215 143 -151 -84 346 -5 238 -49 76 -125 139 154 134 252
4948 252 50 24 -65 193 -29 -39 99 -42 1 71 13 32 22 -302 -94 33 139 -34 42 60 -124 -285 -69
4971 -69 170 2 -19 111 -74 66 64 -35 -43 116 154 -136 -105 -315 86 109 -5 -173 120 -127 -23 62 167 -23
4995 -23 119 65 -101 -175 -167 381 264 84 -47 46 80 229 105 -135 -258 -7 -76 -123 -72 208 -274 -255 180 56
5019 56 -16 -142 -85 73 104 136 25 -110 -126 2 -98 -182 -197 14 29 94 -171 41 0 157 185 -7 12 60 -64
5044 -64 -121 -35 35 105 23 2 -111 168 -328 169 -127 -64 -5 21 -107 299 149 -111 -66 88 6 -95 263 527
5068E27p87M87j84m4k51L57lj82k08K57o0J97j29K09l63J53K54k01K5J8N8p3j0
5091D7L3n85K2O79Q7n05N14k01k26j72O27K15o14M42k59j98N48j77L55r32J05
5112a95K92J95R4n48K32pJ65k66K62m51p5O98j94j68m7R3m45P80j2m45j26R9K19
5135A50m6k37Q8J96l90K53OK12k77R4J57N3j95rl00K29k01K77m20N81j47j84M6
5158f4K07O1j48k40L13o8j91J70J52o4k29J64l66N01l68L13j81J33l64L41M8j68
5180d8j9Q5n6Q9j27K82k33p8J80k22j6L00j27k5n7J64m2k0m0j97L39j43j91K3
5204a79K77l01K10O0m65M83J65j11j82o2L66q5j77J14k96J93J58r9O3l78J76Q5
5226A5j43J57J51Ok43K19l08K41n2q7J29j53K62m6j08R4j12j0j74K18j97j8L10
$$ plain form
5068 527 -260 227 43 -1 -252 105 102 -80 -288 -31 -91 106 -23 186 -177 -24 230 29 54 72 130 57 47
5091 47 80 -505 -483 196 283 -222 292 91 -135 -307 320 535 -79 363 104 -94 454 277 632 -300 -195
5112 -195 97 292 386 -162 70 63 228 -38 224 -227 -302 396 202 34 -13 80 -365 415 403 -42 -168 -69 150
5135 150 104 -133 -45 151 -239 14 20 232 -45 49 206 259 64 55 -245 -16 -217 60 -360 221 74 -110 -64
5158 -64 143 204 56 -184 129 61 -130 40 192 128 -101 63 -303 198 -170 143 -38 95 -269 72 120 -48
5180 -48 -67 18 -38 51 -76 206 -27 -105 75 -147 -163 137 10 -15 -72 92 50 30 -10 -207 132 -11 -202 -179
5204 -179 98 -203 7 67 -398 85 250 139 -43 -105 261 176 -1 113 -183 10 168 69 132 -246 -70 15
5226 15 -128 29 180 186 -57 162 -146 95 43 -44 85 -68 194 148 40 134 22 12 -162 56 -141 -159 151
5249A51J0q3J07j55L29m69M44l11j98J43K14j47k61M27j54J0k04K62j02j60M21
5270B74k39K14m34K82k05J44L5p2J01m1J73m92K60K85p9p6l95M86j71j53Q52p14
5292C5j44J64n35J78P04n76m3j32L66L07p1L84o01J40o60R83m51M93m28l59N09
5313B63k21j60M04l9O9k94L4l16K17J51j7j75J22L8k38J02k8J30k08L85r1k2k14
5336a08o7L72k16P2j9J92l40K3o5L7K97r0l7k45J41J00j89K29l1J9j3r5K09j93
5360a7j57J61J68p0j46Q5K5j48J52P3j55L1O8Mj70J47J42k45oQJ4j53K13O4J5
5385A03J10O4j94k28J59R0l1O6m34K51K20k90j79K45J08R5j15J34j02l90L33j
5407A4k6L4R7nQj91O6K2J41M0l76J96J63k24J73l86K04P6K51m85J22J51L8l3J9
$$ plain form
5249 151 161 78 185 30 359 -110 334 23 -175 -32 182 35 -226 201 47 57 -147 115 13 -147 274
5270 274 35 249 -185 97 -108 36 71 -1 100 59 232 -260 0 285 206 130 -265 221 50 -103 749 35
5292 35 -109 55 -480 -302 402 -174 -217 -349 17 324 253 637 36 176 -484 499 48 541 113 -246 263
5313 263 42 -118 286 247 316 22 56 -260 -43 108 91 -84 38 76 -162 -60 -88 42 -166 219 128 106 -108
5336 -108 -175 197 -19 53 34 226 -114 -91 -156 -119 178 88 51 -194 -53 47 -142 87 56 75 62 -33 176 -17
5360 -17 -174 -13 155 85 -61 24 49 -99 53 126 -29 2 70 74 -96 51 193 -52 -58 -50 -36 -189 24 88 103
5385 103 213 277 83 -145 14 104 73 139 -295 -44 176 -114 -293 -48 60 155 40 174 72 -318 15 14
5407 14 -12 22 119 114 122 -69 -3 19 160 200 -176 20 183 -41 132 -254 -50 26 277 -208 -86 65 103 70 89
5432H9k81L08j06J8j68J12J58P6j49J16j83K59k07k4Q3r1L1N7k5O3M0k40m3K45
5456A38j02l0k7O1N7k84K24o0k35K05K28j1j17r5Q0k89L67j07%Q4j72J94J54j20
5480A43j89J44j66K03k20M6Q7r5N0O5m4J35n1k42R7L36m79M8L3K34j58j5K50k07
5504Ek09K39R5j64K4K70j46j30K63j72l98K17j70K93j42K30j02k67K72l0r5L20
5526B03m2O4j45j65J60k20J50J06l23J29Q9j18K73k41q5J37J69m86M02r4M6n9
5548e0K4L60k69l4j06O9K15l41J60k14L24j64O6k52L38q8l31K69P4J2j28K47j
5571A80j47J38k1L2J9j48k97K21j6K4R9k44L18Mk8J17k98J82p9j76K7%j4NM55
5596C53m11q8lr1N95k39l5j02k55J53NMK68lj54N4L4l9n42O79j30j85j5J40k8
$$ plain form
5432 89 -192 116 10 28 -140 -28 130 206 57 173 -10 249 42 18 101 10 41 98 73 136 176 -64 -107 138
5456 138 36 6 -21 40 97 -187 37 -23 -258 -53 175 164 47 -48 32 -257 110 3 3 87 -85 109 263 143
5480 143 -46 98 -68 135 -85 -39 48 -47 3 68 24 159 108 -134 -37 299 -180 -132 -99 135 -23 -38 212 5
5504 5 -204 35 130 -34 -10 260 114 -16 247 75 -323 -106 -276 17 -125 105 3 -264 8 -22 -117 203
5526 203 161 225 80 -85 75 -145 5 111 -212 -83 6 -112 161 -80 -165 -28 141 -345 57 -37 9 -50
5548 -50 -26 334 65 31 -75 -6 209 -132 28 -186 138 -26 40 -212 126 38 -293 -24 50 62 -66 181 180
5571 180 33 171 150 182 201 53 -244 -23 -39 -15 84 -160 158 162 134 251 -47 135 56 -120 -93 -93 -107 -102 353
5596 353 -58 -146 -149 -240 355 116 81 -21 -276 -123 -118 -114 154 151 -3 51 85 46 -496 183 53 -132 -147 -7 -35
5621c5k53K55J70j39r8L9j17J33J2M3j75J98J58k03j49M50k45j16mK9J32k57J43
5644b9J25n8K42l30J97l81L14K48l04k58L22M5l54K09p1R1j8r8J06L5J77l17j12
5667b19K66N4j25ON2R2k23J37j75K07k28L2J78Q7j90N9k04K3L26j60J7m4P6K01
5691B45k58J08kj50K11k07J93j59r3J04O3J56j72j27K52l1k1o5j09M60k59j78
5713c9L11j50k50j64J11J51k71K68K84j28n7j56N6L21j47Q3j91j10k46N69l47
5734a02K48n7k39L34n8K28m16K71j20k12J17J46j58r3J34R0r6K8J94l68r8O2O8
5757i7K30j96j38L14j44j96M58m52R4O2J5O7J90j07k35J58J00j44j14J73j95J29
5779b8L53m53k3J30k48M58n28M91l08J99K01n19L14m5p9J74j09j50K60j18Q5M
$$ plain form
5621 -35 -288 -33 137 -2 -100 -61 -178 -45 -33 10 -165 33 191 -12 -161 289 44 -72 -76 -47 85 -172 -29
5644 -29 96 38 280 -50 147 -234 80 328 24 -234 88 133 -221 -12 -83 8 -10 -108 -2 33 210 -107 -219
5667 -219 47 101 -24 -18 34 126 -97 40 -135 72 -156 -124 54 141 -49 10 -194 -171 155 -5 12 -32 44 245
5691 245 -13 95 93 -57 154 -53 140 -19 -112 -8 55 211 39 -88 164 133 112 47 -62 398 139 -39
5713 -39 272 122 -128 -292 -181 -30 -301 -33 251 123 66 -90 -34 287 140 223 32 -78 -324 245 -102
5734 -102 146 89 -150 184 126 354 -62 209 89 -123 -6 140 -18 -111 23 113 17 45 239 -129 -227 -165 -97
5757 -97 133 -63 -201 113 -31 -227 231 -221 -127 -65 -50 17 207 100 -135 23 123 -21 -135 38 -157 -28
5779 -28 325 -128 -151 -21 -269 189 -339 152 -156 43 244 -275 39 -6 -85 89 -20 -170 90 -28 57 61
5801F1J9j07n9O8p6L9o9L2J0l1j28K45L0j8o5r5M86j50j06J26l30K6L8J0R9j85
5827a30q6J55j33J7m6K57M4j0j92M7L09k08n4J48r1O7Q1j25k27PK77k89L40k46
5851h8NL09k44k38K27j74K88r6J08O5R9k23k01J06N6j22L25j29k04L99o8k27K07
5874A80l63K45k83L22M4m0k68K58k67K25j82J43j39Q5M1J16J00P1Q9m84M5q3J62
5897A7m43M87r4m2L49j96k40Q1q8L49k50K00j53J24N4l51L29P4l70N72k84j57
5919c2j60M69k62j60j26K05m6o9J97m2k03J12N0m6P7m1L00j21k96L62k53q3L80
5942B12l70K42n2j20q4K66l33OM41J28l20J03j28J86l0m07M33N3m00L12j49J80
5964A69m31K73K3J09k99L29j20r6N5p8J67J9j28O9r1J54l24J36K82m2j56j72K87
$$ plain form
5801 61 80 -27 -86 -18 -94 -55 -124 -92 -82 -113 -241 4 34 16 -49 -144 342 192 86 212 -118 -92 -54 -44 55 -130
5827 -130 -216 -61 -194 -177 -223 34 78 68 -124 -77 232 24 -30 118 27 94 175 50 -177 -170 107 -182 158 -88
5851 -88 -83 226 -18 -256 -29 -203 85 -11 97 162 261 38 -163 -57 -1 -123 202 73 -131 268 200 -27 180
5874 180 -183 62 -221 101 145 105 -163 95 -172 53 -129 14 -125 -40 1 117 217 288 377 -107 -62 -145 17
5897 17 -426 61 -33 -75 274 78 -162 -81 -169 180 -70 130 -23 101 155 -196 133 207 -163 409 125 -32
5919 -32 -192 277 15 -145 -271 -66 -112 -181 16 -26 -229 -117 -67 -113 -36 -77 223 102 -194 168 -85 -168 212
5942 212 -158 84 32 -88 -172 94 -239 -233 208 336 16 119 -9 177 147 -260 173 226 -174 138 -11 169
5964 169 -262 11 34 143 -156 173 53 -43 12 -66 101 120 -8 61 -30 124 -200 -64 218 176 20 -152 135
5987A35r1j23J01K59k87P0P2l40M16J04n18K62K0K8j20j79L75k21n3J80j45N6
6009AL00l65K09q1j30o8K36j29J68l0k7k50n2K63Q1k05Q8j25P6L66m23r1K61M0
6033A13K26o96L04j35J66k4J07q4J75k37K75k49J24r9oO3m3N8j47M44l98J93P6
6056B06l42J86L2j37J2k8K34k30Q0K04Q5m60M36l88M0j00J10l8k7J19m5l4J1j9
6080i3N28m06j73J02K57k1k93K6O3j06K50nq6J78k04M8n8j47j11R8n6M61l75M6
6104g7J60O1l31J16k35J84j55K38J74j31O6k69R3k0M0k1k1qJ97p7J25j75K01r5
6128D0j22j62K74K05k84L03k41j88K14k52K20J3j04J20J34k58NM6J67k46K08k
6150I0J9k92Q7L40m26J87J09J74j21l14q4o9M75j27Q6l4J7J25j83P9l35L51m64
$$ plain form
5987 135 44 -79 22 281 -6 64 136 -204 212 316 -202 60 80 108 -12 -191 184 -37 -90 90 -55 1
6009 1 301 -64 145 64 -66 -134 102 -27 141 111 84 -166 -218 45 126 -79 9 -116 -40 326 -97 -188 73 113
6033 113 339 -357 -53 -188 -22 -46 61 -23 152 -85 190 -59 65 -34 -40 23 -20 38 -109 335 -63 130 206
6056 206 -136 50 82 -55 -43 -71 163 -67 13 217 302 -158 278 -110 -70 -170 -60 -98 -125 -6 -51 -85 -74 -93
6080 -93 435 29 -144 -42 215 194 -99 -73 -10 -116 134 129 43 221 17 65 7 -140 -251 -153 -209 252 -123 -77
6104 -77 83 144 -187 -71 -306 -122 -277 -39 135 4 70 -199 -106 -126 -86 -107 -128 -136 61 -16 109 -66 135 40
6128 40 -82 -244 30 235 -49 254 13 -175 39 -213 7 20 -84 36 170 -88 -83 -37 130 -116 92 90
6150 90 109 -183 -96 244 -182 5 114 288 167 -147 -231 -300 175 48 134 100 117 242 59 138 -197 154 -310
6173c10L25j35L18k96J37N5L6k97K48N2Lk80R5J76j66k2R5j30K47o1J00L1j93
6196B8o2J46j7r9j14M6K65k20K20k96L1K62m53K07J09J27k45J99L5r4j58J19k88
6219b52K97O5k6R6j18q3P2O8k33N9m8O5j66K81O0L37j93k53n5O0J59k86L20k47
6243b1J04k2j91k35L41K84k16K0m77K10J71K06k73K65k85n3J08K43j93Q1l1J09
6265A45j0K11l46r7J49r8J34k32rRJ89k6K0j55KL11m03j38M43j67j4k4l3J05J65
6290A31k04lq4P6L92j7l44J00K1j95J76k3j88K22N7j46r0p6J34J61pr8j45k0L4
6315a36K69k26J56j40j20J23J70k99O1M0J8L74k51k88Q1M44o5j72j57n4M05j78
6337E5j21K93j51Lk15O7J55k72L14k0J9k12Q4j1k3J79k8k33J6L63l67J92n9j38
$$ plain form
6173 -310 15 -120 198 -98 39 94 130 -167 81 133 136 -144 -49 127 -39 -61 34 -96 151 90 190 221 28
6196 28 -34 112 95 -4 -118 -72 193 -27 193 -103 -72 190 -263 -56 53 180 -65 134 169 75 -83 36 -252
6219 -252 45 110 84 180 62 -21 51 119 -114 -55 -103 -38 -204 77 137 474 281 28 -27 33 192 -94 226 -21
6243 -21 83 61 -130 -365 -24 260 44 64 -413 -203 -32 174 -99 166 -119 -172 -64 179 -14 67 36 145
6265 145 135 346 0 -97 52 -46 88 -144 -153 -144 45 19 39 -116 -114 197 -206 -344 99 -68 -82 -106 -139 -34 131
6290 131 -73 -76 -160 -84 308 291 -53 47 68 -127 49 26 -162 60 117 -29 -119 -195 -61 100 93 -5 -150 -170 -136
6315 -136 133 -93 63 -77 -197 -74 96 -203 -142 -102 -84 290 39 -249 -168 276 211 39 -118 -172 233 55
6337 55 -66 227 76 79 -136 -69 86 -186 128 108 127 -85 -1 -12 -35 144 116 -117 -101 262 -105 87 28 -110
6361a10k7J89N3k93K65j85q6K74k14J56O8l22L60j14J39j88J73M9M3l34M28k37
6383H7j49j12K92j08j4j21q6K36p7J21M9J9j98J92k40L86j79o5K2j53l0K84j94
6406c8n1K09j39k44M05l8q4j64J13L24l28K0J60k86l0J59Q8J34l25n2K28q1j45
6429a65P9k9j67M78k19JQ1J80j05l57K07j69J01K17l09J36L49k69l61L26K42k03
6451D4p7o5J66J23k04J01Jj86R0j5p2J65j39R1Q6qm04K13J31K52l20j47J82P3
6475H1l90K48J1J38k19M30p0l37m6ok00K87M75m24j3K24k92J23k88L66k99K85
6497H4j72k2K08K7k09l3N1o1J90K2O5j18o9j2K17L4j28p7K01l48M6J46k00J05
6521e3J55j75J20m2J19o7N1o5J15j5j62k76M61l72J26%M3j70K66j91K69k10j6
$$ plain form
6361 -110 -137 52 105 -188 77 -108 -194 80 -134 22 90 -232 128 14 153 -35 138 187 230 -104 324 87
6383 87 -62 -174 118 10 -4 -125 -211 25 -52 69 118 137 -61 131 -109 277 98 33 55 -98 -128 156 -38
6406 -38 -89 120 -19 -263 142 104 20 -144 -31 293 -35 -15 145 -141 -171 -12 76 210 -115 -167 61 -20 -165
6429 -165 -86 -115 -282 196 -23 -22 59 239 134 -223 -16 -185 -84 133 -176 -40 309 40 -321 5 247 44
6451 44 -33 -98 68 191 -13 88 89 -97 -7 -22 -94 71 -68 23 109 101 -303 -90 41 293 -27 -174 8 81
6475 81 -309 -61 -50 88 -131 299 229 -108 -154 -160 -360 -73 402 -22 -35 189 -103 20 -268 98 -201 84
6497 84 -88 -110 98 125 -84 -117 -66 -127 63 85 150 32 -37 -49 168 202 74 -3 198 -150 -104 42 -158 -53
6521 -53 102 -73 47 5 124 57 108 43 158 143 -19 -295 166 -206 -80 -80 -37 -207 59 -132 137 -73 -89
6544h9m9K24O1k50JK42N8l53K17pk6M8m4O5K7k77K01MO9j31N3j1J43o8k07O2k8
6571f5j78L57l73L23P8k95J0M16k6l58J66k09J17J22j71j09K20L9k00K2J55J79
6593B20k94k65L71j39J54N2k52pJ66j13Q8k02M19k70K51l54L57k36K18k79L2L57
6615B74j68O3j15j81J6J84J53j21k21o7J47J20j24J07j62J2J37m9J42J7j38l6
6637a0l95M01J13j31k59L57j17J23j08n6J03PJ14k54p2J92j35nL32k79L69l81
6659i1J37K2m9k79P6J11J35m2m33L80J33j04j5QM5M2j46k42K16L9j76Q4K5J13
6683a1j7L17j72R9k90l1K49j07J6p1j73K23l49M78l96K71q2j17K53n6rK92l68
6706e1L1q2k99M59p0J37k37m2NJ12J38k58M43l47L15n8j35J1j08M9k07J99j93
$$ plain form
6544 -89 -138 86 147 -103 -102 140 198 -155 62 55 29 77 33 98 125 -152 49 53 122 -9 44 33 176 108 -99 -37 -65
6571 -65 -243 114 -259 64 142 -153 -143 273 247 -111 55 -154 -37 85 -86 -195 25 64 -136 -114 41 220
6593 220 -74 -339 32 -107 47 99 -153 -160 6 -107 -19 -221 198 -72 179 -175 182 -54 164 -115 -83 274
6615 274 106 169 54 -127 -111 73 226 105 -116 -183 -36 84 -40 67 -95 -83 54 5 147 164 26 -10
6637 -10 -405 -4 109 -22 -281 76 -41 82 -26 -82 21 28 142 -112 -184 8 -127 -132 200 -79 290 -91
6659 -91 46 68 19 -260 -184 -73 62 20 -413 -33 100 -4 -19 -11 34 76 -70 -312 -96 -57 -233 -149 -124 -11
6683 -11 -28 289 117 216 -74 -105 144 37 53 -18 -191 32 -317 161 -235 36 -46 -163 90 34 25 317 -51
6706 -51 -20 -102 -401 58 -12 125 -112 -154 -149 -37 101 -157 286 -61 254 196 61 72 -36 13 -194 5 -188
6729a88K35P0j45q9J09Q2j45mK64q2n2m8n9l0J14n7p2J16j81J81J62p8j04p5J6
6754f0J80L9k34m8LJ59j1k14K24m40N39j23rlK3J16k73J4M36m14L4J55l3l02J52
6779i0O1J44k19Q2QJ51j85J08OJ11j06j63L3J48j87K13k25L51j39j39J93l8j92
6802g4J16rM0j69K4q3J80K30l19M69m56Q0J2j52K15K5Pl91L20m5L53l13Jj07j6
6827f2J8l0P7o6M9K19k75M9O0P0k29NL44l68J15J64J07k88r6J06R1n0l42K36J77
6852H1j45J11q0kl13N06l07J38n6l4J84j32Q9p3J62J16Kk73k3q2J35M2Q2J12r6
6877A44j56j0lL9R1m9J67l82K07j27L54k59K7p3J06%k72M37j78j71J85L2j76q3
6901a50K80l14%K48J47J34j83p3J47m49M04l1l39K33L2K0k56J85J38n5j05k76
$$ plain form
6729 -188 47 117 -28 -117 -8 74 -71 -75 189 107 55 7 -52 -82 32 -25 -97 19 -162 19 181 103 -1 -76 -60
6754 -60 120 159 -75 -123 -120 39 28 -186 38 -402 137 14 5 2 25 141 -132 -118 318 -96 -62 93 60 -242 -90
6779 -90 -29 115 -104 -22 -14 137 -48 60 66 177 71 -92 -59 89 -98 115 -110 241 102 -37 156 118 -74
6802 -74 42 33 73 -96 -72 -155 25 255 -64 405 -51 29 41 -111 104 129 136 -255 65 20 373 60 61 -46 -62
6827 -62 -44 -74 3 -63 -14 205 -70 -21 39 109 -120 -115 229 -139 -24 140 247 -41 -137 -31 60 10 -332 -96 81
6852 81 -64 47 -33 -35 -348 158 -149 -11 -67 -101 83 -49 40 -33 129 245 247 -26 -49 -131 4 46 128 240 144
6877 144 -12 -22 -25 14 105 56 223 -159 48 -79 275 16 43 -30 76 76 -196 241 63 -108 77 109 -67 -150
6901 -150 130 -184 -184 64 211 345 162 89 236 -213 191 160 -179 54 86 106 -150 35 173 118 13 -263
6923b63K92J25k92O9J49J01L7j85j04K2L9r8m2qj52N01o2k92L6J44J29n16N05
6946A35l8k36L61K1k04N2o7M8K8R1l94L6R4J25j84K4J84k79J73K5K78m96J58j09
6970a74K13Q6p4KK1m6J72r1k12K66k41j03J50j1LJ70kk31J95q6r4p4J94kJ4J90
6996B35j60j52J90J49n31K98j69L18k12J16N5J18j96k40r7R5L1M27l08M2j74K31
7018F6k41K48k8qJ0LP2k32N5J52k17J92J90k70l4k39L23K22m5l13N32k99n4j10
7042b5M8P3j1K0L5j88N8J3J39m68L76K9j23J58p7m8K2l06L06J07K6j13j85J7j62
7067b79M88n0j3k16K41l84N05j71J04j74L9J3j73O8J85k00J41J67l73k13K37P9
7089B1j26K3L06j45o1k50J45j78L18R3j8j3N2k48M0R5J13l98L74k68K75k79J38
$$ plain form
6923 -263 29 154 -138 -69 80 181 218 33 -71 -49 -10 -108 -150 -158 -310 191 129 -163 -127 17 146 -370 135
6946 135 97 -139 222 243 39 91 24 72 100 191 -203 -167 -73 52 -132 -108 76 -203 -30 -5 273 -223 -65 -174
6970 -174 39 125 51 53 74 28 200 109 -103 163 -78 -181 -31 -42 -39 131 129 -102 93 7 -87 -161 33 31 45 235
6996 235 75 -77 113 262 -269 29 -140 178 -34 82 137 255 59 -181 -278 -183 -152 275 -33 9 -165 66
7018 66 -175 73 45 37 47 50 122 -110 -55 97 -120 72 262 -8 -42 -281 42 264 219 -94 438 139 85 -25
7042 -25 23 96 85 105 140 -48 10 23 162 -306 70 99 -24 134 57 9 31 -275 31 138 164 51 -134 -117 -279
7067 -279 209 159 146 -70 171 -213 292 121 225 51 90 103 -70 -2 183 -17 124 291 -82 -295 -58 21
7089 21 -105 -82 224 79 18 -232 -87 -265 53 146 128 115 167 -81 -41 54 167 -231 143 -125 150 -129 9
7112Ip2K9J01O5j12L2jQ1n49M21J21j25J36J17k68R6o9J96k98J90K4k33K2QJ12
7137C3M9J31k91K89k64j29K92r6j50%J21l0K60r0j89R1K06k65N7K0J39j55l2K26
7161B23m34K98p7R1R5k16l9K44l44L85k46J71q4j43N8j08J51J3J27r3j05L9J8
7184B4j05qn2O4M5N4r9j50l2K69M5k94N12l5l85J66P2J05m22O42m49K19o37M40
7208a1l05j33L52J15K18j80j88j62N73j00n1l99Q1J77j29J56J46k05L3L6p7R0
7230C7j13N4J37L0J3J7K3q3l3k35kL57l66L33j76J02k35K2J14J62j47j39j22J13
7254a37J23k57K32P1L2k82L75M0k99M52n92M71Nk05q1n1K62k81J16RK36r0p5j46
7278g2rQ3k32MO4L81k78J24K16l98J04K28q0k25o5N8k48K41M5J08M6k17k7L60
$$ plain form
7112 9 -63 -34 67 132 20 52 51 132 -417 4 125 0 136 253 -15 81 12 208 -90 100 124 -109 -87 -79 33
7137 33 82 213 -78 211 -53 -182 110 14 -136 -136 -15 -45 215 125 -64 27 233 -32 25 45 184 29 -3 223
7161 223 -211 87 10 101 196 -20 -59 185 -159 226 -20 151 67 -76 -18 -126 25 38 165 72 -33 6 24
7184 24 -81 -89 -141 -77 -32 22 -77 -227 -259 10 55 -239 273 238 -147 19 91 196 -226 416 -33 186 -451 -11
7208 -11 -316 -449 -97 18 236 56 -132 -294 279 179 128 -271 -190 -13 -142 14 160 -45 -12 24 -53 37
7230 37 -76 -22 115 145 158 175 198 115 82 -153 -155 202 -164 169 -7 95 -140 -118 -4 158 11 -128 -250 -137
7254 -137 -14 -271 -39 32 64 -218 157 197 -102 350 -242 229 234 29 -52 -103 159 -122 -6 3 239 149 74 -72
7278 -72 -81 2 -230 -226 -162 219 -59 65 281 -117 -13 215 135 -90 -155 -97 -345 -104 -59 49 95 -122 -149 211
7302B11k49K38k79J80j45K4J61j56J41j83K59m66K82j01o8K41o7j28K94j09j11
7323c1M3m5L3n2R0J00k46j40L78j25l3J53k44j6J95m4j0l8J9j74K54k42Q3k1N3
7348f0J5K3RR4k95K92m1o6r6L63k50N4J98l63N1j59K36L0K6N7L15p12l4L36M15
7373D38N3r40K94L53l61O04j042L28N34p01P44m95k06J77L24K42l10l33M90k28
7393c5j16J09l5R1m8p4J35n3q0l2k48N26Q5l54J57q2Q4J23j89K9J22m42R4K06
7417b7J35j75L54l80J11J68p4m4J26k89K36k88K96r2j06J02l75L15M1m8R6n9j36
7440a13K87j40l7J3k10K36q3K10k31J29K38m39K78k68J94j91J56L12n01K53j34
7461d1J42m50K49J81j75J88J05j36j12K49K4q6J20k77K24j58j88K78k09j2J65
$$ plain form
7302 211 -38 200 -79 101 -44 -20 141 -15 126 -57 202 -264 18 -83 -151 90 23 -105 189 80 -31
7323 -31 12 -33 0 -52 38 138 -108 -248 130 5 -28 125 -119 -135 60 16 6 -32 -13 -187 67 -175 -92 -113 -60
7348 -60 -45 -22 -13 81 -214 78 37 -29 -125 238 -12 42 240 -123 -72 -231 5 35 61 118 433 -279 -313 23 438
7373 438 491 -449 -155 198 -163 441 -601 -273 261 -440 304 -191 -397 -220 104 346 36 -297 193 -35
7393 -35 -151 -42 -77 14 -34 -108 27 -26 -106 -138 -386 140 225 -129 28 -54 30 153 -36 -7 115 -327 -233 -27
7417 -27 108 -67 287 -93 18 186 112 68 194 -95 141 -147 149 57 -49 53 -322 -7 34 -14 82 23 -113
7440 -113 174 34 -3 10 -200 36 -47 163 -68 61 299 -140 138 -130 64 -127 29 341 -160 93 -41
7461 -41 101 -349 -100 81 -94 94 199 63 -49 200 224 138 258 -19 205 47 -141 137 -72 -84 81
7482H1r4K8J07j52P0KJ81j08R8m1l09L27l16mJ84k17K6J9M17n82J87M1J12J37
7506A94n24L53J97l35J58j59L30j72J87k46L22n82lM14j53O2q1M9j39K91j58j41
7528a36K16j99J12K64m78J87P6M1k57K93j5LO5r6Q7k66P5k62K24J42l4Q7L7lk51
7553h8j25K65P1J66j61n2J30j53L9j95J36j70J37k03J93L6j91L41l57J21oK26
7575A60m99N81j57p2Q5j54K7J45k0O2l20o7J33L4L4J37J3j0p9j1R5k3P0O5k74
7600d5n6O3k07N26m61L38q7j27r8J46j18n5J71J98k59J6j8K00n9Qk19M6P6J70
7624A49j02j19J71L30p65N36j14K05m04j58K39j11L67l76Q4J77k0j78K90l71j2
7645a82L72j03ok8j95K52l33P7p0l9K88k86K16j34M0M46l69Q6J34k6J7o6On6m5
$$ plain form
7482 81 -13 15 122 -30 40 42 223 115 213 172 -137 190 -126 -130 54 -163 -137 -118 299 -283 -96 -55 57 194
7506 194 -330 23 220 -115 43 -116 214 42 229 -17 305 -277 -280 134 -19 43 -38 11 -128 163 5 -136
7528 -136 80 -119 -7 257 -221 -34 42 83 -174 119 104 107 172 76 163 -103 -28 -290 -66 76 42 129 166 163 -88
7553 -88 -213 52 123 289 128 76 206 53 92 -103 33 -137 0 -203 -10 26 -165 176 -181 -60 -66 160
7575 160 -339 242 85 13 98 -56 -29 116 96 158 -162 -229 -96 -62 -28 109 122 112 33 22 117 94 164 229 -45
7600 -45 -101 -38 -245 281 -180 158 71 -56 -154 -8 -126 -181 -10 188 -71 -55 -73 127 68 76 -143 -97 -21 149
7624 149 47 -72 99 429 -336 200 86 291 -113 -271 -32 -143 224 -152 -68 109 89 -89 201 -170 -182
7645 -182 190 87 81 53 -142 110 -223 -146 -216 -255 33 -253 -37 -171 -131 315 -54 32 166 140 157 91 97 41 -4
7670dM1J36j8m1k73K12J27m31J62L08l43R3R4K12k66j44J45K26l05J76k09J34
7692C2Jj77N3K84j70J1L2k05M18k22n6K5L31l28k18M34j41k62J4J22K19r6j36
7715c5q0J54j86J28J26q3p2K13j84Q6kk49M63m53L13l29Q6J72j5R4L5r9j43j04
7739a64J17K03j89q1O7J65k89L63j25l61M21j46J14j37P9j67JL89l67J03k47J73
7761g8J23l71K73J23J58k12K0k10K34J8J1j12j5k7k3J53r4n9m7J90j61J17j79
7784a68q2J80J55j54O1J82j79j14J59K38k47J70l59J81k0j2O7j35J19k86M17k05
7806c2m6k1P7n5J40l0J1J6j0j97J62L0j09P4m4o9J98k21J23O1r9j4l5N5qR4K3
7833G4Q6j32R8k97N7J64n3k73J59Q1K99k13k85L59j73j27K37j24J8j81L59k53
$$ plain form
7670 -4 37 173 155 114 -159 53 180 -251 -89 219 -124 -31 63 275 9 -135 10 236 -69 107 -102 32
7692 32 33 -144 -91 193 23 34 66 -139 279 57 1 26 357 29 -189 245 104 -158 -144 -22 197 101 -35
7715 -35 -115 39 -147 -19 107 24 -48 165 -19 67 65 -184 279 -174 139 -190 -104 68 53 147 182 83 -60 -164
7739 -164 -47 156 -33 -114 -47 118 -171 192 67 -294 127 -19 95 -42 37 -130 -129 260 -107 -4 -251 -78
7761 -78 45 -326 -53 70 228 16 36 -174 60 78 89 -23 -38 -65 -88 65 -29 -88 -135 55 -106 11 -168
7784 -168 -250 -70 85 -69 -8 174 -5 -119 40 278 31 201 -158 23 3 -9 58 -77 42 -244 173 -32
7806 -32 -78 -99 -22 -77 63 33 44 60 50 -147 15 45 -64 10 -34 -103 95 -126 -3 58 -41 -55 -90 -35 -43 51 74
7833 74 160 28 126 -171 -114 50 -3 -276 -117 -36 263 50 -235 124 -49 -176 61 -63 -45 -226 133 -120
7855a20p6J68nN9k08L09l22K96J59k02j5j97K20k04l5J79K49l98Q9j0L8k39L03
7878C8j27R5J2J6P4o0j71j43M21k33J84j17J27k06J57J65J0k58L8k64K83o6J60
7901A35l62L42j28l2p4L22j89O4r6l41M64j58J02j50K57k9k11O2l8O7K30k09j86
7924a58Q4rP6K10l68O7l2nJ13K5J58j34k5j04r5L12j29J40j63j25M73l77J30j56
7948i2K96j15j89P8j43K26O1m10M21o3l56J32k07M50j20R0K14k74jj11m7K38j75
7971i7J91j99Q3J71J3N0j11k92J25K42k89K28q5q1J27Q7j27o5K4Q7j63Q9q7N3
7995b6j90J80K43l84J52O6O9N4j4k13n4k5J56K9J35l71R2J26j43K90m6K8l2l56
8019b34M26Qj75q4N1j37O9p3J21p7J26p1j80K23p2j5pk49M52j05J82l31J29j77
$$ plain form
7855 -120 -196 -28 -33 26 -182 127 -195 101 260 58 43 -154 66 -138 -173 6 255 -143 -54 -64 -26 -265 38
7878 38 -89 6 18 34 108 48 -123 -266 155 -78 106 -11 116 -90 67 232 242 -16 22 -242 41 -25 135
7901 135 -227 115 -13 -45 -119 203 14 78 -18 -359 105 -53 49 -101 156 127 -84 -22 -60 7 237 28 -158
7924 -158 -74 -83 -7 203 -165 -98 -130 -135 -22 3 161 27 2 -102 -197 115 -14 126 -37 -162 311 -66 64 -92
7948 -92 204 89 -100 -22 -165 61 122 -288 133 70 -286 -154 -361 89 -31 59 273 -1 -2 -113 -160 78 -97
7971 -97 94 -105 -22 149 162 212 101 -191 -66 176 -113 115 30 -51 76 163 36 -29 -5 82 -81 8 -79 -26
7995 -26 -216 -36 207 -177 -25 41 110 164 150 -63 -117 -142 14 43 178 -193 -101 25 -118 172 126 154 122 -234
8019 -234 192 200 25 -59 -8 -145 -76 -149 -28 -105 21 -50 -230 -7 -79 -94 -101 -350 102 -3 179 -152 -23 -200
8043b00J98j07J05J29k31J72K42m46K93J5o25O27j6j39l30J39M9K10M1p6j09Q6
8065B7Q1k38J29L5J54o7l0k06K71j58Qm6K9R0M5j27j18J93j5J49p6l9q5k42L39
8090A03k81K62N5l8o6k48M43l59r1L95k02j79M48p2j07k32J62j48p9K89J11k32
8112f6j99p4N36r4j91k3L22k86n8J29K2j64J73J26j6k87M57l61j75O22l58J67
8134B02k81J41j34J87k21N0K55J5m60K49r4J14K13k41k25K2K78j04Q3k1o5k20
8156b57L73qJ45j15l27J36j53K5j1K16k47J7L79j18m11L71j90L66m80N22l37J25
8178B1p5K11k16mP4j02K6o4K26j07J26q0Q1
$$ plain form
8043 -200 -2 -109 -4 125 -106 66 308 -138 155 170 -455 172 156 17 -313 -174 -125 85 126 50 -59 27
8065 27 108 -130 -1 34 188 121 91 -115 156 -2 6 -40 -11 79 124 -3 -121 72 57 206 130 91 6 -236 103
8090 103 -178 84 139 101 35 -213 230 -129 -220 175 -27 -206 242 170 63 -169 -7 -155 -234 55 166 -66
8112 -66 -265 -339 197 103 -88 -111 211 -75 -133 -4 18 -146 27 153 137 -150 307 -54 -229 393 35 202
8134 202 -79 62 -72 115 -106 -56 199 214 -246 3 -91 23 236 -5 -230 -208 70 -34 49 28 -37 -257
8156 -257 116 108 253 138 -189 -53 -206 -181 -192 24 -223 -206 173 55 -356 15 -175 191 -289 233 -104 21
8178 21 -54 157 -59 -63 11 -91 -65 -129 97 -10 116 36 117
8191A17
$$ Imaginary data points
##PAGE= N=2
##DATA TABLE= (X++(I..I)), XYDATA
0@%%%%%%%qJ6j6K4l2L2m0N6p2Q8j04J28j60J92k27K70l23L83m46N19o03O93p96
30d26R14j044J188j348J524j719J935k168K423k707L017l353L721m125M567n050
46b651N575o148O777p468Q228r064R988j1017J2165j3455J4920j6595J8528k0791
60a1008K3487k6763L0842l6081M3097n3037O8299r4953J54620n23470K08436J116021
72H99490n90743q11873Q2225O48292L9052k06566j14993r1744j07353L52452L42414
83D40653l10384o03275J53197O82069J05804o66917k88492M67882L87078k12712
93A54903k95948k1574J03353R4212J37789n9942l16475m0326M14433J31818l77424
104g5181j66937K74168R3900j96431L6515J89636j80148k21300K89713K82977
$$ plain form
0 0 0 0 0 0 0 0 0 -8 8 -8 16 -16 16 -24 32 -40 48 -56 72 -88 104 -123 147 -176 207 -239 280 -323 370 -426
30 -426 488 -556 632 -716 808 -911 1024 -1144 1279 -1428 1589 -1764 1957 -2168 2399 -2651
46 -2651 2924 -3224 3553 -3915 4313 -4751 5237 -5780 6385 -7070 7850 -8745 9783 -11008
60 -11008 12479 -14284 16558 -19523 23574 -29463 38836 -56117 98503 -424967 -216531 899490
72 899490 308747 -503126 -420901 227391 266443 59877 -55116 -146860 -254213 98239 440653
83 440653 130269 -473006 -319809 362260 468064 -198853 -487345 -19463 367615 154903
93 154903 -141045 -162619 -59266 34946 172735 112793 -203682 -244008 170425 302243 -75181
104 -75181 -242118 32050 125950 -70481 -33966 155670 -24478 -245778 43935 326912
114C26912l32553l60073K75803M00134j78600l63044J24422K77656j21624j70593
124a21560J66835Q2299k68922o5188L99594J37652m85580k42344M79359L16894
134C99039m02203l52757K79558L23544j56967k07928R0114M0278r1326J06739
144B8091J35846j88140j97197K05869K68053j63900l02301R0270K60086l0510
154A06167j72081M19Q2584m862j0121M9598m3407j22064O7743J76777p0777j92320
166a32344P4115K03365p4163k20837P7499K35144r1278k41352R8397K36558q0898
177H4206k13704N3481J63210n9325j00642R9062L5402j55349J4816K19264j4931
188A25490k75232l6256L00430J06537k73417j50017K02430J57411j06309j30068
$$ plain form
114 326912 -5641 -365714 -89911 310223 131623 -231421 -106999 170657 49033 -121560
124 -121560 45275 127574 -141348 -206536 193058 330710 -154870 -397214 82145 399039
134 399039 -3164 -355921 -76363 247181 90214 -117714 -27600 12678 -78648 28091
144 28091 163937 -24203 -221400 -15531 252522 88622 -213679 -123409 136677 106167
154 106167 -65914 -65495 17089 12227 2106 51704 8297 -113767 -46024 130753 59976 -132344
166 -132344 -58229 145136 70973 -149864 -72365 162779 71501 -169851 -71454 165104 84206
177 84206 -129498 -76017 87193 27868 -72774 26288 61690 -93659 -78843 140421 125490
188 125490 -149742 -185998 114432 220969 -52448 -202465 -35 157376 51067 -79001
198g9001J7927N8233J8025M0500Q42j29714n2093J76488J12625j71411j71621
209a79200J27087K06851o8019j87798K7586J23874r493m3695J4714k5253n1476
220f4822O5975J07630p9211j58391O9427J73620m6764j58554J7267J29392L314
231E8883r5404N710O6766l4147m4345O3111L6941p4881m6320P8573O2331q2770
243e552o8455P9112N1003p4146k5057P1385N592q1065O112J02107j5164j16933
255g1061K0594J13797j2974q9909K377O2493j357l8452J7889J6041m9216j089
267c0867P4455Q26q8767k2247R2188N0094q8039o5727P5465O2701m8077m4420
279c2415K2345K2897j1751N635K2149l8903m1276O4852N5226p3210o8233N8189
$$ plain form
198 -79001 -61074 -2841 15184 55684 56526 -73188 -125281 51207 163832 -7579 -179200
209 -179200 -52113 154738 86719 -101079 -73493 50381 40888 -2807 11907 -13346 -64822
220 -64822 1153 108783 29572 -128819 -59392 114228 67464 -91090 -73823 55569 58883
231 58883 -36521 -30811 35955 1808 -42537 20574 57515 -17366 -63686 14887 77218 -5552
243 -5552 -74007 5105 56108 -18038 -43095 28290 33882 -47183 -41071 61036 45872 -71061
255 -71061 -50467 63330 50356 -39553 -37176 25317 23960 -14492 3397 19438 -29778 -30867
267 -30867 43588 44414 -44353 -66600 25588 75682 -12357 -78084 -2619 60082 12005 -32415
279 -32415 -10070 12827 1076 6711 28860 -10043 -51319 13533 68759 -4451 -72684 -14495
291a4495P7032l7911p8866K3029O4211j3672l4589Q439O903p516J0152K1383j3502
304A0598m5197J5910O4995j5382p1177N316O4516P487n7879j6681N0845Q633l7446
317a5462P064K0753j9392p420K6738Q980l3226j5233M3489J8490m6998j5568L9442
330A1657J3290k8324j8048K1692J7927k5213j0773K5867r21k1730P295J9413o028
343F104k1730Q243K9040j4719k7550K2458J9267k1376j3588J6499J3297j6639
355f94j6398K0591J0730k3387l954J6794J977r192m557R539O192j3364K235J5376
369A1888j1318j1345J4288J2071j0880k0055Q042K6280j0061k6028O754J4847
381D483Q94l757q918j109O148N875P002j0950j6478J4516K0080m881j7692j0758
$$ plain form
291 -14495 62537 24626 -54240 -31211 33000 19328 -15261 -6822 81 -7435 2717 24100 10598
304 10598 -34599 -18689 46306 30924 -40253 -34937 29579 37066 -20813 -37494 13351 21984 -15462
317 -15462 -8398 12355 -7037 -14457 12281 21261 -11965 -27198 16291 34781 -12217 -27785 11657
330 11657 24947 -3377 -21425 267 18194 -7019 -17792 8075 7154 -14576 -7281 12132 6104
343 6104 -15626 -7383 21657 6938 -20612 1846 21113 -263 -13851 2648 15945 -694
355 -694 -17092 3499 14229 -9158 -13112 3682 5659 -3533 -8090 1449 7641 -5723 -3488 11888
369 11888 570 -10775 3513 15584 4704 -15351 -7309 18971 8910 -17118 -10364 4483
381 4483 5377 1620 -7298 -8407 -2259 3616 10618 -332 -16810 -2294 17786 12905 -4787 -15545
395a5545J5173J8399j1676j3726k00J022J2464R832j7263j9338O022K8300O870
408B0334l2746j0796L0310R930j4911o604J86M336K008Q92P130p442j4373P318
422d428J5117L46j9767j6487K4848K5419k5137k0755J9919J3405j2667j0921J2177
435A069J1017j4583o319J8988L008j2675j0332j413J8929R346k6491j0800K7149
448F893J4283k5390k2486K4549K2889k8354j3721L2075R850k3435j0493J4151
460H11J6321j3363k4384J3484L0235n663l4700m487M2551M359n7386k421O1941
473B7298J895n4205r07N0736M638n2481r176M8919J0373l5099j0941K5969K2386
486B9405k1982l9074J6928L9549j7602l4474K1407L8253k3820m7750K9012N0142
$$ plain form
395 -15545 -372 18027 6351 -7375 -7575 -6553 5911 15743 -1520 -20858 -14836 13464 20334
408 20334 -12412 -23208 7102 17032 2121 -4483 -4297 39 2047 2939 10069 2627 -11746 -4428
422 -4428 10689 11035 -8732 -25219 -371 25048 -89 -20844 -925 12480 -187 -11108 1069
435 1069 12086 -2497 -8816 10172 13180 505 -9827 -11240 7689 17035 -9456 -20256 6893
448 6893 21176 -4214 -26700 -2151 20738 -7616 -21337 10738 20588 -2847 -13340 811
460 811 17132 3769 -20615 -7131 23104 17441 -17259 -21746 20805 25164 -32222 -34643 27298
473 27298 29193 -25012 -25919 24817 29455 -23026 -32202 16717 27090 -8009 -18950 7019 29405
486 29405 7423 -31651 -14723 24826 7224 -27250 -5843 32410 8590 -39160 -10148 39994
498C9994l8544n1176L8237N8881j3418o0207j4482N4479L2493m2999m8701K1943
510b3500O0020k97n6881k974L9155j6129k5780L5443K0966n0341k9402O8227N7724
523G6231p0615q5988M5775R5094m479q9002l2622Q0680N7935o1886o4544L0897
535b2524M3924j8866j9352L5501O326o1111J680Q1404j503r3647k0443Q9200N6401
548G6990n9927p0619K6710O1703j307m9810k2640L7988L0180k7162j2826K7727
560A7007j1089m3279J2704N8947K40p0237j1331P7786L0039o2713n0409K7905
572b4430N7724J513n3148j1012M4925J2492l4987j0549K8032q330m3264K9702
584a1332P0166l5359q4870K8631Q8758j1204r1271j4429Q3111L7129n1381l8090
$$ plain form
498 39994 1450 -49726 -11489 47392 33974 -26233 -40715 13764 46257 3258 -45443 -23500
510 -23500 36520 36223 -20658 -23632 15523 -606 -26386 9057 30023 -20318 -49720 18507 76231
523 76231 5616 -80372 -34597 60497 56018 -32984 -65606 15074 73009 11123 -53421 -22524
535 -22524 21400 2534 -16818 18683 25009 -36102 -34422 46982 45479 -48168 -68611 20589 76990
548 76990 17063 -53556 -26846 34857 33550 -16260 -38900 -912 29268 2106 -10720 17007
560 17007 5918 -37361 -24657 34290 34530 -35707 -47038 30748 60787 -1926 -52335 -24430
572 -24430 33294 34807 -18341 -29353 15572 28064 -6923 -17472 10560 2230 -41034 -11332
584 -11332 58834 23475 -61395 -32764 55994 44790 -46481 -60910 22201 59330 7949 -30141
596c0141J7678L0321k880k7808r47J7666r182j883L1182K669n0601k5121N4235
609E188M4579m9176m9703M0968M9053j4377l7122j5742J6339K4505j20j7174o261
622i043J2610M838j4275N825J4525k9943k2587M5716L5322l6121m2064J8844M3172
635B6819n096l5940o594J6123J6510P975j2667j3070j674l941J1488K2983j8317
648D599m0922J3617O0205O729p0147k7858N7142L3036k8693k3754K127J4635K0105
661B0821J344k7140k4097J3823L6664L032k7953j5533N811K3974J5884k9615l3617
674c6602K0351L8954J635l0039j5268J6832J7337k11j1682j9620O026L1302J55
687A9170k5208l890R281J796J48R16n682r836J0204K1236j1394k2612Q471J3021
$$ plain form
596 -30141 -12463 17858 14978 -12830 -13777 3889 -5293 -7176 24006 26675 -23926 -49047 5188
609 5188 49767 591 -49112 -8144 40909 26532 -10590 -26332 -9993 14512 14392 -2782 -9043
622 -9043 3567 8405 -5870 -45 14480 -15463 -38050 7666 42988 6867 -35197 -16353 26819
635 26819 21723 -14217 -20811 -4688 11822 19797 7130 -5940 -7614 -11555 -67 22916 4599
648 4599 -36323 -22706 37499 44228 -25919 -53777 3365 36401 7708 -16046 -13919 716 20821
661 20821 22165 -4975 -29072 -15249 21415 24447 -3506 -19039 -13228 10746 26630 -2985 -36602
674 -36602 -16251 22703 24338 -5701 -20969 -4137 13200 12989 1307 -18313 -12287 19015 19170
687 19170 -6038 -9928 -647 1149 1297 2213 -3469 -13305 -3101 18135 6741 -15871 -7400 5621
701E621k629j642j882n26L290K859J256o470p037M888L337J990L177j0912n534
716a0214J3691M271j1501n892M879Q394J319l416l85n652J519J3551n282j4447
730i165M655J1032J122o395p234K260N682m97j829n754o30J1937Q13j0104n48
745d655L084N082K654q222k689O769M945n91r434n207J1927M233r466m102O23
760e049N389O073o589p261J514O549P640n981j1438O178J0503n76n252p430J975
775c755J0445m39o496m538o51R428K850j0960l499M445N110L594p153n420O528
790e11M063R69m010n229N325N510m310j475j478j826O140K31o142q01J507L496
806A459O0o396K642M056l399J418J539k661K431R35j105Q80k317Q92L426m283
$$ plain form
701 5621 2992 1350 -532 -1058 2232 5091 6347 -123 -7160 -2272 1065 3055 6232 -4680 -10214
716 -10214 3477 7748 -3753 -9645 -4766 3628 4947 1531 1146 -4506 -2987 10564 5282 -9165
730 -9165 -4510 6522 7644 1249 -5985 -3725 1957 1460 -369 -6123 -6753 5184 5997 -4107 -4655
745 -4655 -1571 3511 6165 -2057 -4746 2023 6968 6377 -3057 -8264 3663 7896 -1570 -5672 -5049
760 -5049 340 6413 -176 -7437 -5923 626 8266 2285 -9153 -2975 7528 6952 1700 -5730 -3755
775 -3755 6690 6251 -245 -4783 -5434 3994 6844 -4116 -7615 -3170 1940 5534 -1619 -7039 -511
790 -511 3552 4521 511 -4718 607 6117 1807 332 -1146 -2972 3168 3399 -2743 -3544 -2037 1459
806 1459 1519 -4877 -2235 1821 -1578 -160 1379 -1282 1149 2084 979 1859 -458 434 3860 -423
822d23j134K583j958R47l26k766L001o78k854M970o01l832J532K694L436l210
838A381o093O522M033n976J82J457l886K040K487r4m611n551P224Q434p691o754
854f896K386N450N631n025o671L632L203K033L088p464o506N955Q287N53j2719
869e063p284J4514O776j1135l253K895K88K892L547q64q460m771J5630R216j5771
884h43r890Q510J1180J54j2836m954Q987K835k054K72l921m017L489P387L420
899G719j2236r317J5094J1638q667q686j382N332Q132o25p497r282L178J8758
913A2159k09k2166k249J4448L431n159l108J265k746j008J4740M911k4174j0023
927a9888K4485J9122j5740k8572P198L3174j720k9891l609J8468M043j1028J479
$$ plain form
822 -423 -1557 1026 -932 15 -311 -3077 -76 -754 -3608 1362 761 -3071 -1539 1155 4591 1381
838 1381 -4712 1810 5843 -133 49 1506 -2380 -340 2147 2053 -2558 -8109 -885 7549 -142 -6896
854 -6896 -4510 940 6571 1546 -5125 -1493 1710 3743 6831 -633 -7139 -1184 7103 7656 -5063
869 -5063 -12347 2167 8943 -2192 -5445 -2550 -2262 630 4177 3313 -5147 -9918 5712 14928 -843
884 -843 -10733 -2223 8957 9111 -3725 -8679 308 3143 1089 1361 -2560 -6577 -3088 4299 7719
899 7719 -4517 -13834 1260 12898 4231 -4455 -5837 -505 7627 7002 -495 -9777 -6599 12159
913 12159 11950 -10216 -12465 1983 5414 255 -2853 -1588 -4334 -5342 9398 14309 -9865 -19888
927 -19888 4597 23719 7979 -20593 -13395 19779 18059 -11832 -15441 3027 7070 -3958 -2479
940b479J1746j2957j5936K3884K0655k7663k5912K1663L3913q527l4302o75K5075
953H485M457j1049q015k087Q582O407k615l308n938m637N806R501L760j1986j4197
968a6834J4024K2841p954k4273p231K1260K2070j5653k7765J0408K6674n988k4586
981a3007J757K2028r732k1888K5242K4082l5256k6952L6197L3215l3518m1048
993c8880K9837M5351k0582l7692J1051K6234m918k3156J967K2779n886k1456J3057
1006b294K2879j5743l0604R765L7482m437l7970N229L3639r76k1481o077O642
1019c946P132K097k805n563J100R833l637j5040Q196J0334j7203n106K6564Q284
1033B0240k7951j5793K8700K0071k9734k2357K5998K5223j3990k5531O627K5871
$$ plain form
940 -2479 9267 -3690 -19626 4258 24913 -2750 -28662 -6999 26914 18387 -15915 -16590 8485
953 8485 12942 1893 -6122 -8209 373 6780 4165 857 -5081 -9718 -3912 5589 9349 -2637 -16834
968 -16834 -2810 20031 12077 -12196 -19427 1833 23903 8250 -19515 -9107 17567 11579 -13007
981 -13007 -11250 10778 1046 -20842 4400 28482 -6774 -33726 2471 35686 2168 -38880
993 -38880 -9043 36308 15726 -21966 -10915 15319 10401 -12755 -10788 11991 6105 -15351 -2294
1006 -2294 20585 4842 -25762 -15997 21485 17048 -20922 -15693 17946 16970 -4511 -10588 -3946
1019 -3946 3186 5283 2478 -3085 -1985 7848 4211 -10829 -2633 7701 -9502 -14608 11956 20240
1033 20240 -7711 -23504 5196 25267 -4467 -26824 -826 24397 10407 -15124 -8497 17374
1045A7374j0292l0179J5184L0375j8177l0048K2383L6386k6667m4396K6391M3561
1057C1895k4931l4128K3162K8710j5933k3152J1793J3346j5210p871J7746O302
1069A1729j1261p192M228Q941m676j4199K593J3933M126n146n261L77K504k34
1083D62J103n326l061J4831O240j9372k939J7315m426k0492O637K4300q641k5851
1097a9220J5794K7616k2533k6443K1333K1751j7187j8824J8579K0484j7936j8567
1109a5153J5552J2121j5182j1800J2872J6937j0501j9221J3017J5857j7544j6138
1121a9183J7257J5957j3602j1984J8332Q631k3342m677K1605k561j7028Q169J6375
1134A3949p861j6565P655J1592j4054p108J6347L108j1953Q80J0467j327j2144
$$ plain form
1045 17374 7082 -23097 -7913 22462 4285 -25763 -3380 33006 6339 -38057 -11666 31895
1057 31895 6964 -27164 -4002 24708 8775 -14377 -2584 10762 -4448 -12319 5427 11729
1069 11729 468 -6724 -2496 6445 1769 -12430 -9837 4096 8222 3076 -2185 -1808 696 462
1083 462 1565 -3761 -6822 8009 14249 -5123 -8062 9253 4827 -15665 -9028 15272 6631 -19220
1097 -19220 -3426 24190 1657 -24786 -3453 18298 1111 -17713 866 21350 3414 -15153
1109 -15153 399 12520 -2662 -14462 -1590 15347 4846 -14375 -1358 14499 -3045 -19183
1121 -19183 -1926 14031 429 -11555 6777 15408 -7934 -12611 8994 6433 -10595 -2426 13949
1134 13949 6088 -10477 -2822 8770 -5284 -12392 3955 7063 -4890 -4010 6457 5130 -7014
1147g014j811J4628J120j2452K327J1497l7j2191m152J3034Q58j6737M738J8944
1161A2752q247j7031R220J5785j1926j8158J5311J8432j7543j1517K0866N701
1173A3645j9988m230J6740L165j7656K5J9839k773j8255L711J1984l509j1319
1186h621J668J3631m5j4009L526J3084o431j2340N570J4282m991j4781Q999J4738
1200A4280j4598j2177J4535O430j4146l678J5085K938j6869j17J7195m889j4929
1213a0940P681J1651n433q447N273Q628p259r102R253O165r718m499Q704N731
1227G688q184r693R988Q944j3000o057J4291M259j2712k540J3632J820j6911J034
1241g441J8825m808j6413P290J2841p012j2229N465J1388p887r936J0802P109
$$ plain form
1147 -7014 -8825 5803 6923 -5529 -3202 8295 8258 -3933 -8085 4949 5807 -10930 -6192 12752
1161 12752 4505 -12526 -3306 12479 553 -17605 -2294 16138 -1405 -12922 7944 13645
1173 13645 -6343 -10573 6167 9332 -8324 -8299 11540 8767 -9488 -5777 6207 2698 -8621
1186 -8621 -6953 6678 6633 -7376 -3850 9234 2803 -9537 -3967 10315 5324 -9457 -458 14280
1200 14280 -318 -12495 2040 8470 -5676 -9354 5731 8669 -8200 -8317 8878 3989 -10940
1213 -10940 -3259 8392 2959 -5488 -215 8413 1154 -7948 1305 7470 -2248 -6747 1957 7688
1227 7688 -496 -10189 -201 8743 -4257 -10314 3977 8236 -4476 -7016 6616 8436 -8475 -7441
1241 -7441 11384 6576 -9837 -2547 10294 3282 -8947 -3482 7906 19 -9917 885 7994
1254G994j1008m032Q405M846p217o623R739O784j1141l160J0000J326r083k214
1268e384R219K305j2251J52J2877m155j0728N163P938m285p618N460Q840p478
1282E5o886J0011L798r544j796P241K994p623l580Q802J265r933J041Q303k689
1297A459o664J803P860j409r853M031J0346n928p649O406N832m695o498M856P007
1312F904p629o033Q964K944q077k381O153L307o236l758Q017K048p806O04O686
1327C707p90m703p4N356J90o763J534N930m264l328L451J223k192k803K861L639
1343B974n049k133O416M6m413N76L416J080l940j273O165j156o288K770M361k741
1359H11l895Q55M553q60n673K479M306l297j688K562R39K59k302N29L249j976
$$ plain form
1254 7994 -3014 -7046 1359 6205 -1012 -7635 2104 8888 -2253 -5413 4587 5913 -3170 -5384
1268 -5384 3835 6140 -6111 -5959 6918 2763 -7965 -2802 5136 851 -6767 -1307 7533 55
1282 55 -6831 3180 6978 -2566 -4362 2879 5873 -1750 -5330 3472 4737 -5196 -4155 4148 1459
1297 1459 -5205 -3402 4458 3049 -6804 -2773 7573 1645 -6004 402 6234 1539 -4959 -103 6904
1312 6904 -725 -6758 2206 5150 -2927 -5308 845 4152 -2084 -5842 2175 4223 -3583 -2979 3707
1327 3707 2917 -1786 -1860 3496 3686 -3077 -1543 4387 123 -3205 246 1469 -723 -3526 -665 2974
1343 2974 -2075 -4208 2208 2254 -2159 -1583 1833 2913 -1027 -2300 3865 2709 -3579 -809 3552 811
1359 811 -3084 -2229 2324 1464 -4209 -1730 2576 -721 -2409 153 1092 1351 -951 -422 2827 851
1375H51j885J980L46n49l78j381J438n39j364J966j311k021L875M37k953j38J906
1392B80J729j914k013M285M15m836K129K849j909k386o09L130J747m559j726L047
1408c41J971j260l484J55O001j057n191L267L731k989l001J845L902j724n446
1423c621L050M762k604l453j543K288M934m589n112N802M838m455m299L244N416
1438D658n008m871P462M027p318k349M982K433k945n520J425N319J32l614k844
1453d031L461N021m940n987O478M869o325j871N938L017n745m816N458M689n355
1468a39l547K331M980J091q008l942R531L165j0225k768J0649M877j0429m935
1482g369J2217K161j3142j02J2036P01q580k601P212M008q430n399N403O099j544
$$ plain form
1375 851 -1034 946 1292 743 365 -1016 422 -117 -1481 485 -826 -2847 1028 1465 -1488 -1626 280
1392 280 2009 95 -1918 2367 2782 -2054 75 2924 1015 -1371 -1980 1150 2897 -1662 -3388 -341
1408 -341 1630 370 -3114 -2959 3042 1985 -3206 61 3792 803 -2198 -353 3549 1825 -3621
1423 -3621 -571 4191 1587 -1866 -3409 -1121 3813 -776 -5888 -86 4752 297 -4002 -758 4658
1438 4658 -350 -5221 2241 6268 -1050 -3399 1583 4016 1071 -4449 -3024 2295 2427 -1187 -4031
1453 -4031 -570 4451 -489 -6476 2 4871 -1454 -3325 2613 5630 -115 -4931 527 5216 -139
1468 -139 -3686 -1355 3625 4716 -3292 -7234 2297 5462 -4763 -7531 3118 7995 -2434 -7369
1482 -7369 4848 7009 -6133 -6235 5801 6502 -2078 -4679 2533 6541 -1889 -7288 -1885 4214 2670
1497B670p630J247R924k778j1676M751R189l633p657M722Q681l935r242K834O685
1512D152k912l603m01K417N089k022p788J444O736j636p468J439J1192j615j1076
1527f052M960Q872o476q250M006Q364p38p617L22O785l13o793m141N271P152n035
1543C17p451R401O584j1184o617R953N997r718m581J2405M355j1808k212O997
1557B438n28m593j38K376K637m32k516j158J812J028l469k837P403L073o838L85
1573a357N874k354m527K50K952o2o98J315l26j442K200k418o001N128N722o396
1589b140k306Q579K142r267k833R054O73r654L261R585l532o079K398J932k002
1604a89l245N5M099J530j609j946N38L558l736n760P025N196o913j488Q121n19
$$ plain form
1497 2670 -4960 -3713 6211 3433 -8243 -3492 5697 2064 -5593 -871 7810 3875 -5367 -2533 4152
1512 4152 1240 -2363 -2764 -347 4742 2720 -5068 -3624 3112 1476 -5992 -4553 6639 5024 -6052
1527 -6052 -1092 7780 1304 -6946 -2940 5424 4686 -2931 -2609 4176 3863 -2930 -7071 -1800 5352 317
1543 317 -7134 2267 8851 -2333 -8950 1003 7000 -2718 -7299 5106 9461 -2347 -4559 2438
1557 2438 1910 -2683 -2821 -445 2192 1760 -756 -1914 -102 926 -2543 -5380 2023 5096 -1742 -1357
1573 -1357 4517 2163 -2364 -2114 838 776 78 1393 1067 -375 1825 -593 -6594 -1466 4256 -2140
1589 -2140 -4446 4133 6275 -2992 -5825 3229 3902 -5752 -2491 7094 3562 -2517 -119 1813 -189
1604 -189 -3434 -3379 720 2250 641 -1305 -767 2791 -945 -6705 320 5516 -1397 -2885 5236 4717
1620D717q193J99O521k072o209N448N302p075j069M844k806l896K665L063j975
1635e36j052L942Q38m817P02K399k341j44K329o42J148N12l232k69J657j348k990
1652c844J791N746k087o034N327L958q503j974Q452P67o530J732O910j927p918
1667d134K150N828m676k839M315J765k198j249M8J255j040j469J422J688N89j413
1683D2p30L129n22m979K117M202l168k247L955J171m190j691L866J13n396K399
1699a929N803l791k854M118R60l556j101L155J672l469J07M034r96l610N80R84
1715A07O08j411j677K942J671l551r51K435Q66k400j123M144J498n315R12N151
1731C906k868l834J987L384j520l253J946L097l784j724L423k72k741R06J903
$$ plain form
1620 4717 -3476 -3277 3244 1172 -5037 411 5713 -1362 -2431 2413 -393 -4289 -1624 1439 -536
1635 -536 -1588 2354 3192 -1625 -923 1476 -865 -1009 1320 678 1826 2338 -894 -1163 494 -854 -3844
1652 -3844 -2053 3693 1606 -4428 899 4857 -3646 -5620 2832 3599 -2931 -1199 5711 3784 -4134
1667 -4134 -1984 3844 -832 -3671 644 2409 211 -1038 -990 265 -775 -2244 -822 866 1455 42
1683 42 -688 2441 1919 -3060 -943 3259 91 -2156 1799 2970 -1220 -2911 955 1068 -4328 -1929
1699 -1929 3874 83 -2771 1347 2307 -1249 -2350 805 2477 -992 -885 3149 2153 -1457 -877 107
1715 107 715 -696 -2373 569 2240 -1311 -2262 173 1039 -1361 -2484 1660 3158 -2157 -1245 3906
1731 3906 1038 -2796 -809 2575 1055 -2198 -252 2845 -939 -2663 760 488 -2253 -1347 556
1746E56R27k061m98K308l0k379J020J430p8q49r31J853K74l311L17K887j437j705
1764a707P75J917o03k362J511K817l249q05L485l74k261R43J665k71k560J88K914
1781B023j807k128K243M21j456o42N78J544j397j741L027J441l083j76J888R96
1797A731j723j778K590K165l642j582L824p5k797r12K734J384l533p70M106p05
1813A017k620R14J979n12j169j00J996l26j790R03O26q56k91L6O1L18j367Q96
1831b85O29j693N03J528j136m50J046Q22r9k013J227K856k603k211K897J026k184
1848a40j182J230J803k218k077L291M66k424m28J951O40p83j816K142J835k797
1864e07m1J561K90j146m89P57M45j769j9K066j693j036J356P8m25p4R56O61j958
$$ plain form
1746 556 1483 -578 -1076 1232 1202 -1177 -157 1273 1195 346 -585 1268 1542 -1769 -1452 1435 -2 -1707
1764 -1707 -932 985 382 -1980 -469 2348 -901 -1706 1779 1405 -856 87 1752 1481 -1079 -891 2023
1781 2023 216 -1912 331 752 -704 -1346 -768 776 -621 -2362 665 2106 -977 -1153 735 1731
1797 1731 8 -1770 820 2985 -657 -2239 1585 1510 -1287 -2199 535 1919 -1614 -2384 1722 1017
1813 1017 -1603 -689 1290 778 -391 -491 1505 1179 -611 292 918 62 -229 -193 -132 186 -1181 -285
1831 -285 344 -1349 -846 682 -454 -904 142 964 865 -1148 79 2935 332 -1879 1018 2044 -140
1848 -140 -1322 -92 1711 -507 -2584 707 1173 -1251 -1679 272 912 129 -1687 455 2290 -507
1864 -507 -548 1013 1303 157 -332 425 870 -899 -918 1148 -545 -1581 -225 -147 -572 -646 310 971 -987
1883i87J6K957j021k683J912J646p32k030q4K669o90l199J236K417j318j476J2
1900a355K345M99l615N15L718j024k471M26K660N06k961p11L265m02l113J114
1916f04J140Lq50j363J404P81j310k19N98M93J500j807j015K568K53k402l98J931
1934G03J318j905j801J898J768k697j212R05J868J93k840L64L535p71l668R71
1950a371L127M52l874mM933r24m756R30L385q96k511m21K690R87l172n60K392
1967D07L77q38k282J357L975j697l740K389K816j816l470J507M175j537m281K242
1983d16K456j862j781J21J145J323k066j121L174J637k613k079J758L156k986
1998a54l276M766K462m111j379K192P91k117j627K283R59n00k77o90j52K175j734
$$ plain form
1883 -987 -971 1986 965 -1718 194 1840 1108 -922 -1006 1663 973 -2226 -990 1427 109 -1367 -1355
1900 -1355 990 1489 -2126 -1611 2107 1083 -1388 -962 1698 2204 -757 -1468 1797 1395 -1718 -604
1916 -604 536 539 -311 -1674 -270 511 -799 -1018 -420 73 1573 -234 -1249 1319 1572 -830 -1228 703
1934 703 2021 116 -1685 213 1981 -716 -1928 -1023 845 1038 -1802 -1438 2097 1326 -2342 -1371
1950 -1371 1756 2208 -1666 -1670 3263 2339 -2417 -1487 1898 1002 -1509 -1930 760 1747 -1425 -1985 407
1967 407 784 -54 -2336 -979 2996 1299 -2441 -52 2764 948 -2522 -1015 3160 1623 -2658 -416
1983 -416 2040 178 -1603 -1482 -337 986 -1080 -2201 973 2610 -3 -2082 -324 2832 -154
1998 -154 -3430 1336 3798 -313 -1692 500 1291 -826 -2453 -170 789 289 12 -678 -830 1345 -389
2015c89k350L076K697k454j966K194K255l236l077L671J714k803q61J840R40n91
2031F60k427n00K962Rk254N8L872J048m962j603N842o07n753J978N645j794m042
2048a868Q45L453k250l534K150K269j545K60P92n15N49p70j623J271J555l50r65
2065b76N99K223j908k214J507N49j783J132R75j331P60J124k236j550J948K227
2081A746k928p42N392j23n690N73M477k009l947K268M283j516m143K693J838l111
2097i39j509J387J589N43j664n73L142l34l285l44L603K80l235j72M686p37m804
2114b366K001K478l408j512L431J292k426l88K409j142l011K350J687k720M32
2129h93L414o60k444K46O44j58j534P22J876l30r28m04L03O48j257j865L186J785
$$ plain form
2015 -389 -2739 337 3034 580 -1386 808 3063 -173 -3250 421 2135 -668 -1529 311 1251 660
2031 660 -1767 -2267 695 704 -1550 -1492 2380 3428 -1534 -3137 2705 2098 -3655 -1677 3968 2174 -1868
2048 -1868 -1023 2430 180 -3354 -1204 1065 -480 -220 572 57 606 -164 -1787 -516 1039 689 -276
2065 -276 323 2546 638 -1576 -69 480 -1303 -171 804 -527 233 1357 -879 -2429 -481 1746
2081 1746 -1182 -1924 3468 3345 -2345 -1772 2705 696 -3251 -983 3300 1784 -2359 334 2172 -939
2097 -939 -2448 -1061 528 1071 -593 -1166 1976 1642 -1643 -1987 1616 1896 -1339 -1511 3175 2438 -2366
2114 -2366 -365 2113 -1295 -2807 624 1916 -510 -898 1511 369 -2642 -292 1395 -1325 -893
2129 -893 2521 1861 -583 -337 307 149 -1385 -663 1213 883 -45 -449 -146 502 -755 -2620 566 2351
2147B351l443p27M075N56m566j020N007R4n522K636M352k963l362K493J709k652
2163i82j957K822K076k356m99J689o33o45O6M2N73K95k55J179r8j796k59J054
2181C16J90j484m35K797L33l564R29K884k977k011L309K351k784k194M116J125
2197B901m315q87M195l38l012Q46K105k23k481N5K192q99k154J089J558M54j619
2214e33j112K409O07k844M06K637r16j476R33K050j867k506K238J753k931p54
2230a906L097k52k021M0K094j014j939J701K325j997j365K212P71j628j467R75
2246c74K069j427j489J613Q59j637j189J298J413j558k036K973J768l399n66K907
2262A225L59k572r2K409L14k695M93K870j954k027J657J212j376j353J175J608
$$ plain form
2147 2351 -1092 -1819 2256 2812 -1754 -2774 2233 2327 -3195 -559 3793 830 -2532 -39 1670 -982
2163 -982 -2939 -117 1959 -397 -896 793 160 -485 -419 -377 196 491 236 1415 1317 -479 -738 316
2181 316 506 -978 -1413 1384 1717 -1847 -918 1966 -1011 -3022 287 2638 -146 -2340 1776 2901
2197 2901 -1414 -2301 1894 1556 -1456 -610 1495 1272 -1209 -1154 1038 139 -2015 -926 632 1086 -533
2214 -533 -1645 764 1371 -1473 -1067 1570 654 -822 111 2161 294 -2212 26 1779 -1152 -1906
2230 -1906 1191 939 -1082 -1042 1052 38 -1901 -200 2125 128 -1237 975 1746 118 -1349 -374
2246 -374 1695 268 -1221 392 1251 -386 -1575 -277 1136 -422 -2458 515 2283 -1116 -1682 1225
2262 1225 1584 -988 -1080 1329 1643 -1052 -559 2311 357 -1670 -13 1199 -177 -1530 -355 1253
2278A253j702r39K063K51j618j82J583O21j645q07K431O31k825k80K304j94k176
2295a231nK190P7k803O74K316j446j294J470J608j180j571J639R07j214r84J519
2312F72N30k033L78Q65k07p03m28J516k39j791J340J142j019j234P74J706r14
2329C55j724J631J600j831j335K127O04j668j621J965J855k557j472K688P34k072
2345g21p87J748Q38j604l51J596J59j737J137R23o17j128J6J191M7j410L41P57
2363C98q37ML67j62k98q0P82M84j263K93J498p47j215J048P90n16j523P79J702
2382A504j591j918K109J218k028p22J393J302j196j968J907J545j297r21N42R25
2398H04j58j568Q33J521j356j153J041Q95r23o91Q7J176k39r10N46L3mM19o27
$$ plain form
2278 1253 -449 -1388 675 926 -692 -874 709 1330 -315 -1122 1309 1940 -885 -1165 1139 945 -1231
2295 -1231 -1236 954 1031 -1772 -1098 1218 -228 -1522 -52 1556 376 -1195 444 1351 137 -847 672
2312 672 1202 -831 -453 412 205 -498 -926 590 351 -1440 -100 1042 23 -1211 -437 1269 355
2329 355 -1369 262 1862 31 -1304 823 1427 -241 -1862 103 1958 -599 -2071 617 1351 -721
2345 -721 -1508 240 1078 -526 -877 719 878 -859 278 1201 584 -544 -528 663 710 -700 -359 398
2363 398 -439 -435 -68 -230 -528 -608 174 658 -605 -312 1186 439 -776 272 1062 546 -977 -198 1504
2382 1504 -87 -2005 104 1322 -706 -1428 -35 1267 71 -1897 10 1555 258 -663 -121 804
2398 804 646 -922 -89 1432 76 -1077 -36 859 -64 -755 -668 508 269 -641 -95 -62 -66 353 -274
2417b74j45Q40K07n45p7M31M85j317o06J905r3j367j04Q70L46r05j011P88J431
2436H59r79j070P18J633k05j861M57K145j262j628J476J224j169j536M09K062
2452A273q70k054R28J255j62n59n51Q80R52j170o52Q25P83n98o39M80R64p05j636
2471a256J238O32r31p56P30J208j47j508R3R89P5k42r47R86J142r08j497J841
2489G42L4j438j82J209Q43j442r46J462M44j350k89O09N61O36j001l72Q98N32
2507I50j090n47J076N74j083o54K184j63k024k10J134K55o30o62R71P01o38p62
2525f18m6R82N39j025q93K245J63j771K10J391q06j925P22K044n83j522J073P23
2543I03j229k01j92J87Q65j20O9l14P4P55j104l56J121M8j193R54N04p76l81r6
$$ plain form
2417 -274 -419 421 628 83 6 437 922 -395 -1001 904 811 -556 -660 210 556 -349 -1360 -572 859
2436 859 -120 -1190 -472 1161 956 -905 -448 1697 435 -1193 283 1507 338 -1198 -789 1273
2452 1273 403 -1651 -723 532 370 -189 -740 140 1092 -78 -730 95 878 280 -359 121 1085 380 -1256
2471 -1256 -18 614 -317 -1073 -343 865 718 -790 -697 292 367 125 -822 164 1306 398 -1099 742
2489 742 776 -662 -844 365 1208 -234 -1180 282 726 -624 -913 -304 257 893 -108 -480 418 950
2507 950 -140 -687 389 963 -120 -774 1410 1247 -777 -987 147 402 -228 -890 81 782 144 -618
2525 -618 -664 318 857 -168 -1061 1184 1347 -424 -214 1177 371 -1554 -832 1212 629 -893 180 903
2543 903 -326 -527 -719 -532 333 213 282 -32 42 797 -307 -663 458 506 -687 267 771 -5 -386 -482
2563d82K35j75M0J04J51L12Q49j334j034J750M63k168R62J942n03j746M49J550
2581A365j209j808J069J587j107m49Q68K7k3j048l53J174J8q7k7N01M87r89j178
2600a182J369M54j522P98J112r33l43n3M49r89RJ115j70j240J876O90j905l34
2618g99J225jj063J78J761l52j629O86P32q61j078O24Q37J52q68l82J170N77j754
2637h45m62J298J413j316r52J875N10k803M43J963q08j374O86J985j220j471R54
2654a24J003j707nP88J8M9L15L54l54m37m0N25m71K9O68l31k76J2n34N73l71n66
2676h82O16J116r56p51R70J212j695j127J764J257k279L9J690J02j648j82J596
2693H42n05j457L19J799o74j026L86K17R7n03k91J050K30n74M11M35m74o78N8
$$ plain form
2563 -482 -247 -422 -382 -278 -127 185 1034 -300 -1334 416 879 -1289 -327 1615 1112 -634 -185 1365
2581 1365 156 -1652 -583 1004 -103 -552 316 343 320 -728 -1081 93 111 24 -3 498 985 -4 -1182
2600 -1182 187 641 -881 -83 1029 96 -247 -300 149 -840 -831 284 114 -1126 750 1440 -465 -799
2618 -799 426 425 -638 -460 1301 949 -680 6 738 -123 -1201 -577 260 412 -456 -838 332 909 -845
2637 -845 -1307 -9 1404 88 -864 1011 1521 -1282 -839 1124 316 -1058 -372 1613 393 -1078 -124
2654 -124 879 -828 -833 -45 -27 22 337 691 337 -100 -140 385 -86 -57 611 280 4 16 -518 55 -316 -882
2676 -882 -266 850 -106 -857 113 1325 -370 -1497 267 1524 -755 -716 974 1076 -572 -754 842
2693 842 337 -1120 -801 998 324 -702 -316 -99 -2 -505 -796 254 484 -90 321 756 282 -396 -338
2712c38O97L6j055Q00R53j364n88R95J70r21j84J296M28j795R66J304j612j136
2730a348J453R35r17p90J182Q17j444o62Q70L01p40j55L12P78o62q17R94P73j566
2749f86l8J074L89r70n65J300M54j699J75J660r02q86N79Q37r40o26O31Q68j113
2768d58m62J283J34p84J46N42k44k05m09J233k92j229N97M76O5q57j09P47M34
2787F08j471K52J212o90m84O68P00o18r87R55R94j122j100J585K88r16k98L61
2805f3O74q79j46R17l52r87P35J55%p12L41R82l78r67Q49O06n36p65O81P36q79
2826A2p72J137M81j372m67J178K81q14m81R26N30j051l10J307J71j113K75O41
2844E59L6p24rN09J10q72OP51o94Q1nJ00J71o67P09O14r96O74O0q2k06j89O89
$$ plain form
2712 -338 359 395 -660 140 1093 -271 -859 136 306 -615 -799 497 925 -870 96 1400 -212 -1348
2730 -1348 105 1040 123 -667 515 1332 -112 -774 96 397 -343 -498 -186 592 -70 -887 107 880 -686
2749 -686 -724 350 739 -231 -796 504 958 -741 -566 1094 192 -694 -115 722 -218 -844 -213 655 -458
2768 -458 -920 363 497 -287 -141 401 157 -48 -457 776 484 -745 -148 328 393 -464 -573 174 608
2787 608 -863 -611 601 -89 -573 95 795 177 -810 145 1139 17 -1083 502 790 -126 -424 -63
2805 -63 611 -268 -414 503 151 -836 -101 54 54 -658 -317 665 287 -680 169 775 239 -526 155 891 12
2826 12 -760 377 858 -514 -981 197 478 -336 -817 109 639 -412 -722 585 756 -357 -82 559
2844 559 595 -129 -138 371 481 -391 -385 366 -328 -247 -252 -152 19 -648 61 675 -321 353 413 331 125 -64 625
2867F25q5r87J11J102o56j053R71O83j033n77O82Q53n85r50J277M15j104k20J171
2886F40L25p39p31P92J025j331r03J187K23p59n34M87J032j088q4P15O1m92l03
2905d77M35N25n18q5K04m2j9O9J93l84J89K70l32p87N32N50n07j05M64K00q06
2926d31K6M25L00k47n74P39P96q09p34Q28L59n45j054L86J349r00q78J245K15
2945D96q62j83L01O27n35k67O08J88l22J3l67L14K61l13j73J66J24k23j52j9M03
2966H5m60J15K07o6j97N34l35k08Q27j31o60N29M62k25r22j02J199p86q32P92
2986a74P79q31k63K47N54m66l09N17L13n15K59L0J97L86r48o39J136L30p26k43
3006c66N48K91m08o27Q14m03n52Q30K57j58o5L5m27J70K77l89l11R03N24j010
$$ plain form
2867 625 540 -447 -336 766 110 -943 28 711 -322 -899 -217 636 51 -899 378 793 -311 -531 640
2886 640 965 226 -505 287 1312 -19 -922 265 488 -271 -805 -318 714 -374 -458 257 318 -174 -477
2905 -477 -42 483 -35 -120 84 42 23 92 285 -99 90 360 28 -759 -227 323 -184 -289 175 375 -431
2926 -431 -405 20 320 73 -501 238 1034 225 -509 319 678 133 -921 -535 814 -86 -964 281 496
2945 496 -366 -549 -248 379 -156 -423 185 373 51 64 -303 11 272 -41 -214 -48 76 -147 -299 -318 85
2966 85 -375 -260 -53 -119 -316 218 -117 -325 502 371 -289 240 702 477 -445 -547 652 -134 -966 -174
2986 -174 605 -226 -489 -242 312 -154 -463 54 367 -148 111 141 338 724 -224 -863 273 603 -123 -366
3006 -366 182 473 65 -562 252 -151 -703 127 384 226 161 196 -231 -61 216 -173 -484 419 943 -67
3026f7n52Q95j9p05j16L44K50j38o9R2K4K01l87K07K83K37m77n81J353k76q25
3047c26k45N94K55n25l22Q61K34p98M27p1o46M73J49J98J6K14m80n40Q26K11j059
3068e54k23J482O4j387L67M77n44J16n6L5J43J45J03m5q2R0l05l94J263j90p97
3089b92J71P42j01p13j6M61l46k41N45O0n94N19l7m90J9O09o16K77O21L22r61
3110f1m86J291k35j275K45R71j65l54l25M14J33m42j18K99R4j33j56M70M10k94
3130B83j098J039O29q41o46Q49O91q81n25P12l7l00P2K50k56J36L20n53M9RK2
3151g6JN5M88j5q68L92Q19q55o12L57L66L33m47q3J78O6l49m6K57J70q3n19N52
3174H1Q32j279l77J270p1m96p54J470K85j680J02P58l06m75M20L33K28j72k04
$$ plain form
3026 -67 -619 276 257 -448 -564 -220 30 -108 -177 -85 -61 140 -247 -40 243 480 3 -578 775 499 -326
3047 -326 -571 23 278 -247 -569 292 526 -272 155 84 -562 -89 60 258 274 488 8 -532 294 505 -554
3068 -554 -777 705 769 -618 -251 226 -318 -202 -258 -223 -80 65 168 123 41 131 -174 -568 695 505 -292
3089 -292 -121 621 520 -193 -209 252 -94 -335 210 270 -324 195 158 -332 -313 296 -320 -43 578 900 -61
3110 -61 -547 744 509 -766 -521 450 285 -69 -394 20 153 -289 -407 -108 -14 -147 -303 167 577 283
3130 283 -815 224 853 12 -634 215 906 25 -500 212 175 -125 -53 197 -59 77 397 -156 -107 -98 -76
3151 -76 -75 -20 468 453 -415 -23 796 -59 -671 -314 52 385 -62 -145 33 99 -250 -296 -39 131 48 -471 81
3174 81 913 -366 -743 527 456 -40 -794 676 961 -719 -617 141 -165 -640 -220 113 341 169 -35
3193c5J45N7j92J8Q2L95l7o12N34k63l06L63j42j67j81m9P35j87l04K98R5r93
3215g46O51O07q01l10O79P83q76o97Q48M47q41k80Q30J57l82l26l5K58o14K80
3235c68O73p6p3l38J52M95n34j83M26R9j59m1J87J91o92K2P07m24o79O24L25m40
3257a06l3K09J9r5l45N39q0l57K07M89l63k94K12L47mp31J4L32j74m52M76M14
3279B24l16k05J04O46o37k17M09O59n30l34L67R4l07J77L9l4n98K10P18l30n43
3300d04J70J38J78m93M98N04m06k05j03L47k50KL00O3l67l49L21L19n28k6M46
3321A55J82n68m7L46K58p82M78L32m5o03K42L14j49l99k5N87N3n39K48m7k5k39
3343b73K08Q4N4j34K54k44j19M2K63M5l13K68L7K07n57L22J95l85k73L52L8m38
$$ plain form
3193 -35 110 167 -25 -7 75 470 433 -179 355 92 -214 149 7 -160 -341 -390 345 158 -146 152 247 -746
3215 -746 -95 512 -289 -599 80 863 -13 -710 138 585 -256 -536 294 451 69 -257 -292 -34 -648 -368
3235 -368 305 229 156 -182 -30 465 -69 -252 174 273 114 73 260 451 -241 -219 488 64 -615 9 334 -106
3257 -106 -139 70 89 -6 -351 188 108 -249 -42 447 84 -210 2 349 345 -386 -372 -40 -214 -666 -190 224
3279 224 -92 -297 -193 453 -184 -401 8 667 137 -197 170 264 -43 134 173 139 -459 -249 469 139 -404
3300 -404 -234 -96 82 -411 87 591 185 -20 -123 224 -26 -24 276 339 -28 -377 -56 263 -265 -291 155
3321 155 337 -231 -278 68 326 -456 22 354 309 -294 -52 262 113 -286 -311 276 329 -210 38 -9 -34 -273
3343 -273 -65 19 73 -61 193 -51 -170 -128 135 180 -133 135 172 379 -178 144 339 -46 -319 33 71 -367
3365c67Q3J71L20m57k11O44J08n37M8L70K74m82r0K77P4j99j93M38k80P3n41O94
3387B17k93k65M6L66J08l43pJ63K74k93J43J69l42m0J59J17k82J14N4r6l34K52
3409a13K55j09l32K57J32l2k58L39L37m00j50R5L37o57J15M20J7j12o13L03O33
3430D64q76K5N42k9k89P5R9L79l10k60J27L40k96J25J16k33j50K18j98j07j74
3451d12K83J90k21L32j90q3L6K36l44L3K55M7O0R8m35K22o6J22m85J57L05J11
3473B51o98K88K31k54j89K77J78j03L5kL42k54k05O3J57J4m6l33J45J55J72l33
3495a09K06N2J8r20R93k20q2K04j50N8j78m0K79j74n7J43j87j18N87k26l49J77
3517i3K51j27k80K39p0j35r6J04K22M0P0O1l40N03m81k73K73L81j67m54K44M12
$$ plain form
3365 -367 -284 -113 207 -250 -461 183 291 -246 -198 172 446 -36 -126 151 225 26 -167 271 -9 64 -477 217
3387 217 -76 -341 -295 71 179 -164 -171 -8 266 -27 116 285 -57 -97 62 179 -103 11 65 -31 -365 -113
3409 -113 142 33 -299 -42 90 58 -200 139 476 76 -74 21 358 -299 -184 236 253 141 -472 -169 464
3430 464 -412 -387 155 126 -163 -88 11 390 80 -180 -53 287 -9 116 232 -1 -151 67 -131 -238 -412
3451 -412 -129 61 -160 172 -18 -101 -65 171 -173 -140 115 162 222 320 -115 107 41 163 -322 -165 140 251
3473 251 -447 -159 72 -182 -371 -94 84 -19 16 14 356 102 -103 -40 117 131 85 -248 -103 52 224 -109
3495 -109 97 149 167 -753 240 20 -62 142 -8 50 -128 -168 111 -63 -120 23 -164 -282 305 79 -270 -93
3517 -93 158 31 -249 -10 -80 -215 -311 -207 15 55 125 186 -154 349 -132 -405 -132 249 82 -372 -128 284
3539B84m20m69O96N6m80n6K48k47K46K71k88J68m4J56p8k33P05k62l71K31K18
3560C31l34j34K98j91l9j97M12rn31K8M64k30J87M4l13M23K82l98j12J44j8k94
3582a87J6N20k02m42L24J45m61RL32P0j21m1J91p7j26J49q7m61J024r0n12p9K90
3605A84l16m57L15Q47o89j65N03r8k31j14K53j57L66n5p9j16K31Q3l96m4K48o6
3627D7n80M11M49o25J8M22m11r8K69%J53L6N3J01m32K93J10n65K95K64J97p50
3649c43N73k36p4l49K46N87p47J66K16J90o5j59k66M58lO2j1l30M30j34n18M73
3671A66K57r20L28L06Q0j95l84L79j09r1N3K11j23K27O9o0p7n9J8l25K90J62l73
3694a70j96K22K75m37K88J32j72J47j18k50L88J57k12j29j35M49j15j60K04lk81
$$ plain form
3539 284 -136 -605 91 147 -333 -389 -141 -388 -142 129 -159 9 -35 121 43 -190 515 253 -118 113 331
3560 331 -3 -137 161 -30 -69 -266 146 137 -394 -366 98 -132 55 99 -214 209 491 93 -19 125 107 -187
3582 -187 -171 349 147 -295 29 174 -287 -278 54 124 3 -38 153 76 -50 99 12 -449 575 485 -27 -106 184
3605 184 -132 -589 -274 573 -116 -281 222 124 -107 -221 32 -125 241 186 107 -9 222 305 -91 -135 113 47
3627 47 -533 -122 327 -298 -280 142 -269 -367 -98 -98 55 91 144 245 -187 106 216 -349 -54 210 407 -343
3649 -343 230 -6 -80 -429 -183 404 -343 -177 39 229 164 5 -261 197 194 256 245 -85 345 211 -307 166
3671 166 423 -497 -169 137 217 22 -362 17 -92 -183 -130 81 -42 185 254 194 117 58 76 -249 41 203 -170
3694 -170 -366 -144 131 -306 -18 114 -58 89 -29 -279 109 266 54 -75 -210 239 124 -36 168 165 -116
3715a16k38N09j53l97K8P12j96j45p3J11j3m8j77K28J19P1k64P4j02K4O3J67l0
3738A54l19o7Q0M28n71O6K4o6pK16J33M9r5M4N9k31J03J69m05L31j50R6J33Q9
3762B63k70p3j91j0M43j87L4p9Q9J45r3m11N08M3j95L6Q5l3Qk79L13J32m91k83
3786d96N77k21j32J51K76n60M64j67L4j93J0N17l88J8o1J66O1j48K3n2K94m07
3808b34J48K53j52j25P8K78K5m53m7L44j35K9l4n1K97j91k22K33K9j99N5R7k19
3831a96o0j00M48L1J65m94N8J5N2K99j99J01j57L81l99K55k66J27p6n0J30j41
3853g6M4k35L48N0l97q7O95m51P9j1J02J3k00L42J01l8o27P7L15L04m58j25J4
3876b21J13J72q1K74j10q3J67k82no1L22J74m33M5Q9J1O3j71M6nK31l82K03r1
$$ plain form
3715 -116 -354 155 2 -395 -367 345 149 4 -69 42 29 -19 -196 32 151 222 -42 32 -70 -46 17 184 154
3738 154 -165 -232 -152 276 -295 -229 -205 -271 -278 -62 71 120 25 69 128 -103 0 169 -236 95 -55 41 174 263
3762 263 -7 -80 -271 -281 162 -25 9 -70 19 164 71 -340 168 211 16 52 137 104 112 -167 146 278 -213 -496
3786 -496 81 -140 -272 -121 155 -405 59 -108 -74 -267 -257 260 -128 -110 -171 -5 56 -92 -69 -121 173 -234
3808 -234 -86 167 15 -110 -32 246 271 -182 -229 115 -20 9 -25 -76 221 30 -192 41 70 -129 -74 23 -196
3831 -196 -256 -356 92 123 288 -206 -148 -133 -81 218 19 120 -37 344 -55 200 -66 61 -15 -65 65 -76
3853 -76 -32 -267 81 131 -266 -353 342 -109 -30 -41 61 74 -126 216 317 279 -348 -271 44 348 -110 -235 -221
3876 -221 -108 64 -17 257 147 64 231 -51 -56 -117 205 379 -54 -9 80 91 154 -17 29 24 255 -127 76 -15
3900a5j40L96k36r6J38j84J61K34j78O5n5L5l31J29K75l55M0K84qj93j75K51l35
3923b93M81k39K72m72K12L0J51k43J54M4K41n66j0M76k69j97j08L54o6M1K86k72
3945GL6q8l9P6l8K28k08L27j85p8k33L93k27j12R4L04l63Q7k31K46p1j86R7K71
3969A07k19k03J39L66j18o7J14p1j9j9q6K69j8J61r4m55J69J19j39J06Oj63J62
3992D7j48j40L29j40j50J12j37L96k64J9L91o9m70L5R4J96k50J82K12k23j46J28
4014DK22l42L40j13p5N5n2J20J28k14Q6j0n0L32l17k60J35L0k16o9K30P7q8o9
4038a16J30j22n4K44J35l17J35j30L2M2J13n2Mk71J88J08o02N06J59j64Pko3M95
4062D05m00Q0O3M9m97K16J79p4j13J20Q2J9k26l13M83j51k8p8k2K98p6l58M64
$$ plain form
3900 -15 -155 241 5 -91 47 -137 24 258 80 145 90 125 -206 -77 198 -157 -117 167 159 -34 -209 42 -293
3923 -293 188 -51 221 -251 -39 -9 142 -101 53 97 338 -228 -238 238 -31 -228 -336 18 -48 -7 279 7
3945 7 43 -45 -84 -8 -46 182 -26 301 116 38 -195 198 -29 -141 -47 257 -106 -19 -250 -4 -75 -261 -164 107
3969 107 -112 -315 -176 190 72 5 119 48 29 10 -76 193 175 336 242 -213 -44 75 -64 42 48 -115 47
3992 47 -101 -241 88 -52 -202 -90 -227 169 -95 -76 315 246 -224 -189 -95 101 -149 33 245 22 -124 4
4014 4 226 -116 224 111 36 91 39 159 287 73 159 149 99 431 114 -146 -11 19 -197 -266 -36 41 -47 -116
4038 -116 14 -108 -162 82 217 -100 35 -95 -63 -21 92 40 44 -227 -39 69 -533 -27 132 -32 -25 -27 -90 405
4062 405 5 85 148 197 -300 -84 95 21 -92 28 110 129 -97 -410 73 -78 -106 -184 -206 92 16 -342 122
4085A22n4Nj80Q6J01m4J43L1j44j24K86j07l7k04j89P7r6L28n3K93j58J67j00
4108A49l36J00L47q0l70R6J43n3k03L07j84j33J63n7L67m24j16L24m96L18J80
4129D2j88K24K13j89j73L15k95J99k25mL8K33k35L92l08J09j83j66L43j33J63
4150A72o5j26PK61l20j45K95J47k72k3J35k83K86J1k67P4j41L69l53L30J87l43
4172f4O4K3n9j53J3K42J66J4l1p1O0n47L48K13l92K92m3K1j39k5L1J71k02M1J75
4197A48j90o4K21l26L06J90j32m91K94N9N5k57O4m8K0J16K14l61K95l4Qj39RJ96
4221A53m09K57j33Q0l2K18j07j19O8j93R5m4M09m36J1L65J7l8k79K25n4o0P3O2
4245A29l58K01R9k82L75p6J38j68l93L78J91k38o8J58j01J17k11J10q2rK42l70
$$ plain form
4085 122 68 73 -107 -21 80 36 179 210 66 -58 228 121 84 -120 -309 -232 -328 0 -53 240 82 249 149
4108 149 -187 -87 260 180 -190 -94 49 -4 -207 100 -84 -217 -54 -111 256 -168 -284 40 -456 -138 42
4129 42 -146 78 291 102 -71 244 -51 148 -77 -81 -43 190 -45 347 39 148 -35 -201 142 9 172
4150 172 107 -19 -12 249 -71 -216 79 226 -46 -69 66 -217 69 80 -187 -113 -254 115 -238 92 279 -64
4172 -64 0 23 -36 -189 -176 66 232 246 215 144 204 -343 5 218 -174 118 75 96 -43 -68 -37 134 -68 -27 148
4197 148 -42 -106 115 -211 95 285 153 -338 -44 15 70 -187 -123 -171 -151 -35 179 -182 113 79 87 -52 -43 153
4221 153 -256 1 -132 -52 -84 134 27 -92 -24 -217 -122 -166 243 -193 -182 183 200 162 -117 108 54 -6 67 129
4245 129 -229 -28 71 -211 164 88 226 58 -335 43 234 -4 -72 86 -15 102 -109 1 -81 -90 152 -218
4267b18l8L47o1P1P4j72r8k17K06L44j60l60L84k09o6K23J59k81n8M8p2L43M4
4290B33p9j82m8J20n7j72Q2qO2L18Q5k24j63P9j85Q2K06j27k51lM72l32j97N13
4314B24j40K9j03p9j11M8M41m90P4K00k71K17k4j7L72n77M10r3k08N36k84j24
4336C0O2l79K15j5J04k26J75p4j46J56j8K96k78j62J57O3O3O1j1n7K44k89j48
4359a77J79l7J64k90P2K05l37J88K45j72K24j76k75J88K5O7l9j16r2K32j15K9
4381hK38m2j23j29K10l08P0J51M8j58J27j70K11p4k09J31j43j6J06r6J07M3Q6
4404E2q3Nj22K06j20J1j01K11j30J51j75R5p2K53l2j89J6Ol3M4K16n8j50j87M32
4429B46m03j43J95J58j01P6j41J36Kk17K87r6J67l80M55j0l92L84k27L0L12p3
$$ plain form
4267 -218 -256 91 30 101 175 3 -95 -312 -106 238 78 -282 102 -107 -173 50 209 -72 -130 -82 -154 189 233
4290 233 154 -28 -76 44 -13 -185 -103 -111 -49 269 354 130 -33 46 -139 -57 149 22 -229 -232 240 -92 -289 224
4314 224 84 113 10 -69 -180 -132 309 -181 -107 93 -178 39 15 -2 370 -207 203 110 -98 438 154 30
4336 30 92 -287 -72 -87 17 -209 -34 -108 -254 -98 -116 180 -98 -260 -103 -40 23 84 73 16 260 -29 -177
4359 -177 2 -35 129 -161 -89 116 -221 -33 212 40 264 88 -187 1 26 93 54 -62 -154 78 -37 -8
4381 -8 230 188 65 -64 146 -162 -92 59 107 -51 76 -94 117 43 -166 -35 -178 -194 -88 -184 -77 -34 52
4404 52 -31 -26 -148 58 -62 -51 -152 59 -71 80 -95 0 -72 181 149 -40 -24 -18 -51 -7 209 151 1 -186 246
4429 246 -157 -300 -105 53 -48 28 -113 23 25 -192 95 -1 166 -214 241 231 -161 223 -4 26 338 265
4451B65m50J34J18m04J18M6K61j10q4j48J76J89l93N57l29j91K74Q1R6n8j99j25
4473a76M22k51J7L1k93K23n1P0o2N5M8k32L56j48J48j7K75l01O0r7N7j75J3J68
4497A40j86R3R9l68J22K77l35M29l61L6N1MO4k2K00k81J17l38lJ25j8O6K88j65
4521C4j49k0J57L86o09K12J38j73J21k9j37K75j58l01M12J07l33l6R9n1J58j37
4543c4K7j58J92r7q1J09P0j36N6Q4m2oM9rj86O4J09j34K36k51Q8L1l02L14r7m5
4569a49J80p7k65K07n3J33k3R5J31j24j22J18j11j06R1j87L36j92p3J51P5M7j03
4592b1j89LL24k06J62r0KK12k75J04O9j49J16qk3K0j33J22n13N15J35nk05J22
4616H9q5%J18k55j1J72J54j47n4j10K46k40p8J27Pl0J66j29J98j9K9k70Q0K31
$$ plain form
4451 265 -185 -51 67 -337 -219 -173 88 -22 -106 -254 -78 111 -282 275 -54 -245 29 110 206 148 -51 -176
4473 -176 246 -5 12 43 -250 -27 -78 -8 -70 -15 33 -199 157 9 157 140 415 114 174 77 134 -41 -28 140
4497 140 -46 47 146 -222 -100 177 -158 271 -90 -54 -3 1 65 43 243 -38 79 -259 -262 -137 -155 -89 199 34
4521 34 -115 -135 22 408 -201 11 149 -24 97 68 -69 206 48 -253 159 266 -67 -103 -4 -55 103 -34
4543 -34 -7 -165 27 -70 -151 -42 28 -108 -52 32 -10 -16 33 24 -162 -98 11 -123 113 -138 -50 -19 -321 -7 -104 -149
4569 -149 31 -46 -311 -104 -157 -24 -47 48 179 55 -67 51 -60 -166 -75 -262 74 -118 -191 -40 35 82 -21
4592 -21 -210 -207 117 -89 73 -17 -15 197 -78 26 95 -54 62 54 31 51 -82 40 -473 42 177 172 -33 89
4616 89 4 4 122 -133 -144 28 182 35 -19 -129 117 -123 -201 -74 -67 -97 69 -60 138 119 148 -122 -42 189
4640A89l20J61M2k5J84k08l3L82j26k89LO6j85J45j12j60M00j43j51M58l39K45
4662A84l12J78O5l2k21L93k00j81M5pJ99J95n41L83l96K55J5j91m8P7L65j17o6
4685D2Q9j41k34L76l74J84J61j41L56m28j04K97r0P0P8m19L28j47K6o8j07J22
4707a24K72k12J26k94L44mj09J13l63N6J89j09Q4J17n7J51j73N7j93K00J59k63
4729c3J16J07k22R4K04j48P1Ql17O0l3M4K00k8o6j31k33K30L98l89p1L57j73j79
4753a34M5J21K22l28r0J81%q1K65n21L98l6k51O32n01p4K35M5k13L3N0K11l29
4776a20J5J42j74J86Q7j7j14n8K49l63K12O3%p5O6j42j26J39K26j54j04r5n6K33
4800B0j34J62o8K1K98l23n6O4q2J79N5r7j68K52J6o7Q3r6R4Q7j35o5j29J95k4
$$ plain form
4640 189 -131 30 72 47 231 23 -10 372 246 -43 -40 26 -159 -14 -126 -286 114 -29 -180 278 -61 184
4662 184 -128 50 115 83 -138 255 55 -126 -81 -88 111 306 -235 148 -248 7 22 -169 -217 -140 225 108 42
4685 42 131 -10 -244 132 -242 -58 103 -38 318 -110 -214 83 -7 63 141 -278 50 -97 -71 -139 -246 -124
4707 -124 148 -64 62 -232 112 108 -1 112 -251 -195 -6 -115 -31 86 29 180 7 64 -129 71 230 -33
4729 -33 83 190 -32 62 266 118 189 197 -120 -60 -93 -49 151 123 57 -74 -307 -77 321 -68 -139 218 45 -134
4753 -134 -89 32 254 -74 -164 17 17 -64 201 -320 78 42 -209 423 -78 -152 83 128 -85 -52 -2 209 -120
4776 -120 -105 37 -137 49 136 119 5 -53 196 -167 45 108 108 33 99 -43 -169 -30 196 42 -62 -157 -213 20
4800 20 -114 48 -20 1 299 -24 -80 -16 -98 81 136 39 -129 123 139 72 155 59 153 240 105 40 -89 106 82
4825H2J03k18J11k0N7j53J73n96L71k5N4l0Ll7K03j54lK09o3j85J39l37M42kk23
4850i9K14l25K49n1J2N2k24n6J70O3p3j54j04M79p9J71k40k05K69M5K9k24O8j48
4874a61n9J64m8m6K51k07J51N4j06k56M86n66M93j99k0m1J98j14J25j14J69j52
4896Bj78J8Q6K30l28K3RM00m29J92M5R2l1j02j5J9P2k09P6j67M9J3K84k64K54
4921A41j93J85k4q1q8L71k66k7J18q5K62n79M11q6p1p3M6J24j49j5Q3K6r0k05
4945b65K99j66M6l9J36J29l71L9M12M8j99j57K83m56J99Rj36L5l25K89Q7K66l18
4968a55K46k65L59l25R0n5J91O6k00L20m68K12j52nM13k82J54j41J19j49J00N7
4990A30l0lJ83n38J92K7P0O4l46L16r6K26j36K3j04J61o1P0j80Jj17J48K5l16
$$ plain form
4825 82 185 -33 78 58 115 -38 135 -461 -90 -115 -61 -91 -88 -125 78 -76 -79 130 67 -118 21 -316 126 124 -99
4850 -99 115 -210 39 -12 0 52 -172 -228 -58 5 -68 -222 -326 153 74 245 5 -200 69 114 143 -81 -13 -161
4874 -161 -220 -56 -104 -150 101 -106 45 99 -7 -263 223 -343 150 -49 -69 -110 88 -26 99 -15 154 2
4896 2 -176 -158 -72 158 -170 -147 -138 262 -167 25 70 162 131 29 14 33 105 -104 -28 -195 -146 -133 151 -113 141
4921 141 -52 133 109 28 -60 311 45 18 136 51 313 -266 145 59 -12 -85 -39 85 -64 -79 4 30 -60 -265
4945 -265 34 -132 -86 -125 11 140 -231 -192 220 268 69 -88 195 -261 -62 -53 -189 -154 -479 -190 -103 163 -155
4968 -155 91 -174 185 -140 -50 -105 86 152 -48 272 -196 16 -136 -141 272 -10 144 3 122 -27 73 130
4990 130 100 97 280 -258 -66 -39 31 95 -251 65 -31 195 59 82 -22 139 78 148 -32 -31 -148 0 25 -291
5014b91P2L25j5J58j50MJ44k95J07R1n07L57k00J48K76k94K97l66J13PJ60j01
5036D0j89j48O16L5n52J65j1NJ2j10J83j09J36P3j8l57L00J8m3j33l0mL28o1j57
5061a1L8M5k44k4K68q5Q5p3l6J43l61n7M37k59L74l52O7r2J14J41j17K18n46K97
5085c0j46L96l80R0J20j9L08k74j19M75l70k9p8n98P99O22r38K08mn57Q09o06
5107c21p36k79Q88k20R60j54L65j8j88n01L03M34n19K81j69o55N89k7J58N4n43
$$ plain form
5014 -291 -219 106 91 249 99 103 247 -48 59 150 -357 0 -200 -52 224 -70 227 -139 -26 -19 141 40
5036 40 -149 -297 319 354 -198 -33 -44 -39 -27 -137 46 -63 73 146 128 -229 71 89 46 -87 -117 -121 207 146 -11
5061 -11 27 72 -172 -196 72 -13 72 -1 -37 106 -255 -312 125 -134 240 -112 -45 -137 -23 118 1 219 -327 -30
5085 -30 -176 220 -160 -70 50 31 339 65 -54 421 51 22 -56 -654 145 767 -171 37 33 -524 285 -321
5107 -321 -1057 -1336 -448 -668 292 138 503 485 297 -204 99 533 14 295 126 -529 60 33 191 245 -298
$$ [...]
8191d5
##END NTUPLES=NMR FID
##END=
