##TITLE=1H_Pr 11H
 CDCl3,8 sc, 
 25.10.2021
##JCAMPDX= 6.0         $$ Bruker NMR JCAMP-DX V2.0
##DATA TYPE= NMR FID
##DATA CLASS= NTUPLES
##ORIGIN= UXNMR, Bruker Analytische Messtechnik GmbH
##OWNER= root
$$ XWIN-NMR		Version 3.5
$$ Mon Oct 25 13:42:21 2021 Russian Standard Time (UT+4h)  she@DPX200
##.OBSERVE FREQUENCY= 200.1313468511
##.OBSERVE NUCLEUS= ^1H
##.DELAY= (6, 6)
##.ACQUISITION MODE= SIMULTANEOUS
##.ACQUISITION SCHEME= undefined
##.AVERAGES= 8
##.DIGITISER RES= 18
##SPECTROMETER/DATA SYSTEM= spect
##.PULSE SEQUENCE= zg30
##.SOLVENT NAME= Acetone
##.SHIFT REFERENCE= (INTERNAL, Acetone, 0, 15.7039)
##AUDIT TRAIL= $$ (NUMBER, WHEN, WHO, WHERE, WHAT)
$$ ##TITLE= Audit trail, XWIN-NMR		Version 3.5
$$ ##JCAMPDX= 5.01
$$ ##ORIGIN= Bruker BioSpin GmbH
$$ ##OWNER= she
$$ F:/spectra/data/she/nmr/H-F/1/audita.txt
$$ ##AUDIT TRAIL=  $$ (NUMBER, WHEN, WHO, WHERE, WHAT)
(   1,<2021-10-25 13:40:08.50 +0400>,<she>,<DPX200>,
      <created by zg, POWCHK disabled, PULCHK disabled
       configuration hash MD5:
       00 E9 B6 7A A2 85 ED C7 34 08 36 98 17 FE 4E 26
       data hash MD5: 16K
       98 2F 8B 55 4E 31 C2 18 BF 05 A8 24 1A 3F 84 CE>)
$$ ##END=
$$ 
$$ hash MD5
$$ A0 CF 25 51 61 A0 48 2A 5F 9A 5B B1 24 4C 7E F1
##$RELAX= 
##$RELAX= 
##$RELAX= 
##$RELAX= 
##$RELAX= 
##$RELAX= 
$$ Bruker specific parameters
$$ --------------------------
##$DU= <F:/spectra>
##$EXPNO= 1
##$NAME= <H-F>
##$PROCNO= 1
##$TYPE= <nmr>
##$USER= <she>
##$AMP= (0..31)
100 100 100 100 100 100 100 100 100 100 100 100 100 100 100 100 100 100 
100 100 100 100 100 100 100 100 100 100 100 100 100 100 
##$AQSEQ= 0
##$AQ_mod= 1
##$AUNM= <au_zg>
##$AUTOPOS= <>
##$BF1= 200.13
##$BF2= 200.13
##$BF3= 200.13
##$BF4= 200.13
##$BF5= 200.13
##$BF6= 200.13
##$BF7= 200.13
##$BF8= 200.13
##$BYTORDA= 1
##$CFDGTYP= 0
##$CFRGTYP= 5
##$CHEMSTR= <none>
##$CNST= (0..31)
1 1 145 1 1 1 1 1 1 1 1 1 1 1 1 1 1 1 1 1 1 1 1 1 1 1 1 1 1 1 1 1 
##$CPDPRG= <>
##$CPDPRG1= <>
##$CPDPRG2= <>
##$CPDPRG3= <>
##$CPDPRG4= <mlev>
##$CPDPRG5= <mlev>
##$CPDPRG6= <mlev>
##$CPDPRG7= <mlev>
##$CPDPRG8= <mlev>
##$CPDPRGB= <>
##$CPDPRGT= <>
##$D= (0..31)
0 1.2 0 0 0 0 0 0 0 0.06 0 0.03 0 0 0 0 0.0002 0 0 0 0 0 0 0 0 0 0 0 0 
0 0 0 
##$DATE= 1635154807
##$DBL= (0..7)
120 120 120 120 120 120 120 120 
##$DBP= (0..7)
150 150 150 150 150 150 150 150 
##$DBP07= 0
##$DBPNAM0= <>
##$DBPNAM1= <>
##$DBPNAM2= <>
##$DBPNAM3= <>
##$DBPNAM4= <>
##$DBPNAM5= <>
##$DBPNAM6= <>
##$DBPNAM7= <>
##$DBPOAL= (0..7)
0.5 0.5 0.5 0.5 0.5 0.5 0.5 0.5 
##$DBPOFFS= (0..7)
0 0 0 0 0 0 0 0 
##$DE= 6
##$DECBNUC= <off>
##$DECIM= 32
##$DECNUC= <off>
##$DECSTAT= 4
##$DIGMOD= 1
##$DIGTYP= 9
##$DL= (0..7)
0 120 120 120 120 120 120 120 
##$DP= (0..7)
150 150 150 150 150 150 150 150 
##$DP07= 0
##$DPNAME0= <>
##$DPNAME1= <>
##$DPNAME2= <>
##$DPNAME3= <>
##$DPNAME4= <>
##$DPNAME5= <>
##$DPNAME6= <>
##$DPNAME7= <>
##$DPOAL= (0..7)
0.5 0.5 0.5 0.5 0.5 0.5 0.5 0.5 
##$DPOFFS= (0..7)
0 0 0 0 0 0 0 0 
##$DQDMODE= 0
##$DR= 18
##$DS= 0
##$DSLIST= <SSSSSSSSSSSSSSS>
$$ [...]
##$SUBNAM2= <"">
##$SUBNAM3= <"">
##$SUBNAM4= <"">
##$SUBNAM5= <"">
##$SUBNAM6= <"">
##$SUBNAM7= <"">
##$SUBNAM8= <"">
##$SUBNAM9= <"">
##$SW= 18.0517286264689
##$SWIBOX= (0..15)
0 0 2 0 0 0 0 0 0 0 0 0 0 0 0 0 
##$SW_h= 3612.71676300578
##$TD= 16384
##$TD0= 1
##$TE= 0
##$TE2= 300
##$TE3= 300
##$TEG= 300
##$TL= (0..7)
0 120 120 120 120 120 120 120 
##$TP= (0..7)
150 150 150 150 150 150 150 150 
##$TP07= 0
##$TPNAME0= <>
##$TPNAME1= <>
##$TPNAME2= <>
##$TPNAME3= <>
##$TPNAME4= <>
##$TPNAME5= <>
##$TPNAME6= <>
##$TPNAME7= <>
##$TPOAL= (0..7)
0.5 0.5 0.5 0.5 0.5 0.5 0.5 0.5 
##$TPOFFS= (0..7)
0 0 0 0 0 0 0 0 
##$TUNHIN= 0
##$TUNHOUT= 0
##$TUNXOUT= 0
##$USERA1= <user>
##$USERA2= <user>
##$USERA3= <user>
##$USERA4= <user>
##$USERA5= <user>
##$V9= 5
##$VALIST= <valist>
##$VCLIST= <CCCCCCCCCCCCCCC>
##$VD= 0
##$VDLIST= <DDDDDDDDDDDDDDD>
##$VPLIST= <PPPPPPPPPPPPPPP>
##$VTLIST= <TTTTTTTTTTTTTTT>
##$WBST= 1024
##$WBSW= 4
##$XGAIN= (0..3)
0 0 0 0 
##$XL= 0
##$YL= 0
##$YMAX_a= 425213
##$YMIN_a= -559548
##$ZGOPTNS= <>
##$ZL1= 120
##$ZL2= 120
##$ZL3= 120
##$ZL4= 120
##$ABSF1= 10
##$ABSF2= 0
##$ABSG= 5
##$ABSL= 3
##$ALPHA= 0
##$AQORDER= 0
##$ASSFAC= 0
##$ASSFACI= 0
##$ASSFACX= 0
##$ASSWID= 0
##$AUNMP= <proc_1d>
##$AZFE= 0.1
##$AZFW= 0.1
##$BCFW= 1
##$BC_mod= 2
##$BYTORDP= 1
##$COROFFS= 0
##$CY= 11.3945322036743
##$DATMOD= 1
##$DC= 2
##$DFILT= <>
##$DTYPP= 0
##$F1P= 2.36226072786647
##$F2P= -0.459571619588291
##$FCOR= 0.5
##$FTSIZE= 0
##$FT_mod= 4
##$GAMMA= 1
##$GB= 0.15
##$INTBC= 1
##$INTSCL= 1
##$ISEN= 128
##$LB= 0.24
##$LEV0= 0
##$LPBIN= 0
##$MAXI= 10000
##$MC2= 0
##$MEAN= 0
##$ME_mod= 0
##$MI= 1.114404
##$NCOEF= 0
##$NC_proc= 0
##$NLEV= 6
##$NOISF1= 3.799351
##$NOISF2= 2.8
##$NSP= 1
##$NTH_PI= 0
##$NZP= 0
##$OFFSET= 15.70392
##$PC= 1
##$PHC0= -15156.98
##$PHC1= 16.40083
##$PH_mod= 1
##$PKNL= yes
##$PPARMOD= 0
##$PSCAL= 0
##$PSIGN= 0
##$REVERSE= no
##$SF= 200.130013532006
##$SI= 16384
##$SIGF1= 3
##$SIGF2= 2
##$SINO= 400
##$SIOLD= 16384
##$SREGLST= <1H.CDCl3>
##$SSB= 0
##$STSI= 0
##$STSR= 0
##$SW_p= 3612.71676300578
##$SYMM= 0
##$S_DEV= 0
##$TDeff= 0
##$TDoff= 0
##$TI= <>
##$TILT= no
##$TM1= 0
##$TM2= 0
##$TOPLEV= 0
##$USERP1= <user>
##$USERP2= <user>
##$USERP3= <user>
##$USERP4= <user>
##$USERP5= <user>
##$WDW= 1
##$XDIM= 8192
##$YMAX_p= 0
##$YMIN_p= 0
$$ End of Bruker specific parameters
$$ ---------------------------------
##NTUPLES= NMR FID
##VAR_NAME=  TIME,          FID/REAL,        FID/IMAG
##SYMBOL=    X,             R,               I
##VAR_TYPE=  INDEPENDENT,   DEPENDENT,       DEPENDENT
##VAR_FORM=  AFFN,          ASDF,            ASDF
##VAR_DIM=   8192,          8192,            8192
##UNITS=     SECONDS,       ARBITRARY UNITS, ARBITRARY UNITS
##FACTOR=    0.0002768,     1,               1
##FIRST=     0,             0,               0
##LAST=      2.2672688,     0,               0
##MIN=       0,             -559548,         0
##MAX=       2.2672688,     425213,          0
$$ Real data points
##PAGE= N=1
##DATA TABLE= (X++(R..R)), XYDATA
0@%%%%%%%%%%qJ6j6K4l2M0m8N6p2Q8j04J28j52J76k12K52k93L39l90M48n14N87
32C13o70P61q60R70j089J222j371J531j703J894k105K334k584K856l153L477l834
49b011M225m653N127n650O230o880P607q431R373j0457J1726j3235J5063j7328
63i294K0225k4086K9507l7731N1832q2432K66101k75355m69422N74136K92508
74C35989l17921k43205K54641J04319j04223o6069j8419p2830J51052J97308j46185
85G4457l16521J03208L25492l6802l08976P219K50285M1152j72347n5386N2260
96c5959L7040N0847K5596j19465n9577J59812P1875k03505q2757K16240J02916
107A63063j72354p7664Q6682j2632l6454J08914K8026j44596r576J36486n5673
$$ plain form
0 0 0 0 0 0 0 0 0 0 0 0 -8 8 -8 16 -16 24 -24 32 -40 48 -56 72 -80 96 -116 136 -157 182 -208 240 -274 313
32 313 -357 404 -456 514 -575 647 -724 807 -896 998 -1107 1227 -1357 1499 -1654 1823 -2011
49 -2011 2214 -2439 2688 -2962 3268 -3612 3995 -4436 4937 -5520 6206 -7029 8034 -9294
63 -9294 10931 -13155 16352 -21379 30453 -51979 214122 -61233 -530655 43481 335989
74 335989 18068 -225137 29504 133823 29600 -36469 -54888 -127718 23334 220642 74457
85 74457 -242064 -138856 186636 149834 -159142 -151923 98362 139514 -32833 -88219 -35959
96 -35959 1081 51928 77524 -41941 -101518 58294 130169 -73336 -156093 60147 163063
107 163063 -9291 -86955 -273 -12905 -49359 59555 87581 -57015 -66591 69895 14222
118A4222j44993J16732J68269j28253j48104J18465P3595j43367M309K03754l5038
129I9591k41428M5001K42191n9537k32001P3632K24862o7491j97231N1264J38365
140G7218n3775p8124O2439L0437o0971J7832N1206p9984o1121J20864P7906j17592
152a3665o7468R4433K2792q7968K0941R4192l3277o8971M1894J8103p0784J8966
164c0812J06002j8786j05493J4396O8155l6351l5286O7069K5675p5625k0951O2030
176B0023l309n5289K8397N5627l8439m5504M0414J8755n3026Q004P2112k6248
188B1517p9149N2591Q2629q2928r4876R8420J09482q6044r8685O7369O3724o1144
200g094l3561N4740J9000k9651j132o674l8360K2080P2961j5285p9336P669O2713
$$ plain form
118 14222 -130771 -14039 154230 25977 -122127 -3662 69933 -73434 -69125 134629 99591
129 99591 -141837 -96836 145355 85818 -146183 -72551 152311 84820 -112411 -61147 77218
140 77218 23443 -54681 7758 38195 -22776 -4944 46262 -33722 -94843 26021 103927 -13665
152 -13665 -81133 13300 36092 -51876 -30935 63257 29980 -38991 2903 21006 -49778 -30812
164 -30812 75190 56404 -49089 -34693 33462 -2889 -38175 28894 54569 -21056 -42007 20023
176 20023 16714 -38575 -10178 45449 7010 -38494 1920 20675 -32351 -24347 47765 21517
188 21517 -57632 -5041 77588 -5340 -100216 -1796 107686 21642 -77043 -9674 54050 -7094
200 -7094 -40655 14085 33085 3434 2302 -4372 -42732 -20652 52309 37024 -42312 -34643 28070
213B8070j8048n2846L0429N3475k6332m0717J7831J1401k0930J7381L7655k7943
225I426m5911L4041M3664m3621l9931M9910L8435m3513k9179L2511Q766l0536
237a5938O285K6082j2597j0506J8679j1703l6324K0183M9390j6646m3374K0934
249e535K8488l6050k3718M7299L0355l9606k5194K7573O664k5819R148L1052r780
262A4877k5680P325R965j6749L50K8176k945k9953M356K1477j3485j8089K0864
275D89J7002k1940r159K1263m055k3650J2586K6161j2955j9314J9020J1631k9026
288a1947j0443L3607J4775k4116j1231J4118j357j4746Q366J7063n448r705J606
301E42o831j0168J4478K0160j3544k1089J3456J3302k0308r767K5987J2473k1518
$$ plain form
213 28070 10022 -42824 -12395 41080 14748 -25969 -8138 3263 -17667 -286 37369 9426
225 9426 -36485 -2444 41220 -2401 -42332 7578 46013 2500 -26679 5832 14598 -15938
237 -15938 -9653 16429 3832 -6674 12005 302 -36022 -15839 33551 16905 -26469 -5535
249 -5535 22953 -13097 -36815 10484 40839 1233 -23961 3612 10276 -15543 -6395 24657 14877
262 14877 -10803 -3478 6487 -10262 -9912 18264 15319 -14634 -10278 11199 -2286 -20375 489
275 489 17491 -4449 -13608 7655 3600 -20050 -7464 18697 5742 -13572 5448 17079 -11947
288 -11947 -22390 11217 25992 1876 -9355 4763 3406 -11340 -2974 14089 8641 -1064 542
301 542 -6289 -16457 -1979 18181 4637 -16452 -2996 10306 -10002 -19769 6218 18691 -2827
314b827r284J4636L00j0498Q423R444q740l696R486k598j4307M079J6527j810
328I135j2661K266O418o854q212O827R360l059m344J502o046p536R341J3304n262
343D179j0296O661M081j4088j771K0209N455j4882m494Q006k634n053Q162M952
357H487o812n66L064p511m166R603N613q091m634N578Q57o383j664M444L681J032
373B532j735k819k696n72N905M875l568m789N264M813r360q189J1104J2314m264
388H815r823m358Q01O485N759o785q780R280R783j4192j4998J1614J7388k052
402H937j3503o398M894J0297K960j1633o767J3791J1640j0981j4620K622J5246
415F485P117r166j2399L049J4556M12j5904m360J3401Q481n349j1846p481P634
$$ plain form
314 -2827 -12111 2525 2825 -7673 750 10194 1454 -2242 7244 4646 -9661 -5582 10945 9135
328 9135 -3526 -1260 5158 -1696 -9908 -3081 6279 3220 -1124 378 -5668 -13204 -3863 9441 4179
343 4179 -6117 544 4625 -9463 -11234 8975 14430 -452 -4946 3060 426 -4627 3535 8487
357 8487 1675 1109 4173 -3338 -7504 2099 7712 -379 -5013 565 1422 -4961 -6625 -2181 1500 2532
373 2532 797 -2022 -4718 -5290 615 5490 1922 -2867 2397 7210 -2150 -10339 765 13079 8815
388 8815 -1008 -5366 -4565 1920 7679 894 -7886 1394 11177 -3015 -18013 -6399 10989 8937
402 8937 -4566 -10964 -6070 4227 7187 -4446 -11213 2578 14218 3237 -11383 -8761 6485
415 6485 13602 4436 -7963 -4914 9642 10054 -5850 -10210 3191 11672 6323 -5523 -13004 -5370
429e370J5380j031j7724l050J6197M142j4057o304Q203J0469L295r382j3495K610
443a0117J7774N574j3391q162P327Q495Q72r326j0592Q204K0228k878k6088p024
457a9104K3470J3802j6812j8225O780K0738L951k1587j4415J6207K1193n441j9853
470i296m343J2263J1502r94j5526q472K0043J8459j9615k6174J3438K9025m234
483A6076k4055l246J3377O481n192r059j917R645O909p041j1214q29R630Q322
497G887k380j3044m945J5251Q599j4540r277J2537R699o804n941K059q66K89P650
512F174J529r419n297P482J0009n406j7363P71K4785O232k9640j4961K8156J8473
526B1525k3119j6413J5717J1558p928n757M83j661O474J2040p880j9838M604K3953
$$ plain form
429 -5370 10010 8979 -8745 -11795 4402 8544 -5513 -11817 -3614 6855 10150 768 -12727 -10117
443 -10117 7657 13231 -160 -8322 -995 7500 8372 -954 -11546 -3342 16886 14008 -12080 -19104
457 -19104 4366 18168 1356 -16869 -10089 10649 14600 -6987 -21402 -5195 15998 10557 -9296
470 -9296 -13639 -1376 10126 9132 -6394 -14866 5177 23636 4021 -22153 -8715 20310 16076
483 16076 -7979 -11225 2152 8633 3441 -5618 -7535 2110 9019 1978 -9236 -10065 -435 7887
497 7887 5507 -7537 -12482 2769 11368 -3172 -12449 88 9787 2983 -2958 -899 -1765 -1476 6174
512 6174 7703 -1716 -7013 469 10478 5072 -12291 -11520 13265 19497 -10143 -25104 3052 21525
526 21525 -1594 -18007 -2290 9268 1340 -4417 -3934 -5595 879 12919 5039 -14799 -10195 13758
540A3758L283k3123j0199K1113J5772j8813k0185J4153K1716r305j9247N338J0991
553E252m992l457M572k861m621P602M728j1342o831J1291Q962o187p886J390P255
568B875J056o820o14Q915J017j0355Q92J1570n290j4096J0520J6995j2891k0172
582a6398J1566K0604r450k0923O839J8966l488j7158n34J3640K590q872j334M403
596D51k460n2P569j674j2182L592J7431m464k0464M298K0251k239j7702J364J3968
611G687j600j1226L22P040Q41l169j667J08m4l39M92J171L0j143L45J203j702
628a651q79L573J579l981L2N857o64q071J15J1003J813j1881m504J1152P566j0787
644B72j0954R154J2956p467j3913L626J2465j689r416K55N048K66m73q38l629
$$ plain form
540 13758 17041 -6082 -16281 4832 20604 1791 -18394 -4241 17475 8170 -11077 -5739 5252
553 5252 260 -3197 1375 -1486 -6107 1495 6223 -5119 -11950 -659 8303 2116 -5770 -4380 2875
568 2875 3931 -2889 -3503 5412 6429 -3926 -3034 8536 3246 -10850 -330 16665 3774 -16398
582 -16398 -4832 15772 6322 -14601 -7762 11204 7716 -9442 -9976 3664 6254 -2618 -3952 451
596 451 -2009 -2061 5508 3834 -8348 -4756 12675 8211 -12253 -7955 12296 10057 -7645 -6281 7687
611 7687 6087 -5139 -4817 2223 3064 -105 -1772 -1664 -1708 -2047 -1555 -384 -354 -1497 -1152 51 -1651
628 -1651 -2530 1043 2622 -1359 -1327 4530 3866 -4205 -4090 6913 8726 -3155 -7659 3493 11059 272
644 272 -10682 -1528 11428 3961 -9952 -6326 6139 4450 -4966 -4711 337 603 130 -708 -4337
659d337N84Q324K044j0535m639J0354O607p229o438M343O418j634o135j223M004
674E08M023j543m804j619L125K698j936m054Q43M904q6m868j640L517K964j685
690C47k134N93J311J098q20j196J563J392j083o56J075L12k252N04L172m19m138
707a331o83L250O90l163j223K977J049l022j838J738J820n84r37K70m22O94J434
724G19j254j268K132J832j495j389R84N67n27J300L15k177J90J800r96j713N33
741d47J445j59j611o64J17J299J99k024Q1K616o16k380N87K046K14l92Qj91J40
760B68Q63n65q69K149N89k417l28J677l03j627Q43P03j653k01J141j010j519J639
778f20P72j093p21M72J55J1Q50l85m83J661K92j903J22K187K52r56j67M56J99
$$ plain form
659 -4337 -3753 4571 6615 -3920 -8559 1795 8402 1173 -5265 -922 5496 3862 -2273 -3496 508
674 508 4531 2988 -1816 -3435 -310 2388 452 -3602 -2759 2145 2059 -2809 -4449 -932 2032 347
690 347 -1787 -1194 117 1215 395 -801 762 2154 1071 415 1490 1802 -450 54 3226 2807 -1331
707 -1331 -2014 1236 1926 -1237 -2460 517 1566 -1456 -3294 -1556 264 -320 -1257 -987 -1409 -715 719
724 719 -535 -1803 329 2161 666 -723 261 828 301 1601 1916 -261 -71 1729 733 -980 -447
741 -447 998 839 -772 -1436 -1319 -20 179 -1845 -1764 852 236 -2144 -1557 489 703 311 319 128 268
760 268 1131 566 -303 1846 2435 18 -310 1367 1064 -563 280 983 -670 -871 270 -740 -2259 -620
778 -620 152 -941 -1662 -1190 -1035 -1024 -174 -559 -1042 619 911 -992 -870 1317 1569 613 446 902 1101
797A101K09p50j094J400J706k617j974K366Q01k060l56J734m28j431P14j98n15
814a392J375O16j932j4K300m28j764J271J486r32j00O35r49k5J533o32j359J006
832F95M36j257l74P71p77j39J293j368j725J939J064k223mK130o55j397J422O27
850D58j747Q76K474j499j387K013J95j648J212J352k048p71K349k25k868Q41J672
867A249n51j135o03K7J018L35j563o97J623J153k185k72J055K58N99O68j824n38
885a383L003O12l383O1L768o56k874J199J312k066M97J888j921k234K608J498
901A929l403j062L036J41k130J47J155n24l13J020J86n20p0J88Q33M02j535J55
919c65K485m97k195M35J766n53j063J075n74j651J881O47l050j67K979m09k509
$$ plain form
797 1101 1310 560 -534 866 2572 -45 -2019 347 1148 -912 -1268 466 38 -1393 -679 -877 -1392
814 -1392 -17 599 -1333 -1347 953 525 -1239 32 1518 586 486 1121 172 147 1680 1048 -311 695
832 695 1131 -126 -500 271 -506 -645 648 -720 -2445 -506 558 -1665 -1669 461 -194 -1591 -169 458
850 458 -1289 -413 2061 562 -825 1188 1383 -265 947 2299 251 -520 1829 1604 -1264 -423 1249
867 1249 698 -437 -1040 -1013 5 340 -1223 -1920 -297 856 -1329 -1601 -546 -288 311 979 -845 -1383
885 -1383 1620 2232 -1151 -1090 2678 2022 -852 347 1659 -407 90 1978 57 -2177 431 1929
901 1929 -1474 -2536 500 641 -1489 -1342 -187 -711 -1024 -4 182 -338 -408 -220 613 1015 -520 -365
919 -365 2120 1623 -572 -137 1629 1076 13 1088 514 -1137 744 1391 -1659 -1826 1153 744 -1765
936a765M66J345j171K15J609j555j363L093P54l303j00L476n2k788J098K163j401
953G21j305J336J048j043j579R91J557j262k260J241K122j565k156J436J278k038
969a478O31J844k017k202L876K266m625j867N302J908m546j133K910Q37r01J0
985H15j174j19K528L97l861j077M004J129k980j818R68K031j12j868q28J014J686
1002G35j33j507j260R24K640M93l362j193M448J380m104j145L838N08l100Q57
1018A9K032k512p89L745p53m271R79L727j130l154J025J343p62K34J16j490n6
1035a697K648M88k668j419K819J945j552j981O02K484L47k010o80N49J318J081
1051B274j061l017K68M529j93n786m96N899M51n078m68L280o1j582Q66k07j922
$$ plain form
936 -1765 -1299 46 -1125 -910 699 -856 -2219 874 1628 -1675 -1775 1701 1649 -1139 -41 2122 721
953 721 -584 752 1800 757 -822 169 1726 464 -1796 -555 1567 2 -2154 -718 560 -1478
969 -1478 -847 997 -1020 -3222 654 2920 -1705 -3572 1730 3638 -908 -2041 869 1706 805 815
985 815 -359 -478 2050 2447 -1414 -2491 1513 2642 -338 -2156 -1188 843 731 -1137 -1965 -951 735
1002 735 602 -905 -2165 -1241 1399 1892 -1470 -2663 1785 3165 -939 -2084 1754 2262 -838 19
1018 19 2051 -461 -1250 2495 1742 -2529 -1550 2177 1047 -2107 -1082 261 -501 -267 -151 -1641 -1697
1035 -1697 951 1439 -1229 -2648 171 2116 564 -1417 -815 1669 2016 6 -674 -125 1193 2274
1051 2274 1213 -1804 -1536 2993 2800 -2986 -3482 2417 2868 -2210 -2678 602 541 -1041 -175 -382 -2304
1068b304K113L013k982l524L132M029k675l568K384L204j630k143Q79O77p9J69
1084F95J8j109l07J410M63j789j099J407Q57q38n68J62K74K5O60m38j680Q39K729
1103A711m41k862P30K825p65k252J335R80j199M12J303j672k173K649K284l375
1119e10k448L674J718l332j781K352J321j982L9R17p36n92J748J23j923J58K627
1136A373K40k956J21K916q7k284J76J841l60r82N59L64j327L26R96p85j321R00
1154b90J302j232j079J092M55j248N7J216j78j355R28J421j256j162J869Q64j556
1171a52j20J708o04j498J079J218j998l79K138o25k019P79J510j063j392J113
1187c05O97j358m7J150l88q42N98O45r5j146O88J302o97r96P30J345p83j191J579
$$ plain form
1068 -2304 -191 2822 -160 -3684 -552 3477 802 -2766 -382 2822 1192 -951 -72 605 526 695
1084 695 713 -396 -703 707 1170 -619 -1718 -311 546 -292 -860 -698 -424 -399 261 -177 -1857 -1018 1711
1103 1711 1270 -1592 -862 1963 1198 -1054 281 1261 62 474 1777 105 -2068 581 2865 -510
1119 -510 -2958 716 2434 -898 -2679 -327 994 -988 -949 -32 -768 -1360 388 511 -1412 -1254 1373
1136 1373 1613 -1343 -1222 1694 1607 -677 -501 1340 980 -2 557 921 -406 -80 916 131 -1190 -290
1154 -290 1012 -220 -1299 -207 248 -1000 -943 273 95 -1260 -332 1089 -167 -1329 540 1404 -152
1171 -152 -272 1436 832 -666 413 1631 -367 -746 1392 767 -1252 -473 1037 -26 -1418 -305
1187 -305 392 -966 -1013 137 -251 -1093 -495 150 55 -1091 -403 899 202 -794 -64 1281 498 -693 886
1206H86O33j794l6J635o69j525J239J082j835r67K102j54k004O99J298r06q95
1223a211J362J95j468K05J559m89q75J023K71n76J49K68J0k90J65M27m19Rj60
1242A55Q5J76o98NQ16o77q35Q09M18j065j83J219l03j272J006J281j571p72K128
1261G22J10j479L51J526q54q27J352R6j153L68Q18o86n80N91L96p20m86N08M7
1280A00k49k7l77K01K66o94M31J15k86q9P83k8q54M64J281q97p66J240L80j216
1300b22K80R26m70p10P65N3j117L47P80p32o45R95k4r32J74Q32q60k66R22lq47
1321g54M42M08j92r5L28r8J02J92r9j66N10l07j29M96m5r57M82P47q58q14R25
1342A18M55j140k53R80k04j082J100J87r85J07J078m84n14M85N54o33M30J89m71
$$ plain form
1206 886 1519 -275 -311 1324 655 -870 369 1451 -384 -1351 751 597 -1407 -708 590 -316 -1211
1223 -1211 151 346 -1122 -917 642 153 -722 301 572 -4 145 413 423 133 298 725 306 315 155
1242 155 240 416 -282 -277 539 -138 -973 -164 254 -811 -994 225 -78 -1350 -344 937 -634 -1406 722
1261 722 832 -647 -296 1230 376 -451 901 997 -156 212 1030 344 -236 355 751 31 -455 53 100
1280 100 -149 -176 -553 -352 -86 -780 -349 -234 -520 -609 174 146 -708 -244 1037 140 -626 614 994 -222
1300 -222 58 984 514 -196 569 622 -495 -148 632 -100 -745 250 226 -706 -532 300 -560 -826 96 93 -754
1321 -754 -312 96 -96 -191 137 39 141 333 234 68 578 271 142 638 593 -364 118 865 7 -807 118
1342 118 573 -567 -820 160 -44 -1126 -26 161 -824 -717 361 -123 -637 -152 402 -231 199 388 -83
1361h3K15O28m00n42O15L18o50j68M56l84j46K57m1l71l2K85j88j90J91n3J52
1382a31K75n25m62Q98N55j042j33J101j85m80N86J05n81K85P55q28m43O38K32
1401F20n09k10jQ3l3K42n49m68Q78K14q59k49P71O4m80K49J46O9L1J56Ok32K84
1424B23J15L4P8m09QP27j92q96n9J180l58j003K71P95p63k45L72q1l54L75L41
1445A59n72j08L60K27L8k69l67N75P82n62q66P41R24o27q40O79K98n01J06K86
1465D63n56l55O19J60o02k91K92N33l52p25l8J155J7j034J08J183q1j084K58Q92
1485E62l74m46Q39L6p68m7P66M1p84k04P74K83q19l78L57O75m81p40N29L60l40
1506a59l45N98j69n60L11N72k90m98L91O67j51o74p3R23J01p61qN86J81n63j76
$$ plain form
1361 -83 132 760 360 -182 433 751 101 -67 389 5 -141 116 75 -296 -328 -43 -231 -421 -230 -283 -131
1382 -131 144 -381 -843 55 610 -432 -565 536 351 -129 457 562 -19 266 1021 193 -250 388 620
1401 620 111 -99 -100 -17 -50 192 -357 -825 53 267 -592 -841 -70 -6 -486 -237 -91 -22 9 165 171 -61 223
1424 223 338 372 450 41 49 776 584 -312 -371 809 451 -552 -281 514 -249 -494 -122 -203 -557 -182 159
1445 159 -413 -521 -161 66 104 -165 -532 43 825 263 -603 138 1062 435 -405 274 572 71 177 463
1465 463 -93 -448 171 331 -271 -562 -270 263 -89 -814 -852 303 320 -714 -606 577 496 -588 -330 562
1485 562 188 -258 581 617 -151 -198 568 609 -175 -379 395 678 -141 -519 -162 513 32 -708 -179 181 -159
1506 -159 -504 94 -75 -635 -324 248 -42 -540 -149 518 367 -307 -380 543 644 -117 -125 461 642 79 -97
1527i7K84o5k62K56J66n30p8L15K65p39l7L62L11n03l39M29M05k36n33O25L53
1548C52l30P8P9Q8l10J45M14k57l38K11L12q1l92k72O11j66k66m9J33k40L18k89
1570b49J16q1O2K46j33k11P7l5M20p8k10J14L82j44j55j88L62K10l99J22R7k38
1592H7j22LJ03l67J62J78P8m94J10K14n2l35J17M21k97j18K68M4J23j31J01J36
1614B29k05J42K37k30j31N5J16K33m92RL54q9l99j8J60k30n0L37j53j98J09L19
1636A05m79j39M20J02o5L91j71m20Q7O65k20k88N27j78k64J8K75k91j89J81J48
1657B15l69J77l1j8r6j01l4J6L35l73m5K96j26l49M48K63l65J31M69j85m46M61
1679B73K26m12j43L77Pn45L43K07n16l3O04l91l49L81R1m65J36P3o3k3J94m6k15
$$ plain form
1527 -97 187 122 -140 116 282 -248 -326 -11 254 -485 -522 -160 151 -352 -691 -262 143 -93 -626 -1 352
1548 352 22 100 179 267 -43 102 516 259 -79 132 444 363 -29 -301 310 144 -122 -171 -38 -278 40 -249
1570 -249 -133 -214 -152 94 -39 -250 -173 -208 212 134 -76 38 420 276 121 -67 295 505 106 228 325 87
1592 87 -35 -32 71 -296 -134 44 122 -372 -262 -48 -100 -435 -318 103 -194 -312 -44 0 123 -8 93 229
1614 229 24 166 403 173 42 97 213 446 -46 -37 317 228 -171 -189 -29 -259 -309 28 -125 -323 -214 105
1636 105 -374 -513 -93 9 -56 335 164 -256 -169 496 276 -12 515 337 73 91 366 75 -114 67 215
1657 215 -154 23 -8 -26 -122 -223 -257 -241 94 -279 -324 -28 -154 -503 -55 208 -157 -26 443 258 -188 273
1679 273 499 87 -56 321 328 -217 126 333 -183 -216 388 -3 -352 29 120 -345 -209 -136 -199 -222 -28 -74 -289
1702b89K80R2k61n8M72k74O2K27N9l02K54J14m65J62L09l14k07L49L6n77L56K98
1724C23p20J2N52j59m74M58J41m97o7N12P3m30K14K90k48O2L40r4l21J74r2J63
1746B12J02j31j82j7K71m28j09M70m10j20M31q8k89r8M59j89k45K69Lk01K11L45
1768B66j90k53M47j25l73K47L87l01j35M81j74k09m4K30k80o0J38j06j68K14P8
1789G0j85Rk0j55K12q6Qj12K68j36j80L89R5k14N7M32k89m36M57K71m40j60M63
1812C18k41l71M22K0j96r6J50r3k87J27R7k19J84L11m30O6J93j03r8R2M35j91
1834I0j85K42q7O1J3qJ6J30j40k72M21j09l40m9M09j60n40N98M0n18j02N61J7
1857H8m42K32Q9j39n7K38jj38L29k34MJ07M4k21K60J56k83J9R2l9k74J20L52k49
$$ plain form
1702 -289 -9 83 -178 -236 236 -38 24 251 310 8 262 376 -89 73 382 68 -139 210 246 -331 25 323
1724 323 -397 -385 167 8 -466 -8 133 -364 -431 81 154 -276 -62 228 -20 42 382 288 -33 141 49 212
1746 212 314 183 1 -16 255 -173 -282 188 -222 -342 89 1 -288 -386 73 -116 -361 -92 -89 -290 -79 266
1768 266 76 -177 270 145 -228 19 406 105 -30 451 277 68 24 254 -26 -86 52 -54 -222 -8 70
1789 70 -115 -106 -126 -281 -69 -155 -147 -259 9 -127 -307 82 177 -37 20 452 163 -273 184 455 15 -145 318
1812 318 77 -294 128 148 -48 -144 6 -87 -374 -247 -150 -369 -185 126 -304 -238 -45 -148 -246 -154 281 90
1834 90 -95 147 60 121 134 126 142 272 132 -140 281 172 -168 -217 192 32 -508 90 130 -388 -490 71 88
1857 88 -354 -122 -33 -172 -229 9 8 -130 199 -35 -31 76 120 -101 159 315 32 51 143 104 -170 -50 302 53
1881E3j09k05J30P0j19K7r7J77j83L3J18J61j61l9L01j9m26K76M98k19n06K88
1903D9M28l54k32J17L39l39j80K82L6k78r2J11J74k14j91J44J81j21k27K58J71
1924F2j71j50L07J12k34l1L02P5j03k8Q5r8p9j13K63Q8l85n2L48k19j67m3L53
1947A22o4l24J8K40K7k82j23L03J21k53J68J85j5k50J02N02j60m92J84M60j55
1968C14m76J95K08k62r9J18J57j49j25J44r0j13j74L68K22l05k10J88K32m56r
1989c22N52M3m11P7K86O4k78J6K41Q1l84K14J23j53k02M0K35j98l03K33J25p8
2011Al77K4N75k46j77K47P6l52J05N9j1J10j04K42L5M8l41J69L09k34k04K27K13
2034C94l04l27L13J83l11l8R3p8J9j91L25j27k20o5L68j54k8j31L39J80n63Q3
$$ plain form
1881 53 -56 -261 -131 -61 -180 -153 -250 -73 -256 -223 -105 56 -105 -144 157 138 -288 -12 486 267 -239 49
1903 49 477 123 -109 8 347 8 -172 110 146 -132 -224 -113 61 -153 -344 -200 -19 -140 -367 -109 62
1924 62 -109 -259 48 160 -74 -105 197 272 169 141 226 128 49 -64 199 287 -98 -150 198 -21 -188 -231 122
1947 122 58 -266 -248 -8 19 -263 -386 -83 38 -215 -47 138 123 -127 -25 477 317 -175 9 469 314
1968 314 -162 33 241 -21 -120 -2 155 6 -119 25 -65 -178 -352 16 238 -67 -277 -89 143 -313 -322
1989 -322 230 273 -138 -61 225 289 11 27 268 349 -35 179 302 149 -53 -13 222 24 -279 -46 79 1
2011 1 -376 -352 223 -23 -200 47 123 -229 -124 -65 -76 34 -70 172 207 255 -86 83 392 158 -46 181 394
2034 394 90 -237 76 259 -52 -90 3 -75 -56 -247 78 -49 -269 -334 34 -120 -148 -279 60 240 -323 -240
2056b40L86r0j37R7K60k72J3J27O9m61K73K35j54l13L34j58K05m52J09J35q9O6
2078e7q2JJ03j18j13L34Q8k40R1J20k9o0J90%n5j10j01J53J82l02J43j54K69j62
2102I1m70L78L0j63p3K55q0k44NM13k28j68K96O2k24%K45J15k25j39L52o9J32
2125B91j91m0K2N2k13K92n5m34K57K44j65j03p9K61k24k04J92j22q3K55Q0l43
2147c10J01M14j18j10J97Ol76M73jk63j62L89l7j89q4L13l52r7K55k6L1j96J3
2170a29qK8j04n2R8Q5k27J74L10k38k96O99j02l66P8K61J31l05J16O3k76j0K08
2193A38L1k22M5J56k03l6J5l0M3M8l2k26R5K16k05O1j9J15j96K9L42j33r4J94
2217A32r3J9K08k75p3K18r5j32J60R9k40k17L47j22l02Q1L12j48l0J54r0l37L61
$$ plain form
2056 -240 146 56 -81 16 276 4 17 144 213 -248 25 260 106 -207 127 -31 174 -278 -169 -34 -123 -57
2078 -57 -139 -138 -35 -153 -266 68 156 -84 7 127 98 38 228 228 173 63 -38 115 297 -5 138 -16 253 91
2102 91 -379 -1 29 -134 -207 48 -32 -276 -271 142 -86 -254 42 104 -120 -120 125 240 15 -124 228 159 291
2125 291 100 60 82 134 -79 213 158 -276 -19 225 60 -43 -122 139 -85 -289 -97 -219 -302 -47 33 -310
2147 -310 -209 205 87 -23 174 180 -196 277 276 13 -149 240 203 14 -70 243 -109 -206 49 23 54 -142 -129
2170 -129 -137 -109 -213 -265 -167 -82 -309 -135 175 -63 -359 340 238 -128 -50 211 342 37 153 216 -60 -70 138
2193 138 169 -53 -8 148 -55 -91 -76 -106 -63 -15 -47 -273 -178 38 -167 -106 -125 -10 -206 -177 165 32 -62 132
2217 132 39 58 266 -9 -82 136 41 -91 69 168 -72 -289 58 -64 -366 -285 27 -121 -151 3 -87 -424 -63
2240f3J55j72Q4LJ44r2K0Kj71J1K49Q1j30p0J03n3J3l8k4R9o9o1pl0q2K4J64o9
2268B1k90K25J15k20mJ45J08j87L44j11k82l0L86r4NO5O1J9l29L08k29L4r4K56
2292B22l03o2L08l83K89r6q6j6j75J53M9Q5J08j47J0J82k88O7L10m4l10K33J84
2315B90k33M8J54j6k81L6K38j67l20K68R3k73j79K14r1%Q0O7p7J38J08j02j9k80
2339c04L74r1K0J6J09J14j72Q9JL5k13K36j80q4J76p9km9P6O9k29j41L38J5l20
2364a96O9J35P3k69J92Q6r7j43K36J67k07Q2J7j5j09J13r4P4j50o3J2Q7O2j54
2388i2N5K7J4j71J32j77J27j15m6K33l2l31K95J02rj48J56R4J1M3j97K42m6k73
2412a06Q8J54L1l24Q6L86l86m4K91j66j56J3K54j52j74J17J58k2j84L3J48j71
$$ plain form
2240 -63 92 -80 4 7 151 59 79 81 -90 -79 170 251 121 51 154 101 114 76 52 151 82 21 14 -16 -98 -74 90 21
2268 21 -269 -44 71 -149 -153 -8 100 -87 257 146 -136 -166 220 126 131 196 257 276 -53 255 26 60 -34 222
2292 222 -81 -143 165 -218 71 -25 -111 -127 -302 -149 -100 -15 93 -54 -44 138 -150 -83 227 183 -127 106 290
2315 290 57 105 259 243 -38 -2 236 69 -251 17 110 -163 -342 -128 -219 -219 -139 -72 -149 -11 97 -5 -24 -304
2339 -304 70 -21 -1 15 124 238 66 155 156 191 -22 214 34 -50 126 47 45 -4 72 141 -88 -229 109 124 -196
2364 -196 -127 8 81 -188 4 90 -7 -150 86 253 46 128 145 130 21 134 40 114 -36 -99 -87 0 62 -92
2388 -92 -37 -10 4 -167 -35 -212 -85 -200 -246 -13 -45 -376 -81 21 12 -136 20 114 125 168 -29 213 167 -106
2412 -106 -18 136 167 -157 -71 315 -71 -115 176 10 -146 -133 121 -31 -205 -88 70 48 -136 -103 45 -126
2434a26J29M9J53j57l2J21R9L0l29p8K31Qj77Q1J74r6k04J07O6p2q3M7q5K1j01
2459b24J77J17j93o7JK84Q1k66J33R1m2k2K18M8l28j20L51k0k40N8K41r1j51J0
2483D6j43J49k29J5J7LJ62l38L69J01l70nM71j86k37J68J86j30r2J62o7J3q5J75
2507A55j0r5m7R1l0R1k23j80J85Q3k28K39j9k43p5L51o2j10j04Q0J24j20J97L8
2531H8m1j23J27j3J9Nk1QK22j80j93J77K56l72N3j3J21l60%K57k78L8J05J83j90
2556a25o2O6J36j97Q9Q6M0J45k47L1J22n4m8J62rp1m7J80j83j54O9K22k80j5J88
2581D4j08k43K23J0j85N9L89k35o9K28K4k93R7K28j46j42K34J15q2q8K31j41j42
2604HO2k6k4R0k49j1K66k28o3L28j46l68j3L97p5l11K79K00j32j53K41J57l05
$$ plain form
2434 -126 3 52 205 48 16 137 236 266 -63 -141 90 98 -79 2 176 80 -124 -17 49 -23 -106 -59 -144 -123 -224
2459 -224 -47 70 -123 -190 -189 95 176 -90 43 134 92 70 288 336 8 -112 239 219 -21 37 278 187 36 46
2483 46 -97 52 -177 -162 -145 -142 20 -318 51 152 -218 -223 248 62 -175 -7 179 49 -43 119 52 65 -20 155
2507 155 145 50 3 94 64 155 -68 -248 -63 20 -208 31 12 -231 -306 45 -17 -127 -231 -151 -27 -147 50 88
2531 88 47 -76 51 38 57 62 41 49 271 91 -102 75 331 -41 12 -1 120 -240 -240 17 -261 -223 -118 65 -125
2556 -125 -187 -121 15 -182 -93 -7 33 178 -69 -38 84 30 -18 144 135 64 17 197 14 -140 -71 151 -129 -144 44
2581 44 -64 -307 -84 -74 -259 -200 189 -46 -115 113 137 -156 -59 169 23 -119 115 230 148 60 291 150 8
2604 8 70 44 20 110 -139 -150 116 -112 -175 153 7 -361 -374 23 -52 -363 -84 116 -16 -169 72 229 -76
2627g6P3K41n3j17K53k06k43J83N0m0K9l8J30j61j43K51k04j74J33J64j43j33
2649b24n5L78k59M5J66N3j76R2K08n3k76J09L69k03k34K48J44l52J09O7ql84K60
2672B4K21j98j64R8q1%J8k8O9j44J0R6L1j1j28O5R7J41KK0q8J5J42k4o7o6J54
2699B04j28j33L95j98l80J61J77m5l49K39J89l60j9K55p2l29K11L98j99j90L32
2720A59R9j84k17K18R9m6j45L06k06j21K00j21n9j30J45L0j01p3J24%k34J27O9
2743f1P4j31j1J16J6k24J85N8j59J41n2J4j12K90J04k96J27L3j37o7J00K21m47
2766b18K65J42j50j80R4J92j64j66L19j81q1j11K08K19n27J67J47L84l89J20o5
2787B5j0J38j31K15j43j68J71Oq2j22K92k26q1L6J31j19k34K41M2j06n7K36j38
$$ plain form
2627 -76 -3 238 185 68 321 115 -128 55 105 65 94 56 186 25 -118 133 -71 -245 -112 52 -91 -224
2649 -224 -279 99 -160 -115 51 104 -72 20 228 175 -101 8 377 174 -60 188 332 -20 89 156 148 -236 24
2672 24 245 47 -117 -19 -100 -100 -82 -110 -41 -185 -175 -79 -48 -59 -187 -122 -25 116 118 138 50 65 207 183 116 50 204
2699 204 76 -57 338 140 -240 -79 98 53 -296 -57 132 -228 -247 8 -64 -393 -182 216 17 -173 159
2720 159 258 74 -143 75 174 128 -17 289 83 -38 162 41 -18 -148 -3 27 -74 -147 -23 -23 -257 -130 -61
2743 -61 13 -118 -129 -13 3 -221 -36 22 -137 4 -48 -34 -146 144 248 -48 79 112 -25 -92 8 229 -218
2766 -218 47 189 39 -141 -47 145 -19 -185 134 -47 -128 -239 -31 188 -339 -172 -25 359 -30 90 25
2787 25 15 153 22 237 94 -74 97 103 21 -101 191 -35 -116 -80 51 -68 -302 -61 -19 -125 -182 54 -84
2810h4P0r3J11q8J42O3N1l65J43K57j15o4J88R6k32j28L81j86k92N3K85j01k91
2833a99J87l7j55j3J93J83k26j03L80k32o8M4K08k73n1J80Q7l45J66L66l12j05
2855a25J58K34j12j61J58m2j78j10K93k09j73K20P9j77j75K89N9l14J03J49l9
2876g3N8J5J32j90P6K0K62k26P6j6J01k36m3J00P2l7l6J8j61L3J10q3l76J76K77
2901D9k40j98K47Q0j62K3M49m2m04J70K81j29k61L32k7j11J1J48j91p0Q5p3J71
2924A38n7k39J35J64k15O3L1n2q0K6Q3j49j1J38O7r2l5K60j84j18L77j72p6K00
2948B02L1r1j59K81j97j78K2K9J30l00M73k82k50OL53j62n7R1k8j14R9l4J34J9
2972A8L0j60J42mj04J24J55k81J38J9J32j07k81M91l91o5K28nl94J32K17k02j26
$$ plain form
2810 -84 -14 -107 4 -84 58 121 172 -193 -50 207 92 28 216 312 80 -48 333 147 -145 -92 193 92 -199
2833 -199 -12 -49 -204 -217 -24 159 -67 -170 210 -22 -90 -46 162 -111 -162 18 105 -240 -74 292 -20 -125
2855 -125 33 267 155 -6 152 110 -68 -178 115 -94 -267 -47 32 -145 -320 -31 28 -286 -183 -34 -73
2876 -73 -15 0 132 -58 18 38 300 74 150 134 235 -1 -44 56 128 91 55 73 -88 -55 55 -28 -404 -228 49
2901 49 -191 -389 -142 -62 -224 -201 248 206 -198 -28 253 124 -137 195 168 57 68 216 25 -45 40 -33 138
2924 138 81 -158 -23 141 -74 -11 20 -32 -112 -86 -3 -152 -163 -25 42 -50 -85 175 -9 -127 250 78 2 202
2948 202 233 142 -17 264 67 -111 -89 -60 70 -230 243 -39 -289 -283 70 -92 -149 -58 -86 -200 -101 -135 -1 18
2972 18 48 -112 30 26 -78 46 201 -80 58 77 209 102 -179 312 -79 -144 84 79 -315 -183 34 -168 -294
2995b94K14j2q8J28j25K55q9M3m4m8K76L5j68Q0mK38k41j19J72k18J04j1K11j52
3019A43j30lN0j65r8J6J19J21k47l4M12l30k44K99J16l3k58M50j54q8K00L4p7
3042I9P2r1J34j06k4Nl33L17o5n3L6k8o7j02L05j47q7j06K28j88M1J79O6O0j35
3067A0J3m3K9k01K78p1M1k74J91J55k44J26J44k44P2k3k3J06j08M8LJ9n5J42j93
3092a02P7n8P8j71K71k37r2K41J31mj38N7J97j38l8j8J31q2O6m6M9k03j50J47
3116c2Kl5j31J84j21p4J49o0J83k62K77oj66m3K24k8j28K22l2M5k1k75K58r0M7
3141H7n2L1p6P9j6o8p2K15j78r2O6J43j61q0J1N5n0j35L03j33J05j7J17P8k22
3166f2J73M0K6j37o3K37j52J52j51Or2R5k6r6n7O0P2J6k90K97P2j77j59K69n4
$$ plain form
2995 -294 -80 -92 -180 -52 -177 78 -11 32 -12 -60 216 251 83 163 159 397 156 37 209 -9 95 84 295 143
3019 143 13 10 60 -105 -203 -187 -68 53 -194 -228 184 -146 -390 -91 25 -8 -266 184 30 -58 142 176 99
3042 99 171 80 214 108 84 89 -244 73 8 -45 -9 -37 -104 -206 99 -48 -135 -241 -13 -201 -160 19 85 145 10
3067 10 23 -20 9 -192 86 15 56 -218 -27 128 -116 10 154 -90 -18 -41 -64 42 -66 -18 -15 4 -51 91 -102
3092 -102 -25 -83 -5 -176 95 -142 -234 7 138 134 -4 53 250 112 74 56 187 105 171 125 174 -29 -179 -32
3116 -32 -30 -65 -196 -12 -133 -207 -58 -118 65 -197 80 74 -92 -135 89 61 -67 155 123 168 147 -128 130 40 87
3141 87 35 66 -10 69 53 -15 -87 128 -50 -142 -76 67 -94 -174 -163 -108 -158 -293 10 -123 -18 -35 82 160 -62
3166 -62 111 151 177 40 -23 214 62 214 63 69 -23 72 46 -50 -107 -47 25 41 -249 48 120 -57 -216 53 -1
3191aj32Q2j1O0R5P4l12J40M4P4j04M6J42k02m3J20o4N6j78J21J41j29j28m2M6
3216a05j5m7L13k91K3l3K28j34K8J07L5m3j0j2J3j80N5J95N4k05J27J8m6N5k80
3241a50L8P2P0n1Q9j63J04k3K8r3J79l05mK78j34m6J71p7K52k84J38R8n3n6q9
3266a1K15j74k8RM2j71J08Q7q4l8j19L41j99j94k0K84m1j87j10K32J38j24J87
3289A43r7j66jK56j89K80j29J91j86j23L24k26K7o7J3K0p4j18R5j81J88j5j56
3312a91Q7M7Q6m6L7K6K2K5j97K75m8j04j26L11q5j06MJ91k91L6J93j01q3kJ98
3337A58j77j82J64j9r5J40o1%j34M8K13l5k03L27p3q1J2m0L5J06n0Q5r8J11m5
3362A06j3nj43K65j47p5p8O0K1M7k89K71j01j2J75o6j82J16J12q7K3r0J67j26
$$ plain form
3191 -1 -133 -51 -62 -2 93 167 -145 -5 39 113 9 55 197 -5 -48 72 8 64 -114 7 148 19 -109 -151 -105
3216 -105 -120 -167 146 -145 -122 -155 73 -61 -33 74 109 66 56 44 57 -123 -68 127 181 -24 103 121 75 130 -150
3241 -150 -112 -40 30 -21 68 -95 9 -14 14 -79 100 -205 -209 69 -65 -111 60 -17 235 -49 89 187 134 78 -11
3266 -11 204 30 2 11 53 -118 -10 77 -7 -45 -164 177 -22 -216 -236 48 7 -180 -290 -58 80 -44 143
3289 143 46 -120 -121 135 -54 226 97 288 102 -21 303 77 104 37 50 70 -4 -122 -27 -208 -20 -35 -191
3312 -191 -104 -57 29 -17 20 46 68 93 -104 171 123 19 -107 204 119 13 17 208 -83 -47 146 45 -38 -40 158
3337 158 -19 -201 -37 -56 -151 -11 -72 -72 -206 -158 55 20 -183 144 71 -10 2 -38 -3 103 53 138 40 151 106
3362 106 93 88 -55 210 63 -12 -90 -30 -9 38 -251 20 -81 -93 82 16 -166 -50 62 -25 -2 -92 75 -51
3386e1L2J43j03Q0J9q0N6j53O0L79l92k1m7mL9Qj42Q7J23j83R2M8o4O5J8q4j9
3413i4j4J88j03j42K76Qj08J35J1%M0j49O8o1j49M33k76r2J43j16r6J06k3k24
3437b39J49J58j48J22j73J83l27L24r3J27k02R4J44q1p0j29L59lp3j22j5J41j74
3460d8j30K24j27j31J0L34l18R3m6L10m02K11km2n5J89L4J9l5q1J20r6J28j04
3484E5m7J68j47j20K63j22m7K8M5Ok86R7J8j12N2J63n4m0M3p6J09n4JN8O7j13
3510d5k4J32K6K09l76J52J44n9p5P7l0j74k1J45kj89j1J02L0q1j0K35k07Q1L2
3535F1k2o5Pj44J18K5l4O9R2L2k10J57J20k91J47j88J98M3r0P6j36k2o5K59p0
3560F7j18N8n9O7k01J96K3J9q7p4R5p3K52J5j89pp6R1J38j9j09N5R3r7k7p4K88
$$ plain form
3386 -51 -19 124 21 101 120 40 96 -57 3 382 -10 -31 -78 -82 -43 -35 -177 -90 33 -150 -58 -10 -74 -9 9 -75 -94
3413 -94 -108 80 -23 -165 111 119 11 146 157 157 197 48 116 55 -94 339 63 -29 114 -2 -98 8 -15 -239
3437 -239 -90 68 -80 42 -131 52 -275 49 -44 83 -119 -25 119 38 -32 -161 198 195 122 0 -15 126 -48
3460 -48 -178 46 -81 -212 -202 132 -186 -93 -139 171 -231 -20 -22 -64 -119 70 104 123 88 7 127 31 159 55
3484 55 8 176 29 -91 172 50 3 31 76 82 -204 -107 -89 -201 -149 14 -40 -80 -37 -113 -4 -58 -57 1 68 -45
3510 -45 -69 63 89 298 -78 74 218 159 84 161 131 -43 -64 81 79 -110 -121 -19 11 -70 -80 155 -52 29 61
3535 61 39 -26 -19 -163 -45 -20 -54 15 107 139 -71 86 206 -85 62 -126 72 115 25 101 -35 -57 -122 137 67
3560 67 -51 7 -52 15 -186 10 33 52 -35 -109 -14 -87 165 180 -9 -16 -92 -1 137 118 9 64 157 60 33 -41 247
3587B47l41J4j5J12J05k42L5j1J69k15K49n3l8j85J25J02j07J2J59Q7p8j49J01
3610H3J09k7r3M5j6L1j86J0O8j71J58p6P7K6k06M0k2J33j43J27k4q1J18J65l1
3635A14l7p2j8k7J5J22N7q2q6J63J48k25l4O6l4k26K90k05k0j09J82j40K43k04
3659a19J75j07n3Q3m4J63j92J9R6Q9N6j20j24K9L13k93J21QJ64j63j53K38j00
3682H6o2Pj5j28p0r5L07j82P3JJ18k23J65o1J28j0j32k5J55N8R5k52p0K19j51
3707f4Q0q5K14k13J89k2j28K9j08j2j60J23P1k5L7n2LJ02Nm5N2J27j85L7J46k2
3733I4r8K31j12j05j30J36L3m2J50l5p4j87K5J01R1l5RKj02j48K09m5J4n9L6Q7
3759D6j44l6L71k57j43M31k5k92J19J9o6p0K15n2j45J21j99J87Jq3l5Q4j05j20
$$ plain form
3587 247 -94 -80 -95 17 122 -120 -85 -96 73 -142 107 54 16 -169 -44 58 -49 -37 122 209 131 -18 83
3610 83 192 165 72 117 101 132 -54 -44 24 -147 11 -65 12 38 -168 -128 -150 -17 -160 -33 -57 -138 -20 145 114
3635 114 77 5 -13 -40 -25 97 154 72 -14 149 297 72 38 104 70 -156 134 -71 -91 -200 -18 -158 85 -119
3659 -119 56 -51 -104 -21 -65 98 -94 -75 21 110 166 46 -78 -49 264 -29 92 100 264 101 -52 186 86
3682 86 24 31 16 -112 -182 -277 30 -152 -79 -78 40 -183 -18 -79 49 39 -93 -118 37 95 190 -62 -132 87 -64
3707 -64 16 -69 145 -68 121 99 -29 0 -108 -120 -280 -157 -86 -111 -74 -126 -123 -21 -16 -61 -9 118 -67 -30 116 94
3733 94 -4 227 115 10 -120 16 49 7 157 122 48 -139 -114 -13 78 43 52 54 -48 -196 13 -32 -18 -77 -41 46
3759 46 -98 -134 237 -20 -163 268 243 -49 70 89 23 -47 168 116 -29 92 -107 80 81 -2 -37 47 -58 -178
3783a78Q4l0J38k9K4k3j37P5K6J69j01j0J74j05p3lJ00m1j46K29j18M8K6oj94
3808a01R5K19j53j37K7J78k64O9L8O1o7J63k31O3o1J69Lk16J39Q4k01K58j21P0
3832H4J5L5j00m3j20J36j66J93j95J1J87n7m0p2O5P9j14J09L2j2q4J11o6j38K75
3857A25RK3j11J75k78J77R8j09p9m9l2K4N9m8p9Kn4Lj0J61j30J85L4k03J62r4
3883c9N2J65j84J2j0p3J76o1l0j25R3j6J07m8J08J2k53L8M2J03q1J00kk83J20
3908g7J91j51n8J25k14J08MJQ0O5j25O4J58n2j81J83k45M9R5k0J53l03L33j83
3932@j53K63R1m8l33J61l9j03L06o8j23J1p0P4oQJ04n7j58K7L08k25j7J75j66
3957c8J06p4K40k85J13k41K31j25J40Rk26PP7r7J63o2j10L8K01k40M2J68l5p0
$$ plain form
3783 -178 -94 -124 14 -15 9 -14 -151 -76 -50 119 18 8 182 77 4 1 101 60 -86 143 25 73 99 93 -101
3808 -101 -6 213 60 -77 -50 128 -136 -67 -29 32 -35 128 -103 -40 -101 68 71 -145 -6 78 -123 135 14 84
3832 84 99 134 34 -9 -129 7 -159 34 -161 -150 37 -20 -60 -132 -67 12 -102 7 39 27 -57 54 -12 -150 125
3857 125 134 157 46 221 -57 120 218 109 30 -19 -51 -27 32 -16 -95 -93 -147 -144 -154 7 -123 62 96 -107 55 -39
3883 -39 13 178 -6 6 -4 -77 99 38 8 -117 -24 -40 67 19 127 139 -114 -76 -34 69 -12 88 86 -197 -77
3908 -77 114 -37 -95 30 -184 -76 -72 -71 9 74 -51 13 171 119 -62 121 -124 -75 20 0 153 -150 183 0
3932 0 -153 110 201 153 -180 -19 -58 -161 145 77 -46 -35 -105 -31 -37 -29 75 18 -140 -113 195 -30 -47 128 -38
3957 -38 68 -6 234 -51 62 -179 52 -73 67 76 -150 -143 -66 -163 0 -62 -172 -134 67 -173 -131 37 2 -68
3981f8P1k0LP6o3n7j14L32l8k59J27J42j56p9oJ16p5o2o1L53j95J1j79J24k8M9
4007e6j47J18J09j18J14k3L9q0J81r1K3o5Q4P2k58J54L4j71J47K8n1%J5K1j36
4032e7K0J53r9j81L3K13k99J32L2J19j54j8N9k6L6q2J74M8m7J0l6n9j2J46nj17
4058a7pR2j08R1n0J01k03N2j01J15rk12J94J39r0L4n8R8J0Q2qj13P8o4k5QJ80
4085B09k47M4K6j04J7J65j09m2r9K7p4O7J31L6j2q8N8Kj42J26J32k26J35j94L77
4110B15j81n7J31r6O8r7L1o9m4R5Pn7N2m7J4K4mj96J40Q2j92J36K3n6m4R0K03
4137A71k79P7Q4Oq7l9J33Lk6K8j09P7O8p7o4R1j07O6o0L9o4lP4k8K4r0r9j22J78
4166a35J52K8j76J82K0k17O7O1r0K2J28O5J1j16P9j75J34j4p6J19j1p0J34q5j03
$$ plain form
3981 -68 3 -17 -14 62 -1 -58 -172 160 122 -137 -10 132 -24 -103 -109 7 -68 -130 -191 162 -33 -22 -201 -77 -105 -56
4007 -56 -203 -85 24 -94 20 -3 36 -44 137 46 69 4 88 160 -98 56 90 -81 66 94 43 43 58 79 -57
4032 -57 -37 116 17 -164 -131 82 -217 -85 -53 66 -88 -106 -47 -73 -37 -119 55 103 56 66 30 -29 -41 105 100 -17
4058 -17 -24 68 -40 51 1 102 -101 -49 -150 -35 -44 -256 -62 77 -13 21 -37 61 71 153 145 32 110 46 21 29 209
4085 209 -38 6 32 -72 -55 110 1 -41 -140 -113 -187 -120 11 47 35 -53 5 7 -135 -9 123 -103 32 -162 215
4110 215 34 -23 108 12 80 -17 14 -55 -99 -4 3 -54 -2 -49 -35 -11 -15 -211 -71 11 -181 -45 -22 -78 -122 -32 171
4137 171 -108 -31 53 59 -28 -67 66 69 43 71 -38 39 107 30 -34 57 -50 16 -44 -5 -69 -72 2 -26 -2 -92 -191 -313 -135
4166 -135 17 45 -131 51 71 -146 -79 -18 -108 -86 42 107 118 2 81 -94 40 26 -50 69 58 -12 122 37 -66
4191f6N2Ro6J20p6p0mm2L02l25K15oj73P3P6J11M3n2j32L4lL1J68j56Q4k50n9
4218a62R4L4j0q7R6Q8o3K5j51P5n7J45m6ORj02Q9P8k2nJ83k03m6J7J68j79K04
4245A78j21k6j6R3r0k9P6q8pR3K7j20q4K63j48j62L2J94N3m2o4l4R5L0j24R1k8
4272D2J5k0k08L37k93J96l4r7N2K0J27j57M9K0j04NmJ0r2J30j22K34Nj75n5J23
4298DL8PP4j48Q4j35J16K3j85k2J55j30J03j31K17j53K46k06P9j73J29j13J73
4321E2j03P0n7L5k3P2M2j06L4R0p6j77J33P3J00j77M7P5j59J09J96j84r7K91j98
4346F2Q7k12k0J45J17j51m8M3k24J38N5q7J75j12J62j37P6j89K83l43K79p3R1
4369A17n6Q9j03j97J40r7lJ23J8j11r8J8J59J06j08m7n2r2M5J26j47K46J6k37
$$ plain form
4191 -66 -14 -5 -71 49 -27 -97 -101 -143 159 -166 49 43 -130 -57 19 130 173 121 -11 23 20 51 219 63 147 -103 -162
4218 -162 -68 -34 -44 -131 -35 53 -10 15 -136 -61 -118 27 -19 -13 -4 -106 -17 61 39 34 217 14 -32 -15 153 -26 178
4245 178 57 31 15 108 18 -11 65 -23 -30 63 90 -30 -114 149 1 -161 -129 65 118 76 12 -22 73 103 -21 70 42
4272 42 57 37 -171 166 -127 69 35 -62 -10 10 137 -20 29 49 -55 -50 -54 -44 -136 -6 -128 106 111 -64 -119 4
4298 4 42 49 123 -25 59 -76 40 63 -122 -144 11 -119 -16 -147 70 -83 163 -43 36 -137 -8 -121 52
4321 52 -51 19 -38 -3 -26 46 88 -18 16 106 30 -147 -14 59 159 -18 29 104 -55 54 250 66 -31 260 62
4346 62 149 -63 -83 62 179 28 -20 23 -201 -63 -8 -95 80 -32 130 -7 69 -120 163 -180 99 26 117
4369 117 61 150 47 -150 -10 -107 -110 13 31 -80 -178 -160 -1 105 -3 -50 -102 -194 -149 -23 -170 76 92 -145
4393a45J91k0r2J4q9K10o7J1R6j25q1J13J6n5O9O3q6k1Oo7J37j54J62k82L8J71
4419A3j18R5j0M2O4l7P0q6Q5j21O2Kj62K33l7j61J62j41J30p4j76J56j53J57m7
4444e2L9K8j79J56M1k9j5K30k46q1J14J48j89J09L9k04K01m8N8j63J2J03J31k35
4468c2nN3MN5j25L2L9r0p4K11k5k57J58n9J42M0n4K2L6K2k7k3p7J77j28O1J31
4495B07k03qKM1r7P9L1j6QN3j07j23J45j34N0J63n5l1J8J3k02J57m5J37j10J37
4521A10j0j40K4o9J55r4J64p0p3J37J4k15j19K46j29J1O2j1O9J8J30l30J30j6
4545fNJ05j97J19r3M7J05N6j89J37Q4Oj35j21Q6m0p7J75j85J12J15K0j84PJ13
4570F5j28K47l9j73J7o8P2RRJ74l66K76j45K17j72N8L0j31N5o9L2kq5nK25r9N6
$$ plain form
4393 -145 46 26 -66 -52 -141 69 2 13 109 -16 -97 16 32 -23 46 109 23 2 8 -59 78 -76 86 -196 -158 13
4419 13 -105 -10 -20 22 86 49 119 33 118 -3 59 61 -101 132 95 -66 96 -45 85 11 -165 -9 -162 -5 -52
4444 -52 -13 15 -164 -8 33 4 -11 219 -27 -108 6 154 -35 74 113 -91 110 62 120 -43 -31 72 203 -32
4468 -32 -37 16 20 75 -50 -18 21 -69 -143 68 43 -214 -56 -115 27 67 13 35 71 93 66 43 -34 143 15 76 207
4495 207 4 -4 -2 39 -58 21 52 36 44 97 -10 -133 12 -122 -72 91 36 5 23 36 -166 -9 -54 83 -27 110
4521 110 100 -40 -16 -85 70 -24 140 70 -3 134 148 -67 -186 60 -69 -58 4 -7 62 80 210 -120 10 -6
4545 -6 -1 104 -93 26 -67 -20 85 141 -48 89 173 179 44 -77 9 -31 -108 67 -118 -6 109 129 -55 -48 65
4570 65 -63 184 145 -28 -11 -79 -7 2 11 185 -181 95 -50 167 -5 53 83 -48 7 -62 -30 -32 -117 -122 103 4 60
4597F0j88J07L6n6r4J25j42j7J15J39j66Q2J30k43P0m3k0J26J4q8r1J43R2P1k04
4622d2J1J06r6L9O9j08O8k62J81M4j27K13j56J93j39j4j2O4J1j6j14L5l7J18j19
4647i0J53o1Kq7J92o3OK3M1j14M7k2j25J60q5J88j59M4N7p7o6M3j25N5J87l26
4673b02J97j73O4K6m4O5J64N4j32J02k11K60k36r5M3k2K56j86J86j89K5P1j29
4696a06N5J72j11j09J49N7j61j0kr4K01rj86O5l4K09L8j51M5J1J2j2n0j34Q3P7
4722Ep3N3k3L9N7j72J79N0j90m2%RJ06j13J97k75R4O2j41L27j22j11M9M4M1J24
4748A74j66N4N9n7j50P2R3M2j54q6Q2K9J1p7p2k2Q8j37Q6J55J3j06M4o7J49q9
4774c2m2L6n4J95j51Q3nJ4q1j3n6J77n7P6J3j39p2L93k22k07L27j66J00r1o4J07
$$ plain form
4597 60 -128 -21 15 -41 -135 -10 -152 -169 -54 85 -81 1 131 -112 -42 -85 -105 21 35 -53 -144 -1 91 162 -42
4622 -42 -31 75 -21 18 87 -21 47 -215 -34 10 -117 96 -60 133 -6 -20 -32 32 43 27 -87 -52 -89 29 -90
4647 -90 63 2 4 -83 109 46 52 75 116 2 49 27 -98 62 -23 165 6 50 107 30 -36 7 -118 -63 124 -202
4673 -202 -5 -178 -114 -88 -132 -67 97 151 19 121 -90 170 -66 -161 -118 -140 116 -70 116 -73 -48 23 -106
4696 -106 -51 121 10 -99 50 107 -54 -64 -66 -160 41 32 -154 -89 -123 86 124 -27 18 29 41 29 -21 -155 -72 5
4722 5 -68 -15 -38 1 58 -114 65 115 -75 -117 -117 -108 -2 -115 82 -193 -99 -37 -178 149 27 -84 -35 9 50 174
4748 174 8 62 121 64 -86 -14 79 121 -33 -119 -37 -8 3 -74 -146 -168 -80 -217 -131 24 37 -69 -25 -92 57 -32
4774 -32 -74 -38 -92 103 -48 35 30 44 -37 -50 -106 71 14 90 103 -36 -108 285 63 -144 183 17 117 26 -38 69
4800F9J1k3P0o6R6j35m8m7K0M4r6J52j58l3J5N4Q4j89J8M4K0M7N0j21J4J51o0
4827a7P8M3L7j61L9Ll5P4O6j74m0J08j4N7o1P7M4q5j92J92j31J86q2j42J49j5
4853DL1K0k33J38J78k46J78j04PJ27k53Q0K0l1L02j66o1Q5n1M7n9L0M0j97K63
4878A49j30J4j9Mo0J22j98J36m4M9j24M2l4N0J53j3kj62k9j09K51L9o3k0j2O0
4904E0k13J79J6k1j01J59r6ml9P7KP7rj52P0R4j45l1K35j73j8m6O8P0j8q8J38
4931H1o7l7J10N1j32j3J4j6J30j55N4m8L7Q8k7j68J72q0l1J07j57O9mR9j80K01
4957I8j1j5k15L26k66P1J32p2M5k14M2J24jj48K11n1K0j75N9M7j18L7L4jQ6L8
4983H3j02j0J47L9j66m4N1M4K0o1o8n2J27l3J25k05J22L8j00P2p5J21j31J42j35
$$ plain form
4800 69 80 57 127 61 157 22 -26 -73 -53 -9 -105 47 -111 -144 -129 -75 9 -180 -162 -118 -98 -51 -1 -122 -108 43 -17
4827 -17 61 104 141 -20 19 22 -13 61 127 -47 -87 21 7 64 3 80 124 39 -153 39 -92 94 12 -130 19 4
4853 4 35 55 -178 -40 138 -108 70 -34 -27 100 -153 -73 -53 -84 218 52 -9 76 25 72 13 43 83 -114 149
4878 149 19 33 14 18 -42 80 -118 18 -26 23 -101 -59 -93 -43 110 97 95 -67 -96 -205 46 85 22 2 -10 50
4904 50 -163 16 32 11 -90 69 -27 -31 -70 7 9 86 77 -75 -5 89 -56 -87 148 -25 -43 -89 -21 49 31 -57 81
4931 81 14 -23 87 138 6 -7 7 -9 121 -34 20 -28 9 97 70 -98 74 -6 -37 70 -87 -18 -22 77 -103 98
4957 98 87 72 -143 183 -83 -12 120 48 93 -121 -79 45 44 -104 107 56 76 -99 -40 7 -111 -74 -40 -41 45 83
4983 83 -19 -29 118 157 -9 -53 -2 42 62 1 -67 -119 8 -25 100 -105 17 55 -45 27 -48 73 -58 84 -51
5008e1N9j59J88l1J4j4O2j32M6P1nQ8p7q1K2p0n8R1J07p1N8m6k6O1j27J09n8k0
5036e0M7R9k12R8l4N1P2Jj38J61o0N3%L7j09P7j06j16J10J62m3q7l7q0J68k06
5062a42k8L43j87pr0k4J29j0m5P0J76k51K4p4J51j60K09k08J35k6L6J6R2m4n2
5087C3p1m9J26K9n6q1J26j42Rm9R6j05j2J67J25p3j57N5k8K6Q5j65o6K38N4nj20
5114a0n3M1k6J32j66J16o0J38j84J15j44J46o6q9L8O2q0J25o3J51j65J2J01m9
5138B2j11J83J4k7j10K8O0j2l0j9J61k08N0m0M1K13k84R7j04J18o6Q1j36P7N2
5163E0Rj09L9J52k04k3N6Q8j18L9N5r4J22p8J21j58R9M1j12J33j01J1o1n4Q8L3
5189B4Nk2k3k2J9L3J16k13J38JK7m2m7p3J1J13j00L0J1J18r9j21M7j10J38QJ15
$$ plain form
5008 -51 8 -151 37 6 20 6 68 -64 -18 53 48 136 59 -22 0 -70 -128 -37 70 -1 57 11 -15 46 -81 28 -30 -50
5036 -50 -3 96 -116 -18 -52 -1 71 72 -66 95 35 88 88 125 16 93 -13 -129 -19 143 100 13 -24 -104 64 -142
5062 -142 -170 173 -14 -21 -111 -135 -6 -16 -61 9 185 -66 -42 -116 35 -125 84 -124 11 -15 21 37 129 85 33
5087 33 -38 -87 39 68 12 -69 57 -85 -76 -125 -29 -134 -146 21 146 73 -84 -29 -57 -31 54 -111 -177 61 115 110 -10
5114 -10 -63 -22 -48 84 -82 34 -26 112 -72 43 -101 45 -21 -110 -72 -10 -90 35 -28 123 -42 -30 71 22
5138 22 -89 94 108 81 -29 -1 59 47 17 -2 159 -49 1 -39 2 215 -69 28 -76 42 -24 57 -79 -2 50
5163 50 59 -50 -11 141 -63 -86 -30 58 -60 -21 34 -60 62 -16 105 -53 46 87 -25 108 7 18 -43 -97 -9 24
5189 24 29 7 -16 -38 -19 14 130 -83 55 56 83 41 -6 -79 -68 45 -55 -25 -14 104 5 -116 -69 -179 -41 -33 82
5216H2j58J93p5O4j36o9K57k34J54m2J72l06K6J00k2p0K24Qk36P8n0K9O4o5m3
5241e5q3J85J4j11J4N0m2j1l7m0O5pP3Q7j20O4K5p0j36J62Qj2O4j65R0J00j60
5268d8J13j89J32n0o6K38q1j19Q8OL6q2J32k02L9JJ20j47J59p2roJ6P0l0j25M7
5295b9J42k10J1Q9Rm7O9m7Q6j5O3q6Jk6J3l8J05j49k3P5LM6l3j49J05J48m2k3
5323D8r1J02q2J32j70l1P1K33j27j57Q6j31J57K8k6j13J02n1J54P6j96R0o3J1
5347E2R8k61J22k87J01J91m7j6p7K20j13L4Rj01J65j42J07K8Qp1j45J45j51M5
5371h6Oj01K82p0j1R7j73J28l8K5n9J77j60r2n7K52j99Nl1K16r0o0M7L8o7q4R6
5398iJ78j71J0k26J47L5M8K0j72J47j67K90j02qM8l6m5J5K2j3PK6J13k80K92m4
$$ plain form
5216 82 -76 117 42 106 -30 -99 158 -76 78 36 208 -98 -72 28 6 -64 160 168 -68 10 -40 -11 53 -12 -55
5241 -55 -138 47 61 -50 -36 14 -28 -39 -76 -116 -51 -58 15 102 -18 46 71 1 -135 27 35 23 87 -78 12 112 -48
5268 -48 65 -124 8 -42 -108 130 49 -70 18 24 60 -22 110 -92 -53 -52 68 -79 80 8 -1 -7 9 79 49 -76 -29
5295 -29 113 -97 -86 3 12 -35 34 -13 73 58 121 35 36 10 23 -15 90 -59 -82 -7 -4 42 9 -140 -35 113 71 48
5323 48 -43 59 -23 109 -61 -92 -21 212 85 -72 14 -117 40 68 42 -71 31 -20 134 210 14 104 41 52
5347 52 150 -111 11 -276 -175 16 -31 -47 -124 96 -17 17 26 -75 90 -52 55 83 91 20 -125 20 -131 -86
5371 -86 -80 -181 101 31 20 117 -56 72 34 59 0 177 17 -75 -132 120 -79 -74 -105 111 21 -39 8 46 -21 -105 -9
5398 -9 169 -2 8 -218 -71 -36 12 32 -140 7 -160 130 28 20 68 32 -13 2 24 11 18 44 157 -123 169 125
5424A25k29O0L6O0j11m8J23j37J8J40j18O2J94j31q5K4J57j79J69j34m1kn1L1
5448f7J65r1l7N5P9l8r1L3Q9j52J11p4OK6j67K69Jj42R5p8o4J02Oj05J24K0k9
5475D6p7N9p9J14J21j49q7J04j6p1M8J58j77n7j7K9J13j87K54j26O1r2M3n0Q2
5500D7q1mj37O6K8K11j10l0KO9l0j25J95n5N1j54N7k3J33r3m7J76k40J03K0Q7
5526A16k0r4L8j45J63j44m7J23Q1l7q5r5Q4J17k3j29K06j04L7J11j58J9J09j95
5550g2l6O2J1l2J43o1k6M0p6J06o8k0o0J01n8J17q3r5J44m1J3o0J61j73Q0M3K
5577F2L9R2k86J11J45p2r1J79L3l10kK14j32nJ79j65K7l6Ok2m1R0o3J22j95J25
5603Dm1k2n9K06j26j19J99j68L20j04j40j04L06l41J70l8p3J70k00J60q4R7p7
$$ plain form
5424 125 -104 -44 -8 52 -59 -107 16 -121 -103 37 -81 -19 175 44 -41 -17 140 -39 130 -4 -45 -47 -98 -67
5448 -67 98 7 -30 25 104 66 -25 8 97 -55 56 -18 -12 14 -153 116 117 -25 70 -8 -72 30 36 -69 55 75 46
5475 46 -31 28 -51 63 184 35 -52 52 36 -35 13 171 -6 -63 -80 -51 62 -125 129 3 64 -28 15 -35 47
5500 47 -34 -38 -175 -109 -81 130 20 -10 -8 61 31 -94 101 46 97 -57 0 -23 110 17 -30 146 -94 9 29 116
5526 116 96 2 40 -105 58 -86 -133 -10 71 34 -51 -146 -62 55 32 -97 109 5 42 153 -5 14 123 -72
5550 -72 -108 -46 -35 -67 76 15 -11 29 -47 59 -9 -29 -89 12 -46 71 -12 -107 37 -4 9 -51 110 -63 17 60 62
5577 62 101 193 -93 18 163 91 0 179 212 -98 -100 114 -18 -23 156 -9 18 -18 -12 -34 -75 15 -48 74 -121 4
5603 4 -37 -59 -118 88 -38 -157 42 -126 194 90 -50 -154 152 -189 -19 -57 -130 40 -160 0 -84 13 -64
5626f4J98j49n0j9n0K01r6O8j0R5oj04kJ77L3j52k40J67NL28l44k2K3J75j82J06
5652H6k40J69m6Q1r0O1k2j92K46n8l1N8k8J27j85P9P2k05J43j85K54N1j08L7o5
5677Im7o2O2l4L5O3k1O8n7P4L5j24j8k5p0J14J49k15p3K21k51K30j04j0J96o2
5703H3j87J29j42K28j58M0J05k01J44n0l9L1rk7J34j05Q8j9n4k6O1kj4m2J7L0
5729A5R2j03j14J09r2J72k29Qj2N7J39Q4j54R4O0K0j42r6J79o7O9j27Q2O1o7r1
5755e3J49k03J12k5R4k2l4j9L7J6l7J09pk1n2J9K5J8j52J22k3j6j06J32j3p4l7
5782f1J67n4o7J11o2n4jJ49r1j14j48K16J08l39K87q0JP1P9m5j72o9J2L30j45
5807B9P1N9j06m0j05J13j29J69m5lN6oo8M0L3k79K05j9L4%K6j79J49O2r1J5m9
$$ plain form
5626 -64 134 -15 -65 -84 -134 67 -29 39 29 124 118 14 12 189 222 70 -170 -3 2 330 -14 -36 -13 162 -20 86
5652 86 -154 15 -31 50 -40 21 -1 -193 53 -5 -36 22 -6 121 -64 15 87 -118 25 -160 94 145 37 74 9
5677 9 -38 -100 -38 -72 -37 26 5 73 16 90 125 1 -17 -42 -112 2 151 -64 -137 84 -167 63 -41 -51 145 83
5703 83 -104 25 -117 111 -47 -7 98 -103 41 -9 -48 -17 -26 -53 81 -24 64 45 -9 -35 26 24 10 -32 -15 15
5729 15 107 4 -110 -1 -93 79 -150 -142 -154 -97 42 126 -28 66 126 146 4 -92 87 20 89 -38 44 105 38 -53
5755 -53 96 -107 5 -20 74 52 18 -1 36 52 15 124 117 96 44 63 88 106 -46 76 53 37 -69 63 50 -24 -61
5782 -61 106 52 -15 96 34 -20 -21 128 37 -77 -225 -9 99 -240 47 -33 -32 39 118 73 -99 -168 -156 174 29
5807 29 100 159 53 13 -92 21 -108 61 16 13 69 63 -5 35 68 -211 -6 -25 9 9 35 -144 5 67 -24 -9 -58
5834e8J43j00L4L6J00q1O4r6P1Kj45M3j16l7K52k44K05q6P9j4j46J46j9n2NJ06
5860I2j04Oo1Q8Oj2j5o7P2K4LJ43k90J22J20q6k41m0J64K03j49P0Jj08k13J24
5886a48J42N1M2j05Q3M2p0M3j1k01J52n2oJ08p9R7r4o0j05J03P7o1o9o6J13j4
5912h8j25K36r6J7J23j74M0O7L1k10K8J67K3lP5n7j0J7l8K8J2m9q7J20j11O1J27
5939A24n9J8k07J79j99J49j04m9J63J39k40K9r8K02O1j56J33j39L8J53j90O8k5
5962a0k0R0j64L8p0J78J08p9j35L9p4N3k3m4P2j57K96r8Q5m0p9l7N5J14j33n4
5988h9N4J02j22O6Nj15nJ60n5n2J49k57J43RJ40k27J50L4j67P9o3J33k95P2P7
6013g4Q6l7k5J63o3L7nr6J13j8j33j2O6k7l1Q9l0O9l5j67J63m2m4m5J08j3n5J68
$$ plain form
5834 -58 85 -15 19 55 155 74 138 42 113 115 -30 13 -103 -140 112 -132 73 -13 66 52 -94 52 33 -19 -14 92
5860 92 -12 -6 -67 21 27 15 0 -67 5 29 32 175 -115 7 127 41 -200 -240 -76 127 -22 48 49 -59 -272 -148
5886 -148 -6 45 87 -18 65 107 37 80 69 -132 20 -32 -38 70 -9 88 -6 -66 -171 -68 9 -52 -121 -187 -74 -88
5912 -88 -213 23 -73 -56 67 -107 -67 0 31 -179 -151 16 39 36 111 54 44 61 23 51 63 14 -73 47 -64 -3 124
5939 124 65 83 -124 55 -144 5 -99 -148 15 154 -86 -57 -155 47 108 -48 85 -54 -16 137 -53 15 -10
5962 -10 -30 60 -104 -66 -136 42 150 71 -64 -25 -99 -46 -69 -113 -41 -198 98 0 85 45 -34 -71 -16 98 -35 -89
5988 -89 -35 67 -55 11 16 -99 -104 56 1 -51 98 -159 -16 -7 133 -94 56 90 -77 2 -61 72 -223 -151 -74
6013 -74 12 -25 -50 113 50 87 82 -14 99 81 -52 -64 2 -25 -56 33 3 72 37 -130 33 -9 -53 -98 10 -3 -58 110
6041A10j74R6r0j3pk7J69R8k11K3m1RO4J7q7pK01j43M7n3N0n5k3k9o5J33j46L9
6069a15N4N5J02j38R8o2K9r8J22j50J54Nr2L1n9O9k19R7K1pJ31p5Q8J6JR5j17
6096C6k4o0Q7j79J09o0N7K7J6L6j37J55p7j14M3O0O7o0J5m6P7J14L2Pk47j22J56
6123c2R2n3J54k00L3j01J90j73P0r3J03R1q7n0K34q7J5k4r6J22j3L3j47J28j15
6148fp7N6L5R7n9l7k8M8k6l7R4l01K37j55Q7R6j83J35N8k9j06L0j3L9J7K6N2p0
6176b0jO3Lj80R9O3j57n4K54j03K43k86J30q8K1J04j29O%J75j55O2q7M2NN0j52
6203i2J85Pn3om4q5O2j5j9K22j00j73MJ91J02k39Q1Q8k73K39j0l1j5P7j0j32J92
6230A53j77M1q9J91M0k55J46K0J7J9j7l1k3p6m1J59r2N6j0m6L6jR6q5k23K76j65
$$ plain form
6041 110 -64 32 -58 -71 -78 -105 64 162 -49 -26 -67 -58 6 23 -64 -71 130 -13 34 -19 31 -24 -47 -76 -141 -8 -154 -115
6069 -115 -61 -6 96 -42 56 -6 23 -75 47 -103 51 56 -36 -5 -64 5 -214 -117 -96 -103 28 -47 41 57 58 153 36
6096 36 12 -48 39 -140 -31 -91 -34 -7 9 45 -92 63 -14 -128 -85 -25 42 -18 -3 -49 28 142 174 181 -66 -188 -32
6123 -32 60 7 161 -39 -6 -107 83 -90 -20 -113 -10 81 -6 -56 178 91 106 82 -14 108 95 128 -19 109 -6
6148 -6 -83 -27 8 105 46 9 -19 29 3 -34 60 -241 -4 -159 -72 24 -159 -24 34 5 -101 -71 -84 -45 -28 -2 50 -20
6176 -20 -21 42 45 -135 -36 27 -130 -184 70 -33 210 -76 54 -34 -13 91 -38 -32 -32 143 -12 50 -37 5 10 60 -92
6203 -92 93 100 47 41 -3 -88 -26 -41 -60 162 62 -111 -107 84 186 -53 28 116 -157 82 72 41 26 103 93 -39 153
6230 153 -24 17 -72 119 159 -96 50 70 87 106 89 58 35 -41 -82 77 -15 41 31 -15 21 20 116 31 -192 84 -81
6257h1J32o6n8J70l0r1J32j42R2o2m7m2j09L04j77L8o4J87J40k18Q5q8pJ7jj10
6283i6J25K8o6j32O9P5J17j31M8j96J34k8K03j45o9Q8J1j40N8M9J20K0k40J83
6307H5j2Nr9l9K03j07l7L8q3k4N1J55l9j78P5%m9J69k38L1%Q0J13K0j31p2L2K6
6335b5o2m6J27j64K92J11k64R5j14N5N1q7m9J56r0JQ2j24j3J87j19k14J70J88
6359A44k43O7J71k06OP0p9J31J4J3j33Q1j68K25j22l6O0m0J20j40M6J2o2J7n8
6384a10N0j09J23P0k5k4J2j4J46j21O7j42K40j17O5j51r5J22J28j45J66j09m6
6407a9J8j10J67Pj12%N9j8N2m5m9RMJ8j82K45L4j92N2J16Q3n1j28J45r0Q7j95
6434i5K88k30o0Q5r5J09q1K06q6q3P1RKK4j76J32M1P8j85lL0R4j54J92kj14o4
$$ plain form
6257 -81 51 -15 -73 97 67 -24 108 -34 58 -4 -51 -93 -202 102 -75 -37 -101 86 226 8 93 5 -2 15 14 -96
6283 -96 29 57 -9 -141 -72 3 120 -11 37 -159 -25 -53 150 5 -64 24 35 -105 -47 2 122 142 -98 85
6307 85 73 78 -21 -60 143 36 -1 37 -46 -70 -19 136 97 -81 -6 -6 -55 114 -124 -93 -93 -13 100 120 -11 -83 -51 -25
6335 -25 -87 -133 -6 -170 122 233 -31 64 -50 5 56 -31 -80 76 -14 -13 69 -55 -68 119 0 -214 -44 144
6359 144 -99 -32 139 -67 -61 9 -70 61 75 88 -45 36 -132 93 -29 -65 -5 -45 75 -65 -19 -7 -69 -52 -110
6384 -110 -60 -169 -46 24 -1 -25 -13 -27 119 -2 65 -77 163 46 111 -40 -135 -13 115 -30 136 27 -19
6407 -19 -1 -111 56 63 -49 -49 10 -8 44 -1 -50 -41 -37 -19 -201 44 78 -114 -62 54 137 86 -42 103 13 100 -95
6434 -95 193 -37 -97 -12 -107 2 -79 127 41 -42 29 38 40 64 -112 20 61 139 -46 -49 -19 75 -79 113 111 -3 -67
6461f7K16j10N2L4j84L6K6L8q1q1J70N1r5LN0j03q1J62k6j29J43j05O6J33k22
6486a04J25k64K03kK56k37pL9M2Q0j04j6L7q1P7M9J03q8j70K2O5j8j08O7q8J46
6512B4P1q3R0l4r1L5m6J3j0k0J19L9j41P3l9j06L5R2q0J21m0ll5j01n4K51J1m9
6540D2K7m4p8O2j3J21j01j4K3M2m6j5J09j10p9N0O3j19R3m8J04L0m9j71J47K9
6566E5k0r2J4l6O9N1o9k7j09K98j17qL4m7J87l4q0j39OQ3j11K91l40M7J36k66
6592b24J71J18j39j9Q3L0K16j81j01O8j44J16q5O5P2M4j0n1p6j2J21r0J15j3O1
6617A35j64oK11Pk35lK24m46K67J18j28P1m3M0j23P9J15o5K3n1o5k6J20p2K6j03
6643i4N4J29K8j87JJ52l2n0Mo6J16O0r5%r8p9N8J04o0J6mJ06o5J10k04P9J24q5
$$ plain form
6461 -67 149 39 91 125 -59 -23 3 41 -40 -121 49 100 5 8 58 -45 -126 36 10 -119 24 -81 -15 118 -104
6486 -104 21 -243 -40 -42 214 -23 -30 9 51 131 27 11 48 -33 44 93 196 108 -62 -40 25 7 -101 -34 -122 24
6512 24 95 12 102 68 -23 12 -34 -21 -31 -51 68 107 -34 39 0 -106 -71 21 -59 62 22 19 -16 -117 -171 80 91 42
6540 42 69 25 -53 9 -4 117 16 2 25 67 21 6 115 5 -74 -24 39 -80 13 -35 69 99 50 -121 26 55
6566 55 35 -57 -43 -79 -10 41 -28 -55 -164 134 17 9 43 -4 183 149 69 -70 -64 19 -92 199 -141 -94 42 -224
6592 -224 -53 65 -74 -93 -10 20 236 55 -46 22 -122 -6 -91 -26 46 90 80 29 -47 -59 62 -28 87 74 135
6617 135 -29 -35 176 183 -52 -55 169 -277 -10 108 -20 51 8 48 -75 4 119 54 77 26 -39 -65 55 -17 9 -94
6643 -94 -40 89 117 -70 -69 83 51 1 5 -61 55 115 20 20 -78 -157 -99 5 -55 -39 -43 63 -2 108 -96 -17 107 22
6671B2j57K57j23j0o2Rp3P8O5o0J05o3j21K39p9j3P9J66l91J27M7mk6M1J11l44
6697a80O1J03q7J67j00L7j7P0p2J1j92K01P6j07L8j9J05q6J47j44P9j36J63k12
6721i4M6J05j11P6L8N5l37K04N5M2jk8O9k77K05r1Q0nn8P0j16M1l6K69k36Q8P4
6748A27j66Q3O8k26J71Q2k36M2M4k6J3QK49k85j7K38k93J75j09o2N0J26j14J68
6772A10j43N9l5o1J31j12K58l02N8p2N9l7J31l0J03j55rm7J5N6o7J18Q5k53J40
6797@Rj56L23k04J0K7j03Q0O0J8q3J07m1L8k38J53N9j75Q9J05J5K5k60J99r4J21
6823H4l75L05J4j80J50Q2k10J3J18m4K5n5J00J08o0r1J11l04J79J01j17o1M1k9
6847i5N6K9m1k0J99j51k0k8P0r3j8R8K2K4j16J86o1m1j04N7l3J1J5JK9P2p4P8
$$ plain form
6671 22 -135 122 -1 -11 -73 -64 -137 -59 6 -54 51 -12 -133 106 27 14 93 259 -132 -5 42 38 12 53 164 -180
6697 -180 -119 -16 -103 64 -36 1 -16 54 -18 -7 -199 2 78 -29 9 -10 95 9 156 12 91 -45 118 -94
6721 -94 -48 57 -54 22 60 115 -222 -18 37 79 78 50 119 -158 47 -44 36 31 -27 43 -73 -32 -68 201 -35 53 127
6748 127 -39 44 112 -114 57 139 -97 -55 -11 -37 -24 -16 233 -52 -69 169 -124 51 -58 -120 -70 56 -58 110
6772 110 -33 26 -9 -70 61 -51 207 -95 -37 -109 -50 -87 44 14 117 -38 -47 -94 -79 -23 -90 28 113 -140 0
6797 0 9 -147 176 -28 -18 9 -94 -14 46 64 -19 88 47 85 -153 0 59 -116 -27 78 93 118 -142 57 -37 84
6823 84 -291 14 28 -152 -2 80 -130 -117 1 -43 -18 -73 27 135 75 -16 95 -209 -30 71 -46 -107 -66 -95
6847 -95 -39 -10 -51 -71 128 -23 -43 -71 -1 -94 -112 -14 8 32 -84 102 41 0 -104 -47 -80 -69 -54 -53 -24 48 -26 52
6875E2J3q8l4K6J18k17R8m1J31k19L7J01J13k85K5M8l5N0j4R8K4J49o9k8j26J74
6901A01j60L7K21k06J72k62O0LJ64q5j20J43j19J5K5R3j21O2j36P9J31o3m1mj5
6926b6k1j29J91n2p8L8RJJ34j62q5J78j83J11J55p2J43k69J70o8P2j81K19pm9
6951C9K6q2m8m9J60r2nJ02R4p7k5q9p2K48q1k3o8j5J9J01q2l4N4L3n6M6k16J91
6979ar8J25N8j2j17J1q5J01n3L3O2RK9n1K7J3N2k58K07j30M7J73j42j84J86j17
7005a15J08p5j69L68k37K36l5j44J09r5j4K6R3r0J67q8m7nN5PoL4j9q2p0J82j11
7032a7J42j95J81j12M2M2ko9J4k6O6J4p7p2J75J5J8m1r4P6j02P8j52J19Pp2J9
7059b3m6J3J43j71J23j76J87o0K6j24K9OJ13n0J77j59m8K9J22j72J02KK8m0p8
$$ plain form
6875 52 65 -23 -57 -31 87 -130 -32 -73 58 -161 -124 -23 90 -195 -170 -122 -157 -107 -121 -23 1 150 81 53 -73 101
6901 101 -59 -22 199 -7 165 -97 -37 -34 130 45 -75 68 -51 -36 -11 82 -39 23 -113 -34 97 34 -7 -11 -26
6926 -26 -47 -176 15 -37 -115 -77 -68 -67 67 -95 -180 -2 -185 -74 81 9 152 -117 53 -15 57 -124 95 88 39
6951 39 65 -17 -65 -114 46 -46 -51 51 145 68 43 -46 -118 130 49 26 -42 -57 -38 63 -19 -53 1 34 -22 24 -192 -1
6979 -1 -99 26 84 72 -45 -34 -119 -18 -71 -38 24 33 62 11 38 51 103 -155 52 -78 -31 142 0 -184 2 -115
7005 -115 -7 -82 -251 117 -120 116 81 -63 46 -49 -63 -37 56 -34 133 45 -2 -7 48 55 49 83 64 -18 -88 94 -17
7032 -17 125 -70 111 -1 41 83 81 12 26 0 66 80 3 -69 106 121 139 98 4 80 -22 56 -96 23 30 -42 -23
7059 -23 -69 -56 87 -84 39 -137 50 -10 16 -108 -79 -73 40 -10 167 8 -40 -11 111 -61 41 43 71 31 -47
7084d7K9n3J69J1k74J27J14j07m3L7L1j93J23m8J88j13J60k34JJ13k6k1n9N8O7
7109A0p3OJ04j19N6K5k22K11J7J8p9J08j15J5M8M7R2j49N9Op8R1n2nm3R5K9k32
7137a30K45k77Q9J98q1j38r7K17l4k6L7O4j81m9J84K0j02oL9m4L4nMJ01j8L5Q8
7164A67k17j4J18l9L9j09N0N0rj32J49pK7p1k1j06l7R4J0P1K6N4l22K37n8KQ1
7191C3p4l7j86J58P2R3o4P6j46P3o3J25j35O6J6Lj07l3Q4L7N2j17J21n0J23l7
7217H3l3p0P8j02J58j46O0p2J6l8J38j86J38n0J25n9J5N6k60Q6J19k12J41R4j39
7242f0k8k6Q2N3K3j33R8o1k6J24J26l11Q6o1J13P1p5oJ07r3p9J86j96P9P0k5J13
7269A51k4n6n8r4J52p5k19J38j3J33l6Q7j20r3M5J51r2M5Q4j99R9j17M2Q7J3j09
$$ plain form
7084 -47 -18 -71 98 109 -165 -38 76 -31 -74 -37 -6 -199 -76 -124 64 -49 111 -123 -122 -9 -35 -56 -115 -57 10
7109 10 -63 -57 47 -72 -16 9 -213 -2 15 33 -46 62 -53 -38 10 57 149 0 59 65 -13 78 26 21 -22 73 102 -130
7137 -130 115 -162 -73 125 44 -94 -191 26 -8 -34 3 67 -114 -163 21 41 -61 -67 -28 -72 -38 -43 -39 62 44 79 167
7164 167 -50 -64 54 15 54 -55 -5 45 36 -96 53 46 73 2 -19 -125 -162 -68 -58 13 39 93 -229 8 -50 -48 33
7191 33 -41 -78 -264 -106 -34 59 -5 71 -75 -2 -65 60 -75 -9 7 10 -97 -130 -46 -9 43 -74 47 -3 120 83
7217 83 50 -20 58 -44 114 -32 28 -44 -28 -66 72 -114 24 -26 99 40 55 111 -149 -63 56 -156 -15 79 -60
7242 -60 -88 -114 -32 21 44 -89 9 -52 -78 46 172 -139 -53 -114 -1 70 -5 -11 96 3 -76 110 -86 -7 63 38 151
7269 151 127 71 13 -81 71 -4 -223 -85 -98 35 -1 86 -34 -127 -82 69 -23 22 106 -93 6 -111 -69 18 31 -78
7295g8R9J07p8O9l1j22k8m9J42K3j23O5j37J51J7j55J22J55k70Q6m2N0N7Q0r4
7320A6r5J60o1j01P4J07o7M6q6O6j26J29OO4l9J5k3q8j38R0j25L02Pj93J22j67
7346a05JP7J56j80p3R5j8J19j29l6Q3K0j48l3J78qJ53j34j88J01R6r1N9j59K80
7371A16j48J39o3j58K47k56N1K15j13q3J04M7n7j80K01j2j77J14k3O0k9j13K23
7394A05j66r8J55o1q8M3R3j25J69Nj73J41M1M2j43O2j7J76k95K75k04L9j0J19
7418H5J34k30%l0M7o2N1nL2J4j13J2M1P1j13O2O3q0Q3r7M8l6p9j5J71p0M3O3j23
7447c3M8O5j61J79o3K1r9J87j04Mk4J33j07j06J32j1q2m1J66k35O2R8L1j61K08
7472A07j75O9p7J27o2P2L4k22J20L7o0K4n5N2J8J69k18K3J23o9l7k6l3J35m1K3
$$ plain form
7295 -78 21 128 50 119 88 -34 -62 -111 31 54 -69 -4 -141 10 27 -128 -6 149 -121 -35 -77 -27 30 110 16
7320 16 -79 81 20 -81 -7 100 33 79 -7 59 -67 62 68 132 93 108 85 -3 -141 -51 -176 126 133 -60 62 -105
7346 -105 -104 -27 129 -51 -124 -29 -47 72 -57 -93 -10 10 -138 -171 7 -1 152 18 -170 -69 27 -64 -5 -164 116
7371 116 -32 107 44 -114 133 -123 -72 143 30 -53 51 98 41 -139 62 50 -127 -13 -36 24 -5 -118 105
7394 105 -61 -159 -4 -65 -153 -110 -17 -142 27 32 -141 0 41 83 -60 2 -15 161 -134 141 -63 -24 -34 85
7418 85 219 -11 -11 -41 6 -56 -5 -10 22 36 -77 -65 -24 47 -66 -4 59 -21 62 -35 13 -23 -102 -117 54 -16 27 90 -33
7447 -33 15 80 -81 98 35 56 -43 144 40 44 20 153 46 -60 72 61 -21 -62 104 -131 -69 29 60 -101 107
7472 107 -68 1 -76 51 -11 61 95 -127 -7 30 -30 -6 -61 -9 9 178 -40 -17 106 37 0 -26 -59 76 35 58
7498E8l5K0o3ol3L8m1J05l2L7l3r0o8J54m8J81kj69K1p1Q3r8J0M7QJ46j13rL6
7527C3o0k0m8J7J68k04J33j54J13r2J29n6K22j22j31r6K11j00n7J76j07j5O3J37
7551A40j58m6K23k54J56m7m5R9o0l1L7m8J2J27M2k11R9J3j45K09j75QJ46k44J43
7576a0J47n3n2n4J36j04J2k5J1J11j52J34L5j55J79j91N6j53K73k95J24j42K53
7599H5j46R5r6O7M3j6l2p3K14j45k00K99l2mJ3r6Q4j69j01K94j18J17M6k12j17
7624b00J40R9K1no3Nm8q7K08o9%j60J16R4j10J06q8J12Qq5pL9N4j65rJ04m4J14
7652H0j02J85r1L7O4l26O8Q0j49J30j3l7RJ72k52J56Q6k34L06k58R1K7k8kq4n0
7678a35J27M1Pk0j4q5P1J0p8L3J3J39p1P1r1K9o6J10j63R5j18N7j16J75m8J2J10
$$ plain form
7498 58 23 43 -20 -26 -59 -21 -62 43 11 48 15 -75 -143 11 -37 144 142 -27 -6 -77 6 -92 -82 -35 -27 119 6 -3 33
7527 33 -27 -47 -95 -78 90 -114 19 -135 -22 -114 15 -41 181 59 -72 -168 43 -57 -114 62 -45 -60 3 140
7551 140 -18 -64 159 -95 61 14 -31 68 8 -23 14 -34 -22 105 147 -64 35 48 -97 112 -63 -55 91 -153 -10
7576 -10 137 84 32 -22 114 10 22 -3 8 119 -33 101 136 -19 160 -31 25 -128 145 -150 -26 -168 85
7599 85 -61 34 -62 5 48 32 0 -73 141 -4 -204 95 63 59 72 -24 60 -109 -210 84 -34 83 129 -83 -200
7624 -200 -60 39 60 55 -8 -3 -51 -138 70 1 1 -159 -43 51 -59 47 -41 71 79 -6 -13 26 80 -85 -94 10 -34 80
7652 80 -22 163 72 109 173 -153 -85 -5 -154 -24 -37 -74 -65 107 -145 11 97 -137 169 -89 2 29 1 -1 -85 -135
7678 -135 -8 33 40 20 6 -79 -8 2 -76 -43 -30 109 38 109 18 47 -19 91 -72 23 -95 -38 -154 21 -27 -15 95
7705I5l7o6m2M6p4P1O6n7q7J33k9J38k34R5N1n8q3M9J60q8j09O8K1RMp2KR8j27
7734e7J10j50K94k79O1n6J03p6KJ28M5j56N5J1%q7J42n1m7L1l8K40k98J37j03
7759c9O2R4k95Q7J82j32J77j10o1J03k6j67J69r3M6N4k1j77L4J22k7N7Nj7K2L8
7785H7K4k08K2J12o5L0r8M8K5o5J85k78K16j85J13p9J24L1n7O0J4k27J38L7K8
7810C2j85K48q7M3j74J79k7L0m9j76N9L7K11j26m9K6o8j2J8k6J1O4l7n4j0J45
7836B3q6Q0o6J8r0K19l1o7j56R0P3J16k7j40J16r7M7j14P4J33j07p0Q5J17r4k9
7862A7N1j22Q4j09Q9P9k12P1J6J75k8r8m0J06p5M9j25R3n7j01k1J95R0j28R5j53
7888e9M5k16K56p1N3K0N8K9j28p9J79o9r5L0J29j03K1j3O3Q4j19M5j14J08r6J4
$$ plain form
7705 95 58 -8 -50 -4 -78 -7 59 2 -85 48 19 157 -77 18 69 11 -72 -23 137 49 -60 8 29 38 42 -30 -28 70 -57
7734 -57 53 -97 197 -82 -21 -77 26 -50 -48 80 125 -31 24 35 35 -52 90 39 -8 23 -15 225 -73 64 -39
7759 -39 23 117 -178 -91 91 -41 136 26 -35 68 42 -125 44 -49 -3 51 30 -147 -113 9 -18 39 44 27 49 87
7785 87 111 -97 -75 37 -28 2 -96 -48 -23 -88 97 -181 35 -150 -37 -116 8 39 -18 42 56 -171 -33 4 32
7810 32 -153 95 8 51 -123 56 29 59 10 -166 -107 -70 141 15 -34 -8 -76 -88 -70 -96 -85 -21 -58 -112 -122 23
7836 23 -63 17 -49 -31 -121 98 67 0 -156 -66 7 123 96 -44 72 -25 22 -92 -18 115 8 -62 23 140 46 17
7862 17 68 -54 30 -79 10 89 -123 -52 -36 139 111 13 -27 79 4 53 -72 21 -36 -137 -158 37 127 -1 94 -59
7888 -59 -14 -230 26 -45 8 28 86 115 -13 -92 87 18 -77 -47 82 -21 0 -13 50 134 15 60 -54 54 -42 -28
7914b8Q0N9j88R9n8Q3J36k33j5J92k08J06K5q7RR8j56J7J55p7n7Q0j99J02M4J81
7940A60j74Lj3p3J03M2j17K2j80J97J99j39r8m8j7J17P1k30J25n1Q3J18k08K1
7964h7n3P8O2R7J2j11j01kK19j5j99l7Q6J03n5K59q8k30J00N8J04k46J63j09j4
7989fqJ12J0p3O9l9J2j43K14j69KK1L6r0k2L7j6J36j18O6M4m8L8o2j48J34K2K8
8017C9J1j11lj46J78P8n3R3q6L0n1k9M0j17MR1o3Q4l9J37o4o3qO9N2r0L9o7J70
8046A25m8r3q5J8P7Q9J1k03N2J08k1k07O3O3J23j4n4K8N7j23q4N4J02j10J81K9
8072A38K0k29Q4L5j99Q1P7K20k57qK0N1j0N7j08L1J34k04J67k00K25q4%r5P2K3
8098D1j1M3m7R5j27j19O4l8J35L8Q8l3k98J76p1O3q0J22o1K6Q6m6j01m6N7R2k4
$$ plain form
7914 -28 52 111 -77 22 -36 47 183 -50 -65 127 -81 25 50 -37 -28 70 -86 -69 86 9 -48 32 -167 -65 -21 160
7940 160 -14 -11 -24 -97 6 48 -69 -47 -227 -30 169 30 -68 -116 -133 -16 55 -175 -50 -101 -18 100 -108 -87
7964 -87 -140 -62 0 97 109 -2 -103 -105 114 99 -100 -137 -51 52 -3 256 168 -62 38 96 200 -46 117 8 -6
7989 -6 -14 98 108 35 104 65 77 -66 148 -21 -19 2 38 -52 -74 -37 -53 83 -35 31 75 27 65 3 -145 -11 11 39
8017 39 50 -61 -64 -210 -32 46 -7 86 0 30 -21 -50 -10 -127 -123 -32 -95 -11 -50 87 23 -40 -48 21 73 -17 22 -45 125
8046 125 77 -16 -101 -83 -6 83 94 -109 -57 51 30 -177 -114 -51 72 58 4 32 89 -34 -118 -64 38 -72 109 138
8072 138 158 -71 13 48 -151 -70 7 227 -30 -38 -18 33 23 80 -28 3 137 -67 100 -100 125 41 41 -54 18 41
8098 41 30 73 26 121 -6 -125 -61 -99 36 74 162 129 -169 7 -64 -1 -81 41 -20 6 92 46 -55 -101 -44 48 24
8125B4J5j40R%O6n3l7QJ78p4j26J07j8K63l12K10k36q5J38j8O9J19n3K8j09r1
8151a18K2K82pj43J02j16P4k50L27l37J80n5m7n1K08q2r6J74j62L7L7M0j25K13
8175A07j31j5p1M4J49O9m05L55o6Q1o6OJ51l01L07j82
$$ plain form
8125 24 39 -101 -92 -92 -26 -79 -116 -108 70 -4 -130 -23 -41 222 -90 120 -116 -201 -63 -81 -12 107 54 82 -27 -118
8151 -118 -96 186 179 36 138 22 96 -154 173 -164 16 -39 -86 -137 71 -11 -107 67 -95 -58 -21 19 -106 107
8175 107 -24 -39 -110 -66 83 152 -253 102 36 117 51 57 208 -93 214 32
8191C2
$$ Imaginary data points
##PAGE= N=2
##DATA TABLE= (X++(I..I)), XYDATA
0@%%%%%%%%%%%lJ1j6J6j6K4l2L2m0N4o2P2q8J04j20J36j55J79k05K34k66L02l42
34a81L84m32M85n43O07o76P51q34R26j024J131j251J379j518J673j844K033k241
52a175K468k723L012l340L712m137M638n234N951o836P965r455J1514j4559J9509
67A1310k8870N2425k16311l78102O26504L58257m14252k85366K95477J57879j74952
78C999r4163N0549k321R9488J30288j57955k70824J30952L26433o5108l24280
89a72942K2240K79968J7714k19043n2065J12457N3535K746n416r0464m5243J40845
101D4332O9543j81889p3939K16443R5438k02557r8369J29622L8636n4821O5848
112D8287K8788j35167k4689J41420j9383j37066R0321J57489j29979j67129J20880
$$ plain form
0 0 0 0 0 0 0 0 0 0 0 0 0 -3 8 -8 8 -8 16 -16 16 -24 30 -32 40 -48 56 -64 72 -83 96 -109 125 -141 161 -181
34 -181 203 -229 256 -287 320 -356 395 -439 487 -537 594 -657 722 -796 877 -967 1066 -1175
52 -1175 1293 -1430 1582 -1758 1954 -2183 2455 -2779 3172 -3664 4301 -5154 6360 -8199 11310
67 11310 -17560 34865 -181446 -559548 66956 425213 10961 -274405 21072 178951 3999
78 3999 -90164 -39615 -41936 57552 187840 29885 -240939 -109987 216446 151338 -172942
89 -172942 -150702 129266 146980 -72063 -124128 -11671 41864 44610 39194 -51270 -96513 44332
101 44332 113875 -68014 -141953 74490 169928 -32629 -130998 -1376 37260 -17561 48287
112 48287 77075 -58092 -82781 58639 39256 -97810 -7489 150000 20021 -147108 -26228
123b6228J14604j25036l0991J72568k5094k27214M1015K46217n0123k35330O9306
134g6306K29944p2332k14578N9093J70640m9642j06347N9041N2958o3836q218
145a9583N4839m8960n4054J04536O9988j25776p8799J04710M6644q8708J608R2085
157E8530l0356q6529L6125M5310n2973N527R1199k1833j10698J4702Q9645k1293
169A7356m8550N3337K8341p4779k4938O9776J0814n6652J6659N5247l6387n3797
181d3573L8322L2651m5591n015O2896j7863p7221L7826Q0262o7676q6954R4557
193B621J04126r4421j07681P6160Q3133o2194m5832N9885K5536m4370j2328J1076
205d289j6671J8006N8333k1001q0850Q822P1126j1676n6630K4763N2749l0980
$$ plain form
123 -26228 88376 -36660 -67651 104917 79823 -147391 -106376 139841 89718 -145612 -76306
134 -76306 153638 81306 -133272 -74179 96461 46819 -59528 -487 52471 -11365 -19583
145 -19583 35256 -13704 -67758 36778 106766 -19010 -97809 6901 53545 -35163 -33555 58530
157 58530 28174 -58355 -22230 23080 -29893 -24366 66833 45000 -65698 -50996 38649 17356
169 17356 -31194 22143 50484 -24295 -49233 20543 31357 -25295 -8636 46611 10224 -43573
181 -43573 -5251 27400 -18191 -23206 39690 21827 -55394 -17568 62694 -4982 -91936 2621
193 2621 106747 12326 -95355 -19195 63938 1744 -44088 15797 41333 -3037 -15365 -4289
205 -4289 -20960 -2954 55379 34378 -46472 -37650 33476 21800 -34830 -10067 42682 11702
217A1702n0329K1243K7151j7027M516K9581k4307m3351L1013M6199l7644m1023
229d2276M8635M0121m7464l4983L8029J9787l0431J28K9601j0268k0251J4220
241D848j762k7398J7742M4187j9343m9491J6623L5268k8061k4250M3717K6820
253C8900m5201l0090L3124J7473k4822L609K9181j0749k9470Q000J8693j0658
265b010k870K3617k701l0581K780K5857q766j9474J7619J7145k2771j4618K0843
278D070J906k2257R129K5459j3142k3705J4890J5166k3739r590L3516J3470k9808
291d635j4129J8575N986j2809O700J7007p712j4767K676J423m862J2117J5296
304B0866j4913k2740J2298J6857j6935j0889K3735J0323k4910j2276J7519N742
$$ plain form
217 11702 -38627 -17384 9767 -7260 -2744 26837 2530 -40821 -9808 36391 -1253 -42276
229 -42276 6359 46480 -984 -35967 2062 21849 -8582 -8454 21147 10879 -9372 4848
241 4848 3086 -24312 -6570 37617 18274 -31217 -14594 20674 -7387 -31637 12080 38900
253 38900 -6301 -36391 -3267 14206 -10616 -7007 22174 11425 -18045 -10045 8648 -2010
265 -2010 -4880 18737 16036 -14545 -11765 14092 5326 -14148 3471 20616 -2155 -16773 4070
278 4070 5976 -16281 -7152 18307 5165 -18540 -3650 11516 -12223 -21813 11703 25173 -4635
291 -4635 -18764 -189 5797 -7012 -312 16695 8983 -5784 -3108 -1685 -6547 5570 20866
304 20866 5953 -16787 -4489 12368 -4567 -15456 8279 18602 -6308 -18584 -1065 4677
316D677j1566M566J0427q742o938R047P02j0970M363J6558k439j5038J625R044
330E316m548o381P717R196n319q383Q23j528m124Q435J0733p951j3259M654O681
345B062j0102j883J8305L591j8444n375J1438J425n321O455N665p826l057N162
359B095l361k914R528N166q950n998O428K204o326j066N440K359k192l811l052
374d450n83J473M871K892m794n219L805M497o678n847J1511J1161q178j1663m9
389g251O064O590L131o265p495P345Q901j2217j2435J3519J6527p907j6544l221
403a1258R140Q574r24j1127n362J2905R108j3063j3626P721J5796K771j2162r868
417a1375N832J4161m67j5011j846J5754O663j0376j0847r73J0416J1957m560j7740
$$ plain form
316 4677 -6889 -2323 8104 -638 -7576 1471 2173 -8797 -4434 12124 9685 -5353 -3728 5316
330 5316 768 -5613 2104 11300 5981 -2402 -1579 -3107 -7231 1204 11937 3986 -9273 -4619 2062
345 2062 -8040 -9923 8382 11973 -6471 -11846 -408 1017 -4304 2151 7816 -10 -3067 2095
359 2095 -1266 -4180 5348 10514 1564 -4434 1994 4198 -2128 -3194 2246 4605 2413 -1398 -4450
374 -4450 -5033 -3560 1311 4203 -591 -5810 -2005 2492 -4186 -10033 1478 12639 4461 -7202 -7251
389 -7251 -1187 5403 8534 2269 -5226 2119 11020 -1197 -13632 -113 16414 8507 -8037 -11258
403 -11258 -2118 6456 5532 -5595 -10957 1948 11056 -2007 -15633 -7912 7884 10655 -1507 -11375
417 -11375 -5543 8618 8151 -6860 -8706 7048 13711 3335 -7512 -8485 1931 13888 9328 -8412
431h412j933J6988L415j5731n081J1429Q415l250j1022r009O619J6720J895j6288
445e245p111J0697Q613k804q484n075R672J5939o093k3532k038K5641J0825k0874
459A31j6278J1542J9157j684k1836r906J9443J8285j1132k2145k3J6420Q442p090
473C326j3438l551J8014J3723k0183k2275J7757K8840q561k6765J51J9188N237
486A1463q589p968J537R572M216r166r832L280J1007M313o347j1595j974J4105
500D022O845j4924r379J3591R700r743q291M081L056J11N080M71q920k818Q890
515A772P764o458j3255L532K1098K353k7677j1024K9641J7336k6511j8150J9114
528d65J3896j2134r079L920J907L041O928p841j6469O877K2957m77k3749o668
$$ plain form
431 -8412 -10345 6643 10058 -5673 -10754 675 9090 5840 -5182 -14191 -7572 9148 11043 -5245
445 -5245 -12356 -1659 6954 4150 -4334 -9409 263 16202 10109 -13423 -15461 10180 21005 131
459 131 -16147 -4605 14552 12868 -8968 -18874 569 18854 7722 -14423 -14446 1974 10416 3326
473 3326 -10112 -13663 4351 18074 -2109 -24384 -6627 22213 13652 -13113 -12962 6226 11463
486 11463 2874 -5094 -3557 6015 10231 1065 -8767 -5487 5520 9833 3486 -8109 -10083 4022
500 4022 10867 -4057 -13436 155 9855 112 -8179 -4098 -1042 -931 4149 4620 -4300 -7118 1772
515 1772 9536 3078 -10177 -6645 14453 16806 -10871 -21895 7746 25082 -1429 -19579 -465
528 -465 13431 1297 -7782 -3862 -1955 1086 8014 173 -16296 -9419 13538 13061 -10688 -17356
542a7356K2554J3545j9588j7710J6721K1537j1479k0994O898J5679n072p085M529
555B179j43m804N005M220j0196o046J1621P923r389q999L271P436L75o759o20
570d926Q033R35r468N0J0949k371j2777Q556J5937j2159j8589J2405K0957j0586
584F946k0935Q300J9815n391j8439J119J5431J747j1979k591O604o50k247M985
598B715j126r838K976J5035m163j8974M749K0984k854j9023J685J6213j205j2602
612e428J408R334R6m928j657J105P85l06K97L07o33j243n08P29j033j218K651
629b42J433l871p40M847l78o410P47R951Q74j1531k741J1860O279j0615r271J0302
645D94J2147q425j3724N634J3251k556j1510N10P004j40k919o57j871O36N787
$$ plain form
542 -17356 5198 18743 -845 -18555 -1834 19703 8224 -12770 -5872 9807 4735 -2350 2179
555 2179 2036 -2768 2237 6457 -3739 -9785 1836 9759 370 -8629 -5358 2078 2453 -4306 -4926
570 -4926 3107 4042 -5426 -5376 5573 3202 -9575 -1019 14918 2759 -15830 -3425 17532 6946
584 6946 -13989 -5689 14126 8735 -9704 -8585 6846 8593 -3386 -5977 627 -23 -2270 2715
598 2715 1589 -8249 -5273 9762 5599 -13375 -8626 12358 9504 -9519 -7834 8379 7174 -5428
612 -5428 -4020 5314 5410 482 -1175 -70 715 409 706 1013 380 -863 -1371 -642 -1675 -2893 -242
629 -242 1191 -2680 -3420 1427 1049 -5361 -4614 5337 6211 -5320 -8061 3799 10078 -537 -9808 494
645 494 12641 4216 -9508 -3874 9377 6821 -4689 -4179 2825 2685 -234 -891 -2762 -2126 3661
660C661O85r928l554J1039N860q729o619N894O794k735o411N56N693K834k820
675B220m509l7M100K191k646l384J426M126p73n458p32M037K122k910k767R67
691b027J558L15j136r47J310J397j166p42J209O52j187L59L025m06l784L61L807
708B598P46l049j204L008J165l488j530K283J652j341j775J76j90K28R93j330
724a058j490K061J439k038j293J304J113l35O32M11j655M1K485n17j553P24J776
741B047l89j587n08O53J083j9j877k29J966p34k809O93J985r9j028n18K75j1P74
760c32j56o70J492P83j941l49K580j39j230Q19J154j348n90J756o61j701J578
777A045Q38j829q13N50J62m88K74l71q45R31M08j878J86K025J4j380Q5P82L54
$$ plain form
660 3661 4346 -5582 -9136 1903 7763 -966 -7585 -1691 5103 2368 -4043 -3487 2206 5040 2220
675 2220 -2289 -2326 1774 3965 1319 -2065 -639 3487 2714 -2744 -3476 561 2683 -227 -2994 -2027
691 -2027 -469 -154 -1290 -2237 -927 470 -696 -1438 -229 423 -764 -405 2620 2214 -1570 -1209 2598
708 2598 3344 295 -909 2099 3264 -224 -1754 529 2181 840 -935 -759 -949 -721 272 -1058
724 -1058 -2548 -487 952 -1086 -2379 -1075 38 -297 335 746 -909 -868 1617 1100 -453 271 2047
741 2047 1658 71 -437 216 1299 1280 -597 -826 1140 406 -2403 -1710 275 176 -852 -1370 -1095 -1106 -332
760 -332 -488 -1158 334 1117 -824 -1173 1407 1268 38 857 2011 663 73 1829 1168 -533 1045
777 1045 1883 54 -759 -209 -47 -535 -261 -632 -1477 -546 -138 -2016 -1830 195 209 -1171 -1086 -304 50
796E0RN6o23J287J750k204j801K725J257k140o05J643p4j705L82N28j008P48M13
815F88k249k80K214k56k103O34K032r63r99R70l37j64J839k11j405R82Q06q20
833C78j74J077k22o65J303r81j815J409J555k249p59J785n35j895Q95J041j748
850a600K67K095j476j736J946J018j716M83J860j387j176K744M33k610N25K548
866B218q01j404j5P48M56M6j357p74J537Q67k329r22J682J36l32J21j417n05K556
885E11N56l102l28M159l26l423J338K336j597l03K184j180k234K335K001l148
901b21j349L241K72k639l0J176n30p01N55J94q65j39L88K72L58j157j47K070n0
920F98k253O52K007j99j195Q88N90j562J275J335k573n88L231j53l183K22J832
$$ plain form
796 50 59 115 -508 779 2529 325 -1476 1249 2506 366 -239 1404 1330 -375 7 535 -473 275 688
815 688 -1561 -1841 373 117 -1986 -1352 680 -283 -1282 -312 -649 -813 1026 815 -590 392 1198 378
833 378 204 1281 1059 394 1697 716 -1099 310 1865 -384 -1143 642 107 -1788 -893 148 -1600
850 -1600 -1333 762 -714 -2450 -504 514 -1202 -719 1141 -246 -1422 1322 1755 -855 -330 2218
866 2218 1417 13 -2 746 1202 1248 -109 -883 654 1521 -808 -1730 -48 88 -244 -123 -1540 -2045 511
885 511 1067 -2035 -2363 1796 1470 -1953 -615 1721 124 -179 2005 825 -1409 926 2927 -221
901 -221 -1570 1671 1943 -696 -726 450 -80 -781 -226 -32 -897 -1036 -648 -376 -18 -1175 -1322 748 698
920 698 -1555 -903 1104 905 -290 598 1188 -374 901 2236 -337 -925 2306 2153 -1030 -808 1024
937A024q15q15J475j034j935K380R98l424l10L422L7l125P16K616j302j421J712
954A99J132j218r78J182J508j092j595J244K025j337k221J164J821j766r58K347
970A457j451k550K758K304m391k309N248J996n014j562L892P29j346m48j91M25
986d53J789M87l117o92M113J280l495j633K147J663n61j902p49J537J041n56k013
1003a114p35J323J704j57k988r60L841J433m337j280M366R40l455J76K847j687
1019h3j067L238j66l829J015L982j294l402R35K297j085o34K88j121k1K109J7
1036A179k876j033K765J593k016k058J205K309j84k194l03J525J007N56r79j986
1052a490O84L969m29n063j15O022L08n675n86M215N0k515K60M05j294J047K499
$$ plain form
937 1024 209 -606 869 -165 -2100 280 1278 -2146 -2456 966 1003 -2122 -1406 1210 -92 -1513 199
954 199 1331 113 -865 317 1825 733 -862 382 2407 1070 -1151 13 1834 68 -890 1457
970 1457 6 -2544 214 2518 -1873 -4182 1066 3062 -1952 -3514 378 1107 -239 -687 -878 -453
986 -453 1336 1823 -1294 -1986 2127 3407 -88 -1721 426 2089 1528 -374 -1123 414 1455 899 -1114
1003 -1114 -1849 -526 1178 1021 -1967 -2927 914 2347 -1990 -3270 1096 2036 -1419 -1243 1604 -83
1019 -83 -1150 2088 1922 -1907 -892 3090 1796 -1606 -671 1626 541 -93 195 -926 -947 1162 1179
1036 1179 -1697 -2730 35 1628 -388 -2446 -1241 1068 884 -1310 -1613 -88 919 1475 496 -1490
1052 -1490 -806 3163 2734 -2329 -2444 3578 3886 -1789 -2375 1840 1890 -625 -365 40 -1254 -207 2292
1069B292k743l527L321L855l020l838K526L503j794k597J412J535m82kJ57o75
1085g7J3J069O84j650r76J564R75j146j067M00L01j54M06l86j717Q34K238r52
1103C59k543L58L029o48k658J295J974j133m66J443q51j522J940K528l017k219
1119b131L625J841l500k142L078J573k279r30J243m63q93J117L74j935j64K469
1135H83j6k994K34K849L7k487J81K016K2j186M31Q42p84n1J154o68j052J043J028
1154A482r72j527J198J067j703k68J210m24j243M67J416j098j364J741J022j900
1170h96m99J947j29j483P94J676j491q08K097O2j932P32J576q75j413J100Q18
1187A276j256m62R48j99j225N91P10o42j008N88J078n92j400R33J170o01j092
$$ plain form
1069 2292 -451 -3978 -657 3198 178 -3660 -1134 2369 575 -2022 -610 925 443 441 598 -77
1085 -77 -64 1005 1689 39 -937 627 1602 456 -611 -211 90 -64 342 -44 -1761 -927 1311 359
1103 359 -2184 -1826 1203 555 -2103 -808 1166 33 -433 1010 159 -1363 577 3105 88 -2131
1119 -2131 1494 3335 -165 -2307 771 2344 65 -865 378 -85 -978 139 513 -1422 -1586 883
1135 883 867 -2127 -1893 956 993 -1494 -1313 703 725 -461 -30 812 28 -23 1131 463 -589 454 1482
1154 1482 510 -1017 181 1248 -455 -723 487 63 -1180 -713 703 -395 -1759 -18 1004 -896
1170 -896 -1395 552 423 -1060 -266 1410 -81 -889 1208 1270 -662 70 1646 771 -642 458 1276
1187 1276 20 -442 506 307 -918 -327 383 -259 -1267 -679 399 -193 -1593 -660 510 -91 -1183
1204a183J230R23j651l13K056l26j572J050J428j239j156J734O27k228M60J524
1220A364j193j023J190L23j608L4J528n53j179Q45L59n92j06L62O7m2M1L47l1
1239A33j20P0L37Q2m54L8Q85m76q33O43O39r28n73J124j2j607P01J214j402j063
1259a602J837K49j853K43J805p20j176J282N25j207Q1J333n39p78R39N85p55l24
1277g5O39R7l97jq4lK57m65j54N35o10j41M59o3q58R2J073m85r89J154N92j174
1299f01o9J192l21o20O03O05j150M19J090q64p02J057K91j228K76P32o04p71J096
1318D31l9q54j35O80m38j75J57J71k90K49J15j5O2L1k2L65N9o59K79J034o18q76
1340d88Q23P65j027m30J325o00q19P35L21j170r6J056k76j009N43M14o06L8M11
$$ plain form
1204 -1183 47 970 -681 -994 1062 736 -836 214 1642 403 -753 981 1608 -620 -160 1364
1220 1364 171 -852 338 661 -947 -913 615 62 -1117 -272 87 -505 -611 -249 -182 -224 -183 164 133
1239 133 13 83 420 502 48 86 971 495 -338 305 944 16 -557 567 555 -1052 -351 863 -539 -1602
1259 -1602 235 484 -1369 -1126 679 -41 -1217 65 590 -617 -536 797 258 -520 419 1004 249 -75
1277 -75 564 661 264 263 179 176 433 -32 -186 349 -261 -402 57 -6 -864 -772 301 -184 -1173 -19 573 -601
1299 -601 -670 522 201 -419 184 789 -361 58 1148 284 -418 639 930 -298 -22 710 106 -665 431
1318 431 392 -462 -597 83 -355 -530 -373 -202 -492 -243 -128 -143 -81 -50 -72 293 352 -307 -28 1006 388 -488
1340 -488 335 1100 73 -357 968 368 -451 284 605 -565 -661 395 119 -890 -347 67 -539 -501 -90
1359i0l01o3O49k16n35M75O94p56k83Q29r8j81M50l3n13J78K00l8l25K8l06J99
1381c6L46n11o46R60L99j155j11Q09O7q07K93L93n07J30Q29l64p51Q09N53n89
1401A11k31L07K85q9Q0k12n52P62K19r32k21P84k44m23j80L54k16J98M7k49m7
1422d49L40j2j29J77k70J25O66Q3q12J7R83r3j096N26P66l20o64M92l5l33K23
1443A85J38m97m59P02K29k14m81l60O11O14p57p48N78J161o08p09O08P22n66q1
1463F8L55k54k90L72L79n01l75O12K48m39o60P2Q54Pj010j68R87K1j059q3J193
1484C29m91n39O60M44r15R3P77J44o32k86Q95K23o69l16M42O43n09n58L38N95
1504F68l78m36Q8J49l98o1N27k64o13M70M50l08o06Q2P24K31p93q3O93K20k48
$$ plain form
1359 -90 -391 -454 195 -21 -556 -81 613 -143 -426 403 305 124 574 541 28 206 406 368 43 71 -235 -36
1381 -36 310 -201 -847 113 512 -643 -754 55 122 -685 -392 1 -506 -376 453 89 -662 147 700 111
1401 111 -120 187 472 383 463 251 -301 461 680 -252 -473 311 67 -356 -536 -182 -398 -200 -153 -402 -449
1422 -449 -109 -121 -250 -73 -343 -218 448 531 -281 -264 719 626 -470 56 822 502 -162 330 295 -38 185
1443 185 323 -174 -633 69 298 84 -397 -757 -146 468 -289 -1037 -459 702 94 -615 -7 715 149 68
1463 68 423 169 -121 251 630 129 -246 366 614 175 -485 -413 441 448 -562 -730 257 278 -781 -864 329
1484 329 -162 -701 -41 403 -512 -419 358 502 -130 -416 479 702 33 -283 159 802 293 -265 73 668
1504 668 290 -146 -58 91 -307 -368 159 -105 -718 -248 202 -106 -712 -630 94 325 -468 -551 142 362 114
1525A14j94L94J48k92oL68l49l76L42M84n75m70M40M34o94m05O25L31n40l23M57
1546h7K77l05k81J86K41l09P2L62m6k49K11K55l3m23J61N36j2m30j00J90j94q1
1568e9J47j33j00m8J22j6k25J40P6k17J17k49K63J82o2k61J04K18J66j24N3K06
1590C00k23P7m6J74r6P7K23k45k36o7L34k85k53q8M38k00l30J82P3l7n0nKlJ69
1615a15J55j64n4k8M44K38l87j20L21p2k40K41L7j7j71J75r0l30K56K20m66j29
1637b96K21J5k88J18K81n25M4M13k19nK62K36m25M8M06j75m5K37K3k48o2K79n6
1660B39r3L6j08R9J11m03j12J56r1l81L61N17n38k99N65j27k69R3N44m94j37P16
1682C85j52l92M3N76k70j30L57j97k42J32L38m61l3K84j99l65K87Q6k47K52L0
$$ plain form
1525 114 -80 314 462 170 164 532 183 -193 149 633 58 -412 28 462 -232 -637 -12 319 -221 -544 -87
1546 -87 190 -115 -396 -210 31 -278 -206 156 110 -139 72 327 294 -129 32 568 556 126 26 216 22 -59
1568 -59 88 -45 -145 -193 -71 -87 -312 -172 -96 -313 -196 -445 -182 0 -62 -323 -219 -1 165 41 94 300
1590 300 77 154 108 282 186 263 486 241 5 -62 272 -13 -266 -354 84 -116 -446 -264 -191 -228 -278 -283 -281 -284 -115
1615 -115 40 -124 -178 -206 238 476 89 -31 290 218 -22 219 256 239 68 243 153 -177 79 299 -167 -296
1637 -296 -75 -60 -348 -230 51 -474 -430 -17 -236 -241 21 257 -168 -120 286 111 66 303 326 78 16 295 239
1660 239 146 182 74 173 284 -119 -231 -75 -166 -547 -186 331 -207 -506 59 -68 -337 -244 300 -194 -331 385
1682 385 233 -159 -116 460 190 60 417 220 -22 110 448 -13 -46 238 39 -326 -39 47 -200 52 82
1703H2l19j20N06k90j49L90k10o3O5J06j42K56J71j42k17L96Ll65K86J67k86l77
1725b52O36k51n07L53M09n44o3K97ln48J44L65l17m6L64ql45K48l4o1K11K36l17
1748c3O2M01l56p1N53k04l49P9K93l39J5L3P0l92L00J64p09K23L28k51l03K71
1770b15K69m48K54M16n12J8M85L3l68J47K83k36j52K09K16l99j3L53l01NNj50
1792a01K84j35k92K64RKl64K42K5j88n9M36k42k58K11L24k89j44N39j06l91L88
1814A55K94m11J16L13k33k43J15J79k35k02J12j36k9J82Qk89J8K50p1p0kq2K47
1837a4j76n7K62K43k95l10N07P7m19M70K13k52m59L59L11o01j26M95k8m10O0L45
1859A95m10j59K80R9k51N0J26p4PJ49k4r8P2p2J69p3K09m10K04L06J7m30K27k1
$$ plain form
1703 82 -237 -357 149 -141 -290 100 -110 -173 -108 -2 -144 112 283 141 -76 320 323 -42 244 411 125 -252
1725 -252 384 133 -374 -21 388 -156 -219 78 75 -473 -329 36 -281 -327 37 29 -316 -68 -102 -163 48 284 -33
1748 -33 29 430 74 3 556 352 3 82 375 36 51 84 154 -238 62 226 -483 -260 68 -183 -486 -215
1770 -215 54 -394 -140 276 -236 -218 267 300 -68 79 362 126 -26 183 399 0 -13 340 39 44 49 -101
1792 -101 183 48 -244 20 29 31 -333 -91 -66 -254 -313 123 -119 -377 -166 158 -131 -275 264 158 -233 155
1814 155 449 38 154 467 234 -9 106 285 50 -152 -40 -176 -205 -23 -15 -304 -286 -36 -107 -177 -179 -261 -14
1837 -14 -190 -247 15 258 -37 -347 160 237 -182 288 501 249 -210 149 460 -141 -267 228 200 -210 -150 195
1859 195 -215 -374 -94 5 -246 -196 -70 -144 -137 12 -12 -110 -38 -110 59 -14 195 -215 -11 295 312 -118 109 88
1883H8n7m1j12J78j15P3j93m8K79j28j77K27J03m31L4O01j71n65K82N51m47j00
1905a69K78Q7j69k74L19K03j70o5M0N3O4k36J20N7j37k88K14J51k01l96M99N2
1927C2n60J94K71L7j08o8K38j52n9K27Q5m5j72J4K08l7j34k38O07j3l84j04K08
1950D7r2k29J08J82q7k5P5Q1p5l33K21L52l45l31K29M94j72m82L44L54k52j14
1972e0J56O8K05m09J88J47l34q1J56k6k1j02J56K36o91o2O31j44q4j93K22J21
1994H9k90J25L40o1n23K73J13qj18K2L21M8k83j41M33j41l89J49M70l95k27J14
2016g9J49k44j02K50r5M3L2Nj99K26k81K72L4j48o7K72K59m79J07J77K17l12o0
2039b3L64r2k84j4J67k5k34J65R8K0l57l8L83k09j32j37M00n5k32J48J17j50j36
$$ plain form
1883 88 31 -10 -122 56 -59 14 -179 -227 52 -76 -253 -26 77 -354 -320 281 110 -455 -173 378 -69 -169
1905 -169 109 196 27 -247 72 275 105 40 80 133 197 -39 81 138 1 -287 -73 78 -123 -519 -20 32
1927 32 -528 -334 -63 -26 -134 -202 36 -116 -175 52 137 92 -80 -66 142 105 -29 -267 340 327 -57 -161 47
1950 47 -45 -274 -166 16 -71 -96 -21 60 -15 -348 -127 225 -120 -451 -222 272 100 -382 -38 316 64 -50
1972 -50 106 174 379 -30 158 305 -29 -110 46 20 -1 -103 53 289 -402 -464 167 23 -61 -254 -32 89
1994 89 -201 -76 264 203 -320 -47 66 58 -60 -38 283 331 48 -93 340 199 -190 -41 429 34 -193 -79
2016 -79 70 -174 -276 -26 -121 -78 -46 -41 -240 -14 -295 -23 11 -137 -204 68 327 -152 -45 132 349 37 -23
2039 -23 341 249 -35 -49 118 93 -141 24 122 142 -215 -253 130 -79 -211 -348 52 -3 -235 -87 30 -120 -256
2062b56M43l5j05j7L25q7p7k35J25J24k50P6K39j36j54j07K75L6l14m6J29N8k42
2085b31J26N9l9J2l1J12j76O7R2r1P0q8O6K25j9N3l61L54J49l48r8L15m5m03Q1
2110a49K69j61j56J80K58n52o3L10rj48J26J12j82J22J5p0K40J19m51L00J80k97
2132gj00M28K5l97K78J17k33l10K55J49l59L9J58k85j00J60j59R5K76q3j12l9
2154b04M19m53M0L96J9l26K3J86O4k39K37j0pj59J27j45L9M7j81L83k12k23L9
2177a40L52k81j26J61P8j19j91L87j60l08L42K15k46j58L40J28k86K7L53k24j63
2198a9J94j49p4K34Ok55j06J05Q0l20J12R2P2J8k5m1p1K0l1J67j81J05p1K45j07
2223@p4L32J78l09j92K63Q7k86J77J90l39j41M50j65m73P8L22j45m44M37J2k38
$$ plain form
2062 -256 187 152 47 30 355 268 191 -44 81 205 -45 31 270 134 -20 -127 148 184 -130 -176 -47 11 -231
2085 -231 -105 -46 -85 -73 -104 8 -168 -101 -9 -100 -30 -118 -52 173 154 207 -154 200 349 1 -97 218 173 -230 -149
2110 -149 120 -41 -197 -17 241 -311 -374 -64 -73 -221 -95 17 -165 -43 -28 -98 142 261 -190 110 290 -7
2132 -7 -107 321 346 -51 227 344 111 -199 56 205 -154 -115 43 -242 -342 -182 -341 -246 30 -53 -165 -204
2154 -204 215 -238 -198 198 217 -109 -86 100 164 -75 162 152 145 -14 113 -32 7 54 -127 256 44 -179 -140
2177 -140 212 -69 -195 -34 44 -75 -266 121 -39 -347 -5 210 -36 -194 146 274 -12 15 368 144 -19
2198 -19 175 26 -48 186 192 -63 -169 -64 16 -304 -192 -100 -28 -10 -35 -76 -147 -127 -158 9 -172 -67 -138 107 0
2223 0 -74 258 436 127 -65 198 285 -1 176 366 27 -114 336 171 -302 -224 98 -47 -491 -54 -42 -280
2245b80kJ93Q2j47J00L26l46l7K11o1M8O6j92K39j14j5K69k33j0P8nr3j98J26
2269EJ41kk69M12l92k20J55L8n0k7J94M7l19J95L67k75j31K04P6k47OJ24K05j12
2293A25j5p4J14j19Q2k3j12K1J04j07J24l87K40J40k07q7K14j4k21K39j05l0p7
2316a75L49j41K5M7Q5r7q8J20L6M2j71J17J19l22J31J59l37l6N7O8k09Q4K5M4
2340f8m2N3o0p7J45J8K4n5oK58Kk14J45J5O5k04l2J98l7k42L42m1k31N1Q4j22
2366c1j38J50j7j04j50J38J05j71J03O9J96k00k0K45q1j67J05J87p8r9J4J20o8
2389A08q7N4k24K10Q7k70N3j01K56k25q7J98j05j15M7K13M9k19J12J90l8k40J59
2412B5J64j79j29R6K77l74J56P6J85l86o1K86m7j70Q1L18m40k05J91J51j59n8
$$ plain form
2245 -280 -282 -89 -7 -154 -54 272 -74 -111 100 39 87 153 -39 200 86 71 340 107 97 175 170 77 -121 5
2269 5 146 144 -125 287 -105 -325 -170 -132 -182 -209 -15 32 -287 -92 275 0 -131 73 149 -98 -92 32 237 125
2293 125 110 36 150 31 113 90 -22 -1 103 -4 120 -267 -27 113 -94 -181 33 19 -202 37 -68 -98 -175
2316 -175 174 33 58 105 190 93 5 125 161 203 32 149 268 -54 77 236 -101 -137 -80 -12 -221 -137 -112 -68
2340 -68 -110 -57 -117 -194 -49 -31 -7 -62 -68 190 192 -22 123 138 203 -1 -33 165 128 -114 228 187 -44 7 91 -31
2366 -31 -169 -19 -36 -140 -290 -152 -47 -218 -115 -46 150 -50 -70 175 94 -73 32 219 141 42 56 176 108
2389 108 21 75 -149 61 148 -122 -69 -170 86 -139 -226 -28 -133 -248 -201 12 61 -158 -46 144 106 -134 25
2412 25 189 10 -119 -23 254 -120 36 112 297 -89 -150 136 89 -81 0 318 -122 -327 -136 15 -144 -202
2434b02j24L14o8K8j39J17q5J15k22L15m2j37J60K52j49l0j2O6j70j28K86k06
2456f1l3J21L6j06l0k21J20K51j43k47J27K34l16j11M50N1l67K33J33k8j08r1
2478a06L82k98K9M9N5m9o3N8J30o1m3j98J14J41l29j61L47r2j85jL49k70oJ23
2502h5N0r8j12L00J08k35J34J28l0k55J80l2J27p0r0K06M9l12m3K77j28k95K23
2525cOJ63l09L1J45j03j25J20n7P6J56j94nJ49M8j03kK41m6j60N8J64k34J33L7
2550A86j28k56K85q2m8j42J88l4j36j55K55m2k4j53L31j19P6l07K41L13k58m2
2572e1L70k00m1j5N6r2q3L40q3k90j8J53o1L0K11l14j40K41k17R9p5L12o6l58
2596b92J76J11J2nMJ72j63L4r0L52k55r1K0K57q7j76L55j33m12Q8L07j87p3K8
$$ plain form
2434 -202 -326 -12 -80 -52 -191 -74 -159 -44 -266 49 7 -130 30 282 133 103 91 157 -13 -141 145 -61
2456 -61 -94 27 63 -43 -73 -294 -174 77 -66 -313 -186 48 -268 -379 71 122 -245 -12 121 93 -15 -106
2478 -106 276 -22 7 56 111 62 -1 57 187 126 83 -115 -1 140 -189 -350 -3 -95 -280 -281 68 -202 -208 -85
2502 -85 -35 -133 -245 55 163 -72 62 190 160 -95 85 53 180 110 20 226 275 -37 -80 197 69 -226 -3
2525 -3 3 166 -143 -112 33 -70 -195 -75 -132 -56 100 -94 -99 50 98 -5 -7 234 188 28 86 250 16 149 186
2550 186 58 -198 87 5 -43 -185 3 -31 -167 -322 -67 -109 -133 -286 45 -74 2 -305 -64 249 -9 -51
2572 -51 319 119 78 63 119 27 -56 284 201 -89 -107 46 -15 15 226 -88 -228 13 -204 -105 -180 132 66 -292
2596 -292 -116 -5 7 2 6 178 15 49 -41 311 56 -35 -15 242 155 -21 334 201 -211 -123 184 -3 -76 -48
2620d8J99l90j4L60j91j53L53l3j34m4Rkk5K18mj19NJ16l3o9J20r6j19K75pL4
2646B08L0j66m7l3r6P6l3K53l24j16K5J12q7J1M39k33l56M04R3k17j3L84Lk56
2670F1p7L39j45l04L76j40k47P5j0O1k0m0k2L6L0r0j4PL2q7M7J74r7P6p0J48k3
2697G6jl0j40K74L4o0j96K06L2k00r3N08l76k55K62J4k13j08K95%m56J98K99k04
2721a34j87M76j45m2j8K09k08j44K25Q8l7J19l2M2n1l00J89K78l07j87K14J0r0
2744c2M3J30k51r1J67R0m15K66J27j98j12K29K35l33J66Nl1o7J87J74k24k2K00
2767B43l5m22K89J55l1k79J49R1k68J2j4K25j49n2K8%j82q3J94J30l01J50L15
2790A65j82j4J24J6n1l3R5L9k10J67R9j45j81K33rj38RP4M8l10K63O0l11J21n0
$$ plain form
2620 -48 151 -239 -253 107 -84 -237 116 83 -51 -95 -86 -88 -113 105 101 -18 -13 103 70 1 121 25 -94 181 174 208
2646 208 238 72 25 -8 -104 -28 -61 192 -132 -248 -223 -111 -198 -187 252 19 -337 67 160 -57 -70 314 317 61
2670 61 -16 323 178 -126 250 110 -137 -62 -72 -11 -31 -71 -93 -57 -27 -117 -131 -124 -92 -179 -132 42 -55 21 -49 99 76
2697 76 75 45 -95 179 213 153 -43 163 195 -5 -98 410 34 -221 41 55 -158 -266 29 29 -427 -229 70 -134
2721 -134 -321 155 10 -32 -50 159 -49 -193 32 120 83 202 170 212 161 -139 50 328 21 -166 48 58 -32
2744 -32 11 141 -110 -201 -34 56 -359 -93 34 -164 -276 -47 188 -145 21 26 -5 -72 115 289 65 43 243
2767 243 208 -214 75 230 199 -80 69 160 -108 -96 -110 115 -34 -86 -58 -58 -240 -323 -129 1 -300 -150 165
2790 165 -17 -31 93 109 58 25 120 159 -51 116 215 70 -111 122 113 -25 -16 58 106 -204 59 119 -192 -71 -121
2815a21J6n0RJ34k3j16J3K19l2k79L10J18k45J8K34J2k31K94j25n8k28K08N2k32
2839a03p4P6J57m00J50J45Jk16oM95o2l45L34o3l87L36J20Q1l89M29q2k07qQ0
2863F2K42k53J19L20m92j17J61R8k04J25q6m2j72L8J77j08j3J55J65k92K6R1N0
2886E0r2mQ4Jq3J97q7J18j64K95o9j86l7J76r3k26J77N0k23j74L33J2m22L6L94
2911F3j56j13P4J83j17k7O8J79m2O5P7j20j69R2J45p0jr9R2N0k62j49M13j51l48
2936c23K69Q8j22q0J50m9m1p8K44j25O6j60L03k88L52j17P0j70P2m7n8L56j87
2959A25k50N3L11j37k34R6P3p0j77N2J86k48J01L4p1N8j00J45J31k01j77L66K08
2982B74m12m7L38l3j50O1K53p5j57Q3n5l8r7J76r1j27Q2L2j47J31j81M2P1k3M9
$$ plain form
2815 -121 -105 -155 -146 -12 -35 -151 -138 81 49 -230 80 198 -47 -29 205 217 -14 280 155 97 -131 77 129 -103
2839 -103 -177 -101 56 -344 -194 -49 -48 -264 -270 225 163 -182 152 89 -298 38 158 239 -150 279 197 -10 -18 62
2863 62 304 51 170 490 -2 -119 42 140 -64 61 -25 -67 -239 -201 -24 -132 -145 10 175 -117 -91 0 50
2886 50 -42 -46 38 39 -44 153 66 184 20 315 246 60 23 199 106 -120 57 107 -116 -290 43 55 -367 -331 63
2911 63 -93 -206 -132 51 -66 -93 -25 154 112 177 254 134 -35 57 202 132 131 32 124 174 -88 -237 176 25 -323
2936 -323 -54 34 -88 -168 -18 -67 -108 -186 58 -67 -1 -161 142 -146 206 89 159 -11 61 14 -44 312 125
2959 125 -125 -72 239 102 -132 -36 37 -33 -210 -158 28 -220 -119 -85 -156 -98 -198 -53 78 -123 -300 66 274
2982 274 -138 -185 153 120 -30 31 284 209 52 135 80 42 -55 121 30 -97 -15 17 -130 1 -180 -138 -67 -90 -41
3007d1j56K50n2p9J84Op4k83K81J01n3j0N3J64k91OkQ2J04k64j36L15j86j21O8
3032a34J35n0j92K35m0j29J38kk0R5j17K27k06K36K4j9P1l8k51J48N2j37J01K1
3056A48J42l45q4J33j5j28J01l9L4N8q9j43LJ21L0J00r1J22r6J6J95k51J03J0
3080C5O4N4K0N7k03K03j18M5j40L3K6l5K7j81L8M1j66j14K05j4J75k74O4R8L3
3105b7j47J47J08m9q8M0K77k06O4j4mJ9rP3Q7l16o4J18j04J01j56N3Q5N3j97J95
3131C9Oj39rQ9m1j4k0N4NK23j74J1J5r7J49K0p0J55k37j3J33k11L0K66r2k15R3
3158d4p9N7j54R6J05p1o5j0K42j53K9Q8J02p3j10o4K62j8q9O1J07j67k7J07L6
3183A68j81n5L9M9O1k35p1M8R5mj59J31m8K1l3L61j39k0j04K30j27j32R5K44m5
$$ plain form
3007 -41 -197 53 1 -78 106 112 38 -245 36 137 84 74 127 291 0 6 4 86 190 -74 -210 105 -81 -202 -134
3032 -134 1 -49 -241 -6 -46 -175 -37 -39 -59 36 -81 146 -60 176 200 181 252 214 -37 111 163 26 127 148
3056 148 290 -55 -139 -6 -21 -149 -48 -87 -53 5 -84 -227 -224 -103 -73 27 -64 58 -38 -22 173 -78 25 35
3080 35 99 153 173 230 27 230 112 157 17 50 76 41 68 -113 -75 -34 -200 -314 -109 -123 52 -222 -158 -60 -27
3105 -27 -174 -27 81 32 -56 -16 261 55 119 105 101 120 111 184 271 -45 -109 9 -95 6 -150 -97 -12 41 -156 39
3131 39 45 -94 -103 -14 -55 -69 -89 -35 -30 193 19 30 45 -52 97 117 47 202 -35 -48 85 -126 -96 170 78 -137 -44
3158 -44 -123 -66 -220 -124 -19 -90 -155 -165 77 -76 -47 41 143 70 -40 -104 158 140 51 112 219 52 25 132 168
3183 168 -13 -68 -29 20 81 -154 -225 -177 -82 -86 -245 -114 -162 -141 -174 187 48 28 -76 154 27 -105 -10 234 189
3208A89n7j16K14j26k36L3K30k84J66O7j29k5k8JJ26k81J74P2k37J7K78Q8o1j93
3232a18J54J0j50kK80o1K9m9m7N6j17J83p8O1j01J49k35q8J45j11k01K98L4Mk08
3257a63O2J95k63J29K18j52l0J01j9o3Nl8L18k67p6J28p5K16l21K18p0j15J12
3280E0JMl03J15J50l12M3J82ok18J40Q6P6K1K0l8k03J85K43j43j53M3L31k43m9
3305B2M8on9J41j70O9p1r3J31j51r2N0K10k23j7J64q2m4J43R3n4k75M20J15l86
3330a17J32J33P8k17q5L26j42k96K90M2j04r9K52o8l90J46N3Mo5M0J18J4j69K04
3354H0j83K2p4J59J4J22l5k5Jj16R6J18j10j20K19j3k65P6J63P8k22M6n5j19J06
3379c7J4j10O9rP1j86k8K08K5j49J30N8k75J85J72k4K6j51oPN1J6M8J57j18k16
$$ plain form
3208 189 132 16 230 104 -132 -99 131 -153 13 80 -49 -74 -102 -101 25 -256 -82 -10 -247 -230 48 136 75 -118
3232 -118 36 46 -104 -106 174 113 142 93 46 102 -15 168 90 151 50 199 -36 -124 21 -90 -291 7 41 45 -163
3257 -163 -101 94 -169 -40 178 26 -4 97 78 15 20 -18 300 33 -43 85 10 226 -95 123 53 -62 50
3280 50 51 55 -248 -133 17 -295 -252 -70 -76 -294 -154 -68 8 29 49 11 -192 -7 236 93 -60 -17 314 71 22
3305 22 70 64 5 146 -24 45 -26 -119 12 -139 -231 -181 29 -194 -211 -47 -129 -173 -30 63 9 -266 154 269 -117
3330 -117 15 148 226 9 -76 250 108 -188 102 144 40 -59 193 125 -265 -119 -66 -62 -127 -87 31 45 -124 80
3354 80 -103 -81 -155 4 18 140 105 80 81 -35 61 179 69 -51 168 155 -110 -34 129 207 -15 31 -24 -143 -37
3379 -37 -23 -133 -64 -73 -2 -188 -216 -8 17 -132 -2 56 -219 -34 138 114 140 -11 -17 -10 41 57 105 262 144 -72
3405g2K1Q5p5j4J1PJ3j8J79l45Q1K02k6k14J87J45k25P0OL9O8O8R4k47k18O19
3431D41m68K31kj13j68k9J79l1j42k1Q3j25N8QJ30j18l0O2J76k14J80r6M8p7m9
3456h7K51j26j6nK25j47j41J13J51j13k92K23M7j99N3J71L7k32j8J13J0o4k11
3479b57K27m2O5j46K49o1Lj51m1J95j18J03J99j58O0j73J04q0qJ40r6r8PK9p4
3504a22J31l5j35K38k10M6r9J55k2j2J7l4j32J15K98o8j33j66K59j7k16J72Q6
3527A16J13j38%n5j3K0j60J05L0k4j08J36J9m9k28K10j4o0J68m6L3j35R8O7J33
3552B18j05OL5j01o5K9J20r9j7J19M4j32j80K42q2j20k20M07j24o0k9R9N3j58
3576a20R7j5K8P9nJ31j02j80L8J99O2j54ll8k7K1M9j69J73j01J4k3j17r2J39R2
$$ plain form
3405 -72 -51 34 -41 -55 -44 -37 -24 -42 137 -208 -127 75 49 -165 22 167 -58 12 18 57 125 193 287 40 -178 441
3431 441 -27 204 202 89 -79 -108 71 40 -102 -123 -40 -165 -107 -99 31 -87 -117 -55 121 -93 87 -9 39 -38 -87
3456 -87 164 38 22 17 242 95 -46 67 218 105 -187 36 83 -116 -63 108 145 -87 -105 8 18 -46 -257
3479 -257 -30 -72 -7 -153 96 35 38 -113 -154 41 -77 26 225 67 127 -46 58 -22 -30 110 14 -84 -77 -48 -122
3504 -122 9 -26 -161 77 -133 -87 -186 -31 -53 -65 -48 -82 -214 -99 199 131 -2 -168 91 74 -142 30 116
3527 116 229 91 91 36 23 43 -117 -12 18 -6 -114 22 41 -8 -236 -26 -40 -100 68 22 55 -80 18 85 218
3552 218 113 119 154 53 -12 17 137 38 21 140 184 52 -128 114 32 -88 -308 99 -25 -85 -114 -15 38 -120
3576 -120 -23 -38 -10 69 64 195 93 -87 -49 150 212 58 55 17 -10 11 60 -109 64 -37 -23 -46 -163 -255 -116 -24
3602b4Q8r7r6K06k43N7O2L9m6oJ03J7M3k28K48m2n1K5rJ02j65p0J13R4p7j02J89
3629A30j72q1O7K8j35R1o1M3J24k03K41o2J4p0j14K24q3K12k47J42l8JrR1J4j52
3655eq9M3R8j10j8J36j47J53j03M4k08N1Q0j3j46J44j02K79L2k62J71j7O9k2j81
3680a23L00j86J39n9l2P3j07K13k53M6l1N5o0L9J3j44Q6O0j51l6Q1P0q5J7m6J45
3706B4j51K33j45K24k32R1J02o9n5K8L9j39J8J64p4j03K01k8k63l8J66m3K1O2
3730C3lj51O7M4l4N3R9qk5l9J36r5p8K18l27K09P6k01N7Q2k3j90N4J54j69k8Q4
3757eJ6Nl9N1m2J08j23R2K7j30O3j57M0L2R9j12K60j76j7P3k2L9k27J30Op1K25
3784A45j89M0J64k38O9mJ0q7j1K4J52j37j91K37jO1q0J77Mj30PN9j84J62k1m4
$$ plain form
3602 -24 64 -33 -129 77 -166 -109 -47 -8 -54 -60 43 60 103 -125 123 81 30 55 46 148 -17 -87 26 120 43 -59 130
3629 130 -42 -123 -56 -28 -163 -72 -133 -90 34 -169 72 10 24 -46 -160 64 -19 193 -54 88 50 51 42 133 147 -5
3655 -5 -94 -51 47 -63 -81 55 -92 61 -42 2 -206 -155 -75 -88 -234 -90 -192 87 119 -143 28 11 80 58 -123
3680 -123 177 -9 130 71 39 112 5 218 -35 11 -20 35 -25 14 27 -117 -31 29 -122 -158 -77 -7 -92 -75 -121 24
3706 24 -127 106 -39 185 -47 44 146 77 22 50 89 -50 -32 132 58 -45 156 128 -135 -173 -7 -50 -29 33
3730 33 30 -121 -54 -10 -44 9 108 100 75 36 172 77 -1 217 -110 99 175 -26 31 113 90 -100 -46 108 -61 -89 -5
3757 -5 11 16 -23 28 -14 94 -29 63 90 -40 23 -134 -94 -62 37 -75 185 9 -8 65 43 82 -145 -15 -9 -80 145
3784 145 -44 -4 160 -78 -9 -13 -3 -90 -101 -77 75 -62 -253 -16 -17 44 -36 141 145 15 22 81 -103 59 38 -6
3810fJ33j39K12k08j05J65k50l8K00l5M3o6R0p6o0J09l1Q6j09K32j13p7M3J20
3834A20n2p6O3K1j5K17k17P8j89O3j5L8o2L3J02o5n9p8n9R0q4J43J2k24J92j29
3860a52J99j92J29K24o2j99J4K72k26N4J25m4j51L5p1K8k2K7J60l32M5K25j0j52
3884g6J7J00j5j79R8J16j98j1K78k03k0j4J78m0p0Mq1J58p1K20j05j16J87j15
3908D2m1m3K50k31kj4K2j5l8p5k9l4J45qN9n4J35m2q8M0P4Q5n0np3q0L00j26J59
3937B63k31n5J41q4O8p5j09J13l4j40J55k89L65l02K75r1k84K48N6j52J80n8J9
3960b1J77j62J07o1R5k6kn7Q2n5l3j47J90m3j7m8r4J59M8m4j03J21m8k17K45k1
3986B5o3J71j70j08p8K18Q5j10J26o3L8K4o1P9K8q6J8l22J34NJ61j11JR9j96o7
$$ plain form
3810 -6 127 -12 200 -8 -113 52 -198 -236 -36 -71 -28 -94 -4 -80 -140 -31 -62 24 -85 147 34 -43 0 120
3834 120 68 -8 55 76 61 278 61 139 -50 13 -2 36 -26 7 109 44 -15 -93 -152 -62 -146 -3 9 -215 -23 -152
3860 -152 47 -145 -16 208 146 -53 -39 233 7 61 186 142 -9 26 -45 -17 -39 -12 148 -184 -139 86 76 -76
3884 -76 -59 41 26 -153 -55 61 -137 -148 130 -73 -93 -107 71 31 -39 -35 -116 42 -29 191 86 -30 157 42
3908 42 1 -42 208 -23 -25 -39 -17 -32 -70 -145 -174 -208 -63 -71 -12 -66 69 27 -61 -21 53 138 88 83 10 -70 230 104 263
3937 263 32 -23 118 34 102 27 -82 31 -3 -143 12 -277 88 -214 61 -30 -314 -66 -10 -162 18 -40 -21
3960 -21 156 -6 101 40 135 109 107 50 132 77 44 -103 87 44 27 -21 -115 44 92 48 -55 66 18 -199 46 25
3986 25 -38 133 -37 -145 -223 -5 80 -30 96 33 71 95 34 113 141 55 73 -249 -115 -110 51 -60 -59 40 -156 -223
$$ [...]
8191f6
##END NTUPLES=NMR FID
##END=
