##TITLE=1H_Pr 119
 CDCl3
 8 sc, 
 7.06.2022
##JCAMPDX= 6.0         $$ Bruker NMR JCAMP-DX V2.0
##DATA TYPE= NMR FID
##DATA CLASS= NTUPLES
##ORIGIN= UXNMR, Bruker Analytische Messtechnik GmbH
##OWNER= root
$$ XWIN-NMR		Version 3.5
$$ Tue Jun  7 14:24:00 2022 Russian Standard Time (UT+4h)  she@DPX200
##.OBSERVE FREQUENCY= 200.13135
##.OBSERVE NUCLEUS= ^1H
##.DELAY= (6, 6)
##.ACQUISITION MODE= SIMULTANEOUS
##.ACQUISITION SCHEME= undefined
##.AVERAGES= 8
##.DIGITISER RES= 18
##SPECTROMETER/DATA SYSTEM= spect
##.PULSE SEQUENCE= zg30
##.SOLVENT NAME= CDCl3
##.SHIFT REFERENCE= (INTERNAL, CDCl3, 0, 15.7039)
##AUDIT TRAIL= $$ (NUMBER, WHEN, WHO, WHERE, WHAT)
$$ ##TITLE= Audit trail, XWIN-NMR		Version 3.5
$$ ##JCAMPDX= 5.01
$$ ##ORIGIN= Bruker BioSpin GmbH
$$ ##OWNER= she
$$ F:/spectra/data/she/nmr/H-F/1/audita.txt
$$ ##AUDIT TRAIL=  $$ (NUMBER, WHEN, WHO, WHERE, WHAT)
(   1,<2022-06-07 14:22:57.04 +0400>,<she>,<DPX200>,
      <created by zg, POWCHK disabled, PULCHK disabled
       configuration hash MD5:
       00 E9 B6 7A A2 85 ED C7 34 08 36 98 17 FE 4E 26
       data hash MD5: 16K
       41 B7 AA 83 64 FF E8 86 19 CD B0 5D BF C4 F1 03>)
$$ ##END=
$$ 
$$ hash MD5
$$ 42 25 AA 2D 75 C7 09 A3 96 27 A5 BC C3 B4 1C 96
##$RELAX= 
##$RELAX= 
##$RELAX= 
##$RELAX= 
##$RELAX= 
##$RELAX= 
$$ Bruker specific parameters
$$ --------------------------
##$DU= <F:/spectra>
##$EXPNO= 1
##$NAME= <H-F>
##$PROCNO= 1
##$TYPE= <nmr>
##$USER= <she>
##$AMP= (0..31)
100 100 100 100 100 100 100 100 100 100 100 100 100 100 100 100 100 100 
100 100 100 100 100 100 100 100 100 100 100 100 100 100 
##$AQSEQ= 0
##$AQ_mod= 1
##$AUNM= <au_zg>
##$AUTOPOS= <>
##$BF1= 200.13
##$BF2= 200.13
##$BF3= 200.13
##$BF4= 200.13
##$BF5= 200.13
##$BF6= 200.13
##$BF7= 200.13
##$BF8= 200.13
##$BYTORDA= 1
##$CFDGTYP= 0
##$CFRGTYP= 5
##$CHEMSTR= <none>
##$CNST= (0..31)
1 1 145 1 1 1 1 1 1 1 1 1 1 1 1 1 1 1 1 1 1 1 1 1 1 1 1 1 1 1 1 1 
##$CPDPRG= <>
##$CPDPRG1= <>
##$CPDPRG2= <>
##$CPDPRG3= <>
##$CPDPRG4= <mlev>
##$CPDPRG5= <mlev>
##$CPDPRG6= <mlev>
##$CPDPRG7= <mlev>
##$CPDPRG8= <mlev>
##$CPDPRGB= <>
##$CPDPRGT= <>
##$D= (0..31)
0 1.2 0 0 0 0 0 0 0 0.06 0 0.03 0 0 0 0 0.0002 0 0 0 0 0 0 0 0 0 0 0 0 
0 0 0 
##$DATE= 1654597376
##$DBL= (0..7)
120 120 120 120 120 120 120 120 
##$DBP= (0..7)
150 150 150 150 150 150 150 150 
##$DBP07= 0
##$DBPNAM0= <>
##$DBPNAM1= <>
##$DBPNAM2= <>
##$DBPNAM3= <>
##$DBPNAM4= <>
##$DBPNAM5= <>
##$DBPNAM6= <>
##$DBPNAM7= <>
##$DBPOAL= (0..7)
0.5 0.5 0.5 0.5 0.5 0.5 0.5 0.5 
##$DBPOFFS= (0..7)
0 0 0 0 0 0 0 0 
##$DE= 6
##$DECBNUC= <off>
##$DECIM= 32
##$DECNUC= <off>
##$DECSTAT= 4
##$DIGMOD= 1
##$DIGTYP= 9
##$DL= (0..7)
0 120 120 120 120 120 120 120 
##$DP= (0..7)
150 150 150 150 150 150 150 150 
##$DP07= 0
##$DPNAME0= <>
##$DPNAME1= <>
##$DPNAME2= <>
##$DPNAME3= <>
##$DPNAME4= <>
##$DPNAME5= <>
##$DPNAME6= <>
##$DPNAME7= <>
##$DPOAL= (0..7)
0.5 0.5 0.5 0.5 0.5 0.5 0.5 0.5 
##$DPOFFS= (0..7)
0 0 0 0 0 0 0 0 
##$DQDMODE= 0
##$DR= 18
##$DS= 0
##$DSLIST= <SSSSSSSSSSSSSSS>
$$ [...]
##$SUBNAM2= <"">
##$SUBNAM3= <"">
##$SUBNAM4= <"">
##$SUBNAM5= <"">
##$SUBNAM6= <"">
##$SUBNAM7= <"">
##$SUBNAM8= <"">
##$SUBNAM9= <"">
##$SW= 18.05172834244
##$SWIBOX= (0..15)
0 0 2 0 0 0 0 0 0 0 0 0 0 0 0 0 
##$SW_h= 3612.71676300578
##$TD= 16384
##$TD0= 1
##$TE= 0
##$TE2= 300
##$TE3= 300
##$TEG= 300
##$TL= (0..7)
0 120 120 120 120 120 120 120 
##$TP= (0..7)
150 150 150 150 150 150 150 150 
##$TP07= 0
##$TPNAME0= <>
##$TPNAME1= <>
##$TPNAME2= <>
##$TPNAME3= <>
##$TPNAME4= <>
##$TPNAME5= <>
##$TPNAME6= <>
##$TPNAME7= <>
##$TPOAL= (0..7)
0.5 0.5 0.5 0.5 0.5 0.5 0.5 0.5 
##$TPOFFS= (0..7)
0 0 0 0 0 0 0 0 
##$TUNHIN= 0
##$TUNHOUT= 0
##$TUNXOUT= 0
##$USERA1= <user>
##$USERA2= <user>
##$USERA3= <user>
##$USERA4= <user>
##$USERA5= <user>
##$V9= 5
##$VALIST= <valist>
##$VCLIST= <CCCCCCCCCCCCCCC>
##$VD= 0
##$VDLIST= <DDDDDDDDDDDDDDD>
##$VPLIST= <PPPPPPPPPPPPPPP>
##$VTLIST= <TTTTTTTTTTTTTTT>
##$WBST= 1024
##$WBSW= 4
##$XGAIN= (0..3)
0 0 0 0 
##$XL= 0
##$YL= 0
##$YMAX_a= 294494
##$YMIN_a= -442750
##$ZGOPTNS= <>
##$ZL1= 120
##$ZL2= 120
##$ZL3= 120
##$ZL4= 120
##$ABSF1= 10
##$ABSF2= 0
##$ABSG= 5
##$ABSL= 3
##$ALPHA= 0
##$AQORDER= 0
##$ASSFAC= 0
##$ASSFACI= 0
##$ASSFACX= 0
##$ASSWID= 0
##$AUNMP= <proc_1d>
##$AZFE= 0.1
##$AZFW= 0.1
##$BCFW= 1
##$BC_mod= 2
##$BYTORDP= 1
##$COROFFS= 0
##$CY= 11.3945322036743
##$DATMOD= 1
##$DC= 2
##$DFILT= <>
##$DTYPP= 0
##$F1P= 2.36226072786647
##$F2P= -0.459571619588291
##$FCOR= 0.5
##$FTSIZE= 0
##$FT_mod= 4
##$GAMMA= 1
##$GB= 0.15
##$INTBC= 1
##$INTSCL= 1
##$ISEN= 128
##$LB= 0.24
##$LEV0= 0
##$LPBIN= 0
##$MAXI= 10000
##$MC2= 0
##$MEAN= 0
##$ME_mod= 0
##$MI= 1.114404
##$NCOEF= 0
##$NC_proc= 0
##$NLEV= 6
##$NOISF1= 3.799351
##$NOISF2= 2.8
##$NSP= 1
##$NTH_PI= 0
##$NZP= 0
##$OFFSET= 15.70392
##$PC= 1
##$PHC0= -18030.99
##$PHC1= 12.80074
##$PH_mod= 1
##$PKNL= yes
##$PPARMOD= 0
##$PSCAL= 0
##$PSIGN= 0
##$REVERSE= no
##$SF= 200.130013532006
##$SI= 16384
##$SIGF1= 3
##$SIGF2= 2
##$SINO= 400
##$SIOLD= 16384
##$SREGLST= <1H.CDCl3>
##$SSB= 0
##$STSI= 0
##$STSR= 0
##$SW_p= 3612.71676300578
##$SYMM= 0
##$S_DEV= 0
##$TDeff= 0
##$TDoff= 0
##$TI= <>
##$TILT= no
##$TM1= 0
##$TM2= 0
##$TOPLEV= 0
##$USERP1= <user>
##$USERP2= <user>
##$USERP3= <user>
##$USERP4= <user>
##$USERP5= <user>
##$WDW= 1
##$XDIM= 8192
##$YMAX_p= 0
##$YMIN_p= 0
$$ End of Bruker specific parameters
$$ ---------------------------------
##NTUPLES= NMR FID
##VAR_NAME=  TIME,          FID/REAL,        FID/IMAG
##SYMBOL=    X,             R,               I
##VAR_TYPE=  INDEPENDENT,   DEPENDENT,       DEPENDENT
##VAR_FORM=  AFFN,          ASDF,            ASDF
##VAR_DIM=   8192,          8192,            8192
##UNITS=     SECONDS,       ARBITRARY UNITS, ARBITRARY UNITS
##FACTOR=    0.0002768,     1,               1
##FIRST=     0,             0,               0
##LAST=      2.2672688,     0,               0
##MIN=       0,             -442750,         0
##MAX=       2.2672688,     294494,          0
$$ Real data points
##PAGE= N=1
##DATA TABLE= (X++(R..R)), XYDATA
0@%%%%%%%%%%qJ6j6J7k5L2m0N6o4P2r4J18j36J60j92K24k56K96l44L97m55N20
$$ 0 0 0 0 0 0 0 0 0 0 0 -8 8 -8 9 -16 16 -24 32 -32 40 -54 64 -72 88 -104 120 -136 160 -184 213 -242 278
32B78n93O73p62Q58r64J082j212J353j507J677j862K064k285K525k787L075l393
$$ 278 -315 358 -404 454 -510 572 -640 713 -794 883 -979 1085 -1200 1325 -1462 1613 -1780
49a780L739m117M538n002N514o085O729p458Q288r249J0373j1705J3321j5324
$$ -1780 1959 -2158 2380 -2622 2892 -3193 3536 -3922 4366 -4883 5490 -6215 7106 -8218
63h218J7881k1286K6065l3302M5697p2558K34622k27938l54274M78449J31562
$$ -8218 9663 -11623 14442 -18860 26837 -45721 188901 -39037 -393311 85138 216700
74B16700k30385r2011J23526j5898M3738M0079j34968j24282J72998J40433q0242
$$ 216700 -13685 -105696 17830 1932 45670 85749 -49219 -173501 -503 139930 59688
85E9688j59826q039J50611Q0035j59476r7830J33750J22921r6995r3446N3598
$$ 59688 -100138 -108177 42434 122469 -37007 -134837 -1087 121834 24839 -68607 -15009
96a5009K5260j5999P0913l7153j23584Q3298J28910j18144j02881J26382O0763
$$ -15009 10251 -5748 65165 28012 -95572 -12274 116636 -1508 -104389 21993 82756
107H2756j18293J1250Q1908r4224l6269J36524l509j31102J6555J14979j0112
$$ 82756 -35537 -24287 57621 -36603 -72872 63652 60143 -70959 -54404 60575 50463
118E0463j08060l141R3679R413o6102R16N4130k8457n9204P0930N4233j17291
$$ 50463 -57597 -60738 32941 42354 -23748 -22832 31298 2841 -56363 14567 68800 -48491
130d8491l1214J49730J9544j53887j9882J39495J2310j11205J0247O9621k8839
$$ -48491 -79705 70025 89569 -64318 -84200 55295 67605 -43600 -33353 36268 7429
141G429j6531L5962k7396m7619M6322O2941m9607p0939M2501O1248k9498n4079
$$ 7429 -9102 26860 -536 -48155 -1833 61108 11501 -59438 -16937 44311 14813 -39266
153c9266J1005M8346o827l2759J8163L006k9726L1457L5073m9389k9435N9185
$$ -39266 -28261 20085 13258 -19501 -1338 1668 -28058 3399 38472 -10917 -40352 18833
165A8833J9725o1234J456N6034k2720l5245L8211J5285m5748j1712M7809J4860
$$ 18833 38558 -22676 -21220 34814 12094 -23151 15060 30345 -15403 -27115 20694 35554
177C5554n1320j4838M4200N689l7623k341K9834o811k4894K6185J6746m9653n825
$$ 35554 -15766 -30604 13596 19285 -18338 -20679 9155 2344 -22550 3635 20381 -29272 -35097
190c5097O4919K597o8118J257P1162k782o0387J0876L7494j0281n649M773j8258
$$ -35097 29822 32419 -35699 -34442 36720 33938 -26449 -15573 21921 11640 5991 10764 -7494
203g494l281L1122O801m2330j5826M1547K0889l4104l3560K0250M4777j6108m5734
$$ -7494 -10775 20347 27148 -15182 -31008 10539 31428 -2676 -36236 -15986 28791 12683 -33051
216c3051J4936K9696r211n827K766j3548J715L6302j128n3211R080N8848j4494
$$ -33051 -18115 11581 2370 -3457 -691 -14239 -12524 23778 22650 -30561 -21481 37367 22873
229B2873m5940J3382K9120o657j6082L435J666o437J2390L782k1150j574J5184
$$ 22873 -23067 -9685 19435 12778 -3304 131 1797 -4640 7750 11532 -9618 -11192 3992
242C992N207j0624j7432J1700K2879j5636j8848J5304J5972j5035j2167K2082
$$ 3992 9199 -1425 -18857 -7157 15722 86 -18762 -3458 12514 -2521 -14688 7394
254G394J284k3966J7399J4626k5628l11K3044n244j8144P870J6565j2909j0828
$$ 7394 8678 -15288 2111 16737 -8891 -9202 13842 8598 -9546 -1676 14889 1980 -8848
267h848J6454o71j1014L660K671J746m596p190J0879L646j4108k67J1080P67j3888
$$ -8848 7606 6935 -4079 -419 2252 3998 -598 -7788 3091 6737 -7371 -7638 3442 4209 -9679
282i679J957J5770j1873p919J9610o232j5132J5672R756j5851p355J7762P108
$$ -9679 -7722 8048 -3825 -11744 7866 1634 -13498 2174 11930 -3921 -11276 6486 13594
295A3594j9533P20J4832o210j891J775m582M778J223l643L57m130P97N070j594
$$ 13594 -5939 -5219 9613 3403 1512 3287 -1295 3483 4706 1063 1420 -2710 -1913 3157 1563
310A563o949m934J3884M219k1653L638J8465j0392o568R137O6n054M365P655r621
$$ 1563 -5386 -10320 3564 7783 -13870 -10232 8233 -2159 -8727 410 476 -4578 -213 7442 -2179
325b179n067J7392j185j4229O936M858k377J03m802J226M340k764l507j560L967
$$ -2179 -7246 10146 8961 -5268 1668 6526 4149 4252 -550 676 5016 2252 -1255 -2815 1152
340A152j315n555O358k583p592J0960J27j2523O339R396n843p320P604P796r706
$$ 1152 -163 -5718 640 -1943 -9535 1425 1552 -10971 -4632 4764 -1079 -8399 -795 7001 -2705
355b705M42R402p231N62P600o728k223N985j35l035j815J551o26L53J123q102
$$ -2705 -2263 7139 -92 470 8070 1342 -881 5104 4969 1934 119 1670 1044 1397 2520 -5582
371e582J390R989q474n260Q481k228l633N640Q9p421J878J1103l306j0833Q065
$$ -5582 -4192 5797 -2677 -7937 544 -1684 -5317 323 412 -7009 -5131 5972 2666 -8167 -102
386a02N526n631L077q02n452O200N683o052o490M711N994m286j804j750m646R149
$$ -102 5424 -207 2870 2068 -3384 2816 8499 2447 -4043 668 6662 2376 572 -1178 -5824 3325
402C325N100j3458l625R127L154m165l963j617J834R092Q23j5918K33J7543j917
$$ 3325 8425 -5033 -8658 469 3623 -542 -4505 -6122 -4288 4804 5627 -10291 -10058 7485 5568
417E568r506L79K350L559M571l914r671K573J4844j668j3575m03O147O136O66
$$ 5568 -3938 -3559 -1209 2350 6921 3007 -6664 -4091 10753 9085 -4490 -4893 1254 7390 8056
432H056j2760m923J4901N636j2951r946R792Q355n204k220l940m028J1564N545
$$ 8056 -4704 -9627 5274 10910 -2041 -11987 -2195 6160 956 -1264 -5204 -9232 2332 7877
446G877j2883n853Q627R651j839j0295m367P561J3847k904j9455L564J7921k558
$$ 7877 -5006 -10859 -2232 7419 5580 -4715 -9082 -1521 12326 9422 -10033 -6469 11452 8894
460H894r721k230J363N627L835m146r808q22J2286J173q500n935j161J2382Q606
$$ 8894 -827 -3057 -1694 3933 7768 3622 -6186 -7008 5278 6451 -2049 -7984 -9145 3237 11843
475A1843j7199j1601J4928J2478r098j2660P070R032k994K180k548q966O655J1262
$$ 11843 -5356 -16957 -2029 10449 1351 -11309 -4239 4793 1799 3979 1431 -7535 -880 10382
489A0382j863j0913o012J1443J1078q501j4632N9J8709M429k2353m657J5256K684
$$ 10382 8519 -2394 -8406 3037 14115 5614 -9018 -8959 9750 14179 -8174 -12831 2425 5109
503E109m353l774l812J464N648N064p536j0136R812J2372l549j3640o233J6277
$$ 5109 756 -3018 -6830 -5366 282 5346 -2190 -12326 -2514 9858 6309 -7331 -13564 2713
517B713J4416j4077j3967P326J4564m21j5867k901J2642L412k632n376o229K431
$$ 2713 17129 3052 -10915 -3589 10975 10554 -5313 -8214 4428 7840 5208 -168 -6397 -3966
531c966O719N118p790j3772Q795J7344p281j8451j549K0751R059j9922r356J2691
$$ -3966 2753 7871 81 -13691 -4896 12448 5167 -13284 -14833 5918 14977 -4945 -14301 -1610
545a610P822k481o374p46M317J17M294R37j2956j637J6864P817j6377j5740J5147
$$ -1610 6212 3731 -2643 -3389 928 1045 5339 6276 -6680 -8317 8547 16364 -13 -15753 -606
560f06J6679j3521j2169M474R123M982r410r049M785O431J657l884l942r72K778
$$ -606 16073 2552 -9617 -5143 3980 8962 -448 -9497 -4712 1719 3376 -508 -4450 -5422 -2644
575b644R642q66j8186J957J9887J70j4904n145J2038R981q144r988O93R796O887
$$ -2644 6998 6132 -12054 -10097 9790 9960 -4944 -10089 1949 11930 3786 -6202 -5509 4287 11174
590A1174j0116q169Q598K533l515J761l295o198O351J1761q861j8144J0487J7727
$$ 11174 1058 -7111 1487 4020 505 2266 -1029 -7227 -876 10885 2024 -16120 -5633 12094
604A2094j0216j1889M080O967L633m522p112L604P877J5o901K47M046k288M637
$$ 12094 1878 -10011 -5931 1036 4669 147 -6965 -3361 4516 4531 -2370 -2123 1923 -365 4272
619D272M403j1307l800J2675J955j0314k937P650K596n092j386k375q73P738p84
$$ 4272 8675 -2632 -6432 6243 8198 -2116 -5053 2597 5193 101 -1285 -3660 -4533 3205 2421
634B421p557K086K903j817M51J317k822j567Q534J739j1572O56R843o86k710j148
$$ 2421 -5136 -3050 -147 -1964 -1513 -196 -3018 -4585 3949 5688 -5884 -5228 4615 3929 1219 71
650G1j434L374L223l846m043L796L965m316j777J625l854K365O400o259o478N378
$$ 71 -1363 2011 5234 1388 -2655 1141 5106 790 -987 638 -3216 -851 5549 -710 -7188 -1810
666a810N270m240n728L729M910j656p46k504j421N986J262l837r4K756R07j858
$$ -1810 3460 -780 -6508 -2779 2131 475 -271 -2775 -4196 1790 3052 -785 -879 1877 2784 926
682I26l98k03r07M524O78o491P62L800k249m28J26j510O43J925q44m166J515L424
$$ 926 528 325 -582 3942 4620 -1871 -1109 2691 442 14 140 -1370 -727 1198 354 -3812 -2297 1127
700A127k555p30J871k208R88K701k050q03J316J295N21j517N40M50K80J756k167
$$ 1127 -1428 -2158 -287 -2495 -1507 1194 -856 -1659 -343 952 1473 -44 496 946 1226 2982 815
717H15j599L085k46j020M5j702R35P03j97j294k332L298R24m435J207J079j097
$$ 815 -784 2301 2055 1035 1080 -622 313 1016 819 -475 -2807 491 1415 -3020 -1813 -734 -1831
734a831K201r12k356J659J994m10k064R81L204j868m3P44k299L170J528m373M11
$$ -1831 370 -542 -2898 -1239 755 345 -1719 -738 2466 598 555 1299 -1000 2170 3698 -675 -264
751b64K472l23r13j476J103Q8l82O24l216J82L438k508j735K041l07L97n10n52
$$ -264 2208 1885 972 -504 599 687 305 929 -2287 -2105 1333 -1175 -2910 -869 -1176 -779 -1289 -1841
769a841J284q95K622j098k610L785Q08k717J538P00q40J182n30n94l19J195O52
$$ -1841 -557 -1452 1170 72 -2538 1247 2055 -662 876 1576 736 1918 1388 794 475 1670 2322
786B322l627J481K144l482O97O96k230J403O36j911N4O03J242j681m60K366r80
$$ 2322 -1305 176 2320 -1162 -465 231 -1999 -596 40 -1871 -1817 -1214 28 -1653 -2113 253 -727
803g27n41K249k033P97K190j774J59J032J51j17p87J079k30j855K473j235k274
$$ -727 -1268 981 -1052 -255 1935 161 320 1352 1503 1386 599 1678 1448 -407 2066 831 -1443
820a443K724m43k001Q14m4k32m02J74L22j595J439Q64k639J831O78j358J662P
$$ -1443 1281 838 -1163 -349 -393 -625 -1027 -853 -531 -2126 -687 177 -2462 -631 47 -1311 351 358
838C58j123R25R54N5j374O37J612j546j4J468k325R61J942k315r85Q29O89n78
$$ 358 -765 160 1114 1169 -205 432 2044 498 484 1952 -373 588 2530 215 -770 59 748 170
856A70j523P24J61o92J794j830j357K502k59n44K78r84J155J283o78p83l41K723
$$ 170 -1353 -629 -468 -1160 634 -1196 -2553 -51 -310 -854 -576 -1560 -405 878 200 -583 -924 1799
874A799K52k730J748J79p98J817p96k563J237K040r63k716N96K154j503n51K31
$$ 1799 2051 -679 1069 1248 450 2267 1471 -1092 145 2185 1222 -1494 -898 1256 -247 -798 -567
891e67j429J373J208j942k20K0P64J366j082j264M79K680Q88l803L01L765j420
$$ -567 -1996 -623 585 -1357 -1577 -1557 -793 573 -509 -1773 -1294 1386 2274 -1529 -1228 2537 1117
908A117j311J610p25m50J241J158k214k151K881J153k752n27k69J135J540k575
$$ 1117 -194 1416 691 241 1482 2640 426 -1725 1156 2309 -443 -970 -1239 -104 1436 -1139
924a139j575J705J183l11j732J75J606o71J305p97j802K591J365j727o5k31O71
$$ -1139 -2714 -1009 174 -137 -1869 -1694 -88 -759 546 -251 -2053 538 1903 176 111 -120 551
941E51J513L79k661j660L813K720n595j692M157o0j953r90M78J202r31N02K79
$$ 551 2064 2443 -218 -1878 1935 4655 -940 -2632 1525 1465 -488 -1478 -1000 202 -729 -227 52
958E2k395J20K097J257j490m031L270N639m194m346L903L732k559k764K356J307
$$ 52 -2343 -2223 -126 1131 -359 -4390 -1120 4519 325 -4021 -118 3614 1055 -1709 647 1954
974A954k376K280P72l590M91K008J26j343j726P84K152m05k924k415M065L348
$$ 1954 -422 1858 2630 -960 -469 1539 1665 322 -1404 -620 1532 1127 -1797 -4212 -147 3201
990C201n114j167L032l40K14l46q57R75J041M50j265j141J873m52J326J871m737
$$ 3201 -1913 -3080 -48 -388 -174 -520 -1377 -402 639 1089 -176 -1317 556 104 1430 3301 -1436
1007a436p62O162q31n632j76O103K90n917j23M181k383q74J849m53j399p7J929
$$ -1436 -2198 3964 3133 -2499 -2675 3428 3718 -2199 -2322 1859 -524 -1398 451 -2 -1401 -1478 451
1024D51L59l390n87L839K135l065l882M133L987m882j858M192M30j536R7J045
$$ 451 810 -2580 -3167 672 2807 -258 -4140 -7 3980 -902 -2760 1432 1862 326 423 1468
1040A468r84j231K665L31l550M39J980Qq48j901j54K284J14j169j638R31K716
$$ 1468 484 -747 1918 2249 -1301 -862 1118 1126 278 -1623 -1777 507 621 -548 -2186 -1255 1461
1057A461k144j658J914N67J51o90m03J271j100L69K421j058j698J57K477K10m287
$$ 1461 -683 -2341 -427 140 291 -399 -802 469 -631 -262 2159 1101 -597 -440 2037 2247 -2040
1074b040O58N256j685l642O50J732n23k128J355J889k674l25K534j435k416J044
$$ -2040 -1382 3874 2189 -1453 -803 929 406 -1722 -367 1522 -1152 -1477 1057 -378 -2794 -1750
1090a750L023O03l745L57K419q56p93q7J560R75j278J55M56k029R12J981j009
$$ -1750 1273 1876 -1869 -1512 907 51 -742 -829 731 1706 428 583 1039 -990 -78 1903 894
1107H94j057L93J291r16k115J290R59j422J069n66j822Q08J603R8k246J13K643
$$ 894 -163 230 1521 605 -1510 -220 739 -683 386 -180 -2002 -1194 409 507 -1739 -1626 1017
1124A017j382j602J920Q21j232N04R38k18j869J605J795k099n05J355J61m06j127
$$ 1017 -365 -1967 -47 774 -458 46 984 766 -1103 502 2297 198 -307 1048 1209 803 -324
1141c24o8J820r40j038L86P16j114q46J825J12l218J800K307k365r78K167O04
$$ -324 -392 1428 488 -550 -164 552 -562 -1408 417 529 -2689 -889 1418 -947 -1925 242 846
1158H46j963j77K537n78k130K497M97k405Q13J715r18q81M36P78o57o14O27j29
$$ 846 -1117 -1294 1243 665 -1465 1032 1529 -876 -63 1652 734 -147 289 1067 410 -204 423 294
1176B94ll7q58J045o05j237J374K85j547M19R92k93j275Q32J730j563n04K235
$$ 294 291 254 -604 441 -164 -1401 -27 258 -1289 -870 122 -171 -1446 -614 1116 -447 -951 1284
1194A284j020q82J029R61q42p64J310O25j973k56J539m88p04K7Q17n09j119M90
$$ 1284 264 -618 411 1372 530 -234 1076 1701 -272 -528 1011 523 -181 -154 663 154 -965 -475
1212d75J164j697J09P37J58j089k03J685j21j810J282J179j596L65O47K05m99
$$ -475 689 -1008 -899 -162 -4 -1093 -1296 389 268 -1542 -260 919 -677 -312 335 540 41
1229D1j63J112l27q41P37j52K36l44n85J047k96j231J384k04j199M36M77k44j023
$$ 41 -122 990 663 -178 559 407 643 299 -286 761 465 -766 618 414 -785 -349 128 -116 -1139
1248a139L09J407j327l87J673q15p25J017O10m56n47O66O63j326O92P62r43J09
$$ -1139 -830 577 -750 -1137 536 -279 -1004 13 623 167 -380 286 949 -377 315 1077 134 243
1266B43K80j8M20q93N0O26n94m67K97J92l49r11J223L10k195J259J027j222r6
$$ 243 523 505 925 32 82 708 114 -353 -56 136 -213 -1124 99 409 -1786 -527 500 -722 -818
1285h18R07N9o23k44J219l53p25J207M5m49L46r3M54l38p03Q31j82n05M26k01
$$ -818 89 148 -475 -719 500 147 -578 629 674 225 571 478 932 594 -109 722 540 35 461 260
1305B60J36n88l44Q43n86n87J183p07o10K29K90K66o74P39K86p02O1J183q47K09
$$ 260 396 -192 -536 307 -279 -866 317 -390 -1000 -771 -481 -215 -889 -150 136 -566 -505 678 -169 40
1325D0N46k71L38k21m0L33k61R0k65k47K35k03K91J56j212L55R40j148k84L05
$$ 40 586 315 653 432 392 725 464 554 289 42 277 74 365 521 -691 -336 604 -544 -828 -523
1345e23K10k96j94Q27j43o49P61m8l20K69J02L83l55n1O92k43J51l40k26M70L01
$$ -523 -313 -609 -803 24 -119 -768 -7 -55 -375 -106 -4 379 24 -27 665 422 573 233 7 477 778
1366G78q44K97r7l18O51l34l89j02J16K01n88M02j8k02J35M45p99K74N92l11R2
$$ 778 -66 231 134 -184 467 133 -256 -358 -242 -41 -629 -227 -245 -447 -312 133 -666 -392 200 -111 -19
1387a9k55N47K33m06pJ78j04P90p49j14K65j33rK63n93K31j35q2K00o56L35O2
$$ -19 -274 273 506 100 93 271 167 957 208 94 359 226 217 480 -113 118 -17 -99 101 -555 -220 -158
1409a58r0j53l06K76O14n85j61L94J04L76l94J43L62n52O52P1m93J69k6J81K40
$$ -158 -248 -401 -707 -431 183 -402 -563 -169 -65 311 -83 60 422 -130 522 593 100 269 243 424 664
1430F64o23j64N91k34j73o39L66P73j082J2M53k81n0K23n20N29j96J7N36m70K67
$$ 664 41 -123 468 234 61 -578 -212 561 -521 -509 -56 -337 -387 -164 -684 -155 -351 -334 202 -268 -1
1451al65O21L53q10m8J279o62o80L86N65L3p33J52M47n16Q0r7j63K54n66L14M96
$$ -1 -366 255 608 -202 -250 1029 367 -313 73 638 671 -62 90 537 21 101 4 -159 95 -471 -157 339
1473C39p99n16Q71J96j46q23O00R04j092KP03k30J53P7j27K91k03J38M73o62J46
$$ 339 -460 -976 -105 91 -55 -878 -278 626 -466 -464 239 9 162 239 112 403 200 338 811 149 295
1494B95k84M34M95j149k91R52k21n32k78J53N07n31K40J76m66J10K6j29Q16m98
$$ 295 11 445 940 -209 -500 452 231 -301 -579 -426 81 -450 -210 -34 -500 -390 -364 -493 323 -175
1514a75j68R12m61n64M90P75m31r22O16P75n20l27M79l26J30n20J99K7j80Q1J64
$$ -175 -343 569 108 -456 34 809 378 -544 72 847 327 0 479 153 283 -237 -38 -11 -191 -110 54
1535E4j43M2q07M54J115j321k94J068j66m82n0Q09j49k62N40p6n94O27N3n78Q56
$$ 54 -89 -47 -854 -400 715 -606 -900 168 2 -480 -530 279 130 -132 408 332 -262 365 418 -160 696
1556F96k67l95L00o8l13k95M38N06p63j99N94n87p3L37k37M50j45k95j0J13j3
$$ 696 429 34 334 266 -47 -342 96 602 -161 -360 234 -353 -426 -89 -326 124 -21 -316 -326 -213 -226
1577b26R1J00L03l32k79J106r8q25O48K14m98n64O11L93q29L60L79p63k4L38q9
$$ -226 -135 -35 268 -64 -343 763 665 -160 488 702 204 -360 251 644 -185 175 554 -209 -233 105 16
1598A6n0l90l1M35n6l14O7L69J10m69J33L09l27k4K83RK5J80K07m04l23P26O9
$$ 16 -34 -424 -455 -20 -76 -390 -323 46 156 -313 -180 129 -198 -222 61 70 95 275 482 78 -245 481 550
1621E50k06j33j0j79p9J90j42p8j57L00j36j62K71O0m96R7j40L06k63M48M09p28
$$ 550 344 211 201 22 -57 133 -9 -87 -244 56 -80 -242 29 89 -407 -310 -450 -144 -407 41 450 -278
1643b78K6M37JO9j97L70J11l29k2n0jM7j6P5K61m58m5M3j05l37M96k7l12k94K91
$$ -278 -252 185 186 255 58 428 539 210 188 138 137 184 168 243 504 46 1 44 -61 -398 98 71 -241 -535 -244
1668b44J75m95P4N26j94n6k6J61K99k96M50J0n78J25O7O5J97L8L06l42m17N5J1
$$ -244 -69 -564 -490 36 -158 -214 -240 -79 220 -76 374 384 -194 -69 -2 63 260 298 604 262 -155 -100 -89
1691h9J47l1O7j47Mk79L40l22l08O75q3p9J22j16q9j53L64J50m19L70j7j07rj52
$$ -89 58 27 94 -53 -49 -328 12 -310 -618 57 -26 -105 17 -99 -188 -341 23 173 -246 124 107 0 -9 -161
1715a61K01M61l69j56L05j99k50L45j19M7k05K31J3o50L83R2l89J79O7o5jl54
$$ -161 40 501 132 -24 281 82 -168 177 58 105 -100 131 144 -506 -123 -31 -420 -241 -174 -239 -240 -594
1737e94O66l12r3M35P5j88KK60j44L83o53M77k26J22N4r8p4j93R1K57l78j35K60
$$ -594 72 -240 -333 102 177 -11 -9 251 107 490 -163 314 88 210 264 166 92 -101 -10 247 -131 -266 -6
1760fP6k74J34J72m25K71j29L55m33k1L73k42Q3o9m5M23p3j19J02r9j9K05k19
$$ -6 70 -204 -70 102 -323 -52 -181 174 -259 -280 93 -149 -66 -135 -180 243 170 51 153 54 35 240 21
1783B1K42l56L14k0k00O3j9P3m27m2L04k12j58J84K38l65L12O1k88L2J73k68M60
$$ 21 263 -93 221 201 1 64 45 118 -309 -351 -47 -259 -417 -233 5 -360 -48 13 -275 -243 -70 -338 122
1806A22l10K73O0l07M07l02K57p7J7J75P0m59J41N0J43j0l60J46j51k89O05k20
$$ 122 -188 85 145 -162 245 -57 200 123 140 315 385 -74 67 117 260 250 -110 36 -115 -404 201 -19
1828a9j86K02n6l65L45M7j3k68L13L14n25K37o7L19j40k13L64k18l07L10J21j24
$$ -19 -205 -3 -59 -424 -79 -32 -45 -313 0 314 -211 26 -41 278 138 -75 289 71 -236 74 195 71
1850G1o7r9J71o0j96R3L82m53k21L72l25J68m8J80O1j54J92J04k28J27R2j36J08
$$ 71 4 -95 76 16 -180 -87 295 -158 -379 -7 -332 -164 -212 -32 29 -125 67 171 -57 70 162 26 134
1873A34j41P4K59l29K40q3k81M66l05J22l17J33K27k07k46L05j34r3k51O29j75
$$ 134 -7 67 326 -3 237 154 -127 339 34 156 -161 -28 199 -8 -254 51 -83 -176 -427 202 27
1894B7k31M1M38o48N14j24nj05J18K3P4K21k27J37j24O8J37k31j17J85k21K96
$$ 27 -204 -163 275 -373 141 17 12 -93 25 48 122 343 116 253 129 197 334 103 -14 171 -50 246
1916B46l61n5L88m23N7Nj69K53j43J03jr3L00k76K43n0Lj21L99n06J85K38k60
$$ 246 -115 -170 218 -205 -148 -143 -312 -59 -202 -99 -100 -193 107 -169 74 24 27 -94 305 -201 -16 222 -38
1939c8Q8R7L9j77J14J31m9n26L58N2j53K28m32K22J41n03L91j35q3K40k10o2K60
$$ -38 50 147 186 9 123 254 205 -321 37 89 -64 164 -268 -46 95 -408 -17 -152 -235 5 -205 -267 -7
1962gl79P00j66k13N6j18R5j1M6K08j07kK52p3K5m75N3K23j36j78K60j02l20Q6
$$ -7 -386 314 148 -65 -9 -127 -32 -43 3 211 104 102 354 281 306 -169 -116 107 -29 -207 53 -49 -369 -283
1986b83K10O4n5k50K86m4O5j75j34N60j00l11N50m30PK02k03L01l75K55J05L9
$$ -283 -73 -9 -64 -314 -28 -72 -7 -182 -316 244 144 -167 383 -47 -40 162 -41 260 -115 140 245 284
2008B84k18o0J90r7o5n3k2J7j84J09j85K77ol01L85O9k30n7J5K8j7n0M73j88j05
$$ 284 66 6 196 99 34 -19 -41 -24 -208 -99 -284 -7 -13 -314 71 140 -90 -147 -132 -104 -121 -171 302 114 9
2033IQ2m6K17j03m6K07m73j4K60J76k64j0k5L52l87l32L23J21m12K83Q3j21q5
$$ 9 91 45 262 159 113 320 -153 -167 93 269 5 -5 -30 322 -65 -397 -74 47 -365 -82 1 -120 -205
2056b05j69L48j77M6K49M2l26K27JQ0J2k24R8K2K62k97r3J69k32M0L16j78k02
$$ -205 -374 -26 -203 -157 92 134 -192 35 36 116 128 -96 2 24 286 -11 -104 65 -167 -127 189 11 -191
2079a91l4J01J63k87M44k98RK89l7l73K74L6j07P0n6K86n43K0O77k32k64K95l40
$$ -191 -225 -124 39 -248 196 -102 -93 196 159 -214 60 96 -11 59 3 289 -254 -234 443 211 -53 242 -98
2102i8J67j26M7R0K11j93k9J15l81n3K55N1j80N8K40k41P2l7kN2k20K38k2j54
$$ -98 69 -57 -10 80 291 98 69 184 -197 -250 5 56 -124 -66 174 -67 5 -32 -34 18 -202 36 14 -140
2126a40j4L72k71m5M88j87j69l7N7j03K23M1j86l49K74Q7j77j7k21N24l3m42K91
$$ -140 -154 218 -53 -98 390 203 34 -3 54 -49 174 215 29 -320 -46 41 -136 -153 -374 150 117 -325 -34
2149c4Q0p0M0o0n9P5k18M18l4k65K06J81m3j85R4J25j21k61K76q2m4J90J3k68
$$ -34 46 -24 16 -44 -103 -28 -246 172 138 -127 79 260 217 32 126 251 130 -131 145 63 19 209 222 -46
2173d6J08j37Q0p3l7m2k1j1K13k1k21J51J50J23l03K95k37m5J97j45K22j86J08
$$ -46 62 -75 5 -68 -105 -147 -168 -179 34 13 -208 -57 93 216 -87 208 -29 -74 123 -22 200 14 122
2196A22R0M0k06M7p3J94q3m05M91j97k46K39N5k08R9QJ24j65J19k21J84J6j08
$$ 122 212 252 46 93 20 214 131 -274 217 20 -226 13 68 -140 -41 -33 91 -74 45 -176 8 24 -84
2219h4j02J48mk9L71m8l03K33q1N7Kj68K21j90l68L51rM0j12k88M05j33K23j15
$$ -84 -186 -38 -42 -71 300 252 -51 182 101 158 160 -8 213 23 -345 6 -3 37 -75 -363 42 -91 132 17
2243A7k86K93Q1l54k1N42p3j31nrk78L99l51N31n04K10P8l6K58k16j12j68j2J87
$$ 17 -269 24 105 -249 -270 272 199 68 63 54 -224 175 -176 355 -149 61 139 103 361 145 33 -135 -147 40
2267D0L8j45%K85k37l5l29J60J26j96J14n8K14k48Q5J24J18j31J1O1J27k61L66
$$ 40 78 -67 -67 218 -19 -54 -383 -223 -97 -293 -179 -237 -23 -271 -186 -62 56 -75 -64 -3 124 -137 229
2290B29j57ml6L1J74k64L96o9n41J92k3J42j74K29J98k57l80L00K5j04P8j66L07
$$ 229 72 68 32 63 237 -27 369 300 -241 -49 -72 70 -104 125 323 66 -314 -14 11 -93 -15 -181 126
2313A26p4k04L53k82r8K25j15J22L7n2L4j56K78j3j79N1k0K6o2j63K87j22j90
$$ 126 52 -152 201 -81 -179 46 -69 53 90 38 72 -84 194 181 2 53 33 59 -3 -166 121 -1 -191
2336a91J84j19J58j20R7J59j05k13K61N6m36K85r0J15K53j68J6l3j0k2O2j21J16
$$ -191 -7 -126 32 -88 9 168 63 -150 111 167 -269 16 -74 41 294 126 142 109 99 77 139 18 134
2359A34l52K94l0l25N84m57l05L10r6K54L9j49k3j17J85r1J52j94J42N1R0L8l56
$$ 134 -218 76 46 -279 305 -152 -457 -147 -243 11 50 -99 -122 -239 -54 -145 7 -187 -45 6 96 134 -222
2382b22M79k14J60k42N5J30j98K19M5q4j92K27k20LK84l72N4j8M5p6k91K85j49
$$ -222 257 43 203 -39 16 146 -52 167 212 128 -64 163 -57 -54 230 -142 -88 -106 -61 -137 -428 -143 -292
2405b92R2J15L25m26l4o3K64J46k21N6J4R1qj01PK41j81K2M6k60K77m62L13J07
$$ -292 -200 -85 240 -186 -220 -283 -19 127 -94 -38 -24 67 59 -42 -35 206 25 47 93 -167 110 -352 -39 68
2429F8j86J20k17K36N4l34M4K19k23l8J17J34k6m1J83K1j73P4P5O8l2J26k83M03
$$ 68 -118 2 -215 21 75 -259 -215 4 -219 -257 -140 -6 -32 -73 110 131 -42 32 107 175 143 269 -14 389
2453C89k15j15Q0Mj23l21L60l9j12L6J26j15Q0j03J53k66k4J16K15N1j28l79K74
$$ 389 174 59 139 143 20 -301 59 20 -92 -56 70 -45 35 -68 85 -181 -205 -89 126 177 49 -330 -56
2476e6J12j99R1L2k1J17J91m13K65j20L25l02M37m23P0j32J17j24R3nl3j53J23
$$ -56 56 -143 -52 -20 -41 76 267 -146 119 -1 324 22 459 36 106 -26 91 -33 60 55 22 -131 -8
2499hj22J26j7j73RP2RJ80j94L65k47l9L29k81K21k8k09J56J62l79J72Q5k38n7
$$ -8 -130 -4 -21 -194 -185 -113 -104 76 -118 247 0 -39 290 9 230 202 -7 149 311 -68 104 189 -49 -106
2523a06J15Q7k92J05Q5K5k79K91j25J72j30J16j16M8o5J29P8k72K11N1K65m77
$$ -106 9 96 -196 -91 -6 19 -260 31 -94 78 -52 64 -52 -4 -69 60 138 -134 77 128 393 -84
2545h4Q7L08m34J67K44k53K44m25J53N8j91Q9K51j17j92J06l38K06p4K92j44j50
$$ -84 3 311 -123 44 288 35 279 -146 7 65 -126 -37 214 97 -95 11 -327 -121 -195 97 -47 -197
2567a97K84j46r3K74k44L30j14J03j46j2O2n8j8L23k41k24L98l32J78m1J18l65
$$ -197 87 -59 -152 122 -122 208 94 197 51 39 101 43 25 348 107 -117 281 -51 127 86 204 -161
2589a61K16m12M43k17M6J18K49l51J52k60j01K22K54k76j03K00R2j04J42j22q9
$$ -161 55 -357 86 -131 -85 33 282 -69 83 -177 -278 -56 198 -78 -181 19 111 7 149 27 -62
2610f2J29l6j11P9R8j00N8L23j48j18r3o3J16l17M05k91J4j93J31R6k7J56j3n4
$$ -62 67 31 -80 -1 97 -3 55 378 230 112 19 -44 72 -245 160 -131 -117 -310 -179 -83 -110 46 33 -21
2634b1L31j77j76K56M0r3j39o5J83l31J01M14j76k39L0j16K36j16PL36m42N9J0
$$ -21 310 133 -43 213 253 160 21 -44 139 -192 -91 323 147 -92 -62 -178 58 -58 -51 285 -157 -98 -88
2657h8Q6J5q8j00o6j26Q0K98l74K02J15j03J15K77J44m61n2J19J78k11R8J3j68
$$ -88 -2 13 -75 -175 -241 -367 -287 11 -363 -161 -46 -149 -34 243 387 -74 -126 -7 171 -40 58 71 -97
2680i7O8p2J31K07l09J63k22m8j36K57p6L3L22l49K7J42q0J66k56Q3l37L21P6
$$ -97 -29 -101 30 237 -72 91 -131 -179 -315 -58 -134 -101 221 -128 -101 41 -39 127 -129 -46 -383 -62 14
2703A4k13N66k36Rj25k9J17q2M8L88m37j79J54q2J42j62o8K83k54k7P2R8k17J53
$$ 14 -199 367 131 140 15 -14 103 21 69 457 20 -159 -5 -87 55 -107 -175 108 -146 -173 -101 -3 -220 -67
2727f7N0k1k78L54m1K01m14J38J39Ml1mQ8Q1q3J08k04J51L15m04j02O2P3K75l80
$$ -67 -17 -38 -316 38 -3 198 -216 -78 61 65 34 30 118 199 116 224 20 171 486 82 -20 42 115 390 10
2752A0k50K32q3J82j88j4j92K94K15k87K4K3l7K0J89j00L67l44j39J51J21m31
$$ 10 -240 -8 -91 91 -97 -111 -303 -9 206 -81 -57 -34 -71 -51 138 38 405 61 -78 73 194 -237
2774b37N44j09j25R3M4J5l30N9L9m8R0R9k94K98l16M0j71J51M0L21m64K61J81
$$ -237 307 198 73 166 210 225 -105 -46 -7 -55 35 134 -160 138 -178 -138 -309 -158 -118 203 -261 0 181
2797A81j92L3L2J74Q6l37j36L49Rj95R0k5Q5k06J09q3n5M64j88j20k13J61P8j72
$$ 181 -11 22 54 228 314 -23 -159 190 199 4 94 69 154 -52 57 -26 -81 383 195 75 -138 23 101 -71
2821g1l64L79j7j21J56k12J60R9K2j71o8K66J87k95J80m3j24J82k04K25n0O6k99
$$ -71 -435 -56 -73 -194 -38 -250 -90 9 31 -140 -208 58 245 -50 130 87 -37 145 -59 166 116 182 -117
2844a17K91p7J11k3m02J23l1Q3m8k3k05J69J99l8k01K24Kk45L01j28o4M54m82
$$ -117 174 97 208 185 -217 -94 -125 -42 -90 -113 -318 -149 50 12 -189 35 37 -208 93 -35 -99 355 -127
2867a27P1J81k16L66j38J8l0O7j09K1j77L98k27j53N4l0j03j97L69p8j50P7L00
$$ -127 -56 125 -91 275 137 155 125 192 83 104 -73 325 98 -55 -1 -31 -134 -331 38 -40 -190 -113 187
2890A87k59j07K68k90J14j1K7K4r7L89j4l73O7J90L25l04Rk04K34m63K60J18p8
$$ 187 -72 -179 89 -201 -87 -98 -71 -47 -144 245 231 -142 -75 115 440 136 145 -59 175 -288 -28 90 12
2913A2l40L3MJ36K62m29L32j02k0J82J37j49j66k5M48k53pJ29q1r2K06J2k24J66
$$ 12 -328 -295 -291 -155 107 -322 10 -92 -112 70 207 58 -108 -133 315 62 55 184 103 11 217 229 5 171
2937A71J3j22r1p8J03k5q0K15n4K7J8k76j63J05L57n54M25Q5j35J46l82M02K0
$$ 171 184 62 -29 -107 -4 -29 -109 106 52 79 97 -179 -342 -237 120 -434 -9 76 -59 87 -295 107 127
2960A27O3k10Q8j67J0L19K6j10k09J93o2J29j67kJ76l3l33J7Rj39J89J0l9L62
$$ 127 190 -20 68 -99 -89 230 256 146 -63 130 68 197 30 28 204 171 -162 -145 -136 -275 -86 -76 -115 247
2984B47j60r1J97l25K38k87L23n9m07M13K9r7J1J16o1J95k88j6L9q5J18j93J34
$$ 247 87 -4 193 -132 106 -181 142 83 -324 89 118 21 32 148 87 282 -6 -22 17 -68 50 -143 -9
3007iM6l06jL42k37p8J99J2n8J47r1K05k85n9K55MK1p2J61k5j98K7J26k74N02
$$ -9 37 -269 -270 72 -165 -243 -44 -32 -90 57 -34 171 -114 -173 82 86 107 35 196 171 -27 0 126 -148 354
3032C54k49j59K01J9m94M09k3j50J52j78K45r3o7M44n81p7N0k74L45k3J39j39
$$ 354 105 -54 147 166 -328 81 58 -92 60 -118 127 34 -33 411 -170 -247 -197 -471 -126 -149 -10 -149
3054a49J64j25K9K18j5j83Q0K80m07k08K09K28j28p3J7J71j29j50K59j66K91j79
$$ -149 15 -110 -81 137 122 -61 19 299 -108 -316 -107 121 -7 -80 -63 108 -21 -171 88 -78 213 34
3076C4k13K09j02m4J34l0J00j50p7J85K9JK6q4RK3JL31j23j26J34k00p5L60m00
$$ 34 -179 30 -72 -116 18 -12 88 -62 -139 46 75 76 102 18 27 50 51 382 259 133 267 67 -8 352 -48
3101d8K26om5j8j11j23o6L6M7n6K09J04k54p9J14p8J52k7j40K92m5n0j4j55M33
$$ -48 178 172 127 109 -2 -125 -191 -155 -108 -164 45 149 -105 -184 -70 -148 4 -23 -163 129 84 34 20 -135 298
3126B98k08L01l04P3j81J03j06k9pj60L07j76J23r6j53L54m21M4R0j3M2J42k03
$$ 298 90 391 87 160 -21 82 -24 -53 -60 -220 87 -89 34 -62 -215 139 -282 -238 -148 -161 -119 23 -180
3149a80M26m8k85M42l64O2m6J67j95J60j32P9j84K48j69k3L13j47j26L17l54o57
$$ -180 246 198 -87 355 -9 53 7 174 -21 139 7 86 -98 150 -19 -42 271 124 -2 315 -39 -696
3171f96N28K43r2l32R4K67m10M54l6p1r2J90k80J94L7j49K37M5Q7j95K10J30k95
$$ -696 -168 75 -17 -349 -255 12 -398 56 20 -51 -143 47 -233 -39 -2 -151 86 131 218 23 233 363 68
3194F8j37k8J96n1R0l7k46n6J65j40J09j03J85k54m1K30L6J07M0k20R6k04K58
$$ 68 -69 -97 99 48 138 101 -145 -201 -36 -176 -67 -170 15 -239 -280 -50 -14 93 133 -87 9 -195 63
3217F3N0j18N1j09R6K42L8m42K38j20J43j30k28L79k47K50K1k43J73M1l23K77
$$ 63 113 -5 46 -63 33 275 313 -129 109 -11 132 2 -226 153 -94 156 177 -66 107 148 -175 102
3239A02j82K23j17l30L67j63J84k9N9j51J86j02M1k60M26l46K32j08j75J55J21
$$ 102 -80 143 26 -304 63 -100 84 55 114 -37 149 47 88 -172 254 -92 140 32 -143 12 133
3260A33j4m2j04o2R5o6J4J64r3k36J42%k07L09m7M3j58J10o5O4K20l9j43O9r1
$$ 133 119 77 -27 -89 6 -60 -46 118 25 -211 -69 -69 -276 33 -14 29 -129 -19 -84 -20 200 161 18 87 -4
3285dj20N02l45K5J1j51j07P9K91Lk39K82q7k40j50L54l05J15Q6L6j60J33k42
$$ -4 -124 378 33 58 69 -82 -189 -110 181 184 -55 227 140 -100 -250 104 -201 -86 0 36 -124 9 -233
3308b33L54l22O2J57j8QJ59j20j24O2K57l84K97r3j30M06k88J4j31J67l70J30
$$ -233 121 -201 -139 18 0 8 167 47 -77 -15 242 -142 155 62 -68 338 50 64 -67 100 -270 -140
3330a40K15k61K61L9j14j34P0k43K08J0r3L27k12J8M8j76J07K5K16k02m5J81l8
$$ -140 75 -186 75 114 0 -134 -64 -307 -99 -89 -182 145 -67 -49 -1 -177 -70 -45 171 -31 -76 105 67
3353F7K29j09K6k6k30K90Pl37J08J39m45L34m2j22J95k37j46J26Q6J49k45j37
$$ 67 296 187 213 187 -43 247 254 -83 25 164 -281 53 11 -111 84 -153 -299 -173 -87 62 -183 -320
3375c20J62K05Kj01R0P6j52J52j37k7K99r7k43J74QN4j65k61N52m34j04K82j19
$$ -320 -158 47 49 -52 38 114 -38 114 -23 -50 249 152 -91 83 91 145 -20 -281 271 -163 -267 15 -104
3398a04l2j43m0K27Q1j68L72k76p9J27l8K26j14mok79L60j5k10K75P0j38Jk56
$$ -104 -136 -279 -319 -92 -11 -179 193 -83 -162 -35 -73 153 39 35 29 -250 110 95 -115 160 230 92 93 -163
3422a63R2O7P0l8L8m5k6j38p4J89q8J81n16K71J74N2l33J85K43k92M7J0J66j32
$$ -163 -71 -4 66 28 66 21 -5 -143 -217 -28 -116 65 -451 -180 -6 46 -287 -102 141 -151 -104 -94 72 -60
3446f0l4M03j27N7j54K56k39j9M5r6n7KJ19j50M8q4P1Ok16j25L03j09J62J5rK10
$$ -60 -94 309 182 239 85 341 102 83 128 32 -25 -23 96 -54 -6 -90 -19 -13 -229 -354 -51 -160 2 17 8 218
3472B18j87j02O1j45R4M29m33P4K69k00J26M4l34J80nL7r3l12K61j5k37L71l86
$$ 218 31 -71 -10 -155 -61 368 -65 9 278 78 204 248 -86 94 89 126 33 -279 -18 -33 -270 101 -285
3495b85P6J96j78K12l34L05L1j91j6K05k56L91j92J67K30l25r6m3j28L74l3Ok8
$$ -285 -209 -13 -191 21 -313 -8 23 -168 -184 21 -235 156 -36 131 361 36 -60 -103 -231 143 110 116 88
3518H8j64Q4k5K5j54J66O6j02j82Q1O4k34K76J21k37L0L23j26rk60K97k1K9j16
$$ 88 -76 8 -17 8 -146 20 86 -16 -198 -117 -53 -287 -11 110 -127 -97 226 100 91 -169 128 107 136 20
3542B0K05Q2l69K00J83k98k4J67l39L51J25k80K11j49k27L73m35P3j21J64J69
$$ 20 225 307 -62 138 321 23 -1 166 -173 178 303 23 234 85 -142 231 -204 -131 -252 -88 81
3563H1l32J07j10J24K33j6j79k04M48l35K53r8J32r4J82k2k18K51n4j68K65j61
$$ 81 -251 -144 -254 -130 103 87 -92 -296 152 -183 70 -28 104 10 192 170 -48 203 149 -19 246 85
3585H5j29pj00K29j80L5P8k2J1k9R0j81j40K09k5J5J44j04R7q2J01j15J40J40
$$ 85 -44 -51 -151 78 -102 -67 11 -11 0 -29 61 -120 -260 -51 -76 -61 83 -21 76 -6 95 -20 120 260
3609B60j20J7k84K79K4j30k82L80j17j1J91k08k37K42jr0J19r9j23q2P7J48N2
$$ 260 140 157 -127 152 176 46 -236 144 27 16 207 -1 -238 4 3 -87 32 -67 -190 -272 -195 -47 5
3632EJ2M7l00J38N6j12J46J36k77K00k94J77K32k71J39k1K41k17n5j53J17j18
$$ 5 17 64 -236 -98 -42 -154 -8 128 -149 51 -243 -66 166 -105 34 13 254 37 -18 -171 -54 -172
3654a72j72M65J9n2l02J33K42k77L46k31k76K20J84p4k29K47R0r4K76q6k46L2
$$ -172 -344 121 140 88 -214 -81 161 -116 230 -1 -277 -57 127 53 -176 71 161 67 343 257 11 43
3676D3k8R0j17Q8N9j84L3J62l70j38L63l11p1M40n8l06J29p4L06n2P3r9j07J53
$$ 43 15 105 -12 76 135 -49 -16 146 -224 -362 1 -310 -381 59 1 -305 -176 -250 56 4 77 -22 -129 24
3700B4j6P9M01k85k59O8O4P0k48K22j00M5j11M0nJ3N7j51R0l5j68J18M9o0J23
$$ 24 8 87 488 203 -56 12 76 146 -102 120 20 65 -46 -6 -11 2 59 -92 -2 -37 -205 -87 -38 -98 25
3725B5k10J95j17m2K01lOO8K6o3J41j41L4j64K13j88N4L2K02l16j22K64k29J97
$$ 25 -185 10 -107 -149 52 49 55 123 149 86 227 86 120 -44 169 -19 35 67 269 -47 -169 95 -134 63
3749F3k2k79J61j56J23L2j58L13k50L08k06k7J85j62K05k51PJ45K82n87M36O7
$$ 63 41 -238 -77 -233 -110 -78 -236 77 -173 135 -71 -98 87 -75 130 -121 -114 31 313 -274 162 229
3771B29k06P1R7j03j45J4K99l52K16n3j42j5l0J25k3O6k89K64o8k35J53L2J6j49
$$ 229 23 94 191 88 -57 -43 256 -96 120 67 -75 -90 -120 5 -18 48 -241 23 -45 -280 -127 -95 -79 -228
3795b28K22m9J2P8J8r9n8K03j92J25k8m2r6K7J01L78l26j53J16j31J66j40k19
$$ -228 -6 -55 -43 35 53 -46 -104 99 -93 32 4 -38 -134 -107 -6 372 46 -107 9 -122 44 -96 -315
3818c15K59L2j66K36n9P2j62J66J83k09o8Jj92K4J01J31J22j09J08j43j35lK09
$$ -315 -56 -24 -190 46 -13 59 -103 63 246 37 -31 -30 -222 -198 -97 34 156 47 155 12 -123 -126 83
3841H3P5n5j56o5j9l1M44o23O4J97O6k02M9K0P4j00J37R5o2M2p2M7J53Q8n8j01
$$ 83 158 103 -53 -118 -137 -168 276 -347 -283 -86 -20 -222 -173 -153 -79 -179 -42 53 -9 33 -39 8 161 249 191 90
3867I0l66M24j35J94K8j63j54K38j90k24M90m04J89m2j45K35j70q7M6J50k91Q3
$$ 90 -276 148 13 207 235 72 -82 156 -34 -258 232 -172 17 -25 -170 65 -105 -192 -146 4 -287 -204
3889b04L45j48j63K23k3j15K18j12R1J50l32O8J55j46N4N4j7m3j23l5j07L90k37
$$ -204 141 -7 -170 53 30 -85 133 21 112 262 -70 -2 153 7 61 115 98 55 -68 -103 -210 180 -57
3912e7l5K8K45j73l3j13K67l02L6j35K79RJ37J70m47L16j22m9k2L8k73M11J03
$$ -57 -92 -64 181 8 -25 -138 129 -173 -137 -272 7 16 153 323 -124 192 70 21 -1 37 -236 175 278
3935B78j84l7k96J96m7K0j2Lj27M6M5J94j83L31k76K27k3j90o5K87k50Q4q0J11
$$ 278 94 57 -239 -43 -90 -70 -82 -79 -206 -160 -115 79 -104 227 -49 178 155 -35 -100 187 -63 21 -59 52
3959E2K88m71J51P1k75K89R5P1l51m1L38j22mq1k19K48Q7l11K97j81K07j94R5
$$ 52 340 -131 20 91 -184 105 200 271 -80 -121 217 95 91 10 -209 39 126 -185 112 -69 138 -56 39
3982C9k32O8J44k84J50J01j03N8J8QO5J00k91j6J28M10k46k17J30l02L38k39K8
$$ 39 -193 -125 19 -265 -115 -14 -117 -59 -41 -33 32 132 -159 -175 -47 363 117 -100 30 -272 66 -173 -145
4005a45M1L0j70K71p2O3N8k11J87j82P1j31q8M76l08j6P6L42m0l27K73k72j4O4
$$ -145 -104 -74 -244 27 -45 18 76 -135 52 -130 -59 -190 -278 198 -110 -126 -50 292 252 -75 198 -74 -88 -24
4029b4P5m1J65q5r2j11J17J93j09Rl7l21K22q1k13K53R2j45k01L92J17O4lk93
$$ -24 51 10 175 90 -2 -113 4 197 88 97 60 -261 -39 -120 -333 -80 12 -133 -334 58 175 239 236 -57
4053e7N5j13k5r7M01q0O7N8r3k7P2j70O4j18J12p0P7NQ5k2r5J1k1k73l0O1oJ61
$$ -57 -2 -115 -140 -237 164 84 151 209 116 89 161 -9 55 -63 49 -21 56 61 146 124 29 40 19 -254 -284 -223 -229 -68
4081f8J8J27n1k28J81J4k1mJ46p2o7J36j10J35k4n0k09j16L35o4l6J19j43j32
$$ -68 -50 77 26 -202 -21 -7 -28 -32 114 42 -25 111 1 136 112 62 -147 -263 72 8 -28 91 -52 -184
4105a84J21M7j95J81M5n2m0K85j94j18J95q5j12k0K07K70k06p9O7k21P3P8R0j67
$$ -184 -63 -16 -211 -30 15 -37 -77 208 14 -104 91 6 -106 -126 81 351 145 66 133 -88 -15 63 153 -14
4129a4K60l45J2R4Q4j49K4k0j85J11K20m9m30K54K06k05J36O1l16K22j25K50J24
$$ -14 246 -99 -87 7 91 -58 -34 -54 -239 -128 92 43 -387 -133 73 -132 4 65 -251 -29 -154 96 220
4152B20n0L0j40M1J05m5n8l1K79k58k87J28J39k08l2J65q1Q9p9j23J95J15m18
$$ 220 170 200 60 101 206 161 103 72 351 93 -194 -66 73 -135 -167 -2 -83 6 -73 -196 -1 114 -304
4175c04nL64k09M4N4J87l07N17k21k74J39L40m29L53j57j30j43L51l69K30j05
$$ -304 -309 55 -154 -110 -56 131 -176 341 120 -154 -15 325 -104 249 92 -38 -181 170 -199 31 -74
4196g4J42L1j37J32k15J1M8J96r7m2jj28r4J73O4l11J31M83l16k74J33M8J43j39
$$ -74 68 99 -38 94 -121 -110 -62 134 37 -5 -6 -134 -228 -55 9 -302 -171 312 -4 -278 -145 -97 46 -93
4220i3J25N5k29L10M3k10R3l10K64j22K60j12l0j75J84p2Rl4k04K82J46l54J30
$$ -93 32 87 -142 168 211 1 94 -216 48 -74 186 74 44 -131 53 -19 -10 -44 -248 34 180 -174 -44
4243d4j55J53j63L44j25k75L55R4k02L2o6L53m5m16L57p3r4j09J08k31M23k12
$$ -44 -199 -46 -209 135 10 -265 90 184 -18 14 -52 301 256 -160 197 124 30 -79 29 -202 221 9
4265IN8J3q2k8j4l1j57J85J52p8k74L15j46K13m43N57m7J40k18j40j1pO3P1k05
$$ 9 67 80 -2 -30 -44 -75 -232 -47 105 27 -247 68 -78 135 -308 249 202 342 124 -16 -27 -34 29 100 -105
4290a05q6pK44p3o2L42m05R6q4M0j32K95j11R0k03KO10m76J14M9k21O8R1j42k4
$$ -105 -191 -198 46 -27 -89 253 -152 -56 -140 -100 -232 63 -48 42 -161 -159 451 -25 89 138 -83 -15 76 -66 -90
4315i0J31j6N5q1O5k81M7O1j5K74k35J06K7k35M6L58n33M62k07m3J06M9k44PJ37
$$ -90 41 25 80 -1 64 -217 -170 -109 -124 150 -85 21 48 -187 -141 217 -316 146 -61 -104 2 51 -193 -186 -49
4340d9N3Q6P5k25k9K62j01j06M4O6p1P4P9j96L11k55r1L17k28J16l11K25j66q5
$$ -49 4 90 165 -60 -89 173 72 -34 10 76 5 79 158 -38 273 18 -73 244 16 132 -179 46 -120 -205
4364b05K84k59K35K03m39K31O4k0j15qM5j11K32l0j62J26k96N30n35L11N8k7n2
$$ -205 79 -180 55 258 -181 50 114 94 -21 -29 16 -95 137 107 -55 71 -225 305 -230 81 139 112 60
4387F0jJ69k91N8N3m9k04J43J44j37k39M88j46m2k74J77P7j39O6R0J2M4j06J2
$$ 60 59 228 -63 -5 48 -1 -205 -62 82 -55 -294 194 48 6 -268 -91 -14 -153 -87 3 15 59 -47 -35
4411c5j17K1J47K22k14j14J71k21K86j76P3J87k31J30j36k86L10j76K7K05j53
$$ -35 -152 -131 16 238 24 -90 81 -140 146 -30 43 230 -1 129 -7 -293 17 -159 -132 73 -80
4432h0N6j06Q0j28L28J9lj78J77k09L8J0j78L26K07n47K35q3O5N2K35j57j69R2
$$ -80 -24 -130 -50 -178 150 169 166 -12 165 -44 -6 4 -174 152 359 -188 47 -36 29 81 316 159 -10 82
4456H2j23J44k04O3l7O5j60j57L20J2O8j26K7l2j16K99Qk24JR7k4p7p3L14N9k31
$$ 82 -41 103 -101 -38 -75 -10 -170 -327 -7 5 73 -53 -26 -58 -174 125 133 -91 -90 7 -17 -94 -167 147 206 -25
4482b5J10k02J27M6Oj53K57K4k80NJ44j72O7j17K91J9Lk24J13n9K07j51P8L5O4
$$ -25 85 -117 10 56 62 -91 166 190 -90 -85 59 -113 -46 -163 128 147 150 -74 39 -20 187 36 114 149 213
4507B13o6K0J0jN4l53J72k35O7J82j43j55J33J64K61l25J22k66K0J28k67L89l75
$$ 213 147 167 177 176 230 -123 49 -186 -119 63 -80 -235 -102 62 323 -2 120 -146 -126 2 -265 124 -251
4530b51K45j51J03R1j34o2J13L79l23K04k93J48J03k98J30O1MRn1L2m1J80m33
$$ -251 -6 -157 -54 37 -97 -159 -46 333 10 214 -79 69 172 -126 4 65 69 78 27 59 18 198 -235
4553b35K68j49k28L46p5rJ68j33N1ok33K06Q2J6R2q5P7k83J43J34m5R3j00J1j36
$$ -235 33 -116 -344 2 -73 -82 86 -47 4 -2 -235 -29 53 69 161 76 153 -130 13 147 102 195 95 106 -30
4578c0J69mk83K65k3n3l01K87q3j86K11j72m0J0K81j26pK47J04n47L36p8L05l12
$$ -30 139 135 -148 117 94 41 -260 27 -56 -242 -31 -203 -243 -233 48 -78 -85 162 266 -281 55 -23 282 -30
4602c0N0J08j77K21m2J33k68M70m35Rr9J21lK05m53l1J82p1k50M05KN0K5Klj39
$$ -30 20 128 -49 172 130 263 -5 465 30 39 -60 61 58 263 -190 -221 -39 -110 -360 45 47 97 122 124 121 -18
4628a8n5J61J25l19OK23l0r9J12j86K06j53k56L78j11K32k47M7O6j45J21P5j09
$$ -18 -73 88 213 -106 -100 123 93 -6 106 -80 126 -27 -283 95 -16 216 -31 16 82 -63 58 133 24
4651B4r1M6j27j0m5M20m76p9L06j6L2j35J50J02N5k4n2q2l3j12J07M8m15M01j99
$$ 24 -67 -21 -148 -158 -203 217 -259 -338 -32 -48 -16 -151 -1 101 156 132 80 -2 -35 -147 -40 8 -407 -6 -205
4676b05L82j39k4J94l11pJ58j06k28L75m82K94q7L29j24P6j03j67J13K52p3J52
$$ -205 177 38 14 208 -103 -110 48 -58 -286 89 -393 -99 -186 143 19 95 -8 -175 -62 190 117 269
4698B69j38q2q9L1K2k4R1j91K89l53J25r4J03J22l00R9K01j43l02J87J2J52JJ63
$$ 269 131 49 -40 -9 13 -11 80 -111 178 -175 -50 -144 -41 81 -219 -120 81 -62 -364 -177 -165 -13 -12 151
4722A51j94l04K74p9K18M4k25J85j02P3J68Mj06O4m56L28ro4j38K04k13L62l01
$$ 151 -43 -347 -73 -152 66 110 -115 70 -32 41 209 213 107 171 -285 43 34 -30 -168 36 -177 185 -116
4745a16j40L94k32L7J0J88j27k30K48Q4j95J40np9L7j2k45L44l14L39J67k29J82
$$ -116 -256 138 -94 -57 -47 141 14 -216 32 116 -79 61 56 -23 14 2 -243 101 -213 126 293 64 246
4768B46J28n57M91l50j84L08j19j16M7R3q0R3p3J55j33q4J84J8M0k9k72J80j19
$$ 246 374 -183 308 -42 -226 82 -37 -153 -106 -13 -93 0 -73 82 -51 -135 49 67 107 78 -194 -14 -133
4791a33j02K13RR0L4N9j39P5l8P7L6n3Q6l90Q6j1J60j70M7J57n6q5r5K9J1j1l9
$$ -133 -235 -22 -13 77 111 170 31 106 68 145 181 128 214 -176 -90 -101 59 -111 -64 93 37 -48 -143 -114 -103 -114 -153
4818a53K62P3k83K36K8Jj99L17k80L8j83J98l9j65M9J69j22L17j45m5R7o13M98
$$ -153 109 182 -101 135 163 164 -35 282 2 40 -143 55 16 -149 -100 69 -53 264 119 74 171 -442 56
4841E6m7k66J28o5J59k0J41J3k57r5J57j17K48qM2m9K34k54K80k98j2J44M7l00
$$ 56 9 -257 -129 -194 -35 -55 86 99 -158 -253 -96 -213 35 27 69 20 254 0 280 -18 -30 114 161 -139
4865a39J61J72l42K64k91M68l24J20m1k10L50p2j03L29o67J90J37J95q3o7J87
$$ -139 22 194 -148 116 -175 293 -31 89 48 -162 188 116 13 342 -325 -135 2 197 114 47 234
4886B34l61j74M38o4k94M37j81P7K7M8j13k54nM22k1l15L09k41O8J5j0K53n4m07
$$ 234 -127 -301 137 73 -221 216 35 112 139 187 74 -180 -185 237 216 -99 210 -31 37 52 42 295 241 -166
4910a66J06j02J42P5j34L34j68j4m1m4K29k16L21k47l11L48n5j00j2K06j44M0
$$ -166 -60 -162 -20 55 -79 255 87 73 32 -12 217 1 322 75 -236 112 57 -43 -55 151 7 47
4932D7P7j36N0k14K31Jn3j70P1m7J13P6l03J6O8J91k53J75q3J77r9J00j18K83
$$ 47 124 -12 38 -176 55 56 3 -167 -96 -143 -30 46 -257 -241 -173 18 -235 -60 -143 34 -65 35 -83 200
4956B00j44M8k15p7Q0K14J15k60k7K5k5nJ80k61J76j03l0o9Q7nJ02K19k41k09
$$ 200 56 104 -111 -188 -108 106 221 -39 -66 -41 -66 -71 109 -152 24 -79 -109 -178 -91 -96 6 225 -16 -225
4980b25L76j86L1J0o9J91J15r5O8j26k82J63L3K30m30K45J65k54J84k89J47K6
$$ -225 151 -35 -4 6 -63 128 243 148 216 90 -192 -29 4 234 -196 49 214 -40 144 -145 2 28
5002B8l2kR5J3n1m05J60R7O4m9j07K35j87K07N3j33K42n65L47K45k40Q2k30K38
$$ 28 -4 -6 89 102 51 -354 -194 -97 -33 -82 -189 46 -141 66 119 -14 228 -337 10 255 15 97 -133 105
5026A05Q7j97J0q3l9QN0j7j27Q3P7J17k76J64N7j00O6K3k2J78l44K22K1J37p4
$$ 105 192 -5 5 -78 -117 -109 -59 -76 -203 -120 -43 74 -202 -38 19 -81 -15 8 -14 164 -180 42 63 200 126
5051A26k05M7j39K60K15m81K36pk0j10N8j6K38r8J27j62Q0k47P3k02l3J57J78
$$ 126 -79 -32 -171 89 304 -177 59 52 32 -78 -20 -36 202 104 231 69 149 -98 -25 -227 -260 -103 75
5074G5k30J56J3J22j84Q3j1l7j11J68n0j46J77Jj78j01N03l05J24m2K8j64J12
$$ 75 -155 1 14 136 -48 35 24 -13 -124 44 -6 -152 25 26 -152 -253 250 -55 69 27 55 -109 3
5097Cj70n7J84R0k84K11J38o4o1k18K83j11J23p3nM6j62O8J7j87L39j95j6M6J6
$$ 3 -167 -224 -40 50 -234 -23 115 51 -10 -228 55 -56 67 -6 -11 35 -127 -59 -42 -229 110 -85 -101 -55 -39
5122c9K64l82n0L08j1k14P0K15k24j44L41k68M0r4K6K21j89K3M7k2J51J28j70
$$ -39 225 -157 -207 101 90 -124 -54 161 -63 -207 134 -134 -94 -188 -162 59 -130 -107 -60 -82 69 197 27
5145B7Q7j79K79k00K8p9P8k5j03P1l5q1J11M5j5R7k1r9P1j56J4k14K08o0J57R0
$$ 27 114 -65 214 14 42 -37 41 16 -87 -16 -51 -132 -21 24 9 106 85 -14 57 -99 -85 -299 -91 -151 6 96
5171I6n5J34p5kk62J76j10j04K23r1m0J04K96l50J46J51l30L09k43l6N0M8m7m8
$$ 96 41 175 100 98 -164 12 -98 -202 21 -70 -110 -6 290 -60 86 237 -93 216 -27 -63 -13 35 -12 -60
5195f0J27o0N9l4L7l02L03J15j68L7J16k40j38J84qm6K0K26Q4j2j75Kn8O5o3K09
$$ -60 67 7 66 32 69 -233 70 185 17 54 170 -70 -208 -24 -32 -78 -58 168 252 240 65 67 9 74 11 220
5221B20k12J42J20j27j18R0j71j60K81j55J44q4J44j73J44k83K25J25k35J90q5
$$ 220 8 150 270 143 25 115 -56 -216 65 -90 54 -30 114 -59 85 -198 27 152 -83 107 22
5242B2J16J24k33n2j83j36L09j02J90P1r4k10K39j65Q3m2M9K4J82l20R0L7q0N6
$$ 22 138 262 29 -23 -206 -342 -33 -135 55 126 32 -178 61 -104 -21 -63 -14 10 192 -128 -38 -1 -81 -25
5266b5m05L30q1M9R0K00j96K09k52n3J41m7L5Q2K06j93j02O7N2j49J86p3J46m04
$$ -25 -430 -100 -181 -132 -42 158 -38 171 -81 -134 7 -40 -5 77 283 90 -12 55 107 -42 144 71 217 -187
5290a87K57P9l15K76j07o2Q5j46J68j36r6l6J26J61j69K23m11N03L1j25P8j52
$$ -187 70 149 -166 110 3 -59 26 -120 48 -88 -184 -220 -94 67 -102 121 -290 213 244 119 197 45
5312D5k18M47l99L86k92J30M4O7j65p0M76l40k19J9J90k91M11k08k7j64Q0J15
$$ 45 -173 274 -125 261 -31 99 143 210 45 -25 451 111 -108 -89 101 -190 221 13 -14 -178 -98 17
5334A7j39J36j02N7k3R9J45j18J61l78J69J10j01N0k34N52k64m7k85K64j92n7
$$ 17 -122 14 -88 -31 -54 45 190 72 233 -145 24 134 33 83 -151 401 137 90 -195 69 -123 -180
5356a80J16K19m5m69M95p0j74M41o14J13J82j1O4q3R7Q7m41L78J41k58j15J92
$$ -180 -64 155 110 -359 136 66 -108 333 -281 -168 14 3 67 -16 81 168 -273 105 246 -12 -127 65
5378F5nj7j26ML41m02M02Pj81j17r4R3j93JK00O9k94J78n2J72J18k03m4J09K00
$$ 65 60 43 -83 -79 262 -140 262 269 88 -29 -123 -30 -223 -222 -22 47 -247 -69 -121 51 169 -34 -78 31 231
5403B31j16k20K56K4l71R1Q1J22N5r9M5L8j0p0n7k4m8K6l4q1J32O6j25k4rL49
$$ 231 115 -105 151 175 -196 -105 -24 98 153 54 99 137 127 57 0 -24 -72 -46 -80 -161 -29 37 -88 -112 -121 228
5429B28l04j06L49k42J69q7RQ6k10O0K62j10k48K61J18j79j17K0O8p0j66J36J00
$$ 228 -76 -182 167 -75 94 7 16 102 -108 -48 214 104 -144 117 235 56 -61 -41 27 -43 -209 -73 27
5452B7Rj10P6k46K56j03K33N2k84K0L0q1k88L81J61k04J63j96j70L74k02K73l25
$$ 27 36 -74 2 -244 12 -91 142 194 -90 -70 -40 -121 -409 -28 133 -71 92 -104 -274 100 -102 171 -154
5475a54L75k29j16L67N3l41J9J94m64L38j52J72r3J24j03J6k20j5N49n15K89j08
$$ -154 221 -8 -124 243 296 -45 -26 168 -296 42 -110 62 -31 93 -10 6 -214 -229 320 -195 94 -14
5497a4Q5q1j85k32K56J22K81kk37L35q6j33l2P1k41M6J00j52K20j27j05j10M87
$$ -14 71 -10 -195 -427 -171 -49 232 230 -7 328 242 109 77 148 -93 -47 53 -99 121 -6 -111 -221 266
5520B66k02k41K9K16r4j05J04J96k85J24P8lk2j07r3J98k4lOk27K18j09J10R1
$$ 266 64 -177 -148 68 -26 -131 -27 169 -116 8 86 83 61 -46 -139 59 35 32 38 -189 29 -80 30 121
5544A21n5o0J13m28K44K2j29L3J20OJ98l89K68k44j47L92N2l02K61l02L27L1R2
$$ 121 66 6 119 -309 -65 -43 -172 -139 -19 -13 185 -204 64 -180 -327 65 117 -185 76 -226 101 132 224
5567B24k48J05j50J45l30N02m66K05K41l76j76M71q8O1K04l68J04Q0j60J08k83
$$ 224 -24 81 -69 76 -254 248 -218 -13 228 -148 -324 147 59 120 324 -44 60 140 -20 88 -195
5588a95J69j17K25l1j05J32k60K47po3J43j99N8Mn2J81j06P6j8k2j47R2p7J10
$$ -195 -26 -143 82 51 -54 78 -182 65 58 -5 138 -61 -3 1 -51 130 24 100 82 60 -87 5 -72 38
5612C8j74K67k50K3J55j8q7N3k46K52j76N9N4N9L3j97J37L2N8k25J71J41J1k57
$$ 38 -136 131 -119 -96 59 41 -46 7 -239 13 -163 -104 -50 9 42 -155 -18 14 72 -153 18 159 170 -87
5636h7O32p15L11p0J63k89J01l04K37J44j53o7L75l32n7q2K87J8k84N0J54mq2
$$ -87 545 -170 141 71 234 -55 46 -258 -21 123 -30 -97 278 -54 -111 -193 94 112 -172 -122 32 28 -54
5659e4J73l83M22j12j01j27J23J95l05j73L59q5K6J51L6m0k8l01K83o2mj15O7
$$ -54 119 -264 158 46 -55 -182 -59 136 -169 -342 17 -68 -42 109 145 105 77 -224 59 -3 -7 -122 -55
5682e5k80K94nL0l1Q0j44J2K21o6j66K22K11k71k07K29j07K13k53%L8K29L5l34
$$ -55 -335 -41 -46 -16 -47 33 -111 -99 122 56 -110 112 323 52 -155 74 -33 180 -73 -73 -35 194 229 -105
5706a05K96j49lm9p1K71l59J08L9n4O1k43K59pR3j53j33L6J12M85k71l42Q1M7
$$ -105 191 42 39 -10 -81 190 -169 -61 -22 -76 -15 -258 1 -6 87 -66 -199 -163 -51 434 163 -179 -98 -51
5730e1j05J28J21j23J05k83O05l84k39J89K73r7j33J14L1r3k5j56J23J00K4q1
$$ -51 -156 -28 93 -30 75 -208 397 13 -226 -37 236 139 6 120 151 58 33 -123 0 100 124 43
5752D3q8j85J26J07M0k81K77j01J15k50K83Q2l69M59l5j71l5j14J13Q4J01J6l96
$$ 43 -45 -230 -104 3 43 -238 39 -62 53 -197 86 168 -201 258 223 52 17 -97 16 100 201 217 -179
5775a79J47j95K48p5J05j42m8L17k23P9r7J60J66l16j12M26k98K34J01m52K25
$$ -179 -32 -227 21 -54 51 -91 -139 178 -45 34 -63 97 263 -53 -165 261 -37 197 298 -154 71
5796G1r7M2j14J15M3q1k5l3K22j27J58k94Q9K71l8K14p50K14m1O7j54M24k45K38
$$ 71 -26 16 -98 17 60 -21 -46 -79 143 16 174 -120 -31 240 202 416 -334 -120 -161 -94 -248 176 -69 169
5820A69l68N1R9j79Q6N2r9Q9m8M5J58J9m8K01j63J04p3k67K28kJ12l02M3k0r5
$$ 169 -199 -148 -49 -228 -142 -90 -189 -100 -148 -103 55 74 26 227 64 168 95 -172 56 54 166 -136 -93 -113 -208
5845b08J92Q1k30J85RP7l37N2J14K78m56L63j53jj23J86j88J05Q8R8k20J29PJ5
$$ -208 -16 65 -165 20 29 106 -231 -179 -65 213 -243 120 -33 -34 -157 29 -159 -54 34 132 -88 41 48 63
5869F3j30K5j4j2J45j05J07k86J55N2J02j42P9J1L26l01j65M6r0L9L47l25K33
$$ 63 -67 -42 -56 -68 77 -28 79 -207 -52 0 102 -40 39 50 376 75 -90 -44 -134 -95 252 -73 160
5892A60M5l34M8K83j03j65J91k35m7K80k2o3j52J61j05k9O3O0J2k7o3k5K48m28
$$ 160 205 -129 -81 202 99 -66 125 -110 -157 123 101 38 -114 47 -58 -87 -24 36 48 21 -42 -67 181 -247
5916b47l5J86J36l90M29p8J16q9N8k69K23J06m5r6k7J53Lk81J4Q8R2q2L4j42Q3
$$ -247 -282 -96 40 -350 79 1 117 28 86 -183 40 146 101 5 -22 131 134 -147 -133 -45 47 -35 -1 -143 -60
5941f0r6K58l63M34l04J98L9l26J91R5M2j36Rk14J80J49J10j34J33r2k86K52o2
$$ -60 -156 102 -261 173 -131 67 106 -220 -29 66 108 -28 -19 -233 -53 96 206 72 205 113 -173 79 17
5964A7R1k29N5L30j62p0K45l37n2q9J02J80k43l4J37q5%J48K1k29P5k0K35qj30
$$ 17 108 -121 -66 264 102 32 277 -60 -112 -201 -99 81 -162 -196 -59 -144 -144 4 25 -204 -129 -149 86 78 -52
5989e2%k55K83K76k53Q7l03M94l16j25M7R0l4Q8j29m8K09k29K27k10K46p2k27
$$ -52 -52 -307 -24 252 -1 86 -217 277 -39 -164 -117 -27 -61 27 -102 -150 59 -170 57 -153 93 21 -206
6012b06n7J04L14j02Q1r9r4P3L98l31p2L4M8k44N5J33K1k99L76j56J53j83R2p5
$$ -206 -263 -159 155 53 134 35 -59 14 412 81 9 43 91 -153 -98 35 56 -243 133 -23 130 -53 39 -36
6036c6k01L63j47m4J08j71J76l6rk25J80J62N1M6l54oj18M00j87j6K65k66J06
$$ -36 -237 126 -21 -65 43 -128 48 12 3 -222 -42 120 171 217 -137 -143 -261 139 -48 -64 201 -65 41
6059D1Nl23L43J02k76j5L0J19k36K27j67M8j20K54l02K27J27k19J79j40J67j58
$$ 41 46 -277 66 168 -108 -123 -93 26 -210 17 -150 -102 -222 32 -270 -43 84 -135 44 -96 71 -87
6081h7J33J25m8K3J3j59q1L46r3l07j10K21R1j17J09K8j79P1O8j31J0qJ44q0j85
$$ -87 46 171 123 146 159 0 -81 265 172 -135 -245 -24 67 -50 59 87 -92 -21 47 -84 -74 -82 62 -18 -203
6106b03K87j67Q9K91k32j42l4k73K12K20j34K97l42L59l00K5J14r0R2l5k84J17
$$ -203 84 -83 6 297 65 -77 -111 -384 -172 48 -86 211 -131 228 -72 -47 67 -23 69 34 -250 -133
6128a33LL01k00R6k34J84J8m9o8L1J9J13j09l19L85L2j75J36k0n2J97j36K0j20
$$ -133 -130 171 -29 67 -167 17 35 -14 -82 -51 -32 81 -28 -347 38 70 -105 31 11 -41 156 20 40 -80
6152h0j49j1L77J8o2K84k82r3J65j66J02j62mL5j2q3j52N7K20j61K28j07J31l16
$$ -80 -229 -240 137 155 93 377 95 2 167 1 103 -59 -63 -28 -40 -123 -275 -218 2 -159 69 -38 93 -223
6176b23J31L8j05P4k12L52P1m5l33L45k04K04k79J40n0L9J58r3j38J03J13k1l46
$$ -223 -92 -54 -159 -85 -297 55 126 81 -252 93 -111 93 -186 -46 -96 -57 101 8 -130 -27 86 65 -281
6199b81O5K56j28j61Q9j9J37Q1j07J98rk27J61J90j12r0j14L02j66k41L78k31
$$ -281 -216 40 -88 -249 -160 -179 -42 39 -68 130 121 -106 55 245 133 43 -71 231 65 -176 202 -29
6221b9J37k41J45J39Q6l81L86q8k15K23m06M25k54j08K55J7k80L50l33J78j46
$$ -29 108 -133 12 151 237 -144 242 154 -61 162 -244 181 -73 -181 74 91 -189 161 -172 6 -140
6242a40j47N85l16J29q2P7k7K3K4j67J14k61K67k93K77j71J14J97j56P4k49K4
$$ -140 -287 298 -18 111 29 106 79 102 126 -41 73 -188 79 -214 63 -108 6 203 47 121 -128 -104
6264a04J41j20k3L14m09O6J00J72l80J73j29L57p4j82J78p4J12k99K40N8M8j75
$$ -104 37 -83 -106 208 -201 -135 -35 137 -243 -70 -199 158 84 -98 80 6 118 -181 59 117 165 -10
6286a0J36k69J54K11k75j5k43M02j53Q9Pk8p7nK56j16j04k07Q7J05L14j19l35
$$ -10 126 -143 11 222 -53 -68 -311 91 -62 27 34 6 -71 -76 180 64 -40 -247 -160 -55 259 140 -195
6309a95L02l25K16m4R3k92N33k59m9J73j95K51k90L01k88J48l12K86j59l1J97
$$ -195 107 -218 -2 -46 47 -245 288 29 -20 153 -42 209 -81 220 -68 80 -232 54 -105 -136 61
6330F1j22J21J18l21L97k77J48k40j77N11m02K82q0n8P3j65J99K18l09L02j87
$$ 61 -61 60 178 -143 254 -23 125 -115 -292 219 -183 99 19 -39 34 -131 68 286 -23 279 92
6351I2J28qk94j25K27j27K74k9k81Rk1J48O6m12K21J64j03R0j37N78o26M25k29
$$ 92 220 212 -82 -207 20 -107 167 138 -143 -134 -155 -7 59 -353 -132 32 -71 19 -118 460 -166 259 30
6374C0J80k50N1j6L24j41l19K90l6j02j49J25K06l55K72j94r8K89k55R9L1o1j13
$$ 30 210 -40 11 -5 319 178 -141 149 113 11 -138 -13 193 -162 110 -84 -182 107 -148 -49 -18 -79 -192
6397a92R1K23O9j62k02L44j91r7n0J07Q0J27j11m05N66K85k42k33K7l20Q4J36
$$ -192 -101 122 191 29 -173 171 -20 -117 -167 -60 20 147 36 -369 197 482 240 7 34 -286 -202 -66
6419f6P8J32j51p7O8J59K2J44n01J55J57k55M95n78J14K49j11P7m12L92l47j4
$$ -66 12 144 -7 -84 -16 143 165 309 -192 -37 120 -135 360 -218 -104 145 34 111 -301 91 -256 -270
6441b70M15m5m4o0pP1L7l25O53l10q9m12L71q0M6K14j41j68K00P9j75K31k92l3
$$ -270 145 100 56 -4 -11 60 97 -228 425 115 26 -386 -15 -95 -49 165 24 -144 56 135 -40 191 -101 -134
6465a34O0K81N8m06j9L79l39K57j6j8r4L4K7j10K51M3j39R7l35K64Jk81J88j78
$$ -134 -74 207 265 -141 -160 219 -120 137 121 103 9 43 70 -40 211 254 115 212 -123 141 142 -139 49 -129
6489a29L20j33j32N4j06M5J01J79j44kJ89m21Q2Q7P0r0R9r5K46l78K44jK9j87
$$ -129 191 58 -74 -20 -126 -81 20 199 55 53 242 -179 -97 -10 60 -30 69 -26 220 -158 86 85 114 -73
6513g3o6J14J38j75J41j94MR1J21l42L45k64M19n49M08k06J21P7q0Q2l88K05o9
$$ -73 -139 -25 113 -62 79 -115 -111 -20 101 -241 104 -160 259 -290 118 -88 33 110 30 112 -276 -71 -140
6536a40j11m8L55n6k1j16L44k98L33j07j83K04j58o1K0o8P5m5O7r7N4j01J07p1
$$ -140 -251 -299 56 0 -21 -137 207 -91 242 135 -48 156 -2 -63 -43 -111 -36 -81 -14 -111 -57 -158 -51 -122
6560a22J74J92l22K01j94J4K99n8j74M9j4j41J11J17n7k44J01J20j5k7j53oP0
$$ -122 52 244 -78 123 -71 -57 242 184 10 59 45 -96 15 132 75 -169 -68 52 37 10 -143 -149 -79
6583g9r1K76j17j37L23j15J5m16M15j21L1J81j31J96j92j33J50L65m53j01K48
$$ -79 -170 106 -11 -148 175 60 75 -341 74 -47 -16 165 34 230 38 -95 55 420 -33 -134 114
6604A14j87L11j77p3j04J56J92j13R1j76J98j0l16k3K03j14j17J5K07k13K39k61
$$ 114 -73 238 61 -12 -116 40 232 119 210 34 232 222 -94 -117 86 -28 -145 -130 77 -136 103 -158
6626a58J15L6o1M3j21j39L04N8M1q3J22mp6K3j98QJ9J87j26J17J2p3J12k71O5
$$ -158 -43 -7 -68 -25 -146 -285 19 77 118 35 157 153 77 100 -98 -90 -71 116 -10 107 119 46 158 -113 -48
6651d8R7k49J87j61m1K50j57J88l3n9J44n8k9qj9P6L1j22K60m68K08J00J08m89
$$ -48 49 -200 -13 -174 -215 35 -122 66 33 -26 118 60 31 23 4 80 111 -11 249 -219 -11 89 197 -292
6675b92M29q2rm7M0o6l20K95P5J66k1j86nPj8k5j61M5M75l71N3N3K4j81K03m3
$$ -292 137 55 46 -1 39 -27 -347 -52 23 189 168 -18 -23 -16 -34 -59 -220 -175 300 -71 -18 35 59 -122 81 38
6701C8J8q6p0K12j56r5n9J97K24k80j77N0K7J54K7K08k37j78M3J93q4Q6k55K59
$$ 38 56 -30 -100 112 -44 -139 -198 -1 223 -57 -234 -184 -157 -3 24 232 -5 -183 -140 53 -31 55 -200 59
6725E9j94J37J77m00K56j98K59k38J49K04j60j48J34j57J40Q0l24K71m2L6k2J55
$$ 59 -135 2 179 -221 35 -163 96 -142 7 211 51 -97 37 -120 20 100 -224 47 5 41 19 174
6747A74K5m59J22nJ62K30m88K00o1K32n3o7R4M5j20J10Kk97J00K03k7k92K66j41
$$ 174 199 -260 -138 -143 19 249 -239 -39 -100 132 79 12 106 151 31 141 143 -154 -54 149 122 -170 96 -45
6771d5l8J86k59K69m8o9J71k28J50J0j35j55J34J79k96J25K4R9l21J14J49OK49
$$ -45 -83 103 -156 113 65 -4 167 -61 89 99 -36 -191 -57 122 -174 -49 -25 74 -247 -133 16 22 271
6794B71m08n5Q0J32l8K63p9j40j77O8l9J61j1K21l5k85K14M6k36L7j62K43J6j24
$$ 271 -137 -192 -112 20 -18 245 166 26 -151 -83 -122 39 28 249 214 -71 143 189 -47 -10 -172 71 87 -37
6818c7j04qL09l03J22J1j57K48j64p6K94J21j33j71n0K29j27j29K07P6j12j77
$$ -37 -141 -149 160 -143 -21 -10 -167 81 -83 -159 135 256 123 -48 -98 131 4 -125 82 158 46 -131
6840a31j62K35k3Q5o3j4p7j4L20j80J28j18l1Q4l78L88N9m9K21l50J47M7R0j12
$$ -131 -293 -58 -81 4 -59 -73 -150 -164 156 -24 104 -14 -45 39 -339 49 108 59 280 -70 77 124 214 102
6864A02Q5j88k8k1mo0J40k18R4jj46J57J11k15K79m2m9J08l51K62Rn8k7J26N0
$$ 102 187 -1 -29 -50 -54 -114 26 -192 -98 -99 -245 -88 23 -192 87 45 -4 104 -247 15 24 -34 -61 65 115
6889A15j56J32j33o7J60n6Q0%J3j29O6J5K3j32J72k18L17k28j75q5L69p8KLj82
$$ 115 -41 91 -42 -109 51 -5 75 75 88 -41 25 40 63 -69 103 -115 202 -26 -201 -286 83 5 7 10 -172
6914a72L0nL16n7k7n7n4j6J54j64Q8K39k35l1P0l5j0j92J94J43m3P4j08J47k85
$$ -172 -142 -147 169 112 85 28 -26 -42 112 -52 36 275 40 9 79 44 34 -158 36 179 136 210 102 249 -36
6939c6J41k67P2R2J61q0j41l1J12r7m0J68k9k47K07J63k86R1p2J13m9J9J76k23
$$ -36 105 -162 -90 2 163 83 -58 -89 23 -74 -114 54 25 -222 -15 148 -138 -47 -119 -6 -55 -36 140 -83
6963h3j0J27L82n27J43L35n25L67r9j29k8J8j30K13r7j03L79p30L74J43r8J95
$$ -83 -93 34 416 -111 32 367 -158 209 110 -19 -47 -29 -159 54 -43 -146 233 -497 -123 20 -78 117
6985A17P8l66O8J33j69M32j47k57K66n4p5o8j61J52m0nk35M85k26k31M37k02N4
$$ 117 195 -171 -103 30 -139 293 146 -111 155 101 26 -42 -203 -51 -91 -96 -331 154 -72 -303 134 -68 -14
7008a4j51J03J23k9l5n3j15L12j95j77L97k70j18K18n4K60k85p8P0J96j60L2K14
$$ -14 -165 -62 61 32 -3 -56 -171 141 -54 -231 166 -104 -222 -4 -58 202 -83 -161 -91 105 -55 -23 191
7031A91k67J8OK12j52r2J03K72l83J56j02n7K4K45j28k30P4r3K86k48J59K71j85
$$ 191 -76 -58 -52 160 8 -84 19 291 -92 64 -38 -95 -71 174 46 -184 -110 -203 83 -165 -6 265 80
7054H0j28J92k18MR5J3k04J37J40J7k06K7L15k92M6m0J42j86J45O0j77R9n1n5
$$ 80 -48 144 -74 -70 25 38 -166 -29 111 128 -78 -51 264 -28 18 -22 120 -66 79 139 -38 61 10 -45
7078d5q7J6N8j40K06k23K76j23J60j15q0P4q0M3K91l31K9k4k18K73K89k10j66
$$ -45 -132 -116 -58 -198 8 -215 61 -62 98 -17 -97 -23 -103 -60 231 -100 -71 -95 -313 -40 249 39 -127
7101a27n2M08j37j35j22J82j2j93L12j71L8K65k16k19J92N0k33J13J00j61L25
$$ -127 -179 229 92 -43 -165 17 5 -188 124 -47 -9 256 40 -179 13 63 -170 -57 43 -118 207
7122B07n4p5k60L7P3L8P7j87o9J99k53M84q4l5p4Q8q9K5q3M3k24J74k15J19m9
$$ 207 153 78 -182 -145 -72 -34 43 -144 -213 -14 -267 217 133 98 24 112 23 48 -35 8 -216 -42 -257 -138 -187
7147a87K91J57k32K6j00K5k0K9k37K83j18K19q6l10L37n94N14J14j53J3J43j14
$$ -187 104 261 29 55 -45 -20 -40 -11 -248 35 -83 136 50 -260 77 -517 -3 111 -42 -29 114 0
7169@p6k1J78Lk65J25rJ28p1K0N7j75N0J09P5j50L9M5j45J3q7Q9L8n8j16K15K03
$$ 0 -76 -97 81 84 -181 -56 -65 63 -8 12 69 -106 -56 53 128 -22 17 62 -83 -70 -157 -68 -30 -88 -204 11 214
7196B14k19K68j75k17K25O9j74j21K04N1j64k70K92J40L4k48L2j64L04K1j83L64
$$ 214 -5 263 88 -129 96 165 -9 -130 74 125 -39 -309 -17 123 157 -91 -59 -223 81 102 -81 283
7218B83r1j93K9J52j29k67K23j89K27j35j84L28M0j99K05j74K42k74j6J40J48
$$ 283 192 -1 28 180 51 -216 7 -182 45 -90 -274 54 94 -105 100 -74 168 -106 -122 18 166
7239A66k20L9L4P2k1LL6J88k82j54K75k06J9R0l08K69j07J64J8j82P0k2j63L30
$$ 166 -54 -15 19 91 70 73 109 297 15 -139 136 -70 -51 39 -269 0 -107 57 75 -107 -37 -59 -222 108
7263A08j89R5j35O7j42J33j29K13rL4K4j55L21j73p3j38J33p8J75j27Nk3K45j27
$$ 108 -81 14 -121 -54 -196 -63 -192 21 12 46 70 -85 236 63 -10 -148 -15 -93 82 -45 -40 -63 182 55
7287E5j21K44j52L8k75N6O9N6K06j37j24R8j74J52J0J49m9j23L9J23p0j72J65
$$ 55 -66 178 26 64 -211 -155 -86 -30 176 39 -85 13 -161 -9 1 150 101 -22 17 140 70 -102 63
7310F3j80K27k0k4q8m0R4J42k17N8r4NJ07m7J05n1J9m6j92L7M36n4m92K55k0K0
$$ 63 -117 110 90 66 -22 -62 32 174 -43 15 -79 -74 33 -14 91 40 59 13 -179 -142 294 240 -252 3 -17 3
7336CK68m72K06j11o1q2J39oK5N2p5K89j77p2L4J01J24l34K9K75k49R6pq7M19
$$ 3 271 -201 5 -106 -167 -249 -110 -116 -91 -39 -114 175 -2 -74 -40 61 185 -149 -120 155 -94 2 -5 -92 327
7361C27k04j99j46J05K59k89K54l53K20j70J81q8J46J67k80Q9K4l5j08M08l84
$$ 327 123 -76 -222 -117 142 -147 107 -246 -26 -196 -15 -103 43 210 -70 19 43 8 -100 308 -76
7382g6r0K58j74o8K85l13L2Q5j93R4J62l5J7R6j87J87j9n1j69J21J09j56J67n0
$$ -76 -166 92 -82 -150 135 -178 -146 -61 -254 -160 2 -33 -16 80 -107 80 61 10 -159 -38 71 -85 82 32
7406C2LJ35j28J20r4n9j54K65k6Q2k90K51r0m9kr2r8L3N4J64j44rm7J66n2r8N6
$$ 32 35 170 42 162 68 9 -145 120 94 176 -114 137 47 -2 -4 -96 -194 -161 -107 57 -87 -96 -143 23 -29 -127 -71
7433g1K04q7j57P4J22m0RN0O9j06N7k36N6Jj87J29J06k9K45l19N1j72K77j83m4
$$ -71 133 46 -111 -37 85 45 54 104 173 67 124 -112 -56 -55 -242 -113 -7 -36 209 -110 -59 -231 46 -137 -181
7458a81J73k09J65J54p4R5j81K06j27J0M2l10J37J04J07m7j12Q9P0K58n2k49O
$$ -181 -8 -217 -52 102 28 123 -58 148 21 31 73 -237 -100 4 111 64 -48 41 111 369 317 68 74
7481G4j69R7J64nm24K60K4K1k04J77M5l43K05N4q7l0k3M43k45j42j9J10j75M0
$$ 74 -95 2 166 161 -263 -3 21 42 -162 15 60 -283 -78 -24 -111 -141 -164 279 34 -108 -127 -17 -192 -152
7505a52o6J34K55j75m0J28j3j67r7J52J3J64j3n7l6nj68L05l42J83K34k75K11
$$ -152 -218 -84 171 -4 -44 84 71 -96 -193 -41 -28 136 123 66 30 25 -143 162 -180 3 237 -38 173
7528A73k84J67l5J49j44l6k92L94j59Rr1J63k7p1kK94j74k6O6j27P7K47m00J70
$$ 173 -111 56 21 170 26 -10 -302 92 -67 -58 -149 14 -13 -84 -86 208 34 8 74 -53 24 271 -129 41
7552D1j42K70j97k43L42L2J8k61L52k82J37o9j13J85J9j60m9k0K28k57J57L7J02
$$ 41 -101 169 -28 -271 71 103 121 -140 212 -70 67 -2 -115 70 89 -71 -120 -140 88 -169 -12 25 127
7575A27j13j2j1j28r1K20P0j81Q0m5Q6Q9n4j69Q1J19q2k53L64k2k70L41j73J22
$$ 127 14 2 -9 -137 -228 -8 62 -119 -39 -84 2 91 37 -132 -51 68 -14 -267 97 75 -195 146 -27 95
7599I5j18n4J97j68J62k73m5K19K7l12K88l8J13m9O2M1N9k86J63j18k7n3O5j1
$$ 95 -23 -77 120 -48 114 -159 -204 15 42 -270 18 -20 93 44 106 147 206 -80 83 -35 -62 -115 -50 -61
7623f1K4K21Qj65K30l13qK36l8J6p4P1k34M2J25Jk71J88j37klL86q1m60K95p7
$$ -61 -37 184 192 27 257 -56 -64 172 134 150 76 147 -87 -45 80 81 -190 -2 -139 -141 -144 242 161 -299 -4 -81
7649h1K99l00M3k08K57P7O4k61Q9j18L30j67R0j28O9j14J68j01J04k62K15k01
$$ -81 218 -82 -39 -247 10 87 151 -110 -21 -139 191 24 114 -14 55 -59 109 8 112 -150 65 -136
7671a36K18O4j00K2J50l14P1J23m53M31K33l64O7K4N0O6n2j51J62p5R4k04J6O7
$$ -136 82 146 46 68 218 -96 -25 98 -355 76 309 -55 12 36 86 152 100 -51 111 36 130 -74 -58 9
7695Ik2K27l17J40o2Q5o8pR3k26O3K39k82K17l6m21K04J10j66L7M64j01l52L25
$$ 9 -13 214 -103 37 -25 60 -8 -15 78 -148 -85 154 -128 89 53 -368 -164 -54 -220 -183 281 180 -172 153
7719A53j47k6j88kJ42J59o9j12J01K5M6Q2p0k89J26p0K76r4pr8L6J98J65m34K09
$$ 153 6 -20 -208 -210 -68 91 22 -90 11 36 82 164 94 -195 -69 -139 137 43 36 -62 -26 172 337 -97 112
7744A12j64r9J04R1j12J36O7m12K70o8n9J25p0J73j60o4K17j74J43k62J80K7J06
$$ 112 -52 -151 -47 44 -68 68 135 -277 -7 -75 -134 -9 -79 94 -66 -130 87 -87 56 -206 -26 1 107
7767A07k33K08ln6j16J56q5o4N0J95j75M5O2k00R0k2R5J20n74K90K2J08m3K16
$$ 107 -126 82 79 23 -93 63 -22 -86 -36 159 -16 29 91 -109 -19 -41 54 174 -400 -110 -88 20 -23 193
7791A93nk11k4J78P7l99K65j08k45L1J29L47k33k1N9J81j48Q9r4j68J01J65q8
$$ 193 188 -23 -47 131 208 -191 74 -34 -279 -248 -119 228 -5 -26 33 214 66 155 61 -107 -6 159 71
7814G1jm0J90K7l52N8J8Q8j34k0J59p6j95J37Q4J75N0l33j8L05J1k20M5L98n28
$$ 71 70 30 220 247 -105 -47 -29 59 -75 -95 64 -12 -207 -70 14 189 239 -94 -112 193 204 -16 29 427 -101
7839a01L64n17J63q9N0L20l52J29L1K5J82k13N6oJ90q6k07O9k98N18n08K61p3
$$ -101 263 -254 -91 -180 -130 190 -162 -33 -2 23 205 -8 48 42 232 146 -61 8 -290 228 -280 -19 -92
7862i2N4J6J42k75L0NM0n4J09o3J77j97Q6j22k6L74k21J81j72l4o6p3L75M7n17
$$ -92 -38 -22 120 -155 -125 -120 -80 -134 -25 -88 89 -108 -22 -144 -170 204 -17 164 -8 -42 -108 -181 194 241 -276
7887b76J43RK87nj40J44L7p1n9l0O7K3J13k62r7L36q6k21LK07j78O9K9o4Q1l3
$$ -276 -133 -124 163 158 18 162 199 128 69 39 106 129 242 -20 -117 219 133 -88 -85 122 -56 13 42 -22 59 26
7913B6J05k60J66j90J33k0L00k38j51j79M61k19P8j05K79k5k30k9j83M10k7j1
$$ 26 131 -129 37 -153 -20 -40 260 22 -129 -308 153 -66 12 -93 186 161 -69 -98 -281 129 102 91
7935I1n7J7l33K93J37k94L39j07m82L29J1q2J72j90L34j75j95K12nk43N03k9r7
$$ 91 34 51 -282 11 148 -146 193 86 -396 -67 -56 -138 34 -156 178 3 -192 20 15 -228 275 246 149
7958A49P1k54j2K28l73K97j47jl0j9J60k01L94l46J6J74j03o1L16k13m1Ok18J20
$$ 149 220 -34 -46 182 -191 106 -41 -42 -72 -91 69 -132 262 -84 -68 106 3 -58 258 45 4 10 -208 -88
7982h8Q2k00L07N6m65K55Q3m1k4M6k86M00o2LJ3j73j19K62o1k13L50J53l35l9
$$ -88 -6 -206 101 157 -308 -53 30 -11 -35 11 -275 125 63 66 79 -94 -213 49 -12 -225 125 278 -57 -96
8006i6K4j62K23l9l0m9J37J69K0j81N5l3j07J99Q5m0L3r3k51M20m88k87O49m13
$$ -96 -72 -234 -11 -50 -80 -129 8 177 197 16 71 38 -69 130 215 175 208 115 -136 284 -204 -491 158 -255
8030b55J66M0l9kK54k71L03l87Q7M9K5O0Q1m4j32j18J14K07j25j27P8L23j44j28
$$ -255 -89 -49 -88 -90 164 -107 196 -191 -104 -55 -30 30 111 67 -65 -183 -69 138 13 -114 -36 287 143 15
8054A5k39Q6n8L65l59O5J71j51K06k07j9k39K21K57rq6j89K04k26L47k56M3J47
$$ 15 -224 -138 -196 169 -190 -125 46 -105 101 -106 -125 -364 -143 114 105 19 -170 34 -192 155 -101 -58 89
8077H9M8r6J3j6J5j5q4k5P9J92k20n6j16Q2K52l89O9K66j86J3J13l6j76P8n8o4
$$ 89 137 41 54 38 53 38 -46 -71 8 200 -20 -76 -192 -110 142 -247 -178 88 -98 -85 28 -8 -184 -106 -164 -228
8103b28O53k81k67K71j62Q9k10K01Qp3Q5l62kL36m3k3Q0k24K55J4l6l07K99n1
$$ -228 425 144 -123 148 -14 75 -135 66 74 1 86 -276 -278 58 15 -8 72 -152 103 117 81 -226 73 22
8127B2J21l69L54j33j38J12O3p2j74J28R4P8k87K06O4K1k9j3j15L80j69Nl4O5
$$ 22 143 -226 128 -5 -143 -31 32 -40 -214 -86 8 86 -201 5 69 90 61 48 -67 313 144 149 115 180
8151A80j60mR8j7l8j34N9k23qL56l56N7J87Q6p6l7K24l83K13j42J51mp6Q6J9M
$$ 180 20 16 114 97 59 -75 -16 -239 -247 109 -247 -190 -3 83 7 -30 194 -189 24 -118 33 29 -47 39 58 62
8177F2l5J52j24K7l21k0L98k21L98l03J16P5l13K05
$$ 62 27 179 55 82 -239 -259 139 -82 316 13 129 204 -109 96
8191I6
$$ Imaginary data points
##PAGE= N=2
##DATA TABLE= (X++(I..I)), XYDATA
0@%%%%%%%%%%%%Nj3J6j6J6k4L2l2M0m8N6o9P7q8J04j20J36j57J81k05K34k66K98
$$ 0 0 0 0 0 0 0 0 0 0 0 0 0 5 -8 8 -8 8 -16 16 -16 24 -24 32 -37 40 -48 56 -64 72 -85 96 -109 125 -141 157
35A57l34L74m17M67n20N76o40P11p86Q69r61J058j166J284j412J557j717J892
$$ 157 -177 197 -220 247 -273 303 -337 374 -412 457 -504 554 -612 672 -740 817 -900 992
53I92k089K311k562K849l180L567m026M583n273O154p322Q943j1350J5285k2756
$$ 992 -1097 1214 -1348 1501 -1679 1888 -2138 2445 -2828 3326 -3996 4947 -6403 8882 -13874
68a3874M1605j71519k98962N18036K19208l33452j19416J86428K6636l2022K1270
$$ -13874 27731 -143788 -442750 75286 294494 -38958 -158374 28054 54690 22668 43938
79D3938r1052q7171J72222J33172j32766j56191L5494J51272M9925j59290r0660
$$ 43938 -47114 -134285 37937 171109 38343 -117848 -82354 68918 118843 -40447 -131107
90a31107J47930J12687j19340j14920P2479O5283l6811K4536r876j02901O1814
$$ -131107 16823 129510 10170 -104750 -32271 33012 -3799 20737 10861 -92040 -30226
101c0226J33442j02567j16250J26254Q7073j23954k6829J03583n2980n8153J22877
$$ -30226 103216 649 -115601 10653 97726 -26228 -53057 50526 -2454 -60607 62270
112F2270J4055j38357J3053J21350j6057j12336J307J01679O462q1664q313N5302
$$ 62270 76325 -62032 -48979 72371 56314 -56022 -54715 46964 53426 -28238 -36551 18751
124A8751j3486n6503M8049N9590r5071m2803J37352K3558j54162j7736J49870
$$ 18751 5265 -51238 -3189 56401 -38670 -81473 55879 79437 -74725 -92461 57409
135E7409K0019j25263q70R3803j9527m2227L3775q185m0352L9426N5492n0306
$$ 57409 77428 -47835 -48705 45098 25571 -16656 17119 8934 -31418 8008 63500 13194
147A3194p0409M5593O5797l8119n8198J8545M9639p276m3089J0309J9034k4703
$$ 13194 -57215 -11622 54175 16056 -42142 -23597 26042 18766 -24323 -14014 5020 -19683
159a9683J5682L4145m1681l2783N5628K7145n9357r443O1170j1434m6088L2594
$$ -19683 -4001 30144 -11537 -44320 11308 38453 -20904 -30347 30823 19389 -26699 5895
171E895K4125m2846j1215M7173J3021n0465j6658M8387R647m1284m403L2841j932
$$ 5895 30020 -12826 -24041 23132 36153 -14312 -30970 17417 27064 -14220 -18623 14218 12286
184A2286k7559J4431K0751l9234j1417N8058L242o6886o76P0389j487o7283P777
$$ 12286 -15273 -842 19909 -19325 -30742 27316 30558 -36328 -37004 33385 31898 -35385 -27608
197b7608N1158j1156k0710Q241o778k551K5644N148l7043j0676M3340J8291l8900
$$ -27608 23550 12394 -8316 -75 -6853 -9404 16240 21388 -15655 -26331 17009 35300 -3600
210c600k6887K6538L9674j7297m8226J4947L8919j3214j8684N045n043qK4683
$$ -3600 -30487 -3949 35725 18428 -29798 -14851 24068 10854 -7830 -2785 -7828 -7836 16847
223A6847k101m5773M036N8222j2090n4184J6127L7777r613k1441M753J0352m366
$$ 16847 14746 -31027 -26991 31231 19141 -35043 -18916 18861 9248 -12193 -7440 2912 -1454
236a454O640O411j7675j794J9620K648j2741j1613J0170K1108j4812k1991J4659
$$ -1454 5186 11597 -6078 -7872 11748 14396 1655 -9958 212 21320 6508 -15483 -824
249h24J6550j5267j5667J7529O958k4378P704J9755k3205o795K5758l220j9478
$$ -824 15726 459 -15208 2321 9279 -15099 -7395 12360 -10845 -17640 8118 4898 -14580
262a4580O970J8087r074j3734J6814N365j3727M329O694j671j522n731P858N875
$$ -14580 -7610 10477 1403 -12331 4483 9848 -3879 450 7144 5473 3951 -1780 6078 11953
276A1953j4022k278J2085n01j2542j693J4035o832j4403J6899L73j8780J2367
$$ 11953 -2069 -4347 7738 7237 -5305 -6998 7037 205 -14198 2701 3074 -15706 -3339
289c339J1864j6049p075J6422Q582j8788k752J9758m030p971N888j743K216L835
$$ -3339 8525 -7524 -14599 1823 10405 -8383 -11135 8623 4593 -3378 2510 767 2983 6818
303F818n386L71j88j76N025k965n967k071R133N112j9133j629K1369q709j3191
$$ 6818 1432 1803 1615 1439 6464 3499 -2468 -4539 4594 9706 -9427 -11056 10313 1604 -11587
318a1587J0446K403o664K347O205o127p253J4824L008j6988N581J0325m937r39
$$ -11587 -1141 1262 -5402 -3055 3150 -2977 -10230 4594 7602 -9386 -3805 6520 1583 644
332F44j830J117N266j973l691P17L198Q73n823L295K242q735P220L884j3634L197
$$ 644 -1186 -69 5197 3224 -467 250 3448 4321 -1502 1793 4035 -4700 2520 6404 -7230 -4033
348d033J0965o938q134O049P494q933m165J0923m627m506R006m348m574P535P97
$$ -4033 6932 -6 -8140 -2091 5403 -3530 -7695 3228 -1399 -5905 3101 -1247 -5821 1714 2511
363B511l385m61K447J655j180J434l380p40R775n023q785R140O87o643M089O97
$$ 2511 -874 -1335 1112 2767 1587 3021 -359 -1099 8676 3653 -5132 4008 4695 -1948 2141 2838
379B838o796M37Q561k709j2366N997Q582p747p28K748m827M333O239o269n259
$$ 2838 -3958 -3521 5040 2331 -10035 -4038 4544 -3203 -3931 -1183 -6010 -1677 4562 -1707 -6966
394f966N844P197m161l783K390j641N973O097j2455m382J1761K726o723m442Q71
$$ -6966 -1122 6075 1914 -1869 521 -1120 4853 10950 -1505 -5887 5874 8600 1877 -2565 -1694
409a694K706M503j106j3660j196J7914k111j4525J656N893J275J570l781o197
$$ -1694 1012 5515 4409 -9251 -10447 7467 5356 -9169 -7513 -1620 -345 1225 -2556 -8753
423h753L892J2540j010j4751J564J1191K726j582r338k833J4684N000j4379q123
$$ -8753 -4861 7679 6669 -8082 -6518 4673 7399 5817 -3521 -6354 8330 13330 -1049 -9172
437i172J1067R312q033o126L96k026P552N067j3854n586J0956P269n437j0622
$$ -9172 1895 11207 3174 -2952 -2556 -4582 2970 8037 -5817 -11403 -447 6822 1385 -9237
451i237q44R507R213m328j6935L601J9964l324j3565J360N174N193J727n354p119
$$ -9237 -10081 -574 8639 4311 -12624 -9023 10941 7617 -5948 -4588 586 5779 7506 2152 -4967
466d967J618J1266J234j1564l494L850Q493N095j6112j1123J6527J1817j2289
$$ -4967 -3349 7917 9151 -2413 -5907 -2057 6436 11531 -4581 -15704 823 12640 351
479C51j3128P495J1571n189l820L51n986N618J1192m755j0700j550J1550Q979
$$ 351 -12777 -5282 6289 1100 -2720 -2369 -8355 -2737 8455 3700 -7000 -8550 3000 11979
493A1979j0074j2219M640J6993K510k0975m982J9937L386j0328l339j200K929
$$ 11979 1905 -10314 -5674 11319 13829 -7146 -12128 7809 11195 867 -2472 -3672 -743
506g43M962J090o639q307Q826J1019q231j2792j151J4644J1769j6330j4295J1564
$$ -743 4219 5309 -1330 -9637 -811 10208 1977 -10815 -11966 2678 14447 -1883 -16178 -4614
520d614J4014l462j4704j345J5713L778p626m252k464N022P268N59o658r841P820
$$ -4614 9400 5938 -8766 -10111 5602 9380 1754 -2498 -4962 60 7328 7887 1229 -8612 -792
535g92J5931r050j8291K846J9155N735k1563j0540J6676Q668p680p525P9N764
$$ -792 15139 6089 -12202 -9356 9799 15534 -6029 -16569 107 8775 1095 -6430 -6351 -587
549e87Q21n39J027q517k83J5721M639j6131j1601J6180J7153j4364j4523R769
$$ -587 234 -305 722 -7795 -8078 7643 12282 -3849 -15450 730 17883 3519 -11004 -1235
563a235J0364M58r669p958P151P968j773n793l721J590K697M518j448j4977J369
$$ -1235 9129 9587 -82 -8040 -889 7079 5306 -487 -4208 -2618 79 4597 3149 -11828 -10459
578a0459K0156j929j7535j953J3216Q095r917j0062N151J0181M250r456q407J0303
$$ -10459 9697 7768 -9767 -11720 1496 9591 -326 -10388 -5237 4944 9194 -262 -8669 1634
592A634N615o123O1L0l746M731Q383p552j5911R805J8284j1738j5158P278Q637
$$ 1634 7249 1126 1187 1217 -2529 2202 10585 3033 -12878 -3073 15211 3473 -11685 -4407 4230
607D230p0n817o045M077P616j714p333o39O483p10Q1M127q206l985J2850L356
$$ 4230 4160 -1657 -7702 -3625 3991 2277 -5056 -5695 788 78 159 4286 -3920 -7905 4945 8301
623H301j1060j965Q802K993o600k478K024k53N381L10r048J418M963k491j461
$$ 8301 -2759 -4724 4078 7071 471 -2007 17 -236 5145 5455 -3593 -2175 2788 297 -1164
638a164J262j643j810N406J714j0607o54J1221p40o034j3L37K725L167l577l175
$$ -1164 98 -1545 -3355 2051 3765 -6842 -7496 3725 2985 -3049 -3062 -2725 0 3167 -410 -3585
654c585L961M449l809l485M077j035N64N371m773p109N936N479m859n627L914
$$ -3585 376 4825 1016 -2469 1608 573 1137 6508 1735 -5374 562 6041 1182 -4445 -531
669e31M835l501k813p77j104M671J431n125n00L071O34k066q86J674j02K930J612
$$ -531 4304 803 -2010 -2787 -3891 780 2211 -2914 -3414 -343 291 -1775 -2661 -987 -1089 1841 3453
686C453n782RN840j647j607J617o14M79J031j095k784L96M055k108k995K431j595
$$ 3453 -2329 -2320 3520 1873 266 1883 1269 1748 2779 1684 -1100 -704 3351 1243 -1752 679 -916
703i16n39K662k300k060J838O27J59j701l0J863m70J281p92j789L221J014j659
$$ -916 -1455 1207 -1093 -3153 -1315 -688 -529 -2230 -2260 -397 -867 414 -378 -2167 1054 2068 409
720D09M80n83P15J261n27o66j490K096K008m636K91K485k070N10l06k660J387
$$ 409 889 306 1021 2282 1755 1089 -401 1695 3703 -933 -642 1843 -227 283 -23 -2683 -1296
737a296J848j318j925J58L282j706j714K412j735J721K744m117j2L841o52j223
$$ -1296 552 -766 -2691 -2533 749 -957 -2671 -259 -1994 -273 2471 -1646 -1658 2183 1531 308
753C08m20J536Q22j130O28j062q92L327j584l111K319J21j118j57r57R11k78n
$$ 308 -112 1424 2246 1116 1744 682 -210 3117 1533 -1578 741 862 -256 -413 -1370 -459 -737 -742
771g42M8k233K034J809l333Q01J708j238J246k05p23P52P02J233k316L14L212
$$ -742 -694 -2927 -893 916 -2417 -1616 92 -1146 100 -105 -828 -76 626 1859 -457 -143 3069
788C069k560n35K628k464P82J439k532J05Q49N3j003j480J891n32k026K490j526
$$ 3069 509 -26 2602 138 920 2359 -173 -68 781 834 -169 -1649 242 -290 -2316 174 -1352
805a352r36K780j823q93J781J1J52o70J033P79j179J453N84k547K147J208k281
$$ -1352 -2288 492 -1331 -2224 -443 -432 -280 -950 83 862 -317 1136 1720 -827 1320 2528 247
822B47M17R67o93r0n44R64j449j08J742k582m4J727j920M27N99j893R35J128q28
$$ 247 664 1631 938 848 304 1268 -181 -289 1453 -1129 -1173 554 -1366 -939 -340 -2233 -1298 -170 -998
841i98n26K66J958j072n68J677r80k69K791j511j372J968N01n19j261N45R51j032
$$ -998 -1524 -1258 700 -372 -940 737 -243 -512 2279 768 -604 1364 1865 1346 85 630 1581 549
859E49M80l11k202J875L87j762J90m66O56R87j603j026K67K161M54k883R40K132
$$ 549 1029 718 -1484 391 778 -984 -794 -1260 -604 383 -1220 -2246 -1979 182 636 -2247 -1307 825
877H25j042O57L92j856J390K112r84k020L60K645o79k066J384j192L26J562k209
$$ 825 -217 440 832 -1024 366 2478 1494 -526 -166 2479 1800 -266 1118 -74 252 1814 -395
894c95o92O98L34M78j168j504P92J751M48l153n66M513j137k345J715J83k54J010
$$ -395 -1087 -389 -55 423 -745 -2249 -1457 294 742 -2411 -2977 1536 399 -1946 -231 -48 -302 708
912G08O58j213j583K314K104k869o28J444L96J146k020k125K386J153j545j617
$$ 708 1366 153 -1430 884 2988 119 -509 935 1331 2477 457 -1668 718 1871 326 -1291
928a291p6J997q11j75l36j917J889J798k056q03P60K85K043n07k284n00L441K472
$$ -1291 -1367 630 -181 -356 -692 -2609 -720 1078 -978 -1781 -1021 -736 1307 800 -1484 -1984 1457 3929
946C929m780k091N257J006k996p47R25J103p49o63P63j547m11J882O05j976l010
$$ 3929 -851 -2942 2315 3321 325 -422 503 1606 857 194 957 -590 -1001 881 1486 -490 -3500
963c500J997N075m154m905M466L484k806l069K452K463k259M88J899k838O2L069
$$ -3500 -1503 3572 -582 -5487 -1021 2463 -343 -3412 -960 1503 -756 -268 1631 -1207 -1145 1924
979A924k69j225q95Q65K376p98k461j192L004L055n054k355M026R6j740K65r51
$$ 1924 1655 430 -465 400 2776 1978 -483 -1675 1329 4384 -670 -3025 1001 1097 -643 -378 -1329
996a329P73P91m95j167r59J830N14k96J347k794j504N773N25n779N90N771P73
$$ -1329 -556 235 -260 -1427 -2386 -556 -42 -338 1009 -1785 -3289 2484 3009 -2770 -2180 3591 4364
1013D364o322q12N772j261k211J914o7j558j73J212M66l031o81M008M11l262k876
$$ 4364 -1958 -2770 3002 1741 -470 1444 1377 -181 -354 858 1324 -1707 -2388 1620 2031 -1231 -4107
1030d107L191M325m520l331N151O98k653J69J241k26r42J774J309l329M26K981
$$ -4107 -916 3409 -1111 -4442 709 1407 -1246 -1077 164 -62 -1004 770 2079 -1250 -824 2157
1046B157l32j198j169N5K674m91j749q64R31K192j952k709K039R35q42o04q68
$$ 2157 1825 627 -542 -487 2187 1696 -53 -917 14 2206 254 -2455 -416 519 -323 -927 -1795
1063a795J346k42o28J835l47k155R08K321Q5l312M51N063q63m947J360K425l25
$$ -1795 -449 -691 -1319 516 169 -1986 -1078 1243 1328 -1984 -1533 3530 2667 -2280 -920 1505 1180
1080A180j340R14J869k294j291K341j155k377J376K654k83l572m37L081p72j813
$$ 1180 -160 754 2623 329 -962 1379 224 -2153 -777 1877 1594 -1978 -2415 666 -106 -1919
1096a919O55J493N62j451q62J155n89L74K500j511j198P94J248m50j604J253J824
$$ -1919 -1264 229 791 -660 -1522 -367 -956 -582 1918 407 -791 3 1251 801 -803 450 2274
1113B274j912M74N9j448L05J720l75k086m64K602p38k783K103J060j532j05N55
$$ 2274 362 836 895 -553 -248 1472 1097 -989 -1453 1149 411 -2372 -269 791 -741 -846 -291
1130b91l13q93O22K151j557j047J726K66m02m90n1J687k01j414Q24R03q77q60
$$ -291 -604 -1497 -875 1276 -281 -1328 398 664 262 -228 -279 1408 1207 -207 617 1520 643 -217
1148b17J342J92k201n7L076k661j563K430O28j952q64K261k18k319J326J904k761
$$ -217 1125 1317 -884 -941 2135 -526 -2089 341 969 -983 -1847 414 196 -2123 -797 1107 -1654
1165a654M11K187o79r24L27J197k32j177J171K53l67J05m96K51M69j158J226L74
$$ -1654 -1243 944 265 -659 -332 865 633 -544 627 880 513 618 122 373 842 -316 910 1284
1183A284j899J06J172o42j040K30J607p99j503J821q93j112R59J150o20o35P99
$$ 1284 -615 -509 663 21 -1019 -789 818 19 -1484 337 -556 -1668 -709 441 -179 -814 -15
1200a5J021j720k02J983j72p80L17K34L86j205J19J352j169n49R80J7q65p9Q18
$$ -15 1006 -714 -916 1067 895 115 432 666 1052 -153 -34 1318 149 -400 580 597 -268 -347 471
1219D71K26k152P84J617k072j06J333m04k91m62J043J44j254J179M72j60j97n27
$$ 471 697 -1455 -671 946 -1126 -1232 101 -303 -594 -1056 -13 131 -1123 56 528 368 171 -356
1237c56Q23L05j065J307K68j400N66M66k69q70q3J520j217j141J662l29j650J090
$$ -356 467 772 -293 1014 1282 -118 448 914 645 -225 -308 1212 -5 -1146 516 187 -1463 -373
1255c73L59o30l90L98J045j381RJ577q34l55P70j22N31m43k72J065o11m13O09
$$ -373 -14 -644 -1034 -636 409 -972 -963 614 -220 -575 195 73 604 161 -111 954 343 -70 539
1274E39J14j74o36P08Q48j839k7J348j142n90J125j37p07m39R91O9j318J002L42
$$ 539 653 479 -157 551 1399 -440 -467 881 -261 -851 274 137 -570 -1009 -18 51 -1267 -265 77
1293G7q42O48k5J29P2m98R72K56r47N09L15l29J52l70Q41n44p97J013Kq83K09
$$ 77 -765 -117 -142 -13 59 -439 533 789 -158 351 666 337 489 119 960 416 -381 632 634 -249 -40
1314d0N70o02o1k26L28q06k41J354r00m23O99Qk0R5J22M32k81K60l0j16K50j27
$$ -40 530 -72 -133 -359 -31 -837 -1078 276 -624 -1047 -348 -340 -360 -265 -143 289 8 268 238 122 372 245
1336B45J85M11q82K03P46n63o53P90N2l60l52K43L93j244O15K05r32J71L37N9
$$ 245 430 841 -41 162 908 345 -308 482 534 174 -178 65 458 -786 -171 34 -898 -727 -390 -331
1356c31K10n64M60M07n43L73m71O34O33q87J59L93k97O04J41r05K35K34K36p50
$$ -331 -121 -685 -225 182 -361 12 -459 175 808 -79 80 473 176 780 921 16 251 485 721 -29
1376b9l16P18k58l67M31n74J53M94n45p9k20J2K99o5k66K63j60N23j51l22P86
$$ -29 -345 373 115 -252 179 -395 -242 252 -293 -372 -592 -580 -281 -346 -612 -349 -509 14 -137 -459 327
1397C27j49Q7J82j74J18k38K86K45m04j30N58p28j13J13j74M66m27o13P43k36
$$ 327 178 265 447 273 391 153 439 684 280 150 708 -20 -133 -20 -194 272 -155 -768 -25 -261
1417b61L4l59k17J040n98KO51m26j27O10l58J53k96JR66l3n09l53M08M35l89o64
$$ -261 -227 -586 -803 237 -361 -359 292 -134 -261 349 -9 144 -152 -151 815 782 273 -80 328 763 374 -290
1439b90R26l48m56K04j55m9K10m05N58m72j88j00L61j7j61m16J203l89o70L67
$$ -290 636 288 -168 36 -119 -168 42 -363 195 -277 -465 -565 -204 -221 -382 -798 405 16 -654 -287
1459b87P80j87l09j01Q75o89L24j62p3L85r5l6M4k96q96J036M80j078m35N32N47
$$ -287 493 306 -3 -104 771 82 406 244 171 556 461 425 469 173 -723 313 793 -285 -720 -188 359
1480C59j061l57R54r0j28l1L7L05l71J86L78k08j29J92J78N77q76j27J193k01
$$ 359 -702 -1059 -105 -195 -323 -354 -317 -12 -383 -197 181 -27 -156 36 214 791 -85 -212 981 780
1500G80p10j82O68Q2n58l20L63K5j51j9m88M97j84k33N22Q2j061K75P40j12o80
$$ 780 70 -112 556 638 80 -240 123 148 -3 -22 -510 -13 -197 -430 92 174 -887 -612 128 16 -664
1521f64K12J334o25q83R08q6j06K20j52N46m85j58L02j55j4l76o7J098j003p13
$$ -664 -452 882 257 -626 282 196 90 310 158 704 219 61 363 208 194 -182 -249 849 -154 -867
1541h67J224j84j049M38M18J81m85L1M40p69p8Q19l91N2N24p46L90L87l70Q7L96
$$ -867 357 173 -876 -438 -20 161 -324 -293 147 -622 -700 119 -272 -220 304 -442 -52 335 -35 52 448
1562D48J15o61j18R24m64m52N02l00R1rn35oL78j72J04j77M43n30p06J269m0q38
$$ 448 563 -98 -216 708 244 -208 294 -6 85 76 -459 -465 -87 -259 -155 -332 111 -419 -1125 144 104 -734
1584g34O70L32n92j36N43M17o69J01O61n52J95K89k40M8n4l52O30k39m07K79k41
$$ -734 -64 268 -324 -460 83 500 -169 -68 593 41 236 525 285 333 279 -73 557 318 -89 190 -51
1605e1K66m06j45J75p3n3K42L9m37K30L85l71k43M22K36k63M9P7k20K58L17j95
$$ -51 215 -191 -336 -161 -234 -287 -45 -6 -443 -213 172 -199 -442 -20 216 -47 2 79 -141 117 434 239
1627B39M2l0K25j09m81K98Jk04K19l60O4j57J27%%l03K86J18k43q2P2L16l81k5
$$ 239 281 251 476 367 -114 184 185 -19 200 -160 -96 -253 -126 -126 -126 -429 -143 -25 -268 -350 -278 38 -343 -368
1651c68L75j24J54L74k92J74j56k22M75o0l49K61J42r3k49j08J69n31L50M04m62
$$ -368 7 -117 37 411 119 293 137 -85 390 330 -19 242 384 291 42 -66 103 -428 -78 326 -136
1672a36j14M5J71l13J84j00J57l20K46N2K8J81j31L5L46o38M97K8k92K96j07M7
$$ -136 -250 -205 -34 -347 -163 -263 -106 -426 -180 -128 -100 81 -50 -15 331 -307 190 218 -74 222 115 162
1694A62k52J80K45k60l24N90j9p63M63L4m39L7K08J18j97j92M23j92n3j9J98K15
$$ 162 -90 90 335 75 -249 341 322 -441 22 56 -383 -346 -138 -20 -217 -409 14 -178 -231 -250 -52 163
1716A63l51j1K32J5o9J01K39j51l8P7M98o75j9K43m0k59J77q3j62k98L98M8m49
$$ 163 -188 -199 33 48 -21 80 319 168 130 207 705 30 11 254 214 -45 132 49 -113 -411 -13 35 -414
1739d14j47N54k78M1OM9L04l53M92l21m7J91K44k63j20L3K54L0k68L57mk84q2
$$ -414 -561 -7 -285 -244 -238 -189 115 -238 254 -67 -114 77 321 58 -62 -29 225 255 -13 344 340 56 -26
1762b6K08p6Ml50M59n47L2O39l34m53L24j73J90l8p1J6J84n9K96k75J39m1N3J85
$$ -26 182 106 110 -240 219 -328 -296 343 9 -444 -120 -293 -103 -141 -212 -196 -12 -71 225 -50 89 48 101 286
1786B86m00M20L23n98l21M32J40k22j79K52J28m64J88J83l84K2q7L03j92l22L46
$$ 286 -114 306 629 31 -290 142 282 60 -119 133 261 -203 -15 168 -216 -194 -281 22 -170 -492 -146
1807a46J75n47M01j80j80O97l87L46l9L1j3Q2j70K97m8k73R7j06L58m29j66j3
$$ -146 29 -518 -117 -297 -477 220 -167 179 140 171 158 240 70 367 319 46 143 37 395 -34 -200 -213
1829b13L75l82K37N9J0j67q6J27m0j91M25m4j98l7j77L78l20L18J78k32J13O2
$$ -213 162 -220 17 76 86 -81 -167 -40 -80 -271 154 110 -88 -125 -302 76 -244 74 252 20 133 195
1851A95L0J09p3j05L28l85m60Q43k56l03K29k07R2j38jj41l83N17M1l01J65J11
$$ 195 225 334 261 156 484 99 -361 482 226 -77 152 -55 37 -101 -102 -243 -626 -109 -68 -369 -204 -93
1873i3j19M83l87L5R4k11K49k0J90M8j74P1j62q5M07o5l98J31N5j15o2j60L54
$$ -93 -212 271 -116 -81 13 -198 51 31 221 269 95 166 4 -81 326 261 -137 -6 49 -66 -128 -288 66
1896F6j32k80J46J02j88K97j85K25p5k34K96j11J85j61rK39p1l20N88j81j30o
$$ 66 -66 -346 -200 -98 -286 11 -174 51 -24 -258 38 -73 112 -49 -58 181 110 -210 378 197 67 61
1918F1k49O60l89o0J48J2l03R7o9R0N2k6m8j18K10j72n7k8j8j29M21N9k13N4L92
$$ 61 -188 472 83 23 171 183 -120 -23 -92 -2 50 24 -24 -142 68 -104 -161 -189 -207 -336 85 144 -69 -15 377
1943C77l00L2l00K53K65p5l7j07L4J56k88M0L5k7%qK1k78J20J31n8j20J31M9k11
$$ 377 77 109 -191 62 327 252 215 108 142 298 10 50 85 58 58 50 71 -207 -87 44 -14 -134 -3 46 -165
1968a65l9J11L20k06j72K55J15P2l04n7L89j44q3J92q6j20J3p2M09k75l42K29
$$ -165 -204 -93 227 21 -151 104 219 291 -13 -70 319 175 92 284 198 78 91 19 428 153 -189 40
1990D0j1r3j04q2K81j1L6pk62P1J64j35K1J77o5m1J71l32L45Kq5Jj19Q2J45l41
$$ 40 29 -64 -168 -250 31 20 56 49 -213 -142 22 -113 -92 85 20 -21 150 -182 163 165 80 81 -38 44 189 -152
2016a52L05k22K38o8l77L83k33p0lJ33n4J47o43Q55l95j58L05m6l5K54p6j35K3
$$ -152 153 -69 169 101 -276 107 -126 -196 -199 -66 -120 27 -616 239 -156 -314 -9 -55 -90 164 88 -47 -24
2039b4j92P8K34p3J40k03K48j03m59M02M00n94j0K57J66m63R3K23l15K05%l07
$$ -24 -216 -138 96 23 163 -40 208 105 -354 48 448 -146 -156 101 267 -196 -103 120 -195 10 10 -297
2061b97j08M92k09M6l4P5PN5j9P6j99J11L98m82K40K13l72J91k5l16J36K40k00
$$ -297 -405 87 -122 -76 -110 -35 -28 27 8 84 -115 -4 394 -88 152 365 -7 184 159 -157 -21 219 19
2084A9q3K14k24l46N51Lj27l25K53j7%o9L71j76k25M35q9l83L93k07K22j55j5
$$ 19 -64 150 -74 -420 131 134 7 -318 -65 -82 -82 -151 220 44 -181 254 165 -218 175 -32 190 35 20
2107B0J31j14rk22J99J5Mj03J79P3l41J27J57j7l2j28J96n06L97O4R7k69o9NJ7
$$ 20 151 37 28 -194 5 20 24 -79 100 173 -168 -41 116 99 67 -61 135 -371 26 90 187 -82 -151 -146 -129
2132a29J00k2p1K34o6o2J19k69L18k2p4j23l6K47k25n3m3O5O2j6K61m06j40M27
$$ -129 -29 -51 -122 112 46 -16 103 -166 152 130 56 -67 -103 144 -81 -134 -177 -112 -50 -66 195 -211 -351 76
2156G6l3p7p5j5K1j55o0N22j3l76K19n3QJ35j25K28l79J35K37o2j18n7R4j6J7
$$ 76 43 -34 -109 -124 -103 -258 -318 204 191 -185 34 -19 -11 124 -1 227 -152 -17 220 158 40 -17 77 61 78
2181G8l7k50L24k60J83Rl10M24j58J05M2j18J69k86r3J60k5J23m0q5J39j22J02
$$ 78 41 -209 115 -145 38 47 -263 161 3 108 150 32 201 -85 -178 -18 -43 80 40 -45 94 -28 74
2204G4J56m49K79K32K9l16j6J2l5l9o1J61k00O0J26m3o2r5J43o7J43M8r7j37o5
$$ 74 230 -219 60 292 321 5 -11 1 -34 -73 -134 27 -173 -113 13 -30 -92 -187 -44 -111 32 80 -17 -154 -219
2229b19M29k80n1J7K74j00j77M63l26J07k4r4k22L41l17L10k84k23M16n5l70K38
$$ -219 210 -70 -121 -104 170 70 -107 356 30 137 113 19 -203 138 -179 131 -153 -376 40 -15 -385 -147
2251a47j10J51q7P2J76k52J04K92l53L52m01L11K43j13m35J05J08k05K18O2k1
$$ -147 -257 -106 -193 -121 55 -197 -93 199 -154 198 -203 108 351 238 -197 -92 16 -189 29 91 70
2272G0k54J25M40n40p8K46n3J04p8o6J93l81J04L91n06K38K00k49J98l9l19L69
$$ 70 -184 -59 381 -159 -237 9 -44 60 -18 -84 109 -272 -168 223 -283 -45 155 -94 104 65 -254 115
2294A15j09J68J68l35L4K48N3k41k80O12l64k17K60ll38K56J40j76J8l23J73J54
$$ 115 6 174 342 7 41 289 342 101 -179 433 69 -148 112 109 -229 27 167 -9 9 -314 -141 13
2316A3k99K76j36J84k05K66N3j16R8l1r6J03j7m6M2L2J39k31O2R7j05j07K0L7
$$ 13 -286 -10 -146 38 -167 99 152 36 134 103 7 110 93 47 89 121 260 29 91 188 83 -24 -4 33
2340C3q9K3m3K68l3l57K30lj56J11q1P3J9l55K47K51j39j77L12j89J71l68M04
$$ 33 -56 -33 -76 192 159 -198 32 29 -127 -16 -97 -24 -5 -360 -113 138 -1 -178 134 -55 116 -252 152
2363A52N4q7J50k62J91j41n7o7Q1J44j7j98M0l07M8K19k63P1K70K8j5j84j54K57
$$ 152 206 119 269 7 198 57 0 -67 14 158 141 -57 -17 -324 -276 -57 -320 -249 21 49 34 -150 -304 -47
2387d7J44o6m8J9L6J98j77q5K05o4k03Q1no0k2J9K55k94j45M28N5n30K39k5J05
$$ -47 97 31 -17 2 38 236 59 -26 179 115 -88 -7 -12 -72 -94 -75 180 -114 -259 169 224 -306 -67 -92 13
2412A3o0P1m5P0O2k91J24K52k69KK73O8l7j62J65p7k99J30L2L8J57K6k52L0k58
$$ 13 -47 24 -21 49 111 -180 -56 196 -73 -71 202 270 233 71 236 159 -140 -10 22 60 217 243 -9 21 -237
2437b37K98k5o9j97p6L23K79l33l5O8k0J3r2R2j59L43l71J52m7K07l2j32J33k49
$$ -237 61 36 -33 -230 -306 17 296 -37 -72 -4 -24 -11 -103 -11 -170 173 -198 -46 -93 114 82 -50 83 -166
2461a66M17q7J7k19J30k8K9j80J24Q1k79J1J62k65J00R9K4L7j34k51K61o9L54
$$ -166 251 164 181 -38 92 64 93 -87 37 118 -161 -150 12 -253 -153 -54 -30 7 -127 -378 -117 -186 168
2484A68k50k3J00j82J81L69m18J56L56o13L84l85J26K46k05l9P4r7J75j4m31L93
$$ 168 -82 -105 -5 -187 -6 363 -55 101 457 -156 228 -157 -31 215 10 -29 45 -52 123 109 -322 71
2506G1j28l3J90j98P1k6r0J99j55R4L0j58J33J27l24N50l25M0J67k43o1L5q2J
$$ 71 -57 -90 100 -98 -27 -53 -143 56 -99 -5 25 -133 0 127 -197 353 28 68 235 -8 -69 -34 -116 -115
2530a15L84j61j47J62q9l88K01O6j92J9K4J25J96k74J7K67k11K57j31K74m26O3
$$ -115 269 108 -39 123 34 -354 -153 -87 -279 -260 -236 -111 85 -189 -172 95 -116 141 10 284 -142 -79
2552g9K45j21J54pJ4j90j51J75o1L1k01K43j93j14Q3R6j45N30l69j86K97j42j0
$$ -79 166 45 199 192 206 16 -135 40 -21 10 -191 52 -141 -255 -172 -76 -221 309 -60 -246 51 -91 -101
2575a01K28k74M75l21Q4j0k91K52Q3l4J13p7L6j07l9j04J29PO6j07L0J0j50J1
$$ -101 127 -147 328 7 91 81 -210 42 125 91 204 127 163 56 17 -87 42 49 115 8 38 48 -102 -91
2599i1Q9J46j35m8p4on7O9J02j36J68J04o6k6j17P1K11J00p4j7j32K71l53pK03
$$ -91 -2 144 9 -39 -113 -119 -176 -107 -5 -141 27 131 65 39 -78 -7 204 304 230 213 81 352 -1 -8 195
2624A95k12j57R9K60l70o5M27r4m19M54J74o83N54J0l07J88k18J87k67K25J86
$$ 195 -17 -174 -75 185 -185 -250 177 83 -336 118 292 -391 163 173 -134 54 -164 23 -244 -19 167
2645A67k99k2L11j27j62L62l18L67k00J22K6k29K25k02oL64o96L89j0k82j7M1
$$ 167 -132 -154 157 30 -132 230 -88 279 79 201 227 -2 223 21 15 379 -317 72 62 -220 -237 -196
2667a96J07k97K03K53j12j12J38K69l33J41m5J85j87k4M5j71J60M0k0o9N4J47
$$ -196 -89 -386 -183 70 -42 -154 -16 253 -80 61 16 201 14 -10 35 -136 24 64 44 -25 29 176
2689A76j98Kj51K91k44K4j72M9j0L3Q5o3J28n5K51j53j02R8K14k06Q8q0o0l4j21
$$ 176 -22 -20 -171 120 -124 -100 -272 -223 -233 -200 -115 -178 -50 -105 146 -7 -109 -11 203 -3 85 5 -55 -89 -210
2714b10L74l35M2K07J00M6l81J91J00j27j20K67k27K99k59K02l8j03j11k0J17
$$ -210 164 -171 -129 78 178 224 -157 34 134 7 -113 154 -73 226 -33 169 131 28 -83 -103 14
2735A4j26j2Q0R4k12L55j13k18J53K28j56PJ8j67L28k33L9K19l40J45L16p47K45
$$ 14 -112 -124 -44 50 -162 193 80 -138 15 243 87 94 112 -55 273 40 79 298 -42 103 419 -328 -83
2758h3J21j32l1k21K68Oj41K4j9P8q3l3K86M3L2j0r2O5J86k66J05j39L87j73k48
$$ -83 38 -94 -125 -346 -78 -72 -213 -189 -208 -130 -213 -246 40 83 115 105 13 78 264 -2 103 -36 351 178 -70
2783g0l8L02l74J9rj2R8L7J12J82m41J11n6j17Q6K3j1j08J10M44j51l44J84J0
$$ -70 -108 194 -180 -161 -170 -182 -84 -47 65 247 -194 -83 -139 -256 -170 -147 -158 -266 -156 288 137 -207 -23 -13
2807a3J02K4j59R7J59j98K5l5K9j24O1o0J62P2r4m4k3L9k9k01J7J28j07n3P6L0
$$ -13 89 113 -46 51 210 12 37 2 31 -93 -32 -92 70 142 48 4 -19 20 -9 -210 -193 -65 -172 -225 -149 -119
2833a19J93l17M23k69M8k4J2J38k4R2R2l25P2oK77j2m94L96J59k49p6k25L18j14
$$ -119 74 -243 180 -89 -41 -65 -53 85 61 153 245 -80 -8 -14 263 251 -243 153 312 63 -13 -238 80 -34
2857c4l01K95O2k15L31N6n51O08k79n5L81n0j61j01J6m7J15Q3K24o1k39J45o8
$$ -34 -335 -40 22 -193 138 194 -357 251 -28 -83 298 248 87 -14 2 -45 70 153 377 316 77 222 154
2880A54J03l4k43M8j81P0M0L9R9m2k95J55n5o3K61k52j80LM40K93l99J42kj80
$$ 154 257 223 -20 28 -153 -83 -43 -4 95 53 -242 -87 -142 -205 56 -196 -376 -373 67 360 -39 103 101 -79
2904g9R6j15M56k92q9MQ7k61J38K10l4J56l60j6K36k57l4J48lj03j36J53J44k94
$$ -79 17 -98 358 66 -23 -19 68 -193 -55 155 121 277 -83 -99 137 -120 -154 -6 -9 -112 -248 -95 49 -245
2928b45j3L48m03K80o8J19Q3k02J62l3j26J9K12l15L84k95K83r2k75K82P5m06
$$ -245 -258 90 -313 -33 -101 18 101 -101 61 28 -98 -79 133 -182 202 -93 190 98 -177 105 180 -226
2950b26M24N6k24j22K32k63M7j51J59j67lJ11N8J53r0Q9k66M66n51M25Q9l26J57
$$ -226 198 254 30 -92 140 -123 -76 -227 -68 -235 -238 -127 -69 84 -6 83 -183 283 -268 157 246 -80 77
2973G7Jo2k04K00M1J48Mn9l03K91N6l04K18p5p2P8k97M05k17l39O10k21N4j50
$$ 77 78 16 -188 12 53 201 205 146 -157 134 190 -114 104 29 -43 35 -262 143 -74 -413 197 -24 30 -120
2997a20r7j9K21J1J41L9j28J7J2J93j74j97K55j36M7j23L63k74k20L29j50J8r
$$ -120 -217 -236 -15 -4 137 176 48 65 77 270 96 -101 154 18 65 -58 305 31 -189 140 -10 8 -1
3020aM2k9m3Rl25O0K68O9m4k60N00l64j27L90q9l49N15K86n35J70k78L25j80P8
$$ -1 41 12 -31 -22 -347 -287 -19 50 6 -254 246 -118 -245 145 56 -293 222 508 -27 143 -135 190 10 88
3044H8K10n51K72n4j38j83N54m26P4p5K99k83J63J7o2m2M26k08j75K07M5m1o7
$$ 88 298 -253 19 -35 -173 -356 198 -228 -154 -229 70 -213 -50 -33 -95 -137 289 81 -94 113 158 117 50
3067E0J98k03K39j06q2m9K4j42j9K87N7n07M14q6k93R2j61K76m24M29j9j94l8
$$ 50 248 45 284 178 96 47 71 -71 -90 197 254 -253 161 75 -218 -126 -287 -11 -435 -6 -25 -219 -257
3090b57J48j55K10j61O1M25l62J0J27m4L50j82k84K35oP8j38j30L60q6l18O2o7
$$ -257 -109 -264 -54 -215 -154 271 -91 -81 46 2 352 170 -114 121 115 193 55 -75 285 199 -119 -57 -124
3113a24qK71l73N5L11l88J73j23O9Q1J09Qj01m0J85r5j25J84J55j07Jj45L64m
$$ -124 -132 139 -234 -179 132 -256 -83 -206 -137 -56 53 61 -40 -80 105 10 -115 69 224 117 118 -27 337 333
3137C33k74L18l01k39L57j68m1J44k29k4P2J21k44q1L12mQ1J9k04j0J78l26J06
$$ 333 59 377 76 -163 194 26 -15 129 -100 -124 -52 69 -175 -256 56 52 133 152 -52 -62 116 -210 -104
3160a04J12K8J1oP5Q4l8jQk68K22K01k36O2p4J19l03j24L61o9k35Q1J57l09J15
$$ -104 8 36 47 41 116 200 162 161 169 -99 123 324 88 150 76 195 -108 -232 129 60 -175 -94 63 -246 -131
3185a31J03K50j59j23r4j47K80P0l0P2N8r6J23j74N6J10l82N65l51N5j27K23l63
$$ -131 -28 222 63 -60 -154 -301 -21 49 19 91 149 53 176 2 58 168 -214 351 0 55 -72 151 -212
3208b12K68j77J98j61o8N3n2j05J51j05K38Mk12O5J47l49K96k80L13M3j94K00
$$ -212 56 -121 77 -84 -152 -99 -151 -256 -105 -210 28 32 -180 -115 32 -317 -21 -301 12 55 -139 61
3230F1j13J4Q9N8k23M41j66j31O6j34J1k9l0j49Q2j8O1r3K5j40L38K52l97J56
$$ 61 -52 -38 51 109 -114 327 161 30 96 -38 -27 -56 -86 -235 -153 -171 -110 -203 -178 -318 20 272 -125 31
3254C1LO6k72k4K61J77j10k51J81J14n8j69L24m7l78K46J22m44L85J6l71K12N0
$$ 31 34 100 -172 -196 65 242 132 -119 62 176 118 -51 273 226 -152 94 216 -228 157 173 -198 14 64
3277F4J43k0n97M95q8m14L34K32j93j55OO4J57K06k86N8K14l2k20J35p0O4k6j52
$$ 64 207 187 -410 85 -3 -417 -83 149 -44 -199 -193 -129 28 234 -52 6 220 188 -32 103 33 97 71 -81
3301h1M84p0l21o9K1k08L4J59j14J90M2P7k75O3m4O7P8j07J25q6R1J72K1J04k49
$$ -81 403 333 12 -57 -36 -244 -210 -51 -165 25 67 144 -131 -68 -112 -45 33 -74 51 -35 56 228 249 353 104
3326A04l4j77O2n0L69l84J94r3O6n8n7p4MP1K45m49pK68r6l9r8K29q3K52m7l31
$$ 104 70 -107 -45 -95 274 -110 84 -9 57 -1 -58 -132 -128 -57 188 -261 -268 0 -96 -135 -233 -4 -87 165 118 -213
3352b13J99K15l77L34r1j40K62j20j02J02l52M82j52m8o7J85m26L77j71J66q1
$$ -213 -14 201 -176 158 67 -73 189 69 -33 69 -283 199 47 -1 -68 117 -309 68 -103 63 -18
3373a8R8l04Q9l9J65l2k31M15j57nM9J39l65O2K17L4l2L69m23n3K91j34j31N9
$$ -18 80 -224 -135 -174 -9 -41 -272 143 -14 -19 30 169 -196 -134 83 117 85 454 31 -22 269 135 4 63
3397F3k9q0Q3K55J35n46qK7j95J72k32J08J58K43l15J00npM7j31j32L27j18K73
$$ 63 34 -46 37 292 427 -119 -127 -100 -295 -123 -355 -247 -89 154 -161 -61 -66 -73 -26 -157 -289 38 -80 193
3421A93n4J14m59Q6J44L0j60K90j24J45nk29K45k14R1J49j01k68L47l81K7J9m4
$$ 193 139 253 -206 -120 24 54 -106 184 60 205 200 -29 216 2 93 242 141 -127 220 -161 -134 -115 -159
3444a59Q0M4l0J8p8J21o6o1J65N7n7K8k15K09j8QM4jo0P1k68K75j27R0k03J14
$$ -159 -79 -35 -65 -47 -125 -4 -70 -131 34 91 34 62 -153 56 38 46 90 89 29 100 -168 107 -20 70 -133 -19
3470a9j50M5R6j7j31J9O8O1k39K56j25P7J65j15L38m52j3J93L05l34j10L5K40
$$ -19 -169 -124 -28 -45 -176 -157 -89 -28 -267 -11 -136 -59 106 -9 329 -123 -136 57 362 28 -82 -47 193
3493A93m37J75p0J37P7j51J51J03m06J24P4k49J26J40K9l27M2K06j72J28K34j89
$$ 193 -244 -69 -139 -2 75 -76 75 178 -228 -104 -30 -279 -153 -13 16 -311 -269 -63 -235 -107 127 -62
3515f2l04M42K5j28pJ62km5k11L46l19J2K96k16K07R4k46J16n0l11J01j39J07
$$ -62 -366 76 101 -27 -34 128 126 81 -130 216 -103 -91 205 -11 196 290 44 160 110 -201 -100 -239 -132
3538a32j67J88M7m6m2K01n0RpQ3j07j15O2K82j05N3J01l40L07l22J5k9L50k79
$$ -132 -299 -111 -64 -110 -152 49 -1 8 1 84 -23 -138 -76 206 101 154 255 -85 222 -100 -85 -114 236 -43
3562d3K18m64J90j19J31j7J42k78L4P4J56P9k72J20j82K47J21N9Pm0l19K96K72
$$ -43 175 -289 -99 -218 -87 -104 38 -240 -206 -132 24 103 -169 -49 -231 16 137 196 203 163 -156 140 412
3585D12m69l2J91R8k13J35j13J33j11j34l2m7m1K34m73O23qk75l9rJ18j18K44
$$ 412 -57 -89 102 200 -13 122 9 142 31 -103 -135 -182 -223 11 -462 161 153 -122 -161 -170 -52 -170 74
3608G4J54k25J44j22R7o6K26m4l06J76p4R6j52J89j23K4p9J80n5j21L9j00NK55
$$ 74 228 3 147 25 122 56 282 238 -68 108 34 130 -22 167 44 68 -11 169 114 -7 32 -68 -63 192
3632A92j96J04m55L23j78K16L45n11K57l06o9pJ55L14k30K54q9j79J13L5j03J69
$$ 192 -4 100 -355 -32 -210 6 351 -160 97 -209 -278 -285 -130 184 -46 208 119 -60 53 88 -15 154
$$ [...]
8191d8
##END NTUPLES=NMR FID
##END=
