##TITLE=1H_Pr 118
 CDCl3
 8 sc, 
 6.06.2022
##JCAMPDX= 6.0         $$ Bruker NMR JCAMP-DX V2.0
##DATA TYPE= NMR FID
##DATA CLASS= NTUPLES
##ORIGIN= UXNMR, Bruker Analytische Messtechnik GmbH
##OWNER= root
$$ XWIN-NMR		Version 3.5
$$ Mon Jun  6 16:23:41 2022 Russian Standard Time (UT+4h)  she@DPX200
##.OBSERVE FREQUENCY= 200.13135
##.OBSERVE NUCLEUS= ^1H
##.DELAY= (6, 6)
##.ACQUISITION MODE= SIMULTANEOUS
##.ACQUISITION SCHEME= undefined
##.AVERAGES= 8
##.DIGITISER RES= 18
##SPECTROMETER/DATA SYSTEM= spect
##.PULSE SEQUENCE= zg30
##.SOLVENT NAME= CDCl3
##.SHIFT REFERENCE= (INTERNAL, CDCl3, 0, 15.7039)
##AUDIT TRAIL= $$ (NUMBER, WHEN, WHO, WHERE, WHAT)
$$ ##TITLE= Audit trail, XWIN-NMR		Version 3.5
$$ ##JCAMPDX= 5.01
$$ ##ORIGIN= Bruker BioSpin GmbH
$$ ##OWNER= she
$$ F:/spectra/data/she/nmr/H-F/1/audita.txt
$$ ##AUDIT TRAIL=  $$ (NUMBER, WHEN, WHO, WHERE, WHAT)
(   1,<2022-06-06 16:22:18.89 +0400>,<she>,<DPX200>,
      <created by zg, POWCHK disabled, PULCHK disabled
       configuration hash MD5:
       00 E9 B6 7A A2 85 ED C7 34 08 36 98 17 FE 4E 26
       data hash MD5: 16K
       A2 0D A4 CD 98 AA 1A A9 1E A2 0E 6B 03 31 A1 E9>)
$$ ##END=
$$ 
$$ hash MD5
$$ 12 F7 8B AF F8 76 77 B0 65 C3 3B AA 7B 04 02 0A
##$RELAX= 
##$RELAX= 
##$RELAX= 
##$RELAX= 
##$RELAX= 
##$RELAX= 
$$ Bruker specific parameters
$$ --------------------------
##$DU= <F:/spectra>
##$EXPNO= 1
##$NAME= <H-F>
##$PROCNO= 1
##$TYPE= <nmr>
##$USER= <she>
##$AMP= (0..31)
100 100 100 100 100 100 100 100 100 100 100 100 100 100 100 100 100 100 
100 100 100 100 100 100 100 100 100 100 100 100 100 100 
##$AQSEQ= 0
##$AQ_mod= 1
##$AUNM= <au_zg>
##$AUTOPOS= <>
##$BF1= 200.13
##$BF2= 200.13
##$BF3= 200.13
##$BF4= 200.13
##$BF5= 200.13
##$BF6= 200.13
##$BF7= 200.13
##$BF8= 200.13
##$BYTORDA= 1
##$CFDGTYP= 0
##$CFRGTYP= 5
##$CHEMSTR= <none>
##$CNST= (0..31)
1 1 145 1 1 1 1 1 1 1 1 1 1 1 1 1 1 1 1 1 1 1 1 1 1 1 1 1 1 1 1 1 
##$CPDPRG= <>
##$CPDPRG1= <>
##$CPDPRG2= <>
##$CPDPRG3= <>
##$CPDPRG4= <mlev>
##$CPDPRG5= <mlev>
##$CPDPRG6= <mlev>
##$CPDPRG7= <mlev>
##$CPDPRG8= <mlev>
##$CPDPRGB= <>
##$CPDPRGT= <>
##$D= (0..31)
0 1.2 0 0 0 0 0 0 0 0.06 0 0.03 0 0 0 0 0.0002 0 0 0 0 0 0 0 0 0 0 0 0 
0 0 0 
##$DATE= 1654518138
##$DBL= (0..7)
120 120 120 120 120 120 120 120 
##$DBP= (0..7)
150 150 150 150 150 150 150 150 
##$DBP07= 0
##$DBPNAM0= <>
##$DBPNAM1= <>
##$DBPNAM2= <>
##$DBPNAM3= <>
##$DBPNAM4= <>
##$DBPNAM5= <>
##$DBPNAM6= <>
##$DBPNAM7= <>
##$DBPOAL= (0..7)
0.5 0.5 0.5 0.5 0.5 0.5 0.5 0.5 
##$DBPOFFS= (0..7)
0 0 0 0 0 0 0 0 
##$DE= 6
##$DECBNUC= <off>
##$DECIM= 32
##$DECNUC= <off>
##$DECSTAT= 4
##$DIGMOD= 1
##$DIGTYP= 9
##$DL= (0..7)
0 120 120 120 120 120 120 120 
##$DP= (0..7)
150 150 150 150 150 150 150 150 
##$DP07= 0
##$DPNAME0= <>
##$DPNAME1= <>
##$DPNAME2= <>
##$DPNAME3= <>
##$DPNAME4= <>
##$DPNAME5= <>
##$DPNAME6= <>
##$DPNAME7= <>
##$DPOAL= (0..7)
0.5 0.5 0.5 0.5 0.5 0.5 0.5 0.5 
##$DPOFFS= (0..7)
0 0 0 0 0 0 0 0 
##$DQDMODE= 0
##$DR= 18
##$DS= 0
##$DSLIST= <SSSSSSSSSSSSSSS>
$$ [...]
##$SUBNAM2= <"">
##$SUBNAM3= <"">
##$SUBNAM4= <"">
##$SUBNAM5= <"">
##$SUBNAM6= <"">
##$SUBNAM7= <"">
##$SUBNAM8= <"">
##$SUBNAM9= <"">
##$SW= 18.05172834244
##$SWIBOX= (0..15)
0 0 2 0 0 0 0 0 0 0 0 0 0 0 0 0 
##$SW_h= 3612.71676300578
##$TD= 16384
##$TD0= 1
##$TE= 0
##$TE2= 300
##$TE3= 300
##$TEG= 300
##$TL= (0..7)
0 120 120 120 120 120 120 120 
##$TP= (0..7)
150 150 150 150 150 150 150 150 
##$TP07= 0
##$TPNAME0= <>
##$TPNAME1= <>
##$TPNAME2= <>
##$TPNAME3= <>
##$TPNAME4= <>
##$TPNAME5= <>
##$TPNAME6= <>
##$TPNAME7= <>
##$TPOAL= (0..7)
0.5 0.5 0.5 0.5 0.5 0.5 0.5 0.5 
##$TPOFFS= (0..7)
0 0 0 0 0 0 0 0 
##$TUNHIN= 0
##$TUNHOUT= 0
##$TUNXOUT= 0
##$USERA1= <user>
##$USERA2= <user>
##$USERA3= <user>
##$USERA4= <user>
##$USERA5= <user>
##$V9= 5
##$VALIST= <valist>
##$VCLIST= <CCCCCCCCCCCCCCC>
##$VD= 0
##$VDLIST= <DDDDDDDDDDDDDDD>
##$VPLIST= <PPPPPPPPPPPPPPP>
##$VTLIST= <TTTTTTTTTTTTTTT>
##$WBST= 1024
##$WBSW= 4
##$XGAIN= (0..3)
0 0 0 0 
##$XL= 0
##$YL= 0
##$YMAX_a= 159311
##$YMIN_a= -239084
##$ZGOPTNS= <>
##$ZL1= 120
##$ZL2= 120
##$ZL3= 120
##$ZL4= 120
##$ABSF1= 10
##$ABSF2= 0
##$ABSG= 5
##$ABSL= 3
##$ALPHA= 0
##$AQORDER= 0
##$ASSFAC= 0
##$ASSFACI= 0
##$ASSFACX= 0
##$ASSWID= 0
##$AUNMP= <proc_1d>
##$AZFE= 0.1
##$AZFW= 0.1
##$BCFW= 1
##$BC_mod= 2
##$BYTORDP= 1
##$COROFFS= 0
##$CY= 11.3945322036743
##$DATMOD= 1
##$DC= 2
##$DFILT= <>
##$DTYPP= 0
##$F1P= 2.36226072786647
##$F2P= -0.459571619588291
##$FCOR= 0.5
##$FTSIZE= 0
##$FT_mod= 4
##$GAMMA= 1
##$GB= 0.15
##$INTBC= 1
##$INTSCL= 1
##$ISEN= 128
##$LB= 0.24
##$LEV0= 0
##$LPBIN= 0
##$MAXI= 10000
##$MC2= 0
##$MEAN= 0
##$ME_mod= 0
##$MI= 1.114404
##$NCOEF= 0
##$NC_proc= 0
##$NLEV= 6
##$NOISF1= 3.799351
##$NOISF2= 2.8
##$NSP= 1
##$NTH_PI= 0
##$NZP= 0
##$OFFSET= 15.70392
##$PC= 1
##$PHC0= -18032.67
##$PHC1= 8.200737
##$PH_mod= 1
##$PKNL= yes
##$PPARMOD= 0
##$PSCAL= 0
##$PSIGN= 0
##$REVERSE= no
##$SF= 200.130013532006
##$SI= 16384
##$SIGF1= 3
##$SIGF2= 2
##$SINO= 400
##$SIOLD= 16384
##$SREGLST= <1H.CDCl3>
##$SSB= 0
##$STSI= 0
##$STSR= 0
##$SW_p= 3612.71676300578
##$SYMM= 0
##$S_DEV= 0
##$TDeff= 0
##$TDoff= 0
##$TI= <>
##$TILT= no
##$TM1= 0
##$TM2= 0
##$TOPLEV= 0
##$USERP1= <user>
##$USERP2= <user>
##$USERP3= <user>
##$USERP4= <user>
##$USERP5= <user>
##$WDW= 1
##$XDIM= 8192
##$YMAX_p= 0
##$YMIN_p= 0
$$ End of Bruker specific parameters
$$ ---------------------------------
##NTUPLES= NMR FID
##VAR_NAME=  TIME,          FID/REAL,        FID/IMAG
##SYMBOL=    X,             R,               I
##VAR_TYPE=  INDEPENDENT,   DEPENDENT,       DEPENDENT
##VAR_FORM=  AFFN,          ASDF,            ASDF
##VAR_DIM=   8192,          8192,            8192
##UNITS=     SECONDS,       ARBITRARY UNITS, ARBITRARY UNITS
##FACTOR=    0.0002768,     1,               1
##FIRST=     0,             0,               0
##LAST=      2.2672688,     0,               0
##MIN=       0,             -239084,         0
##MAX=       2.2672688,     159311,          0
$$ Real data points
##PAGE= N=1
##DATA TABLE= (X++(R..R)), XYDATA
$$ [...]
1771C9m55L71KJ01L43o21P65K22j013J017o04r2M07o18O20k24o44R84l99m59R
1792b49k27N67k73m57Q08k53o89R72p47M63J57n90P33m69l60Q82j62K23K35m61
1812A03L03L6m75Q63p44l23R43q58L07N9q07J108j039J01O05p10O0P34q61M01
1832a94j76j8P40r80O01L38r07O89J70k08K31l38L91J15m56O35l19o18O42k75
1852F3J16K83j005Q94j76o65Q54p04j22M01m62K97m9n58J119o68k01O35j48L53
1872B57r5n93R17l08l61P67n95K22N8r8K58n66M4O59p75M9K28l90L60j04k74K80
1894f0q52N52N30n74J48J56l2M4l38O28k2n23N85J11m65N29k66P4M33r85Q06J26
1916F05q24M29j13oP1n20M06J28p37J008p78l82R53p32L29J31m89Q21m11j58N06
$$ y = [39, -416, -45, -43, 58, 401, -220, 545, 767, -246, 771, 167, 75, 482, -136, 484, 260, -384, 600, 201, -258, -249, -476, 91, -182, -639, 169, -84, -773, 199, -548, -85, 72, -518, 215, -254, -614, 268, 106, 329, 564, 103, 406, 442, -33, 830, 86, -237, 706, -152, 155, 214, -593, 515, -524, -423, 182, -528, -468, 266, -595, -194, -370, -388, 352, -628, -27, 311, -596, 93, 263, 55, 286, -52, 339, 454, -2, 633, 314, -304, 338, 63, 179, 462, -543, 351, 175, -490, 364, -340, -462, -61, -523, -226, -275, -833, 286, -382, -583, 52, -96, 257, 162, -431, 486, 178, -183, 584, -11, 211, 269, 171, 429, -137, -93, 566, -209, -160, 68, -322, 38, -66, -340, -60, -912, -360, 170, -404, -256, -100, -132, -88, -426, 202, 180, -343, 242, 353, -112, 417, 151, 225, 658, -327, 479, 605, -219, 210, 97, 91, 162, -358, 48, 176, -561, 447, -331, -713, 240, -492, -163, -32, -521, 300, -111, -269, 237]
1937B37n71L26M53o65N55k69J05O73j175N96J90o04M70k98k04N48o76K33K83q70
1957f63M04K1j61L34l81R2M33m98L01K32n66Q25m27k8N69p19J86O36o54K66k62
1978f0o5O14o02Q3M03p41L05p1J63K96j006M55K05j44p2k78J35M59m05O3N66p75
2000d72N10j7q0M79n21L14L70n97K10J70n16O36l94Q2K73m23n1N5l65J58K2k6
2022a83J59m91J36L32k40K12k81O8O24o22J66M12l43L76j10m64R27o04l00N98
2042C72l76L95j07J88j52p01R6N55n80R6J43j60L41o05K33M83o31L90O3l13N5
2063b15LP9N11p91M21P01o77N18m56k01P27n67K47M2n77N02k51l92N89l66J96
2084D3P0r34Q53m05l08J095n89l73O67l82r8m3o2P72j15l54O45o12M10K52l24
$$ y = [237, -334, -8, 445, -220, 335, 66, 171, 844, -331, 265, 455, -149, 321, 23, -181, 367, -309, -76, 207, -663, -259, -238, -399, -65, -446, -354, 79, -419, -118, 114, -452, 373, -54, -82, 487, -232, -46, 590, -64, 202, -60, -125, 489, -113, -30, 373, -368, -63, -134, 29, 325, -681, -226, -21, -165, -237, -515, -380, 79, -326, -263, 303, -472, 38, 21, -59, 420, -101, 213, 583, -14, 196, 366, -150, 486, 92, 174, 447, 24, -27, 28, -337, -179, -157, -183, -24, -515, -379, -47, -287, -75, -356, -288, 336, -286, -120, 292, -51, 325, 215, -249, 678, 74, -226, 372, -4, 391, 284, 472, 320, -381, -285, 270, -310, -214, -71, -231, 110, -495, -262, 221, -410, -20, 43, -270, -215, -212, -133, 378, -413, 8, 709, 32, 550, 94, -107, 620, 53, 300, 342, -235, 267, 16, -376, 213, -153, 43, 113, -821, 32, -373, -681, 414, -175, -548, 119, -263, -361, -404, -466, 306, 191, -163, 482, -130, 280, 532, 208]
2105B08O64p56l60Q04o10K36J94k13J44m76l02R87q44j38O58l19Q3k03N5OQ7k05
2127c00N33o26N45N7m54O48n93L82L19r43R40J73n54K02m3L7K1m79L69p7m97O17
2149B77j11m49J68PJ33J14p02O42p4n52N95J27j07L8l46L43kj34N43l52l85K69
2171D2l3N57n43k63R03m73n35O06m01R4k09K37K47p61R6N01m77j5N21m63M70q0
2193B1j60M76m49K60L43o66M24r2j15L7p7Q9N38p80L58o6j67L08n26p5M42m28
2215c05K87J27n35N28k29P2om12O12o3n46Q06k05l74O14k40L00l29k78R45p52
2236A7j54N94n80J24K09j90K99l91j63K14k06oK81l22K31m94L39J60j67RJ93k88
2258b91M93q3r6N15n49N6O09o90K68K14m39J09l52K59J44l21L8K72k72R1J5o3
$$ y = [208, 872, 116, -244, 560, -50, 186, 380, 167, 311, -165, -467, 520, -324, -462, 196, -123, -40, -243, -188, -182, -95, -300, 233, -393, 152, 209, -245, 403, -190, 192, 511, -432, 508, 681, 127, 329, 286, 323, 344, -135, 234, 157, -340, 277, 166, -283, -115, -108, 25, 139, -563, 79, 5, -547, 48, 175, 68, 106, -240, 103, 101, -33, 510, 158, -227, 42, 9, 566, 23, -240, 663, 190, -345, 261, -140, -46, -255, -18, 229, -532, -436, 65, -412, -427, 94, -369, 101, 21, -139, 337, -112, 148, 491, -175, 249, 157, 42, 79, 2, 91, 629, -151, 207, 141, -26, 282, -244, -319, 123, -305, -18, 109, -426, 102, -127, -55, -61, -473, 139, 76, -470, 336, 131, -243, 371, 131, 431, 102, -176, 769, 17, -137, 457, -123, 1, 210, 20, 319, -72, -235, -21, -227, -233, 48, -274, -43, -537, -198, -38, -205, -196, -3, -291, 202, 119, 23, 538, -11, 45, 654, -36, 232, 446, 7, 116, -236, 23, 167, -154, -116, 156, -116, -25, -10, -73]
2280g3O8k57R6j74j49O04k13k90M09l13L26K04o65P11k13j33N11m38J45K77k15
2301B18J94k09l71N96m23j72N08o82M99m57N2L46m31L98L05m71N9j1l07M78l52
2322b33P3M49m19Q2K73l04K99j38L22q2n24L67R1k02K76k87j75J60j35j37N94
2343C50o67L52k57k90K59J10J60k63j75M99j74KM07k33j99K33k99L91l32nQ74
2364G43k05n67M43m70K84j32k24K03j96K46N7m79K16L8l11M40n42r5N67m53K90
2385a47K18n58O91J65n85M71m53K0L78k66O56k70l42M75m01r6K21l85N90m65j48
2406b31M68j91m12M17k56K00J36m98J51J00q6j5p4O24n3k98K41j46L2K10l17K13
2428B15j11q4L34l82R8K08n87K11L51n00L43j09m2J70m21K87n1k42L00Q7k29K03
$$ y = [-73, -5, -262, -166, -340, -489, 115, -98, -388, 21, -292, 34, 238, -427, 284, 71, -62, 449, 11, 156, 433, 218, 412, 203, -168, 428, 5, -167, 341, -341, 158, -299, -247, 99, -332, 66, 371, -100, -41, -52, -359, 119, -233, -160, 289, -130, -48, 225, -79, 220, 82, 404, 322, -202, 165, 256, 54, 330, 43, -132, 28, -107, -244, 350, -317, 35, -222, -512, -253, -143, 17, -246, -421, 78, -96, -94, 313, 80, -119, 114, -185, 206, -126, -131, 743, 538, -29, 414, -56, 228, 96, -128, 75, -121, 125, 182, -297, -81, -43, -354, 86, -456, -551, 16, -437, -147, 71, -487, 204, 369, -216, 255, -198, -178, 200, -66, 590, 320, -22, 453, 52, -44, 177, -208, 382, -83, -231, 237, 46, -366, 51, -205, -5, 131, -367, -216, -116, -202, -217, -291, 333, 280, -18, 223, 77, 109, 319, 2, 215, 104, 20, 354, -28, 70, 278, -309, -98, 253, -247, 96, -13, -55, 115, -306, -19, -70, -312, -12, 75, -154, 49]
2450D9j2j6L03l33J47P7j76L62n37J9L05k85K27K32o35L59j3l56M08p4PK84p99
2473d57K76q5o0N14l90J70J44m25L38k19J77L78m20l6M53m05K75R1k62J33j6k6
2495A48K21m62JK42o5L0k74PK20l05L98k72m15L38j4r0J87j39R3l3j93K94J85
2518A02l65L31o7J14J09j48J66m6k10L38m11J84K92l29m9Q4l56M92m77J00K65
2539A19j91m4J22k15J53k55j00P77p51L90L12o16M71m12L13Q8k30Q0L08l54K70
2560B35j60j53N35n15oK81l56J0K17m38L41n62M15M5k47L90j63k56L31n4K6K03
2582A19j74j04L97l49K03J46k18K40k92J15J8k87P97o57K77J5m80J58r5J33PJ27
2604I6j85L03o52J35K17m6K75j90j00L53k04j99L42J4n7n9r1J52j62K5K33j29
$$ y = [49, 37, 21, 324, -9, 138, 215, 39, 401, -136, -117, 188, -97, 130, 362, -273, 86, 73, -283, 125, 51, 58, 342, -457, -181, -266, -326, 188, -202, -32, 112, -313, 25, -194, -17, 361, -59, -95, 358, -47, 228, 319, 57, 190, 174, 148, 369, -93, -92, 150, 85, 115, -159, -152, 68, -237, 161, -111, -526, -188, -202, -292, -105, -244, -151, -184, -377, -83, 102, -263, 68, 1, 115, 224, 76, 242, 196, -14, 324, -87, 97, 389, 60, 11, 95, -261, 231, -246, -146, 119, -72, -116, 6, -209, -56, -311, -411, 366, -385, 5, 317, -299, 172, -240, 73, 161, -69, 11, 319, -35, 235, 75, -78, 457, -58, -64, 217, -139, -129, 88, -350, -9, -571, -156, -111, -358, 32, -131, -387, -56, -110, -84, 119, -55, -159, 238, -111, 92, 238, 20, 260, -32, 83, 101, -186, 611, -46, 231, 246, -234, -76, -171, -38, -31, 96, -89, 214, -438, -303, -86, -132, 143, -47, -147, 206, 2, -197, 145, 159, 102, 43, -48, 104, -58, -33, 200, 71]
2626G1J00N3m03L61k59K15j63l64O48j49l10K67l16J24K21l34J83J65m59M57r9
2647Ik35M58l14K01J60m17L93J25l23L88k75M8k37J16j0o6k04K37k57J6m4k2J28
2670a25j45j38L62r3o4J46oK66j76j21N96o70m4M01j54M3K07m10K97q9j29L76
2692C30k62j03K17l38j35L97n57N02j42j4r7j07J97R9m65O25l76L47J69m47L15
2713A55R5m09N13k85J53K46k98J76o19J46K68j47mM6k12O43o09L2j2n2j7J34J6
2736d1k82L15l58M83r2k97L09J9l4Jm9L03n57J1N60m22J8K81j40O8J21k87Q5j6
2760aq9L45n17K54j50j94K96p4M3Q5l52K81J60k80J47Q3j55K75j98J83O1l23L04
2783A84j02j21J70j51j0J49l69M98l66k48M17p0k2k38J03J38rk88N82o69N4L72
$$ y = [71, 171, 224, -179, 182, -77, 138, -25, -389, 259, 110, -200, 67, -249, -125, 96, -238, -55, 110, -349, 108, 9, -226, 232, -82, 119, 279, -138, 255, 380, 57, 445, 170, 218, -19, 97, 87, 21, -183, 54, -203, -187, -231, -253, -125, -270, -408, -46, -139, -203, -57, -63, 203, 27, -94, 502, -168, -212, 189, 35, 78, 285, -125, 172, 83, -46, 330, 68, -35, 182, -156, -291, 106, -451, 51, -91, -105, -202, -309, -112, -13, -478, 147, -229, 118, 287, -160, 155, 250, -159, 354, 69, 222, 468, 170, 346, -273, -127, 141, -6, -10, 36, -176, 467, -142, -110, -122, -174, -191, -57, -41, -323, -8, -366, 117, 25, -272, 37, 56, 22, 23, -26, 277, -280, -269, 291, -131, -113, 168, 28, 96, 217, -70, 15, -1, -90, 255, -262, -8, -158, -352, -56, -130, -87, -2, -354, -73, 87, -193, -46, 37, -118, 157, -41, 142, 203, -120, 184, 82, -39, 131, -20, -30, 119, -250, 248, -118, -366, 51, -19, -41, -279, -176, -38, -47, -335, 247, -422, -368, 4]
2805Dq5O0Q2l42L24j34L4L19l48K21J85k17P3j14P2q0k11J36O4l76M39J21j87
2828D0n7L7j74K35k55q3K8K50j58K9K46Kk41L5K70k47J05M0O7q0k69L35k5k60
2852a30L68J2k22J11l26K11N2L7J80m78p4M24l62j94L34J6J03j46KJ62Q4l0k25
2875i1r5L24k48k0N47k84J31j08L3n4K0j50J20j00r8l2q4L55j94KN7l0j42M1J32
2900C2j63N5q6PJ84J78N7l44PK35p7J92l93J39M5j67J15j7n2J31p6k51M22k29
2924e6q5J80m12L85j01l60M10J58l86K56o6L94m68K3L21m44M44p1k40K85K3m45
2946b55O32n36K08J90m01J61K58l33Q8J27j27Q6l64J40k5J38k1R4l85J68K4K07
2968G4k3n0K44l19n3Q6M4J74K05l69J30K01l42Q5j02n8L68l37M9j38k01M35l73
$$ y = [4, -81, -21, 61, -281, 43, -91, -57, 262, -86, 135, 320, 103, 176, 62, 134, 54, -157, -21, 43, -333, 106, 227, 40, -17, 20, -154, 81, -174, -257, -229, 21, -137, -108, 138, 140, -101, -66, 204, -43, 62, 102, 169, 89, -180, 155, 130, -130, 238, 250, 28, 139, -187, 24, 76, 113, 293, -185, -259, 165, -197, -391, -57, -41, 62, -84, -82, 80, 164, 134, -91, -186, 138, -110, -130, 417, 133, 264, 156, 189, 135, 155, 5, 125, 25, -73, -105, -189, 166, -28, -26, 31, 1, -141, -100, 32, -131, -76, -162, -155, 29, 207, 264, -80, -73, 162, 85, 277, -116, 23, 68, -99, 16, -1, -53, 78, 2, -249, 173, -56, -141, 39, -373, 12, -89, -449, -39, 119, -267, -11, -77, 317, -151, -128, 193, -251, 193, 122, -118, 167, 190, -255, 377, -159, 49, 239, -162, -1, 257, -76, 12, 139, 12, 98, -266, -126, -151, -13, -34, 60, -325, -157, -133, 74, 51, 1, 245, -74, -127, -41, 3, 177, 382, 13, 143, 344, 2, 87, -15, -73, 295, -42, 7, -131, -332, 103, -270]
2991b70L31J3m49L35q4j15L16j30j12N37n08J28k3j62L23o2L03j29j18q8M15m77
3013b6K76o2k23n3j98K26J92j09l2N9k12L37l49LJ30m06N38r3k44J22k08L43K16
3036B27n33N48k3m12L70k70QR5J8K87r4k45L36l13k30L34j62m3J28j33R1k56J15
3059a57N40l06j45L93m71K48M8j77K52j19j10J61k13J46k0J35j14O5N6j22n9j13
3081h2J91j37Q4j68K96j98NK3J21m51O00k13m2m2j44J6K73m2M0j62m9K45j61k45
3105b42M43l7j38J17k74K18k22J52M80p65J60L6N8O5k94L86j11j08K05j9k66J25
3127c1J45j67J59j07j66L64m07L70k23J24LN4k53K82k36J75K1k02j85J01m4M27
3149B04m28K65k96P7J51k27l6M49k21J97j75l55N61m4n4P1j59R5J7j75L94m01
$$ y = [-270, 61, 74, -375, -40, -124, -239, 77, -53, -165, 372, -136, -8, -31, -193, 130, 68, 371, 242, 124, 36, 451, -26, 250, 188, -35, -88, -286, -60, 132, 23, -9, 50, -162, 175, -174, -171, -41, -447, 91, -2, -246, -124, -332, 11, 227, -306, 242, 219, -193, 177, -93, -85, 10, 28, 315, 221, -24, 312, -1, -231, 103, -59, -102, 26, -107, -16, -272, -157, 383, 77, -68, 325, -146, 102, 150, -27, 225, 106, -4, 157, -56, 90, 70, 205, 91, 156, 212, 90, 31, -82, 109, -28, 56, -112, 184, -14, -9, 14, 135, -316, 284, 71, 29, -13, -157, -141, 132, 90, 130, -32, -81, 164, 3, -242, 201, 164, 26, 143, -131, 87, -135, 17, 497, -268, -108, -72, -14, 51, -243, 143, 32, -76, 129, 110, -156, -31, 114, -53, 106, -1, -167, 197, -210, 160, -63, 61, 64, 118, -135, 147, -89, 86, 107, -95, -280, -179, -223, 204, -224, 41, -255, -178, -27, -254, -290, 159, -62, 135, -40, -395, 166, 122, 68, 139, -20, 75, 92, -83, 311, -90]
3171i0J72j00M4K4m6K5K28l41J0J23m9K1j4j44N2K91k26K35j55k59K36k68J02
3194a29K2K03J31k03j29K89m65K79P0%J24j76J34L0j79M9m8j31J44J00K9R4m20
3217a82K03K1k83O01l88P6K26j64r8o7qK05m4j2K7J05j38j5j77K27p9k33K47J22
3241A72l78N67k59J06k38j60K61j80j40M58l38k4K13j55K92k62m3L77k72j94N11
3262C14m81J56J76l8n1m1j5L10l16l1R3k79J14n8L18k86m0Q1q0J94r4K31k11q5
3286a19J00M2Pj8j57J94j29L16k39J93k49j06L63j48J04Kj70Q3J59j83J15m10
3308b50L63j10o2K94j15o7j08N4k00j69L13Q8J14j57J41j84K0K3k14L93q5k43
3330a61N21k98j06M9r6LL34r5J6k04j88K26r5J60j4j77o8K68j43o4J50k45L08
$$ y = [-90, 82, -18, 26, 50, 4, 29, 257, -84, -74, 49, 0, 21, 7, -137, -85, 206, -20, 215, 60, -199, 37, -231, -129, -107, 96, 227, 24, -105, 184, -281, -2, 68, 68, 192, 16, 150, 180, 1, 50, 2, -129, 15, 115, 144, 238, -182, 21, 42, -241, 360, -28, 48, 274, 110, 12, -55, -63, 142, 98, 86, 113, 218, 80, 65, -112, 115, 36, -197, 50, 172, -206, 361, 102, 208, -30, -190, 71, -109, -249, 209, -129, -153, 60, -95, 197, -65, -108, 269, -3, -197, 314, -167, -11, 165, 127, 76, 35, 20, 330, 14, -17, 76, -203, -89, -147, 171, -115, -155, -74, -154, 40, -54, 177, -34, -119, -19, 23, 30, 12, -145, 49, -80, 236, -3, 190, -59, -165, 198, 50, 154, 156, -14, 69, 228, 45, 160, -250, 113, 3, -59, 235, 120, 53, -55, -1, -201, -370, -57, 31, 145, -12, 129, -55, -35, -12, -226, 167, 82, -161, 360, 62, -44, 5, -91, -88, 246, 151, 167, -37, -225, 1, -94, 66, 52, -125, -193, 75, -68, -132, 18, -227, 81]
3353H1q2K5j44J6o5K04k43L88j45k7K52l34J77j43J98j7m3j53J43l79M65k85N2
3376e9J76j01l26L94k87L58j80n4J53m48K45J30k27L08Q4k14Q6O6j1p4R6%j93
3399g8j12L19J4j88K80k63n6L17l28J97j35P2J78l25k6R2K0J41%j87J29k62j18
3422c19L50q0M42k06k25K1N0J8J43k02Q3q2K6k30K92jK2m62M19m6j05L44j51k3
3446G8M1j71O5q2m9M3Q8q4N7k28M70j06k45M5l42N20J83k27q8K85m31K56J06j14
3470G0J29l68p8M6q6L36k38p2L39j7p0J97k90J74K26l82L6m0K59onj13J4j80K90
3495A71j3j66P3J0j59R6r5K64m6k47K45m20N15k26J06j64k5K86l0l36J87Nk52
3518b21K91j46J80Pm8K1P8p0k76K65l41M29m2k23QK21m61L31k65L22p0J70q5o9
$$ y = [81, -1, 24, -120, -104, -169, 35, -208, 180, 35, 8, 260, -74, 103, -40, 158, 141, 98, -55, 88, -291, 174, -111, -59, 117, 16, -310, 84, -203, 155, -25, -79, 74, -374, -129, 1, -226, 82, 166, -48, 38, 104, 93, 19, 115, 115, -78, -190, 129, 143, -45, 235, -28, -84, 233, -95, 102, -33, 39, 217, -108, -134, -42, -22, 119, 119, -68, 61, -201, -319, 31, -49, 393, 187, -38, -17, 33, 51, 194, -8, 75, -7, 19, -211, 81, 80, 102, -360, 59, 13, -92, 252, 101, 78, 119, -52, 13, -69, -118, -75, 13, -71, -14, -242, 228, 122, -123, -78, -420, 100, 283, 56, -32, 253, -178, 78, 184, 70, 199, -169, -247, -201, -287, 49, -189, -261, 78, 61, -9, 188, -102, 72, 298, -84, -48, -88, 171, 165, 160, 47, 61, -119, 171, 158, -8, 65, 75, -84, 12, -83, 181, 135, -112, 133, -287, 228, 2, 108, -56, -81, 205, 175, -161, 26, 31, -221, 70, -76, 104, 111, 63, 84, 162, 92, -184, 81, -260, 169, 127, -96, -88, 133, -328, 3, -262, 60, -10, 160, 75, 6]
3542Fj06m9j18J73pK43l6j20P2lM2l77L76k60M93m41J43Q9p8K15p0l23j67J13
3566a90J2J47Q5rqj05J85n5j13l0k7M1j29K27m8n3O9k3j11M38l10j25L80l66L53
3591B35j03j58L1M8L8R3j13j22K04j78J50r6q4j07K35j37j27J10J46j15j81M14
3613A83k00O7k4N0k8P1q6n3J63k60K37k67j55M71p5J26j30k53M4m5J07P0J3l1
3637eK01k07J30n53J11K85k03K25J07k08K15Q7k3J09j93l0r4j16N8L06n2O3j71
3660D2j16j40J75k75J41O3P0R9ol2p5p9R3rJ13l11M19l6l18R4NP1K42j9l28J08
3686in5J80k7j45L29m74J28L1j1J14J06l26O9Jj50M48l60K8K31k69L00j34j67
3709a62L24J09n21L05k8J47J3k61K42k29k3q5L62j95J9J05r4k0k87M66M7j29M
$$ y = [6, -100, -149, -267, -94, -101, 142, 106, -14, 58, 55, 97, -280, 96, -164, 329, -112, 31, 120, 42, 257, 187, -136, -303, -190, -178, -31, 54, 45, 37, -68, 117, 62, -51, -81, -108, -67, -196, 31, -17, -70, -1, -24, -135, 303, -7, -132, 248, -118, 235, 132, -26, 5, 53, 91, 184, 71, -51, 153, -25, 125, 29, -55, -162, 73, -64, -191, -81, 65, -50, -231, 183, -17, 50, 26, 76, 48, 119, 33, -20, 143, -117, 120, -147, -302, 169, 94, 220, 90, -163, -119, -164, -57, 13, 26, -5, 196, -11, 119, -434, -323, -38, -241, -16, 91, -117, 98, 185, 162, 271, 78, 48, -46, -162, -104, 202, 150, 213, 42, -74, -214, -39, -314, -173, -110, -40, 59, 53, 21, -54, -133, -40, -49, 64, -247, 172, 136, -182, -88, -83, -12, 230, 211, -117, -9, -64, 116, 89, -56, 273, -201, -73, -42, -53, 61, 167, -159, -90, -89, -239, 209, -151, -123, 108, -161, 139, 5, -162, 162, 271, -250, 55, 27, 174, 187, -74, 168, -61, -84, -169, 193, -2, 17, 122, 28, 8, -279, 187, 234, 105, 109]
3732A09l11K04o9kK4J15k35r6K52J99l08LL10j57l12O4O7J72L5l19K74o2pK58
3756B08j40j1k5o5L2m8j4k2n5J10mp1N4L9j11L39l02K51J45l71Q5R6j85J02rj68
3782a40L13k86K06k16O1MK48k00O4J8L06j16l72J01j03O1J85m12L01J97k40k6
3804d6M2k13J93L1J28j43j33O2p7L91k11J89k20l8K1qj31K23j01K2K04j38k90
3827b43K40K01l58J66k6J68j78j8nN8r8J47k92K29R2j93lM3K96l9j60j01J39R0
3851A55Pj17m71M56m0l18M91j01q8N1p4J3q9j32M30l7k89Q6n4J91k7J99k44j28
3875a30K53k2j54o7J7J22R4j76J05O9j53k9J72KR4j97j48J80r5m7L0o4J17kr8
3900a27l5J36M1j41R5K00j80j17J37q2J6q8L50k1k48J64jl9P1k97K9J70n4K15
$$ y = [109, -202, 2, -67, -69, -45, 70, -165, -261, -9, 190, -118, -115, 195, 38, -274, -210, -143, 29, 64, -255, 19, -43, -50, 208, 68, 57, 32, -33, -1, -49, -63, -85, -140, -30, -34, -105, -51, -12, -123, 216, -86, 165, 310, -61, 24, 120, -65, 37, 28, -140, 173, -113, 93, -123, -62, -58, 190, -10, 54, 72, 378, 262, -110, -9, -112, -51, 134, -278, 23, 220, -20, -46, -4, -217, -24, 7, 135, -8, -141, -79, -156, 235, 24, 213, -7, -45, -24, -32, -163, 60, -41, -19, 185, 47, -243, -3, 198, -160, 6, -20, 148, -30, -48, -53, 5, -93, 54, -238, -9, 83, -110, -113, -70, 226, 187, 27, -74, 65, 155, 162, 45, -426, 30, -10, -328, 163, 62, -26, 25, -49, -36, -125, -257, 173, 136, -153, -67, -121, 70, 43, 242, -2, -130, 123, 101, -53, -120, -103, 19, 113, -63, 42, 111, -42, -71, 101, 103, 197, 0, -148, 32, -63, -110, -80, -144, -27, -29, -127, -162, -26, 15, -126, -31, 169, -11, -128, 9, -73, -57, -145, 205, 184, -64, 100, 99, 60, 131, -166, -137, 33, -21, 194]
3924A94j63k90M51k02n6J02k79K05K21j86J9m2J00k78L67j19%j26J35jk09J72
3946A5J99m18J54K5q4K51j25Lp9k7O2J43j0J2m8j53L4k25L30j5n2J30r7J47n2
3971A20j25k8M00k21j03q0K96l83j5M89j44k14o3o1K22J2NO2l47l9J84l4J11J38
3995A82j38n0L0k20K46l02K02o8J98Q9k64r8L00N4k91K63O7j94J66k98K05O0M1
4018A80j22L6k09K28q8j67J33j38J20r3j47K28r8p2M98j98j77p6L04o9l45K03
4040f9J58j25L5p5O9J98k07O2P7k63J73k0m8J81rk04M1k9K10j87K8Mk27L81k36
4065h2J27N7P0k58j71L74m0o5q8K06N4l99J49RJ36n4N1mj87J25j12k14J96K06
4089H6j77P3K23j05P4n7k41L14Q6j96J72j21k38J12L0m4j96j7K50J21k93J08j49
$$ y = [194, 31, -259, 192, -10, -66, 36, -243, -38, 183, -3, 16, -26, 74, -204, 163, 44, 44, -82, 53, 52, -157, 15, 214, -204, -50, -25, -109, 142, 17, 20, -59, -86, -24, 119, 109, 121, 73, -80, -46, -271, 59, 44, -8, 122, 25, 172, 120, -5, -33, 367, 146, 43, -37, 259, -124, -139, 350, 206, -8, -71, -132, 90, 102, 107, 169, -178, -217, -33, -67, 44, 182, 44, -6, 24, -196, 50, -252, -50, -118, 80, 169, -95, -193, 107, 161, -130, 133, 200, 6, 172, -126, 79, 139, 180, 58, 94, -115, 113, 25, -142, -9, -147, -27, -120, -267, -39, -137, -209, 289, 91, -86, -162, 142, 73, -272, -69, 89, -36, -1, -76, -7, 191, -16, 46, 123, -140, 33, 13, -35, 146, 137, -67, -26, -55, 155, -32, -4, 0, -227, 154, -82, 45, 102, 172, -86, -257, 117, 77, 12, -76, 130, 184, -215, -66, -57, 79, 25, 76, 72, -115, 10, -102, -316, -120, 86, -91, -18, 205, 100, 174, 117, -124, 190, 276, 80, 252, 131, -107, 5, 35, -9, -205, -222, 28, 149, -144, -36, -185]
4112a85N30r8m92K43l2J08J82l76KL8KP8mq6K9J31k39J44k8J03k43M4l1L24r2
4137E2l2q6P0J55j49j64L48m8o0k34N8J97j34J77k89PN3K7KM6O4j01k61L55jJ17
4163A69r1k96J40J10K08l84J08l5J54p6m1K07K1p1o9M7l00L2L83k33J8J29j4r2
4187B4k8j90J73J03j67J31m1j57L9K20j91K7q8L49k50K58k0k69M9P5k9N8j76m
4211a04J24l1L9j42k69kM06j44m1J19l56N18j34JJ28m4M4k43m1M65j86k6l73M04
4235A12Lo8J26m82K97N3Q8k15J79k02p4L2L8R1k22K47K10l49J47M9o0j03R5J9
4259A1m7Q1k59J78j14K69k8l28K02L09j46n3l8l8N7J7j38J62q3J33j1m09K24J71
4283A22J02k26kj22L0J59j90j7K60P5k37PK23l35n1J44L35Q2l26k00L09j80J33
$$ y = [-185, 345, 247, -245, -2, -34, 74, 256, -120, -118, -80, -78, 0, -4, -90, -61, 70, -169, -25, -53, 50, -193, -149, -180, 144, 52, 20, -66, 4, 159, 10, -154, 194, 146, 86, -148, -90, 107, -27, 150, -139, -132, -79, -52, -50, -4, 60, -41, -302, 53, 52, 169, 78, -218, -78, 32, 240, -144, -36, -71, 83, 7, -34, 173, 194, 123, 54, 101, -199, -167, 216, -17, 1, 130, 116, 24, -4, -194, -21, 82, -85, 46, 5, -152, -113, 107, -84, -57, -145, 204, -46, 212, 192, -77, -28, 47, 18, 76, -100, -104, 20, -11, 28, -114, -383, -385, 21, -123, -164, -45, -401, 117, -17, -16, 112, 68, 112, -131, -172, 293, 107, 81, -292, 112, 115, 47, 173, -309, -12, 41, 129, -86, 93, -109, -183, -151, -113, -22, -244, 3, 213, -136, 11, 60, 0, -103, -8, 11, -36, 45, -214, -36, -150, 119, 91, -237, -35, 274, 128, 75, 37, -1, 56, 73, -65, 97, 14, 147, 136, -273, -49, 122, 224, -2, -4, -126, -96, 63, -127, -144, 116, 191, -46, -39, 184, -151, -202, -58, 277, 359, 33, -167, 142, -38, 95]
4306I5k06K45o3j23O5JQ1j56Q9K6o2j23J95p3P4j0j30J01j06K15j69L6N8j28N9
4331iJ03j08J67j75LJ13j75O8R5%J9p9L0Oj85J64q4J63r4J53m8j84M8N0L1r2Q8
4358F8j11K86j75p7J83j3j44K2O9Q8j85k2O0j26K60R2l87O4J60o7m8L8PJ86j28
4383A00j40J47l82M16l38M22j81j37m1K16k28K65j32L54l7k82Q7n9q1J95Q5k91
4405d2k15L26Q8m42L15Q3l8k92n4L73j47j35J41J21j9o%k08K43M2r1j56K12q1
4429A8N7o4l4k0L0r3J56j16K0O7m9J60pN5k28n7K88j85j4K02k99J09o1r5J02Q4
4455B6k52J95L68l05j24K11p6k24l2J1L09q2J5N6l54K71j89J67q1oM1j0R1q4O1
4480CJ9J21k83K61m5j78q7k9K85j46K00j53N0J00n8j30K28j72j34J8j21L61k7
$$ y = [95, -111, 134, 71, -52, 13, 14, 95, -61, 28, 54, -8, -131, 64, -9, 65, 55, -75, 26, -80, 135, -34, 2, 60, -68, -9, 94, -14, 153, -22, -19, 94, -81, -13, 82, 82, 101, 22, 52, 58, -127, 37, -47, 116, 22, 175, 127, -57, -9, 41, 72, -20, 68, -43, 243, 68, -9, 174, 161, 17, 39, 108, 196, 11, -11, 49, -77, 183, 275, -112, -48, 112, 45, -3, 35, 42, 228, 100, -40, 107, -275, 141, -197, 225, 44, -93, -134, 82, -146, 119, -13, 341, 304, 22, 109, 50, -31, 164, 249, -42, -257, 69, 157, -285, 30, 113, 75, -217, -271, 102, -45, -180, -39, 82, 63, 57, 57, -151, 92, 134, 43, -113, 99, 18, 75, 11, -23, -43, -13, -106, 50, -66, -46, 21, -28, 132, 125, 180, -48, -105, 183, -2, -16, 186, -113, -4, -65, -160, -58, 26, -226, -31, 337, 32, -92, 119, 43, -181, -213, -202, 107, 25, 40, 96, -258, 13, -176, -9, -90, -96, -55, -65, 26, -58, 3, 22, 143, -140, 121, 76, -102, -189, -218, 67, -79, 121, -32, 18, 118, 60, -70, 158, -14, -148, -130, -251, 110, 83]
4503H3j3j8j6P0l07M1k55L96j18J52k48L8J18O2j52J94j82j5J75j3o9o5J59P7
4527I4K4k04K39K9p9k12K24O3k73lJ7J72k28K65Q2j39j35J23l8J01k33J4J23J02
4551A28k30LJ13J18l1k10J76m9j7K1p2j51M08q7j10O3J5m3J00j21L2j58J93p8
4575A3k86K18M5k44N14j38l57J54p6J66o8J42J7m9n0K42n32Q5J79L6l6mP9j12
4599f2l6J21n1K66j70p8k8K61l17k0K11r5J59l48J24j55M8L15r4J40l55K96l10
4622a78R3K41k66K65k33j28L10k78K39J20p3q4RK4q6J24l16K91j91K33k86K77
4644A07n4j36M7P8M6J0k32PJ86pn1k00J64J99k82J9J82P0l07O3J21k27L65k14
4668d6K11m16J67J97k08O7K05k25k8n9J10J72M6j45k2J17l22n3K78Mp6j0J39k26
$$ y = [83, 70, 52, 36, 106, -201, -160, -415, -19, -137, 15, -233, -195, -77, -15, -167, 27, -155, -170, 5, -8, -77, -142, 17, 94, 118, -86, 153, 182, 103, -109, 115, 178, -95, -98, -81, 91, -137, 128, 210, 71, -64, 59, 21, 122, -111, -97, 26, 128, -102, -99, 14, 132, 101, -109, 67, 18, 1, 22, -50, -201, 207, 120, 10, 73, 88, 45, 145, 24, 56, -102, 91, 13, -273, -55, -10, -254, 260, 122, -235, -81, -157, 9, -59, 83, 100, 51, 1, 243, -289, -204, -25, 11, -25, -29, 50, -62, -98, 23, -28, 238, 68, -10, -38, 223, -94, -114, 97, 2, 161, -187, -63, -218, -170, 145, 51, 191, -164, 132, -178, -85, 156, -110, 155, -78, -206, 104, -174, 65, 185, 112, 28, 37, 61, -25, 99, -217, 74, -117, 116, -170, 107, 53, -83, -36, 42, 88, 98, -134, -127, 59, 52, 1, -199, -35, 164, -118, -99, 83, 153, -154, -91, 30, -197, 168, -46, 165, -251, -84, 113, -95, -28, 177, -48, -76, -135, -25, 147, 193, 48, 26, 143, -179, -232, 46, 50, -26, -36, 103, -123]
4692a23J02K18l67K60p4M9r0p4J0O3j17J07k78L43mk68L21P5l05K15P6k08P2r8
4716i5JJ78m9nJ9j19P0j68J19J65k84K56j03j43J28K45k03j77J82K32l86k1L55
4739A97k02k55J99l9j92O65l96q8r4K89m40N61j77j82K55j16J71k93K94k18Q4
4760B3n3K02m16N6K24nm3r9O8Q5p6R7O1r0J4qJ66k16j55K83r3l7K1P8Q4o2j76
4787f7J42pr2J84o5j54j14l3N02k68j64K66j90L35o31M56k3n8Q1P1j63P2o7n3
4811d0P9J00l32J66M1K84l54q8K43r7L7p4n3R8k28J93l1N1K3K47k93k3j77J99
4835b9J42k05J59J73m1j22QK0j86J05qm1L3K38k01k6N5j16kQ4J73q2k78J8K45
4860A16k34k21N60k67l3J50j50K44N6l49J58j48J24j27k4K58j55Q3r8K32j90J00
$$ y = [-123, -21, 197, -170, 90, 16, 65, -25, -99, -89, -26, -143, -36, -314, 29, 25, -243, 78, 153, -152, 63, 139, -69, 3, -95, -94, 84, 35, 30, 49, -70, 0, -168, -49, 116, -168, 88, -15, -158, -30, 215, 12, -165, 17, 249, -137, -158, 197, -5, -260, -61, -100, -292, 373, -23, -111, -205, 84, -356, 205, 28, -154, 101, -15, 156, -137, 157, -61, 23, -30, 172, -244, -188, 36, 31, -12, -111, -43, 42, -34, 63, 124, 34, 48, 40, 206, -10, -165, 118, 25, -12, 9, 87, 171, 109, -67, 75, 68, -24, 160, 95, -59, -173, -206, 296, 28, -136, 130, -60, 275, -356, 100, 77, 19, 100, 171, 8, 80, 13, -40, 39, 139, -193, -27, 14, 298, -56, -144, 99, 2, 39, -35, -88, 10, -218, -25, -56, -5, 18, 265, -28, -51, -228, -29, 113, -92, 67, 240, 199, 77, 85, 105, -81, 24, 16, -25, 8, 246, 45, 19, 74, -42, -44, 40, 213, 131, -147, -129, 116, -118, -339, 221, -46, -79, 71, -79, 165, 221, -128, 30, -118, 6, -121, -145, 113, -42, 41, -57, 175, -15, 85]
4882H5J00j23J29q2o2j12J56j25j22J10J40k6J40n77K34Q3k21M54o2m67K23K8
4904i7N5j90K77J16j75L8o1n4pL57q4J52m80P0J25J04oj10l8J85k91O7l1J29j85
4929a34m4J08Q9J18j67O4MM8j01k8K5J37k19L43j05n8k27L70j42k01J36K1O5k0
4953H2k14K57k76J96q9K65l61J16O2J1j4q3L04l52J80l77J54J40l4K26k8j93Q1
4976E3n3k72K14J48r5O9J22k24L38k48K11j78p9j77N9L9J75j17L4p6j2K06P4k44
5000c3L1j2j83L8J64Q0k45K71n1o9j10J64O4K4q4p3j23K23j62Q2k03J97K45k37
5024bK33k65R5P6j14k42J30o1J12m7J9k31M22j12N3q6l4J37r5L9k80J18J29O9
5048F3l08J83n6l4J18j92L83l09k6L4N5l8K1K96j51nl88P38l05K9M7k94J02R9
$$ y = [85, 185, 62, 191, 109, 47, -65, 91, -34, -156, -46, 94, 68, 208, -369, -135, -52, -273, 181, 119, -348, -125, -97, -42, -232, 45, 161, -14, 24, -37, -91, -98, 259, 175, 327, -153, -83, 42, 146, 140, 30, -8, 177, -114, -47, -78, 51, -134, -178, -70, 19, 137, -30, 34, 38, 86, -15, -43, -18, 119, -100, 243, 138, 80, -147, 223, 81, -120, 16, 37, 102, 82, -132, 125, -151, 45, -44, 221, -140, -24, 38, 49, 35, -48, 256, -96, 84, -293, -139, 1, -33, 193, 165, -28, 53, 0, -272, -58, 90, -5, 64, 186, -38, 300, 52, 263, 85, 6, -171, -112, -73, 102, -15, 19, -57, -69, 137, 211, -33, -2, -14, -197, -159, 5, 85, -160, 111, 60, -9, -119, 45, 109, 133, 49, -24, -147, 76, -86, -4, -207, -10, 235, -2, 231, -34, 61, 137, 23, -219, -89, -150, -38, -85, -66, -297, 125, 13, 66, -20, -54, 83, -12, 27, -253, -135, -6, 63, -245, -62, -118, -152, -34, -226, 157, -152, -178, -144, -89, -127, -106, 190, 39, 34, -354, 384, 79, 108, 155, -139, -37, 62]
5072F2j08j18L41N3j98J66j20J59k83oj53J6K07j45K36j70l9J78j10N2j94L52
5094A78j26j09J16j54Q0j99J75L42j89l12J79j50L15j07k31J20j09L05j61j41
5114a78K34j21j0J88K6l15J05J48j13m6K43k95L3k0J77lL4M7k13P6J05l25K17
5137fJ62j23NK8m0PK3j09K27j40J72k72mLk1lM6m9k0M9Qm4p3K83k40K25op9q6
5166g7J04j88L57k29p5J3O6k7j21M83k79K0O4j44K00J8j77K24j08j51P2M2j87
5189a00K1K68k43K49k14P1O6p3K0j0J35l83L36j51R8j78J49q0L3J48j42j96J87
5212A1k77M50k34J31k66K97k34K52j50j58J39rL37k82j76R3j82K96j73L22k84
5233i7O4J32J18l55N6L25m43L01J65l12Q1K81k52j23P7k49J80J59J74k99j25N
$$ y = [62, -46, -164, 177, 230, 32, 198, 78, 237, -46, -52, -205, -189, 18, -127, 109, -61, -100, 78, -32, 20, -174, 178, 52, -57, 59, -95, -15, -214, -39, 303, 114, -198, -19, -169, 146, 39, -192, -72, -181, 124, -37, -178, 56, -65, -75, 113, 139, -176, -71, 77, -36, -82, 161, -134, -101, -121, 56, 53, 87, 134, -79, -3, 102, -223, -6, 156, 33, 38, 66, 26, 33, 56, -53, 174, 34, 206, -66, -70, -67, -88, -91, -45, -94, -114, -65, -57, -101, -174, 109, -131, 94, 88, 9, -77, 27, -161, 196, -33, -108, -95, -29, -56, -177, 306, 27, 47, 111, -33, 167, 185, 8, 232, 124, -27, 45, 87, -100, -79, 189, -54, 195, -19, 52, 118, 45, 65, 55, 190, -193, 143, -8, 90, -88, 61, -19, 14, 162, 20, -176, 11, -266, 184, -50, 81, -185, 112, -122, 130, -20, -178, -39, -48, 289, 7, -169, -76, -258, 38, -135, 187, -97, -33, 99, 217, -138, -82, 243, -200, 101, 266, -46, 35, 316, 64, -59, 18, -231, -51, 108, 282, -17, -142, -137]
5255a37n7L68j63M6j93J19J07k2o4k59K40j20J5J57j91J56j63R7K49n5j23p9M6
5278b6k7p9K34L9j69r8L74l30R2J36j57j9o2n7R2J42j04J6j0K0j94N9K8J28q8
5303f0M48j84k00N5k10R1l3l6J85k70K12j90J82K4j86K28J25k70J89p8K9j15J95
5326A31m1Lj22N0j47M5M6o7P0J66j68r6L43l07J41k63J54N8J26o2J59j0j71l48
5350c10N05k39k35K24j9J44j27p7J23N3l51M12k5j04J0p3j62K44k0Q8j63P1m8
5373g9J6J74j44j7K7J2K00qj39R8k5j6p4n4j90J75P3K19k89k78K41J33q3kk51
5398b81M10k14J42L8k49J43o2O8Q4kk28K82l80J40J22l9Q1M2j94m7M25l92O6k7
5422g2NJ48J03Pr2j48j08J04K52N0k95J52R5o04P45m07J11k11M3J30J9k44L0K36
$$ y = [-137, -194, 174, 11, 57, -136, -17, 90, 68, 4, -255, -15, -135, -120, 37, -154, 2, -161, -64, 185, 130, 7, -72, -26, -53, -132, 102, 141, -28, -126, 248, -82, 10, 146, -11, -30, -92, -149, -57, 85, -19, -3, -13, 7, -187, -128, -100, 28, -60, 388, 204, 4, 59, -151, -60, -93, -129, 56, -214, -2, -192, -10, 14, -172, 56, 181, -89, 100, 22, 51, -64, 131, 90, 93, -29, 21, -126, -81, -35, -102, -32, 134, -34, -130, 213, -94, 47, -216, -62, -4, 122, 60, 219, 209, 38, -310, 195, -44, -279, -55, -74, 70, -57, -134, -11, 42, -309, 103, 78, -26, -16, -89, -251, -7, -27, 61, -102, -31, -79, -63, 111, -33, -50, -23, -11, 189, 181, 42, 140, 115, 99, 25, -29, -219, -44, 29, 248, -41, -319, -78, 55, -28, -30, -281, 129, -85, 57, 95, -154, -11, -73, -5, 79, 77, -151, 131, -249, -109, 13, -26, 55, 97, -97, -144, 281, -111, -45, -72, -67, 81, 184, 191, 99, -49, -157, -53, 199, 249, -46, 106, 201, -403, 342, -65, 46, -165, -122, 8, 27, -217, -187, 49]
5446D9r0j16K57M7j57j39L31K8l0j34j27m1L21k04k01K54j72Q3k4K40j92l3K42
5469A92l62k6K54o4j25K05K46j29j9k1L2p4m3L9l47j34M48j09oK14P8l62J8J21
5493B6J0J67k38J57m4rR9K8l82J75j8j65M1K17P2J64l24n4QJ01j1J1j64J46o7
5518e4j03J0r7L45M8m40K65k29jK67K1Mj80K4J71J50j25l29K45j1j31j11L98r7
5542D0q3J43n6n0J56k06K93p3k16J38O4k69J41L0l91L70R0r1k59L45N3k25J70
5565A14j53P5J07j71j05q9R2J08R2j13J29pJ55q8k11J08k98J54J56M3k86M11o5
5588A58k04J38l35K17JJ60j83j74J82N5J4K4k66J57R6j20j9n3J34k67K85Q5k66
5611a81Q7K91l3j03J15o9l78K28J62j46J08j13q4J86j26R5j24K24K8k46N2J37
$$ y = [49, -41, -157, 100, 147, -10, -149, 182, 210, 180, 46, -81, -122, 199, -5, -206, 48, -124, -41, -65, 175, -17, -50, 192, -170, -196, 58, -6, -131, 74, 320, 191, 172, 151, 183, 109, 66, 105, -242, -376, 72, -37, -43, 171, 249, -113, -95, 26, 36, 203, -35, 122, 78, 69, 168, 196, -186, -11, -29, -194, -153, 64, 136, 300, -24, -78, -70, 31, 20, 31, -133, 13, -54, -157, -147, -244, 101, 149, -291, -26, -255, -256, 11, 32, 36, -144, -120, 51, 201, 76, -253, -8, -19, -150, -261, 137, 40, -43, 100, 44, -6, 150, -56, 237, 164, -52, 86, 150, -119, 22, 52, -339, 31, 121, 30, -229, 116, 169, -56, 114, -39, 36, 143, -28, -133, -222, -130, -22, 70, -43, 86, 79, 234, 146, -65, 43, -255, -101, 55, 98, -188, 223, 158, -46, 92, -243, -26, -25, 135, -48, -222, -40, 15, 29, 53, -213, -56, 40, -80, -99, -152, -18, -285, 0, 85, -181, -94, 197, 164, 61, 176, 107, -271, -43, 119, -27, 81, -32, -116, 70, -56, 39, -85, 139, 167, -79, -27, 110]
5633A10J4j55J81k12J37j48%K56j26j0j49J17J46j99r0J38j86Q9J00M3m5KJ10
5656A23p5m3O3j68J75l3j58J91q6R6j23J28k93K2K30k93L89M6j66J56j47Rj60
5679a17K1P1m2J00j53K37n0l11LJ71j47K50p9J25j38J58j39L56m91N2K00OJ54
5702B37k19j74K07P5p0J16j66J0j74K03j8J99j2j00m2M4j79K2P6j94J83j28J62
5725E8p0Q2P1k31K46o5Pl7K3P3j75j50K55J37N8k57K5k24M1K26j97OJ67j10P9
5750C8l6J75j81NQL3J02l52K25J9P5j00j08R9n2R8J78l93J82L8L6K4K03n28M22
5775B10j60O4j46r2L43l82K43l1m8J1P7j31K09l46L28m21K44O4j46R4J7m6J0J80
5799A45o8j87L15m8K5k58K77j2l29J64R2j10j48j30K22K22l08Q2O6j19M1P7k9
$$ y = [110, 124, -31, 150, -62, 75, -73, -73, 183, 57, 47, -102, 15, 161, -38, -128, 10, -176, -87, 13, 56, 11, 13, 123, 48, 5, 68, -100, 75, 42, -116, 75, -11, 85, -38, 90, -203, -181, 49, -244, 145, 191, 25, 181, 34, 43, -117, -96, -25, -67, 33, -120, 117, 67, -244, -241, -70, -217, 33, -46, 79, -59, 99, -40, 316, -175, -123, 77, 83, 237, 18, -156, 51, 126, 56, 172, 6, 16, -158, 45, 27, 226, 214, 114, 72, 116, -63, -41, 35, -159, 24, -104, 58, -12, 70, 141, -90, 156, 91, 98, 61, 84, 157, -18, -168, 87, 224, 282, 25, 50, -174, -133, 93, -104, -98, 69, -41, 38, 2, 177, -4, 1, 9, 42, 144, -208, 17, 36, 111, 11, -97, 2, -50, 48, 226, -167, 15, 53, 89, 113, 316, -212, 210, 50, 114, -32, -124, 219, -163, 80, 49, 1, 12, 89, -42, 167, -179, 149, -272, -28, 36, -110, -16, 1, -45, -35, 145, 77, -110, 205, 157, 182, -76, 201, 189, -140, 24, 116, 6, -142, -272, -50, 172, -136, -54, 12, -107, -66, 11, -18]
5822a8q0q8L16k18N0M8J40k25p3K50J09l66K72q0N4l01K56J39q7j83n2k5K82l55
5846b35K36j07Q9j49K16J04j16p0J74j88K14j80k17J54l6J61q8L48l98J22l2J53
5868A55k06J97j90n5R9J35O5l4k04J2K1j52qL94l38J26Mn4k35L62j20J00M8q4
5892C8J9O1k78K07l73N01j59j05J80p7k8J3j29P2J74p0n5N0l86N54k07J57n2m23
5916c16N02O3k58J03l8j14J30l72M66j26NQ9j33J11Kk68J33N3j02J6m6J23q6J90
5940A27J0j20j71M03j96l54K95%j1j40Q5R1k5j09K63j87J8Q5j34JL54l71j60L51
5964A05k11J8J08k47L96l58J48L2j3J06k60K87q5J9j1j0j01J05j0O9J5k89oK91
5988I8O0j99k8K58j0j93k1jJ78o6N5k07l2K8l27N43k88K66l8j55j8kK69po0nl8
$$ y = [-18, -98, -186, 130, -88, -38, 10, 150, -75, -148, 102, 211, -155, 117, 37, 91, -210, 46, 185, 98, -85, -137, -162, 120, -235, 1, -106, -17, -166, 50, 154, 38, -32, 142, -46, 168, -12, -229, -75, -111, 50, -38, 310, -88, 34, 2, 155, -51, 146, -44, -99, 0, 135, 200, 166, -38, -26, -5, -157, -165, 229, -109, 17, 21, -33, -268, 94, -26, 74, 122, 38, 57, 118, -160, 47, -326, 175, 16, -89, 91, 14, -14, -1, -130, -58, 116, 46, -9, 41, -345, 209, 2, 159, 107, -316, 186, 249, -9, 94, 56, -58, 72, -300, 166, 40, 45, 134, 1, 112, 114, -154, -21, 32, -70, -54, -100, 23, -63, 127, 137, 17, -154, 249, 53, -301, -6, -6, -17, -157, -72, 19, -6, -115, 148, -39, -21, 64, -70, -69, 285, -86, -246, 105, -106, -88, 20, -227, 169, -189, -41, -9, -22, 84, -176, 111, 26, 45, 34, 24, -77, 28, 18, 87, 102, -187, -193, 98, 158, -41, -69, 189, 179, -14, -35, -36, 142, 76, 131, -76, -108, -80, -407, 136, -152, 114, 76, -79, -97, -99, 170, 163, 103, 98, 60]
6015F0j72K37k10o3K53k59J75j08L03j39J56m15LJ93j93L02k30K30j31L37l16
6036A3N6lj68J25M0j94L03P9m25l1N5K28n4O1l78L23J80m12K06r4O9l4N9J05L5
6061A44p3j65J89j29J35r9k4J7nk04L50q2j36J94o5j95K23k20J9m8K40j94P2J40
6085H4j49O5k66M51Ql38L22j00rm4l61N1L07q4j66M51j83O8k81Q3K11l52K12P0
6109E0rK8k01Lj09L86j48J71l63Q0J78j45N6L2j12J02j25J11L93n01J31k2J09
6132I5L2l45L05m5j23Rk65J43L73j49n6j80J28M1jK33J53o78M03j6m0j89K18J60
6156B06j17l2K31k14j22J79q9K9J51n5r7r5k21J86K40L0k28j36p9L85k3n0j31
6179e2J65r6j3j22J00m1J49k07J99j49k7P4K37j92m6r6J05J76p7K17m60J88J65
$$ y = [60, -112, 125, -85, -148, 105, -154, 21, -87, 216, 77, 233, -182, -179, 14, -179, 123, -107, 123, -8, 329, 13, 69, 66, -102, 23, 63, -131, 172, 251, -174, -205, -150, 78, 24, 85, -293, 30, 210, -202, 4, -90, -21, -55, 4, 109, 144, 71, -94, 95, -34, 101, 2, -22, -5, -10, -214, 136, 54, -82, 112, 47, -148, 75, -145, -126, -174, 66, -128, -56, 84, -65, 0, -266, 185, 193, -145, 177, 77, 68, 24, -337, -286, 21, -63, -229, 222, 39, 107, -174, -91, 120, -232, -20, 50, 41, 69, -132, -129, -238, 148, 0, 171, -192, -112, 66, -79, -23, 9, -103, -1, -126, -15, 378, -123, 8, -14, 95, 127, -218, 87, 42, -81, -72, -337, -194, 179, 30, -26, -206, -78, -37, -38, 195, 348, -330, 73, 57, 17, -172, 46, 206, 89, 57, 288, 74, -48, 131, 42, 71, 222, 167, 70, -25, -246, -60, 180, 210, -18, -154, -233, 152, 129, 79, -52, 113, 17, 4, -118, -18, -59, 90, -117, 82, -67, -94, -20, 217, 25, -21, -117, -12, 164, 87, 304, -156, 32, 197]
6202A97o8m2m4j50J42j04J06J00j04R0k11L03k84n6K22K0q4J01M9k30o3kJ48K8
6226F4q0%K8O6j26K65j87j78L68j44q3k27L21j72j0j43J47J36M6Qj66j02J34j69
6250b04J5M41l73l6J32n3J04j54r9K17k17K81J64j82J33j5j25j25J59J00j59K80
6272B84l58J47%Qk9J22Kk37P6n8l4M0n4J7L76j86j26r8j03L18l32N11k13l41J89
6297g9j0K29j72J47K5j09j7K02l03K76k22l71L16L20n99K43O2O0J17k9Q9m7j05
6320B3K0j14K01l7n0J0K49j10j84K4q1L03l12N9r9J55j36J00m2p0J57j29k07M42
6344A72l18J16o6L01j76n3K03l49L62j26J17j09m5r2j11K41Q0k73m8K67j37J08
6366F4o9r1J36JK79k60J0j58K29j61N6k4j15L30j07R1k34O7l0j54J22KJ3k42J83
$$ y = [197, 129, 87, 43, -107, 35, -69, 37, 137, 33, 123, -88, 215, -69, -125, 97, 117, 33, 134, 183, -47, -110, -112, 36, 64, -16, -16, 12, 78, -48, 217, 30, -148, 220, 76, -7, -234, 87, -85, -95, -238, -91, 45, 91, 99, -67, -169, -35, -204, -189, 252, -121, -157, -25, -78, 26, -128, -227, -10, -227, 54, 218, 36, 169, 154, 29, -96, 63, 163, 4, 284, -74, 73, 73, 81, 52, 174, 176, -61, 15, -43, -77, -37, -91, -74, 302, 116, -10, -108, -211, 107, -225, 286, 73, -268, -79, -89, 140, -32, 115, 140, 31, 14, 216, -87, 189, -33, -404, -88, 232, -367, -124, -62, -2, 115, 86, 175, 128, 23, 43, -71, 130, 93, 43, 53, 302, 192, 8, 32, -49, 254, -58, 1, -98, 57, -79, 21, -21, -91, 66, -63, -270, 172, -146, -30, -96, 205, 29, -24, 179, -170, 192, 66, 183, 74, 29, -63, -174, 67, 147, -126, -174, 93, -44, 64, -5, -96, 40, 41, 320, 60, 70, -88, 141, -20, 36, 12, -103, 227, 120, 211, -23, 44, 14, -140, -18, -16, -3, -245, -62]
6391f2J30m1J54j90q5j56J07J17K14l32J48P0j21M9P4Q2j81J45r5k55K35P2L39
6414D18o24J73J17p2Q2l4N6m43L61k52K86K65m17J81M5O8k39O2J5rr5J16k30Q
6438a62M01j86j46N7K5K2k7L5K60j31j59J49k23K26j00p4n5j4K93k13N9P9L5l40
6462a89R8K77m37K74PJ32k38J07kr1J1J2L6J68O1j64LQ9k79R2p7p1L48j16l62
6487c11M11j30L3R1j21K53j71K29p3j36j04J21r3qJ48j88l7O6Q8p2K3L2j19p2
6511a40L11k22J9j73L50ol3rj24o3P3J31k96J51J05j40J89J2l3J9j92J15K8L7
6535A09N6k82L64j33k67L04j46P9lnJ11l8j64J02j08M3k6j17K2K87m69L11m4J6
6559BJ09n0k91K02p9J54Q3j86J32j12k2k4K63q3j34j22K52R4l87J54n3M8j70M9
$$ y = [-62, 68, 27, 181, -9, -94, -250, -143, -26, 188, -144, 4, 74, -47, 2, 76, 158, -23, 122, 27, -228, 7, 79, 418, -206, -33, 84, 12, 94, 60, 116, -327, 34, -218, 68, 333, -84, 97, 142, 210, -29, 33, 48, 39, -56, 60, -170, -162, 239, 53, -93, -36, -11, 11, -16, 19, 279, 148, -11, 138, -85, 141, 41, -33, -88, -102, 191, -22, 37, 116, 151, -189, -91, 186, -251, 23, 30, 162, -76, 31, 29, -62, -51, -39, -3, 165, 226, 62, 65, 154, -125, -33, -110, -181, 167, 51, -311, 100, -30, 3, 94, -27, 226, 55, 284, 211, 75, -29, 92, -1, -9, 139, -49, -86, -20, 68, -4, 19, 51, -68, -140, 171, -51, -32, -205, 145, 139, 106, 97, -27, -90, -17, 114, -182, -31, 74, -66, 123, 135, 102, 121, -71, 44, 72, 109, 165, -117, 247, 114, -153, 151, 5, 84, 81, 76, 187, 149, -15, 87, -21, 22, -4, -121, -99, 188, -281, 30, -14, 2, 111, 61, -230, -28, -107, 47, 130, -56, 76, -36, -58, -82, 181, 98, -36, -158, 94, 188, -199, -45, -98, -50, -220, -171]
6583a71J01J71k49K88q1L5k3k32J46LJ59j84L57l78J08q0r2j59K00J58Q2j05K70
6606C24m56R0J09l13J38L75l50r3l3M17j27j86p1K30N2n6P9J2p9j4L1j33m5K84
6630A85K14m45O5p6j46K07j41L12j49j60K51k53K03j01p2J39R4Q4k43j51K65K1
6652A03j42J18j61M7o3n1M76k50j07j10P3L8k32R3K55O5j57J48r0l7p7j57J64
6675e4J59r3P4j20J35J44j74K5j78n8N0J62l8Kk41L16M4n5j07Q1Q3k08K14k66
6699a03J32kj05J69mo6oO9R9k70N9J82j02j04n0J20k18p9L56r1J76k22n6M17r4
6724B07m79K63K63l62P4J63k09M05j20m07K82k57J30j31l4K28R1j26J34r3l2M7
6746C7P4l19J10qJ70J4k70J84n7K76m3j25J96k22P8k23R3Q8o0MJ48j9J1k8k67
$$ y = [-171, -70, 101, -148, 140, 59, 94, 71, -161, -15, -12, 147, -37, 320, -58, 50, -30, -122, -281, -81, 77, 159, 54, 324, -132, -42, 67, -246, -108, 267, -83, -176, -209, 208, 81, -105, -176, 54, 106, 50, 129, 141, 62, 48, 79, -54, -99, 185, 399, -46, 19, -57, -203, 4, -137, 175, 26, -134, 117, -136, 67, -34, -106, 33, 127, 211, -32, -183, 82, 103, -39, 79, -82, -35, -98, -149, 327, 77, -30, -140, -67, -29, -261, -168, 87, 152, -5, 143, 53, 16, -61, -218, -54, 105, 12, 86, -34, 101, 245, 71, 96, -82, -140, -90, 72, 34, 36, -205, 111, 155, 100, -7, 74, 157, -51, 163, -103, 29, 27, -78, 91, 87, 21, 15, 84, 183, -87, -28, 154, 52, -52, -102, 18, -200, -279, 77, -14, 162, -60, -116, 301, 207, -272, -9, 254, -108, -34, 129, -80, 325, 205, -202, 80, -177, -47, -178, -212, 16, 107, -19, 115, 22, -10, 37, 111, -208, -98, -106, 64, 78, -192, -8, -65, 211, 168, 43, 239, 17, 95, -128, -35, 53, -7, -3, 145, 126, 137, 109, -158]
6771a58J5R8n7J31j88L15k99j49L42k07L5J33M8j12O3K43k81m3J21J04j71K10
6793A93k0n0j21OOP7k81N0O8j08O4k76K07K31k30K10J19J6j67P6q6O9J12k55Q2
6818hK92k63N3j16J21j92j58L56r5J72j38P4j79P5n9N4p9J94j59j00L53k38J42
6841A02mN2j18Q6k65J79L6j87L73m97L63j41Q3K5k7j2n1o1M7m2j3K4m9L32j96
6866C9N8j01r6K55mr3k32Q7J90k63K03J46j96j90J78l9N8L1m7L5P3k32J21K19
6890B00l91J90j82L02q1l0m96O77r4k44k5K01k3n4J43j13P1j09nJ89k80K70j87
6913g1M4J58l56J13K99j91j73N0J64j45P0n0N7M2k69K99JJ08m65M72l14L06qk37
6937i6n9m2j06J17J92j09J65j75KK26q7n5K9p7p7K24J18m30K64j5l14O39k43k35
$$ y = [-158, -143, -45, -102, 29, -159, 156, -143, -292, 50, -157, -122, 11, 59, -53, 10, 253, -28, -71, 50, 154, -17, 193, 173, 123, 2, 8, 14, 91, -190, -140, -72, -180, -116, -392, -185, 46, -184, 26, 145, 161, -6, 70, -16, 53, 165, -90, -8, 284, 21, 74, -42, 79, -113, -271, 85, -10, 162, 24, 98, -81, -6, -65, -11, -90, 104, -55, -155, 198, -40, 102, 98, 150, 32, 118, -147, 32, 68, -119, 254, -243, 120, -21, 62, 87, 60, 48, -3, -64, -17, -59, -72, -48, -97, 235, 39, 97, -4, -100, 155, 151, 58, -174, -87, 103, -160, 43, 189, -7, -197, -19, -58, 0, 31, -16, 19, 92, -140, -19, 200, -191, -1, -183, 119, 38, 8, -488, 189, 95, -149, -174, 27, 4, -50, 93, -20, 51, -58, -63, 126, -154, 116, -71, -27, 131, -225, -112, 187, -4, -177, -127, 37, -108, -38, -88, -31, 11, -258, 41, 42, 150, -315, 157, -157, 149, 141, -96, -155, -197, -303, -186, 6, -103, 62, -113, -111, 115, 28, -27, 2, -75, -152, 72, 190, -240, 24, 9, -305, 334, 91, -144]
6961a44l1l4L7L24j62m44M45m0m6J44j36p3N0K77R7k71n7n9N9Q7r5J71o7k18L39
6986A53k40J71r2k12K35K35k97o2K51j80O6j7j15k43N45k9j2l78J42jO7N9J33
7009A79q4J65k07j47N5J06ojL0q5O6J49Ol79o1K30n9o5K35p4j52Q8m5r3K89l07
7035a67R8O0J23qo1o4p5RO6j37K52p5k03Q5L61j26l51J50J55k54N8M8K91k45j0
7060b0J37k98P8J69j36J36p3m0k4Mj60J72j4l2J23J1K51l71P7lR4k32kM38l37
7085e2J32J2J3M0q1P0p2j88K51ml32j16M09K15l52J1j47L26k62J66j07N1J25k96
7109a88L25J3l3k36O5Q7j53K1k7L3J32m8j00q7J11J43l3n1j0o7m6J87j87M86l56
7134a9j01J85n8m7k70J78j06K73p8J01J7j85J68k07L15k72K51O5p9j18j47K05
$$ y = [-144, -175, -209, -172, 152, -10, -454, -9, -49, -95, 49, -87, -160, -110, 167, 264, -7, -64, -123, -64, 23, -72, 99, 32, -186, 153, -87, 84, -8, -220, 15, 250, -47, -109, 142, -38, 28, 11, -104, -347, 198, 169, 157, -221, -79, -80, -13, 46, 179, 95, 260, 53, -94, -39, 67, 61, 60, 90, 5, 71, 220, 226, -153, -214, 16, -43, -108, 127, 53, -99, -11, -56, -149, 140, -167, -69, -9, 114, 106, 45, -19, -94, -85, -19, -156, 96, 21, -182, -97, 264, 138, -213, -63, 92, -162, -104, -56, 235, -10, -20, 117, -181, -103, 66, -70, 66, -7, -47, -71, -67, -227, -55, -69, -101, 22, 33, 284, -87, -10, -13, 81, -151, -153, 285, -52, 80, 92, 105, 145, 64, 134, 62, -126, 125, 121, -211, -327, 82, 297, -55, -44, -191, 135, -127, 39, -68, -17, 108, -188, 137, 150, 117, -119, -54, 33, -120, -99, -126, -93, 39, -9, -109, -196, -85, 58, 25, -26, -36, -103, -149, 38, -149, 337, -19, -120, 65, 7, -40, -310, -132, -238, 35, -43, 58, 75, -110, 58, -149, 166, -106, 145, 210, 131, 13, -134, 71]
7156G1o9K3k05L78j37k6N0j10j5M7j41J35j63K92j65j08J8J65P3j80K92j24Q1
7179A82k80O3J03J23j39k29p3K68p4k21J14m4K97l79K80k87J33K26Mq4L6K9k4
7202B4Q1k00j04K4J46J77l40K85k2k99L87j42j18K1J22j3j18M2O5j84J09l9o8
7225a64K36Ol8L5m3m8L1j85K03J88k19j22M6J07Q4J2k84K72mM8j68J49j69O0J26
7250A59K2r7l6k87J48J71j92J81j40J38r0p0k09K50J17k9k70L07J4j04k8J89j38
7273Fn0M3j35M70k02j49O7o6J23j28L4J73m1j13J03k33J63N6r9J13l55Q2L43l71
7297a66L09k54K81l26K90k07R4l6K8k6j28J49J32l34J8K53j8p5K3K2J6K6l11J45
7321i5j26L52m3p9Q3j58Q9K19l08j5K01m50L99m27M61j94K5L5j70K27k60J65k08
$$ y = [71, 2, 25, -180, 198, 61, 35, 85, -25, -40, 7, -134, 1, -162, 130, -35, -143, -125, 40, 113, -67, 225, 101, 182, -98, -35, 68, 191, 52, -177, -250, 18, -56, -277, -163, -207, 90, -289, -9, -296, -163, 63, 67, -17, 19, 48, 24, 105, -95, -199, -175, -29, 148, -192, 93, 71, -228, 159, 17, -101, -80, 42, 29, -89, -47, 18, -166, -57, -96, -164, 72, 78, 40, 75, 32, -16, 15, -170, 33, 221, 2, -120, -74, 33, 117, 129, -155, 117, 113, 161, -7, 142, -27, 33, 159, 181, 84, 48, -239, -91, 80, -112, 69, -71, 67, -23, -93, -302, -52, 65, 36, -234, 73, 87, -17, -45, 144, 6, -44, -1, -136, 334, 132, -17, 50, -16, 107, -21, 13, 186, 145, 32, 135, -98, 65, 121, 22, 135, -220, -138, 205, -166, 143, -111, 170, -156, 134, -73, 21, -15, 13, -13, -141, 8, 140, -194, -176, 77, 59, -16, 7, 29, 45, 71, -240, -95, -221, 131, 88, 9, 92, -66, 23, 242, -66, -81, 120, -330, 69, -358, 103, -91, -66, -31, -201, 26, -234, -69, -277]
7344b77K56j4N3k0m5r2J53j49J80j01J20M5l15K27L4N6j4R4k57N1Rjm3p5k4K48
7370I9j20j7j04L68k09j61M40k88N3kn4j12K23j72k9J90j24J60l0j54L5m8L2L10
7394B86j66j62L0p1J9J22J7J26j65k6L1Q2j06O5j02p8N7J57J03m88L36j68J45
7417D4N2k63J87q5P4j18n7M0K56m2k7Q7k07n7j3J11q2K2K21j08j21j69L40j45
7441f0J75o4k6j61N8P6M0k56L41j84j26K54j26K60l28M6J77k0j95Pj75J21K5J49
7465Ho9O0R3m6k90M49k19k22J57J31p4j35N2p9k9J76L4O2J06k79K22K5k07j08
7489a82L62N0k39p5J2m9J23P5P8k56k4J69Q3k11J77j5j28o4K99k23r4K73j43P
7513EK33k56l7K0J17k21J5j45M21o1r4nk32K0K14J28k3k83Pj1K07n3q2k6P0K08
$$ y = [-277, -21, -35, 18, -2, -47, -139, 14, -135, 45, -56, 64, 109, -206, 21, 55, 111, 97, 191, -66, -15, -6, -7, -50, -125, -149, 99, -21, -38, -142, 226, 17, -144, 296, 8, 61, 59, 5, -107, 116, -56, -85, 105, -19, 141, 111, -43, -8, -56, -24, 286, 120, -42, -12, -83, -64, 58, 75, 201, 36, 10, 41, 123, 17, 82, -20, -98, -41, 116, 219, -269, 67, -101, 44, 96, -167, 20, -65, 9, -109, -166, -126, 130, 88, 61, 148, -59, -116, -129, -18, -100, -78, 143, 35, -86, -255, 85, -60, 115, 51, 25, -136, -78, -2, 38, -218, 123, -61, -187, 67, -59, 201, -127, -81, 96, 76, -119, -112, -287, -166, -141, 8, -61, -1, 92, 46, -244, 205, -14, -236, -79, 52, -22, -157, -105, -184, -213, -37, -3, 59, 165, -114, 108, 133, -74, -182, 180, 230, -9, -84, -72, -121, 2, 77, 155, -101, -125, 44, 127, -84, 93, 78, -50, -114, 185, -38, -132, 141, -2, 5, 238, -18, -55, -35, 82, -139, -124, -269, 152, 91, -3, -8, -240, -220, -6, 122, 99, -184, -177, -188, 19, -34, -116, -142, -72, 136]
7539A36l43J72n4o2l5L03j39L97n05K83pl92M48j45MJ17k26K8j65J46R0k07O4
7562i2l3K25j21Nj7J03k85L81L6k27O2L5J32k63N2P8r3J01J30n7j89q3K34pj4
7587I3p9K33k28m8m4J87o5r6J7j33Lm8K78o8n5P4M9O1o7j29J97q5j23L7p5K25
7613A11k08j26M00l22n7Q4L4JJ22l6J71j52Q5L37m30j35R4j04J49N2n1J17k5j83
7637g2K67l75J73j8K38j48j29J18L8j15K4r7J05j86J48k7k3K81n5J72l32L2o4
7660d5J35pJ48n12M39j06Q5k43J64l4k55J83Q2k6O8l27K99j25l7J88J09l99K43
7683B7o4p4J54L2l58J30K79j54K62p9L5k31j11k84L91J73k88J70m2K55l63M2J55
7706E7l4j6J94l23R9K00j20O2q2l0J15j18M6k58n8M23m30J80J8K56k06M7q1O0
$$ y = [136, -207, -35, -89, -151, -186, 117, -22, 375, -130, 153, 146, -246, 202, 57, 61, 178, -48, -20, -185, -39, 51, -156, -92, -125, 100, -21, -16, -33, 70, -215, 166, 202, -25, 37, 72, 204, -59, -7, 71, -22, 79, 209, 152, -37, -120, 114, 107, 93, 14, 247, 19, -29, -73, 114, 49, -47, -30, -163, -160, -208, 70, 2, -53, 21, 70, 131, 64, -65, 132, 47, -76, -39, -114, 111, -97, -223, 177, -145, -202, -118, -84, -83, 39, 3, 174, 22, 107, 444, 14, -121, -27, -131, 18, 70, 19, 136, 111, -72, 195, -180, -7, -25, 213, 65, -64, 54, 92, -23, 1, -96, 9, -177, -29, -56, -79, 202, 147, 319, -13, 19, -45, 90, 83, 231, -281, 158, 52, 137, -106, 58, 24, -231, -48, 34, 8, 76, -251, 48, -77, -114, 74, 183, -216, 27, -37, -111, 43, 75, -283, -153, 126, -28, 234, 155, 190, -41, -152, -436, -45, 128, -160, 10, -32, 223, -140, -98, 57, 23, 7, 201, -122, -23, 177, 57, 119, 37, 7, 122, 4, 50, -208, -266, 157, -273, -93, -75, 181, -25, 22, -59, 1]
7730AJ9l4j09K51p7k07P6j8J75k2l9j09J50Kj66R7j40j63M65j6P8q4r3L27l45
7755A9J30k18k9m0j6J21np3J1j9J02J34k13J88K41l44K4K6n3m2J81l07L9J48J37
7780A42m12K35O5L8kj58M6L9N0j14m0JJ47J3P5j32j53L73l63L56k96N7J59l7l05
7805b16J31J66j22J92j08J68k26n4j51L06j49j15K10r1j47L75k55P5Q9k58K07
7826B7j61J30K09n18L85L1k63K37k00J93l03M39k76k87L18J55O0j79j78L24J21
7847B64k05j40K18j65L31j30j80j12K01j20O5j95K97M0m87M08N3m71Q7J52J55
7868F6O3k36Q7j11J02Qo1K1O1J14k1Q1j72N7j90NO9j0j25O7J22J91k67J97j06
7893A2j8j40J34J21L7K30l40K3k1l16K44O8p7O6O1L5k90J94J9m8K56k69J0N8m2
$$ y = [1, 20, -14, -123, 128, 51, -156, -80, -98, 77, 55, 16, -93, 57, 59, -107, -10, -150, -313, 152, 136, 214, 130, 37, 364, 19, 149, -69, -98, -138, -154, -33, -38, -111, -100, -119, -17, 117, -96, 92, 333, -11, 13, 39, -14, -56, 125, -182, -143, 5, 142, -270, -35, 30, 68, 66, -92, -46, -7, 43, -71, -111, -110, 37, 50, 125, -7, -160, 213, -150, 206, -90, -33, 126, 89, -216, -85, 81, -41, 151, 43, 211, -15, -69, -220, 86, -63, -178, 32, -59, -206, 169, -86, -11, 78, -180, 27, -134, -4, 205, -313, 72, 103, -160, 77, -123, 70, -233, 206, -70, -357, -39, 116, 176, -3, -181, 143, 264, 59, -81, 137, -28, 303, 173, -7, -119, 82, -38, 27, -168, 129, 169, -318, 90, 143, -328, -241, -89, 66, 129, -107, -20, -131, -29, -21, -82, -61, 0, 114, 93, 174, 2, 59, -131, -126, -57, -67, -192, -125, -3, 188, -79, 118, 12, -6, -146, -12, 109, 146, 376, 36, 59, 38, -278, -34, 34, -43, 23, 84, 119, -171, 23, 42, -6, 250, -19, -9, 49, 7]
7918Gk2K5m0k42N40k47k28L18k6k52J10K48j40k91K13J48l85M05q4k55K05j19
7940a12J25J41j45L6K0J7p4o1j8j23J86j58M08l05j2K30j50R5K07l73L64l61J10
7963D7j64J31J41k19j3K29j19j31P9o1O6p2J10Nj07P1k1j10K18j40PL67m08L97
7987C03j00k03N7j13K26j62N8K41m55L08l06N5R3J5m2N2j32J6j89J32J14%j40
8010a72J2J98K2Q3k30K72m31K30l69L15o5K64j52j03K11p4k15M90l52Ok46K93
8032a3k5j02Q1j73M82l31l3LJ75p5L59j87k25j62L20j99J16mJ55m02P5K08Qr8
8056d7k13J13L60n3k41pJ77j6N1j15j23J74j28J93j50P3k1K7L8l0j94J83k98K91
8080D4j36L74l66O6q0J98j42m3o9j79L23M3j09J31K69l88J31j11K6j26r7K06R9
$$ y = [7, -15, 10, -30, -272, 268, 21, -207, 111, 85, -167, -57, 191, 51, -240, -27, 121, -264, 141, 57, -198, 7, -112, 13, 154, 9, 45, 65, 82, 8, -53, -71, -194, -8, -166, 242, -63, -75, 155, 5, 100, 307, -66, 298, -63, 47, -117, 14, 155, -64, -77, 152, 33, -98, -19, -80, -14, -86, 24, 29, -78, -7, -28, -138, 80, -60, -53, 314, -94, 303, 203, 0, 57, -56, 170, 8, 66, 307, -148, 160, -146, -91, 2, 17, -25, 27, -105, -89, -278, -146, -32, -32, -172, -160, 38, 60, 143, -87, 185, -246, -16, -385, -70, -135, 129, -23, -126, 85, 11, -204, 286, -66, -60, -306, -13, -38, -140, -59, -232, 250, -81, -114, -111, 64, -11, 348, 161, -64, -226, 94, -105, 11, 7, 162, -240, -165, 43, 51, -47, -260, -147, 213, 160, -81, -88, 89, 73, 124, 9, -114, 60, -68, 125, -25, 48, 27, 54, 92, 62, -132, 51, -247, 44, -92, 282, -84, -18, -98, 100, -42, -85, -154, -333, -10, 33, -76, 55, 324, -64, 67, -44, -18, -144, -241, -35, 64]
8103F4k65J70P5J33k33K36j04k30K28N8k36O5Q5j00J87j31k09J90n9L2k1P2N4
8126F1j54L18k60K72k49l25N25r8p3j51M1o5J9J83j62M18j51k99m4L99j93l0P8
8149F0l21M04Q1o2k13P3J4j83K77k80K95m68K09Q4p0r4J05J71j70J27j78n6K78
8172H3j16q9N17m89P8m5j4R1J79j01k39r0J30Q5J10L03m62J17l23
$$ y = [64, -201, -31, 44, 177, -56, 180, 76, -154, 74, 132, -104, -39, 46, -54, 133, 2, -207, -17, -76, -44, -65, 7, 61, -93, 225, -35, 237, -12, -337, 188, 90, 17, -134, -93, -158, -139, 44, -118, 300, 149, -150, -194, 205, 12, -18, 60, -261, 143, 224, 162, -51, 22, 36, -147, 130, -150, 145, -323, -114, -30, -100, -194, -89, 82, -88, 39, -139, -195, 83, -33, -122, 395, -94, -16, -61, -75, 16, 195, 94, -145, -235, -105, -20, 90, 393, -69, 48, -275]
8191b75
$$ Imaginary data points
##PAGE= N=2
##DATA TABLE= (X++(I..I)), XYDATA
0@%%%%%%%%%%%%%%Qj6J6j6J6k4L2l2M0m8N5o3P2q6R5j06J22j40J62j84K06k31
36a22K59k91L25l62M02m46M96n49O06o70P39q13Q96r88J089j200J323j460J614
55H48j788J985k213K480k796L177l645M240n024O102p684J0236j4999K6760j07704
70i0025j49059K90188J08207j78460r7811J12967O4292m1115j7982j3393m5185
81e7376P3360Q5448o7681j07600K1568J15886J5520j27307k8147R7499L4213o0415
93e032m5857K6033L0970m164J8379k3305n3752N7223O3750o3440n2861N6516N2445
106E6905n3765l6611N2571r933l9400N1282J3610o6386n328O7683R837p9872o102
119d5509Q8002n798o8880J4865M5225j6386m2190K8153M4357n7494l4509P5099
$$ y = [0, 0, 0, 0, 0, 0, 0, 0, 0, 0, 0, 0, 0, 0, 0, 8, -8, 8, -8, 8, -16, 16, -16, 24, -24, 31, -32, 40, -46, 49, -57, 65, -75, 87, -97, 109, -122, 137, -154, 171, -191, 211, -235, 261, -288, 318, -352, 387, -426, 470, -518, 571, -629, 694, -766, 848, -940, 1045, -1168, 1312, -1484, 1693, -1952, 2288, -2736, 3366, -4318, 5918, -9081, 17679, -90025, -239084, 51104, 159311, -19149, -116960, -3993, 60299, 19184, 1202, -12191, -57376, 15984, 101432, 33751, -73849, -52281, 63605, 79125, -48182, -76329, 21170, 55383, -5032, -50889, -24856, 6114, 1950, 20329, -2976, -56728, 495, 64245, 805, -52056, 4460, 56905, 3140, -33471, 19100, 9167, -30233, 21049, 34659, -31727, -37055, 30628, 40465, -39407, -45509, 42493, 36695, -32185, -17320, 27905, 11519, -30671, -2518, 41839, -15655, -50164, 24935]
131B4935J7813p5589k2348P0292L0204o7779j5642N7944m378k4048J8604j221
143H787k0960J0783L8322j3402n7381K0371N2977k6619l8660J1531K5416m335
155F830k2542J0838P020k2981J6588K4818k3653j9750J9265K6000j6657k5479
167a9703K5718R698k6787J0737J6003j9879j4742K1118K5198k9262k8403L7089
179F785J7021k9371n141J7546M100j4761L097J8460k3620j6522L5526O728l4196
192a4348j1164K7487J8280l0778j5170K8365L711r755L865m396n46Q753J0840
205A5144o776k5228J5273L1554k0849k7609J1602K4845k821l1117K119K3669p601
218B205o451K387o479L699R645K438j3643j2148K6904J0354k9283l163J8798L968
$$ y = [24935, 42748, -32841, -55189, 15103, 45307, -22472, -38114, 19830, 15452, -8596, 10008, 8787, -12173, -1390, 36932, 23530, -33851, -13480, 39497, 12878, -25782, -14251, 11165, 6830, -15712, -4874, 2146, -20835, -4247, 20571, -3082, -22832, -3567, 22433, 5776, -19703, 6015, 15713, -11074, -337, 15666, -4213, -18955, 2163, 27361, -1901, -30304, 6785, 23806, -5565, -10706, 6840, 10940, -3821, -724, 17736, -5884, -22406, 13120, 19848, -14348, -25512, 1975, 20255, -10523, -25693, 2672, 6383, -3372, 493, -3903, -4449, 4304, 15144, 8368, -16860, -1587, 29967, 9118, -18491, -6889, 17956, 15135, -15982, -13863, 9806, 2205, -4246, -1859, -8338, -4639, 5006, 7444, -6199, -18347, 8557, 18911, -10372, -13535, 5263, 9231]
232I231j0100q430J0624K196r294J0677r41j2561Q238Q914j233j1125l397K0158
246A2957k662j8682P940P460m791n492q98Q059p881n718J3916o808r601J1992
260b09K706n814l424O188R866j2673k080J5348n450o060M468J898N31q024K059
275f70J0057j1760l317R554k583k642k584L443M568r796L932P332j1180K686P575
290D615m855l707j629R566N09j4665O856Q520o843O7l35K507L712n549M940L37
306D046o544Q498P51p031J56P96O231n071j0572J0345J242q160K748q95M79R71
322b010j889N133n224j438J1055m875m850N296N27L081m696k877Q404l706l151
337a220L895l324K285j08k744M262m871J057O046p528n05N282k094j42m010K403
$$ y = [9231, -869, -9299, 1325, 3521, -5773, 4904, 3963, -8598, -360, 8554, 7321, -3804, -7201, 12957, 10295, -8387, -447, 7013, 2222, -3270, -4168, 3891, -3990, -9708, 4208, -2600, -12201, -209, 2497, -3317, -6741, -553, 9313, -3360, -5440, 9908, 4458, -1602, 2866, 4764, 5295, -2729, -670, 9387, -2373, -5690, 3864, 1281, -1361, -3945, -502, 4066, -5730, -1798, 5534, -5646, -2960, 4615, -240, -3947, -5576, 3990, 4499, -10166, -3310, 5210, -1633, -1566, -1901, 606, 4318, -1231, 3709, 4046, -2498, 6000, 6751, -280, -124, 672, 6903, 1832, -8740, 1605, 2847, -5313, -2565, -3460, -2981, -2010, -3899, 1234, -3990, -5428, 5627, 752, -4098, 1198, 1725, 4806, 110, -2767, 5637, 1931, -1220, 2675, -649, 1636, 1528, -1216, 3046, -1825, -768, 5278, -2250, -2755, 2527, 433, 291, -3719, -1316]
353a316M525p825J534L922m906L418n94k079M063k202K059J890n100N146J512
368D047k876J919k812L288J846p149L116J791m683K755j901j782J280j962M499
383A376k623n713O816O91k180J615l961L424L691l695J042k518J514O049m772
398G56j954P80m81O836l224p120M407J941K724k188p225L772M379J94j866q975
414g244L676Q962n216l847j581J457P130l266m159J02O49Q551j067r516K802N064
430B497L889j295j0426M140Q843k751m354m513L872O623o248j897m63j639O970
445C248j202o576P62J808N548j523r551L716N668J410k191q196N018Q734n269
460A404l338j079K322O457l238l610K30j16P012p25q023N08K118N473P50j2033
$$ y = [-1316, 3209, -4616, -3082, 840, -4066, -648, -1242, -3321, 742, -1460, 599, 2489, -2611, 2535, 4047, 1171, 3090, 278, 3566, 5412, -1737, 1379, 3170, -1513, 1242, -659, -2441, -1161, -3123, 1376, -1247, -6960, -144, 547, -1633, -18, -3979, -555, 3136, -559, 483, -2035, -521, 5528, 756, -1198, -418, -899, 5937, 2713, -4407, 0, 1941, 4665, 2477, -4748, -976, 3403, 3597, 1731, -7244, -3568, 5394, 178, -3669, -5250, -3793, 3337, 71, -4088, -3986, -3337, 5214, 4147, -5369, -2567, 2497, 6386, 5091, -5335, -1195, 7648, 4897, 543, -3970, -98, 6525, 277, -1620, -2083, -3722, 3248, 2046, -4530, -3768, -1960, 3588, 2065, -7486, -3770, 1898, 3308, 1117, -7079, -2061, 6673, 1404, -1934, -3013, -691, 5766, 2528, -1082, -852, -968, 6044, 5319, -2704, -2196, -78, 5395, 6145, -5888]
476e888p0Q522J419l536q151K680Q022l330o08j452m585O535N327k709n644m207
492g675J1257P448j0567n734K689Q728L836j3059l470Q742K329R75o291n474M705
507a561L874K688n139j0307Q892R679n813p895m097J0292Q432j0379n842K975
521d201O280M445q977m184P535K277J122k973o339M994N566J003m978r435Q346
536D81J0194q105q874M56J0217M422j3607m719R376K991j130n792j476N914o78
551c30K315k96r072M354J0376r94q435p200J0928J0535j1063p454L829O602M036
566H131q898m882N930J489K213k630o351K390L495L774k189j1679L132J1722k130
581C517o537m729N747Q775n675o500K021L942M933m576l911M890j540J461M111
$$ y = [-5888, -5958, 2564, 3983, 447, -7704, -5024, 2998, -332, -940, -2392, -6977, -442, 4885, 2176, -3468, -7675, 3582, 11030, 463, -5271, -2582, 6146, 9982, -3077, -6547, 2195, 4524, 5499, -792, -6266, -1561, 2313, 5001, -138, -10445, -1553, 8126, 2313, -5582, -9679, 613, 9045, -1334, -7176, -4201, 2079, 6524, -2453, -6637, 898, 3175, 4297, 1324, -5015, -21, 5545, 6548, 1570, -7865, 481, 10675, 2570, -6304, -5848, 4369, 8791, -4816, -9535, -159, 2832, 1702, -4090, -5566, 348, -330, 1985, 1689, -7383, -3029, 7347, 6353, -2082, -9282, 1646, 12181, 1118, -6336, -2507, 4095, 8131, -767, -5649, 281, 1770, 3983, 1353, -4998, -2608, 887, 4661, 2472, -9207, -6075, 5647, 3517, -3020, -7749, -2002, 6773, 1098, -5402, -3381, 561, 5494, 918, -2993, 1897, 357, 1818, 5929]
596E929o075l002L620N722r46j1855K425J1097l944o778n45L000N129n214l623
611e060N113nj41j096j463K932j880J731M543o687j431N825P79k176l149K110
627e5N253m123j488N09j420M734q42m203K092q26L2J464k430K0r02K005L465o631
645c346k342O108Q51o82k968j417N486M22k782M27n89L476J74k675J514k732J071
662dN865m366l997J478K739J896n912j719N514o05p75j416l062M131J629k787
678a391J30j205K662J560l566R62M23K47L229l538r18L620j395R84l31k055K509
695A927n34j79K50k798K492M64l206J960j151j018K747k124j21j80o64L207j973
712i01k008L244r43R75N08k733L038J13j251J965k201O62K069j932P89j292p08
$$ y = [5929, -146, -3148, 472, 6194, 5248, -6607, -4182, 6915, 2971, -3807, -4352, -1352, 3777, -1437, -5060, 53, 48, -93, -1189, -2652, 280, -1600, 131, 4674, -2013, -3444, 2381, 3160, 984, -2165, -55, 5198, 1075, -413, 96, -1324, 3410, 2568, -1635, 457, -369, -337, 1127, -1303, -1283, -2185, -180, 3285, -3346, -5688, 420, 1271, 589, -2379, -3796, 1690, 2112, -670, -243, -832, 2644, 2818, 143, 1657, -1075, -4, 5861, 1495, -2502, -1024, 1715, 3611, -2301, -4020, 1494, 889, 114, -1302, -4364, -233, 1396, -1391, -1261, -2466, 196, 1756, -1810, -848, -425, -178, 3051, -487, -1405, 2215, 820, 1804, 1473, -582, 1927, 1393, 1214, 1464, -1334, 1158, 1622, -1584, 376, -775, -1793, 954, -1170, -1291, -1471, -2135, 1072, -901, -2909, 335, -608, 367, 875, -1858, 1180, 1293, 42, 2007, -194, 468, 2537, 605, 1394, 102, -606]
729f06L178k338j025J698k021K001m05k632J765o30O44R39l953K482J647k019
745a275J176k025R92L369l056K33J222j058K662j877p89K662j383P17j4k814K963
762A705M3k363J189j285P51O22k913J935k58j175K374k222K50J642j898J220J78
779b05j159K733j577m72K084j717J727k50j976L047j305j037K221k273R40Q72
795A653k031J094j116k19J932k912Q15J262k134J750j472m89K656j944J43R41
811g1j179K047q30r60K415j619M57J687k562J894O26j690J433j484K50J395k586
828g77J285j08j703K342j581r88J721k012J522N14k517J961k69k26J461k408J567
845b16J084j748K069q92j189K801j298k95N00j535K669q52j740K051j586M93J039
$$ y = [-606, 2572, 234, -791, 907, -1114, 887, 482, -2150, -385, -1015, -371, 568, -3385, -903, 744, -1275, -99, -2124, -1132, 2237, -819, -586, 636, -422, 2240, 363, -426, 2236, 853, 1570, 1556, -1258, 1705, 1748, -615, 574, -711, 40, 662, -2251, -316, -574, -1749, 625, -1597, -1347, 295, -1603, -383, -205, -1364, 1369, -208, -680, 1404, -313, 1414, 1164, -812, 2235, 930, -107, 2114, -159, 781, 1653, -378, 716, -400, -619, 1313, -1599, -784, 478, -1656, 94, -1378, -1867, 789, -1155, -1012, -71, -1250, 797, -33, -993, 1422, -197, 260, 1947, -615, 1279, 1905, 215, 1648, 164, 414, 1809, -777, 508, 400, -1303, 1039, -542, -1530, 191, -1821, -299, 215, -2302, -341, -610, -836, 625, -1783, -216, 868, -880, 1189, 297, -892, 1909, 611, 316, 816, -719, 1950, 1098, -642, 1409, -177, 316, 1355]
862A355k671J282J05j189J936k259l12K057j740Q08l40p86K926j610r13J966j327
879g12J592N96k069J273J47J96R45k836J113J959j987Q59j464l84K155j638J04
896a51j75j946K832L81l088O01K72J955%l799K605J116j516J436j276j12J849
913I84q46J487j170k254L854k4j409l28j342L175j03l436J392P2NJ107k294J85
931i45M02n41K001j931j353K559r40Q30R1k305K175J271q56o34j035K640J671
948C100m113J028J458n19M58j521M04R83k309J927K19k598Q06M49J456j284m216
965d272M110K781m491o14J646J582k24l295K432J189k051K759k82k250J009K13
981B42K245j034l484K603K167j042j916k089L261J954m182J82P90l98J520j657
$$ y = [1355, -1316, -34, 71, -1118, 818, -1441, -1753, 304, -1436, -628, -968, -1754, 1172, -438, -1351, 615, -712, 880, 1476, -593, 680, 827, 1023, 1968, -868, 245, 2204, 217, 1076, -388, -772, 1383, -255, -151, -326, -2272, 560, 941, -2147, -1546, -1274, 681, 681, -3118, -513, 603, -913, 523, -753, -865, 984, 138, 1625, 455, -1799, 2055, 2031, 622, 294, -1048, 2127, 2024, -1412, -20, 52, 57, 1164, -1130, -945, -543, -1084, 917, -1014, -2367, 192, -748, 82, 173, -2132, 43, 1314, 458, -176, -1211, 1429, 3100, -1013, 15, 1473, 954, 1412, -109, 295, 1278, -1031, 896, 1115, -1483, -677, -228, 1228, -56, -4272, -162, 2619, -1872, -2486, -840, 742, 518, -2777, -345, 844, -1207, 1552, 1270, -980, 29, 242, 2487, 1453, -2031, 572, 2739, 1697, -219, -2308, 953, 2907, -1275, -1093, -303, -701, 819, -838]
997h38p04R74p48J988p55k056J787o50K160J092m830J030L756l90k556j156L341
1014A445K111m508O03J966k048J409l96j77K8k148K585J169m096LJ990J453j693
1031c04m000L740L161m175j32J792j07K53q36J233J08k111L043J70k871J345L62
1048F71R18J34k694J251Q85q46N19j937L56K140k262j76O61p88J816j155j064
1065a571J447j698J174J551j524j28l08J664J530l852M07L702j230p67o85P21
1081D33J321k461J227J412k931N69K019j246j092j146K330J473l831K63J831p45
1097e74M18j124O75J208k034K017L87k659J929Q02J5q21j146K422J85k411J683
1114I72k87q11J554j374j16K39m81J916k235j307K724j146n38N71j036J502q88
$$ y = [-838, -1542, -568, -1316, 672, -83, -2139, -352, -1002, 1158, 2250, -2580, -1550, 2206, 1816, -740, -1896, 1445, 3556, -952, -349, 1617, -431, 978, 582, 405, 433, -1715, 870, 2039, -2057, -2054, -64, 1389, -304, -4304, -564, 2597, -1578, -1710, 82, -25, 228, -608, 625, 733, -1378, 1665, 1835, -1036, 309, 671, 1589, 1723, -971, 280, 1165, 319, 838, -1099, -743, 1397, -865, -1041, -380, -1168, 648, -507, -1571, -124, -1822, -648, 903, -621, -749, -1057, 607, 2137, -1715, -1308, 2394, 1164, 397, -288, 433, 1754, -707, 520, 1932, -999, -430, 1589, 343, -749, -1895, 435, 1908, -1923, -1660, 171, -574, -156, -1280, -605, 603, -1431, 586, 973, -1686, 243, 1045, 1060, 239, -907, 1515, 1700, -711, 972, 685, -126, 1428, 54, -62, 177, -304, 1612, -623, -1930, 794, -352, -890, -319, -1355, 147, -741]
1131g41n67K119j848OK166j065o41M63L20J651k262J73K143j669k52Q89n07M17
1149G95j275R30R72l074J349J518j921l0k7O80J89k051J494Q53k278J829M20j176
1167h03L67K2J165J54j941J778M26j611J187n74N98J56j484J764m56j770K077
1184A055p64p33K74n44J298j039r22K074j088p69J660j231M06q1r0J302j340k57
1202g89K154j566k20J310l50N39q12N5J396k360O20J659j933L53J24k67N73j970
1220a484J061J139k006N44O91p12K86n08P61M81j838J646O54j696J213k22M53
1237D63L26j141J321K38j926J661K29j171O59m50L04l15j178J864j101q49J211
1254A45n19k26j7k36J258j018q39K142j309l4R85o36P68o25k60J673j284K02J125
$$ y = [-741, -1308, 811, -1037, -1031, 1135, 70, -571, -108, 212, 1863, -399, -226, 1917, 248, -4, 885, 378, 795, -480, 450, 1422, -1652, -303, 1215, -706, -736, -763, -83, 106, -1945, -451, 402, -1876, -47, 373, -803, -436, -414, 751, 905, -1036, 742, 1168, -443, 744, 170, 768, 924, -560, 1204, 748, -1022, 1055, 291, -442, -168, -712, 586, -453, -1375, 699, -389, -1158, 502, -729, -323, -404, -494, 808, -532, -789, 1365, -201, -421, 889, 539, 1078, 266, 321, 1717, -643, -23, 1636, -297, 56, 180, -87, 486, -1484, -423, 716, -1290, -746, -55, -767, -481, -989, -228, 253, -1585, 61, 715, -981, 232, 10, 463, 789, -352, 969, 1207, -719, 942, 1171, 0, 659, 209, 513, 198, -980, 884, -217, -1066, 145, -374, -600, -617, -853, 405, -613, -1452, 690, -619, -653, 332, -304, 464, -161, -421, 1252, -32, 170, 1295]
1273A295r70K75j32k33Q54j373L13J266j993N02M57r37M31l87O2J078j975J069
1291c98O49j531J113k40J59P95j345R97O66j517J271J42n78O04o53O90n3j374
1309f03J630l05j303J272o50j13L90j297J019k09j008J644j138l71J080o05M36
1326a31k41o27J459q64k23J472j296Q25K00r26J178o65J72J100j540L04N82p21
1344E8O15p06m13J038j383M10N60r28P45J5p00O31p80L11P55j041N96L18p15J378
1364G64j035J92J147j183N14L94j064J211n42m78P05j193R59K92j294J098q22
1381c35k12J061j318K65M91p03P77n79n19J190o33K59L12p09J090j36o98J057
1399F60o10L55N81j204Q62j28q26J560r39l57L60p82R53o00q78J064k55m55M85
$$ y = [1295, 325, 600, 468, 235, 1089, -284, 29, 1295, -698, -196, 261, -676, -245, -632, -570, 508, -1467, -398, 251, -1280, -167, -407, -248, 547, -798, 199, 865, -652, 619, 761, 183, 787, 134, 824, 771, -603, 1027, 722, -581, 691, 41, -72, 318, -979, 40, -169, -1177, 467, -671, -1042, 38, -567, -131, -372, -999, 460, -404, -627, 845, -451, 374, 574, -352, 826, 161, 333, 1433, -107, 197, 779, 58, 673, -33, -446, 592, -791, -381, 179, -749, -4, 11, -689, -58, -838, -527, 228, -813, -217, 101, -614, 764, -271, -79, 1068, -115, 399, 793, -271, 940, 398, -80, 625, -568, 391, 683, -611, 487, -335, -547, 514, -804, -539, -48, -751, 26, -553, -1072, 118, -515, -256, 56, -653, 437, 301, -397, 660, 50, 405, 986, -218, 644, 516, -310, 1250, 311, -46, 314, -468, 485, -115, -993, 71, -184, -639, -154]
1418a54q81Q43j8q42J113m79k47J117q18L75L72q98J456m53q14J133n75L23J99
1437G52j374J596p50l49P30m99k46L91p66N70n27o43J394p20k01J41l25J254n79
1456a51r53J436l16m25O00m94P27J7n39J093p03m81R13m30L70j77j264J641m63
1475D01j110O33j1O78o13j343J770l99q65R50q07L00J78n64J188m41o70J115m6
1494C44j1m04k77J452j39j363J089k87k25J35n37N99J97j204J135r27J2N86j088
1513i13J006l40r63Q34M70n84j6l64J249Oj201J072L65q37N00l31P46k5j001Q43
1533E16K43r44O43j4J10m44j271J708J86j538O84K56k67k16n35P50n9n81J377
1552F04p56l58P55n76P09j77p62J113k25j27M03r08J029L42j197N62j26n39R33
$$ y = [-154, -1035, -192, -210, -1052, 61, -418, -665, 452, -366, 9, 381, -517, 939, 486, -328, 805, 230, 553, 752, -622, 974, 224, -125, 605, 106, -140, 251, -515, 55, -472, -1115, 279, -441, -642, -501, -826, 428, -151, -1104, 332, 16, -409, 191, -303, 424, 441, -98, 995, 292, -189, 724, 294, 664, 487, -777, 864, 401, -709, -76, -87, 591, -22, -1365, 405, 6, -859, 91, -716, -416, -238, -802, 386, -55, -725, 390, 344, 333, -71, -348, 1104, 965, -398, 691, 404, 179, 314, -223, 376, 573, -631, 504, -423, -411, 175, -913, 93, -247, -1210, -376, 94, -490, -506, -870, 379, 385, -816, 256, 621, -216, 284, -47, 699, 674, -327, 516, 759, -185, 458, 444, 554, 110, -1161, 547, 733, -805, -121, 135, -132, -348, -883, -133, -192, -773, 604, -152, -510, 245, -331, 378, 201, -561, 552, 327, 200, 603, -305, 724, 1066, -131, 431, 305, -234, 699]
1571F99r04l9N53p50K14k39nO85r97N57L83j334P76P56j040P61m17M75M65j175
1591e76Q12L97r75R09k40m49O96r06J010K1r91N03L8j88K93o91P60qj183O68j15
1612b15p25O42J53k10Ml51R26n50k56Q83k67j13O48q44O14P2j81O50q36P4L89
1633E07n20K91m2m34Q34j007M0L63o64J83J67l85L89l38L53O00j279O10R98j151
1653d85N25p3K60M17p38P50j78r11Q93K08q64N39l91N82j28q65P75k59n35O46
1673A68n11J77N8m82M64j97p35J359k94o15M41k20M38Q5l17Q03m69j71O52p34
1693a00O62J0m54L92m26j09O65q32p3N39n35L71m41j63O52r32K84P41j191P15
1713b25R6M9J08n08N17N21j327P09O48o68M96k15k16O45r05R15K75j088M47r4
$$ y = [699, -205, -244, 309, -441, -227, -466, -471, 214, -783, -226, 157, -1177, -401, 355, -685, 76, -341, 134, 599, -576, 236, 633, -342, 567, 327, -122, 574, -332, 678, 699, -292, 211, 249, 61, 354, -337, 423, 415, -768, -100, -215, -940, -298, -145, -355, -351, -702, 224, -326, -582, 301, 34, -79, 569, -275, 339, 411, 230, 880, 44, 118, 507, -13, 278, 236, -198, 636, -371, -331, 32, -632, -449, -282, -667, -278, -616, -263, 337, -942, -332, 666, -485, 40, -33, 227, 644, -94, 656, 478, -433, 460, 668, -196, 343, -48, 534, 406, -459, 316, 57, -478, 168, -343, -166, -108, -590, -126, -323, -1058, 301, 7, -608, -167, -387, 51, 136, -181, 622, 153, -18, 634, -100, 562, 572, 118, 510, 84, -25, 640, -192, -265, 274, -261, 110, -331, -494, 158, -774, -490, 251, -940, -225, -129, -80, 28, -480, 37, 558, -769, -60, 588, -80, 416, 201, -15, 630, -275, 640, 915, -173, 274, 180]
1733A80k71M16q68P58p3o90O58j99l73L51k06J17K12p54P73k59n39J152m75K46
1753A56J99o44P60n58k71J178m56k50K46l58L78l48n3Q54j366L79N68q01Q4K15
1773h8m47N74n71K65N76r29M98M63m47K19k04Q0O91q22M96R8o44N28J35m65N75
1794E81q11L45N58j168P42R4q95M16P1j90j08o10R76po73L91rJ55j87j91N83n2
1816A1n21R41j53m68O59m29L62jo64O81k85l95O40n60J15L77l42K00n93L8N81
1837A94o85J1M79p94P63l30o8Q51j281Q04L24n32K51L84l65M31n00L67N59j445
1857e82P66J08m78M96m86L67K18j270Q81m0m66O26j16k77K31o93N14K41o61O01
1877b0n1k40N62k68l5J33k19P37o85k85J064m32n0K66p10P09m63O0L04n54PN24
$$ y = [180, -91, 325, -543, 215, 142, -548, 110, -89, -462, -111, -317, -200, 12, -742, 31, -228, -767, 385, -90, 156, 355, -289, 471, -87, -358, 820, 364, 114, 360, 2, 380, 32, -21, 833, -533, -154, 414, -387, -303, -88, -535, 39, -532, -267, 309, -620, -122, 341, -106, 113, -91, -11, 680, -142, 354, 452, -192, 336, 471, 6, 581, -230, 115, 673, -495, 247, 341, -554, -138, -67, -257, -365, -975, 1, -6, -679, -288, -297, -142, -329, -520, 63, 11, -510, 431, 278, -190, 469, 40, 402, 401, -263, 418, 133, -262, 378, -182, -67, 310, -32, 168, -425, -387, 194, -491, -480, -1, -795, -32, -362, -430, 421, -860, -56, 268, -264, -13, 371, 6, 437, -63, 304, 863, -582, 184, 292, -186, 310, -176, 191, 409, -861, 20, -20, -486, 140, 24, -253, -22, -715, -201, 40, -621, -20, -71, -311, 251, -17, -52, 81, -138, 599, -86, -371, 693, 261, 211, 477, -233, 476, 13, 73, 377, -177, -170, 354]
1899C54o48N5k12j51P99q44J77O92p17M99R6k53L24j49k00Q92j066O50K94o16
1919b4L43m30M1O87o59J94J39m46M20l72k47N53n38JK64m79O00l95N1M51p28J95
1941c79O42n09N27l40j48N58j06k56N31m69L92k08m88O42l53j92P15k98k19j38
1961i6m30Q54o67l99R28q53L05L26m59N57k73j15N68n35K53K32k72R0M7k3P19
1982G57l56k74L60m46L86j76m76N64o32K71J23j60p6o6j09M48n04j15N63n77Q9
2003d06J16l28P64n06j07O63m22L02J04k81Q46o56j26N68n48L84rm42O86n95k24
2024b17M76m43j22J58j61N50n74k59P06o31L23K40n26P41o13j79Q57j84k53M46
2044C35m14M71n28j66P48k28k90N13l33L03k12n12O39o50K11K13l19k24K48n40
$$ y = [354, -294, -239, -451, -602, 197, -647, -470, 222, -495, 4, 100, -153, 171, 22, -178, 714, -352, 298, 592, -24, 319, -111, -70, 617, -42, 152, 291, -155, 265, -107, -354, 199, -339, -338, -74, -553, 47, -348, -297, 154, -574, -379, 263, -246, 281, -59, -207, 351, 245, -11, 520, 51, 443, 235, -253, 389, 36, -156, 559, 261, 42, -96, -526, 328, -339, -738, 190, -663, -358, -32, -491, 66, -207, -322, 246, -289, -36, 196, -76, 14, 61, 38, 757, 401, 127, 487, 41, 427, 251, -225, 339, -293, -22, 101, -59, -135, -201, -310, 138, -366, -481, 82, -495, -406, -290, -618, 146, -360, -467, 196, -226, 76, 180, -101, 745, 89, -37, 531, -17, 367, 358, -84, 602, 7, -217, 259, -184, -306, -148, -309, 241, -333, -592, 114, -517, -194, 46, -480, 261, -352, -531, 326, 142, -111, 335, -79, 392, -136, -302, 446, 218, -72, 441, 108, 411, 199, -313, 326, -324, -113, 100, -219, -443, -195, -735]
2064g35O91j82k88O97n21R0L31l93O03k38m44R56p06J76M72o17M08j2J3j21k59
2085g9K05L06k70L4n0m33N25k62k85J55j93L40L4n87M52J63m43J88O1L21j77m09
2107d04P43k62l54O86r9J61k99k23N40k46n29P29l84j26K40k23K35k30l99O28
2127A84l75m87P01m47M33n1j70K83m58K07M77k57j61O02l94J69j94N4N64j052
2147c72P35k3o21M40j2Q1q2m55L25N8p41O48k91k47M02k16K95p6l82P75j74m25
2169c58M24k30M92j06n71R32l20n44O68j75k28R7k11M22n3o42P91n05j58M89n53
2190c39M58l43j47K96j35m4J78k49nM03n13N86J99l86L00l97J50M43p23O92j96
2211B28r0M15o22J03M46n98J88j4k91L50l96L86l2p53P76j96n06O04m8q6N1k72
$$ y = [-735, -44, -226, -514, 183, -338, -248, 83, -310, 293, 55, -389, 567, -139, 37, 509, -108, 300, 288, 301, 180, -79, 126, 432, 162, 196, 146, -287, 238, -24, -309, -154, -347, -7, 27, -560, -108, 55, -388, -200, -139, 182, 5, -404, 339, 77, -277, 409, 310, 471, 172, -51, 489, 243, -286, 443, 59, -67, 173, -50, 185, -45, -444, 184, -191, -678, 23, -424, 9, -42, -212, 71, -387, -180, 297, 40, -121, 481, 87, 256, 62, 116, 680, -372, 363, 340, -281, 159, 147, 228, 146, -309, 16, 74, -667, -19, -310, -557, -155, -371, -76, -152, -534, 241, 67, -358, 66, -164, 328, 222, -349, 583, 263, -281, 387, 212, -16, 81, -130, 292, 239, -403, 388, -117, -275, 214, -339, 119, -224, -371, -75, -210, -254, -76, -325, -330, 73, -440, 146, 345, -41, 259, -138, 12, 455, -268, 424, 228, 138, 553, -69, 34, 480, -118, 70, 56, -235, 115, -281, 105, 73, -680, 96, -100, -606, -2, -50, -136, -85, -357]
2233c57O82k24l75N34j19k53N11k50M7K30o45R28o41l14O31l04j69k0r7L20k33
2254a18k89N29m92J33K63m28J60N1j01O06n58J24L32l01L21J96m19J29l22K10
2274B6M47o43L60K80m42K64j73l75M94n97K56K08l05J66k88P7K70k90j1M76o54
2295d54N44j1o08N62j60J71R3k41M86L7l18J41k47j9M56n24N11m39l68O88m43
2316a43l0J21j93N19l57j39L00k75l18N61m11n7M16k01K39k37O5Q33q84L48M10
2337E67o99M65k35j3L10k96K08j5m78Q2K30k69J73l2j86J21k06R0L37o14L17j01
2359b44J34L75n15L3K68m17O11l45rL27j95K45j00q0L19l50k76N88l63n0K13l80
2381b11K46j52l74N47m07L75pl34K73o4Q4L41m96J34K64l21L60m46J93N00o49
$$ y = [-357, 325, 101, -274, 260, 141, -112, 399, 149, 196, 426, -219, 709, 68, -246, 385, 81, -88, -108, -205, 115, -118, -407, 122, -370, -237, 26, -402, -242, -191, -292, 314, -244, -120, 212, -89, 232, 428, 9, 138, -184, 26, 473, -170, 190, 470, 28, 292, 119, -256, 238, -359, -103, 105, -200, -34, -322, -245, 25, -265, -276, 200, -454, 90, 79, -529, 33, -127, 44, 137, -104, 382, 419, 101, 242, -5, -24, 432, -92, 419, -20, -388, 300, -143, -173, -52, -245, 274, -83, -222, 78, -197, -515, 46, -365, -422, -6, -207, 32, -205, -140, 693, -191, 157, 567, -132, 333, 98, 85, 395, 99, 307, 292, -186, -104, 126, -143, 30, -2, -188, -67, -273, -183, 154, -460, -143, -244, -110, 265, -250, -217, 51, -366, 245, -100, -109, 218, 23, 268, 168, 88, 407, 57, -219, 369, 6, -44, 169, -211, 35, -117, -491, 56, -351, 24, 17, -317, -44, -108, -24, 317, -179, -45, 219, -102, 258, -188, 5, 505, -144]
2402a44K36L64p87N95j2l57J91k15P0M83o82rL52k98J7k05o3K67l31O93o6j70
2424g1K33n62K17K52m65O44J97o73L43L6j74N74m63K3K05l21J82j55j27J46K5
2445F6j17K71r33N50J93k47K27j07Q0J87o86N13Jn4K32m20J96L37m54K45J30l44
2467a34L55j83r5K60k44l4K71l20K56j74L7Nk53n2L38j88m5J89j39Qk18J29N36
2490C05l44J3L27m21L15j50k0J73k31J16Q1l72M89n5m44N53m00L15j56k66J62
2511a0j76J88Nk87K81M1m10N32N9n19O46l27n3J9j01L78l55m0K97n3j20M97n61
2534f9M10p3j12J13l35N1K84j86o7Ll68M78k51J40R2m07K41Q3l14J97P7p3L73
2557B87n58J25K09k47M26k87o6K65j8p4Qk0K0J1j58K51l14J31K03k25n3q2m5K03
$$ y = [-144, 92, 456, -331, 264, 252, -105, 86, -129, -59, 424, -258, -267, 85, -213, -196, -401, -464, -197, -528, 165, 99, -71, 162, -400, -183, 69, -396, 248, 445, -228, 115, 151, -23, 551, 88, 111, 316, -5, 177, 22, -105, 41, 66, -51, 220, -713, -163, 30, -217, 10, -97, -17, 170, -516, -3, -2, -56, 176, -244, -48, 289, -165, 80, 210, -134, 221, 38, -57, 203, -41, -75, 196, -124, 132, -42, -5, 0, -253, -305, 33, -155, -200, -11, -150, -142, -360, -231, 305, -39, -26, 301, -120, 195, 45, 25, 198, -33, 83, 164, -208, 281, 226, -218, 335, -65, 250, 94, -172, -10, -186, 2, 7, -280, 1, 42, -368, 164, 223, -296, 350, 23, -30, -11, -112, 266, -89, -129, 168, 115, -5, 492, -69, 341, 268, 156, 269, -66, -15, 269, 83, 16, 19, -349, 129, -122, 18, 110, -297, -56, 27, -287, -90, -13, -86, 287, -271, -146, 63, -184, 242, -45, -111, 154, 136, 62, 70, 50, 70, 81, -77, 174, -140, -9, 194, -31, -84, -166, -211, -8]
2581hk09K28j42j48K03J3k84N08l28K34N0p6LL49m98L58R9l23K88k35Noj03J46
2605A24L3k53L71l37N3l64J88J24p8j85N43m92j0N23m34K84q6N9O2j89P9L84m20
2628b1K11J20m09K32n5j5K88m46J26p6l02N38k85o5L22m40N38l54k23L44k05O3
2650a14K71m10K92P9m79L18K09j92J81k0M2L34n49L91m1o85N37J24j51j49j02
2671a14Q4J87l60J22q2J02J17m13K85l6J46j04k02L06j5j41K67j87o8K55j0j71
2693c2M33n31J82K98m81M17l90J23J40l00L17n8l76J46N0r0K51k97k48N43m89
2714c92K06J34j86K23rK27N2k15J67q7m13P24m59K23o6j54K61m23j8J03p4J05
2736g1M23o46K99j17l15N94Q6l64l9k80J22L52n0J30j10m4L20j51n7m4n6J13k03
$$ y = [-8, -217, 11, -131, -279, -76, -63, -347, 161, -167, 67, 117, 41, 44, 393, -105, 253, 352, 29, 317, 82, 87, 81, -22, 124, 157, -96, 275, -62, -9, -373, -185, -61, -139, -324, 219, -273, -283, 240, -194, 90, 4, 63, 125, -64, 15, 399, -21, 190, 310, -99, 133, 78, 63, 351, -95, 31, -45, -347, 191, -94, -159, 163, -277, 261, -93, -316, 28, -177, -114, 157, -253, 39, 118, -361, -43, 166, -26, 155, 135, 177, 511, -38, 353, 312, -373, 164, 288, 137, -12, -114, -30, 157, -203, -81, -163, -61, 56, -357, -72, -108, 38, -66, -268, 38, 23, -118, 149, -38, -106, 149, 139, -32, 401, -130, 52, 350, -131, 286, -104, 19, 159, -141, 176, 118, -258, -112, -62, -152, 99, -198, -446, 97, -392, -186, -52, -238, -15, -24, 203, 255, 40, 207, 120, -293, 431, -28, 195, 129, -25, 236, -187, -205, -102, -176, -71, 352, -294, 5, -112, -427, 167, 253, -111, -150, -430, -308, 44, -6, 124, 14, -30, 290, 139, 82, 38, -18, 95, -108]
2759a08m1O87n50jK23m37J72J24j85L26l58j00M67n48L35j59LN3q2o5M07m71J49
2782a59K70l70L89k04J40K15k79N6J52j52J80l52P5J62j25J14j18j24K06P5l25
2803a74J00l3k39M88l31K78J27l88M21m99K19j8j0K78n5k00M29n84P2L74l32K5
2825e2J34P7q7m8L3K02m33K54K6l10J32o3k23L98m75L18O7j20K34m3K6k13K2r0
2849b34N34o31L38J27l55O14l34j4KR5K7k84q1K44k2j20M5k44j5L20j71J28P1
2872D0k45K15j61J34J69k55M32m32l94Q24l38j15L16k28J97j21j16n9K68J35R7
2893C63k26q6j32k7J54k31j7q7J92J87L4k30J03j38j4K28k10J29M7l12L60P2j22
2916C7q3M9K88q7l70K06O2L8O7J37m08K70m13K08n5L6J95p0k7J51l93J6K08l58
$$ y = [-108, -149, 538, -12, -13, 210, -227, -55, 69, -116, 210, -148, -248, 219, -329, 6, -153, -150, -97, -179, -244, 163, -308, -159, 111, -259, 130, -74, 66, 281, 2, 58, 210, 58, 238, -114, -39, 123, -2, 112, -6, -130, 76, 151, -174, -74, -107, -346, 142, -189, 89, 216, -172, 249, -250, -31, -49, -59, 219, 164, -36, 393, -191, -119, 255, -77, -52, 82, 159, 72, 24, 57, 259, -174, 80, 106, -204, -72, -135, -358, 40, -435, -117, -50, -170, 64, 21, 47, -166, -144, -234, 300, -331, 7, 134, -221, 393, 59, 45, 47, 142, 169, -115, -196, 48, 26, -94, -49, -293, -308, 12, -159, -31, 40, -205, 10, -151, -17, 152, -103, 329, -103, -497, 327, -11, -126, 190, -38, 159, 38, -78, -137, 131, 266, 363, 137, 51, -81, -108, 46, -185, -202, -289, -97, 90, 124, -106, -3, -141, -155, 73, -137, -8, 39, -273, 87, 159, 37, -46, 3, 291, 204, -166, 40, 102, 140, 207, 344, -64, 206, -207, 1, -54, -18, 177, 107, 80, 231, -162, -146, 62, -296]
2940b96L55j27k75L04l76K68M81m25M07k67j03L16l56O0M08n26K49n3KL8j94K0
2962i0K58l50K51j56k03L00l0j19K43j19j79M4Q8K01l50L87q4j67J34L4l04N16
2984C05k68J8O3j18K32J80l12k37PM6m8O0J01r1k13R0J38j34L46k13J17k16K33
3007H6J94k39O7J28n32Q4L35k59K97L8j82l0R8m3K6k19M58k27j21R2j66R0j60
3030a85k05N35l60J50J70k33m4L65k70j47M81k26p7l2N9K91l67N1mj9L58j66k1
3053A04K45k44n8K4l98N12l26O6M0M3j80J65j42Q3J6R1Q8k83L14j88j61o3K44
3076ho7K99k05L5K06k43O7p3j31LL16j81L9m6K1m0l30L55K8j39m4q1m4L03r0r5
3102a45J3o5K37n4j24R4k1K51L9j69m7k08K08P2k54J13jQ3l6r1pJ76k10L31k84
$$ y = [-296, 59, -68, -343, -39, -415, -147, 334, -91, 316, 49, -54, 262, -94, -34, 374, -152, 97, 44, 46, 84, -110, -90, 168, -182, 69, -87, -290, 10, -20, -139, 104, -15, -194, -150, -62, 139, -211, 176, 92, -75, 59, 93, -211, 305, 37, 55, 118, 0, 232, 412, 100, -137, -130, -84, -132, -72, 29, -62, -275, -185, -47, -181, 165, -48, 69, -147, 86, 280, 41, 108, 236, -296, -212, 123, -136, 161, 199, 17, -13, 85, 42, 68, -151, 307, 80, -41, 51, -115, -25, -185, -390, 145, -215, -65, 105, -128, -172, 193, -77, -224, 257, 31, -46, -78, -19, 272, -95, -44, -48, -67, 291, 125, 104, 349, 105, 47, 71, -327, 185, -141, -75, -35, 8, -172, -7, -149, -66, -50, 41, 129, -154, 160, -28, -189, -252, -8, -75, 224, 19, 54, 260, 17, 84, 11, -120, -117, 199, 18, 57, 11, 32, -8, -338, 17, 45, -94, -138, -219, -263, 40, -50, -145, -132, -197, 40, -14, -138, -44, -65, 186, 225, 56, 9, -199, 9, 81, -173, -60, -61, 22, -14, -105, -112, 64, -146, 185, -99]
3127i9j3n2O8O0J63o1p8Rj13J21l05J78O45q92M45J11l97K81k5K7J63p0p7J81
3151B70m48K8L39n94L18K12k73K16r0L0M9j50n1K37k73J54j7M72k22k34O4l9l9
3174d1J5q4J20O9K3o4p8o5M38k63j14Q6j87K97j27k08K03q9M1k82J49J03R1o4
3198c1J92k93k7K06R0K33k87j84K78m9j6J66j31o6mO8Q7j21l69N84l05Q2J6m53
3222c34L29k84L69O3l76J55J96k29J73j43j44J57k2P9J52k33K48l6rJ15j65K1
3244H2j32j84M70j25r8J58l1J5j79l2j62J72j0O0j72J85M0l33J92K15m56J50J71
3267dJ7J79m11J01J07j81J92J19L5J11k42J6K4N5P1k57k89M65m15J00L21k12k6
3290a24J93m35M55j85j2J13k80K42q8K35j25j02r8L12n05L21Q7K7L0n7J20j8J71
$$ y = [-99, -112, -164, -96, -36, 127, 66, -12, -3, -116, 5, -300, -122, 523, -369, 76, 187, -210, 71, 46, 73, 236, 166, 89, 270, -178, -150, 189, -405, -87, 125, -148, 68, -22, 8, 57, -93, -144, 93, -180, -26, -43, 429, 207, -27, 37, -2, -41, -26, -110, 10, 79, 102, 38, -40, -105, 333, 70, -44, 42, -145, 152, 25, -183, 20, -69, -28, -310, -161, -58, 33, -31, 161, -132, -159, 47, 137, 370, 83, -101, 177, 128, 112, 278, 147, 81, 77, 145, 232, 111, -258, 326, 21, 103, 119, -334, -5, -289, 80, 143, -233, -78, 118, -111, 62, -81, -225, -68, -90, -11, 141, -92, 156, 120, 111, 226, 61, 82, -50, -234, 236, 111, 13, 171, 140, 155, -24, -56, -218, -46, -56, 4, -168, 17, 57, -276, -84, 131, -325, -175, -4, 13, 192, -219, -118, -11, -192, 0, 119, 154, 265, 23, 39, 63, 118, 189, -68, -357, 108, -307, -207, 114, -98, -124, 69, -366, 89, -96, -108, 5, -275, -33, -121, 114, -11, -113, -211, 101, -404, -83, 4, 31, 61, 4, 124, 106, 277]
3313B77q3p1j05Q8q0l69M57k41L1R3j82L08j84J26J37k82k10M05k01Q3K4Ok00
3336a73J46mL49k51n0J87k62J81j9r7K75l87J70j04K38R0n13O4K87k78J31K24
3358B04j14J49j41q0K59q0k91N4q4J11pj0J97j90K85k47r5OK4j1J92m11K99nj16
3383a02J65k96J21L01l68j23L12k85J96K38k62K29L6q1K17l83J23J27j68J40j6
3404A21j09K74k53L04q2j7j58j63J27P7m4r0r8j62K49j34K23k4n7j70K97k15Q3
3427b1R6k38J90j33pL25k69J77j22j01K88q6k36M48l23Q8K01k60Q6j89P5j9m03
3450d33L64R4l46K86q7N0J04J08k36K75j88m9j43J14M1j17K77J12k22p3J31o4
3472bR1j19j71K52P9r5p9K83m2k38K70j2k31J63k62J00j23j74L44L9k37J24j22
$$ y = [277, 194, 123, 18, 106, 26, -343, 114, -127, -96, -3, -185, 123, -61, 65, 202, -80, -290, 115, -86, -3, 21, 27, -173, -27, -31, 318, 67, 17, 204, -58, 123, 104, 7, 282, -105, 65, -39, 199, 289, -224, -160, 127, -151, -20, 204, 90, 239, 98, 18, 277, 197, -94, -40, -124, -13, -20, -30, 167, -23, 262, 15, -80, -74, -50, -61, 131, -280, 19, 14, -102, 63, -233, -112, 189, -179, -302, 10, -275, -79, 159, -103, 126, 162, 81, 298, -85, 38, 165, -3, 137, 121, 12, 286, 33, 337, 255, 238, 80, -83, 44, 121, 77, -13, -111, -273, -24, -158, 65, 41, -16, -186, 111, -104, -21, 75, -163, 27, -106, -113, 212, -57, 120, -2, -103, 185, 99, -137, 311, -12, 76, 277, 17, 103, -86, -11, -30, -433, -69, 25, -321, -35, -122, -72, 32, 140, -96, 179, -9, -58, -201, -87, -46, -163, 114, 226, 4, -69, 62, -2, 89, -30, -201, 51, 130, 35, -44, 239, 197, -41, 229, 217, -14, 149, -113, -13, -136, -310, 34, 73, -164, -40, -162]
3495a62J47J15k86J48J56M9k4l3k57K85M8l51K74k04N4J70m20K44J28r8K4q6M8
3518c1R7k5rm3j02p1Q9M6p6Q2J41q8J13j92l9R5L02l38Q4j6k5J39M0n3r0J26k39
3545h3m4K3J31k35L46l22L63l13J57q8q5K39l64N34j27j04j86Q2K28j23K49k59
3567A9j20J37K19k68o6J27l9N3j09jJ18k18J14R4j8p2j8N3P3k68r3K35M0j3n6
3592g7K64n9j61j06L42j19o4k10L10o8j29J42K02l27K44j56k50L84l04L3K32k44
3614a21J11j20m5J96j10N0J96o2k95K60M2L6j22J43L43l36Q9l43j94K61q8K37
3636A28l21J13J84k4k28K28k3p3O3j22Q3q1k32N50m39O5K68j97j00K44k35K16
3658F7K52l51L73l54r5o8K20L7K9J6Q2k78J22k19L67k28K0j0j88K06o7K25l31
$$ y = [-162, -15, 100, -186, -38, 118, 167, 143, 110, -147, 138, 186, -165, 109, -95, -41, 129, -291, -47, 81, -17, 7, -79, -31, 66, 41, 32, -11, -113, -184, -95, -49, -125, -43, 98, 10, 123, -69, -108, -13, 289, -49, 35, 19, -6, 133, 173, 120, 30, 156, -83, -127, -104, 27, -208, 138, -184, 179, -134, 23, -65, -150, 89, -275, 259, 132, 28, -158, -76, 152, 29, 278, 19, -101, 36, 255, -13, -79, 48, 9, 62, -47, -48, 70, -148, -34, 60, 42, -30, -48, 5, 78, -190, -283, -48, -8, -21, -77, 187, 128, -33, -139, 203, 84, 20, -190, 120, 52, -77, 65, 267, -60, 184, 28, -222, 162, -142, -109, 123, -121, -10, -130, -175, 21, -89, -39, 157, 95, -200, 60, 102, 138, 16, 159, 502, 166, 255, -88, -282, -21, -109, 128, -193, -80, 104, 80, -148, 80, 57, -16, 47, -75, 8, -73, -305, 245, -194, -129, 139, -58, -158, 86, -149, 67, 319, -32, 341, -13, -108, -176, 44, 81, 110, 126, 208, -70, 52, -167, 200, -28, -8, -18, -206, 0, -67, 158, -173]
3681a73J40K52l06O8O6n7lj13K16J13k00J09O3n9J0O5K2j49j61K9P6J35J11j79
3705G5j01M82k01l00j20N9k0k4M4K09j73j30K67m7R3j57j10J38K08r5L9r6rK07
3729B38k22J58j02L09m28k92N75k25o9Q0O1j12K5J38J29j59m08K96k80M42j29
3750B5k5K5q9o5J06k00L66k73J29J42J49k16K70m25oL81l57n9Q5L2J11J16k09
3773A3p4j49J26K27Rk47J86k30K62r4j73K67j89J4Q9k62M03j95N9P4j37j80L24
3796A23l06K03l0R2K2l8O7j98K22l63L6K56K8m29J88L78k54k34K13q5J16p5o1
3819a29L11k88J32n0mj06K3L12j45j89K39j34P9j02m4j21L40l30J93J16j81J84
3841A06j16p6j30J14J11J06k25K52m7k68L00j09j33M7J01j56j5R7M8k15K85j41
$$ y = [-173, -33, 219, -87, -19, 47, -10, -13, -126, 90, 203, 3, 112, 175, 116, 126, 191, 213, 64, -97, -68, 8, 143, 254, 75, -26, 456, 255, -45, -165, -106, -126, -150, -106, 103, -70, -200, 67, 20, 113, -44, -154, -16, 192, 97, 136, 40, 31, 238, 16, 174, 72, 381, -47, -339, 236, 11, -58, 22, 83, -29, -4, 134, 263, 104, -304, -8, -288, 154, 25, 0, 25, -64, -129, -23, -223, 143, -130, -1, 141, 290, 74, 344, -81, -87, 294, -63, -122, -37, -5, 106, 222, 13, -61, -210, -84, 143, 152, -95, 91, -139, 123, 29, -144, 123, -66, -52, 37, -225, 178, -17, 42, 116, -21, -201, 123, -183, 20, -10, 82, 104, 66, 133, -65, 157, -206, -170, 86, 114, -315, -127, 251, -3, -237, -24, -109, 7, -68, -129, 182, -106, 26, -24, -28, -134, -111, 201, 56, -133, 106, -28, 51, -51, -95, -216, 124, -206, -13, 103, -78, 106, -10, -86, -216, -102, 9, 115, -110, 142, 95, -173, 127, 18, -115, -68, 33, -123, -138, -41, 7, -208, 77, -64]
3863f4m0J09k18K11k9M7q3K9K0o8J27p9j17L0L21k00l7Q1O6k12K04j59J03K42
3887B84l26l2J53j51J75J7k76M72l43M4P1Jj02q5K45j41q4m1J01J93R8l35o6L13
3911A85k63pK26q6PO0l0M3k4J67m24O9l1P3J31J07m42Q7K24k34L11k73j03L39
3935A12K0j96J6J29m15K88J89nO9l76K09j37p5K36J67j93K32j69l5k93L44k74
3957a57J48k05K46k70J00J11P6J71l32J64j57j24K20K72l23L29k37Q9l63L93M5
3978A96k15L63l43l2j38J76K03k78J04J50j47j27J51j33L40k58J95n21M94p1l30
3999b21K34j74K26k65L04l06K1R3K69l57J7k21L42J9o4j50K09J62r7L79m52r9
4021a31J0L66l00j02K59j32J38j81M1j60L12p8j34p3J57r2r6K17mJ16j91P7l69
$$ y = [-64, -104, 5, -213, -2, -31, 16, -67, -38, -18, -86, 41, -38, -155, -125, 196, -4, -41, 40, 106, -106, 98, -61, 42, 284, -42, -74, 79, -72, 103, 120, -156, 316, -27, 17, 88, 89, -13, -98, 147, 6, -78, -119, -18, 175, 273, -62, -128, 185, -78, -85, 141, 55, 62, 122, 92, 135, 111, 278, -146, -77, -108, -35, 96, 203, -239, -152, 72, -162, 149, -124, -227, 112, 132, -64, -48, 81, -334, -46, 143, 138, 207, -169, 40, -97, -172, 64, 231, 38, 270, 101, 66, -227, 117, -157, -9, -214, 32, -238, -138, -27, 49, 220, -112, 52, -105, -229, -9, 263, -60, 269, 32, 121, -242, 151, 196, -19, 344, 1, -31, -169, 7, 210, -68, 36, 186, 39, -88, 63, -70, 270, 12, 207, -314, 180, 109, -221, 13, -161, 65, -200, 104, -202, -181, -88, 181, -176, -159, -380, -38, -19, -83, -233, -24, 138, 41, 420, -32, -131, -121, 245, -55, -157, 102, -30, 108, -73, -32, -192, 120, 42, -92, -165, -8, -100, -196, 21, 17, 133, -58, 19, -350]
4044c50N46k4j38j08K66j40m6l4M4j23L3J09o1J99o4o8Q2L1j61o4j8K18l71L19
4068G7j39r6J63p1J56k79pK6L01p9J91k85J6J18n0J28k11P0mR2m2L5l6j3j19q4
4094a42J26p6J3L42m77L23j66J43j2O5r2N0J3ml8O0l95O37m50J21R8j00k47N79
4118C71m76n2L81M5m69L62p2l13J81R1j63O3P6r7J52k04J78n0N1l9O8j12K9L63
4142C64k63M5j10n8K4J47J08k50N5m9K66m63M29m6l32J4O4j03J73l2l0j2n3r4
4166b06J24j9K43q8J87m13K63O5k17J40l05O06m54K34N2j84J93k13J1M6n5k08
4188a98j8M23k83MP6o2M1P2k33J91j57J29rj90K30j62j9L52j32J42jl49J57rJ9
4213A4j33L95j28l20N95m51J50K3j14J33k78M5l6J20K4Jj73k8n7L44k44M10k86
$$ y = [-350, 196, 172, 34, -74, 192, 52, 6, -28, 16, -107, -74, 35, -26, 173, 109, 41, 123, 154, -7, -71, -89, 129, -242, 77, -62, -158, 5, -66, 90, -189, -196, -170, 131, 52, 243, -42, -26, 92, 42, 170, -41, 29, 25, 117, 75, 110, 74, 61, -58, -142, -16, -92, -79, 263, -214, 109, -57, 86, 74, 139, 47, 97, 110, 106, 68, 128, -267, 370, -80, 41, 139, 39, -208, 371, -105, -157, 224, 269, -200, 162, 90, -223, -42, 49, -114, -51, 25, -72, 80, -124, 54, 4, 55, 16, 84, -28, 1, 364, 101, 146, 36, -22, 2, 149, 257, 7, 62, 13, 279, -184, 245, 199, -133, -119, -55, -158, 15, -17, -47, -59, -112, -206, -82, -101, 142, 54, 241, -172, 91, 156, -61, 79, -226, 380, -74, 160, 212, 28, 221, 8, 19, 65, 10, -198, -216, 207, -76, -72, 4, -58, -17, 55, -178, 13, -144, -15, -24, -214, 16, -146, -165, 187, 55, 197, 196, -153, 4, -5, 14, -119, 276, 148, -172, 423, -28, 122, 145, 31, 164, -114, -69, -105, 15, 39, 40, -133, -161, -218, 126, -118, 292, 6]
4236FJ4K0j89J86q1j49N8K85j42j55J17k5J09j63N1j35P4K3Q1o8M3O0J57k48q
4261g9J62q4j00N6j33L59k03M6j16J0j2J27r4M7L9J26j21q0K1K6N4j82L61j52
4285G8k15O9M7l32K98o3J8J25o6n7k6j35N07k93J50k27P1O3j28O6J21l35M09M1
4309A86Q1k85J88k20K6K03r0J24l91P5R3K80j96k98J03J24J73j41j60K5J96l44
4331b48L55r4m7J03L9r3n1J23k34L32j0J6k41Jj73K98l8K11o3k67J29k9j38K5
4355i4J75N9k77Q3M7l9r3J71j02J15m0J36nr1l11J63n7J61J35k03K24k64m4J2
4379a39J0L12l3k87J66o2q7K15k8j88k3N3R1Kp7J01m9J09J08k16J72l97K52o7
4403f2K50j87J55l33J80P7l9j21k3J35k3J47j91O6J59l28n0L23j05k09K63J84
$$ y = [6, 20, 40, -149, 37, -44, -193, -135, 150, 8, -147, -30, -55, 54, -109, -58, -193, -119, -96, -15, -83, -40, 20, 177, -71, -79, 83, -1, -101, -45, -178, 181, -22, 24, -92, -82, -94, 33, -61, -14, 25, 151, 30, -50, -29, -3, 51, -131, 230, 78, -137, -68, -21, -353, -55, -118, -100, 25, -41, -98, -124, -259, 248, -45, 105, -122, -51, 12, -116, -50, 71, -264, 145, 186, 267, -18, 170, -50, -24, 179, 89, 213, -178, -103, -10, 270, 74, -224, -121, 3, 176, 35, -125, -100, 96, -248, 107, 13, -34, 69, 108, 15, -36, 87, -147, 185, 175, 191, -50, -49, -222, 76, 38, 249, 186, -81, 48, 19, -119, -94, 81, 140, -137, -54, -7, -46, -139, 32, -70, 45, 5, 141, 136, 45, -266, -103, -160, 1, 136, -67, 157, -107, -151, -139, -129, 183, 150, -137, 29, -33, -120, 95, 67, -121, -144, -91, 0, 2, -75, 26, -23, 86, 194, -22, 150, -247, 5, -62, 188, 1, 156, -177, 3, 80, 41, -80, -103, 32, 9, 156, -35, 31, 190, -138, -188, 135, 30, -179, 84, 268]
4425B68o02J49J94j14j2J77j64k38N14k52J6J6k7k4k0Q2k99L39j53j20L28j2J9
4448F5J0l61K14J03KJ8j95j5J88j46r3j57M00k48L08P1k15l3K01j86K79j14j26
4471c0k6K49j8J53k79j00J89jn7p3J68l39N0K56j02q2J31k98L02p6J45r6L8j01
4495CK24l52K43K1j44j12M4kN9J22l7k05P6J65k74J51o1J15j38J25j08K53k69
4518a01k7j94L38j5J54k36k2R2R5q9j91K51j45K38j26lP5j64K6J66k8r5m6j00
4542a47M5l7O3k0M7j47N5L34k59j21K65k24L38k77l4J74m6m5J59p6P4k71k24L18
4566e6j74K41J12j01k10M15k45k3K92k84m0L2J47j36o2J77M4k55J57Lk22l1K20
4589Ap1J69J38l7n12M61j43o7J65n8j23j58L65l28J92p5R2j54K83k76J40j48J12
$$ y = [268, -334, -185, 9, -105, -117, 60, -104, -342, 172, -80, -64, -48, -75, -99, -119, -37, -336, 3, -150, -270, 58, 46, 65, 75, -286, -72, 31, 33, 51, -144, -159, 29, -117, -210, -367, 33, -215, 93, 164, -51, -84, 117, -69, 210, 96, -30, -56, 193, 175, 328, 49, -51, 138, 137, 80, 7, 175, -164, -114, 142, 40, -42, 89, -209, 93, 17, 162, 66, 104, 3, 227, -125, 118, 139, -5, -117, -73, -75, -16, 106, 69, -136, -60, 105, -169, -18, -79, 36, -102, 23, -85, 168, -101, -128, -322, 16, 1, 155, -81, -103, -11, 84, -5, -196, 55, -90, 148, 22, 19, 94, -70, -44, 122, 94, -1, -47, -147, -102, -139, -76, -96, -49, -196, -141, 193, -66, -187, 78, -146, 192, -85, -119, 55, 9, -36, 123, 47, 121, -150, -374, -56, -230, 11, 123, 22, -188, 227, -18, -41, 251, -33, -73, -41, 106, -30, -92, 85, 129, -126, 31, 34, -188, -219, 1, -70, 99, 237, 200, -312, 149, 6, -61, 104, 46, -77, -235, 130, -198, -6, -81, 11, -143, 140, -136, 4, -144, -32]
4612c2K26k25L9J1P8k46N06m87K13p8L2p1K22k50K2M5N7j63M12k09P0J27l54J12
4636E7Q6j00k38K84j19J62Rn7k13J72r5K5oJ7O5M4j06p0J14j74J64o2J00j58K57
4661A58q2kj24M1N2j41L2R8m7k5p5P6n9j30M54l31J33K06k96J79j45j80L85k24
4685d7j59J61j74L25o5q9k1Q9J2J51r0p0L59m09l6m8k9J18J52j52J8p5k7M5R3
4710C2j91R0j88J49J72q1J31k22Q6P4k26M35k55J07K17k86j69jJ00J57j32P5j1
4733F3k60L93k01J16Q9k35%j82K02P2k22L23j11j35J64K65l88n0J05R4m9j0j40
4756i7nn6jL3j27L08J18j32m39N92k5J0l22Q1K9J17p9Q3Q8k39P9L7N7k46M44l02
4782Fr8O5J0r1nK5J03j36j03L18j12j95K34J22n0O4j22j08p4j67L71r7l0J41J62
$$ y = [-32, 194, -31, 8, 19, 97, -149, 357, -130, 83, 5, 37, -34, 188, -62, -40, 5, 62, -101, 311, 102, 172, 299, -55, 57, 143, 43, -195, 89, -30, 132, 141, 84, -129, 43, -52, -27, -33, -16, 49, 93, -13, -83, 31, -143, 21, -41, 59, -99, 158, 76, 74, -50, -9, 43, -98, -66, 32, -15, -40, -115, -39, -98, -228, 226, -105, 28, 234, -62, 117, -28, -208, 177, -47, -206, -45, -219, 106, 41, -48, -69, 20, 32, 183, 93, 23, 382, -27, -63, -111, -140, -22, 130, -22, -4, -79, -106, -61, 32, -159, -69, -257, -108, 64, -17, 114, -108, -22, 52, -174, 261, 6, 113, 330, 44, -125, -126, -26, 131, -1, 74, 63, -197, 196, -5, 111, 200, -35, -35, -217, -15, 57, -165, 158, 47, -88, 76, 341, -47, -97, 8, 102, 53, 43, -97, -102, -158, -159, -126, -253, 55, 173, 41, -398, 194, 169, 179, -143, -62, -33, 84, 5, 88, 176, -63, 16, 53, 110, -136, 308, 6, -92, -27, -17, -108, -113, -88, 15, -121, -224, 94, -18, -213, 21, 143, 93, 157, 35, -73, -147, -314, 57, -40, -70, 71, 233]
4807B33m15K27k25M42l42K10k40J19N5j22K22o0m9QJ67k42M7k99R2K86k50M7m
4830i3J5J60k88J76p4J01J97k60J36j99K49k40K78k90P4m8J50J26m3o5j6l14J40
4853a28K0J18oJ63k1p9k63lK63l12L74k15j52L13K8j22J44j31J80k26k2l2k5L48
4877B14n0j29o0J06j11L7LJ69j16o9j85o4K03k00Q7K98l37K95j56L00k38j10J64
4900E1J98n9j17L5j99J68k64K04j74J51L1j1j84J42K41j16o3m3m2K18j55j42K82
4923A52r8k42N45l41k1P4j06J51L3P8k98K36j78j6K20m3P4j84Oj76R7J29L0o7
4947E5p5L4O0j57P6JK7j33k4P5J25n9K3k1J23j04j05Q8j73L66k7o3k26R8J82j09
4973E7m5o3k2J01j69J72k31K85nN5L4l18N6J66j09o0K41l34J53J94k66J72q3K31
$$ y = [233, -182, 45, -180, 262, -80, 130, -110, 9, 64, -58, 164, 104, 55, 63, 230, -12, 35, -264, -172, 114, -136, -89, -93, -78, 82, -206, -30, -104, -3, 194, -66, 70, -129, 120, -120, 158, -132, -58, -106, 44, 170, 127, 62, 46, -268, -128, -108, 10, 4, 167, 146, 67, -196, -199, 64, -248, 126, -89, -241, 72, 100, -22, 122, -9, 171, -55, -77, -109, -134, 214, 164, 35, -25, 81, -30, 7, 10, 179, 63, -6, -191, -255, -52, -252, -165, 133, -204, 91, -65, 235, -3, -113, 51, 249, 190, 73, 108, -91, 77, -187, 17, -157, -6, 25, 14, -170, -28, 213, 97, 34, -9, -51, 167, 12, -130, 152, 54, -188, 357, 16, -5, 69, -37, 114, 147, 225, -73, 163, -15, -31, 189, 146, 220, 36, 42, -134, -37, 92, 122, 55, -20, 14, 74, -83, -7, -6, 21, -112, -136, -61, 64, 5, 28, 7, 130, 26, -79, 9, -164, 202, 175, 112, -114, -16, 166, 57, 12, -51, -73, 28, -141, 31, -200, 85, 80, 135, 169, -149, -93, 73, -36, -96, 145, -189, -36, 158, -108, 64, -19, 212]
4997B12j37j14j25K33k73Q8l1M65m85K96q9m0j02j00K09RP2J45k99J6J9L38l91
5020h4M2J16Pn5j90L90j23j14lp8O8J16j32p6K6K99k64J18p7K21k50L4q3K9K52
5045A89m96N36l34J28K04m16RP8K17k03J76j55l7j4M8L5J33l01P5K58r1N8j59
5068f2M1Q1j4n2k17J74J28l3J5n2j79K66l37O6L43M5k32j10K15j41J14j51L04
5091B12m29M11j39q5jl4L7L9N6k23K02q6n8L4J81j01O3j55M9J73l39L55l09J39
5115hj62J96J50m8P3l24J40Q7o7J24l12O3Mk6L06j73n6Q4r3K36n21L45J25j04
5139C9j57K4L23j80j10R3l2m9J12j10J02R0J4j03m4j37K18k19q3J13J14k68K54
5162DJ90Pj40oO9o8k36K99k68J55kO5j16p3K00j18k6O4m5K62k86K4M9M9j35J18
$$ y = [212, 75, -39, -164, 69, -204, -116, -147, 318, -167, 129, 40, 0, -102, -202, 7, 16, 88, 233, -66, -50, -31, 307, -84, -42, 74, 81, 26, -164, 226, 103, -11, -14, -92, -24, 92, -40, -116, -90, 209, -55, 63, -14, 207, -43, -9, -92, -63, 189, -307, 229, -105, 23, 227, -189, -180, -102, 115, -88, 88, -67, -104, -118, -70, -35, 98, -203, -128, 130, 39, 97, -62, -21, 60, 46, -6, -223, -49, 79, 46, 61, 9, -170, 96, -241, -175, 168, 213, -19, -129, 86, -55, 59, -92, 212, -217, 194, 55, -30, -31, -65, -28, 11, 67, -156, 46, -40, -98, -64, 117, 16, 79, -76, -27, 146, -193, 162, -147, -8, -170, 26, 176, 128, 201, -123, 17, 104, 37, 161, -151, -88, -84, -110, 196, 23, -33, 51, -42, 194, -327, 18, 143, 39, -118, -94, 229, 49, -61, 32, 0, -49, 63, -47, 55, 145, 159, 56, 12, -125, 93, -126, -209, -96, 18, -250, 4, 194, 201, 61, 55, 124, 56, -180, 119, -149, 6, 4, 69, -47, -120, 80, -38, -64, 0, -45, 217, -69, -45, 4, 53, -82, 36]
5188C6k37J58N0n8J04m6j6j75J89j37O0R9qj3N2j43M5L3M4P7Q5l49K82j09p4j36
5214a87M49l40j25M73k56lK9j65J91K5Q0k12j62K94l28L42k39n9J18P0j10K52
5236A37k18j38K60O8j11K11k20o0k14K67r8R3J54K8j60R0n8j21L41k64Q9L1l1
5259G6n7JM6O3J03n47L16O7j85J73J66l66O9K72p1n64M57j4j3k6L1R7m17K38L47
5284B62j33o4J31l75K28j76J64K5r7P4n6J41l04J83Q9j65q4K02l3j00L04l21R8
5307gM9%J2P1l14L17j42Qrk49L90j92MqL04l05j15L36j74r1K24l90P8J97l8L1
5333a3o2J55Kl2K8j17J08o9l49M48j14j17K26P3J6j72j8j46K93J16o15J27K02
5356c0j34K80J43j43j82j5j53J7N99j28l82j41K86N5O3j27j31j24L59r1j55J78
$$ y = [36, -201, -43, 7, -51, 53, 7, -9, -184, 5, -132, -72, 27, 19, 6, 58, -85, -40, -7, 37, 114, 199, -150, 132, 23, -51, -187, 262, -78, -203, 270, 14, 11, 40, -125, 66, 91, 171, -41, -203, 91, -237, 105, -134, -193, -75, -5, -115, 137, -81, -219, 41, 109, -2, 209, -11, -71, -285, -18, -116, -23, 131, 159, -1, 89, 31, -90, 251, -13, 76, 107, 76, 19, 20, 66, 129, 232, -315, 1, 68, -117, 56, 222, -144, -75, 197, 126, -438, 19, 5, -8, -34, -3, 94, -323, -85, 262, 129, 65, 196, -179, 49, -127, 37, 62, -35, 39, -17, 124, -180, 3, 92, -73, -157, 45, 12, -88, 216, -105, -7, 42, 42, 54, 125, -189, 128, -14, -6, -15, -264, 126, -66, -62, -70, 234, -71, -186, 150, -24, -115, 109, -281, -203, -6, -44, -13, -75, 80, 82, 50, 78, -39, 69, 0, -349, 99, -15, -132, 94, 167, 183, 11, -7, -153, 140, 256, -359, -232, -30, -164, 116, 259, 116, -66, -81, -234, -217, 382, 254, -128, -269, 17, 72, 135, 8, -123, -247, 112, 21, -134, 44]
5378D4m5J9k62K95k6k26K69j32q3o4K61J14Q3j72k25M31l78J50k97K35q3J5J47
5401G0QN6J8j84J03J3O0k41O1j5J10P6j58j08r9K48l1j63K55J23k87pP3L6M39
5426D56o30Q1J4L59k91l4kk39K20O3N2J09j71R0J0r5M7pj59J78l3k3J28J21m74
5451b30K42j43K23k55J55J98k8k72L70l86J5j44L45Lj41P8k42K14r1lN7k6j16
5474a77J78n0Q4K04k08p5J49m6n4j30R5K04k60K22k12J4m6l8j5J66J41Mj91K40
5498A99k02j3L22k12j7J80l17k95L55j8J31k11j98K20J15l4K8J43j33m7J53j88
5520c9oJJ75j64k32K81k03J40K40J2p2l62L30j13j60J53J7l7J10j94J87q7K17
5543A94k03J33k35L14j04k95L19n2j72Q0k12L77l38J00L3JJ36l07L56j41J55k96
$$ y = [44, -1, 18, -244, 51, 25, -201, 68, -64, -147, -211, 50, 164, 247, 75, -150, 281, -97, 53, -244, -9, -92, -77, 70, 78, 134, 152, -32, 71, 84, 144, -97, -36, -51, 59, 135, -23, -131, -230, 18, -13, -176, 79, 202, -85, -92, -19, 17, 456, -174, -93, -79, 280, -11, -45, -47, -286, -66, -3, 49, 158, -13, 77, 87, -8, 39, 32, -127, 51, 18, -5, 123, 244, -230, 12, -131, 92, -163, -8, 190, 162, -110, 260, -126, -111, -255, 90, 93, -48, 30, -212, 2, -89, -92, -35, -61, -177, 1, -49, 35, 239, 31, -44, 105, 59, 5, -125, -30, 174, -86, 136, -76, -62, -108, -146, -161, 5, 146, 150, -41, 199, -3, -16, 306, 94, 77, 257, -60, -355, 0, -18, 113, -98, -296, -76, 39, 5, 33, 176, 43, -4, 149, -39, -45, -44, 131, -33, -265, 16, -187, -47, 193, 205, 133, -229, 101, -12, -172, -19, -2, -39, 71, -123, 64, -23, 194, -9, 124, -111, 203, 99, -196, 123, 71, -101, -21, -233, 144, -194, -94, -61, -60, 76, -231, 125, -16, 139, -157]
5565a57L72k83K32k90n4J84Mq9J25j70L3K9R9j00M1K63k81K02j64k46K67j5j25
5588a23K14q2m1K46k11p0K13j45J2j26J30o2j56K54m6J69q2j76K70j87K2j54O6
5611f5J05k0k6j83K09o2J18nj56j61M06j94L77j79l78K56J00j44p5L1Q5L03m87
5634a45K50k32L94nl71L34k50J56k02L84n80M58P6l71K41Jj35L3k06K88L7l20
5656a65L63q3j81k9L5K00j39j6J73l54K55P6j35J73k23J93k42J81j09J52N6l11
5678a30J90p1r5J02j73M30m17J8K71k78J78m0K0K1l6Q9m9J13l19J53N6k46J82
5701c1p7K08J21j07r9P2k46J39q4K63l34L65j57l54M54k25R9l30K09K3J91R4q1
5724A13o4k18J94P3J02o23M97K6R7j92K30l51K36j60j73K1Q3j06M53l13p2Q1J9
$$ y = [-157, 215, -68, 164, -126, -180, 4, 8, -81, 44, -126, -93, -64, 35, -65, -24, 239, -42, 160, -4, -250, 17, 2, -123, 91, 9, -32, 214, 3, -67, 146, 1, 13, -113, 17, -45, -201, 53, 7, 176, 94, -82, 188, 1, 23, -131, -65, 40, 20, -6, -189, 20, -42, 76, 71, -85, -246, 160, -34, 343, 164, -214, 42, 142, -2, -77, -46, 39, 342, -145, 105, -127, 267, 262, -109, 225, -25, 131, -71, 313, -267, 191, 267, -104, 137, 138, 3, 36, -170, 118, 155, -165, 198, 115, -66, -95, -60, 140, 1, -15, 158, -196, 59, 135, 0, 173, -50, 143, -99, 82, -27, 125, 181, -130, 60, -11, -106, -4, -177, 253, -164, -146, 125, -153, 25, -15, 5, 26, -10, 79, 30, 143, -176, -23, 33, -213, -31, -108, 100, 221, 114, 15, 87, -159, -20, -104, 159, -175, 190, 33, -321, 133, -92, 7, -323, -114, -91, 100, 194, 113, 49, -169, 25, 98, 200, -423, 74, 100, 197, 5, 235, -116, 120, -40, -213, -192, -109, -215, 238, -75, -147, -66, -47]
5747d7LJ97n3p7L8m48L84M7k7j41QK23p8o7k0n9L53j18o1k7M8j71J50J26j99p1
5773h7K06j96J74j96L38l3k79K88l40J98j40J22k2p5P1j78J26Lk38K86j60K31
5795I9k7j24M62m66L22l0j48j0K2k15J75l67L54o7R0k93J74J76j79m3j07J79J09
5818H6j10q9L75k71J74j49J31j38LJ3j60L88m02L8J63j01Q8J09j03M8q3m8K2P9
5842F3j4KL5j69O6J72j44N1j57M9j00J02nk1J66L3J8j87Q9R3J13j85j80R4r3P1
5868c8qn0J66kr0l15K04K1J15k19L04r5l1p7O8j09K62j7l96K10K16l47J03J55
5892C0M3J49k17J69l14K27q3j6n4QM1N5p9N6P0l2o6J80p6l68M22l32O3J86l15
5917b53K67j42L48k90K01J00l09O5o6K25q0K12k48Q2K5m4k69K45k6L2m1J35l1
$$ y = [-47, -44, 153, 100, 23, 61, -387, -3, 44, 17, -124, -116, 107, 29, -38, -58, -117, 236, 118, 57, 30, 78, -93, 57, 183, -16, -87, 119, -77, 97, -99, 239, 206, -73, 215, -125, 73, -67, 55, 33, -42, 29, -149, -23, -20, -258, 28, -132, 99, 72, -52, 410, -56, 266, 236, 88, 78, 100, -115, 60, -307, 47, -20, 70, -223, -49, 127, -52, -95, -202, -23, 86, -24, -113, 262, -9, 165, 16, 147, 9, 12, 25, -135, 253, -149, -111, 52, -49, 39, 148, 45, 93, 10, -38, -16, 63, 49, 51, 86, -83, -17, 155, 11, 62, -95, -46, -146, -44, -49, -70, 96, 129, 147, -40, 49, 142, 255, 70, -110, -16, -109, -38, -46, -96, 70, 68, -22, -337, -133, -112, 3, -216, 88, -7, -38, -115, -47, -156, 106, 89, -307, -97, 119, -228, -125, 30, 73, 222, 5, 174, -140, 87, 4, -12, -66, -58, -17, 38, -41, 15, 85, 53, -13, 167, 91, -277, 145, -187, -124, 62, -253, 14, -128, 220, -70, 131, 231, -78, -13, -79, 146, 66, 278, 30, 112, 137, 93, -176, 69, 43, 75, 34, 169, 138]
$$ [...]
8191B03
##END NTUPLES=NMR FID
##END=
