##TITLE=1H_Pr 117
 200.13MHz, D2O,
 8 sc
 
 4.3.2025
##JCAMPDX= 6.0         $$ Bruker NMR JCAMP-DX V2.0
##DATA TYPE= NMR FID
##DATA CLASS= NTUPLES
##ORIGIN= UXNMR, Bruker Analytische Messtechnik GmbH
##OWNER= pz
$$ XWIN-NMR		Version 3.5
$$ Tue Mar  4 14:46:47 2025 Russian Standard Time (UT+4h)  she@DPX200
##.OBSERVE FREQUENCY= 200.1313
##.OBSERVE NUCLEUS= ^1H
##.DELAY= (6, 6)
##.ACQUISITION MODE= SIMULTANEOUS
##.ACQUISITION SCHEME= undefined
##.AVERAGES= 8
##.DIGITISER RES= 18
##SPECTROMETER/DATA SYSTEM= spect
##.PULSE SEQUENCE= zg30
##.SOLVENT NAME= CDCl3
##.SHIFT REFERENCE= (INTERNAL, CDCl3, 0, 14.3821)
##AUDIT TRAIL= $$ (NUMBER, WHEN, WHO, WHERE, WHAT)
$$ ##TITLE= Audit trail, XWIN-NMR		Version 3.5
$$ ##JCAMPDX= 5.01
$$ ##ORIGIN= Bruker BioSpin GmbH
$$ ##OWNER= she
$$ F:/spectra/data/she/nmr/H-C/1/audita.txt
$$ ##AUDIT TRAIL=  $$ (NUMBER, WHEN, WHO, WHERE, WHAT)
(   1,<2025-03-04 14:45:27.71 +0400>,<she>,<DPX200>,
      <created by zg, POWCHK disabled, PULCHK disabled
       configuration hash MD5:
       00 E9 B6 7A A2 85 ED C7 34 08 36 98 17 FE 4E 26
       data hash MD5: 16K
       FE A1 16 06 35 B1 ED BC 42 72 BA FF 3A BF EA D5>)
$$ ##END=
$$ 
$$ hash MD5
$$ 4D C4 CC FF 32 EA 49 97 E8 DB 94 37 9A 9F 78 09
##$RELAX= 
##$RELAX= 
##$RELAX= 
##$RELAX= 
##$RELAX= 
##$RELAX= 
$$ Bruker specific parameters
$$ --------------------------
##$DU= <F:/spectra>
##$EXPNO= 1
##$NAME= <H-C>
##$PROCNO= 1
##$TYPE= <nmr>
##$USER= <she>
##$AMP= (0..31)
100 100 100 100 100 100 100 100 100 100 100 100 100 100 100 100 100 100 
100 100 100 100 100 100 100 100 100 100 100 100 100 100 
##$AQSEQ= 0
##$AQ_mod= 1
##$AUNM= <au_zg>
##$AUTOPOS= <>
##$BF1= 200.13
##$BF2= 200.13
##$BF3= 200.13
##$BF4= 200.13
##$BF5= 200.13
##$BF6= 200.13
##$BF7= 200.13
##$BF8= 200.13
##$BYTORDA= 1
##$CFDGTYP= 0
##$CFRGTYP= 5
##$CHEMSTR= <none>
##$CNST= (0..31)
1 1 145 1 1 1 1 1 1 1 1 1 1 1 1 1 1 1 1 1 1 1 1 1 1 1 1 1 1 1 1 1 
##$CPDPRG= <>
##$CPDPRG1= <>
##$CPDPRG2= <>
##$CPDPRG3= <>
##$CPDPRG4= <mlev>
##$CPDPRG5= <mlev>
##$CPDPRG6= <mlev>
##$CPDPRG7= <mlev>
##$CPDPRG8= <mlev>
##$CPDPRGB= <>
##$CPDPRGT= <>
##$D= (0..31)
0 0.7 0 0 0 0 0 0 0 0 0 0.03 0 0 0 0 0 0 0 0 0 0 0 0 0 0 0 0 0 0 0 0 
##$DATE= 1741085127
##$DBL= (0..7)
120 120 120 120 120 120 120 120 
##$DBP= (0..7)
150 150 150 150 150 150 150 150 
##$DBP07= 0
##$DBPNAM0= <>
##$DBPNAM1= <>
##$DBPNAM2= <>
##$DBPNAM3= <>
##$DBPNAM4= <>
##$DBPNAM5= <>
##$DBPNAM6= <>
##$DBPNAM7= <>
##$DBPOAL= (0..7)
0.5 0.5 0.5 0.5 0.5 0.5 0.5 0.5 
##$DBPOFFS= (0..7)
0 0 0 0 0 0 0 0 
##$DE= 6
##$DECBNUC= <off>
##$DECIM= 32
##$DECNUC= <off>
##$DECSTAT= 4
##$DIGMOD= 1
##$DIGTYP= 9
##$DL= (0..7)
0 120 120 120 120 120 120 120 
##$DP= (0..7)
150 150 150 150 150 150 150 150 
##$DP07= 0
##$DPNAME0= <>
##$DPNAME1= <>
##$DPNAME2= <>
##$DPNAME3= <>
##$DPNAME4= <>
##$DPNAME5= <>
##$DPNAME6= <>
##$DPNAME7= <>
##$DPOAL= (0..7)
0.5 0.5 0.5 0.5 0.5 0.5 0.5 0.5 
##$DPOFFS= (0..7)
0 0 0 0 0 0 0 0 
##$DQDMODE= 0
##$DR= 18
##$DS= 0
##$DSLIST= <SSSSSSSSSSSSSSS>
##$DSPFIRM= 0
$$ [...]
##$SUBNAM0= <"">
##$SUBNAM1= <"">
##$SUBNAM2= <"">
##$SUBNAM3= <"">
##$SUBNAM4= <"">
##$SUBNAM5= <"">
##$SUBNAM6= <"">
##$SUBNAM7= <"">
##$SUBNAM8= <"">
##$SUBNAM9= <"">
##$SW= 18.0517328524113
##$SWIBOX= (0..15)
0 0 2 0 0 0 0 0 0 0 0 0 0 0 0 0 
##$SW_h= 3612.71676300578
##$TD= 16384
##$TD0= 1
##$TE= 0
##$TE2= 300
##$TE3= 300
##$TEG= 300
##$TL= (0..7)
0 120 120 120 120 120 120 120 
##$TP= (0..7)
150 150 150 150 150 150 150 150 
##$TP07= 0
##$TPNAME0= <>
##$TPNAME1= <>
##$TPNAME2= <>
##$TPNAME3= <>
##$TPNAME4= <>
##$TPNAME5= <>
##$TPNAME6= <>
##$TPNAME7= <>
##$TPOAL= (0..7)
0.5 0.5 0.5 0.5 0.5 0.5 0.5 0.5 
##$TPOFFS= (0..7)
0 0 0 0 0 0 0 0 
##$TUNHIN= 0
##$TUNHOUT= 0
##$TUNXOUT= 0
##$USERA1= <user>
##$USERA2= <user>
##$USERA3= <user>
##$USERA4= <user>
##$USERA5= <user>
##$V9= 5
##$VALIST= <valist>
##$VCLIST= <CCCCCCCCCCCCCCC>
##$VD= 0
##$VDLIST= <DDDDDDDDDDDDDDD>
##$VPLIST= <PPPPPPPPPPPPPPP>
##$VTLIST= <TTTTTTTTTTTTTTT>
##$WBST= 1024
##$WBSW= 4
##$XGAIN= (0..3)
0 0 0 0 
##$XL= 0
##$YL= 0
##$YMAX_a= 286921
##$YMIN_a= -308508
##$ZGOPTNS= <>
##$ZL1= 120
##$ZL2= 120
##$ZL3= 120
##$ZL4= 120
##$ABSF1= 10
##$ABSF2= 0
##$ABSG= 5
##$ABSL= 3
##$ALPHA= 0
##$AQORDER= 0
##$ASSFAC= 0
##$ASSFACI= 0
##$ASSFACX= 0
##$ASSWID= 0
##$AUNMP= <proc_1d>
##$AZFE= 0.1
##$AZFW= 0.1
##$BCFW= 1
##$BC_mod= 2
##$BYTORDP= 1
##$COROFFS= 0
##$CY= -3
##$DATMOD= 1
##$DC= 2
##$DFILT= <>
##$DTYPP= 0
##$F1P= 0
##$F2P= 0
##$FCOR= 0.5
##$FTSIZE= 0
##$FT_mod= 4
##$GAMMA= 1
##$GB= 0.15
##$INTBC= 1
##$INTSCL= 1
##$ISEN= 128
##$LB= 0.25
##$LEV0= 0
##$LPBIN= 0
##$MAXI= 10000
##$MC2= 0
##$MEAN= 0
##$ME_mod= 0
##$MI= 1.114404
##$NCOEF= 0
##$NC_proc= 0
##$NLEV= 6
##$NOISF1= 3.799351
##$NOISF2= 2.8
##$NSP= 1
##$NTH_PI= 0
##$NZP= 0
##$OFFSET= 14.38212
##$PC= 1
##$PHC0= -628.9902
##$PHC1= 10.99222
##$PH_mod= 1
##$PKNL= yes
##$PPARMOD= 0
##$PSCAL= 0
##$PSIGN= 0
##$REVERSE= no
##$SF= 200.129724274929
##$SI= 16384
##$SIGF1= 3
##$SIGF2= 2
##$SINO= 400
##$SIOLD= 16384
##$SREGLST= <1H.CDCl3>
##$SSB= 0
##$STSI= 0
##$STSR= 0
##$SW_p= 3205.1282051282
##$SYMM= 0
##$S_DEV= 0
##$TDeff= 0
##$TDoff= 0
##$TI= <>
##$TILT= no
##$TM1= 0
##$TM2= 0
##$TOPLEV= 0
##$USERP1= <user>
##$USERP2= <user>
##$USERP3= <user>
##$USERP4= <user>
##$USERP5= <user>
##$WDW= 1
##$XDIM= 8192
##$YMAX_p= 0
##$YMIN_p= 0
$$ End of Bruker specific parameters
$$ ---------------------------------
##NTUPLES= NMR FID
##VAR_NAME=  TIME,          FID/REAL,        FID/IMAG
##SYMBOL=    X,             R,               I
##VAR_TYPE=  INDEPENDENT,   DEPENDENT,       DEPENDENT
##VAR_FORM=  AFFN,          ASDF,            ASDF
##VAR_DIM=   8192,          8192,            8192
##UNITS=     SECONDS,       ARBITRARY UNITS, ARBITRARY UNITS
##FACTOR=    0.0002768,     1,               1
##FIRST=     0,             0,               0
##LAST=      2.2672688,     0,               0
##MIN=       0,             -308508,         0
##MAX=       2.2672688,     286921,          0
$$ Real data points
##PAGE= N=1
##DATA TABLE= (X++(R..R)), XYDATA
0@%%%%%%%%%%%%%%%%%%%qJ6j6J6j6K0k6L0l3L8m5N2n9O8p7Q7j00J13j27J41j57
$$ 0 0 0 0 0 0 0 0 0 0 0 0 0 0 0 0 0 0 0 0 -8 8 -8 8 -8 12 -14 16 -17 21 -24 28 -31 37 -40 47 -53 60 -67 74 -83
40h3J75j98K21k42K70l01L32l66M02m43M90n40N93o52P21p96Q78r71J077j200
$$ -83 92 -106 115 -127 143 -158 174 -192 210 -233 257 -283 310 -342 379 -417 461 -510 567 -633
60f33J341j506J704j942K234k601L065l611L859J711J96779M8952n6404k7631
$$ -633 708 -798 906 -1036 1198 -1403 1662 -1949 1910 3621 200400 249352 192948 165317
74A65317j74944j16519M1151n9997j07763J32208J90440R5302J14979j3430k61751
$$ 165317 -9627 -126146 -84995 -144992 -252755 -120547 69893 165195 280174 266744 4993
85D993j68443J8805k5919R372J33382M7492L1923J72650N1286j84633j52360j04504
$$ 4993 -163450 -144645 -170564 -161192 -27810 19682 51605 224255 275541 90908 -61452 -165956
97a65956j09847Q9119K09222M3455O912J00259m847q6730l1842j35764j94458
$$ -165956 -275803 -186684 22538 65993 72905 173164 168317 81587 49745 -86019 -280477
108b80477M2777J79859R9296J14056P5037j15317r8091J9825q9645j38858J3429
$$ -280477 -237700 -57841 41455 155511 230548 115231 17140 36965 -52680 -191538 -178109
119a78109M8191O4472K07086J32514j08109j13472n8520j21768l9084P6691j0586
$$ -178109 -129918 -65446 141640 274154 166045 52573 -5947 -127715 -166799 -90108 -100694
130a00694M922J72948J21774k0445k4738j13425k07658l8717R7287K3742N3120
$$ -100694 -95772 77176 198950 178505 153767 40342 -167316 -206033 -108746 -85004 -31884
141c1884J23601K3576j48N9993q2147k00280p1808R061J7574J44062J48980k0806
$$ -31884 91717 115293 115145 175138 92991 -107289 -179097 -170036 -152462 -8400 140580 119774
153A19774k3652L6045p6069j13244l3666p1450m2189J51794J64174K7150J9429
$$ 119774 96122 132167 56098 -57146 -90812 -162262 -204451 -52657 111517 138667 158096
164A58096k1825j39477p2153J8274o6693m4010J03957R3875O1512J06819j5763
$$ 158096 136271 -3206 -75359 -57085 -123778 -167788 -63831 30044 91556 198375 182612
175A82612j70445q9944j6421n4339K9945J02857J8234L9261J24661N671j12120
$$ 182612 12167 -77777 -94198 -148537 -118592 -15735 2499 41760 166421 172092 59972
186E9972p0816r2705r7030O9604J26442K4431M6090P6175l3568n1525j1767j11182
$$ 59972 -10844 -103549 -200579 -130975 -4533 19898 65988 142163 108595 57070 45303 -65879
198f5879j23061M1213Q8188N7914J12374N7015q2793m9205k855r1617p5450K3726
$$ -65879 -188940 -147727 -59539 -1625 110749 167764 84971 35766 32911 -58706 -134156 -110430
210a10430R732M5982J54551P6322o2201m6412n7870j09982j6824M8161j9102K7018
$$ -110430 -100698 -54716 99835 176157 113956 67544 9674 -100308 -117132 -68971 -88073 -61055
222f1055J25520N9195k903N733r3277j48222j7511M3369M939O6427R0062J082
$$ -61055 64465 123660 120757 126490 33213 -115009 -132520 -89151 -84212 -17785 72277 73359
234G3359J4872M5694p6530j27793l8681k1739M940J21018R8855j4389P466J5900
$$ 73359 88231 133925 57395 -70398 -109079 -130818 -125878 -4860 93995 79606 87072 102972
246A02972p4771o3425j9094p1763k3624J14634R7622L0003M0733k8584j10701
$$ 102972 28201 -35224 -54318 -126081 -149705 -35071 62551 92554 133287 104703 -5998
257e998l8313J490o0440j1699P2972M5654N8825R2735k3869j16080n4817l6782
$$ -5998 -44311 -42821 -103261 -114960 -41988 3666 62491 155226 131357 15277 -39540 -76322
269g6322m6515M3080O7325J644M5964Q9839q520o1589m3817r4027p2671O2652
$$ -76322 -122837 -79757 -12432 -10788 35176 125015 116495 54906 11089 -82938 -155609 -92957
281i2957P8514K0523N5648M3942l7082j6417o648r9103q2035K9628M1948N3141
$$ -92957 -14443 6080 61728 105670 68588 52171 45523 -53580 -135615 -105987 -64039 -10898
293a0898J05478L0165o4640k1000j4101p7182l6265J2101j6004M4620J24735M6493
$$ -10898 94580 124745 60105 39105 25004 -52178 -88443 -76342 -92346 -47726 77009 123502
305A23502l2626k0745o5265q8606M284K6490k3327L4914Q7301L1107J9284J5503
$$ 123502 90876 70131 4866 -83740 -79456 -52966 -76293 -41379 45922 77029 96313 111816
317A11816q6733j08775r099J2986O298O9131N6599p665K8443L3109o6366q0830
$$ 111816 25083 -83692 -92791 -79805 -73507 -4376 52223 44558 73001 106110 39744 -41086
329d1086l0991m0101Q296J02933O3879n104K1134j089o3208l0515j9069o8685
$$ -41086 -72077 -112178 -103882 -949 62930 57826 78960 77871 14663 -15852 -34921 -103606
341a03606q698Q4857N8826L6690M6223l4098q4086j9201j3257n1359P487M8962
$$ -103606 -112304 -27447 31379 68069 114292 80194 -3892 -23093 -36350 -87709 -80222 -31260
353c1260K0908N7141P5007k6497p4893l4954m8596l8830M3687M2342R72N0200
$$ -31260 -10352 46789 121796 95299 20406 -14548 -63144 -101974 -58287 -15945 -14973 35227
365C5227O0247j6294l0173k9430q4241n0632M5806M2038K3467O0248K5942l0920
$$ 35227 95474 79180 49007 19577 -64664 -115296 -69490 -27452 -3985 56263 82205 51285
377E1285k799j4622q0753m6613J8319J3685M6060Q6346J7634l5393n737k9705
$$ 51285 48486 33864 -46889 -93502 -75183 -61498 -15438 70908 88542 53149 47412 17707
389A7707o6020j5821M539j5991M4912Q6665K2752p116l092o0335o8230K160K834
$$ 17707 -48313 -64134 -59595 -75586 -30674 55991 78743 71627 68535 8200 -60030 -57870 -55036
402e5036j3773M7218O0314J2630K3508J1124o9501o6674q071j4900L135O5075
$$ -55036 -68809 -21591 38723 51353 74861 85985 16484 -50190 -58261 -73161 -70026 -4951
414d951M1212J613L2356Q863o0290m3970k0579m1731Q674P2123L6281J3580L5194
$$ -4951 36261 37874 70230 79093 18803 -25167 -45746 -87477 -78803 -6680 29601 43181 78375
427G8375j2208n5787k0559k4310n0550J0492N6409K7137L6558M4557k6279n2746
$$ 78375 66167 10380 -10179 -34489 -85039 -74547 -18138 8999 45557 90114 63835 11089
439A1089j5473l4358m2682K1702L6814J4159M9973M7069k6272l6851j9359n3361
$$ 11089 -4384 -38742 -81424 -59722 -22908 -8749 41224 88293 62021 25170 5811 -47550
451d7550l5064L1354K4168J3472N6102L4738k3901j4528k1821o6033k8964K6837
$$ -47550 -82614 -51260 -27092 -13620 42482 77220 53319 38791 16970 -49063 -78027 -51190
463e1190J1890K5481O2414J9070k0665j63k7658o5094j8737J2627j492L7935O4652
$$ -51190 -39300 -13819 48595 67665 47000 46837 19179 -45915 -64652 -52025 -53517 -15582 49070
476D9070J0707r898M033l9574n7507p751j554q457M5433N6731Q188P780M342n1142
$$ 49070 59777 49879 53912 14338 -43169 -50920 -52474 -60931 -15498 41233 49421 57201 61543 10401
490A0401m8958m274j3980m809N0417M1909Q001K3810J853n4265l7980j0404k6676
$$ 10401 -38557 -42831 -56811 -61620 -11203 30706 38707 62517 64370 10105 -27875 -38279 -64955
503f4955M350N3125K8540J2409L2629o018m9501k4504k0224l6760J2547M8867
$$ -64955 -60605 -7480 21060 33469 66098 60080 10579 -13925 -34149 -70909 -58362 -9495
515i495K0077K3821L5456j6953m1219j4218l0408l7964J8478L6119J4979L8175
$$ -9495 10582 34403 69859 52906 11687 -2531 -32939 -70903 -52425 -16306 -1327 36848
527C6848L4771k3723l0657j2837m0765l0840K2726K0925J3402M7717K9311k2263
$$ 36848 71619 47896 17239 4402 -36363 -67203 -44477 -23552 -10150 37567 66878 44615
539D4615j6715j8146n0458k2111K2371R720J8633N0625J8752j6246k974k4357
$$ 44615 27900 9754 -40704 -62815 -40444 -30724 -12091 38534 57286 41040 38066 13709
551A3709n4042j5253J3924J522K9072N0954Q801q591L878l1367m9147q192Q25
$$ 13709 -40333 -55586 -41662 -40140 -11068 39886 48687 40096 43974 12607 -36540 -44732 -43907
564d3907m567L7971M7166M901L022L675m0075m0325l443j0920m593M2326L7057
$$ -43907 -48474 -10503 36663 41564 44586 48261 8186 -32139 -35582 -46502 -51095 -8769 28288
577B8288N792J6673M22m5209l1285n734k0461J985M3527K5099R713K5763n133
$$ 28288 34080 50753 51175 5966 -25319 -31053 -51514 -49529 -6002 19097 28810 54573 49440
590D9440m2886k1649j4057k7475R962M0279J6855J7852K8866j2844l5989j3896
$$ 49440 6554 -15095 -29152 -56627 -46665 -6386 10469 28321 57187 44343 8354 -5542
602e542k3199k9183J5759L1533J2264K8157K8021j7943k6702j1884l2517k5356
$$ -5542 -28741 -57924 -42165 -10632 1632 29789 57810 39867 13165 1281 -31236 -56592
614e6592J9773K0865J1521L5770K2771j8593j4605j3778m0516j9966J8680J1453
$$ -56592 -36819 -15954 -4433 31337 54108 35515 20910 7132 -33384 -53350 -34670 -23217
626b3217J6768M1075J3880j6912m691j7676m1865j2801J1090J652K4455M3865
$$ -23217 -6449 34626 48506 31594 26903 9227 -32638 -45439 -34349 -32697 -8242 35623
638C5623Q306j0447j441k6369l8082l843L107m301K8562L8783O602K597L72l5887
$$ 35623 43929 33482 32041 5672 -32410 -36253 -33146 -37447 -8885 29898 36500 39097 39469 3582
652C582l5274j081l298o37L2474K7443L631J4006K260l6977k9630p548j3752O633
$$ 3582 -31692 -32773 -36071 -36708 -4234 23209 26840 40846 43106 6129 -23501 -31049 -44801 -38168
666c8168L8760K0017L260J6835l042l1565j7146j3594k5036Q310L7845J8648J3514
$$ -38168 592 20609 23869 40704 37662 6097 -11049 -24643 -49679 -41369 -3524 15124 28638
679B8638J7940j5135k9861p386j4881k4816R191K4983J3272K7241K3828j9740
$$ 28638 46578 31443 1582 -5804 -20685 -45501 -36310 -11327 1945 29186 53014 33274
691C3274k8365j0642k1742j5605J7284J3982N570L0217K3514j3492j6201j6910
$$ 33274 4909 -5733 -27475 -43080 -25796 -11814 -6244 23973 47487 33995 17794 884
703H84l5178j2707K2361J2704R728K7923J0817j0400r82j5384l9735j4512J2806
$$ 884 -34294 -47001 -24640 -11936 -2208 25715 36532 26132 25150 9766 -29969 -44481 -31675
716c1675R283K3457L2726N17j2743J313j5601l0332q186j136j965K9351L7530
$$ -31675 -22392 1065 33791 34308 21565 22878 7277 -23055 -31241 -32377 -34342 -4991 32539
729C2539L937o350n393k7178k3032L029m304o177K4869K8011Q818J0654m525l7191
$$ 32539 36476 30126 24733 -2445 -25477 -22448 -26752 -32929 -8060 19951 28769 39423 34898 -2293
743b293k5074R71m332M835K6045J2901M501J9211J27l1027k1817j2507j4150J4344
$$ -2293 -27367 -26396 -30728 -25893 152 13053 17554 36765 36892 5865 -15952 -28459 -42609 -28265
757b8265L3070J0365M140J3876o695k0385q741j8326k3650J1329K9115J5181J7267
$$ -28265 4805 15170 19310 33186 26491 6106 -2635 -20961 -44611 -33282 -4167 11014 28281
770B8281J1302j9151j9527k789j6143j7871Q693J3569J2173K9526J6576j9205
$$ 28281 39583 20432 905 -1884 -18027 -35898 -27205 -13636 -1463 28063 44639 25434
782B5434j9375j1466k1058o204J5268M702O280K7900J5091r018q163j9351l2022
$$ 25434 6059 -5407 -26465 -32669 -17401 -12699 -6419 21481 36572 27554 19391 40 -31982
795c1982m719J7369P056J2739K2508K784m870L401j7399l2166q113N511N851K5574
$$ -31982 -36701 -19332 -12276 463 22971 25755 20885 24286 6887 -25279 -33392 -27881 -22030 3544
809C544K5509l637o295J165j7647k0918l457o667j618K7975K7103K651O55o851
$$ 3544 29053 25416 19121 20286 2639 -18279 -21736 -28403 -30021 -2046 25057 27708 28363 21512
823B1512k6570j4616K689p703j502K2143J7412Q399J3443o982l1050j6348k734
$$ 21512 -5058 -19674 -16985 -24688 -26190 -4047 13365 21764 35207 28225 -2825 -19173 -21907
836b1907o912Q961K1635O513O705J6966m417k2926j3831j4703j3142J5463K4618
$$ -21907 -28819 -19858 1777 8290 14995 31961 27544 4618 -9213 -23916 -37058 -21595 3023
849C023O813Q640J0495j0212j3512n109j8980j7597J1667J8831J2188J9474P446
$$ 3023 9836 18476 28971 18759 5247 138 -18842 -36439 -24772 -5941 6247 25721 33167
862C3167j7968j2311l788j6859j0430Q492O070J1110K7099J0467j4681j1654j3294
$$ 33167 15199 2888 -900 -17759 -28189 -19697 -13627 -2517 24582 35049 20368 8714 -4580
875d580j9921q33J1773Q93Q580K2752Q093m134l293j9827k6576j206J0768N107
$$ -4580 -24501 -25334 -13561 -12668 -4088 18664 26757 22623 19330 -497 -27073 -28279 -17511 -12404
889a2404J5222J6601j213k62L513j7267k3515n569p42N552K5158J8330l982j617
$$ -12404 2818 19419 18206 17944 21457 4190 -19325 -24894 -25636 -20084 5074 23404 19422 17805
903A7805j383j6722j2178k738j0499K07K4530J9077M567M259j0099k3488p514
$$ 17805 16422 -300 -12478 -15216 -25715 -25508 -978 18099 22666 26925 16826 -6662 -14176
916a4176J325q544J697J6425R798J0974J4677r271k5313j1605o052n200J2522
$$ -14176 -12851 -21395 -19698 -3273 6525 17499 32176 22905 -2408 -14013 -20065 -25265 -12743
929a2743J5070J055Q428J4553n171j4708j0712j8005j0405J6509J8321N568R364
$$ -12743 2327 3382 11810 26363 21192 6484 -4228 -22233 -32638 -16129 2192 7760 17124
942A7124M855j0162n259l208j9122j3724Q953J2087J3490J9728J914j6446p271
$$ 17124 21979 11817 6558 3350 -15772 -29496 -20543 -8456 5034 24762 26676 10230 2959
955B959m058j3490m711M233k68J1717K4893P101j0237r050j5603j5646M561Q314
$$ 2959 -1099 -14589 -19300 -15067 -15335 -3618 21275 28376 18139 9089 -6514 -22160 -17599 -9285
969i285j994Q068J6539N325K002j052k1106k1966P32P050O064J5247R237l898
$$ -9285 -11279 -3211 13328 18653 20655 19603 -1503 -23469 -22737 -15687 -9623 5624 14861 10963
983A0963L662M061j4891j6886o316n272P187K4032J2590l681k80m087j2870n023
$$ 10963 14625 18686 3795 -13091 -19407 -24679 -17492 6540 19130 15449 15169 11082 -1788 -6811
997f811l461j2111J218J9688J3997P411M693j2642j9154l178k45o548L710J0007
$$ -6811 -10272 -22383 -21165 -1477 12520 19931 24624 11982 -7172 -10350 -10595 -17143 -13433 -3426
1011c426N300J2679J3021r489j8979r555q356k185J3396R490n44Q797J0110m750
$$ -3426 1874 14553 27574 18085 -894 -10449 -18805 -20990 -7594 1896 1352 10149 20259 15509
1025A5509p812r252j8351o900J4629J2516O269R557K43q919p50l675j6668q330
$$ 15509 7697 -1555 -19906 -26806 -12177 339 6608 16165 16408 7489 6739 3064 -13604 -21934
1039b1934N715O685J3695J7581j216j2223m346o411j0689k72J626j992J1785J9065
$$ -21934 -16219 -9534 4161 21742 20526 8303 3957 -2454 -13143 -13415 -11789 -13781 -1996 17069
1053A7069L572m917o231j5860j1961N111M226p70R530J0864K394M336j215j8422
$$ 17069 20641 15724 9493 -6367 -18328 -13217 -8991 -9761 -231 10633 13027 17363 16148 -2274
1067b274j4988K74J974O356J4710N497k820M822M93j3039r919n521o647P371J9086
$$ -2274 -17262 -16988 -15014 -8658 6052 11549 8729 13551 14044 1005 -8914 -14435 -21082 -13711 5375
1082E375P808l37K040o476j1040k087m357r792M088J4102Q262Q352M991j1731
$$ 5375 13183 12846 14886 8410 -2630 -4717 -9074 -18866 -14778 -676 7586 15938 20929 9198
1096I198j3761k310l858m701O289O828L297J1705Q691q776j1622p200r928j438
$$ 9198 -4563 -6873 -10731 -15432 -9143 -2315 982 12687 21378 12602 980 -6220 -16148 -17586
1110a7586J1373O088J655R251N055n220l856p753j5289l582J0125P155P425R800
$$ -17586 -6213 -125 1530 10781 15836 10616 6760 -993 -16282 -19864 -9739 -2584 4841 14641
1124A4641j464o633m9n546j2934l651L228L250J2450J3705j806o880k979q566
$$ 14641 13177 6544 6495 949 -11985 -15636 -12408 -9158 3292 16997 15191 8311 5332 -3234
1138c234q281J518j11j231J1309J2873J620p15m684j4613q297L557Q47J409R661
$$ -3234 -11515 -9997 -10108 -11339 -30 12843 14463 13748 9064 -5549 -13846 -10289 -9442 -8033 1628
1153A628O399J393N384k189j4920r364j240j194O751J2665K866o07M749k317r905
$$ 1628 8027 9420 14804 12615 -2305 -11669 -12909 -14103 -7352 5313 8179 7572 12321 10004 99
1168I9n391o018o435P346J4082N009K647J965p503p769o84n387p270M755Q940
$$ 99 -5292 -11310 -17745 -10399 3683 8692 11339 13304 5801 -1968 -2652 -8039 -15309 -10554 -1614
1183a614N973R174L710j0475r288k142n325k121O121K997K703J1085N638o845
$$ -1614 4359 13533 17243 6768 -2520 -4662 -9987 -12108 -5987 -2990 -287 10798 16436 9591
1197I591o792p172r949P00R237L084K596Q030J798l117p56p638j2969j573O648
$$ 9591 2799 -4373 -14322 -13622 -4385 -1301 1295 9325 11123 8006 7250 -388 -13357 -14930 -8282
1212h282M657Q304P680l233l993R59n808r322j835rK029J1993J0398k030l932
$$ -8282 -3625 4679 12359 9126 5133 6092 284 -9038 -10873 -10882 -8853 3140 13538 11508 7576
1227G576l077q314m722K143k280q67R653Q701K092J673m992j2863n148K589m28
$$ 7576 4499 -3815 -8537 -6394 -8674 -9541 112 8813 10905 12578 7586 -5277 -10425 -7836 -8264
1242h264K462P618K706K186O030k716j1494o409k934j668P454R660P81O53L896
$$ -8264 -5802 1816 4522 6708 12738 10022 -1472 -7881 -10815 -12483 -5029 4631 5412 6065 9961
1257I961l122o063l160o772n583O892R911L912M059P72p366m526m9n617m826M065
$$ 9961 6839 776 -2384 -9156 -14739 -7847 2064 5976 10035 10807 3441 -1085 -1134 -6751 -11577 -7512
1273g512M758N022R224J992q474n745k832n204k0M828M92K924R281L016m242l671
$$ -7512 -2754 2268 11492 13484 5010 -735 -3567 -8771 -8791 -3963 -3471 -547 8734 11750 7508 3837
1289C837p067q449J696O250J523L832O040k03j220M00p234r379l32L126K973Q125
$$ 3837 -3230 -11679 -9983 -3733 -2210 1622 7662 7459 6239 6639 -595 -9974 -10306 -7180 -4207 3918
1305C918N663l017j630L31o147n778m49j665J417R970O546j167o31k996p798k672
$$ 3918 9581 6564 4934 5265 -882 -6660 -7109 -8774 -7357 2613 9159 7992 7361 4365 -3433 -6105
1321f105J218k803Q64P765M516J893K884m294r491k811J75j759L603O160J233
$$ -6105 -4887 -7690 -6826 939 5455 7348 10232 5938 -3553 -6364 -6189 -7948 -4345 1815 3048
1336C048K433M436l506p413l172l550k295N979O418Q94K678K564m131m100j701
$$ 3048 5481 9917 6411 -1002 -4174 -7724 -10019 -4040 2378 3272 5950 8514 4383 283 -1418
1351a418n601l267N340N087K670M996Q81n593k809j409n469j786L973K080L502
$$ -1418 -7019 -10286 -4946 141 2811 7807 8688 3095 286 -1123 -6592 -8378 -4405 -2325 1177
1366A177P002O18n000k325l421n491N56L426L65L773O501J36k504j152n600n982
$$ 1177 8179 8797 3797 1472 -1949 -7440 -6884 -3458 -3093 680 7181 7317 4813 3661 -1939 -7921
1382g921J329K611P68M959M729j042n34k45o079n283O89M23J514O619L758j416
$$ -7921 -6592 -3981 -3213 1746 6475 5433 4899 4654 -1425 -6708 -6019 -5596 -4082 2537 6295 4879
1398D879K83r59n988l155J42j737J788O904L054j16J278k679o145j590k82k283
$$ 4879 5162 4203 -1785 -4940 -4798 -6535 -4747 2157 5211 5095 6373 3694 -2451 -4041 -4323 -6606
1414f606K355N736J867J655K410l603n854j313j595j884L733M437O85K702K592
$$ -6606 -4251 1485 3352 5007 7417 3814 -2040 -3353 -4948 -6832 -3099 1338 2023 4725 7317
1429G317l802m164j449l625j548M660L449Q63L527J248l784k161j508m835j162
$$ 7317 3515 -649 -2098 -5723 -7271 -2611 838 1701 5228 6476 2692 531 -977 -5812 -6974
1444f974M080K240K252M565j41l861j055k119m537n4K693P03L278N092l96k915
$$ -6974 -2894 -654 1598 6163 6022 2161 1106 -1013 -5550 -5604 -2911 -2208 1070 6162 5766 2851
1460B851r00l627m127J256J755Q5L816M173n67r06o36m997l819J310Q08P72M571
$$ 2851 1951 -1676 -5803 -4547 -2792 -2707 1109 5282 4715 3809 3173 -1824 -5643 -4333 -3525 -2753 1818
1477A818K729j003N71o28n019k996M97p95J773N295J944p69R81j486m535j415
$$ 1818 4547 3544 4115 3487 -1532 -4528 -4031 -4826 -3053 2242 4186 3417 4398 2912 -1623 -3038
1493c038l77k003K037N078J572O20J434k958m278m53r91j808K469L631Q35K235
$$ -3038 -3415 -5418 -3381 1697 3269 3889 5323 2365 -1913 -2366 -3357 -5165 -2696 935 1770 4005
1509D005J819l375l563q31k137j081L367K351N13K853J360k978k119j404l405
$$ 4005 5824 2449 -1114 -1945 -4082 -5163 -1796 555 1068 3921 5281 2303 184 -1220 -4625
1524d625n93L424J671J180L296J62k774p06j689l819j30K518P61K395L659o80
$$ -4625 -5218 -1794 -123 1057 4353 4515 1741 1035 -654 -4473 -4603 -2085 -1324 1071 4730 4050
1540D050k245k51k531l325Q19J147J78L160L361q34j084k42l516k792J123L43
$$ 4050 1805 1554 -977 -4302 -3483 -2336 -2158 1002 4363 3529 2445 2203 -1313 -4105 -2982 -2639
1556b639K06L632K546r55L11n17m004k036P97o08Q04L856J565m43J065j160l897
$$ -2639 -2433 1199 3745 2790 3101 2584 -1420 -3456 -2659 -3267 -2463 1393 2958 2515 3580 2420 -1477
1573a477j027Q3j352J457L604P51M37J535j822l455n23q15j365K096K981Q3J264
$$ -1477 -2504 -2421 -3773 -2316 1288 2039 2476 4011 2189 -1266 -1789 -2604 -3969 -1873 1108 1191 2455
1590B455J586k162k499k99j978j334K685K130L41J930Q33k440j255k65k584j041
$$ 2455 4041 1879 -620 -919 -2897 -4231 -1546 584 925 2855 3688 1248 -7 -272 -2856 -3897
1606c897K408J123R53K818Q2k501o41p34k502p9J662J00J348L134k8j753l90j927
$$ -3897 -1489 -366 587 3405 3487 986 345 -389 -2891 -2970 -1308 -1208 140 3274 3246 1493 1103 -824
1624h24k421Q71J329l18J583K422l84l22J11k690k500Q32O67K16K475J430j153
$$ -824 -3245 -2374 -1045 -1363 220 2642 2258 1936 2047 -643 -3143 -2311 -1644 -1428 1047 2477 1324
1641A324L75M75k551j807L01p91O67L256J199r76N07n83k260l52J30j574M69K809
$$ 1324 1699 2174 -377 -2184 -1883 -2674 -2007 1249 2448 1472 1979 1396 -864 -1216 -1086 -2660 -2191 618
1659F18Q69L93R81j566k632K13mj173J010J610m6J201J655j477k263k94r88o66
$$ 618 1487 1880 2861 1295 -1337 -1124 -1128 -2301 -1291 319 273 1474 3129 1652 -611 -905 -1893 -2559
1677b559J982J157n42J113J263j216q21l30k207p61K144J034J24J474k7j477K20
$$ -2559 -577 580 38 1151 2414 1198 377 47 -2160 -2921 -777 257 381 1855 1828 351 571
1694E71l2k194o00J155J64J096K289m64j656J02n46j466M47M50q84J195K248j60
$$ 571 539 -1655 -2255 -1100 -936 160 2449 1985 329 431 -115 -1581 -1134 -684 -1568 -373 1875 1715
1712A715o12kj598j460J123M01p06J120J179l47M98N20k050j522O85j11J26J704
$$ 1715 1103 1101 -497 -1957 -834 -433 -1139 -19 1160 813 1311 1831 -219 -1741 -1056 -1167 -1041 663
1730F63L65q25Q70L94j506o07Lj112L01K172K98m88P70n35j277M61j37j383K82
$$ 663 1028 203 1073 1467 -39 -646 -643 -1755 -1454 718 1016 528 1298 763 -514 -53 -190 -1573 -1291
1749a291J370P9O50J050j145j410O38l08q75P75M81n58J090J278j058p36Q7j104
$$ -1291 79 158 808 1858 713 -697 -59 -367 -1242 -467 14 -544 546 1824 766 30 117 -987
1767i87m24J403R4n52R66O17p53K77l9j546l87J073PO1J093k64p97Q34O5j324
$$ -987 -1411 -8 86 -466 500 1117 364 641 602 -944 -1331 -258 -251 -190 903 639 -158 676 741 -583
1787e83j32L28n79N99J475m37o36N47l75p50N13q2j047P11J008j71J82L39j104
$$ -583 -715 -387 -966 -367 1108 671 35 582 207 -543 -30 -112 -1159 -448 560 389 571 910 -194
1806a94n65Q75j71o51N79K04l51R08N61j130m32L35n71L1R92l93o09Q76M90o35
$$ -194 -759 116 -55 -706 -127 77 -274 634 1195 65 -367 -32 -603 -572 420 27 -582 294 784 149
1826A49K40k02j165K48R67k56j73O38l29l60R68q8j157l8L32l43N78Q53p38m23
$$ 149 389 187 -978 -730 237 -19 -192 446 117 -243 725 637 -520 -558 -226 -569 9 862 124 -299
1846b99P67k05m23L18m09q11P35Q98k85P1J69q13k1P05m21p17L38K37kR52J66
$$ -299 468 263 -160 158 -251 -1062 -327 571 286 357 526 -287 -308 397 -24 -741 -403 -166 -168 784 950
1867I50j041j82L72m14l5M27n04k12J098M07m32j4m22q88L79P11m30q3O08j09
$$ 950 -91 -273 99 -315 -350 77 -427 -639 459 866 434 420 -2 -890 -511 200 -230 -313 295 186
1887A86J60O57n50j237M0L20j00P00M68n52nP13l71n88j02n46l24J083Q21l11
$$ 186 346 1003 453 -784 -744 -424 -524 176 644 92 87 800 429 -159 -261 -807 -1131 -48 773 462
1907D62j6J06o01r5K95p49n11O65M89L34P68k03j168j47J99m87j3M59j08L56J089
$$ 462 446 552 -49 -144 151 -598 -1109 -444 45 379 1147 944 -224 -371 -172 -659 -672 -213 -321 35 1124
1928A124M2p17m15n57o43N45O34k31K38Q00l8j62K2r74j024M27N10K35Q03K97
$$ 1124 1166 449 34 -523 -1166 -621 13 -218 20 820 782 620 642 -332 -1356 -929 -419 -184 619 916
1948I16m01o9J18o36p78j12k1L00J274O65m65j71k64q21k15J09m56J81J133O91
$$ 916 515 446 564 -72 -850 -962 -983 -683 591 1256 791 620 356 -465 -680 -571 -1027 -846 287 978
1968I78Q1J52o78j259j66J33j80L14Q30K71M33N50o14j217m34m22mQ23Q31J15
$$ 978 1059 1211 533 -726 -892 -759 -939 -625 205 476 909 1459 845 -372 -806 -1228 -1232 -409 422 537
1988E37L54M20n80o36n43q24l69Q75R62M56N52N5p38n28k98q27l44N91O28P17
$$ 537 891 1311 731 95 -448 -1272 -1641 -766 196 652 1204 1259 521 -7 -305 -1132 -1476 -885 -257 460
2008D60J032J12q70o29o06p60n7N74K28P62J080K57m98n42j027j034J13N48L98
$$ 460 1492 1604 734 105 -501 -1261 -1318 -744 -516 246 1326 1583 1085 543 -484 -1518 -1405 -857 -459
2027d59R08Q10J0j37l45j064j129j28L52M72J216Q41j00j74k90j074q90k41j4
$$ -459 449 1259 1269 1132 787 -277 -1406 -1534 -1182 -710 506 1347 1247 1073 783 -291 -1181 -1422 -1436
2046a436M38J326R99J87j00o50j173o80j45k16M37J166Q21N21K38o42j362q35
$$ -1436 -998 328 1327 1514 1414 764 -409 -1089 -1234 -1450 -1013 153 974 1495 1733 1091 -271 -1106
2064a106l90p1O00J113O01N90M25n85j168q82p21l06Q89J106P45O11K41n88r36
$$ -1106 -1496 -1567 -967 146 747 1337 1762 1177 9 -873 -1594 -1900 -1011 95 840 1451 1692 1104 168
2083A68p97r05m12O80J047R75R89J58q19q58p71q87m17N62P08J026J157M20o89
$$ 168 -629 -1534 -1946 -1266 -219 756 1745 1903 1084 226 -545 -1432 -1849 -1287 -579 447 1604 2024 1335
2102A335q55j089r87j84N72N78J016J095L86m04o08j242j341k51N14P69J165J055
$$ 1335 480 -609 -1596 -1780 -1208 -630 386 1481 1867 1463 855 -387 -1728 -1979 -1465 -696 469 1524
2120A524J32j79n05j136j247n73K78O68J454J147K07j82n84j189j069l68k54N25
$$ 1524 1656 1477 972 -164 -1411 -1984 -1706 -1038 416 1563 1770 1588 1004 -185 -1254 -1622 -1876 -1351
2138a351J409J296N98m2p23j525r86l36j39N39J213J072O92M20o61j471j225o38
$$ -1351 58 1354 1952 1910 1187 -338 -1324 -1660 -1799 -1260 -47 1025 1717 2137 1476 5 -1220 -1858
2156a858j37P78J245R11N91M74m81j220j155r72m75P48J460J058P90K61o90j017
$$ -1858 -1995 -1217 28 939 1530 2004 1523 303 -852 -1824 -2299 -1551 -91 967 1757 2018 1328 311
2174C11q57j065o47N88J166J201J309K94p95j114j029r88m06M35P79J050J507
$$ 311 -546 -1611 -2258 -1670 -504 697 2006 2300 1505 391 -638 -1626 -2032 -1597 -818 232 1739
2191A739N78m63j031j419j271l18P29O77J088J195N24k00o28j368j583n34L81
$$ 1739 2317 1854 823 -596 -1867 -2185 -1456 -779 309 1504 2028 1828 1200 -168 -1751 -2285 -1904
2208a904R48J325J318K76k61m94j219j353p50L7O12J603J600L61j70p20j353j111
$$ -1904 -956 369 1687 1963 1702 1208 -11 -1364 -2114 -2077 -1465 138 1738 2099 1929 1209 -144 -1255
2226a255m98k33L73J437J509P50K61p56j698j222n18j66N65J261J132Q38M97m66
$$ -1255 -1753 -1986 -1613 -176 1333 2083 2344 1588 -110 -1332 -1850 -2016 -1451 -190 942 1780 2277 1811
2244A811j559j350r23l77Q47J394J086Q20M14m45j193j169j193o90O35J409J311
$$ 1811 252 -1098 -2021 -2398 -1551 -157 929 1749 2163 1718 525 -644 -1837 -2527 -1892 -483 828
2261H28J090M03p17j061j032j103p80M58J072J250J481O18p05j178j096j191n16
$$ 828 1918 2321 1604 543 -489 -1592 -2372 -1914 -842 408 1889 2507 1802 624 -472 -1663 -2179
2278b179M84O72J121J532Q15m44q28j513j484m95N00P36J274J366M91j14n30j363
$$ -2179 -1695 -1023 98 1630 2445 2001 1173 -340 -1824 -2319 -1819 -1083 191 1557 2048 1934 1404 41
2296D1j663o21J69P61J457J461N02j85n08j322j479o05k13N51J566J598O36L4
$$ 41 -1622 -2243 -2074 -1313 144 1605 2107 1922 1414 92 -1387 -1992 -2205 -1654 -88 1510 2146 2180
2314B180o46j519j284n65k27K93J483J415Q55M09o74j652j241p13l66N33J489
$$ 2180 1534 15 -1269 -1834 -2061 -1768 -285 1130 1985 2394 1720 68 -1173 -1886 -2252 -1719 -230
2331b30J068Q74O50m71j463j278j077n35P24J379J144R49N97n49j198j096j307
$$ -230 838 1712 2362 1891 428 -850 -1927 -2462 -1738 -359 785 1734 2331 1782 584 -512 -1819
2348a819p38O70J303J199J250O03p16j005j122j294p48N48Q45J261J576O44n65
$$ -1819 -2557 -1887 -584 615 1865 2468 1752 747 -375 -1669 -2417 -1869 -1024 237 1813 2457 1892
2365A892r84j271j371n24M15P28J213J494P40l64o79j470j581n71L66P52J287
$$ 1892 908 -363 -1734 -2258 -1843 -1115 98 1592 2332 1968 1289 -181 -1762 -2333 -1967 -1215 72
2382G2J452N83p7n40j357j708o32M2O56J552J519M68K8n00j433j397o86l08M58
$$ 72 1524 2107 2030 1490 133 -1575 -2207 -2165 -1509 43 1562 2030 2058 1558 125 -1272 -1958 -2266 -1808
2401a808J600J573P03K22o17j591j247p06l73M30J419J378J004N38n74j702j273
$$ -1808 -208 1365 2068 2290 1673 82 -1165 -1871 -2244 -1814 -395 983 1987 2525 1951 249 -1024
2418a024q29n17O40J386J104R59P82n54j398j211j284o88P73J436J046J176O07
$$ -1024 -1853 -2370 -1730 -344 760 1719 2501 1947 549 -662 -1946 -2634 -1861 -425 621 1797 2404
2435B404o31r68j197j295q60N71J144J230J538N76o89r34j146j422o70M27O90
$$ 2404 1773 805 -392 -1687 -2547 -1976 -832 398 1936 2512 1823 889 -257 -1679 -2349 -1922 -1232
2452a232J363J691P04m79r09j341j476o02M18N52J248J625O58p6o06j491j758
$$ -1232 131 1822 2526 2047 1138 -203 -1679 -2281 -1863 -1311 -63 1562 2220 2144 1538 47 -1711
2469a711n20K01O02J420J465N99Q5m25j484j625p11j18N48J590J526N49J50m49
$$ -1711 -2231 -2030 -1428 -8 1457 2056 2141 1716 232 -1393 -2104 -2222 -1674 -84 1442 1991 2141 1692
2487A692j412j363p89n02N26J579J403Q01M60o22j498j212q81n08M56J417J243
$$ 1692 280 -1083 -1872 -2374 -1848 -269 1134 1935 2395 1773 275 -937 -1818 -2326 -1870 -453 790
2504G90J075O40o52j419j199j097n80N87J356J040J160Q15o42j174j259j261o51
$$ 790 1865 2505 1853 434 -765 -1862 -2442 -1855 -499 541 1701 2516 1874 700 -559 -1820 -2471
2521b471O07J132J122J348P00n30r37j288j439p18N76Q88J252J433O59m70o73
$$ -2471 -1864 -732 390 1738 2438 1908 971 -317 -1756 -2474 -1898 -1010 242 1675 2334 1864 1191
2538A191j301j571p04M27P06J342J560N73k80o18j299j552o39J50N31J474J631
$$ 1191 -110 -1681 -2385 -1958 -1252 90 1650 2223 1943 1325 26 -1526 -2165 -2015 -1484 -10 1621
2555A621M96j6n96j440j496n49j37M62J512J487O81J81n42j516j485n21l20M73
$$ 1621 2117 2101 1505 65 -1431 -1980 -2117 -1655 -143 1344 2025 2206 1664 148 -1337 -1858 -2178 -1705
2573a705J513J280Q27L94n19j520j347q05m96O50J475J104Q25O03n33j257j197
$$ -1705 -192 1088 1915 2309 1790 270 -1077 -1882 -2378 -1728 -253 851 1676 2279 1746 489 -708
2590g08j116o55N88J488J116J091N30o19j141j017j159q01N20J149J174J400O02
$$ -708 -1824 -2479 -1891 -403 713 1804 2334 1715 574 -443 -1602 -2403 -1883 -734 440 1840 2442
2607B442p29r77j097j291n71M63Q45J028J501P73m68q92j283j494m74M89O38J207
$$ 2442 1713 736 -361 -1652 -2223 -1760 -915 113 1614 2387 1919 1027 -256 -1750 -2224 -1735 -1097 110
2625A10J412N92k61n11j342j632o22L20O73J348J467L96j13m68j256j516n84r3
$$ 110 1522 2114 1853 1342 0 -1632 -2254 -1934 -1261 87 1554 1950 1837 1369 113 -1403 -1987 -2080
2643b080N27J494J530M54O3n03j485j192n41l09L67J559J289O58M33o43j586j081
$$ -2080 -1553 -59 1471 1925 1988 1485 0 -1192 -1733 -2042 -1675 -116 1173 1831 2264 1621 35 -1046
2661a046o73l59M59J354J153Q00N66n14j423j200q52n42O90J329R68Q32O51n33
$$ -1046 -1719 -2078 -1619 -265 888 1688 2254 1740 317 -883 -1735 -2277 -1587 -258 710 1542 2193 1660
2679A660j208r14j214o43O42J192J089J081N52p33q68r54j277n80N27Q89J039
$$ 1660 452 -462 -1676 -2319 -1677 -485 604 1685 2237 1504 636 -318 -1595 -2175 -1648 -759 280
2696B80J497M80o38q82j039j274n03N13N34J152J408N62m26n90j299j435l46L82
$$ 280 1777 2257 1619 737 -302 -1576 -2079 -1566 -1032 120 1528 2090 1664 1074 -225 -1660 -2006 -1624
2714a624N63J158J312L97m4m36j359j436m55Q7N88J385J320K78P1m58j262j251
$$ -1624 -1061 97 1409 1806 1762 1326 -33 -1469 -1924 -1837 -1249 136 1456 1734 1805 1347 85 -1166
2732a166n51k53M90J523J249M71K08o05j366j066m85l48L48J412J069P76M18o37
$$ -1166 -1717 -1970 -1480 43 1292 1763 1971 1366 0 -1066 -1551 -1899 -1551 -139 930 1706 2124 1487
2750A487j415j016o99l28O05J033R49Q61O27n18j234j062j078m03P44J169Q97
$$ 1487 72 -944 -1643 -1971 -1366 -333 616 1477 2104 1586 352 -710 -1788 -2191 -1447 -278 619
2767F19Q17N64n15q79r26j258o20N83J091J066J134L00o31p10p96j241n45L70
$$ 619 1436 2000 1485 606 -320 -1578 -2198 -1615 -524 542 1676 1976 1345 635 -161 -1402 -1947 -1577
2785a577O19J203J491L49n50p76j122j074k59K05M42J061J382N26j70o06j457
$$ -1577 -958 245 1736 2085 1535 759 -363 -1437 -1696 -1491 -1049 12 1394 1920 1750 1144 -313
2802c13j320j89K77N18J102J131K83K63l41j377j375m83mO62J440R85K18J23k25
$$ -313 -1633 -1822 -1545 -1027 75 1206 1489 1752 1411 34 -1341 -1824 -1828 -1166 274 1259 1477 1600 1375
2821A375j131j143o42n49O00J483J178M91J86p69j119p17n44n47L57J129J047
$$ 1375 244 -899 -1541 -2090 -1490 -7 1171 1662 1848 1079 -40 -757 -1301 -1848 -1491 -362 685
2838F85R43N60p89j350q59p34k24O08Q09P01J017P18m38j180r87j217l16Q48Q83
$$ 685 1628 2188 1399 49 -810 -1544 -1768 -1160 -351 350 1367 2085 1647 467 -520 -1737 -2053 -1205 -322
2857c22P81Q55M07l59n18j020j310n52N15Q99J165J087J23n76m74p36j148m92
$$ -322 459 1314 1721 1362 844 -176 -1486 -2038 -1523 -624 541 1628 1751 1175 701 -35 -1183 -1675
2875a675J16N03J187J458K88m12p12j056j014j00L9K13J183J084N95N4o01j449
$$ -1675 -1559 -1056 131 1589 1877 1465 753 -303 -1317 -1417 -1378 -1165 18 1102 1697 1751 1150 -299
2893b99j078k18J76M60J044Q11M38L20k52j251j239n45j95P87J219Q27K83K66
$$ -299 -1377 -1595 -1419 -959 85 896 1334 1654 1402 151 -1088 -1633 -1828 -1041 178 1005 1288 1554
2911A554l68r94p90p70o00N50J313J002O46K12p66r91m92o80n57M54Q35Q77R93
$$ 1554 1186 192 -598 -1368 -1968 -1418 -105 897 1543 1755 989 -2 -494 -1174 -1731 -1277 -442 435 1428
2930A428N53p54j049q09p36k17N41O18N94J068N26l47p97j012j083k62O13O98
$$ 1428 1981 1227 178 -631 -1367 -1584 -1043 -425 169 1237 1763 1416 619 -393 -1476 -1738 -1125 -427
2948d27P19Q53L48l37l90q51j246m52L95P21R64J101P8l44l57q57j027k57q5L26
$$ -427 292 1145 1493 1156 766 -85 -1331 -1783 -1388 -667 297 1398 1476 1132 775 -82 -1109 -1366 -1451 -1125
2968a125J241J166K19k03m74j092q10j52p6K39J043Q82M63L00m75j353q29k94
$$ -1125 116 1282 1501 1298 824 -268 -1078 -1230 -1306 -1067 -24 858 1321 1621 1146 -207 -1036 -1330
2986a330q2N34R01O74M82L63l74j007r01o44k81O70J113O35M08K52m41p60o77
$$ -1330 -1412 -878 23 697 1179 1542 1168 161 -740 -1384 -1665 -995 118 753 1161 1413 972 212 -465
3005d65p48n13N27R88P97P58K20p33p15n13p03l74L60N90P98J013M12o40o93q49
$$ -465 -1213 -1726 -1199 -211 586 1344 1564 831 116 -397 -1100 -1474 -1114 -524 274 1287 1699 1059 366 -483
3025d83p87n8M39M05O37R45L70j84n39j013j048j26M51N81O42P95J15n5k06r27
$$ -483 -1270 -1328 -889 -484 153 1098 1468 1284 745 -268 -1316 -1442 -991 -410 232 1027 1142 1087 881 -46
3045d6r86l89J35M96J072Q73J8j69k66p88p52l14j60K20J129R38K84l4n36r40
$$ -46 -1032 -1421 -1286 -790 282 1155 1173 1004 738 -50 -802 -1116 -1276 -1056 73 1011 1295 1261 725 -215
3065b15o87o8j55J64Q62P67M53L75m88j120p35l05j07N64P48M07M61M38l64p02
$$ -215 -902 -970 -1125 -961 -99 668 1121 1496 1008 -112 -847 -1152 -1259 -695 53 460 921 1359 995 293
3085B93p81p38k80O39R40M44M73J79l81m84m86q27m68M56O58Q74P78L3o02n52
$$ 293 -488 -1226 -1506 -867 73 517 990 1169 788 304 -182 -1009 -1477 -1021 -363 511 1289 1322 720 168
3105A68l80o29l19K78K67Q39Q99K78m07o32p28o57KK97K42N02P82L66r2l67r60
$$ 168 -212 -841 -1160 -882 -615 224 1123 1401 994 362 -366 -1023 -1021 -724 -482 20 802 1168 1076 709 -251
3126b51r31M6K88M17O79N57L8J10j03q29q39l49j2M69R60O50M5j4k88p07n21k86
$$ -251 -1182 -1136 -848 -431 248 805 843 953 850 21 -818 -1167 -1179 -710 250 900 945 931 643 -64 -585 -871
3148h71k47K13R26P79L01J6n57p80l81j56k07K11O65M65N54L65m67q80n24l96
$$ -871 -1118 -905 21 800 1101 1117 560 -220 -601 -757 -964 -753 -88 377 931 1296 829 -51 -575 -971
3168i71j17N14O31K15M66L76l38m95o33o96j99N59O31M30N21N6l26l20m61o31
$$ -971 -1088 -574 57 272 738 1114 776 281 -352 -1048 -1247 -688 -57 373 894 950 624 304 -157 -788
3188g88l71L02N21O82O45M7m47l93m13n51k21K52J96O57Q11R6k46m12o84n51K0
$$ -788 -1159 -857 -336 346 991 1038 591 198 -215 -766 -987 -735 -539 118 929 1025 779 367 -317 -868 -848
3209h48J86J74N46O74J71o1j79q45o58j65K09L31O94M43N3J08k39o40n65k75j22
$$ -848 -662 -488 58 732 903 842 663 -182 -840 -1005 -796 -465 229 672 725 833 594 -46 -611 -886 -1008
3230a008M20P90M33J25O3k58o17l74k44k96K88O97N64K30J71m62o31k99l05j44
$$ -1008 -588 202 635 760 823 565 -52 -426 -670 -966 -678 19 583 813 984 522 -109 -408 -713 -857
3250h57K86N28L37N05K59m25o13l81m24j00M00L67L47M47J60k29l59m68o38j48
$$ -857 -571 -43 294 799 1058 633 20 -361 -785 -885 -485 -118 229 676 836 607 248 -220 -858 -1006
3270a006M12M72L81N12J8k59k14m65n20j79J83L38N80N40K1l36j39n28m69L0j9
$$ -1006 -594 -122 259 771 789 530 316 -149 -669 -848 -665 -327 253 793 814 478 339 -189 -658 -628 -647
3291f47J82N40O55J7j7l10o61l53m8O1J16N47L55K29Q1k37o77m96m3m0K99N54
$$ -647 -465 75 730 747 730 420 -241 -594 -642 -581 -465 82 437 666 747 510 -167 -663 -706 -746 -447 107
3313A07L43R3J59j84n14l85k14k51M14N39L16J87Q5k53m67k06l26k54K46N13L76
$$ 107 450 543 702 518 4 -381 -595 -846 -432 107 423 610 695 442 -25 -231 -557 -811 -565 -52 324
3334C24L17J85m63l87k32k58j45J99K51L41N04J69l45l90l23l77q2L43K22K58
$$ 324 641 826 363 -24 -256 -514 -659 -460 -209 132 636 805 460 70 -253 -630 -712 -369 -147 111
3354A11M18J17j68j71m64m58j49L35K70L13M10Oj57p8l96l85j42M0K56M98L40
$$ 111 529 646 478 307 -157 -615 -764 -429 -159 154 564 570 413 335 -61 -446 -588 -548 -292 206 546
3375E46Oq6j53l53l23q7m8M2N47L73J15Rk99m33l96J14l0J02L58K67J82J65k02
$$ 546 552 466 313 -40 -363 -450 -498 -456 91 464 579 588 289 -144 -540 -426 -456 -354 4 271 453 618 416
3398D16m40l57j81J3K65M53O1J86J51k01l63k33k69j35K81M48J46K06J28l35j78
$$ 416 -24 -381 -562 -549 -284 169 230 416 567 366 3 -230 -499 -634 -353 95 241 447 575 240 62
3419F2j75l20j39J36L74K64L06J02l32k44j58k89j49K30J42K68L88P1j80j97l37
$$ 62 -113 -433 -572 -436 -62 202 508 610 278 34 -124 -413 -562 -332 -190 78 466 537 357 160 -177
3440a77l00K3J82O8K59L23M6J5j35m05m30J02J02Q1L52K94j6J5q6l99k29o1kR7
$$ -177 -477 -454 -272 -204 55 378 424 439 304 -101 -531 -429 -327 -246 106 400 384 399 313 -86 -315 -376 -378 -281
3464b81M57J93JJ5j38l14j82r7j55K09M19J14P6M3j57k86j14j50j19J97K86J20
$$ -281 176 369 370 385 247 -67 -249 -346 -501 -292 127 241 317 360 203 -83 -197 -347 -466 -269 17 137
3486A37K54O8k10k83j06j70j11J30K82J98J37J72j89k76q2k72j10K13J74J08K48
$$ 137 391 459 249 -34 -140 -310 -421 -291 -9 189 326 498 309 33 -49 -321 -431 -218 -44 64 312
3507C12K03k39j78j09k97l9J13J41P9L21M3j30q5j64l36k3J19L6K85K33J08j53
$$ 312 515 276 98 -11 -308 -347 -234 -93 -14 307 350 220 135 -29 -365 -388 -269 -233 52 285 393 240
3529B40Jk49k88l7P9K1K95K74Lj8j22k06k25M9j21L5K95K31j2Q7n7k79k10o4k3
$$ 240 241 -8 -296 -333 -254 -233 62 336 339 321 199 -7 -232 -183 -304 -269 26 257 245 332 275 -4 -214 -278 -301
3554c01O0K31J19J40P5o9k70j36j19j21K00J81J32J21J31j66j80p9j62j36P4K42
$$ -301 -241 -10 109 249 324 255 -15 -151 -270 -391 -191 -10 122 243 374 208 28 -51 -213 -349 -275 -33
3576c3J17J34J07j18j14j29k20j11J46J51J49K03O1j24j07j30k21m1N1N8J22K53
$$ -33 84 218 325 207 93 -36 -256 -367 -221 -70 79 282 343 219 112 -18 -239 -280 -229 -171 -49 204
3598B04P3j30O0j43l25KL2%J88K08N6p0O9k10j66j14L0MJ99J97L7O4l5k28j45
$$ 204 277 147 207 64 -261 -259 -227 -227 -39 169 225 155 224 14 -152 -266 -236 -232 -33 164 201 265 230 2 -143
3623a43k9q5L6J33K85N4M4l0l10m2p0j44M6J94J34J21L6Lj59j38j23j49J29J63
$$ -143 -172 -257 -221 -88 197 251 295 265 -45 -87 -157 -301 -255 -61 73 194 230 233 74 -64 -187 -336 -207 -44
3647d4O2P9J42j9j12j11j94j25R5J49O0K04R6j09o0o9j54k14P7R4J52J54J44j56
$$ -44 18 97 239 220 108 -3 -197 -322 -227 -78 -18 186 282 173 113 44 -110 -324 -247 -153 -1 153 297 141
3671A41J1m8j84j45J9J1J10K70Q2j15M1j35k48r8R8qJ02K33R5K0jj63k32m4m3
$$ 141 152 104 -80 -225 -206 -195 -85 185 267 152 193 58 -190 -288 -190 -198 -96 137 232 252 251 88 -144 -188 -231
3696b31l4J38K06M0J62J0j46k07j32r2P7J54J41rJ62Q6k16m5j45j94j6J76J01
$$ -231 -265 -127 79 119 281 291 145 -62 -194 -286 -209 -55 86 77 239 325 109 64 -81 -275 -291 -115 -14
3719a4J53Q8jj08n4q9k49l4J41J56R0J73l7o7o4j90q2L7q8Q9J94J90O4j04o1k01
$$ -14 139 227 226 118 64 -25 -274 -308 -167 -11 79 252 215 148 84 -106 -188 -151 -239 -150 44 234 298 194 133 -68
3745f8j58M2K3N5J53J78n9J34j49j95j54J5l5Q1J86R6M8O7m9j79j50j78j8R6K97
$$ -68 -226 -184 -161 -106 47 225 166 300 151 -44 -198 -183 -218 -137 49 145 193 260 211 32 -118 -296 -314 -218 79
3770G9R4O6Kn8k30Kj14j72Q6K33J65Q6Q6j56k09l7j68l3J38O5O9K75P8j57j43
$$ 79 173 239 241 183 -47 -45 -159 -331 -245 -12 153 239 325 169 -40 -77 -245 -278 -140 -75 -6 269 347 190 47
3795D7j61j35k0J06P8P8J99P4m1r2j96j91k6P9P9J52K18j9n1qj50k17j18j7J49
$$ 47 -114 -249 -269 -163 -85 -7 192 266 225 133 -63 -254 -280 -201 -122 30 248 229 178 170 20 -197 -315 -332 -183
3820a83K20J57J10j23l2j89j02l1j04lK19K69O5P8j14l06j13l2lJ6J92J54J41
$$ -183 37 194 304 181 149 -40 -142 -173 -277 -280 -61 208 273 351 237 -69 -182 -214 -217 -201 -9 145 286
3843B86Q2j29j91k00m2j98J80J87O3J74J47l7k16k13j71j14J88J69J52R8J07n5
$$ 286 368 239 48 -152 -194 -392 -212 -25 38 212 359 322 106 -107 -278 -392 -204 -35 117 215 322 267
3865B67j64r3k01j88J02J36J79K78R7k03p7j32k14j23M6J38J22K97P8l8q3k53
$$ 267 103 10 -191 -379 -277 -141 38 316 413 210 133 1 -213 -336 -290 -152 -30 267 345 307 224 -29
3887b9k05j51J33N9K21J81J22m1j1k88k59p6j6J05K06K07J69K2m8k22k55j32r9
$$ -29 -234 -385 -252 -193 28 209 331 290 279 -9 -268 -344 -360 -255 -49 158 327 349 301 79 -176 -308 -407
3910d07Q1K96K92R3j2n3k41j91j22j08N2K64J86K05O9l6l13k42j19oJ7J72J79
$$ -407 -326 -30 262 355 343 290 49 -142 -264 -372 -320 -56 130 335 404 368 55 -187 -306 -312 -295 -123 56
3933E6K37P7l5k12k15k33j21J59J52J91K37J26q5j24k58k42k23J28K14K14K17
$$ 56 293 370 335 123 -92 -325 -446 -287 -135 56 293 419 334 210 -48 -290 -513 -385 -171 43 260
3954B60J63o2j46k59k62j04j2J95K78K32J40o2j13j86l32q0n8J66J95L27O5K6
$$ 260 423 361 215 -44 -306 -410 -422 -227 51 283 423 361 248 62 -270 -350 -408 -242 -47 280 345 371
3976C71j36k14k98p2m7J7K86L14K23l2q4k86k84k07m9K23K86K04J76Lm8k21k64
$$ 371 235 21 -277 -349 -396 -379 -93 221 444 412 328 42 -242 -449 -498 -275 11 215 391 394 346 125 -139
3999a39k48n9Q9L20K67J43J12j32k36k56j87j54O0K86L15K11J54j56k08l01j97
$$ -139 -387 -446 -357 -37 230 373 485 353 117 -139 -326 -480 -420 -134 181 392 546 390 182 -119 -316
4020c16j55Q3J76K11K50K02l4k50k63k88j60J88J44K79K61J48l0j59l06l19p2
$$ -316 -471 -388 -212 -1 249 451 417 167 -96 -384 -544 -356 -212 67 328 476 446 287 -19 -338 -410
4041d10n0K14K74K72J35k4r1k99k81k05l4J65L44L44J63l3k17k28l08j78k7R1
$$ -410 -460 -246 28 300 435 411 320 21 -260 -465 -499 -334 10 354 517 484 267 39 -269 -447 -474 -383
4063c83K53M06K21J1j47k99l41j07j01Q8K88L27J81J30r2l00l30k67o6J15L27
$$ -383 -130 276 497 508 361 62 -279 -386 -487 -399 -111 216 397 527 435 135 -195 -462 -528 -413 -86
4084h6K86J93J61j28l09k30k87j42N7K96L73K09P6Ok50k88l11k04M8L00L30L16
$$ -86 200 393 554 426 117 -113 -400 -542 -485 -189 184 393 469 475 225 -63 -374 -578 -530 -230 100 416
4106D16J46j51k44k29l49j39Q7K06L32K96J67j8k02l88l25j77J35J36K71L91J53
$$ 416 562 411 167 -62 -411 -550 -463 -257 75 371 538 520 318 -70 -395 -572 -437 -301 -30 361 514
4127E14o0r3l01l97j11j02K19L33L41J74K4j77l35l83j70l8J52M53K76J66M6j58
$$ 514 454 361 60 -337 -448 -550 -331 2 343 517 541 364 29 -354 -524 -562 -410 43 319 485 531 373
4149C73l84k78j91k8P9L44L59J69J50j20l66l70k15q6J67K76L36L07O6j38l19
$$ 373 -11 -289 -480 -508 -429 -85 274 443 593 473 107 -263 -478 -564 -397 -121 215 522 588 450 131
4170A31k83k55j95J35L52L06K11K15j44k91l31k60j75J37K91L03K54J84j75k22
$$ 131 -152 -407 -602 -467 -115 191 402 617 473 182 -149 -409 -584 -447 -156 147 401 585 410 188
4190A88l12l39j46J45K67K65L85P4rk88l22l41j14P5J60L40L79K19q2k88k84l45
$$ 188 -124 -463 -609 -464 -197 68 453 527 518 230 -92 -433 -547 -472 -312 28 407 626 544 256 -28 -373
4212c73j89NK39L58L44J89J3k53l21l61k01J1J93L38L64J64m2j28l33l82j96J9
$$ -373 -562 -557 -318 40 384 573 586 333 12 -349 -550 -539 -346 -8 356 520 478 350 17 -365 -561 -542
4234e42J44L54M00J34Q3j49l91k81l39J6J70L20L53K29J01j86l37l62k09q2J41
$$ -542 -398 -44 356 490 573 424 33 -248 -587 -571 -401 -81 272 501 602 416 79 -283 -492 -574 -433
4255d33L38L43K20J07j49l30l29k59r2J37K60L45K83K28j47l39l48l30j29J32
$$ -433 -95 248 468 575 426 96 -233 -492 -584 -447 -187 158 441 669 522 183 -165 -495 -624 -492
4275d92K68L79L10J19p3k82l89k94j64J04K86L59L58O2Ll11l63l41j48R8K32L98
$$ -492 -224 155 465 584 511 229 -160 -454 -618 -514 -228 131 489 551 554 243 -120 -461 -609 -511 -279 119
4297A19L45J89j05j90m29l17k55J26K71K99L93J42o1k10l43l39j85r1L13L90L34
$$ 119 464 653 548 358 -71 -388 -643 -517 -246 53 446 588 527 317 -26 -365 -550 -641 -328 62 396
4318C96J77Ok21l77l80j71k8J87L82L88J95M3j66l83l88k23r3K45L43L93K53Q7
$$ 396 573 579 358 -19 -399 -570 -598 -411 -29 359 554 597 431 48 -340 -563 -656 -411 -68 325 578 665
4340F65k36k51m25k89j35K15L64L50K45J07j46k94l60l40o7O6L69M28K70J34j72
$$ 665 429 178 -247 -536 -671 -456 -92 258 503 610 464 170 -190 -530 -597 -531 -162 266 536 670 498
4361D98l36l33l48j75J88K69L95L94J32j65k58m22l53j09P8K92M35K99K44j15
$$ 498 162 -171 -519 -694 -506 -237 158 552 684 519 261 -161 -514 -623 -545 -253 182 481 725 610
4381F10k99m25l49k05J40K32M72L61J19n5l11l40m02k06N7K49M33L29K08Kk67
$$ 610 311 -114 -463 -668 -528 -296 176 537 656 601 290 -50 -452 -658 -601 -352 81 410 618 620 353
4402C53m11l77k06l4K88M16L95J75L0k86l71l36k87N6K58L12L73L07Kk04l37m54
$$ 353 -58 -435 -641 -675 -387 29 424 599 629 343 -28 -364 -651 -595 -337 -25 348 655 657 453 116 -338
4424c38k42o3J71M04L70L08P1k25l74m52k40p9K19L19M57K86P5j72l62l62l67
$$ -338 -580 -643 -472 -68 302 610 681 456 82 -370 -610 -689 -470 -151 306 592 667 495 133 -229 -596
4445e96p1J52L51L79L42P9r6l77l98l23j20J15L73L50M12R3q8k56n16l04j62J25
$$ -596 -667 -515 -164 215 557 636 540 163 -235 -558 -678 -563 -190 160 572 665 577 321 -195 -499 -661 -536
4467e36L16M32L67M7n3k48m89l78j12M4L18M58L14K03j8l28n16k93k39N4L38M43
$$ -536 -220 212 579 626 573 325 -164 -542 -654 -610 -292 166 480 683 665 337 -179 -472 -711 -657 -319 124
4489A24L33K08mk82m06l86k75P5K51L90M34J81Q2l86l89l65k25m5K77M02M08K69
$$ 124 457 665 661 379 -27 -413 -688 -613 -362 28 462 643 725 339 -50 -415 -640 -685 -408 -6 402 671
4511F71P7l28l59m62k63m1K40M30L24K88J09k24l58m19l02q2J89L77M08L51N0
$$ 671 748 420 61 -401 -664 -705 -465 -35 289 577 686 462 104 -315 -617 -699 -510 -133 275 626 676
4532F76j67l38m58l48j09J95M04L80L55P6j71k75m71l06j23J64L10M20L95R6p5
$$ 676 509 171 -287 -635 -744 -549 -145 235 590 666 495 220 -251 -557 -680 -516 -206 214 609 705 630
4553F30m29l64l78j29Q2L41M67L62Q9l3l33m63l13k09R0L02M14L78J87q6k86m80
$$ 630 201 -163 -541 -670 -588 -247 220 582 671 638 305 -158 -471 -680 -590 -288 126 504 691 605 319 -161
4575a61l19j79M0L45L05M11K49q3k86l97l58j93k7L01M10L81K10rk50l61m63k22
$$ -161 -480 -659 -619 -274 31 442 691 608 322 -75 -433 -626 -653 -352 58 439 649 640 390 29 -434 -656
4597f56j2K96L60M41K18M3k46l94m91k15JK15L95M33K57j3j95l33m44l01l0J75
$$ -656 -668 -372 -12 429 647 690 444 50 -441 -656 -655 -440 -45 388 645 632 437 104 -340 -641 -671 -496
4619d96L65M17L32R3k25l06m77l51l8J83L74M75K90N1j29l83m29k95j29J11L82
$$ -496 -131 286 618 711 486 180 -297 -648 -686 -503 -129 346 636 687 558 175 -254 -549 -678 -567 -185
4640a85L98L44J69j36l87l86l70j50J66K73M92L10J93j86k61m70m13j06J27K97
$$ -185 213 557 726 590 203 -183 -553 -703 -537 -264 228 538 731 545 284 -186 -599 -705 -578 -281
4660b81M35L74J23k9k65n14m00j51O8L11M25L88K34j10l23l51l76k16L3L11L95
$$ -281 154 528 651 622 357 -157 -557 -708 -640 -329 96 484 718 608 285 -66 -442 -658 -625 -314 81
4681H1M19K03l0l16m39l50k16L3J64M37M54K80o3k94l67m17k54lK35M05M04K89
$$ 81 500 703 673 357 -82 -432 -648 -615 -451 -14 440 720 657 363 -4 -421 -675 -678 -443 -38 366 655
4703F55k1j54m36m97k03j7K64L08M39L19Rj51m46m30l05J3J48M35M36K91L0j34
$$ 655 634 480 44 -453 -656 -673 -409 -101 338 657 666 515 69 -361 -666 -653 -505 -70 366 657 687 553
4725E53m00m22l67q7K10L27N04L36Q2j55m11m79k75j03J36L12N10L39J30j60l58
$$ 553 153 -269 -636 -723 -513 -186 318 654 736 581 170 -309 -584 -687 -551 -239 271 610 740 580 222
4746B22n28l63%R8L24M63L12K18j36k96m54m05k45J53L37M76L87J49o3l63m16
$$ 222 -306 -669 -669 -571 -247 216 528 746 610 314 -140 -545 -790 -637 -300 176 563 712 649 286 -130
4767a30l63k05ML30M96L33J92K0l79l72l78k67P6K38M34M58K21j5k94m67l47l02
$$ -130 -493 -698 -694 -364 132 465 657 677 298 -74 -452 -719 -643 -405 29 487 708 693 399 -68 -415 -717
4789g17MK98L82M44K24N3k63m66m10k13K9K18L74M56K64L3k99l15m56l21J1J75
$$ -717 -713 -415 -33 411 635 688 425 -41 -451 -664 -635 -417 -43 413 677 710 411 96 -360 -681 -670 -495
4811d95L79M33L82L6k34l70m47l46n5J71M20M24L26J28k58l31m79l04k8O4M18
$$ -495 -116 317 699 735 501 131 -316 -662 -717 -546 -126 298 624 752 494 163 -316 -620 -648 -584 -166
4832a66L83L88J75k01m08m31k79j11L9L73M53L54J90j59l45m14m48j27J22L95
$$ -166 217 605 780 579 171 -260 -539 -650 -611 -238 215 569 759 600 255 -159 -607 -734 -612 -217
4852b17L94L56K02j49l03m50l74k39J22L19M07M48K34j04l41l74n00j99J30K35
$$ -217 177 533 735 586 283 -167 -541 -780 -658 -339 68 516 750 646 305 -69 -569 -768 -638 -403
4872d03N05L48K58K3l52m72m71k12J01K50M90M10K28Jl36m10l75k36n4K87L71
$$ -403 102 450 708 731 379 -93 -564 -776 -675 -425 65 475 703 704 368 -42 -417 -653 -707 -420 -49
4893d9M62K83K9k29m87l94l51K5K33M30L83L63m9j72l22m87l96J4J87M16M71K63
$$ -49 413 696 725 496 9 -385 -736 -711 -478 -48 335 698 649 477 155 -332 -728 -714 -527 -111 360 623
4915F23J30k10l99m87k55j39J88L79M44L89R7k43l00n12k76j86J58L74M71L63
$$ 623 753 543 144 -343 -598 -737 -549 -170 274 663 760 517 217 -295 -571 -757 -599 -225 246 609
4935F09J50j35l80n13l16j60J11L82M17M16J82p1l95m72l92k25J29L64M35M49
$$ 609 759 624 244 -269 -585 -745 -634 -252 165 581 763 692 297 -175 -567 -792 -663 -299 136 585
4955E85J33j23k57n42l54j90P1L44M43M06K50j03l34m14l76k37P4K50M10M62K59
$$ 585 718 595 338 -204 -558 -748 -677 -333 110 516 766 663 329 -85 -461 -698 -624 -374 36 498 757
4976G57m9k87m15n18j94L9K92M17L83K46N1k58m74l84l32K1K56M32M00K82L3j89
$$ 757 708 421 6 -512 -706 -667 -375 42 425 671 722 464 -10 -394 -726 -705 -449 -17 383 665 698 509
4998E09m73m29l35k7K88M28M31L10M3k88l49m39k96l7Q9M56M50L62P2j73m61n29
$$ 509 36 -393 -728 -755 -467 -39 392 702 745 457 108 -331 -627 -664 -575 -119 331 693 765 592 131 -398
5020c98k30j05J44L96M03L72K02j48l83n72l26p8Q7L93M82L72J12r7l90m23l76
$$ -398 -628 -733 -589 -193 210 582 784 636 253 -319 -645 -723 -636 -243 239 611 723 626 236 -187 -563
5041e63k01J52L48L93M46J63p4l37m89l92k51J34L44M63L76L22j72l52l91m26
$$ -563 -764 -612 -264 129 575 738 664 327 -162 -554 -805 -671 -327 136 512 834 662 310 -81 -507
5061e07k58J11K55M60M76K50p9l29m67m40k10L9K89L92M52L68j04k40m69n07k41
$$ -507 -765 -654 -399 61 537 787 708 379 -88 -528 -738 -699 -410 -18 434 802 698 458 -11 -518 -759
5082g59o8K74N01M72L48j0k74m22m70l45n7K58N05M02L57N8k55m02m69l14j03
$$ -759 -827 -553 -52 420 768 758 484 62 -408 -753 -810 -552 -47 355 712 770 515 113 -356 -670 -773
5103g73K19M18M56L69M5j44l98m95l49j55K12M39M75L55J02j55m16m41m50r1J41
$$ -773 -554 -136 320 689 734 590 192 -303 -652 -807 -595 -156 319 674 776 621 205 -236 -686 -777 -636
5124f36L72M92L93J45k9n37m06m16k12K26L84L92M13J99j26l24m71l78k74Q0L41
$$ -636 -264 228 621 766 737 200 -206 -622 -834 -608 -224 168 581 780 654 330 -141 -519 -793 -713 -372
5145c72N48M56J81p5m37m20m08k54L8L57M10N28K09Rl43m66n52k41Q4L05M01N42
$$ -372 176 632 813 738 301 -119 -527 -781 -743 -386 24 552 761 770 427 -39 -591 -832 -748 -443 -42 500
5167E00K74j7k75m71n20k89P5K30M10N61K34J5k28m37m62l34j8K12M71M99L42
$$ 500 774 757 482 11 -509 -798 -723 -493 -83 478 712 727 499 62 -400 -734 -752 -540 -69 430 772
5188G72N5k67m34m93l63q4K36M05M71L80J14j54m91m80l30m9J12M21M35L86Q6
$$ 772 827 560 126 -367 -730 -814 -578 -173 298 678 792 638 147 -333 -663 -712 -600 -179 256 642 728
5209G28r2m39n49k92k21J97M32N02L43J98p9m58m86m39j20P9L98N14L97K17j01
$$ 728 636 197 -352 -644 -865 -668 -236 266 609 807 728 270 -216 -655 -775 -696 -298 216 613 830 729
5230G29m15m32m61k65J17L84M63M58L04j40l99m48m63k67J25K62N25M04L19n6
$$ 729 314 -118 -579 -844 -727 -343 120 578 882 742 343 -105 -568 -835 -710 -448 77 481 800 744
5250G44l25m80n05k06N2K38M83M53K87N8k46n51n08k56K0K84M52M69K37R3k46
$$ 744 419 -61 -566 -772 -720 -482 1 454 741 799 553 2 -506 -762 -742 -458 -6 463 700 793 547
5271E47m58n04l60J1J49N16N48K82N1k37l90n14l49j65K09M45N27L77J31j84m81
$$ 547 89 -415 -775 -764 -615 -99 449 731 782 545 155 -359 -708 -873 -664 -219 308 685 816 632 151
5292A51n33k93j15J95L72M06M67K05j63m26n38m00j61J61M22M58M57J84j60m09
$$ 151 -382 -675 -790 -595 -223 183 650 855 692 266 -272 -672 -833 -672 -250 208 665 849 689 280
5312B80m63m74j78J04M18M79M27J74o0l23m91m14k88N1L23N28M51K63j32k54m75
$$ 280 -183 -657 -835 -731 -313 166 593 767 707 384 -107 -521 -809 -758 -435 93 544 807 675 421 -54
5333e4m77k71M5L17M83M54L02o4l00m34m84k67k2K08N35M81L15K2k43m94n02k35
$$ -54 -531 -802 -757 -440 43 497 799 735 435 1 -483 -750 -772 -564 -29 452 767 789 546 52 -450 -685
5355f85n5K27M67M59L00K3j91l88n25l49p1J27N49N13K83J45k64l58n14l33j87
$$ -685 -740 -513 -46 413 713 736 545 157 -368 -717 -788 -661 -112 401 684 829 565 207 -307 -640 -827
5376h27J82M39M71M63J01j89m14n18m04j28J72L85M98M03K04j50l93n13l84j98
$$ -827 -645 -206 265 728 829 640 226 -292 -696 -824 -652 -267 231 634 838 688 295 -218 -602 -800
5396h00J76L45M20M31K28p5l82n21l95k38R6L83M66M73K17j03l23n19m23l16Q7
$$ -800 -624 -279 141 572 800 725 343 -178 -573 -811 -715 -332 134 607 824 721 398 -121 -544 -860 -773
5417g73L52M46N04K47q3k58n00m85k34M5K72L84N97K42j8k64m68m15l27l3K32
$$ -773 -421 25 529 776 693 435 -65 -550 -784 -739 -467 -83 514 756 738 474 6 -409 -736 -769 -537
5438e37M75M65K81P3j94m93m69l76KK12M70N04K51J54k33m60m46l49j63K23M98
$$ -537 -62 403 684 757 563 70 -399 -775 -773 -561 -91 413 664 818 585 125 -321 -670 -833 -610 -112
5459a12M38L01J67k04m59m20l73j58K26L65M32L78K49j36m28n03l41k41J64M14
$$ -112 326 627 794 590 131 -289 -662 -820 -594 -229 203 581 830 694 266 -237 -578 -819 -655 -241
5479b41M71L82K44k26l73l84l63l00J96K86M18M78J65k5l95l85m75k25M6K70N16
$$ -241 230 612 856 630 257 -127 -490 -790 -594 -308 110 588 753 728 333 -52 -527 -752 -706 -436 80
5500H0M33K37nl35m49n03j87M4J86M56N28K43J0k74m70l86l03n6K45M56N21K69
$$ 80 513 750 745 410 -39 -542 -729 -685 -499 -43 485 728 738 464 -6 -392 -695 -751 -506 -50 471 740
5522G40N7k25n03m50l15n7J66M79M50L71oj35m75m70l12o2J95M60M65L39lj23
$$ 740 797 572 69 -381 -696 -753 -587 -108 342 713 707 572 97 -373 -685 -747 -552 -92 373 712 709 586
5544E86l87m37l92j60J61M08M88L45J77j87l89m56l16k22J53L39M68L71K38j52
$$ 586 199 -238 -630 -790 -629 -221 267 612 789 602 213 -243 -559 -781 -628 -289 179 550 788 636
5564F36l30m34l88k52J11L25M65M07J79o0l18m48m22k75J59J78N05M80J53J1l39
$$ 636 306 -128 -516 -768 -657 -332 133 540 719 659 341 -107 -529 -804 -645 -467 38 518 671 682 343
5585C43l67m65k62O7K41M75M32K55L5l20l57n25k50JK30M40M61K43N1k08m83l84
$$ 343 -24 -489 -751 -684 -443 32 464 719 754 434 77 -448 -698 -697 -467 -27 434 677 728 520 37 -347
5607c47l11m9J94M24M48K74R3j91m17m91j93j39J22L99M66L29R9j62m01m71k59
$$ -347 -658 -707 -513 -89 359 633 726 535 118 -373 -566 -705 -583 -184 282 611 710 548 147 -324 -583
5628e83j50J38L69M35L58J53j38l40m68l63j83J55L72M28L30J95j21l47l93l85
$$ -583 -733 -595 -226 209 567 720 582 242 -226 -589 -772 -617 -245 183 513 708 587 240 -153 -538
5648e38k03J27L56L98L80J95n9l34l42m37k55N4K78M51M18K03r4k73l96l82k34
$$ -538 -741 -614 -258 140 520 715 656 322 -20 -457 -712 -658 -380 71 489 692 598 325 -71 -453 -687
5669f87L7K21L85M27K60M0k48m11m34k72M5K72L29M07K69J1j36m98l52k99j7J55
$$ -687 -650 -429 -44 383 643 683 435 24 -410 -682 -637 -365 -36 371 640 651 515 17 -335 -634 -651 -496
5691d96L83M47K67J07j66l95m06l74o4K16L20M51L15R6j97l42m07k16k19R1M19
$$ -496 -113 334 601 708 542 147 -259 -633 -697 -481 -161 290 605 701 504 162 -245 -461 -680 -589 -170
5712a70M11L22N7p6l63m68k25k12J66L52L54L32K23j51k78m49l33k15J74K69L62
$$ -170 241 563 620 544 181 -287 -512 -724 -558 -206 148 480 703 552 274 -175 -508 -723 -549 -280 82
5733H2L76K01m5l55k94m23j58RK13M77L53J98p3j86l48m57k62J03J83L77M29K02
$$ 82 458 659 614 259 -35 -458 -616 -607 -394 83 436 634 561 375 27 -430 -692 -589 -406 -29 400 602
5755F02m0k33l44l84j96K4Q9M16L99K72j1j43l88m16k32m8K21L12M69J71J26j79
$$ 602 562 329 -15 -399 -595 -571 -482 -66 333 605 594 451 63 -353 -585 -633 -412 -100 369 540 666 487
5777D87l82m16k78lJ23L81L69K46J05j86l33l52k83r5Q9L33L77L26J46j56l15
$$ 487 105 -311 -589 -592 -469 -88 281 527 632 446 113 -239 -522 -617 -528 -195 182 508 654 498 183
5798A83l72k81k00K07K48L33L30K43j84k46l82k38k39J08K77K79K96K55j6l67
$$ 183 -189 -470 -670 -463 -215 118 448 691 507 261 -121 -359 -598 -490 -213 66 362 617 601 234
5818B34k91l36k50J39K12L66K76K41q3j90l43m02j68O5K05L55L21K11lk32l36
$$ 234 -57 -393 -643 -504 -292 74 350 591 508 318 -25 -427 -595 -530 -325 30 351 562 559 327 -9
5839il63j70l2J70L51L69K53m7j37l54l85j41MJ24K08M41K55N5j77k79l90k32
$$ -9 -372 -542 -574 -404 -53 316 569 522 385 31 -354 -495 -491 -367 -159 282 537 592 415 136 -254 -486
5861d86p8J51K74K98L33J32j53k87l80l08j27J06M34K49K31J40p9k99l19k67j67
$$ -486 -564 -413 -139 159 492 624 471 184 -196 -504 -631 -525 -91 158 389 529 450 151 -168 -435 -602
5882f02J30K25M04K68J19r4k40l14k69j61k5L25K67M47Q6j05k43k73k82j85L0
$$ -602 -472 -247 157 425 544 450 210 -104 -373 -534 -559 -234 33 480 566 461 218 -55 -337 -522 -492
5903d92J75K85L72K25n6j49l68m02q9L3J61L15K60K05Qj22l20l63k36M2R6L55
$$ -492 -317 -32 340 565 509 360 -8 -410 -499 -466 -305 10 270 475 483 361 41 -322 -558 -516 -420 -65
5925f5M13Q5N6j49k47l62j81j02J09L57L25K02P6j40k90l12k53l6M8L43K79K38
$$ -65 348 433 489 340 93 -269 -450 -552 -443 -86 239 441 517 377 87 -225 -478 -514 -466 -123 156 394
5947C94Q3j10k04l41k47q4Q2K59K63K84R1l2j96l67k76j29L5K58L18K28J41j8
$$ 394 477 367 163 -178 -425 -509 -427 -168 95 379 470 438 242 -125 -401 -530 -495 -237 81 309 450 432
5969D32k19l19k00k42R3K44K71K79J11o0j88j59l58j31L3J81K61K50K64q8j63
$$ 432 213 -106 -306 -548 -455 -211 60 339 450 390 202 43 -315 -446 -413 -232 29 279 543 455 292
5990B92l17j89j52l3R7K64L15J58M0j90k97k77j63MJ48K39K59K53pp8k31l07k49
$$ 292 -25 -214 -366 -399 -302 -38 277 435 475 285 -12 -289 -452 -448 -300 -61 198 451 444 366 135 -172 -421
6013d21l8O7K44L41J75N6p8k11l11j68r7K9K88K61K17N7k2k85k29j59o7m2K00
$$ -421 -459 -392 -148 193 368 424 346 135 -176 -344 -441 -412 -124 137 354 411 389 104 -125 -284 -351 -393 -193
6036a93L22K04J35o7j98k73k56j41K3K23K81J74J98l6j75k37k75r2l6J68L20J39
$$ -193 129 333 468 401 203 -70 -326 -467 -444 -221 60 234 432 396 221 -16 -291 -383 -419 -251 69 208
6058B08J86lj22k44k89j90M3J82K06K59R4P9j53j90k52j56m9J07K57K44J53Qj07
$$ 208 394 391 269 25 -264 -454 -411 -229 -23 236 330 409 256 66 -186 -342 -391 -284 -27 217 370 378 271
6081B71k12k54j74l5J01J80K48J90O2q3j63l11j53q5J56K06J41K25M7Mk60k10
$$ 271 59 -195 -369 -404 -303 -123 125 315 377 294 131 -180 -333 -418 -262 -56 85 310 357 361 101 -109
6103a09k05j13J08K18K67J03N3N1j76k88j67j53M3J84K65K03J26q5j94j85j52
$$ -109 -314 -427 -319 -101 166 269 322 373 197 -91 -258 -411 -368 -184 81 284 410 325 131 -54 -206
6124b06j27l1J83J58K57J67j5k15j67k25j32K9J36J76J73J68J8j23j44k53j91
$$ -206 -333 -364 -181 -23 234 401 386 171 4 -221 -353 -324 -188 -12 161 329 347 224 80 -173 -364
6145c64M4J51J51K04J59l5q1r6k69k11mJ10J61L13P7N5j40j70j97j39n4M2J78
$$ -364 -320 -169 -18 186 345 310 229 133 -136 -347 -351 -241 -80 233 310 365 225 55 -142 -281 -335 -293 -115
6168a15K32J50P6j3k02k63j42JjJ49K16J47R1l3j53k65j57mJ6J91J28J21J11R1
$$ -115 117 267 343 330 128 -135 -277 -276 -277 -128 88 235 326 293 140 -125 -282 -286 -270 -79 49 170 281 372
6192C72j82j83k02n3r0K25J60J13J56p3n4k13j43r2n2P9K04K11O4L2o2k11j79
$$ 372 190 7 -195 -248 -338 -113 47 160 316 243 189 -24 -167 -259 -311 -232 -28 183 247 279 217 6 -173
6215a73j60J4J13J23K36J69J8j70j76j46j45OM6J89P8K34mRj83j83k12J6M4K16
$$ -173 -333 -319 -206 -83 153 322 340 170 -6 -152 -297 -291 -245 -56 22 256 252 261 78 -105 -317 -301 -257 -41
6239d1J41J83Jl2j63j43j51m8K6J17K11J58j6n0m3k17j65l0%J03K35J30o%o4j76
$$ -41 100 283 284 252 89 -54 -205 -253 -227 -110 101 259 243 193 150 -67 -232 -262 -262 -159 76 206 200 200 136 -40
6265d0j52j00qQ4K24Q4J88qj33j53j12j63J0J37J87J06P0R3j20j74j48q9q9J63
$$ -40 -192 -292 -300 -216 8 92 280 272 139 -14 -126 -289 -279 -142 45 151 221 314 194 20 -128 -217 -306 -143
6289a43J58J22R6Lk2j34j87j28p2J08J53J11J50L2j01n2j89j20k1J2Q1K35J13
$$ -143 15 137 233 236 214 80 -107 -235 -307 -199 -46 65 215 247 146 94 -95 -215 -236 -224 -143 92 205
6312B05M8r5o3j70j21r9Q1Q4J64J57R4j9j29j87j37q3J8J03K32R3K1O7j10k23
$$ 205 253 158 95 -75 -196 -295 -214 -130 34 191 285 266 137 -50 -187 -270 -252 -149 83 176 197 264 154 -69
6336f9j22m7K2M8J61J17Q9M6p2j88j21o6o0Q9J08K48K6K1r9m3k61j3o1P7J09J40
$$ -69 -191 -238 -216 -168 -7 110 199 245 173 -15 -136 -202 -262 -173 -65 183 209 230 131 88 -173 -186 -247 -170 -61 79
6362G9J64P7j45j20p8j94p1P2J77J60N9L2K4j35j02j89j7M3P6J28J36k4P1j21
$$ 79 243 320 175 55 -23 -217 -288 -216 -39 121 180 212 236 101 -1 -190 -207 -164 -88 40 176 152 223 102
6386A02j48j33p0O7M1J56J69N0k5o2k05j14o7L1P2J17J42J72q2m9j61r9p8l5L4
$$ 102 -46 -179 -249 -182 -141 15 184 234 209 147 -58 -172 -239 -208 -136 -19 123 295 213 164 3 -96 -174 -209 -175
6411a75J60J87O3L5j01j48j63Lq1J9J72Q6R6Q5n1j37j38j21o1N8J40J51J12O7
$$ -175 -15 172 235 270 169 21 -142 -139 -220 -201 -29 57 153 238 187 50 -88 -209 -270 -212 -72 79 191 258
6435B58p3j21r1j39r3P0J06J03J50N9j2p9j29j33o0o4J27J75J16N6j0j50p7j31
$$ 258 185 64 -27 -166 -259 -189 -83 20 170 229 217 138 9 -124 -184 -248 -121 54 170 226 216 66 -11 -142
6459a42j3m7R7Q2J86L6k9m2m5k17j2l1OJ68N4J37O3j55n8j34q8lM1O7J87M8L8
$$ -142 -155 -202 -105 -23 163 199 170 128 83 -134 -146 -177 -171 -3 51 188 251 96 38 -96 -184 -187 -146 -79 108 156 194
6486A94pj38j29o9n9L2J46Q3P8O9p3o8j44p2Lj7O5J55R6NK4p7p2j36j21MJ27N2
$$ 194 187 49 -80 -149 -208 -176 -30 53 131 200 127 59 -85 -157 -154 -171 -106 49 145 150 174 97 25 -111 -232 -228 -101 -49
6514d9J38J69o9o3j29k09Mk7J16N0J31J08jo2j01r5l6p4J19J07O3J04Mo4j11j75
$$ -49 89 258 189 126 -3 -212 -208 -235 -119 -69 62 170 169 107 6 -89 -125 -199 -80 27 90 194 198 134 23 -152
6540a52l8m1J35J00J11J26l8m0j08j27r2kJ5R9J19L6Q1mj60r1q6k8L6N9J44J28
$$ -152 -190 -231 -96 4 115 241 203 163 55 -72 -164 -166 -151 -52 67 103 184 180 20 -71 -157 -185 -149 -90 54 182
6566A82k4n0K3k00k6l6l9J15O3J26Q6j1j05j04k9j78l2J32J09J22M9jq2r9j02
$$ 182 158 108 131 -69 -95 -131 -170 -55 8 134 220 209 104 0 -29 -207 -239 -107 2 124 173 172 90 -9 -111
6591a11p3m2N1J74Q0R6J4k8j48j18j04pJ11N4N3J47K7k0j43q5j45K7L3J8K14Q7
$$ -111 -184 -226 -175 -1 79 175 189 161 13 -105 -209 -216 -105 -51 2 149 176 156 13 -72 -217 -190 -157 -139 75 162
6617A62N8k3j21j31j18j4kQ6J51J26O8r6n9j01r5j29L3O9J20J73J1Q2j75p3j51
$$ 162 220 197 76 -55 -173 -187 -189 -103 48 174 242 146 87 -14 -109 -238 -205 -136 -16 157 168 250 75 2 -149
6642a49j22R7Q5J37O8R2J9j37n0j01r2k3K0J21J77L5L8o8r1j13j36J6N7P5J35
$$ -149 -271 -174 -89 48 116 208 227 90 40 -61 -153 -176 -156 -35 142 177 215 147 56 -57 -193 -177 -120 -45 90
6667I0R2K0m2j27j12j03l5N4J49kJ62O5l0r2j35j29j01J01R6J25J32N1m9n0j51
$$ 90 182 202 160 33 -79 -182 -217 -163 -14 -16 146 211 181 89 -46 -175 -276 -175 -79 46 178 229 180 130 -21
6692b1j21n2L7O5J40J71j1j5p2j46j42q6M7J10R2J61J5R0r1j96j14r7N1j2J37
$$ -21 -142 -194 -157 -92 48 219 208 193 121 -25 -167 -253 -206 -96 -4 157 172 262 171 -25 -139 -236 -185 -197 -60
6717f0J75K2P1l8j87j20q5QJ5J35J22J04L4n5j21j17j37l6KK01J81Q1M4m7j32
$$ -60 115 137 208 170 -17 -137 -222 -214 -199 -64 58 162 196 141 20 -97 -234 -270 -268 -67 114 195 239 192 60
6742F0p3j09j34J9J02J51J82M0m9n7j55j20k8k5J33R6J40O3k7j72j17o4q3J7J01
$$ 60 -13 -122 -256 -237 -135 16 198 238 189 132 -23 -143 -171 -196 -63 33 173 236 209 37 -80 -144 -227 -210 -109
6767a09J00J35O2K6j0k05j36j38RJ50J66L9J69l4j10r7j20j80NQ5K20J05J54n4
$$ -109 -9 126 188 214 204 -1 -137 -275 -266 -116 50 89 258 224 114 17 -103 -283 -278 -193 27 132 286 232
6791B32n3j27j59r4m2L2J54K31K8J16j53q0j86p0j03R6Q6J68R4J03j32r3j53j01
$$ 232 179 52 -107 -201 -243 -211 -57 174 202 318 165 85 -101 -171 -274 -178 -92 76 170 273 141 48 -105 -206
6815b06o5K3J79J13J75O1p7j09j32j35r3OJ55P8K11R2p7j09j41q8j46J1J52J61
$$ -206 -271 -248 -69 44 219 280 203 94 -38 -173 -266 -260 -105 -27 184 276 199 90 -51 -139 -285 -274 -122 39
6839C9J13N1O8j08j69j23j71K2J58Q5J41J54j0j15j00j99j06mJ50J5J89K31m3
$$ 39 152 203 271 163 -6 -129 -300 -278 -120 -35 106 260 250 135 35 -164 -270 -274 -124 -109 80 311 268
6862B68n7j28j94j71K9N8J52J38J72J9r2j04k09r1n1L3J24K30J07rJ2j57j17j64
$$ 268 211 83 -111 -282 -253 -195 -43 95 267 286 194 90 -119 -210 -261 -228 -104 126 233 224 236 79 -38 -202
6886b02m7j3J74J70J16Q9o5j56j95j13p8M5J72J72J16J10nj56j65j41j02j4J19
$$ -202 -249 -262 -88 82 198 287 222 66 -129 -242 -320 -275 -103 69 185 295 290 134 -31 -172 -274 -288 -169
6909a69K20J07J48k2j56j21j92j33J01L8K07J61P7K8j02j69k16j14Q4P9O8K42
$$ -169 51 158 306 284 128 7 -185 -318 -217 -179 28 189 266 294 192 23 -193 -307 -223 -144 -76 166
6931A66L6L7j5j96j76j04j4N7J26K19Q6J06j51j19j69j82jJ26J18J76R9J6m4j54
$$ 166 202 239 224 28 -148 -252 -266 -209 -83 136 222 328 177 58 -111 -293 -294 -168 -50 126 225 241 197 43
6955D3j47j66oP3R7K27J40N3n2j62k02j44m1Q3N8K14J54P7o9j26k21j32n7J5J81
$$ 43 -104 -270 -276 -203 -106 121 261 314 262 100 -102 -246 -287 -204 -146 68 222 299 230 104 -117 -249 -306 -291 -110
6980a10J13K26L7Kj05k10j70o9kJ48J15J77J60o0l9k66j35j11j5R6K08K29R6J3
$$ -110 3 229 266 268 163 -47 -217 -286 -288 -140 -25 152 312 252 213 -53 -188 -299 -314 -218 -10 219 315 328
7004C28j52j59j46k03M5L8K00J77J31M5o5k17j68j45p0J04K27J95J56l6p6j43
$$ 328 176 17 -129 -332 -287 -249 -49 128 259 304 239 22 -146 -291 -361 -257 -30 165 321 285 209 66
7026F6j80j38p8J10J24K30J62J8m6k01j72j70j2PJ68K55N6J22lj37k38k12k6p4
$$ 66 -114 -252 -330 -220 -96 134 296 314 268 67 -105 -275 -287 -280 -112 143 199 321 318 181 -57 -269 -295 -369
7050c69J98K40K05L8m1p7k32j84q7M3Q8K05J99Q9k9j19k33j34j49JK05J37J82
$$ -369 -171 69 274 312 271 194 -38 -222 -309 -266 -178 27 226 315 286 167 -66 -200 -349 -348 -143 -6 176
7073A76J61K5j85j91j62j42j2J23K20J57J67L4j30k15j93j43M9Q7J22K43J44J3
$$ 176 337 362 177 -14 -176 -318 -330 -207 13 170 337 371 241 26 -167 -310 -261 -174 -52 191 335 348
7095C48j12j69k09j42m9Q4J54J73K11j6n8j82j88j52o5O4K64K00J19Q2j02j74
$$ 348 236 67 -142 -284 -333 -249 -95 78 289 273 215 33 -155 -307 -372 -308 -44 156 275 357 255 81
7117H1j95j27q9J09O4K38K02N2m7r9k44k43J3m4K11K17J55J00q0j08j99j89j16
$$ 81 -114 -241 -330 -221 -157 81 283 335 288 189 -55 -298 -285 -329 -118 99 254 354 274 166 -33 -222 -338
7140c38O7J23K55J26R9k8j51j87k28p3J7J22J76K19J46k4j14k34k48J7o8J05K21
$$ -338 -271 -148 107 233 332 304 153 -34 -262 -335 -318 -196 -20 199 345 321 207 -27 -275 -258 -326 -221 0
7163@K32O2O2j04k62j94j19J1J46J66J50J45R8j53j35k85j53OP8K00K08J68n9
$$ 0 232 294 356 252 -10 -204 -323 -312 -166 0 150 295 393 240 105 -180 -333 -327 -249 -49 159 327 268
7186B68mj69k47j63m0P9J17K81J74P0q9j19k46k09l6QK05J65K65m1M4k00j73j82
$$ 268 264 95 -152 -315 -355 -276 -159 122 296 366 277 158 -88 -297 -333 -325 -120 45 310 269 313 113 -60 -242
7210b42j01M0J24K51K06R3p2j02k73j54j05N7J43J40K11J03m7j14j30k84j03j6
$$ -242 -343 -303 -179 72 278 371 299 197 -76 -230 -335 -278 -135 5 216 319 272 158 28 -256 -359 -375
7232c75J38K42J90R0N6j50k24j98o8l0J46J64J86J49L7j59k06j50j39m3J08J57
$$ -375 -237 5 195 285 341 191 -33 -231 -299 -329 -183 -19 167 316 353 194 -12 -162 -301 -344 -236 -79
7254g9K56J32K0o8j72k57j66J5L9K41K03J21L1n0k25k04j18o5M3J95K08J49J03
$$ -79 177 309 329 261 89 -168 -334 -319 -280 -39 164 285 316 266 41 -163 -281 -346 -303 -108 100 249 352
7277C52r9j24k46j48n4j0K29J64J53J32k3j62j86k44j52R8K17J35J94J08K1k81
$$ 352 253 129 -117 -265 -319 -329 -100 64 217 349 326 164 -22 -266 -418 -320 -103 32 226 334 355 74
7299G4j42k12n6kJ38K77J55J01lj35k66j33j32O0N9K80J51R4O9j92k09j83j15
$$ 74 -68 -280 -336 -338 -200 77 232 333 330 195 -71 -204 -336 -276 -217 63 214 308 377 185 -24 -207 -322
7322c22o3J74J91J93J27Pj16j70j60j65k0N0K23J97K06j5p0k24j98j76rO3J73
$$ -322 -385 -211 -20 173 300 307 191 21 -139 -304 -324 -274 -51 146 352 337 267 43 -155 -331 -340 -277 -104
7345a04L25P9P8j04j74k11k13J9K2J75J88K12M4n7k01k65j30j2M7J52K62J39N0
$$ -104 221 300 378 274 100 -111 -324 -305 -283 -108 80 292 336 279 78 -187 -317 -329 -282 -130 132 271 321
7368C21J3k42j41j71j22M5J06K89J64P2qj88j77j71r1k9J69J32K58J17n6j66j65
$$ 321 334 92 -49 -220 -342 -297 -191 98 262 334 326 138 -39 -210 -301 -330 -161 -29 229 346 290 124 -41
7391d1k22o5kJ59J98K05J30n9q8k69j45j40K7J27J75K67N4L5r8k16k43j38M5R2
$$ -41 -263 -328 -330 -171 27 232 362 303 215 -54 -199 -339 -312 -185 -10 257 311 346 248 32 -211 -349 -304 -212
7415b12J88K20J15L6n8j79k48j15l6M4J98K12J42O7j11k02k30j55k8P5K13J48
$$ -212 -24 196 311 347 289 110 -138 -253 -289 -245 -47 165 307 374 263 61 -169 -324 -352 -277 -64 84
7437H4J98J9j6j93k01j59j14R8J23K47K35Ko2j56k40j32o8O1J49K10J95J6Mj75
$$ 84 282 301 285 92 -109 -268 -382 -284 -161 86 321 323 261 105 -135 -267 -335 -274 -125 85 280 296 300 125
7461A25k15j47q0MJ45K44J49R1j0k05j48j42j04o6J83J91J67J32k1q6k19k09m7
$$ 125 -90 -237 -317 -313 -168 76 225 316 306 101 -47 -189 -293 -359 -176 15 182 314 293 207 -12 -221 -268
7484b68l7P9J75K31J25l5q1j67k49q8PJ15J75J98J76m2r2k05k20n9j8M2K10J67
$$ -268 -305 -226 -51 180 305 270 189 22 -227 -315 -308 -193 -18 180 356 314 222 17 -203 -262 -280 -238 -28 139
7508A39J81L2j02j44k08j66k7J4K38J40J74L6j27j11j54j68q4N1J83J98J43O7
$$ 139 320 352 250 106 -102 -268 -295 -281 -43 97 271 307 180 69 -85 -253 -337 -286 -103 95 238 305
7530C05J2j72k45j88j2J8J62J93J66O1j9j57k35j30n9O3J08J86K13R1j20n2k54
$$ 305 317 145 -100 -288 -300 -282 -120 73 239 300 281 124 -111 -241 -300 -237 -129 57 270 361 241 189 -65
7553f5n5j76K8Q5K24J47Q9Pj11j78k16j15M7R1J73J70J26Jr7j19l01p5K6R9J88
$$ -65 -120 -296 -268 -183 41 188 277 284 173 -5 -221 -336 -289 -198 -25 145 271 272 175 56 -245 -320 -294 -195 -7
7578gJ63J06K9j11j74j65j39J9Q9J17K16K10o9r2k15j58j24m7J76J41J98J28K8
$$ -7 156 262 291 180 6 -159 -298 -279 -190 -73 143 353 284 192 -23 -181 -305 -352 -176 -35 163 291 319
7601C19o1k25j75n5m8M5Q3K39P7O6k7j57k08j42n1O5R9J98J42J36j39p5j97j68
$$ 319 258 33 -142 -197 -245 -200 -117 122 199 265 238 81 -127 -269 -320 -255 -156 42 184 320 181 106 -91 -259
7625b59pl4J97J70R9J63m6j64j77j30k6p6J64J69R3J46K7k11j43r8j37J2J13K08
$$ -259 -266 -300 -103 67 166 329 283 119 -58 -188 -214 -290 -126 43 136 282 309 98 -45 -143 -280 -268 -155 53
7649E3J17Q9l6j07j66j33j41M2Q0K34J01K13o8j35j02k26n5l3Q2J73J81Q0O2j15
$$ 53 170 259 223 116 -50 -183 -324 -282 -202 32 133 346 278 143 41 -185 -240 -273 -191 -18 163 243 305 190
7673A90j77j56j34J1Q5J62J52J06Q5j11j35k19l0j30J14P1K27J35Np1j22j51j39
$$ 190 13 -143 -277 -266 -181 -19 133 239 324 213 78 -141 -171 -301 -187 -116 111 246 251 180 58 -93 -232
7696b32n9P2J47J36R7J46j28j14j56o2j53J09J37J08J82N7r4r8j71j24q1M7J23
$$ -232 -291 -219 -72 64 161 307 179 65 -91 -153 -306 -197 -60 48 230 287 193 95 -76 -200 -281 -234 -111
7719a11J56J67Pj7j28j05k06l3L2J05J60J29J21q5k3j71j26j12j0J53J24J79j7
$$ -111 45 212 219 202 74 -31 -237 -270 -238 -133 27 156 277 192 169 -2 -128 -240 -250 -97 27 206 189
7742A89L2j21j70r6r5N0J19R3J92K6Mr0j42j44k3n6N3J76J69P1L3q7q9k30r2j0
$$ 189 221 100 -70 -166 -261 -211 -92 1 193 219 223 133 -9 -153 -176 -232 -179 -3 166 237 270 183 94 -136 -228 -238
7768b38P4J54Q0J14K1l6j57j42l4j03M3J66P9J58j8M0j43j60j10O9j10J89J85
$$ -238 -164 -10 70 184 205 169 12 -130 -164 -267 -224 -58 21 179 161 201 58 -102 -212 -143 -253 -64 121
7791A21J02L9m6j54j16j25j4K5R1J88P6L0l2m3j89p4o7k5J41P0J76Q7r3q2j60
$$ 121 223 262 216 62 -54 -179 -193 -168 -77 111 187 217 185 142 -47 -121 -188 -213 -72 -2 174 261 168 86 -74
7816g4k2j40L9M3J55K12L2m0q6j48j55j1o1J49P9K29M1oj44j41o4m2p8J24J16
$$ -74 -96 -236 -197 -154 1 213 245 205 119 -29 -184 -195 -256 -107 -28 201 242 236 92 -49 -113 -155 -233 -109 7
7841GJ34J21j0j21q5j88n6L8QJ71Q6J13m5o2o6j23j26J8M2J22J19O2Q2j01j34
$$ 7 141 262 252 131 46 -142 -198 -160 -152 19 105 218 173 111 45 -78 -204 -186 -144 -22 97 159 241 140 6
7866Fp2j72LJ13P7J21J03mk9j30j17q0n0M1R7K33J3N5J5j63j12j25loJ18J19J21
$$ 6 -66 -238 -235 -122 -45 76 179 175 146 16 -101 -181 -231 -190 -93 140 153 208 223 60 -52 -177 -180 -186 -68 51 172
7893A72M7n4p7j33j17q6M6O4J82J37K0L1j35j12j06o8OQ9N4K13N0q8J8j40j24
$$ 172 219 165 88 -45 -162 -248 -202 -138 44 181 201 232 97 -15 -121 -189 -183 -94 -40 173 223 135 153 13 -111
7918a11p4L3L6J19R1J33o4kj16j17j08j0M5J58Q4J20o8m8k2j72m3l7M9J29P3P0
$$ -111 -185 -152 -116 3 94 227 163 161 45 -72 -180 -190 -145 13 97 217 149 101 79 -93 -136 -173 -124 5 78 148
7944A48J7j8p7k32ok1O7P6J24O8L0o7r8j24o1KL0J02J01J00nm1j7j04j48jM4P9
$$ 148 165 147 70 -162 -168 -189 -122 -46 78 146 176 109 11 -113 -174 -172 -142 -40 61 161 156 115 98 -6 -154 -155 -111 -32
7972c2J24N6O1n6q9j20m2j05L6J14J18J16r0J14q8k01l8n4L0J6J48J04M0n4l5
$$ -32 92 148 209 153 64 -56 -98 -203 -167 -53 65 181 91 205 117 -84 -122 -176 -146 -130 18 122 162 108 73
7997G3q8j22n6P3P4M1Q7N2K5n9r1j34p6K4Q2Q9J10M7L5q7j09m5p9KQ7M8J07KM8
$$ 73 -15 -137 -193 -120 -46 -5 82 134 159 100 9 -125 -201 -177 -95 -6 104 151 186 99 -10 -55 -134 -132 -45 3 110 112 160
8026A60j39l1j03rK9j9R0J11M7Lk6j69pq5k2O1L7J57j0N0lr8j12n9O1o8J10J58
$$ 160 21 -10 -113 -122 -93 -112 -22 89 136 139 113 -56 -63 -148 -170 -109 -72 85 75 125 122 24 -88 -147 -86 -154 -44 114
8054A14l7R8m1j01n9j17mPO8J57O4o4K2l5j30r3M1RP2O3M9%J0J4j27l8r5k3J02
$$ 114 77 175 134 33 -26 -143 -147 -140 -72 85 149 85 107 72 -58 -151 -110 -101 -29 34 83 83 93 107 -20 -58 -153 -176 -74
8083g4R0R3K6Rj23o6n0ln5J30J7M4N0L9l0q0n4o7PN4Q9Q5j6n3k8m6j03n2Q2M7
$$ -74 16 109 135 144 21 -45 -95 -98 -153 -23 -6 38 88 127 97 17 -37 -104 -97 -43 46 131 115 62 34 -12 -115 -167 -85 -38
8113c8L0L5K7N8j06Pj05nkL1P2M4N4k5Qq0n5j0o5L5O2J02J5kMq9p3n2J8J3Q8L8
$$ -38 -8 27 54 112 6 13 -92 -97 -99 -68 4 48 102 77 85 5 -50 -60 -125 -90 -28 74 89 87 91 2 -71 -123 -105 -92 -4 34
8145C4K7N3Nr0p3j0m7M2L3K5J09l0l8n0j5m9K9j4L4K2P3N3o5k4n3k0n5L1L5M8
$$ 34 61 114 119 29 -44 -54 -101 -59 -26 -1 108 78 40 -10 -25 -74 -45 -59 -25 -3 70 123 58 34 -19 -39 -94 -63 -28 20
8175B0K0K7nj4p2Ol3k8Q4j0J14m1L2p8K2r9
$$ 20 40 67 62 48 -24 -18 -51 -79 5 -5 109 68 100 22 44 -55
8191e5
$$ Imaginary data points
##PAGE= N=2
##DATA TABLE= (X++(I..I)), XYDATA
0@%%%%%%%%%%%Qj6J6j6K4l2L4m2N6o6P6r2J09j28J51j76K02k33K69l08L54m03
$$ 0 0 0 0 0 0 0 0 0 0 0 0 8 -8 8 -8 16 -16 18 -24 32 -34 42 -50 59 -69 82 -94 108 -125 144 -164 190 -213
33b13M56n17N80o52P31q16R13j016J130j256J391j538J698j876K072k283K515
$$ -213 243 -274 306 -346 385 -431 482 -534 596 -660 731 -807 891 -985 1087 -1196 1319
50A319k771L054l365L710m099M535n029N594o248P015p931R048j0441J2238j4656
$$ 1319 -1452 1602 -1763 1947 -2152 2383 -2646 2948 -3300 3715 -4216 4832 -5609 6629 -8027
65h027J8107k3470L3015n5176K02990J19482k70082n7716j36477n2839J05592
$$ -8027 10080 -13390 19625 -35551 167439 286921 16839 -40877 -177354 -230193 -124601
76a24601P3817m3641J60147J83259j0190p6380j03719k58447j08753J47802J10583
$$ -124601 -50784 -94425 65722 248981 238791 162411 58692 -199755 -308508 -160706 -50123
87e0123L7816J33205M6382m7962M2017l0618k41732j41756L5282M9644J48619
$$ -50123 -12307 120898 167280 119318 161335 130717 -111015 -252771 -217489 -167845 -19226
98a9226K19098M470j03830P643m4884j43959m6633l7300o8932J35808K48498O4949
$$ -19226 199872 204342 100512 108155 63271 -80688 -127321 -164621 -233553 -97745 150753 215702
110B15702k6643l3930j62355j35722M1538n425p0585Q9331J43085O3379R9812
$$ 215702 189059 155129 -7226 -142948 -101410 -106835 -177420 -88089 54996 118375 218187
121B18187K2292k06170j76570p557j5681K4683J39319N4591n260J14045N4215
$$ 218187 240479 34309 -142261 -149818 -165499 -140816 -1497 53094 47834 161879 216094
132B16094j34331j20511q7113j14693N0551J95554P3898R880O8513k3194r3007
$$ 216094 81763 -38748 -125861 -240554 -190003 5551 79449 89329 157842 134648 41641
143D1641j7726p9464j59504R890J39699Q7855J08679Q8496r4469j18502n481o1408
$$ 41641 23915 -55549 -215053 -205163 -65464 22391 131070 219566 125097 6595 1114 -60294
155f0294r9287K3900M4389L1299J56159J32867o7971j01491o2657j19498m6622
$$ -60294 -159581 -135681 -91292 -59993 96166 229033 161062 59571 -3086 -122584 -169206
166a69206Q5260K2917j052J25072R6857j9357j1608p5496j84387o2756Q0814L8293
$$ -169206 -83946 -61029 -62081 62991 159848 140491 128883 53387 -131000 -193756 -112942 -74649
178g4649N6707J16737J5686k9671M2182m7695j60719o6265M028J576J18224J53464
$$ -74649 -17942 98795 114481 84810 126992 79297 -81422 -147687 -143659 -142083 -23859 129605
190A29605r17l7906J3640p0173r9695j2801m0698m8495J09186J46571L4918K1350
$$ 129605 128688 90782 104422 34249 -65446 -78247 -118945 -167440 -58254 88317 123235 144585
202A44585j2956j31879q7911J8910l1577k9778Q5639P6299L8353Q9282P960j41320
$$ 144585 131629 -250 -88161 -69251 -100828 -130606 -44967 31332 69685 158967 166927 25607
214B5607r7500k3456m4241L0512J07515K7543J3721Q9924J2289q9968n8691p5748
$$ 25607 -71893 -95349 -139590 -109078 -1563 25980 39701 129625 141914 51946 -6745 -82493
226h2493r5777M6376J24728M1297L7464N8096l9086n9145l229p5178j08395K2172
$$ -82493 -178270 -131894 -7166 34131 71595 129691 90605 31460 28231 -46947 -155342 -133170
238a33170P5730N2147J03661O4774p5511o7210j0113o9058n7654K9739J0867K3647
$$ -133170 -57440 -5293 98368 163142 87631 20421 10308 -58750 -116404 -86665 -75798 -52151
250e2151J26864Q2204m4779m7049n7969j06997k0921N9599K205J6627R6651M8542
$$ -52151 74713 156917 112138 65089 7120 -99877 -120798 -61199 -58994 -42367 54284 102826
262A02826l967J2466o9101j38726l4855L9971J7861O6290Q5558n058o982L7030
$$ 102826 98859 111325 42224 -96502 -131357 -91386 -73525 -7235 78323 73265 66283 103313
274A03313n0821j06620l8704k3422m727J06823J06663m058p415K678o9827n5935
$$ 103313 52492 -54128 -92832 -116254 -120981 -14158 92505 88447 81032 83710 13883 -42052
286d2052k796n1867l3215Q9003R1853L3203M1481k0670j11293n1265Q240l7677
$$ -42052 -44848 -96715 -129930 -40927 50926 84129 125610 104940 -6353 -57618 -49378 -87055
298h7055n918O5262L3990L8099Q5531m080j02662o0343l8066m5182M2754P8512
$$ -87055 -92973 -27711 6279 44378 129909 125829 23167 -37176 -75242 -120424 -77670 842
310H42P120K4113O9764m701n1728l1066p8301p8070M4731Q1496L0583N0124L7417
$$ 842 7962 32075 101839 97138 45410 14344 -63957 -142027 -97296 -15800 14783 64907 102324
323A02324m3352k8712J260p1273p3774J9138L5375M2952R7937M2062n8928l6342
$$ 102324 58972 30260 31520 -39753 -113527 -94389 -59014 -16062 81875 123937 65009 28667
335B8667j8133o4706k8118K2548r348K5072J03209N0543k4228j8541n8113r0243
$$ 28667 10534 -54172 -82290 -59742 -69090 -44018 59191 109734 85506 66965 8852 -81391
347h1391n196L6555o826K9098P3140K1586Q232K0166o3482j01242j9460J0808
$$ -81391 -86587 -50032 -56858 -27760 45380 66966 75198 95364 31882 -69360 -88820 -78012
359g8012P385O7380O2944q789Q394K4514n1995o8105k2859l4636m239Q6771O9663
$$ -78012 -70627 -3247 59697 50908 59302 83816 31821 -36284 -59143 -93779 -98018 -11247 58416
372E8416L289J4856n473o4358l3943o607m8441j2274O8005N1663L1402M5959k0432
$$ 58416 61705 76561 71088 6730 -27213 -33820 -82261 -94535 -26530 25133 56535 102494 82062
385H2062q0255l1304j2543l9246J1458N1038J7933L7949O3512j4816o3688l2409
$$ 82062 1807 -29497 -42040 -81286 -69828 -18790 -857 37092 100604 85788 22100 -10309
397a0309m5068m3179L6637N0835Q818L9749M8539k0075l1171j8260o6647n1448
$$ -10309 -55377 -98556 -61919 -11084 -2266 37483 86022 65947 34776 16516 -50131 -101579
409a01579L4156L9428K3386N9245K9764l4834j5092j2469o5992l8690K0833J1035
$$ -101579 -67423 -27995 -4609 54636 84400 49566 34474 22005 -43987 -82677 -61844 -50809
421e0809L2260P7766K5489l0916j0355k9597o4951j5149J5425p613L4047P3698
$$ -50809 -18549 59217 84706 53790 43435 13838 -51113 -66262 -50837 -58450 -24403 49295
433D9295K0490q543J114m8881o8531n773P475o976M4415N8527P799J0451J1049
$$ 49295 69785 61242 62356 13475 -55056 -60829 -53354 -60330 -15915 42612 50411 60862 71911
446G1911n4927o1186q683j2508k150N9053M7642K696K1384N954n5887m2045j1694
$$ 71911 16984 -44202 -52885 -65393 -67543 -8490 39152 41848 63232 69186 13299 -28746 -40440
459d0440l2482R97O2454L7628J2139L2342p861n6674k5579j6678m0639Q296N3278
$$ -40440 -72922 -71925 -9471 28157 40296 72638 64777 8103 -17476 -34154 -74793 -66497 -13219
472a3219K4493K6802M1771j7722n1211j8478k9235l9552J9667M0377J4274L8582
$$ -13219 11274 38076 79847 62125 10914 -7564 -36799 -76351 -56684 -16307 -2033 36549
484C6549M2036k1685l6256j6675m5159l5895K6440K8324J3883M7822L2946k3366
$$ 36549 78585 56900 20644 3969 -41190 -77085 -50645 -22321 -8438 39384 72330 48964
496D8964j8645j7132n5438k9678K3813J4569K1424N6320K1455k1538n784k3039
$$ 48964 30319 13187 -42251 -71929 -48116 -33547 -12123 44197 65652 44114 38330 15291
508A5291n7546j8728J4867Q27L0547N9337J3181j2154J286l4452n4474p771L932
$$ 15291 -42255 -60983 -46116 -45289 -14742 44595 57776 45622 46908 12456 -42018 -49789 -45857
521d5857o337L8272N2992P839L539M655m5079m8299l949q212m112M5348M0718
$$ -45857 -52194 -13922 39070 46909 50448 55103 10024 -38275 -42224 -50436 -54548 -9200 31518
534C1518N121J7619L717m8518l7739q113k1675K256M9694K9911Q261K6030l699
$$ 31518 36639 54258 57975 9457 -28282 -36395 -58070 -55814 -6120 23791 32052 58082 54383
547E4383m6009k4393j4970l1799Q214M6232K1523J8902L1224j3755m1287j4942
$$ 54383 8374 -16019 -30989 -62788 -54574 -8342 13181 32083 63307 49552 8265 -6677
559f677k2884l3635J4725L5702J4022L0859L3287j9549l2293j2706l3893k9356
$$ -6677 -29561 -63196 -48471 -12769 1253 32112 65399 45850 13557 851 -33042 -62398
571f2398K1094K3849J0982L9521K8467k0579j8569j4312m4201k3469K1780J3058
$$ -62398 -41304 -17455 -6473 33048 61515 40936 22367 8055 -36146 -59615 -37835 -24777
583b4777J5489M5108J8982j8178o451j8874m7788j5822J5172L403K3615M7249
$$ -24777 -9288 35820 54802 36624 30173 11299 -36489 -52311 -37139 -33736 -10121 37128
595C7128J0787j1397L44k6901m5539p904N754k522L0972M3366N683l61L231l4568
$$ 37128 47915 36518 36862 9961 -35578 -43482 -37728 -40250 -9278 34088 39771 39410 42641 8073
609H073m0116m493m947k258L7526L5432L385J0194J662l8412l0604n602j6354
$$ 8073 -32043 -36536 -41483 -43741 -6215 29217 32602 42796 44458 6046 -24558 -30160 -46514
622d6514O84M0799K7358P240J8658n336l9594k0314q846k3008N841L6637J8033
$$ -46514 -45830 -5031 22327 29567 48225 42889 3295 -17019 -25865 -48873 -43032 -6395 11638
635A1638J5817K6076j1695l7155j5412j7075k3306J4680K9739R598K2388K7181
$$ 11638 27455 53531 41836 4681 -10731 -27806 -51112 -36432 -6693 2905 25293 52474
647E2474j3785k6931j3284k9464k3293K0460K4392R900K7803J9510j6749j3855
$$ 52474 38689 11758 -1526 -30990 -54283 -33823 -9431 469 28272 47782 31033 17178
659A7178j0267l6268k1974J6741J5112J7173L6991J2010j9806p837j2403l4693
$$ 17178 6911 -29357 -51331 -34590 -19478 -2305 34686 46696 26890 19053 6650 -28043
671b8043j2887R774J521K0839M2796J1019j3117n981k4299l4367j300P670m417
$$ -28043 -40930 -31156 -29635 -8796 34000 45019 31902 25921 1622 -32745 -34045 -26375 -30792
684c0792K1402L5666Q224J961P39l3748l6958j111K845J903K8995K4517k26J0140
$$ -30792 -9390 26276 34500 36461 37200 3452 -33506 -34617 -31772 -29869 -874 23643 23417 33557
698C3557N757l1343l0273q403j1837O348L8831K2257n11R886k901k7837j4844
$$ 33557 39314 7971 -22302 -30705 -42542 -36194 2637 24894 24383 34269 31368 3531 -11313
711a1313r405k3099L632L5468K1613J2602J4754j5422l1544p886q155j9519O273
$$ -11313 -20718 -43817 -40185 -4717 16896 29498 44252 28830 -2714 -10600 -18755 -38274 -32001
724c2001K2354J1729K3493K4302j6027l0370j3410j8106j2291J8277J6154K980
$$ -32001 -9647 2082 25575 49877 33850 3480 -9930 -28036 -40327 -22050 -5896 -2916
736b916K2717K1919j0097j5311j5484l3049j4491K2019J7161R888K3241P974j2545
$$ -2916 19801 41720 31623 16312 828 -32221 -46712 -24693 -7532 2356 25597 33571 21026
749B1026j850j0096l4275j5993J0649R541K2313L2666J824j6259l225j3096k5327
$$ 21026 19176 9080 -25195 -41188 -30539 -20998 1315 33981 35805 19546 16321 3225 -22102
762b2102n507J025l458K3417L5840O795o452o872k6818k3600M267J570m155K0159
$$ -22102 -27609 -26584 -30042 -6625 29215 36010 29558 22686 -4132 -27732 -23465 -21895 -26050 -5891
776e891K4148O915R398j539l3304k6802q25j462O776K6043J2838J68J3612J584
$$ -5891 18257 25172 34570 33031 -273 -27075 -27900 -29362 -22586 3457 16295 16463 30075 31659
790C1659k6162j9849j1058j4219J1161L3018J3581K720R687q284k0635o549j2254
$$ 31659 5497 -14352 -25410 -39629 -28468 4550 18131 20851 30538 22254 1619 -4930 -17184
803a7184k0988P323K6181J4774J6531J2433j8257k2846m243j1594j3983R404J3037
$$ -17184 -38172 -30849 -4668 10106 26637 39070 20813 -2033 -6276 -17870 -31853 -22449 -9412
816i412P896K4538J7994j5421j9693j2093k0372o538J7340Q672M348K1770J3061
$$ -9412 -1516 23022 41016 25595 5902 -6191 -26563 -33101 -15761 -7089 -2741 19029 32090
829C2090q451o934j5085k9964q069J6395R973J2782K1156J627q828J416j2280
$$ 32090 23639 16705 1620 -28344 -36413 -20018 -10045 2737 23893 25520 16692 18108 5828
842E828k7450q628M951M664K2665K6342j202r130k153j6073j8706r03l060l062
$$ 5828 -21622 -30250 -25299 -20635 2030 28372 27170 18040 15887 -186 -18892 -19795 -22855 -25917
856b5917K2491K5799M205M83o401k6107j6527L865k649k88J9114J4783N611J2137
$$ -25917 -3426 22373 26578 27061 20660 -5447 -21974 -18109 -20758 -21046 -1932 12851 18462 30599
870C0599l538k8140j8107l400n057R766K2379O738K488J2802k778j9598j2215
$$ 30599 27061 -1079 -19186 -22586 -27643 -17877 4502 11240 13728 26530 23752 4154 -8061
883h061j3037j3685J2551K5342R289O787P364j0942j3952l175j3703j6326Q162
$$ -8061 -21098 -34783 -22232 3110 12399 19186 26550 15608 1656 -1519 -15222 -31548 -23386
896b3386J7170J1957J8664Q513j7666j5445m190j2636p674Q920N247P265K3689
$$ -23386 -6216 5741 24405 32918 15252 -193 -4383 -17019 -24693 -15773 -10526 -3261 20428
909B0428J2394j2063j2501j3569j9634p10J4562L518N483J8162O851l627j244
$$ 20428 32822 20759 8258 -5311 -24945 -25655 -11093 -7575 -2092 16070 22921 19294 18050
922A8050j6472k6520l925J1316P493J5178J5576l535m130L836j2255k0710o085
$$ 18050 1578 -24942 -28867 -17551 -10058 5120 20696 17161 13031 16867 4612 -16098 -22183
935b2183j563L654K3824K0513l065n203l613j5281j0102N80p626k848J9890J9019
$$ -22183 -23746 -20092 3732 24245 21180 15977 12364 -2917 -13019 -12439 -20065 -22913 -3023 15996
949A5996N900M220r259k4374r776L617l616K155J3910P227P530J4358m904k3563
$$ 15996 21896 26116 16857 -7517 -17293 -13676 -17292 -15137 -1227 6000 13530 27888 22984 -579
963e79j3776o357m050J3315J7207J044L258J0928l333j1955q268j6210j2386J3655
$$ -579 -14355 -20712 -24762 -11447 5760 6804 10062 20990 17657 5702 -2566 -18776 -31162 -17507
977a7507J9906P758Q040K541j2052o781j65j3667j2930N940J0213J2107J9690
$$ -17507 2399 10157 18197 20738 8686 1905 1740 -11927 -24857 -18917 -8704 3403 23093
990B3093M400j6524j0801m690j0378k006O181n66O994K1151Q799p538q624j5393
$$ 23093 27493 10969 168 -4522 -14900 -16906 -10725 -11291 -4297 16854 25653 18115 9491 -5902
1004e902j6741L324J1256J435O273J2636K992R75J165j6307k1452k259O371P252
$$ -5902 -22643 -19319 -8063 -6628 -355 12281 15273 16248 17413 1106 -20346 -22605 -16234 -8982
1018h982J5982J0028n533p29L012j1196j3563m992n603M074K1910J4584k088k020
$$ -8982 7000 17028 11495 10766 13778 2582 -10981 -15973 -21576 -17502 4408 18992 16904 14884
1032A4884n888j3716m377M58q764l73J6003J2165P053O110j0510j9925n687O75
$$ 14884 8996 -4720 -9097 -8639 -17403 -17776 -1773 10392 17445 23555 13045 -6880 -12567 -11892
1046a1892l604N352J0122K925Q235J2002o256j6594r421q741l537J3251J2173
$$ -11892 -15496 -10144 -22 2903 11138 23140 16884 290 -9131 -17872 -21409 -8158 4015
1059D015O55N521O982n197o880n825j5366q365J1597J2643P154R764L39j0834
$$ 4015 4670 10191 17173 11976 5096 -729 -16095 -24460 -12863 -220 6934 16698 17037 6203
1073F203l426j915j2535o984N185M899J0762J7136J500j1739o286p002r916J120
$$ 6203 2777 862 -11673 -18657 -13472 -8573 2189 19325 20825 9086 2800 -4202 -14118 -12998
1087a2998M479j429Q123J6055L880l803m669j4508j3272L576O136J347Q848R290
$$ -12998 -8519 -9948 -1825 14230 18110 14307 9638 -4870 -18142 -14566 -8430 -7083 1765 11055
1101A1055R7K250L93j4443j4315r80J330N721J4868P231l574J365k69j1023p935
$$ 11055 11152 13402 13795 -648 -14963 -15943 -14613 -8892 5976 13207 9633 10998 10729 -294 -8229
1116h229l505o132M447J6997R202N41J198o858j1940k350j527p074K865J1745
$$ -8229 -11734 -17866 -13419 3578 12780 13321 14519 7661 -4279 -6629 -8156 -15230 -12365 -620
1130f20O962P317N826r511j4270l778l065l070P049P191J651Q436Q143o585j0267
$$ -620 6342 13659 19485 9974 -4296 -8074 -11139 -14209 -7160 31 1682 10118 18261 11676 1409
1145A409o678r850k515J1267P813J924O975L437n657l134n163j3322m773Q485
$$ 1409 -5269 -15119 -17634 -6367 1446 3370 10345 13782 8125 4991 -172 -13494 -18267 -9782
1159i782P114P497R836j299q219j473l805j0355k747K930J834J0249J3654j11
$$ -9782 -2668 4829 14665 13366 5147 3674 -131 -10486 -13233 -10303 -8469 1780 15434 15323
1173A5323p113m038q387p747K626J931j355Q358J1264J985l26l480j3574r558
$$ 15323 8210 4172 -4215 -11962 -9336 -7405 -8760 -402 10862 12847 12521 9041 -4533 -14091
1187a4091L167K697K151Q853N260l90M052l24j2358r393j810j373O185J2966L916
$$ -14091 -10924 -8227 -6076 2777 8037 7647 11699 11375 -983 -10376 -12186 -13559 -7374 5592 9508
1202I508k124K569k164q485l945m127o800N000J3225O089K500J566p755q863j04
$$ 9508 7384 9953 7789 -696 -4641 -8768 -15568 -10568 2657 8746 11246 12812 5057 -3806 -3910
1217c910k674n732L399P552M582Q323M830q933j0215l036m207r97O739L414R46
$$ -3910 -6584 -12316 -8917 -1365 3217 11540 16370 7437 -2778 -5814 -10021 -11018 -4279 -865 81
1232H1Q218N802n066o157o421r747n57R413M759K386O048P57l728k27n154j1367
$$ 81 8299 14101 9035 2878 -3543 -13290 -13847 -4434 325 2711 8759 9516 5788 5561 407 -10960
1248a0960k819N496M623Q038Q067k940n584j77m324p367q55K06M05R806J0412
$$ -10960 -13779 -8283 -3660 4378 12445 9505 3921 3744 -580 -7947 -8802 -8596 -8191 1615 12027
1263A2027o67l812l466q446m794L063j94r85P387P182J680K150l286j1831o327
$$ 12027 11360 7548 4082 -4364 -9158 -6095 -6289 -7274 113 7295 8975 11125 7839 -3992 -10319
1278a0319K058O94K972P525K215J73M568j244r434n711k829k438O182R998J913
$$ -10319 -8261 -7567 -4595 2930 5145 5318 9886 8642 -792 -6503 -9332 -11770 -5588 4410 6323
1293F323q1K325l343n885j681m544n485M844Q793L865M149J510p217n862j45l742
$$ 6323 6242 8567 5224 -661 -2342 -6886 -12371 -7527 1266 5131 9280 10790 3573 -2289 -2434 -6176
1309f176l463L973L957L125P698L170p002n714k984n250j34N681J672J651P126
$$ -6176 -9639 -5666 -1709 1416 9114 12284 5282 -432 -3416 -8666 -8800 -3119 -1447 204 7330
1324G330K502l937k566n307q135K87N911K276L774N668p82k636K40n005p906m83
$$ 7330 9832 5895 3329 -1978 -10113 -9826 -3915 -1639 2135 7803 7021 4385 4625 -380 -8286 -8769
1340h769K617J957P034O223k116k496m73n475n086O43n24M54P722O100p12l94
$$ -8769 -6152 -4195 2839 9062 6946 4450 3977 -1498 -6584 -5941 -6465 -6011 1711 7811 7099 6705
1356F705k335p453l413J474j169R63O672L675O69K425k720q083l178Mj577L213
$$ 6705 4370 -3083 -6496 -5022 -6191 -5228 1444 5119 5788 8213 5493 -2590 -5768 -5764 -7341 -4128
1372d128O468J435J026L238k857o435k362k527k684M717O247J197K157K213m096
$$ -4128 2340 3775 4801 8039 5182 -1253 -3615 -6142 -8826 -4109 2138 3335 5492 7705 3609
1387C609m270j084m049k764M399M507J994M358J334n122l229j210m437j298L935
$$ 3609 -661 -1745 -5794 -8558 -4159 348 2342 6700 8034 2912 -317 -1527 -5964 -7262 -3327
1402c327K085K340N671J010m380k274k934n004K64L797Q31K868N424L0k607r43
$$ -3327 -1242 1098 6769 7779 3399 1125 -1809 -6813 -6549 -2752 -1921 947 6371 6401 3794 2851
1418B851m297n585R56K734P22M352M509j321j237m1m938m681O86P13J026N810
$$ 2851 -1446 -7031 -6075 -3341 -2619 1733 6242 4921 3684 3643 -1295 -5976 -5290 -4577 -3551 2259
1434B259L779j512k43q55n338k883P12j143J073O088K904l53J033k143n787j730
$$ 2259 6038 4526 4283 3428 -1910 -4793 -4081 -5224 -4151 1937 4841 4488 5521 3378 -2409 -4139
1450d139L61j599J918N114J510R49K309k808n532j438j119j493L359M361N17J706
$$ -4139 -3778 -5377 -3459 1655 3165 4114 6423 3615 -1917 -3355 -4474 -5967 -2608 1753 2270 3976
1466C976K179l102l805j207k909j774M112L652Q23K653J162l639k231q27l804
$$ 3976 6155 3053 -752 -1959 -4868 -6642 -2530 1122 1945 4598 5760 2121 -110 -937 -4741
1481d741j405L542K186J932L957K40l830j479j506l762p5K679N72K511M586j45
$$ -4741 -6146 -2604 -418 1514 5471 5711 1881 402 -1104 -4866 -4941 -2262 -1690 821 5407 5262
1497E262k702r90l087l891J106K118K18K878L782o45r77k81m171l692J050J035
$$ 5262 2560 1570 -1517 -5408 -4302 -2184 -1966 912 4694 4049 3072 2791 -1380 -5072 -4022 -2987
1513b987O52M007K793j282Pk54m194k764N72n18J069M779K094q55O63j234m244
$$ -2987 -2335 1672 4465 3183 3190 2936 -1258 -4022 -3450 -3968 -2899 1880 3974 3119 3782 2548 -1696
1530a696j296J38j519J460M365J387M21J402k291m066o77n82j591K285L394N85
$$ -1696 -2992 -2854 -4373 -2913 1452 2839 3260 4662 2371 -1695 -2372 -2954 -4545 -2260 1134 1719
1546A719J419J793k746l237n46j820j277K900K515L89K285J206k799k016o72k770
$$ 1719 3138 4931 2185 -1052 -1598 -3418 -4695 -1795 720 1109 3394 4600 1801 -215 -887 -3657
1562c657r34K973J537Q91K921N28k729r74j234l131j47K478N35J537L186j86j948
$$ -3657 -4591 -1618 -81 810 3731 4259 1530 556 -678 -3809 -3956 -1478 -943 594 3780 3594 1646
1579A646k50j987l351M82J752J50K351K974r04j118J99k609k806P28M91P2L189
$$ 1646 1396 -591 -3942 -3460 -1708 -1558 793 3767 2863 1745 1944 -665 -3471 -2743 -2252 -2180 1009
1596A009K474j025k39k36l086j729Q81n95J24L329J805m22O96r70l443j029O40
$$ 1009 3483 2458 2219 1983 -1103 -2832 -1951 -2546 -2422 907 2712 2290 2986 2016 -1427 -2456 -1816
1613a816q68P37K892O70J33J663j193l255p90m13j095J911K647j43N57J483j435
$$ -1816 -2684 -1947 945 1615 1748 3411 2218 -1037 -1827 -2240 -3335 -1424 1223 1080 1637 3120 1685
1630A685k013l19j634j479K236K327K26J342O41k183j066J80j848j305J718J034
$$ 1685 -328 -647 -2281 -3760 -1524 803 1029 2371 3012 829 -237 -57 -1905 -3210 -1492 -458
1646d58P89K561L90k495q87k57j910L6J491k13O60K741M12j550l61j546k383Q18
$$ -458 331 2892 3282 787 -100 -357 -2267 -2231 -740 -953 -293 2448 2860 1310 949 -597 -2980 -2162
1664b162J658l88Q99K010l72l87O56k044k478M72P13K10K133J333j278l4P11j709
$$ -2162 -504 -892 7 2017 1645 1258 1914 -130 -2608 -2136 -1423 -1213 920 2253 975 941 1652 -57
1682e7j505K36p25R9K788J363q92J92l68j987k74O20j236j54K180P55K52J189
$$ -57 -1562 -1326 -2051 -1952 836 2199 1307 1499 1131 -856 -1130 -510 -1746 -1900 280 1035 1287 2476
1700B476j075k516r7M44r26P22J403l75O59J677q79j867k46q79p82J689J341o50
$$ 2476 1401 -1115 -1212 -768 -1694 -972 431 56 715 2392 1513 -354 -600 -1479 -2261 -572 769 119
1718A19N66J071r58n34J44j648j159J576R76L2J260J73j502R3L77j511o86Q58
$$ 119 685 1756 798 264 408 -1240 -2399 -823 153 185 1445 1618 116 209 586 -925 -1611 -753
1736g53r1N30K016N7j441l0k45j280M02O57q02M23J784l6m37L56j236j457P94
$$ -753 -844 -314 1702 1759 318 288 43 -1237 -835 -178 -980 -557 1227 1191 754 1110 -126 -1583 -789
1755g89N69o47P73R09n13M00Q15j345j272M34j79q4J392M62r39N11N74j051l36
$$ -789 -220 -867 -94 815 302 702 1517 172 -1100 -666 -845 -929 463 925 -14 497 1071 20 -316
1774c16K02j051j48J610M22m22N79j86j133L44L93j207o2R76j63L93J076n92j157
$$ -316 -114 -1165 -1313 297 719 297 876 690 -443 -99 294 -913 -975 1 -162 231 1307 715 -442
1793d42L92Op51N34L92p42N39J161m29n53K18p93n99J038L05p17M26N84n14L59
$$ -442 -50 -44 -795 -261 131 -611 -72 1089 660 107 325 -468 -1067 -29 276 -441 -15 569 55 414
1813D14M83j286o16Q31p3o0Q54r9q45O93M76q88j43J44p19J61J273j03n97M79
$$ 414 897 -389 -1005 -174 -247 -307 547 448 -397 296 772 -116 -259 -115 -834 -673 600 497 -100 379
1833C79j51n30N79M5j180J47Q01r6K40N95p03o61P66%o57L00l2o03P48J014n61
$$ 379 228 -302 277 322 -858 -711 90 -6 234 829 126 -535 231 231 -426 -126 -158 -761 -13 1001 440
1854D40m80K00m76k18P47j78q07N86O14j53L48J29j196l40P15j27j15N34k34k51
$$ 440 -40 160 -316 -534 213 35 -772 -186 428 275 623 752 -444 -784 -69 -196 -311 223 -11 -262
1874b62R39K82r33l34n6n97N47R62l49l06N36O6m20L10n05j057L37R48J7K92L99
$$ -262 677 959 26 -308 -364 -961 -414 548 199 -107 429 495 75 385 -120 -1177 -840 108 125 417 816
1895H16o92k86M94k95p62J12J12K6J024P01p37n37P5m59j78M73k94l57R51P16
$$ 816 124 -162 332 37 -725 -613 -501 -475 549 1250 513 -24 51 -408 -586 -113 -407 -764 187 903
1915I03p8p3l70j189j33O23l6L4N95J30p1P52l22j215m96R6k5O77Q82j92j91N11
$$ 903 825 752 382 -807 -940 -317 -353 -319 276 406 335 1087 765 -450 -946 -850 -875 -198 684 492 301 812
$$ [...]
8191a
##END NTUPLES=NMR FID
##END=
