##TITLE=1H_Pr 116
 CDCl3
 8 sc, 
 6.06.2022
##JCAMPDX= 6.0         $$ Bruker NMR JCAMP-DX V2.0
##DATA TYPE= NMR FID
##DATA CLASS= NTUPLES
##ORIGIN= UXNMR, Bruker Analytische Messtechnik GmbH
##OWNER= root
$$ XWIN-NMR		Version 3.5
$$ Mon Jun  6 14:01:33 2022 Russian Standard Time (UT+4h)  she@DPX200
##.OBSERVE FREQUENCY= 200.13135
##.OBSERVE NUCLEUS= ^1H
##.DELAY= (6, 6)
##.ACQUISITION MODE= SIMULTANEOUS
##.ACQUISITION SCHEME= undefined
##.AVERAGES= 8
##.DIGITISER RES= 18
##SPECTROMETER/DATA SYSTEM= spect
##.PULSE SEQUENCE= zg30
##.SOLVENT NAME= CDCl3
##.SHIFT REFERENCE= (INTERNAL, CDCl3, 0, 15.7039)
##AUDIT TRAIL= $$ (NUMBER, WHEN, WHO, WHERE, WHAT)
$$ ##TITLE= Audit trail, XWIN-NMR		Version 3.5
$$ ##JCAMPDX= 5.01
$$ ##ORIGIN= Bruker BioSpin GmbH
$$ ##OWNER= she
$$ F:/spectra/data/she/nmr/H-F/1/audita.txt
$$ ##AUDIT TRAIL=  $$ (NUMBER, WHEN, WHO, WHERE, WHAT)
(   1,<2022-06-06 14:00:06.15 +0400>,<she>,<DPX200>,
      <created by zg, POWCHK disabled, PULCHK disabled
       configuration hash MD5:
       00 E9 B6 7A A2 85 ED C7 34 08 36 98 17 FE 4E 26
       data hash MD5: 16K
       23 BF 54 15 77 3F 1F 49 BC D0 0F B3 D8 10 6F 97>)
$$ ##END=
$$ 
$$ hash MD5
$$ C0 8C 2F 6D 58 C3 D6 8D 19 16 B7 EA 95 2D BD B2
##$RELAX= 
##$RELAX= 
##$RELAX= 
##$RELAX= 
##$RELAX= 
##$RELAX= 
$$ Bruker specific parameters
$$ --------------------------
##$DU= <F:/spectra>
##$EXPNO= 1
##$NAME= <H-F>
##$PROCNO= 1
##$TYPE= <nmr>
##$USER= <she>
##$AMP= (0..31)
100 100 100 100 100 100 100 100 100 100 100 100 100 100 100 100 100 100 
100 100 100 100 100 100 100 100 100 100 100 100 100 100 
##$AQSEQ= 0
##$AQ_mod= 1
##$AUNM= <au_zg>
##$AUTOPOS= <>
##$BF1= 200.13
##$BF2= 200.13
##$BF3= 200.13
##$BF4= 200.13
##$BF5= 200.13
##$BF6= 200.13
##$BF7= 200.13
##$BF8= 200.13
##$BYTORDA= 1
##$CFDGTYP= 0
##$CFRGTYP= 5
##$CHEMSTR= <none>
##$CNST= (0..31)
1 1 145 1 1 1 1 1 1 1 1 1 1 1 1 1 1 1 1 1 1 1 1 1 1 1 1 1 1 1 1 1 
##$CPDPRG= <>
##$CPDPRG1= <>
##$CPDPRG2= <>
##$CPDPRG3= <>
##$CPDPRG4= <mlev>
##$CPDPRG5= <mlev>
##$CPDPRG6= <mlev>
##$CPDPRG7= <mlev>
##$CPDPRG8= <mlev>
##$CPDPRGB= <>
##$CPDPRGT= <>
##$D= (0..31)
0 1.2 0 0 0 0 0 0 0 0.06 0 0.03 0 0 0 0 0.0002 0 0 0 0 0 0 0 0 0 0 0 0 
0 0 0 
##$DATE= 1654509605
##$DBL= (0..7)
120 120 120 120 120 120 120 120 
##$DBP= (0..7)
150 150 150 150 150 150 150 150 
##$DBP07= 0
##$DBPNAM0= <>
##$DBPNAM1= <>
##$DBPNAM2= <>
##$DBPNAM3= <>
##$DBPNAM4= <>
##$DBPNAM5= <>
##$DBPNAM6= <>
##$DBPNAM7= <>
##$DBPOAL= (0..7)
0.5 0.5 0.5 0.5 0.5 0.5 0.5 0.5 
##$DBPOFFS= (0..7)
0 0 0 0 0 0 0 0 
##$DE= 6
##$DECBNUC= <off>
##$DECIM= 32
##$DECNUC= <off>
##$DECSTAT= 4
##$DIGMOD= 1
##$DIGTYP= 9
##$DL= (0..7)
0 120 120 120 120 120 120 120 
##$DP= (0..7)
150 150 150 150 150 150 150 150 
##$DP07= 0
##$DPNAME0= <>
##$DPNAME1= <>
##$DPNAME2= <>
##$DPNAME3= <>
##$DPNAME4= <>
##$DPNAME5= <>
##$DPNAME6= <>
##$DPNAME7= <>
##$DPOAL= (0..7)
0.5 0.5 0.5 0.5 0.5 0.5 0.5 0.5 
##$DPOFFS= (0..7)
0 0 0 0 0 0 0 0 
##$DQDMODE= 0
##$DR= 18
##$DS= 0
##$DSLIST= <SSSSSSSSSSSSSSS>
$$ [...]
##$SUBNAM2= <"">
##$SUBNAM3= <"">
##$SUBNAM4= <"">
##$SUBNAM5= <"">
##$SUBNAM6= <"">
##$SUBNAM7= <"">
##$SUBNAM8= <"">
##$SUBNAM9= <"">
##$SW= 18.05172834244
##$SWIBOX= (0..15)
0 0 2 0 0 0 0 0 0 0 0 0 0 0 0 0 
##$SW_h= 3612.71676300578
##$TD= 16384
##$TD0= 1
##$TE= 0
##$TE2= 300
##$TE3= 300
##$TEG= 300
##$TL= (0..7)
0 120 120 120 120 120 120 120 
##$TP= (0..7)
150 150 150 150 150 150 150 150 
##$TP07= 0
##$TPNAME0= <>
##$TPNAME1= <>
##$TPNAME2= <>
##$TPNAME3= <>
##$TPNAME4= <>
##$TPNAME5= <>
##$TPNAME6= <>
##$TPNAME7= <>
##$TPOAL= (0..7)
0.5 0.5 0.5 0.5 0.5 0.5 0.5 0.5 
##$TPOFFS= (0..7)
0 0 0 0 0 0 0 0 
##$TUNHIN= 0
##$TUNHOUT= 0
##$TUNXOUT= 0
##$USERA1= <user>
##$USERA2= <user>
##$USERA3= <user>
##$USERA4= <user>
##$USERA5= <user>
##$V9= 5
##$VALIST= <valist>
##$VCLIST= <CCCCCCCCCCCCCCC>
##$VD= 0
##$VDLIST= <DDDDDDDDDDDDDDD>
##$VPLIST= <PPPPPPPPPPPPPPP>
##$VTLIST= <TTTTTTTTTTTTTTT>
##$WBST= 1024
##$WBSW= 4
##$XGAIN= (0..3)
0 0 0 0 
##$XL= 0
##$YL= 0
##$YMAX_a= 147153
##$YMIN_a= -207866
##$ZGOPTNS= <>
##$ZL1= 120
##$ZL2= 120
##$ZL3= 120
##$ZL4= 120
##$ABSF1= 10
##$ABSF2= 0
##$ABSG= 5
##$ABSL= 3
##$ALPHA= 0
##$AQORDER= 0
##$ASSFAC= 0
##$ASSFACI= 0
##$ASSFACX= 0
##$ASSWID= 0
##$AUNMP= <proc_1d>
##$AZFE= 0.1
##$AZFW= 0.1
##$BCFW= 1
##$BC_mod= 2
##$BYTORDP= 1
##$COROFFS= 0
##$CY= 11.3945322036743
##$DATMOD= 1
##$DC= 2
##$DFILT= <>
##$DTYPP= 0
##$F1P= 2.36226072786647
##$F2P= -0.459571619588291
##$FCOR= 0.5
##$FTSIZE= 0
##$FT_mod= 4
##$GAMMA= 1
##$GB= 0.15
##$INTBC= 1
##$INTSCL= 1
##$ISEN= 128
##$LB= 0.24
##$LEV0= 0
##$LPBIN= 0
##$MAXI= 10000
##$MC2= 0
##$MEAN= 0
##$ME_mod= 0
##$MI= 1.114404
##$NCOEF= 0
##$NC_proc= 0
##$NLEV= 6
##$NOISF1= 3.799351
##$NOISF2= 2.8
##$NSP= 1
##$NTH_PI= 0
##$NZP= 0
##$OFFSET= 15.70392
##$PC= 1
##$PHC0= -18037.07
##$PHC1= 16.80074
##$PH_mod= 1
##$PKNL= yes
##$PPARMOD= 0
##$PSCAL= 0
##$PSIGN= 0
##$REVERSE= no
##$SF= 200.130013532006
##$SI= 16384
##$SIGF1= 3
##$SIGF2= 2
##$SINO= 400
##$SIOLD= 16384
##$SREGLST= <1H.CDCl3>
##$SSB= 0
##$STSI= 0
##$STSR= 0
##$SW_p= 3612.71676300578
##$SYMM= 0
##$S_DEV= 0
##$TDeff= 0
##$TDoff= 0
##$TI= <>
##$TILT= no
##$TM1= 0
##$TM2= 0
##$TOPLEV= 0
##$USERP1= <user>
##$USERP2= <user>
##$USERP3= <user>
##$USERP4= <user>
##$USERP5= <user>
##$WDW= 1
##$XDIM= 8192
##$YMAX_p= 0
##$YMIN_p= 0
$$ End of Bruker specific parameters
$$ ---------------------------------
##NTUPLES= NMR FID
##VAR_NAME=  TIME,          FID/REAL,        FID/IMAG
##SYMBOL=    X,             R,               I
##VAR_TYPE=  INDEPENDENT,   DEPENDENT,       DEPENDENT
##VAR_FORM=  AFFN,          ASDF,            ASDF
##VAR_DIM=   8192,          8192,            8192
##UNITS=     SECONDS,       ARBITRARY UNITS, ARBITRARY UNITS
##FACTOR=    0.0002768,     1,               1
##FIRST=     0,             0,               0
##LAST=      2.2672688,     0,               0
##MIN=       0,             -207866,         0
##MAX=       2.2672688,     147153,          0
$$ Real data points
##PAGE= N=1
##DATA TABLE= (X++(R..R)), XYDATA
$$ [...]
1907C24l43N76N3p47R04J91j155J096l99m10M53p87O78q5j248J448n98q02Q51
1926@r60P86j92r50J206l95j51P92p14O44Q1l83Q36lp23Q25n93P59j22o81P00
1947G62k18o43P26k38k52K56j244J060o6j008P96n85J43M09q47M66K14p59R09
1966a19k70M54K66p56R98j33n94Q85Rm10M43q30P84J14j152R75l58l49K75n99
1986c67K99J98j255Q97J21q21P01o08P48N6j048J170j21m86P51j98L09L29j089
2005d14Q38J83p23O86p6J24M8j001R62j8j233J163m25n91L41o11P90l69o12M81
2025d57j32k77P78o59M13N16q89J055j66m16O57p11Q76K72q59P11o7n16Q17m95
2045D51k62O15j056K38L00n50M99o81K34M99j383O81J36m72N39m58L19L79r03
$$ y = [324, -19, 557, 610, -137, 767, 958, -197, 899, 500, 90, 543, -244, 434, 349, -899, 549, -49, -851, 0, -960, -174, -366, -1316, -110, -505, -656, 136, -578, 66, 147, -236, 600, 597, -126, 699, 106, 865, 743, 62, 762, 544, -99, 627, 389, 137, 393, -851, 209, 143, -865, -69, -654, -511, -102, -949, -483, -269, -1028, -119, -389, 65, 331, -425, 573, 440, -154, 731, 740, 330, 773, -57, 727, 841, -311, 664, 306, -43, 232, -367, -68, 130, -1125, -228, -107, -928, -227, -835, -87, -31, -1079, 91, -30, -516, 235, 37, 346, 675, -414, 424, 607, -116, 570, 494, 618, 666, -335, 627, 609, -624, 539, 114, -477, -136, -747, 43, -326, -938, -457, -589, -866, -88, -747, -334, 182, -707, 348, 182, -234, 423, -288, 588, 860, 1, 712, 645, 129, 946, 451, 189, 804, -252, -14, 286, -264, 235, -446, -212, 287, -1096, -415, -279, -751, -212, -670, -351, 28, -875]
2064h75J061L31j350J162j00J41O05j301J062K47j317P43M14q34K68m01M41J29
2082D26j162Q10j62o94Q53n73j1L24o38O92m12k42R82q02K15P20p00N49N9k66
2102c2Q05o55L65N33r86K92J36m21P08p30l06J362j636J84N80q21M33k17M9M41
2122H4j192P29M22j226P76K81L6N53q47L95O86j187J128j18n37J092q66J92J56
2141E57p97P09j68o15N61m08j50L79q03O64j86p98J018n18j11N78n71K73Rr9Q64
2162C88m17o61J583q60L05K67o65Q95o41p4P51o80p0P51r00J95k16k44P57j274
2182h10K57P66q83L09k2l81Q11q48M57P45j331Q37K68m89N35j47NO26q49N77K21
2203F54r73R24j20l04M42p95J82L23o43N44j59n38L45n65K97q9l78J191o79l83
$$ y = [-875, 186, 517, -833, 329, 229, 370, 975, -326, 736, 983, -334, 409, 823, -11, 257, -144, 297, 426, -736, 74, -88, -782, 71, -502, -513, -189, -827, -135, -547, -789, 193, -609, -394, 326, -374, 175, 234, -32, 773, 118, 483, 1016, 30, 322, 458, 37, 745, 15, -291, 1071, -565, -381, 199, -622, -189, -406, -357, 84, -1108, -379, 43, -1183, -407, -126, -90, 463, -384, 11, 697, -490, 638, 520, -17, 1075, 209, 401, 557, -240, 469, 301, -314, 247, -161, -311, 68, -735, -71, -257, -1055, -37, -555, -666, -88, -659, -386, -377, -476, 388, -29, -690, 893, 33, 338, 605, -60, 835, 194, 120, 871, 191, 121, 872, -28, 167, -49, -293, 464, -810, -553, 213, -670, -361, -383, -764, 47, -801, -344, 401, -930, -93, 175, -314, 221, 74, 79, 705, -144, 433, 654, -319, 605, 485, 181, 623, -172, 10, 333, -310, 234, 75, -463, -118, -683, -386, -475, -853, 338, -341, -724]
2223g24R42k94k39K39k14P04l16j59R79o13l64R70m64J63l26l91J084j010M0O74
2243F81j002J35M25q08O41q51L14P76j458N95K34k75L20n0P6O30p39N12L86q02
2263b60N57q5m6P52q45N23j60n50O69q1p70O30m73J77J25q37Q34n77n29J165n71
2284c52j70L61n84N16o3k67J002o66J53O85p11L95L22p41R07m51k56Q46p90K0
2304A56L82n20M70n29l24O76q43L37K18j001R45m74kN40p60L36N15p42O35K36
2324B51k30L30l93P2P06q23N87n3p75J048m92R9L2l70K57J50p97Q53p52l23M84
2345a39m07K34J03o64J057n81m26Q76k71j58M40o68J191n64k30J039p18k6N79
2364F67p17O08o0n67O72p13J79K73q48M65m1k16L73m76J11K45o21M18J97o72O92
$$ y = [-724, 218, -76, -315, -76, -290, 414, 98, -61, 918, 305, -59, 911, 447, 610, 284, -107, 977, -33, 7, 681, -321, -186, 239, -569, 72, -779, -465, 311, -1147, -552, -318, -593, -273, -323, -247, 383, -356, 156, 542, -260, 297, 212, 166, 918, 73, 596, 436, -114, 555, 474, -296, 334, -139, 38, 163, -674, 160, -417, -946, 219, -352, -522, -161, -745, -229, -292, -559, 443, -223, -70, 615, -96, 299, 621, -120, 787, 336, 80, 926, 136, 156, 538, 18, 488, -41, -365, 311, -532, -195, 23, -978, -33, -507, -509, 31, -729, -393, 122, -620, 15, 251, 21, 351, -42, 30, 736, -87, 500, 447, -328, 720, 228, 327, 359, -11, 246, 396, -401, 452, -300, -623, -139, -546, -312, -209, -873, 184, -397, -823, 53, -218, -376, 64, -604, 587, 23, -207, 832, 114, 88, 667, -50, 558, 498, -69, 603, -110, 69, 342, -506, -41, -82, -298, 75, -401, -290, -45, -666, -248, -51, -723, -31]
2385c1l79p8O46m12L21L38p10Q59l81N6N22o53M51Pn86P82l58m43O55o93K8L10
2407B51p87O06l76k78P30n28N0K04l88M81r7l92O96l08LM56m00M94r0l38P52n72
2429A69RK61k63L45j47n96O10m17j46M82q08J24J72m31M52O5l71M03n31L27J29
2450a62p21P57M39o84O27Q7L6M01r11M09K06m26P27o50K68p0n83K38K4l67N17
2471A62l95J00J72p53N08J4p27P67j61R7J74l69L16O6j88P45l47j95M68m28L07
2492C33M71q94O78k03l68L34m00K61K45q59P98n64k10K20l02R8M58q71Q31o6p16
2513g26Q24m27M2M59m16M82j8o30Q33k68L44J7m17L01K86q73Q34m84L2L34j105
2534e76O61k3l80L06l55q0N06o13M94r4n14N17J9k65O66r38N71N15r38P79J87
$$ y = [-31, -410, -488, 158, -254, 67, 405, -305, 554, 173, 229, 751, 98, 549, 556, -30, 752, 394, -49, 606, -87, -59, 251, -536, 70, -306, -584, 146, -382, -332, -128, -516, -35, -132, -524, 172, -136, -133, 323, -77, 417, 327, -11, 741, 169, 178, 439, 176, 521, 374, -222, 388, -29, -175, 307, -501, -377, -205, -636, -184, -119, -490, -87, -618, -291, -162, -883, -126, 313, -371, 256, 343, 379, 780, -131, 278, 484, 58, 785, 135, 403, 333, -250, -12, 12, -355, 162, -233, -133, 39, -714, -206, -192, -919, -152, -313, -216, -42, -411, -95, -29, -217, 528, 181, -14, 454, 26, 333, 804, -90, 588, 385, 17, 351, -49, 212, 457, -402, 396, -168, -378, -158, -460, -362, 96, -775, 56, -10, -726, 98, -329, -287, 172, -244, 238, 220, -410, 423, 155, 499, 516, 99, 400, 686, -187, 647, 163, 195, 529, -576, 85, 62, -318, -12, -367, -447, 59, -554, -60, -154, -668, -151, -132, -397, 269, -669, -98, 417, -521, 258, 445]
2555D45j45J63l67K79K80p35N99k87k51M83m51Q1J62n78M59k10l37L33j16k34
2575d27L88m01K06M02o32N47l84J11N38m17J14L15k25J06L25m08L13k22J3J75
2595D37m97K23k11l32P12n87n4M49o68n0J54k5J66J00l03P95o35O8N06o60N35
2616A23MJ48j9K8JL8k24N34m60O5K72o56K03K66n89K49J61k42J49o23N82K3q46
2639h13P23j69m63P24K3p9On88R86k66k82N94k36J16M91r65N43K0l40N54l94p6
2661A09K74j95Q0k66m57O24m25p9M13p21K18K60j80K66j41R7J91l67M94L34p18
2682a89L76M4k59K84j17L43Q2m46K69j33l13L17k44k10L47l42L85m03m75O76j65
2703a73j87R2k26N82l48k50P59m66R5M06j79K99l45k7K29M5m18M89q8j9O4l02
$$ y = [445, 300, 463, 96, 375, 655, -80, 519, 232, -19, 464, 13, 94, 256, -322, 137, -73, -410, -77, -193, -427, -39, -440, -234, 168, -464, 83, -301, -190, 348, -69, 45, 360, 135, 241, 566, 158, 471, 249, 262, 437, -60, 163, -48, -380, 332, -255, -309, 140, -528, -578, -424, -449, -283, -183, -486, 309, -326, -258, 248, -412, 123, 127, 275, 256, 284, 285, 323, 99, 633, 173, 238, 510, -146, 57, 323, -266, -17, 144, -98, 51, -572, 10, 33, -813, -90, -259, -722, 2, 25, -54, -48, -636, 350, 84, -198, 396, 160, 276, 767, -198, 345, 365, 25, 579, 185, 109, 383, 188, 268, 2, -455, 169, -256, -335, 78, -643, -425, -165, -345, -79, -220, -123, 68, -299, 195, 529, -189, 187, 231, -28, 256, 139, 482, 564, 118, 387, 254, -59, 258, 14, -196, 151, -191, 194, -209, -684, -8, -173, -360, -268, -494, 88, -260, -510, 249, -217, -122, 284, 105, 404, 59, 32, 261, 306, -112, 377, 289, 270, 334, 32]
2725C2K99k45k57M02n09p5N29m71k6J20j61N11p07L31J52m60N14r1J18J58n64
2746d00M53L21m28R5O31n18K60j95j49O02o89J71K9m84L39k90K0J70o71P21K25
2767B13q30K96l4J73J06j74L30k0l20M19J40n91O53l98J25M56p11O06k1o93P96
2788E21j83l08L32n15M84l69l68M61l84J39J97l36p1K67k05K08j04k14O74p33
2808e07L98N6J34q2m4K56N8m6J98K19o30L37j16l62M37n44K17J20m28M10j29l77
2830d25O09k70j83K16m65M83j46k52N09l56K44J97k66L89j56j13M17o85J15N79
2850D41j37j11K1L2L3k3m54L44l54j86K10K8K2l08J12M68n29Q0L88l79M20m31
2872c13O1N87o42L22N39p03N32k20l12P29m48P7M24o96K40o1k88O19o42Q1J50
$$ y = [32, 331, 86, -171, 231, -278, -353, 176, -295, -321, -201, -362, 149, -558, -227, -75, -535, -21, -112, 6, 164, -400, 53, 374, -54, 41, 672, 154, 414, 219, 70, 672, -17, 154, 183, -301, 38, -252, -232, -62, -733, -12, 213, -617, -321, -355, -182, -76, -250, 80, 60, -260, 159, 299, -292, 361, -37, 88, 544, -167, 439, 418, -275, 521, 338, 30, 362, -153, 331, -38, -406, 55, -329, -190, 7, -329, -400, -133, -338, -130, -234, -448, 226, -507, -109, -53, 81, -1, -45, 211, 269, 223, 421, 640, 10, 347, 231, -131, 306, -238, -21, 99, -329, 81, -48, -425, 184, -86, -269, -53, -518, -35, -181, -433, 76, -280, -36, 161, -105, 284, 128, 15, 432, -253, -138, 441, 304, 193, 214, 246, 279, 256, -198, 146, -208, -394, -184, -156, -134, -442, -330, 138, -391, -311, 77, -302, 118, -313, -252, 335, -307, 15, 554, -149, 383, 163, -149, 580, 132, 209, 633, -63, 177, 116, -172, 447, -195, -114, 36]
2893C6l33K91M4n82M36m32J94J88m81L63K80m22M10J46m72O66n26M38R1j73J43
2914C05j40l55O86n68l1K54q5M67n10k73L29j27r0J74n52L80k85l2N06n51J67
2935c31L76l64M05Q9j94L15l64J68L57j79N9k5k45K68k40m03N71j74k61J28k58
2956c02M76l32m01N28l89L80j1m43N82j80j3J96m32M02J80m68M61r5l67O02k67
2977A07K63k38j04M80m22k01M64m84J64k0k82K56q0j60J54o2k20N74m96J5M34
2998A42l59L85k13m7K46m26M62J3l99N91k15j23M31p35L76J80j31L25l30l47J73
3019al64N11L4n69J67Kl3L46m20n0M79l93lL25j01L8j35Q9M54n28L60O0n16N59
3043C11R8m11N55o25K63K31o57K51o3k55N30p45L39P5m42O46l86J20L43m47N4
$$ y = [36, -297, -6, 38, -544, -108, -540, -346, -158, -639, -276, 4, -418, -8, 138, -334, 332, -194, 244, 335, 162, 305, 165, -190, 496, -72, -103, 151, 66, 533, 23, -250, 79, -48, -138, 36, -516, -136, -421, -453, 53, -498, -331, 45, -319, 86, 175, -19, 296, -68, 100, 457, 278, 337, 312, 67, 335, 95, -308, 263, 89, -172, -44, -302, 174, -158, -559, -31, -420, -40, -51, -494, 88, -92, -105, 91, -341, 61, 241, -227, 234, 139, -228, 374, 107, 370, 132, 28, 508, 86, -115, 349, -135, 29, 9, -273, -17, -97, -257, -103, -165, -385, 189, -307, -292, 142, -217, 168, -45, -92, 154, -272, 190, 203, -196, 395, 180, 57, 488, -247, 129, 309, 178, 503, 173, -174, -1, -365, 146, 180, -389, -222, -220, -253, 93, -327, -377, 102, -291, -294, 31, -70, -32, -167, -78, 376, -152, 208, 268, -248, 311, 409, -2, 553, -72, 191, 422, -235, 16, -47, -302, 228, -517, -178, -103, -545, 101, -285, -165, 178, -269, -215]
3064b15K53j54K15l14K07K22n38N19L23r06P50jk18M50n65m1K45M4k11q0l1o9
3086a15J10l45L89n41M91j45j72K65k66j44M34k78K61J25j82M26j82l18K26J60
3106A99k74M53l58L28l61J31K51n69K09L64o03K38o1k41L71m57J84K28m01L25
3126d4k3l75N56k98k5L95n68M87q0O5J36l06L04K29m84K32Q7l25K97k37k27N09
3148C05m77K61K35p37L08nl08N17m54R1M57m59K58k58J36R9j32J7O82p73N29M8
3170C40k33J87k87M33r7r6J02N2l60J21k01o7L37k33j63J1j79J57Mr0P9l36M57
3193f2J37m41L98j1k57M85m66L44K54m13L64k34l06N22l00K3K37l41J56R4k70
3214h7K79m65lN42m52K22k55j2K21k4l86M71m62N50O0l12K00j76M1J26k99M57
$$ y = [-215, 38, -116, 99, -215, -8, 214, -324, 195, 518, -388, 362, 361, 143, 593, 28, -13, 232, 276, 65, -15, -46, -115, -5, -350, 39, -502, -11, -156, -328, -63, -329, -473, -39, -317, -56, 69, -113, 313, 131, -187, 39, 199, -75, 378, 20, 348, -13, 118, 369, -200, 9, 373, -230, 8, -53, -294, 77, -380, -196, 32, -369, -44, -67, -442, 114, -184, -209, 186, -382, 105, 25, 90, 226, -80, 224, 453, -31, 201, 288, -37, 260, 23, -204, 305, -172, 89, 324, -413, -105, -110, -418, 99, -355, -264, 193, -266, -8, -266, -130, -31, -163, -146, 536, -237, 292, 340, 107, 294, 7, 440, 343, 247, 349, 401, 41, 162, -39, -106, 231, -2, -165, -154, -333, -176, -172, -262, -183, -519, -62, 75, -366, 32, 21, -236, 249, -217, 127, 381, -32, 332, 98, -208, 314, 14, 37, 274, -67, 89, 183, -87, 192, -273, -276, 266, -186, 36, -219, -231, -10, -34, -420, 51, -411, 139, 199, -113, 87, -89, -48, 78, -221, 236]
3236B36K31k08K70n31j10L63k92J40J74n53J91mM3N0k67mJ35l91J83L49k53L15
3258F7k28L8M94o31L66K22n42M09O1k47K29k24L24O8n00N71n66L7J02k20K82l45
3280b33n5M05k81j6K51l05J95k03Q9K12k19n9M73l18M7M9L1J48n9j5K22k99N7
3303A17R4l07K88rj66P0J7k0N1l96K75N7j30j0l37N37ko59L64K43j43J28k75K05
3327hL65m40J94j50j68O14k90p9L16k08k51J83k91N91m69j31M75k53o1q7r0L01
3349F3J86l24L27j81k27M9j47M47k13r2J22p3N5L57m73N21j68m26K93j36m8M75
3371C87k57K06j76k27J17q4k76M35l25M07l28l51L64L4J6j13q5m1N61l01J5P6
3393E4o6R9L87m24L03n96O75k37k19M00l46pk1l56L76J72m95K07M4p7K60l02l8
$$ y = [236, 467, 259, 529, -2, -112, 251, -41, 99, 273, -280, -89, -93, -50, 0, -267, -271, -136, -527, -344, 5, -248, 67, -161, -123, 371, -260, 106, 328, -214, 195, 256, 9, 238, 14, 338, 406, -94, 477, -89, -52, 50, -170, 112, -233, -288, 117, -164, -180, 71, -234, -39, -242, -153, 59, -160, -219, 254, -64, -17, 32, 63, 211, 152, 137, 359, 60, 117, 211, -96, 192, 183, 17, 87, 104, 84, 135, -261, 14, 71, -59, -69, -406, 131, 129, -530, -166, 77, -66, 62, -213, -8, 357, -83, 111, -39, -207, 407, 117, 38, 354, 146, -105, 78, -213, 378, -91, -222, 253, 0, -61, -148, -238, 63, 249, -75, 252, 71, -156, -107, -254, 193, -20, -112, 10, -63, -8, 349, -124, 397, 229, -197, 96, -40, -88, 387, 130, 336, 160, -67, 50, -34, -310, 125, -200, 207, -121, -472, -108, -74, -58, -171, -256, -297, 264, -37, -22, 54, -12, 87, 474, 50, 353, -243, 432, 195, -24, 376, 30, 23, 2, -354, 22, 194, -301, -94, -50, -127, 133, -169, -207]
3416b07K3j86M08j36n5K22k7J0q2J6M07k14m2J91k91M1K01n3P2k62j12J10mM1
3440G1P8m47L33l87K59j70k3K44j63L5L55o7k48K05k81j25M76k45J92J23m27L30
3462A18M5O8J03n12L43P8k63J32Nl37J55J94k99L68l73K48l18J5R4J86k04p7J87
3485d4O3J30l61M14j80K24Q0m49Q8K82m25N62l77O6Lk19K43K7j57J02q4N4O1l75
3509b72L61j7k39M6m8q4Q8%l2K52l39N08l01j10M84l06J92J02k98K78N7n63M75
3532B34l08J16J76n19K99j16l6J32k66o0K43P0o2J41m65L26j70J75J31l71L85
3553E5J50k98J54J58k48L18l79K54J25j92K15r6p2J11m14k7M58o62R2M26JN2m29
3576b48P5M03n31J67Q8j6J75k22O0J88k46J83Q8n8J38k21L24k61k81K67M10m61
$$ y = [-207, -184, -370, 38, -98, -153, 69, 42, 52, -30, -14, 393, 179, 137, 328, 37, 78, 279, 226, 298, 36, -76, 34, 30, 71, 149, -298, 35, -352, -93, -263, -286, -42, -205, -170, 185, 118, -130, 75, -206, -331, 145, -100, 92, 215, -212, 118, 163, 231, 334, -178, 165, 243, -20, 112, 117, -220, -65, 129, -170, 198, -175, 73, -245, -230, -136, 50, -154, -231, -44, 19, 149, -212, 202, 22, 246, 326, -123, -35, 247, -178, 384, 7, 73, 76, -143, 100, 127, -30, 72, -12, 42, 103, -272, 89, 72, -167, -121, -169, -253, -165, -165, -197, 55, -284, 224, -77, -187, 297, -9, 183, 285, -13, 265, 322, -241, 234, -74, 42, 218, -301, -2, -118, -154, -22, -288, -348, -105, -35, -97, 44, -421, -95, -265, -90, 41, -330, 55, 205, -93, 61, 219, -29, 289, -90, 164, 289, 97, 312, 216, 144, 255, -159, -186, 272, -390, -298, 128, 129, 181, -248, -173, 230, -301, -134, -46, -62, 113, -109, -49, 139, -107, 76, 164, 106, 244, 23, 347, 86, -195, 72, 482, 21]
3598B1J52J44r5P0n89L01q0j35J81k38O5K24n33M81R2k36Q9l9j58J99J07J93L0
3621B46l10K10Nk77M87l63N4J84l27K30n7m15K75k70J68J34l32j6J88j44J98n
3643a37j48K04o4L23l35L5K10j3q9J79k57j25N15k65J57J5M6K34k22l78L15l86
3665a86J86K99k39P9k61M9k8J85j66J10p9K94k81oJ45O4p6Ok61K49m0p8K34l42
3689a43J31K94k35L1J27j02Q5k21J72j76j78K44n2j54K46l95J62p1J26L8L7k41
3711b75M49n34L11O7j79M24k40j71L68j78n5L66j86k7j7J63j85jl20L76n49J64
3733b29K19k99M12l50K77rj97J62N4l86J47k7PK95j54J69L41n96K29L50m79L84
3755C20n92L96j01p5J82m5N9j02k6J13m7k45L7l8j48J51J32k16J55j29L41p2k3
$$ y = [21, 173, 317, 222, 292, -297, 4, -76, -211, -30, -268, -203, 21, -512, -31, 61, -175, -86, -125, -283, -84, 23, 216, 246, -64, 146, 151, -126, 361, -2, 52, 236, -91, 139, 82, -333, -58, -328, -160, -26, -358, -374, -186, -330, -132, -137, -285, -81, -145, 178, -157, -122, 88, 75, -14, 165, -92, -217, 298, 33, 190, 205, 251, 485, 263, -115, 200, -186, 0, 299, 60, 139, -122, -73, -101, 84, -82, 28, -51, 243, -38, -44, 101, 165, 89, 95, -166, 83, 43, -35, 199, -143, -12, 282, 47, 78, 205, 103, 188, -33, 139, -37, -215, 29, -23, -177, 69, -326, -164, -235, -109, -71, -34, -275, 174, -360, -49, 18, -161, 263, 23, -148, 220, 42, -13, 353, 167, 140, 123, 286, 101, 100, -220, 156, -393, -229, -10, -309, 103, -247, 30, 21, -176, -14, 40, -346, -199, -226, -219, 76, -78, 91, 432, -164, 65, 415, -64, 320, -272, 124, 23, -52, 130, 85, 144, 42, 16, 129, 82, -163, -126, -164, -312, -161, -29, -245, -90, -219, 122, 50, 27]
3778B7J45o4j04Kj03J98j91K29j49P7j22J57j89K94p4k05J42p7j43J85k26K77
3800H6n8k23L19j31l1R0j81J80N0k96J36L46j59j08j90J86j8j07J92N2l3L03l30
3823G5l4J79l65k0L73l71J54p3q2K59k67k4j2J19J84l45J32J62j03j01K21l12
3845b51K68R7j47lJQ5J96l73K71j01k07M09k55K76j55J03k07j00L8j82K7J56q5
3868a39K82j51%l8L2j59J3M4r9N32k70m13O97k93q3J27k71L03j96O5K95m85M11
3891B04J82j89o2k93K5J40L3k85J43J56l10J75P6J74l65K12m3N0Q5M9K03l06J63
3914B17l88N39m14J64J04l31K37Q9k82K18j45q2K39j17jk12n0K67j09P3l9P6m9
3937Dj91p4n3K22rJ82O1L7L5j06J44k89L31j12j41m9ro4Q4R2m39L07j07j22L14
$$ y = [27, 172, 108, 4, 6, -97, 101, -90, 139, -10, 67, -55, 102, -87, 207, 133, -72, 70, -7, -150, 35, -191, 86, 28, -195, 124, -7, -38, 52, -129, 51, 101, -195, -59, 287, 128, 20, -170, 16, -2, -109, 83, 135, 102, 405, 75, 41, 220, -145, -165, 208, -163, -9, -82, -164, 95, -172, -196, -208, -89, 95, -250, -118, 44, -59, -160, 61, -251, 17, 114, -33, -36, -35, 50, 246, -127, 144, 43, -164, 245, -10, 266, 111, 214, 7, -93, -55, -237, -210, -54, -139, 143, -8, -8, -46, -14, -173, -160, -116, -215, 317, 47, -366, 331, 38, -45, 82, -189, 114, -82, -17, 278, -207, 204, 386, 197, 135, -158, -133, 7, 40, -245, -102, 54, -256, -81, -5, 169, -196, 16, -27, 23, 108, 157, 360, 54, 217, -171, 368, -46, 118, 222, -109, 128, 217, -65, 153, 8, -74, 165, 48, 47, -165, -215, 52, -57, 16, -23, 53, 4, -187, -261, -314, -92, -101, 81, 142, 179, 214, 108, 252, -37, 294, 182, 41, -8, -17, -81, 3, 95, -344, -37, -144, -266, 48]
3962D8j56P6l68L05J84l56K65j00R5L53l23k18M60n56K94n7J08N8K4q4J2M2J88
3985B94j51p5K4l94J74M38o07R2j7K71j62J1J53j13PK0J81k49p4L1p3K26q5L65
4009B87q3n32J89J35j18M3L30j50r7L7k29K35j50J93Kj76Q4k04M6O0K5k8j55K84
4033B8k60Q5k03J19J60j21K04K52l20l0j7K57k11L10l7k53J9J50O5j78k25J39
4055f7K25m22M03k86K12j95N3k9M9J82l19K19q1P4j18K68j29K8L08k80L6j14K2
4078C9m4J92j95Q0O2j13p9p4J90J09n16K60K50m38J54K11mq9k17J69J75j21q6
4101h5K3j57J03N10m66J27q0oQ5j96K13n8k17M63k60o6%M3J58j87l6O4j5j96K87
4126E1l68J96L5o5N7r2K22O4R7j23m2L00q1l18J48K1m8L9j6K05l58J86j07J11
$$ y = [48, -108, -32, -400, -95, 89, -267, -2, -102, -7, 346, 23, -195, 265, -291, 3, -54, 54, 112, 136, 52, 64, 106, 294, 143, 68, 92, -302, -128, 310, -297, -205, -222, 49, -113, -102, 51, -62, -55, -35, 146, -103, -177, -146, -219, 7, -78, 287, 204, -328, -139, -4, -122, -79, 251, 101, 4, 41, -188, 47, -103, 90, 92, -84, 0, -204, -158, -98, -73, -101, -256, 28, -232, -147, -350, -231, -71, -192, 12, 264, -56, -86, -103, 154, -57, 253, 216, -37, -18, 132, 197, 19, -206, -67, 158, -264, 139, -147, 65, -130, -77, -106, -57, 125, -194, 25, -56, 18, -100, 168, 39, 67, 375, 95, 131, 17, 39, -5, 187, -8, 72, 134, 21, -58, -132, 58, 167, -349, -89, 161, -277, -123, 88, 84, -5, -222, -53, 122, 1, -85, -62, -219, -116, 394, -72, 55, -25, -31, 54, -142, 71, 13, -204, 259, -1, -67, -67, -24, 134, -53, -89, -25, -40, -236, 51, -317, -121, -86, -151, -94, -186, 36, 100, 197, 74, 32, 332, 251, -67, 81, 102, 54, 93, 77, 282, -76, 110, 3, 114]
4150A14m03K98K01j68j15K2K6n2J36j22J46J5l05K35j98J74q1o0K70j47K03p0
4172A19L9K6m7O0l11mL19k88J72l9k3J68k06k40J27R0n8L30k23Q6M4k67r0J31
4196h5j6OJ53j10K05l00J43M2j85J41Q6q4N1p1J08j35J3N3J51l4j7L5k49Q9k72
4221b82N33k91o1J07j45J04K40l40J41R8j99J20r9P4J95k96L8J13k57J77q7J47
4243C0j50J16k63L36o8Q2M3J77n67k4K35j55O0K33p8k56J01L37j81l3j1P8j42
4266a00K34O9k35K04j36j2K1J2J14M1k55j42K19j00J99J83k50q9M4k9o4rO6J74
4290A59l42K00q9J53j09m4k67N72k70R1RO7mmk26J00KK16k37m8J42k94K54J04
4314A35l8O8o4o2k4p0p7M1q3J41j35K46j00J7J06J0l34K91k2k1O3k40L49k60K00
$$ y = [114, -289, 9, 210, 42, -73, -51, -25, -77, 59, -63, 83, 98, -207, 28, -170, 4, -77, -137, 133, -14, 189, 119, 158, 184, 137, 197, -114, -118, 201, -87, 85, 46, 23, 191, -15, -255, -128, -38, -96, 234, 11, 97, 141, -126, -216, -85, -101, -95, 58, -52, 153, -147, -4, 38, -147, -6, 80, -4, 47, -24, 84, -51, -38, 15, 166, 132, 115, 150, -99, -10, -282, 251, -40, -101, 6, -139, -35, 205, -135, 6, 104, -95, 25, -74, 0, 195, -101, -63, 50, -207, -30, -117, 30, -120, -4, -267, 69, 1, 83, 126, 303, -264, -288, -53, -208, -148, 85, 7, -249, -148, 189, 8, -25, -36, 42, -100, 134, 203, -32, 172, 36, 24, 45, 57, 171, 212, -43, -185, 34, -66, 133, 316, 66, -23, 21, -8, -72, -81, -15, 159, -183, 17, -72, 81, -28, -72, -339, 233, -37, 54, 63, 130, 126, 122, -104, -4, -2, 214, -23, -71, 71, -223, 31, 135, 97, 165, 101, 39, 15, -55, -132, -91, -174, -33, -168, 78, -22, -5, 101, 111, -223, 68, 46, 25, 88, -152, 197, -63, 137]
4339A37kJ71l80J04M5j65P9j06K13k47J13K91k24j86J86m1M7j70K6K11j66OJ51
4362I3j16Q8j90J86J59k59j7K15k30j20K66o1J42L9n52K31L24n70N28m70N83l01
4384c2J2j94K80J9j05R3j11K3Q6J39m88L63j24J25j08J52J38j83K7J02j91P2J42
4407B37k39M7j69N5J79q6l23L69nk22J98L3Ok40J18n5K21k85J82Po2J02K7j39
4431d4J71j75r6J87J3k6J49k53k13L93J9J58l00N8l4j46K05J08l37Q6nL5L3PP0
4456F3l9n8J61l70J27J06K9k2J97k03j4R3j39J63k32K64l07J80l1L1R3Qk28J5
4480a13L21o68L71J78R9j84k04K01rJ71k02RK36n5k36Q6K14n50M90q5qr9%L58
4504C21k16L6j17K28j10k8k12J17j14L08j51J8M6rJ36j31k01l5L48k15q4J69k39
$$ y = [137, 135, 306, -74, 30, 75, -90, -11, -117, 96, -151, -38, 253, 29, -157, 29, -12, 35, -135, -109, 102, -64, -58, 93, -23, 65, -125, 61, 220, -39, -56, 159, -71, -191, 75, 14, 156, 195, -357, -126, 198, -372, 156, -314, 269, -32, -20, -214, 66, 85, -20, 73, -38, -15, 71, 210, -278, 85, -39, 86, -22, 130, 268, 85, 112, 214, 23, 95, 237, -2, 45, -124, -69, 110, 24, -299, 70, 65, -157, 41, 74, 80, -160, -42, -97, 124, -161, 21, 28, -34, 68, 95, -44, 127, -48, -144, 43, 56, 30, 179, -74, -287, 106, 125, 283, -17, 41, 7, -139, 66, 174, -163, -77, -82, -47, -14, -7, 63, 24, -34, 127, -243, -116, -10, 19, -3, 194, -9, -23, 70, -69, 94, -138, 126, -181, -1, -32, -1, 92, 100, -128, -113, 208, -460, -89, 89, 188, 4, -200, 1, -8, 163, -39, -30, 206, 151, -85, 1, 215, -335, 155, 70, 62, -37, -37, 321, 105, 141, 24, 252, 142, 114, -98, 19, -95, 213, 62, 80, 126, 117, 253, 122, -79, -114, 234, 19, -65, 104, -135]
4527a35N5J18N0L9J26J70l89J22j6J04l10J87J56l40J35k10J27j71R9O1J31l99
4549b90J49J57K10j90l27L46J07l37L00j4J43J03q5j66j08k3J26q7j57K48q7p4
4571e6Q3m3k04o2K43j22K47P6j49q7j9Q9j52L16j14P7j47QK74l41J62k4J41l22
4595a26J74n0J80m0j01J8O0j51j06J81n1L6l5l4j6j21J75j89N02k12k06O1o1M86
4619C74n24j73K61K7K81n53K85Q1k1k59K49K36k98n0k2J04J25J94l57O1q4K85
4641B22j2l92L01m03J43r9J06K32L6r0N9P4j23J28M6k60n6J48j77M03j33m6j42
4664c5j31J09J10k03K63j29J55k71K70k49J89j72O1l59M65k37LJ72P8Q0j46m0
4686a7J02J55m74L86p7j90M0R1nP0m4K27k52l9M0j22J59Q1r8k3l06Q9K4J70k93
$$ y = [-135, -80, 38, 88, 127, 253, 423, 34, 156, 140, 244, -66, 121, 277, -63, 72, -138, -11, -182, -83, -22, 109, -290, -141, 16, 226, 36, -291, 55, 162, -175, 125, 111, 254, 357, 272, 106, -2, -25, 101, 14, -143, 105, 18, -56, 27, -16, -220, -282, -39, -161, 86, 162, 13, -74, -93, -4, -156, 160, 46, 123, -24, -16, 258, -83, 79, 55, 196, -126, 48, -2, 178, 138, 37, 55, 115, -36, -142, 39, -12, 24, -11, -45, -61, -182, -7, -196, 306, 94, -112, -51, -112, 374, -150, -323, -62, -35, 246, -307, -22, 59, 38, -221, 28, 264, -34, -84, -106, -2, 123, 317, -40, 21, -63, 222, 210, -182, 119, -284, -141, -240, -134, 98, 134, 44, 103, 177, 54, 182, 228, -32, -88, 60, -117, 286, 153, 107, -35, -166, -57, 53, -150, 113, -16, 139, -132, 138, -111, 78, -94, -33, -392, 73, -164, -161, 11, 89, 169, 23, -17, 85, 240, -234, 152, 75, -115, -75, 16, 11, 81, 37, 264, 12, -27, 13, -109, 50, 131, 33, 10, -296, -207, -183, -13, -306]
4711c06L93j40J38k41J06K71m20L49k13N3O4K4j52J81q2J30j94J21M4k20J43K21
4733B70k69J52J8j70j9K12k61J31p9j02R0j10J60J02l58Q9K8K84Nj65j79J67N1
4756D7M2k81J29l3J6L7j84K87j23N7J62j5j31Kq7j36L48r8k93PL54J78j94j81
4780i0L9J22k65j66L71l2L03k05K23l16K88l66PK58j84k9r1P3m1j4O1J36j30J55
4804A07r4k41L31O9k59J2QJ77k38J0J18l6J13k87K52k25L43j51M8NJL7j63j07
4828a70K6K19k10L4j62M05J19r6k25J65j30QN6l28J94J34k37P4Q0r0K49L4q1j83
4852a15L58k3j16J26m55K87j00J62n8O2r0J04j87Q2K7k99K33J35k91L9k6K78k9
4875A04k30J67l1Pn9M4J14j45l5J47k2J65k16K59j57J0l55M00j67N8J65k13j46
$$ y = [-306, 87, -53, 85, -156, -50, 221, -199, 150, -63, -10, 54, 78, -74, 107, 25, 155, -39, 82, 126, -94, 49, 270, 1, 153, 171, 1, -18, 194, -67, 64, -15, -117, -27, -137, 23, 125, -233, -144, -116, 168, 173, 8, -171, -4, 47, 89, -192, -63, -96, -80, -43, -227, 60, -63, -6, 156, 141, 10, 12, -75, -211, 137, 39, -254, -247, 107, 285, 91, -90, -51, 71, -194, -360, 11, -21, 282, 77, 300, -16, 272, -94, -87, 171, -13, -42, -133, -60, -101, -115, -54, 82, -48, 107, 13, -228, 103, 172, -87, -75, -67, 110, -128, -118, 0, -36, 77, -210, 42, -183, 160, 9, 57, 62, 63, 100, -63, -170, -144, 75, -135, -101, -263, 142, 261, 165, -60, 105, -25, -17, 39, -289, -95, 39, -198, -124, -44, -134, 115, 149, 68, -115, 243, 220, 104, 230, -225, 62, -38, 124, 66, 128, 38, 142, -45, 37, 64, -235, -2, 133, -158, -119, -145, 133, 104, -126, 41, 10, 17, -42, 2, 116, -29, -64, 83, 61, 226, 10, 269, 112, 122, -233, 167, 0, 58, 223, 10, -136]
4898a36L85l09L7J34j68J04j24O7J4K5r2M2P8R6k12k97L92k7R3j18N1o2J18J45
4922B36r8m58L83j33K91j02J47k00p0N72p00L09o1r7j93J15j9M7P1j79K22m11
4944c28j8J47R1O8q7K80j00k23J16j05l5L83k61J68N5O2j19l7Nl6R5r4K72k90
4968Ij31j05m5M16j54r0J94j70k0O0j61L38k47rJ91j8J50o6m4m5l5n5j25J79l07
4993b90M79j10J6j17j72J78j7K4k84M85k59l5J83Q3r8M7l65J60L07l8k8l00L94
5016B43k46JJ02K0k51J46j97K53O6k84O1o2J45j60L48k71m0J84j62K19J31k20
5038B6k02J72j66J81p1K18j27j31J15n3k33L64j58MJ48j38J67jl41L16k13Q6J96
5061A59j97K08j87k0O3k06J20M9j1J12l91J95Q9j20J56j60m4Q7K4K98m43L08p2
$$ y = [-136, 249, -60, -23, 111, -57, 47, -77, -10, 4, 29, -63, -21, 57, 153, -59, -356, 36, 9, 102, -16, 35, -27, 91, 236, 138, -320, 63, -70, 221, 119, 266, 66, -4, 568, -132, 177, 116, 19, -174, -59, -78, -31, 40, -139, 83, -328, -346, -199, -108, -40, -127, 153, 53, -170, -54, -159, -194, 189, -72, 96, 151, 213, 94, 57, 62, 26, 121, 27, 299, 9, -122, -227, -272, 144, -10, -100, 94, -76, -96, -36, -197, 141, -106, -115, 76, 58, 208, 142, 98, 53, 18, -37, -162, 17, -290, 189, 79, 95, -22, -194, -16, -33, -9, -293, 192, -67, -102, 81, 164, 66, 113, -252, -92, 215, 177, 149, -151, 243, -3, -2, 100, 120, -131, 15, -182, 71, 137, -147, -86, -148, -3, -163, 185, -86, -126, 58, -104, 115, 246, 26, -176, -4, -170, 11, -60, 158, 31, -100, 15, -38, -271, 93, -65, -61, 87, -51, 116, 115, -226, 90, -123, -37, 159, -38, 170, -17, -37, 26, -180, -60, -11, -22, 90, -301, -106, -17, -137, 19, -141, -185, -98, -74, 224, -219, 89, 17]
5084A7q0R6q4L2j36P3K30j8o0k03J23j39R6o4o7J21K71k17m9K82j12q4k19K81
5108I0k53K88p1J0m3p0K84l97J98K27l12J08N0j80K56q2o1L9J49l18O1Lo7O6j16
5133a41K89k22K10ll7k40M55l15l2l9J85k0j12K11j29p5K8L3k87L29j16m5n3K65
5157A39l33n8M30k95L1m5J50Pj04J90jk97L4M91m37Q7O8Q5k64M7R7j9J20r6j75
5182a48M61j95r9j03K56j39l1K5J76j94J65n2j22k50Q4r6N76j85k39J48k52P1
5204a43j7P4L47k43J06r8j36J30q1J01K1J94k70j73L29j1j4M8j63J31l21J45J9
5227b5K40l25K19j45K6%r1n8N0K63j38j38M5J4j94J21J92k37j34L98J21l09J57
5250E2O8J96k24n3K22q5o7j41K87k12MJ82l84j2Q6J75q9l08K59pO2nK9k3k97K55
$$ y = [17, -63, 33, -51, -19, -155, -82, 148, 130, 70, -133, -10, -149, -53, -117, -184, -63, 208, -9, -58, 224, 112, 28, -191, 90, -163, 125, 54, 64, 21, -49, 235, -162, 36, 263, -49, 59, 109, -71, 185, 103, 42, 81, 230, -88, -27, -24, -91, -25, -141, 148, -74, 136, 133, 96, -144, 311, -4, -36, -75, 110, 90, -22, 189, 60, -15, 13, 46, -241, 88, -28, -73, -126, 139, -194, -252, 178, -117, -86, -131, 19, 26, -78, 112, 111, -186, -152, 339, -98, -11, 57, 142, -122, -75, 22, 3, 123, 27, -148, 313, 118, 19, -84, 172, 33, 2, 27, 203, 9, 174, 122, 0, -250, -166, -262, 314, 129, -110, 38, -214, -143, -160, -86, 261, 18, 124, 26, -110, 20, -61, 40, 61, 255, -15, -188, 141, 130, 116, 164, 1, 132, -189, -44, -25, 215, -110, 109, -36, -10, -10, -101, -159, -109, 154, 16, -122, -77, -63, -257, -136, 56, -181, -315, 83, 204, -105, 52, 120, 316, 92, 39, 261, 176, 109, -32, 255, 43, 47, 229, -155, -167, -81, 94, 5, -303, -44, -51, 11, 6, 35, 12, -285, -30]
5276c0j49M52p8p3J41j99J28j74K13k95k4r4M4N74k52j45K1Oj69R4M9m6k35M99
5300B58j64L2J64k84j27J43j53J05m4J07n8q0j4J34J08l6l6j71K3K32j49j9J3
5323a6L3j88J81K56k54J43k49J76j56J79n5q8K07k61J10L2q5K2j1j00L34k08J9
5346B1r1L30k24j10J68P0k24J95q9o7k7j81K84j24j26M9L25l06K74q5k43J40q7
5369a28K61N6k78P7K53k48j4k3N2K14m47M74l27J03Q0k32K33j65Pk17L39j56K96
5392B10l21K92Q7l26J05l3r4M5k96K16Q1J97j99J95j49p4L2o0M4L1j6Qk9o4K66
5417A48j75k3K3j01r9L34j15j52J32R4r4J28mPn0L3j38L62l46K25m71L52j67j60
5441b57K45K0K63p6j96J29l5J88l95J57J89k79J71j32n1j25L33K8k14J15q3j38
$$ y = [-30, -179, 273, 195, 122, 263, 64, 192, 18, 231, -64, -88, -182, -138, 436, 184, 39, 60, 66, -103, -9, 40, -6, -241, 258, 94, 126, 290, 6, -121, 22, -131, -26, -70, 37, -21, -101, -115, 19, 127, 91, 55, -116, -93, 139, -10, -29, -16, 17, -171, 10, 266, 12, 155, -94, 82, -74, 105, 50, -38, 169, -92, 18, 50, -35, -13, -24, -124, 210, 2, 21, -70, 260, 36, -74, 94, 164, -60, 135, 46, -21, -48, -229, 55, -69, -195, -146, 179, -127, 147, 62, -181, -41, -128, 133, 189, -89, -12, 241, -7, -21, -44, 8, 222, -225, 249, -78, 25, 105, -127, 106, -59, -52, -269, 70, -86, 210, -111, 181, 268, -58, 47, 14, -80, -35, -331, -115, -34, 163, -36, 159, 10, -64, -32, -92, -48, -17, -33, -25, -54, -118, 148, -27, -50, -27, -128, -227, 107, -8, -160, -28, 66, -28, 100, 96, 103, 53, 86, -52, 310, -36, 189, -282, 70, -97, -257, -12, 8, 271, 195, -1, 128, 93, 281, -114, 43, 232, -47, 124, -8, -59, -184, 149, 177, -37, 78, -5, -143]
5463a43K9J15k2J09j70Q5o6m0J61k5JK3m2rL9q0o3R4J19j19R2n1j26M1p1J82j60
5490i7K86j08j04J46j59l2K89J35l30j21R4MQ6l42M23l42J31K9j86L27k09J48
5512F8j09P9M3j03J09p2m0k4j2J14M9j9j3j81J47j73P8L20m04P6K42j04L2Jl1
5537G3k71L04k93m2J02j0K69j0J6j08K62m35q2M24k5m65K87l06N63j36l8N0j89
5560f0L1k04K02k0J86k86K08Q8J21j99R9k8j44L6pM9N4j68o8L9K78j6l73K81l51
5585b52J95O5m2kL4J15j01K3k6J45j34m8R9n2j38K66q9k50R6Q2q0j2JL6R2j5n8
5612e0n7j04J48K49m60L42j09j0r3k4J25j12m0K02K03j61n5Rl29M54l03J98o3
5635d0Q4k27L15k33M0J75k08J09k81K53j31M92l86Q5k11K57k05Q9l21K88M3o5
$$ y = [-143, -114, 1, -21, 88, -82, 3, -63, -103, 58, 33, 34, 57, 15, 6, 45, -35, -98, -4, 115, -4, 88, 37, -89, -48, -119, 63, -97, 189, 81, -23, 123, -36, -68, 221, 356, 26, -95, -1, 3, 89, -253, 170, -172, -41, -12, -198, 129, -80, 68, -41, 38, 81, -22, 87, 15, -25, -49, -61, 53, 102, 83, 70, -111, 36, -137, -59, 261, -143, -67, 175, 71, 103, 104, 73, -198, 106, -187, -229, -127, -137, 132, 122, 138, 30, 292, -143, -225, 199, 174, -291, -4, -310, 253, 117, 79, 129, -60, -29, -233, -31, -51, 135, -151, 57, 145, 266, 67, 166, 138, -6, 30, 23, 72, 126, -42, -110, -71, 207, 191, -182, 99, -252, -57, 8, -34, -36, -2, 113, 12, 35, 9, 154, 20, -28, 71, 19, -119, 147, 58, -192, -96, -14, -94, -106, -105, -69, 23, 8, -50, -107, -211, -63, 186, -274, 68, -41, -51, -144, -168, -43, -155, -195, 7, 210, 49, -6, 3, -326, 128, -175, 23, -40, 44, -183, 132, -101, -61, 114, -94, 15, -266, -13, -144, 348, -38, 47, -164, 93, -112, -23, -344, -56, -13, -78]
5657g8J63j44K38j77l48N20j54Q9k24L53k28L9n4J33k55J72J57j63J77j33N4k05
5679f8RO9O5k00Rr3Q7L4j27L33k66k8K37j93J06J46j07J7l4M1j02K40j23jJ32
5704A83j68r9K41j56n1q9L12j25j11Q8m7J40Q0r9k45J16pl9l12M42L1k61RL80
5728B13k05j34J20L9J7J4k72O15l45N5j79j2N0r2o5K34r1M2L40m40j27J63k5p5
5752a60J95k0p8O5J23l59K13J46M7m12J87R8j9m7J56J01k68j16L18n8N3k31O7
5775AQRk79J65J04N1K8j51p6J70o8J90j74n1J32j06J06k5n7N8O9j02J50J88m16
5800g6o1j9r3K35L5J02j34mJ4k33P4M7M8n7l7N0J87k40J62j45K04L7K8j86K11
5825A49J00j87j02L43j08j96L0q7P5P1q9j04M97j78k96m3J60J51j94J13j21k0
$$ y = [-78, 85, -59, 179, 2, -346, 174, 20, 109, -115, 238, 10, 49, -5, 128, -127, 45, 202, 39, 216, 83, 137, -68, -59, 10, 75, -125, -116, -209, -122, -88, -215, 118, -148, -176, 61, -132, -26, 120, 13, 30, -4, 37, -65, 175, 52, 51, 183, 15, -84, 157, 1, -50, -139, 173, 48, -63, 25, -22, 118, 198, 99, -146, -30, -37, -76, -388, 54, 85, -176, -167, 213, 8, -126, -6, 33, 50, 64, -208, 407, 62, 117, -62, -74, -24, -116, -181, 53, -38, 4, 344, -96, -223, -60, -85, -160, 35, 15, -63, 2, 125, -234, -21, 125, 172, -240, -53, 45, 26, -21, 135, 236, -32, -148, 170, 112, 165, -66, 1, 9, 18, -261, -96, 8, 59, 87, -64, -140, 30, -38, 152, -22, -73, 59, -47, 59, 34, -23, 35, 104, 2, 152, 340, -76, -137, -156, -249, -14, 21, 123, -11, -15, -1, -234, -160, -113, -65, -122, -159, -109, 78, -162, 0, -145, 59, 96, 124, -62, 149, 249, 62, -40, 303, 195, -1, 29, -58, 17, 88, -1, -105, 392, 214, -82, -125, 35, 186, -8, 105, -16, -36]
5847c6J46On6n2K14k38j20J12J53l09J50m7m4Rk5K95k55J07q8J35L5j03M17n50
5871a44K25o9o1mk12K25k39L40j82J65j21J39m9J5J94l68M96l17L20m58L14l48
5893a39k26L32J0M9q0m0K17J35p9n4j42J43l18kO4Q3J3Q5k6j69K10m02K53J28
5917D5j35J01j86K48j02J49Q7L0m37L33k99K91Lk85J11J12p8jj04j2L6J49k5N2
5941H3o2K12k2l36L5J07n2Rj22K40l1n8M3l15J60K76k2k85K08P2j57P4k53K69
5965G3M8o1%p9P2q9R0K6j98J71k32K84l23L16l51J15Q3O0R1k79L43j25j94K68
5989A09J7n6Q0P0j78p6N8r1j10J26O4j18Q9l8k3J11L3Q7j38K30k4j58Rm2j40p7
6015a86L82j14N4k50L29k02Q8K1k20J40K71k94L5mq8k8r3P6J89o7RM6j7j35M7
$$ y = [-36, 110, 116, 60, 8, 222, -16, -136, -24, 129, -180, -30, -77, -121, -112, -137, 158, -97, 10, -78, 57, 92, -11, 406, -144, 81, 12, -49, -53, -265, -40, -279, 61, -121, 44, -77, 62, 13, 28, 222, -146, 350, 33, 353, -105, 209, -139, -365, -33, -23, 26, -54, -94, 123, 258, 179, 125, -17, 126, -192, -194, -130, -47, -34, 51, 25, -144, 66, -336, -83, 45, -90, 11, -175, 73, -29, 120, 207, 237, -200, 133, -166, 125, 128, -157, -46, 66, -12, -13, -117, -129, -93, 56, 31, 83, 21, 233, 211, -125, -90, 17, -35, -26, -148, 92, 61, 3, 46, -269, -109, 167, 145, -140, 68, 140, -17, 57, -196, 73, 121, 60, 60, -19, 53, -36, 54, 80, -118, 53, -179, 105, -218, 98, -253, -138, -55, 5, 96, -183, 160, 35, -159, 109, 126, 70, 150, 220, 42, -34, 24, -67, -177, -51, 13, -105, -16, -54, -77, 34, 67, 154, 16, 246, 222, 64, 73, 31, -109, -186, 196, 82, 136, -114, 215, 13, 101, 122, -98, 42, 313, 19, 54, 50, -38, -66, -159, -83, 106, 39, 48, 94, 77, -58, -11]
6040a1J05OJ10l09K97l05J15P6n3j9O7rO8k36L14j59N3Q4k61J23Q1p9J74j69l32
6065b69L09j45K54l18j37M66k51Q4K84l25qJ97jk57oJ63o3q9J77m5J76q2k28K52
6089A38m8j95j11L66l61L00j2j0j98J61J36o0P2l20QO4M19l95K4m5j33k9L35j50
6113d4KQ2K70l57J42m46M29j69l0Q8J73k12%N9J01r8J13J13k18j58L8j36L88K49
6137C79n67n2J49M5j2K7J63k55j62N6L54l17J20J81N1j42k01K63j61K23M8K11
6159D01m76PJ85m3l75M41j17l6j0oK6L7k84J59p5J30r7N0M3j10L72m5j85j53O8
6184i3J87q3J56j72O5J12J05j76j35J5P4%j69J28P4o3J64j64k44J11j3L63j53
6207H9r9j29J77O1l36J90O4k8q5J55N4k51K20pj25l5K77j7k85L75k04j01n3J38
$$ y = [-11, 94, 100, 210, -99, 198, -107, 8, 84, 31, 12, 79, 70, 138, -98, 216, 57, 110, 194, -67, 56, 137, 58, 232, 63, -269, 40, -105, 149, -169, -306, 160, -91, -7, 277, -48, -56, 141, 140, -117, -123, 40, -23, -112, 65, 20, 196, 114, -114, 138, 90, -105, -216, 150, -211, 89, 77, 67, -131, 30, 166, 106, 178, -142, -134, -70, 349, -46, -22, -67, -200, -229, 106, -44, -42, 40, 310, -47, 95, -351, 78, -91, -121, -33, 140, -72, -72, -13, 88, -10, 103, 216, -2, -160, -122, -258, 130, 379, -188, -240, -91, -46, -58, -31, 132, -123, -285, -229, 125, -192, -72, 109, 160, 18, -183, 80, -81, 142, 190, 401, -75, -68, 117, 74, -301, 140, 23, -13, -23, -29, -3, 34, -250, -91, -166, -36, -133, -83, -40, -150, 222, 177, -8, -161, -93, 94, 11, 167, -5, 60, 172, 277, 101, -34, -19, 55, 55, -114, 14, 88, 25, 189, 25, -219, -108, -121, 242, 89, -10, -139, 38, 99, -237, -47, 17, -11, -96, 59, 113, -138, 82, 75, -50, -85, 192, 175, -110, 265, 61, -40, -93, 45]
6231D5k64J50ln9K94j5p7Nj14J23k46L2K43l18L26N6k92J88l83M80m4l41K51r5
6255e8j7J57L2p8J14j38L4q5j04L94k07R6j81k54K28P1m7q8M5K06J13rk50j9K04
6280A59p3R6k00j4L9J91o4r2O9j53Q3k28J38K5R9m18L41n2j03N2n7K28p4Rj7Q0
6306F4k42q6K05M7J89j33j84J16K7K5j43K96m1k32K53k31l6K28l4k54J55j46J0
6329a47l1K37j49K48k10r8J16Mp4LK11lk01km4m0J79J76j29j34k5L68j52j84L7
6354d4q0R2j48O5K64k76J12j51J31RJ2n2K38M7k78M4J11j14pR6j74M0k4J77n8
6379C2J94J1k38L03m07P3J15J57k75j42L60j10k03j4J65k01J25l7j31J56K34l06
6401a39J51O5j71K46j62l8p8l3J31o9j14L82l11K79k6k47R8J21n7r0j6L0l7J9
$$ y = [45, -219, -69, -72, -131, 163, 148, 71, 76, -38, 85, -161, -129, 114, -204, 122, 178, -114, 74, -309, 171, 127, -214, 37, -58, -75, 82, 114, 36, 150, 12, 46, -39, -143, 251, 44, 140, -41, -295, -67, 4, -43, -131, -86, 120, 233, 224, -26, -45, 159, 86, 182, -18, -32, 7, 198, 134, 42, 111, -42, 41, -187, -49, -24, 75, -343, -2, -54, -157, -105, -162, 66, -8, 1, -16, 64, -178, -264, -59, -12, 177, 44, -140, -24, 3, 28, -115, 181, 140, -92, 161, -70, -106, 122, 88, -166, -11, -157, -147, -178, 59, -90, 158, -52, -150, -34, -30, -104, -101, 110, 107, -94, -96, -140, -180, -1, 175, 46, -88, -113, 255, 103, -81, -44, -124, -32, -180, -115, 149, -127, -15, -166, -35, -26, -14, -66, 172, 219, -59, -15, 96, -18, -25, 71, -103, -63, -87, 90, 32, 226, 237, -1, 302, -105, -32, 83, 240, -35, -177, 183, 73, -130, -144, 21, -180, -55, -92, -223, -67, 167, -139, 12, 77, -94, 152, -10, -48, -126, -159, -28, -97, -211, 171, -140, 139, 113, -134, -36, 85, 28, -62, -78, -48, -85, -66]
6425f6K91k56j11K33r5j23K85j54M1j32m9J56K90k70J48k96J13k66L29N7k46j20
6447b41M87j17j19J18l25K84N7l3j03j18j06L99o16M68Ol35J29j5L9QK38J8j67
6470d4j21k72M27J19Mk73JJ54l0M3Q9k20L02j44r9M3K51k74q0Q9j06P3Q2j21J79
6495G2j77m5K23Jq7j52L80k86K91k33l3m2K23j35P2J8l04L12l00L45L8p6j28o3
6519h6K1K61j02l11K35K7J75k88J7o6J69m2j23nJ42l44P5K43j40L08q0J02k30
6542d2J30r5Q5J21m7k40j24O14l86o2L4K9J44r6j49k9J37J26l4k86K28j56m11
6565e09N72l08K99J79l52J69m3J6J00j83K15j32j65K70P7pk96K19r4P2k54J71
6587A6q4K37j37J18l96O4K40j24j6L16m10K5j9n3L07k73K61l50K80J34j21o0q4
$$ y = [-66, 225, -31, -142, 91, -4, -127, 158, 4, 45, -87, -136, 20, 310, 40, 188, -108, 5, -261, 68, 125, -121, -241, 246, 129, 10, 128, -197, 87, 144, 111, 8, -110, -216, 183, -433, 35, 41, -294, -165, -180, -141, -133, 105, 123, -44, -165, -437, -10, 109, 113, -160, -159, -5, -35, 8, 97, -123, 179, 35, -64, -21, 230, -44, -124, -35, -141, -68, 14, -107, 72, -105, -150, 73, 74, -13, -165, 215, -71, 220, -13, -46, -88, 135, 0, 72, 90, -214, 98, -202, 143, 181, 105, -23, -86, -65, 196, 94, -217, 18, 45, 220, -68, -51, -117, 52, 10, -113, -118, 24, -320, -245, -2, -142, 166, 86, 188, -42, 88, -7, 78, 199, 152, -88, -212, 402, 16, -46, -12, 17, 161, 65, -84, -113, 24, 150, 116, -170, 58, -98, -509, 63, -245, 54, 233, -119, 50, 7, 23, 123, -60, 155, 23, -142, 128, 205, 198, -98, 121, 27, 99, -155, 16, -68, 169, 32, 150, -246, -182, 58, -66, -82, 234, -176, -151, -170, -223, 84, -189, 72, -278, 2, 136, 15, -45, -129]
6610a29K01n7j34K8j2J42j27J39J71k25K25m63J97J71l6k89K2R7M5j17O3R4o1
6633e5K44k82L75j74o0q5lJ81j92j26K44NL2j88J22k18J86Mk46L43k8P3j53J44
6657A43J0pj22p6j5J72k12J00P0L2n6k59L53q6o4l3M46n25L67k42j95K38r7J03
6681D5m9J09L8k34M28m95J18j73M30j36p7q6j9R4l5k78J3N88j0k62kK30k31K31
6705B37k8k83N6J88j94J41l01K49J10j46N2k28o5J18p0J72lm9M7k6J98m86L01
6728a0J1k6k60L19k27J58J72N8q8J9kL53m77R1p9j07J16J54j77j4J09j59J08k94
6752b52K67k21p7k8K91r8K36l24J17J38r6JM2N1j05L11k25J24k51j33j5L02L3
6775H8j28J05O2q4j32Q0l20K23J78k23K90j86L32j21Q9k28j59J88J2Q8j31j2Q7
$$ y = [-129, 72, 15, -119, -91, -103, 39, -88, 51, 222, -3, 222, -241, -44, 127, 91, -198, -176, -79, -34, -151, -88, 6, -55, 189, -93, 282, 108, 48, -37, -40, 141, -51, -177, 67, 72, 104, -84, 38, -180, 6, 10, -236, 107, 79, 152, -1, 143, 153, 146, 24, -52, -67, 105, -107, -7, 63, 95, 39, -220, 133, 47, -17, -50, 396, -129, 238, -4, -199, 39, -58, 45, -4, 105, 143, -91, 337, -158, -40, -213, 217, 81, 4, -82, -101, -7, -42, -320, -307, 281, 271, 9, 7, 237, 6, 237, 209, -74, -18, 170, -24, 117, -184, 65, 175, 29, 81, -147, -212, -94, -164, 8, 5, -44, 3, -23, 175, -311, -10, 1, -25, -285, 34, -193, -35, 137, 195, 107, 126, 124, 477, 0, 91, 12, -95, 21, 175, -2, -16, 93, -66, 42, -252, 15, -206, -283, -311, -20, -118, 118, -206, -89, 49, -47, -46, -4, 47, -58, 253, 28, 152, -99, -232, -247, 55, 88, -40, 65, 127, 43, -89, -9, -329, -106, 72, -151, 139, -47, 285, 164, 253, 25, -134, 54, 66, 154, 23, 11, 98]
6798I8J24l04J76j55O0j6j00K35Rl54K92l3N5j6K86n08n2J69J95j61k0k9P6j97
6822a70K66j4m5P2Mk45k7P7J39k7n0M0m0L33l44K82j74q0o9R6L8j27K29k39o1
6847a36j22P1K60o2j66J92k9Q2j64K21k97J81r4J43J99k53k4J03j43l0J84p0R1
6870A37j95J50k50J33m0J55L5k81J32J97o0P4j11K50j55l65M05k74mO8KR8k25
6893a24J05n6O8j66M46j66k55L29k42J51j82L09oJm40J73K33q9r1k68J11J02J04
6916D7m20L92M6K6k17j72K63qq9K38M9r1M0K5k49J53r1K47n01M21r7q2p1K73k64
6941a32p4L42k45K61l07P4m7J06kJ06J68j05l01M06k09Jn3J56m8j26j14P7J96
6964A30k42K90j32P1p6j15q2N2J61J76j90l9K75m44K58l6J04j24m0J15k96J8J32
$$ y = [98, 222, -82, 94, -61, -1, -17, -117, 118, 127, -227, 65, 32, 87, 71, 357, -151, -203, -34, 161, 0, -20, -49, 27, -170, 96, 82, 37, 109, 113, -132, -159, -82, 57, 30, -20, 20, -20, 313, -31, 251, 77, -3, -72, 24, 62, -65, 164, -75, -136, -258, -187, 73, 11, -155, 37, 8, 90, -74, 147, -150, 31, -63, 80, 279, 26, 2, 105, -38, -68, 116, 46, 137, -58, 92, -158, -25, -65, 90, 125, -156, -24, 173, 113, 187, 76, 326, 171, -194, 211, -63, -67, 1, 3, 101, -124, -19, -75, -7, -173, 273, 107, -148, 181, -61, 90, -92, 217, 211, 212, -228, -55, 178, 89, -2, -270, -159, -57, 47, -373, 19, 65, 91, -126, -298, -35, -43, -132, 106, 155, 64, 104, 129, -120, 33, -58, 189, -312, 109, 12, -70, -141, 132, -132, -206, 136, -109, 152, -155, -81, -128, -22, -24, 82, 250, 145, -156, 250, 41, 42, -11, 145, 97, -29, -143, -66, 130, -112, 178, 46, 117, 41, -74, -156, -104, 57, 233, 43, 4, 279, -165, 93, 57, 161, 37, -3, 112, -184, -166, -34]
6987c4J07p3J05j66p7K37j7K01l46L43j27k08j3L2J8Q1Pr9j2J4l9L5J86j01L9
7012I3k91L86j72k38K55n2K76m60L5K44M4r7N6j24P6o2KR4M1J23j46j91R1J25
7036A08k6k39L37n5K8l8k07J19J11j66K96r7l3l0j30J83k80J20l41M33j16p2p3
7059a68L44k47J17J89j68j75K41J4N8q7j3j37k62L49J28l62M09m01O7r2J01K6
7081f9J1p4j3J98r3j71M35o8j59K08l29L48j42l31L03qo4J6R6pk96M13k98m6J69
7106B9l2L8j10J29K72k08k22J31J16k35j89J98J59k64K87n0l7p8K58j91o8K41
7128A74j70L76n37J58J1p2J37q4K49k00p8k1N2rj50K06k4j8Q6J26N5l29P9J77
7152A94k52k9Q9r1K29%P1j88n3J42O8j01p2n8J71k28L59k75J95J15j39j92q6J38
$$ y = [-34, 73, 0, 105, -61, -138, 99, 82, 283, -63, 280, 153, -55, -68, -36, -18, 63, 70, -29, -41, -27, -66, -31, 155, 54, 93, -198, 188, 16, -222, 33, -19, 257, -203, -168, 76, 120, 23, 79, -45, 31, -31, -29, 65, 106, 229, 83, -108, -17, 108, 82, -157, 180, 125, 153, 115, -92, 27, 138, -28, 268, 171, 138, 108, -22, 161, -119, 1, -340, 93, -23, -95, -168, 176, -71, 46, 235, 67, -108, 133, 147, 205, 118, 105, -32, -294, 55, 183, -179, 230, -171, -104, -196, -95, -69, -58, -132, -145, 53, -40, -211, 224, 156, -3, 205, -124, 224, 82, -249, 54, 46, -18, -2, 94, 87, -209, 204, -94, -140, 29, -3, 35, -75, 54, 326, 118, -104, 27, 143, -92, -281, -83, 76, -188, 99, 49, 12, -66, 192, 1, -67, 174, 4, 380, -157, 1, 12, -60, 77, -7, 242, 42, -36, -57, -5, -14, -164, 42, 18, 0, 86, 212, 267, -62, 17, 194, -58, -87, 2, -89, 140, 140, 211, 23, -30, 112, 180, 79, 7, -51, 120, -108, 251, -24, 171, 286, 147, -45, -131, 7]
7176Gj84K85k15L86l2l68J63Q5o3j30K7J26N2k30N7q0R3K06k62MK20j41j52M87
7200C41k21k35J69l44PJ66K54R4m22n2K77p0j48K89j7Q6N8j70R0k8k33jQ5L44
7224C19j57l17j71M58k23K7j2J28L7J82n65J74J61k41J81M3k3j44K13J23j34j77
7246a18Q9J27J01k64p2J98J8J58j21n0k9n8l9k10L09K83m32o7K02m5P7j57J22
7269B2j27R4Nj63o8M3J22J2j85K41K40k56K38j58k52L86l04J53q0K75j0j89J60
7292A99m5k24p4m3K19M5k74N2J04M6j23k01J60q3L25l01K75j47J61o2k5K92k31
7315D5j56J7J74r4j5q7L56l95j39K66J95j03k14L00j75P3M0p2O5j01M7j27J10
7338A0J03k60K12m0o5q2N7P0Q6j65K30k35L57n12M51k32o2J64j81K39r4j86K09
$$ y = [7, -177, 108, -107, 279, 247, -121, 42, 127, 64, -66, -39, 87, 139, -91, -34, -114, -21, 185, -77, -73, 147, 6, -146, 341, 120, -115, 54, -290, -283, -117, 137, 231, -191, -243, 34, -36, -184, 105, 88, 174, 232, 62, 152, 124, -109, -110, -25, 319, 162, -155, -326, 132, -91, -64, -76, 52, 89, 271, -294, -120, 41, -200, -19, 24, 1, -143, 70, 193, 59, -118, -29, 98, 199, -65, -137, 61, 79, 237, 116, 66, 37, -21, -60, -270, 39, 322, -110, -177, 25, -20, 57, -100, 22, -105, -11, -6, -169, -237, -194, -72, -60, -245, -4, 236, -20, 218, 60, -192, 194, -110, 43, -37, 238, 228, 39, 199, 154, -70, -144, -187, 32, 77, -197, -145, -41, 5, -118, -319, -159, -242, 83, -218, 57, -90, 71, 9, -16, 276, 45, -111, -94, 80, -14, -29, -116, 240, -155, -294, -28, 167, 64, -150, 150, -25, 48, 88, 16, 81, -20, 27, -100, 10, 113, -147, 65, 25, -40, -122, -65, 5, 91, -74, 156, -79, 278, -234, 217, -15, -77, 87, -94, 145, 51, -135, 74]
7361G4K9M3j51j50J71M3j26J96j74P3j98pL60k52J42K5k37K12j94j31J5J65J41
7384F9j85K45M1p6k87L11j98J39j32jK08k0m0J28j88K8k75L86l83N9K04j45J55
7407D3k36K10j25j21K01j85J64J61j05J7L9m5J09k28k13J90J96N6j22M4j03J50
7429I7k03L12j13q5J51m38L29J5l8r0K99q6k88n4J12J49l2j24Q0j2K34l11J73
7452G7k57J10O2J02r9k12o3K89q1k0L86n09J2L13j16j11J13K24l74J92m8j4K2
7475bJ5j15j7J63Q5O3j61k65L64q7k17J03qJ81j47j33L5N8J26j80m3O3L05k89
7499a03J56j1j12N4o5Q0k57K88j4J74m02K93Q2j80L39m33J03n4K35k02n1J42j60
7522i8J96k43K78k72J36K79l32J50M5R5R0m19j66J17J65O7k02J94j68J10JL9k69
$$ y = [74, 103, 146, -5, -155, 16, 59, -67, 129, -45, 28, -170, -177, 183, -69, 73, 98, -139, 73, -121, -252, -237, -72, 69, -116, 129, 170, 94, -193, 118, -80, 59, -73, -74, 134, 114, 74, 202, 14, 42, -233, 153, -230, -171, 33, -112, 43, -193, 17, -108, -229, -28, -213, -49, 112, 7, 24, 63, 18, 127, -101, -314, -124, 72, 128, 6, 50, -53, 97, -106, 206, 93, 8, 159, -279, 50, 65, 27, -63, 236, 150, -138, -192, -80, 69, 37, -87, -7, -19, 215, -96, 77, -180, -70, -8, 94, -5, -217, -280, 9, -72, -92, 294, -215, -203, 110, -6, -117, -4, 220, -154, 38, -10, -24, -2, 13, -102, -119, 44, 129, 192, 31, -234, 130, 43, -174, -71, -79, 102, -45, -178, -143, -85, 41, -139, -182, -119, 186, -103, 53, 42, -70, -16, -81, -1, -258, 30, 16, 190, -212, 81, 163, -17, 322, -111, -8, -62, 173, -29, -80, 62, -98, 98, -145, 133, -139, -3, 276, -56, 94, 139, 234, 324, -95, -261, -144, 21, 88, -114, 80, -88, 22, 23, 62, -207]
7545b07J71J03n6k0j01n9K06m1j75K11J7N8q0r3j82M19q9k48N2N6J58j95L09l49
7569a35K55J6j09j2M2o2n1P6K64m70J91j60J30m2J55l1j60k8n9K35m21M52k58
7592a82Q6J38M1n2m3j20K8J71Q2K7j30J43j08J58j54J66n4j81J09j75L9k98L57
7615D8J36M2K6k90r9M6j05M18mq2k88P5r1J86j76J35k07K95j59PJ75r4Q0J48j55
7640F7l5N4L4j94K57j00n3P0J16k29j63L20k92K27j16J48m39N5J26K14k1L6j67
7663h5N7J14r1%p8j93M16J56m86K38k7n1J28N5J06m57L83m37J94j18K37K0p0j36
7687a25n7K08q0j22J65k67J78RJ93q2l35L32q4P2j14Q6j46K53m4N3L1J3j19N9
7711G7k57L7K83q5j52J81j37oJ67p0j66K49k32J61j60P3J36k75K71m40J79J24
$$ y = [-207, -36, 67, 11, -9, -110, -169, 37, -4, -179, 32, 49, 107, 27, -66, -248, 171, 82, -166, -114, -58, 100, -95, 214, -135, 120, 136, 27, 15, 57, -5, -56, 20, 284, -186, 5, -155, -25, -67, 88, 57, -103, -131, -190, 45, -376, 76, -182, -96, 42, 83, 31, -12, -132, -104, 67, 149, 176, 46, 189, 81, 239, 85, 251, 197, 16, 125, -50, -11, -309, 48, 184, 226, 252, -38, -137, -91, -196, 222, 218, 136, -152, -77, -168, 18, -158, -23, -230, 65, -94, -87, 88, -6, 74, 222, 67, 32, 86, 120, -74, 183, 83, 30, 100, 216, -13, -176, 144, -148, 79, -37, 111, -328, -273, -147, 67, 46, 82, -85, -28, 86, -5, -5, -83, -276, 140, 296, -190, 48, 21, -30, 98, 153, 259, -198, 185, -252, -58, -176, 61, 81, 11, -125, -182, 26, -54, -176, -11, -278, -100, -91, 102, 20, -315, 17, -67, 5, -109, -23, -169, 84, 40, 93, 124, 137, 18, 77, -180, -143, 140, 55, -97, 84, -53, -59, 108, 38, -128, 121, -111, 50, -110, -37, 99, -176, 95, -345, -166, -42]
7733d2R5M04m72R0q7J66k8k32K61j32J01L0q9O6j35RK20j04p8j35K51j89J71j62
7757b1K9r9k7J33J03l25L83k46j23K10L47j78l16K61k05J3L08j18j37rK21j41
7779F3K46k80m0J67j68K35l08p5K83M5k21O7j22K80k04L4K07j28k0j83k6L01o8
7802H5m8m0k33L54K7l9j23R7L5p6k54O1J02j14K53nOj03P0p0j02L48J0m44L32
7827A29l7j33J72o0l1n7K37k70P6J35J20l87R8Q7k12l6j65M39o5k21R5J08Mj86
7851a60L81k34J74o1n49O34j23K75p5j05q2K2j15N9Nj40K96M9k97K27k43R8Lj85
7875a46N7J43j01Q1l38K82k91K60o6K7J06l7R6l2l1M6Lp1j28K32j14J89mj18K91
7900C36l03J22j71J19l17K38m2J47j5j07R7k14N7j93L61j54L8L1m8j45K06J41
$$ y = [-42, 53, 457, -15, 75, -12, 154, 126, -106, 155, 23, 124, 154, 65, 131, -4, 5, 225, 121, 43, -92, 159, -30, 141, -21, 8, -91, -118, 15, 118, -207, 176, -70, -193, 17, 364, 186, -130, 131, -74, -61, 247, 129, -8, -17, 204, 63, 309, 29, -11, 156, -12, 223, -85, -160, 123, 168, -53, 14, -108, 172, -32, 2, 209, 81, 61, -122, -148, 153, 85, 37, -3, -236, 118, 145, 106, -17, 80, 115, 39, -215, -154, -52, -166, 87, 82, 88, -15, 55, -15, -117, 231, 241, -203, 129, 92, -41, 131, 71, 40, -17, 220, -50, 26, 161, 281, -106, -8, 79, -133, -169, -334, 105, 40, -181, -86, 22, 26, -160, 221, -13, 161, 100, -449, 185, 62, 337, 262, 157, 75, 97, -18, 41, 46, -94, 202, 251, -46, 181, -62, 36, 39, -146, -89, 54, -47, 34, -304, -22, -313, -53, -119, -92, 14, -23, 73, 41, 10, 56, 59, -12, -140, 92, -22, 167, 163, 45, 336, 33, 155, -16, 103, -214, 24, -18, 129, 114, 7, 104, -110, -53, -246, 115, -39, -1, 30, -18, -163, 43, 184]
7922A84j05j08j15K90j20k21J71OK6mj07O0J44K2j43K15j60k00K07j2j81N60m21
7945a2m3j1k7l0R6p3M6p6J91k04L75k06j71J4K81j4k95L97M6m13J18J10l70N29
7969B58j29M5j62K62k00M9O9O9m20P9J04j98K04R1j52J53l53M89k90j98J26oK51
7992A41J01j86J16j38J48n19K34L06j72j8LP2j03J1M4L5L7m8q9L96l26n5K0j14
8016a04M7K87k82j39M68n89K67K68n26K39J83l07L32q4j52P0M3r6ML58j82J24
8038B29k53P8j86L64k02m2r7K28m90K36J35O1k11K03l23K71j29J43k81L18J92
8059B44k43P3j71K06l16M57m22J63o6J75k52L54n09L83j25j7Q9K03j84J08m1l69
8081b60M45o7k96k6K39o7M2K35k61J32j86K19j04m0j44J61k4J95l5k9j19j44o6
$$ y = [184, 79, -29, -144, 146, 26, -195, -24, -18, 8, 4, -103, -43, 101, 123, -20, 195, 35, -165, 42, 30, -151, 409, -12, -55, -66, -93, -123, -27, -100, -54, -130, 61, -143, 232, 26, -145, -131, 150, 136, -159, 238, 284, -129, -11, 99, -271, 258, 129, 174, 12, 274, 74, 123, 192, 261, -159, -80, 24, -174, 30, 121, -31, 122, -231, 258, -32, -230, -104, -110, 141, 242, 56, 172, 34, 182, -337, -103, 203, 31, 13, 16, 88, -15, -4, 40, 75, 112, 64, -25, 371, 45, -10, 10, -104, -57, 230, -52, -191, 277, -312, -45, 223, -303, -64, 119, -188, 144, 60, -92, -22, 21, -75, -71, 287, 105, 229, -24, 54, -132, 232, 30, -12, -109, 119, -371, -135, 0, 61, -150, 53, -270, 1, -128, 15, -266, 52, 244, 1, 74, -97, 109, -207, 250, -172, -9, -75, 100, -152, 202, -307, 76, -49, -66, 23, 226, 42, 150, 109, -260, 185, 118, -178, -204, 35, -32, 10, 245, -16, 116, -70, 149, 45, 5, -139, 22, -2, 193, 158, 129, 10, -134, -200]
8104b00K9M73m44O5j21J01p4o2r1M24j8j46J37j33K7K03j17k92L22L3k51N0m9
8127a34j36L38J59j75Mj62k2R0%r7mJ31K14r5j61O7n8J00P0q1k64M52k39M33n14
8152h4J93k07L14qn47K72J03o7J51l82j48J61J07L42l21K64L2q2j84J72q7K71
8174B65jl64J25K51k00mn9J29k72qL8J53j45j25K44j22J43
$$ y = [-200, -171, 302, -142, -77, -198, -97, -171, -233, -324, 100, 82, -64, 73, -60, -33, 170, 53, -239, 83, 116, -135, -85, -134, -270, 68, 227, 52, 56, -106, -128, -38, -38, -135, -139, -8, 206, 111, -50, 17, -41, 59, 129, 48, -216, 236, -3, 430, -84, 109, -98, 216, 208, -339, -67, 36, -31, 120, -262, -410, -249, -142, 200, -121, 143, 175, 93, -91, 81, -6, 265, 264, -100, 25, 276, 76, 72, 13, 142, -130, -138, -100, 53, -92, -217, 27, -95, 48]
8191D8
$$ Imaginary data points
##PAGE= N=2
##DATA TABLE= (X++(I..I)), XYDATA
0@%%%%%%%%%%%%%%%qJ6j6J6j6K1k9L2l6M4m8N6o9P7q8J04j18J32j50J68j88K12
37A12k37K65k96L29l62M01m46M92n43N99o60P27q02Q84r74J072j183J310j450
56g62J609j794K012k266K572k952L434m068M940o223Q294j2175K1822q9161j33148
71b07866K41148J13871j46664r8741Q0566O5887k3477j9516p752n0319N4650Q1003
83H2790m4112r0452l207R9106L2820j02391l4094P2929L0497m0232l4007R206
95b1147J8462l903K4195j6229n8494M5193N5552n0208m0504M4447M2751m2812
107b697k4261N3316j1722m3660N0694K5727n9107j7121N4513K5338o7195k7891
119d4066P2772O423n9380J345L5739p318m0454K0687N0037n1261m4430P0631L4294
$$ y = [0, 0, 0, 0, 0, 0, 0, 0, 0, 0, 0, 0, 0, 0, 0, 0, -8, 8, -8, 8, -8, 13, -16, 16, -20, 24, -24, 32, -37, 40, -48, 56, -62, 70, -80, 88, -100, 112, -125, 140, -156, 173, -189, 212, -234, 258, -285, 314, -346, 381, -421, 463, -511, 561, -622, 688, -762, 847, -947, 1065, -1201, 1371, -1581, 1853, -2215, 2725, -3498, 4796, -7379, 14443, -74718, -207866, 33282, 147153, 489, -98252, -17686, 48201, 24724, 5208, -2544, -52863, 1787, 82790, 38678, -51774, -54981, 44125, 76945, -25446, -59540, 13389, 43886, 3654, -30353, -21147, -2685, -6588, 17607, 1378, -57116, -11923, 43629, -6579, -47083, -2636, 40115, -2697, -26958, 26358, 14636, -29024, 21670, 47397, -11710, -28831, 25682, 51020, -16175, -44066, 28706, 35129, -24251, -22906, 12833, 5515, -34939, -14252, 35785, -15476, -59906, 10725, 45019]
132D5019o3740l5602N7298M7362n3386k9385M4764L580j3639J4079p547j9483
144a0680P740L4866n652n4613R980M9061j7027l1970M807J7610l86j8259J1456
157c067O399k6641J3612K6310j8603j8163J2248K2703j0969k0206K5288N880k9228
170a4437J5095K3312j7697k3587J2868L4802j8239l6961K4949J9000k0562n597
182g054R300J872j4295M481K5005k4060k5106L4305J7601k6965j9245J8426K6746
195B1011k0375j8930J8995K521l054O641r563n873P206J4582q64k8957O346L2877
209B2563j0141k3434N54K0378Q053k4040k486J6899q587K03O441j1300l424Q061
223b60R890j0720j9821J9953J4136k1852k736J1138K213l840n050J1036r41j1909
$$ y = [45019, -18721, -54323, 2975, 50337, -3049, -32434, 12330, 15910, 2271, 16350, 8803, -10680, -2940, 31926, 26274, -28339, -18359, 30702, 13675, -18295, -13488, 4122, 3736, -14523, -3067, 3332, -23309, -9697, 16613, -1990, -20153, -7905, 14798, 3829, -16377, 8911, 14791, -14437, 658, 23970, 6273, -17314, -4446, 30356, 12117, -24844, 105, 19105, -1457, -7054, 2246, 4118, -10177, -5696, 19309, -4751, -29857, 4448, 22049, -4916, -24161, -5735, 21011, 636, -18294, 701, 3222, 168, 6809, -2754, -8627, -1421, 13161, 12297, -16660, -10314, 22563, 12422, -11012, -10458, 9920, 17973, -6067, -8553, 8346, -241, -38, 6403, -4897, -8321, -260, 9630, -1090, -20911, -958, 13178, -8674, -11410, -272, 1941, -1899, -6949, 4087, 3146, -8763]
237h763J4514M577j2924J578N910O133p212j0058J5823O1j5066P273L514n257
251A03m040L29R094j0333p959J6085m348j0455Q033J771j050l296K160R685j0123
266d344r39J4966o735n261N382L946K908j1358P65J4575r729o241N645j225M88
281B843m824m30L599r575O096O261j5193K335J0024j328m604o036J1222O368j3622
296f864M186O591l018M027l181P5M082m612N925j155j0455Q770K530n247k308
311f54l490Q862j810j1326Q420l2n843N366k492j168R26o34O852o576l344J1337
327D394l215l876L423j236N515l261l844Q176l954j768M406m295J902q60j544
342c7N356p693k26P786p059r20K970k115K105m217J445M808p641K837L988n386
$$ y = [-8763, 5751, 10328, -2596, -1018, 4892, 11025, 3813, -6245, 9578, 9639, -5427, 1846, 5360, 103, -3937, -3608, 5486, -4847, -12806, 3279, -1069, -11524, -3491, -1720, -2770, -6066, -3906, 5779, -4344, -5283, 9683, 2948, -2313, 3069, 7015, 9923, -1435, -670, 13905, 4176, -2065, 3580, 2355, 2843, -1981, -2411, 1188, -8387, -2291, 3970, -11223, -8888, 1136, -192, -4796, -10832, 390, 6758, -6864, -2678, 3913, 895, 4922, 1741, 1816, 5898, 1286, 7211, 6056, -4399, 4371, 6901, 1654, -654, -4144, 4718, 2908, -8418, 2, -30, -5873, -507, -2999, -4167, -3241, -3875, 2977, -3599, -6943, 4394, 1179, -2697, 726, -510, 5005, 1744, -2100, 6076, 2122, 354, 4760, 465, 2367, 1507, -37, 5319, -2374, -2600, 5186, -1873, -2793, 177, -1938, 167, -4050, -2605, 2203, -5438, -2601, 1387, -3999]
358c999L582q18r99M672m464K467K568m827M525r0k287L565l817K782J987p133
374b286N744J014o106L318q41Lm60n072N204n71m751M537l652o57N179m291Q46
391b842K39q95O335l224k559M461j459M373n54n969N696J060j213J487o013K242
407A165M468l668p86l965R05N969o379j512K354l487M052o61l869K521j390L463
423h20J948o478M192L289j312J638m161L312N468o191R04K259j457K107m203O26
439A121L360n665K290L73m646L145k210k71K178n469K849L370l740M26j588K908
455a569N059o567P55M570j880K969k837n18N443m263R45L350m962M34k04J964
471B689K319q316O92O884n182r11m49n73L612m163J149L204o569K138M326p41
$$ y = [-3999, -417, -1235, -2234, 2438, -2026, 441, 3009, -1818, 2707, 2617, 330, 3895, 78, 2860, 4847, -2286, 3458, 4472, -1634, 1684, 843, 846, 386, -4686, 518, -53, -4804, -267, -3919, -4576, 603, -3688, -2842, -2603, -3498, 2837, -387, -2946, 1515, 56, 4429, 3875, -2094, 3602, 4662, 3449, 4936, -1077, 1165, 5633, 1965, 1179, -2786, -1881, 4088, -2291, -3803, -1449, -4936, -884, -1545, -5414, -2893, -4283, -820, 1128, -5350, -1158, 2131, 819, 2457, -1704, 1608, 7076, 885, 1789, 4048, 2591, 4698, 495, 1121, 4481, -1184, 1106, 1479, -3167, -22, -2232, -2503, -325, -5794, -2945, 425, -3315, -2889, -4477, -1569, 3490, -3077, -2322, 2248, 368, 3337, 500, -18, 5425, 1162, 2107, 5457, 495, 929, 725, 2689, 5008, -3308, -2616, 4268, -914, -1825, -2274, -2847, 765, -3398, -2249, 955, -5614, -3476, 850, 109]
487A09K58o122L866Q259o731k513L878J012K726m658k98M665n271K639L276m701
503C94L62j683J846M461p682j505M968q39M46n247N8O415m742q12M197l590P03
520b250K21R40M398o036l36P005k248j323j004J824N041n993o86O505m732j748
536d22K181M69J085o345R93O688o459k341L540l89P91m891J224O528o868j463
552e679O656j77j003l585K233P234n349j418M305j756J999j912r37N228m654k222
568a037M873j848j157k634m8N770n627l084N042k712j81J06q77L903m272n62P229
585B884l061l044Q10L315N885p206m318R410j18k842J80n68K248l060N54M363
601E432o819j797N792o76j768n270N11Q599m097n737K562K384K328m321k525O688
$$ y = [109, 367, -5755, -1889, 6370, -361, -2874, 1004, 2016, 4742, 84, -214, 4451, -820, 1819, 5095, 394, 756, -927, 919, 5380, -2302, -3807, 1161, 322, 768, -4479, -4421, 1994, -2748, -3560, 637, -2953, -2250, -2029, -1089, 3309, -2727, -3063, 3942, 1694, 371, -633, 1191, 6232, 239, -447, 6058, 1326, -422, 1759, 2228, 3313, -3032, -2039, 4649, -1810, -4151, -611, -1000, -209, -5100, -3876, 2652, -4216, -5679, 977, 800, -203, -3788, -1555, 5679, 330, -1088, 3217, 1461, 3460, 1548, 611, 5839, 1185, -1037, 3836, 1988, 831, -1803, -1851, 3919, -1708, -4792, 250, -2462, -2643, -2537, -3414, 489, -3783, -4345, 2884, -177, -3221, -2411, 904, 6789, -417, -4735, 4675, 4557, 1715, 1895, 1327, 3575, 515, 1069, 5432, -1387, -3184, 2608, 1932, 164, -5106, -4595, 4004, -93, -5830, -3268, -884, 1444, -2877, -5402, 1286]
617A286j641j186L468k942J485M90r62M158k577k005L444q32J082k417k409N677
633D119j863m238K903j133j13k15j679L404l817j337N109k840j415Q48j01M585
649B217l149l791N384R83j330k54j117M490j122l140M057k553K21L445k858p67
665G16q86J69L993l950l197K871k39J911k718m531N279J089k267l22k085M194
681B7J543m445J935K0J004L231l840K63K594j475K848k159j922L708j419K72p20
698A465k836L959j381l491K922j647o3P98k894K106k18k219L307k120l03K937
714C22k604K016P58j850L495j819n3K880k650J749N68k633K927j300j058J548
730B296k844J746P05l766J951n17j431J768k845Q96K010l085J841l75r59L176
$$ y = [1286, -355, -1541, 1927, -1015, 470, 960, -2, 4156, 1579, -426, 3018, 2186, 3268, 851, -1558, 4119, 2256, -1982, 921, -212, -325, -540, -2219, 1185, -2632, -3969, 1140, -1700, -3115, -2267, -2368, 2217, -932, -4723, 661, 1644, 314, 60, -1057, 3433, 2311, -829, 3228, 675, 896, 4341, 1483, 716, -170, -1, 3992, 42, -3155, -284, -523, 1388, -1330, -5861, -582, 507, -1760, -2082, -4167, 27, 1570, -2875, -940, -920, 84, 3315, -525, -262, 2332, 857, 3705, 1546, -376, 3332, 1913, 2185, 1465, -1371, 2588, 1207, -2284, 638, -1009, -1072, -274, -3168, -1062, -1280, -3499, -192, -2312, -2615, 322, -2282, -266, 492, -1358, 2137, 318, 265, 3145, 495, 2244, 2812, 179, 3106, 1806, 748, 2296, -548, 1198, 1903, -1863, 88, -429, -1860, -92, -2937, -2041, -31, -3116, -1275, -1650, -2609, 567]
746E67k515Q86K196k666K601L93j740L080j601qK153k687J804p23k336L713k462
763F55j332J971k514J621l43k967K571r57p10K077l569J704J867k399K066j107
779a366l22L599k590N37J521j715K802j246j390L037k526J238J492l654J811L95
795A623j794K065k733J20K114l413J258j07j762K868k345k52K390k468J615O13
811b08j665K696j278k96K753k940K278J262k970K790n85j155K189k546J012Q73
827B210k670J843j045j290K341k742k33J600k633K171p34j738K726j804R60J177
843A39k380K452p7j495L333j729o94K932j805J284n32j303L017j798r99J713k348
860b90J318K80k847K130j235j251K514k954K06J526j755J813j471k99L033k447
$$ y = [567, -1948, -1062, 1134, -1532, 1069, 1462, -278, 2802, 1201, 1193, 3346, 659, 2463, 1740, -596, 3117, 655, -677, 1294, -1220, 401, 58, -2909, -338, -1295, -2005, 72, -3497, -1793, 74, -2325, -259, -1366, -1688, 1911, -679, -142, 1379, -336, 2466, 1220, -170, 2867, 341, 1579, 3071, -583, 1228, 1623, -171, 1894, -839, -719, 1395, -2018, -760, -867, -2629, 239, -2106, -2358, 32, -2436, -821, -208, -1873, 823, -455, -751, 2002, -938, 1340, 2602, -368, 2422, 1837, 682, 2871, 325, 1337, 2210, -460, 1383, 338, -952, 1389, -1353, -1586, 14, -2619, -448, -1182, -2920, -194, -1998, -1038, 139, -2241, 211, 134, -1361, 1972, 243, -451, 2481, 676, 1960, 1428, 125, 3142, 1344, 345, 2058, -290, 1028, 1308, -1539, 591, -644, -1895, 619, -2335, -2129, -603, -2358, -545, -2016, -2315, 718, -1729]
876a729Q62J714k336K393N99j469J856j631J488J570l466J704N70j438J671k589
892b31M70J512k964J729m98k640K492o67l05J37k454K945Q59l361J985k42M66
909g67K095k289Q72P80r97L185j697j630K611j048J130m3l164K316K46j018R26
926A508l592J165K845k720m75j101Q34K751l430n13K738k308J642N25j301J268
942a64j082K344J870m652Q26L889j089o26k484K717K852m794J83K096j809O32
958G09q79Q5P27l320K374J456m018R19J117L01O00l657J628L074k249P03o62J49
976i43L559k450m15K033j583J419J83j338J816k413N47K908l302q82O97Q14J919
993B569n438m36N292k117k453L77J091J669l286J141L259m237J11M291o11j527
$$ y = [-1729, -867, 847, -1489, 904, 1503, 34, 1890, 259, 1747, 3317, -149, 1555, 2125, 687, 2358, -231, 239, 1751, -1213, 516, 18, -2622, -130, -797, -1102, -965, -3419, -474, 385, -2976, -991, -1233, -767, 1328, -961, -89, 691, -306, 2879, 1182, -448, 2163, 1115, 2245, 2202, -962, 1354, 1600, 582, 1508, -2084, -919, 1926, -794, -1269, -2370, -1536, 1215, -2215, -2728, 10, -2298, -656, -131, -1432, -164, -1246, 1098, 2968, -1684, -858, 3031, 1942, 1316, -1168, 1549, 4401, -393, -210, 1886, 77, 709, -170, -85, 642, -2678, -304, 1152, -2866, -1947, -830, -529, 71, -3586, -1958, 1116, -1133, -430, -1092, -943, 2616, 166, -249, 1784, 201, 1620, 1803, 465, 2281, -132, 415, 3323, 21, -861, -164, 650, 2569, -2869, -3305, 1987, -130, -2583, -2206, -1115, 554, -2732, -1591, 1668, -2569, -2458, 1833, 1222, -305]
1009c05j865L272L634n464n84L942k86m48j964K40K897l394L55K152l221K91Q70
1026A22k30J27l349J785K840k965J69m81j64L274j781j581K551k64J071j356j221
1043a453M202j277j677K596j525PJ72r9K172l769j123N182k258l113M01J331K257
1060B026m143j234M836k404j895K164k12K32j244J143K976m281K6M484j200r27
1076C47p22J205K463k965o29K675k007O95N11j707R99j621O27J303l254J018J577
1093E15k077J056o53r79J921j435J307m09j910L721q9k367J649M69L50l89p35
1110e5K952j487k670L695q73j611P71j39J452k316j811L903j737k139J902p48
1126i11N04j150n08L028k725p00L223j528l32N38K41J961k241M28L030k850K89
$$ y = [-305, -2170, 1102, 4736, -728, -1312, 2630, 2344, 1896, -68, 172, 3069, -325, 30, 2182, -1039, -748, 122, -108, 19, -3330, -1545, 1295, -1670, -1501, -1982, -2146, 1128, -653, -2234, 317, 53, 1124, -232, -1453, 2749, 1472, -205, 2391, 866, 873, 1045, 946, 3118, -651, -1774, 3408, 1150, -1963, -1562, -231, 2026, -2117, -3351, 1485, -919, -2814, -650, -862, -630, -1874, -731, 2245, -2036, -2010, 2474, 1274, 347, -375, 830, 3293, 328, -301, 2374, 367, 1062, 1573, -134, 865, -756, -129, 1174, -2080, -1062, 515, -1562, -506, -1159, -2138, -217, -1652, -345, -754, -2664, 1057, 968, -1399, 250, 719, 1069, 680, -55, 2897, 1410, -1260, 2435, 1562, -49, 722, 583, 2035, -281, -2092, 1811, 74, -2065, -163, -911, -407, -1557, -2065, 963, -1762, -2462, 761, -767, -1099, -561, -320, 1641, -600, -172, 2858, 8, 297]
1143B97J638j295R10j010N02J275l159J113J638k760O93Q6n48M46j956J631N39
1160D0l157K662O83k256J185k8K53M39j530K730J93k321K485l81l70P95q51J470
1178B041j029j786K881j052j817J637p01N04j084j070K674k031j507K598j259
1193a001m51O78k98J272j939O18K916k693j03K093q28P25q29L50J580k306M96
1210B80K078k168L84N55o90P51j959N85J456k883R39Q29j720Q53m60M43Q82k404
1228b249J941N64k082J754K32l75M96n53J588ok419L071k86j817J774p21K77m24
1246G65j139K073j229j898K508j453n58O69r11J173j235o47K389j558n64K009
1262C94j265P65k33k38K198j808l29K349j636K44O46m72R81j630N74J666k530
$$ y = [297, 1935, 640, 1550, 540, 1042, 2317, -842, 271, 1909, -851, -158, -72, -620, -174, -2130, -499, 40, -3117, -455, 228, -2028, -843, -871, -618, -179, -1709, 1021, 1214, -1107, 1378, 997, 627, 1422, 571, 2041, 1012, -774, 2107, 1055, -762, 875, 174, 678, -406, -1476, 1198, -833, -2340, 258, -1001, -1452, -774, -1072, 200, -1739, -1121, 1795, -898, -1001, 1092, 264, 989, 160, 510, 2090, -216, 280, 2358, 190, 574, 1129, 439, 1190, -769, -184, 1272, -1611, -672, 157, -1563, -710, -1170, -727, 155, -2249, -308, 256, -1826, -72, 160, -215, 281, -272, 1316, 1310, -1109, 1962, 1676, -141, 1633, 912, 1189, 765, -374, 1699, 470, -1428, 1080, -373, -931, -262, -1173, 0, -1235, -1882, 507, -1051, -1615, 394, -871, -106, -339, -577, 1621, -187, -516, 1833, 197, 441, 1087, 615, 1596, -34, 540, 2206, -324]
1279c24N76J249j758N67o86j32R27k369J265J205k543J544k37o27J058j315J433
1296a67P85k248K189L74j416J601p26N97L15j517J946l35j795J814o13n79O07
1313H32j271R26o89j387K131j303r60J783j194L00K14j158K107j283k80J995j309
1330e46L65P71r45J618j088k64K327k089J58J200j368J187o45o50J103j680M88
1347e8J087k272J218j56j137J228j349N59R24j811J340M10j362J792o88J90Q30
1364G45j428J535L87j610J753n08k40R74j240O87J82j685J500p19q88J327j471
1381f99M79L29j785J641o93q97J575q62p6J115j719J787j95p38J542r18K42J176
1399A304j594J191K29j084J390j063J45R97k051J161L33j448Q01q02j08R68j737
$$ y = [-324, 252, 1501, -257, 310, -376, -508, 419, -1950, -685, 520, -2023, -479, -716, -1343, -285, -1600, -167, 618, -1630, 559, 933, -483, 1118, 392, 989, 1304, -213, 1733, 1398, -397, 1417, 804, 225, 832, -439, 487, -202, -1589, 542, -761, -1721, 62, -1132, -832, -618, -1776, 331, -952, -1232, 763, -546, -181, 590, -355, 1263, 175, -89, 2238, 149, 307, 1507, 139, 1326, 681, 31, 1134, -546, -58, 1029, -1243, -25, -181, -1318, -90, -1439, -880, 44, -1767, -427, -17, -1379, 413, -275, -85, 745, -683, 852, 1239, -371, 1382, 874, 634, 1608, 368, 1055, 1237, -448, 1052, 333, -555, 772, -699, -220, 109, -1676, -35, -728, -1625, -50, -912, -988, 127, -1592, 195, 0, -738, 804, -114, 128, 1304, -290, 901, 1130, 46, 1436, 373, 518, 1515, -536, 625, 958, -490, 311, -491, -599, 369, -1368]
1416a368N16P54j257R98p50J60J070j666J057J244j662J248l03J83J175j485O16
1433E30J129j700Q69K17l48Q58j687M22R65j905M17O16r52N78j338O13Q83k113
1451a946J097O69j232R23m42J39J754k115R99Q61r44P53k84L95R78j915J150J058
1469A898j671Q53p22q5J024j589L40N46j456Q65p58k97J321j971P57J106j291
1486a130L43J61J19Q95j384Q99J497j988J011L58o73J474j460K86J473j488j96
1503A97P02n60K05j198O98J262k527M68J069j166N72r39K76J086j818O73R91r63
1521i72P82l42J32J317j659N81J504j199K89K54j74P89j535N74J131j377N92k67
1539D20p20J105j445r6J037j049L4J34o12J392j832J84J952j482J02Q47m23R33
$$ y = [-1368, -852, -98, -1355, -357, -1107, -947, 123, -1543, -486, 758, -904, 344, 41, 224, 1399, -86, 530, 1659, -41, 828, 1045, 697, 1555, -132, 290, 1255, -650, -233, 383, -569, 9, -1329, -716, 167, -1946, -849, -180, -1412, -489, -931, -792, 962, -1153, -154, 707, -237, 516, 232, 627, 1605, -310, 840, 1898, 227, 1080, 358, 273, 1297, -292, 48, 594, -862, 3, -755, -1052, 269, -1702, -945, 161, -1130, -787, -626, -507, 388, -996, -97, 1400, -588, 423, 781, 108, 1582, 122, 408, 1881, 393, 197, 899, 339, 544, -654, 44, 1306, -1221, -753, 316, -850, -278, -1217, -941, 145, -1673, -1000, -9, -972, -190, -532, -400, 917, -742, -161, 1343, 144, 433, 687, 513, 1302, -233, 341, 1472, 95, 687, 420, -300, 805, -640, -736, 301, -748, -714, -580, -1192, 200, -1632, -1448, 504, -978, -876, -29, -452, 481]
1557D81r35L21J492j063o5O71k16P60j222p5J796j866j36J410j149J43r21J54
1575d20J128j978M76R03j458N07M42p65J337j050M5Q38p72Q43p0k24J463j291
1593d6M7J387j270M56N07r64J180p34l60R10j532Q85l38j149J499p86j293J665
1611F4q58K8J3j24J009j189L0J605j003j72J291q95Q12l39j69J412j207PJ293
1630A608j338P60l68o96J319j200n55J179j152k37L82m23P89j185R3J108j448
1647a364P74N00j016R16j57L5R03j150R04N56j344J329k11q7P42q53R8O8o07R69
1667A005m50r27R50o77j90J32p53P52k45j169J277n83k64J084o75O84k50n56J444
1686E89q03l13J209k79Q4J70k06R39j118r3J441j516l1Q64j317Q16n81l13Q09
$$ y = [481, -454, -133, 1359, 296, 231, 902, 686, 1446, 224, 149, 1945, 79, -57, 1353, 204, 347, -574, -420, 708, -1270, -794, 109, -1349, -842, -400, -1165, 172, -878, -833, 5, -767, 76, 6, -218, 1245, -46, 1, 1388, 118, 574, 1081, 117, 1297, 563, 203, 1113, -419, 466, 128, -1021, 478, -308, -1601, 64, -794, -766, -753, -877, 132, -1057, -1027, 578, -425, -597, 694, -201, 611, 272, 103, 1515, 308, 315, 1608, 270, 1030, 662, -34, 1285, 85, -470, 709, -443, -680, -298, -721, 68, -1117, -1024, 84, -1364, -590, -90, -1106, -190, -347, -312, 591, -559, 345, 901, -443, 886, 675, 588, 1330, 477, 575, 643, 36, 1005, 555, -372, 578, -99, -289, -157, -910, -158, -403, -1572, -295, -878, -1142, -58, -733, -49, -299, -855, 589, -214, -527, 682, 403, 487, 657, 451, 1390, 272, 179, 1620, 104, 73, 937, -380, 436, -145, -458, 351]
1705C51j278K89N04r75Q30k86q7Q14j043M76O19j028R33ml52Q04o29P73R2j197
1725c94J266J60j087J162m44m01L14r17J115n76j040R46m13n94P91p23N06j09
1743d38o85J125n56k45Q80p66M91K48o69J397o09j28J292r21p7Q30q43O09n23
1762D12l41J084j267J3O75j096L72p6m39P23r80L38Q45j553P14L90o34P14n42
1781f48K87Q97j120R29M64p96R64n26j86N94q94R60K58j444R13q7p49P33p59L35
1801A25p0j050R99k99o02Q87o80j40N85q47J147k39o02J522r05pP86o18O69l82
1821B79k8R72o44l44J160j165J80l3m66O42r62QO30j111P05O1q18Q48n95j57J084
1842B46j359O48P85r49R12k68k00R12p14L40Q02j288R70k7o62J011r25L06J56
$$ y = [351, -927, -638, -134, -1109, -279, -565, -652, 162, -881, -405, 214, -814, 119, 115, -237, 567, -62, 711, 803, -394, 872, 1032, -55, 1107, 663, 262, 576, -341, 774, 198, -842, 104, -309, -903, -112, -835, -329, -438, -1123, 2, -554, -799, 81, -685, -194, 54, -615, 782, 173, 45, 1337, 416, 339, 1169, 326, 935, 412, 71, 1155, -112, -99, 576, -520, -148, -224, -663, 60, -920, -582, 263, -1290, -576, -186, -820, -106, -648, -361, 536, -584, 345, 809, 13, 977, 451, 265, 859, -35, 925, 1183, -261, 652, 565, -184, 549, -210, 125, 55, -995, 4, -295, -897, -10, -690, -830, -245, -1092, 55, -184, -786, 736, -169, -176, 610, -8, 661, 279, 251, 1223, 579, 235, 1395, 230, 410, 377, -89, 553, -409, -401, 229, -882, -177, -116, -934, -86, -681, -838, 246, -1113, -465, 320, -629, 283, 15, -185, 727, 13, 353, 1155, -133, 837, 810, 148, 1159, 234, 540, 696]
1861F96j085O82J2q20N53n48j09L79n38N04J2j159J294k88l20P66q39Q46m2o43
1881f47J467m24p44J271n66L59j09o77J019n48j58P90r70J0L51r35P06m34m87
1900g26O32p43L33L73p46L76J31m08Q30q15M88N83r54Q49N80r71R99n48L02M67
1920A032j233O68N72j358R02l94j58M92j357O65N45j194O51j25k69P15j173M46
1938e73K86o61Q92k68r6O45p22O64M76p82Q02Ql76L97n92M32N88j265N73K8n58
1959a02P60j120M88L97r59M78l0n83N04o91L85O61j149O79N12r73N18r8J73J129
1979I79j292M62Q42q49O37n11r7Q86j156M70P26j225M51k99j58L23j204O26M15
1998B6j273J055j67k57N51q13L34P82r20L91O49n51N40q68Q81Q10j488P45M85
$$ y = [696, -389, 293, 305, -515, 38, -510, -619, -240, -778, -274, -262, -1421, -127, -415, -735, 31, -808, 38, -4, -647, 820, 396, -348, 923, 357, 716, 607, -70, 949, 401, 243, 1033, 63, 73, 424, -511, 195, -239, -726, -94, -837, -504, -131, -877, -501, -370, -778, 52, -763, -275, 308, -646, 203, 783, -188, 811, 263, 565, 1032, -201, 467, 1039, -319, 583, 189, 31, 523, -834, -169, 376, -818, -167, -292, -561, 154, -1019, -573, -287, -948, -56, -324, -420, 225, -497, 167, 643, -139, 663, 671, 295, 692, 100, 532, 1120, -145, 428, 456, -102, 658, -462, 26, 423, -536, -58, -88, -671, -167, -858, -473, 188, -961, -282, 230, -743, -225, -323, -150, 979, -313, 149, 991, 142, 779, 268, 171, 1057, -99, 371, 1097, -128, 323, 24, -134, 189, -1015, -389, 26, -1247, -192, -359, -616, -65, -878, -544, 238, -682, -291, 358, -193, 347, -521, 360, 1170, -318, 427, 912]
2017I12p06P15o33j24N77j044K95M45j010O84n20k62R72j162K90M51q10P07j71
2036c94L5M65o15K79M42o84R09n8n56J391j016r3N62l63J82j7k03N53j358O42
2056A03P44j053p2L99p52O95j050M75P44j316L29M81l61M35m52J14J292j419M60
2075b04P60p53L37J25R5O84j015M30M07q13K83K32o57P83r38l8K62p05P88m47
2095c84k76P30q63O2M86m33Q17k28r27J201m91j09Q93l64L19K68q61Q33k79p23
2115c29J556j084K01ok68O01r19n2J084j155Q7M04o96P4l09J09R48j061J44Q84
2135B13q99L12J74J76N42o57M00N47r70L71M45m58P29o99J07O23j252Q58k67q40
2155e45P38j12n48N49q73O85N1r06J123j53p45P23j94o8J86l26J122m99k79J041
$$ y = [912, 206, 921, 288, 164, 741, -303, -8, 437, -573, 111, -409, -671, 301, -861, -571, -120, -930, -223, -394, -359, 106, -509, -230, 212, -472, 437, 379, -177, 1214, 198, 105, 667, 304, 486, 469, 266, 819, -539, 103, 847, -206, -278, 121, -631, 64, -986, -511, 233, -1083, -754, -273, -634, -199, -651, -537, 755, -664, -204, 556, -197, 140, 265, 360, 1044, 29, 459, 866, 53, 336, 568, -89, 694, -244, -282, -20, -725, 63, -384, -660, 70, -793, -731, -245, -678, 139, -89, -1016, 185, -306, -415, 478, 114, 433, 701, -160, 673, 394, -329, 1227, 143, 344, 338, 70, 671, -248, -300, 784, -371, -284, 120, -576, -502, -811, -702, 246, -815, -671, 213, -686, -374, -200, -24, 518, -139, 261, 808, -162, 209, 654, 196, 925, 226, 333, 956, -296, 562, 295, -545, 193, 81, -467, 82, -791, -106, -55, -961, 162, 9, -736, -13, -207, -275, -89, -415, 707, 208, -71, 970]
2175I70m73l8o1k58P96m95p86J141n68l97M90o67Q06p04k12P07j053q7J154r06
2195f41K11K44m05O51n84M9P19q10N75O02p61Q40n41J86L97r90O20L09p12Q00
2215G59l90j69J13n04M99Mj191J004k72q05Q34n45L80N9p71R60j40m87Q56l44
2235a50n3O43n95N59K58m87O72n44k18P23o13O2K87o42M95n62k63R70j074K2L30
2256a80m39O68o39j98R85r52O3O29n29M78K45m48R76r84L88O99p66N39j7m14N67
2277F71n56N14L84j052O22j82n68L01n50J68K55r28R53j92p75P05r6j23L21l17
2297d45K97K81m64O95j84j70O43o36J89N37p42R14o67k36P30p92L62Po67O87n39
2318b00m37Q13p91K4O77p07L31m2k49O64p22M06M40q32R53l01j75P24l13J18L35
$$ y = [970, 497, 459, 398, 140, 936, 441, -345, 796, 228, -169, 321, -346, 460, -244, -456, 251, -802, -889, 265, -641, -430, -186, -591, 60, -524, -475, 244, -566, 9, 611, -150, 690, 149, 335, 732, -258, 362, 671, -41, 759, 369, 200, 313, -191, 308, 312, -879, 125, -147, -952, -118, -663, -283, -224, -995, -35, -175, -662, 194, -150, -203, 440, -155, 404, 662, 175, 847, 303, 85, 808, 195, 257, 544, -98, 397, -165, -428, 542, -532, -510, -180, -619, 49, -590, -788, 197, -755, -692, -63, -592, -114, 131, -317, 659, -325, 63, 762, -4, 535, 518, 104, 671, 115, 629, 1013, -39, 583, 401, -167, 134, -416, -248, 7, -921, 32, -160, -935, -230, -326, -449, -128, -445, -148, 133, -331, 364, 180, 10, 653, 17, 206, 743, 1, 915, 248, 12, 742, -50, 312, 319, -348, 339, -200, -637, 176, -615, -591, 86, -621, -290, -332, -581, 83, -639, -233, 207, -625, 328, 27, -148, 576, 263, 381, 716]
2339G16q26P12mn79M96j49j70K63p42N54j2j074Q80l80k62M58m91L11J03o43P01
2360a38M5n44R74m53K15J63l71R05m97k82N43l34J2L83n35K50J80n92M64k69k76
2381a57M35o42M00j70m50M87l15l22M45m13O10J03p21O55k96K57P44r16N81K96
2401F11q56O83R1m28Q16q58L68L57j074M75J77o59O67p12K80K19j039P88K17o68
2421e45J97j54L07Q4k82L72J6m36P17l64K39L39p13N55J66n23N40k90k07O42o50
2442A0OL07p72P01l56j92M71q32N16M8o30O02l36q3N40n26M36K41o41O97Q5l09
2464a7O78o50K8N72o18Q6L44l19N84p00P5M05p66K56L26m43L5k57L6O19j001M36
2486b91K21n91M96j19k4N37o95L60L52m33M66Q1j36M37p87O46J8p82O96j56k21
$$ y = [716, -110, 602, 598, 19, 515, 366, 196, 459, -283, 271, 259, -815, 65, -315, -577, -119, -610, -299, -196, -839, -138, -93, -637, 337, -116, 99, 262, -109, 796, 299, 17, 560, 226, 238, 621, 86, 336, 516, -76, 388, 119, -157, 278, -364, 36, -134, -584, -97, -412, -734, -289, -702, -92, 11, -710, -55, -351, -94, 650, -266, 315, 611, -245, 438, 529, 101, 917, 59, 427, 784, -290, 185, 362, -297, 370, -342, -62, 157, -882, -94, 123, -545, -348, -502, -195, -111, -393, -21, -5, -441, 276, -88, 151, 490, -223, 332, 498, -25, 515, 225, 18, 660, 10, 16, 323, -449, 252, -104, -296, 175, -657, -141, -93, -723, -121, -457, -540, 0, -526, -90, 151, -490, 207, 292, -17, 661, 11, 39, 611, -7, 79, 423, 104, 688, -12, 63, 468, -298, -42, 284, -159, -124, -381, -345, 274, -727, -291, -70, -661, -165, -284, -308, 229, -466, -106, 246, -187, 279, 360, 224, 661, -126, 520, 538, -244, 452, 296, 75]
2507G5N28q57K58K00n90K02J23k15M02o53K15K48n24L47K01m82N51r2k96Q58q54
2528c55O28r3r5M41k46k13M75l70K63j1n47O80n62j78O54q29R5L64o03L97m86
2549e91J46N95o06L90K50j006L73N05m13M52k27L86N11q55M96J4j57K05k04k19
2569D5Q63r54K57l7k27L58o66O3P10j235N10L52p46O70k24m1K79n65L90K17l54
2590c35M75m03j15J024q21M39N06r73O68j82l40O39l31k56N20o70L23j56l04O54
2610C62m73l84O16n49L15j33l66O58n02K27L30o49N04L45m00M49k58j16M93k08
2630B61qK38o21N02j56l87N76m02J18K85j016P22l00J7j6n66O13m5n15O22j07
2651a85j36K11J30r8N86o34M16j38j61K82q0J54J87k57K21k00k53M27l19m54M82
$$ y = [75, 603, -254, 4, 204, -386, -184, -61, -276, 126, -527, -312, -64, -588, -241, -40, -522, 29, -63, -359, 499, -355, 273, 180, 85, 526, 280, 67, 542, 172, 435, 424, -123, 557, -5, -183, 471, -358, -263, 101, -502, -105, -591, -445, 150, -456, -66, 184, -822, -449, 56, -357, 95, -132, 254, 765, -90, 406, 420, 263, 468, 264, 45, 908, -46, 211, 174, -53, 305, -361, -298, 412, -823, -313, 39, -707, -37, -261, -302, -23, -588, -198, 19, -335, 140, -263, -378, 646, -175, 264, 770, -203, 465, 283, -57, 582, 251, -5, 515, -155, 168, 12, -292, 362, -111, -495, 121, -428, -113, -246, -612, 46, -456, -229, 101, -548, -44, 301, -99, 350, 92, -24, 469, 261, 253, 491, -130, 372, 216, -171, 405, 3, 121, 406, -610, 112, -188, -171, -187, -753, -140, -185, -700, -78, -185, -321, -110, 20, -78, 508, -126, 290, 152, -9, 273, 193, 347, 534, 277, 498, 298, 45, 472, 153, -301, 181]
2672A81k92J8J10m21M41k78l25N44l19J4J23N5K40l65L3N61n14K41L77l90L67
2693D01r0l40M89m53M09K72p78K13J35j15L04p42K16L04p72N68k59j45K97k65
2713c51N3J26k58O00k75l16Q21k32PJ87n86N97N7n30N53j18m32O39n53R0q8k37
2735b46M28k26k74L44%m36K17l89M07J07l67P43q10J94N27m33J90k21o1O25j75
2756A44J4L99o12M28L2j15L04m76L2K54o62M38Q0m56L15j48r9K83p41Q6L14k49
2778d35K20P4j52K38j74N32l29l00P32l49l14P90l49r8N38k73J31k46k05K24J14
2799C69l93O5k09n2O4k5K54l56m63O17j55K3Ln8L82l13qN08j87R4K61m93M83j37
2823B74k24N71n65O4L36n80M12q3l3J8l69J56j13k83L09L3o58R09m15J27Q0n73
$$ y = [181, -111, -93, 17, -404, 37, -241, -566, -22, -341, -327, -204, -149, 91, -274, -241, 320, -194, 47, 424, 34, 401, 311, -29, 460, 7, 416, 688, -90, 123, 258, 143, 447, -295, -79, 225, -547, 21, -238, -383, -86, -351, -298, -172, -430, 170, -105, -421, 400, 168, 175, 362, -224, 373, 430, -100, 453, 335, -97, 542, -11, 79, -9, -246, 182, -44, -318, 26, 26, -410, -193, -582, -175, -68, -435, 308, -502, -308, 219, -214, -24, -245, -306, 319, 144, 158, 557, -55, 373, 405, 290, 594, 118, 150, 404, -258, 180, 260, -196, 119, -29, -128, 155, -586, -500, -186, -435, -215, -141, -293, -55, -229, 303, -26, -326, 406, 57, -257, 533, 184, 86, 624, 351, 482, 236, 31, 255, 369, -24, 41, -168, -220, -156, -181, 73, -283, -746, -129, -284, -261, -258, -316, 66, -247, -255, 253, 66, 160, 421, -72, 411, 274, 50, 621, 56, 120, 456, -124, 288, 205, 172, 190, -179, -23, -136, -419, -110, -77, -735, 174, -241, -114, -34, -607]
2845f07O12k01k16M04L9R2P2l49M99Jo45R90m11l19L22k17N6j44lK90k16l14L78
2868A13m11J28q9j69M68j65j99K69j16p0L74k88K25p9k46M20O0k33K63l85M45
2889C15J56n16L01p7L06n0n10J77M9n94N67k31J43j40n42O54j12m13O75j28k23
2910a93K46j36N6K49m25K66K5QR7j23R2L43n12N29j94j10K87m88J77J45q74O03
2932F8o8m07K77k80m5L15m32N10l0k34o0M00j10J9m2J11N22m31K54k12k57N45
2954D13j65n4K84k80L7r7M2K27l16j0J80o35J66L9j02J27m41L35M33m57L18n2
2976hl41L70j31L45j15k23K65L47n56N73k45j73M00j38k59P6l59M56r5l90L04
2997A03l53J89m2l09N50l79J16K03o31K93J67k88M53p5j39M37j97j81J22J57n5
$$ y = [-607, 5, -196, -412, -8, 31, 123, 195, -154, 345, 346, -299, 691, 280, -39, 283, 66, 122, -22, -25, 265, 49, -265, 113, -298, -170, -259, -428, 40, -125, -324, -55, -171, -241, 133, -155, 70, -9, -255, 165, 225, -8, 255, -130, 315, 471, -45, 256, 179, 485, 435, -75, 102, 151, -443, 124, -107, 36, -104, -646, 8, -104, -517, 158, 30, -193, 53, -83, -27, 222, -203, 63, 88, 96, 193, 70, 162, 505, -7, 522, 328, 218, 505, 17, 194, 339, -535, 68, 0, -407, -130, -410, -455, -140, -572, -62, -92, -326, -386, 14, -96, -77, -119, -8, 514, 83, 337, 125, -132, 413, 248, 194, 478, 198, 235, 138, 180, 407, 91, 81, 261, -374, -208, -169, -271, -144, -585, -250, 183, -274, 44, -8, -349, 21, -110, 235, 120, -103, 162, 509, -47, 526, 281, 108, 508, 370, 111, 187, -172, 284, 189, -201, 103, -250, -61, -103, -412, 138, -241, -125, 78, -553, -260, -93, -381, 72, -3, -142, 295, 98, -83, 39, 196, 141]
3018A41j26mK30l92K49L45o26qJ97k23L81l24m9M90q23M03J74m03M68l34J69J68
3040A03k33j40K32J07K82Qk74M04n08K46K94l65L4r2jM32l66k6j8l22M81l86j89
3063b97M7r1K57K00m56M29l45O9K71o6j02J07K3j34L38l83L93l9k59L73k61Rj6
3086F7j43O99o11j60L02l01L2j48j96N88k62k37L13j63R9K4l00L70l55N6O47l19
3108Bn4K58j05J25k25j00N94l44J36M7k54R2j34J1L33m93K46M8p22O16o1m43M96
3131F9j92k06J37o5L3nj27O16n68Q2K86m14N08K00l95K85j80l2L44l63J24P1n00
3154b92L36K82n81L72m7j31J73m30M56j02o93O10p3r4K19Or7K51k91K71k20R0
3176A5M94l37L84n3m51K19k92L42J10p12O06p2k70J16j66j49J00l38L70j1l19
$$ y = [141, 15, 11, 241, -151, 98, 443, -183, -191, 6, -217, 164, -160, -209, 281, -542, -139, 35, -368, 100, -234, -65, 103, -130, -270, -38, 69, 351, 359, 85, 489, -19, 227, 521, 156, 190, 98, 97, 529, 163, 137, 119, -203, 278, -108, -297, -250, -341, -84, 116, -340, 89, -256, -187, 84, 18, -84, 23, 46, -88, 250, -133, 260, 221, -38, 335, 74, 83, 67, -76, 623, 12, -148, 154, -147, -115, -263, -459, 129, -133, -370, -57, -220, -121, -97, -397, -27, -382, -326, 321, 2, -52, 206, 101, 226, 1, -99, 495, 151, 287, 334, 80, 172, 38, 49, 382, -111, 135, 183, -539, 77, 16, -427, 69, -123, -329, -192, -257, -224, -229, -356, 260, -308, -226, 60, -354, 154, 354, -41, 244, 64, 32, 376, 13, 137, 208, -292, 44, 326, -255, 117, 70, -61, 112, -318, 138, 36, -657, -47, -120, -214, 5, 11, -86, 165, -126, 145, -75, 15, 509, 172, 556, 503, 52, 271, -21, 321, 431, -281, 325, 253, -17, 99, -67, -216, -116, -454, -84, -95, -414]
3197d14K49o5o4P9m73N31K81m72L73Rq2K35m9j1J59m07L80P2l30M56n49J71J82
3220B61l29J2J2k17L64l49J72J33l52K91J22m48K78j30k87M05k60L66K04k99L97
3241C46l27J24K53l01K46j96o3K89l53p9K30j45j10L7l23L23K21m76N42p11K42
3262b31M09n39M58n4l98K74j73K11L39k65L2K3j90M19q1k10K48j76j4K2RJ67l25
3285d5k31L40j16K2J55k96K23k04k20N62l04JM3k66J62K40j47Q7o3Q1P7j13K27
3308B15k43J8R2q4K34j2j51l9J32l33M59n18L99K66p11L64j28l50L54j75j37M53
3330A05m09L42J86n11K50o2J6J52k40L38p6r7K18m8j26K28l31N4J66r0K46m63
3352a52j12N70o21L3K06j19O0Q0j12L50m06J54L9p4K41j64k84O03n8q2J46k38
$$ y = [-414, -165, -230, -294, -215, -688, -157, 124, -348, 25, 34, -48, 187, 138, 127, 286, -121, 259, 331, 1, 457, -92, 79, 261, -68, -56, -44, -261, 103, -246, -74, 59, -293, -2, 120, -328, -50, -180, -467, -62, -322, 44, 248, -51, 346, 19, 143, 396, 95, 341, 145, 82, 371, 18, -61, 169, 24, -86, -49, -372, -49, 172, -304, 238, -473, -231, 178, -361, 97, 43, -355, -81, -254, -43, 296, 31, 63, 86, -104, 315, 234, 24, 272, 96, 82, 104, 113, 280, -45, -276, 64, -52, -30, 125, -171, 52, -152, -372, 190, -114, -113, -70, -336, -174, 66, -81, 6, -57, 24, 101, -12, 215, -28, -10, 82, -2, 232, 220, 69, 30, 162, -171, 288, -230, 169, 435, -276, 88, -40, -390, -36, -211, -348, 105, -304, 38, 224, -287, -37, -99, -83, 69, -171, 167, 91, -6, 212, 164, 38, 266, -65, -11, 155, 65, 311, -152, -264, 306, -315, -282, -76, -195, -135, -55, -167, 183, -223, -69, -30, -104, 137, -27, -311, 292, 234, 152, 298, 60]
3374F0J35q8l31N20n6k51L94o70K53k02J2K08j58j87K29j57K35J41q3J0k9l79
3396c94L67J07l5l2o1J29J19j32K38k67L63J54n74L84jm72K52j78j0m0k29N86
3418B74k74n06N55m30L07n6j3J59J1l87N33k63m3J96j07J20K67m37L23n2k4L11
3440D64n59L38k9m78L87O9l71L43n07J71J88j55j14K41l3m7K7l5K25j45K3kj77
3463a76L49j69j58K31M8j1k12L5K47j11J94J06m74K80j96J9J43m06O6K16j25J59
3485E5ok88J39R4r5L80m49Q9J45r4K58k65j38M53j00l00L33l10L51J1k89L10k04
3508H0m00N34j25j74R9Pl2j88j7J78l09M01j36j64L9J18k36J38J31L56ll44K01
3531A54k04K40M9j63O4L5o5O4j33N0J49j83r3P1j52k7J00j40N00m34l17N60m76
$$ y = [60, 195, 107, -224, 296, 240, -11, 383, -287, -34, -236, -224, -16, -174, -361, -132, -289, -54, 87, 4, 14, -15, -394, -27, 80, 45, 13, -48, 81, 200, 68, 306, 39, 402, 556, -18, 366, 365, -107, 145, -33, -43, -83, -312, 274, 0, -506, 49, -381, -74, -130, -143, 16, 27, -360, 173, -90, -133, 63, -44, 76, 343, -94, 229, 177, 153, 464, -95, 243, 214, -264, 123, 192, -179, 164, -343, -172, 16, -139, -253, -12, -45, -92, -65, -100, 125, -20, 3, 1, -176, 173, 4, -154, 77, 125, 114, -98, -63, 184, 73, 267, 373, -101, 179, -17, 2, 145, -261, -195, 21, -104, 55, 49, -239, -100, -6, -101, 279, -170, -81, 64, -30, 228, -37, -175, 278, 178, -122, 211, -99, 252, 263, -26, 284, 80, -320, 214, 89, -85, 14, 21, -11, -199, -216, -38, -347, 54, -82, -246, -207, -89, -325, -187, -56, 300, 297, -47, 154, -50, 190, 239, 76, 140, 175, 110, 174, 41, 91, 240, 57, -36, 35, -117, -144, -44, -184, 316, -118, -435, 125, -351]
3554c51L7J27R7K12k88M3K35j86J88r1Q7J08l32K4M42l78J5M58l98J46k8j23j76
3577a32o9J48kJ2k45J07k6K67j14k89K82N6j11J32k04L90k85PK97j50L33k24k71
3600i1K63j75J92L09n12J48J39l03J25Q0n12M74k40l82O99l20K6k12j04L64k8
3621f0j94R9Q3j15k3N0O2K71m7K06n11M32R0n52N92k99%K66m30N3J73j73J7J46
3645A36P1j28l68J87q9k03N23m0l10Q5L6J87O7k20K81j99j07L46l85J71k43L25
3667A23l6n0k19M18k13k75K04J93j8k55MKJ6j16K66l01K99j89j01M58j85j95j78
3690c48L36J27K3O4J23l25N3Om4K94q5p2k2j00R5Nj23j55L4%K76n1k89L84k36
3715c0kr3j91J27R1q1K3K63j66K64l75K99K10k47J10L5o9n3k01L6K00J25m34L5
$$ y = [-351, -314, -187, -90, 122, -166, -123, 112, -74, 114, 23, 110, 218, -114, -90, 352, -26, -11, 447, 49, 195, 167, 44, -132, -201, -53, -55, -43, -288, -181, -207, 60, -54, -343, -61, -5, -116, 16, -188, 202, -83, -76, 221, 71, 404, 180, -91, 172, -3, 189, 498, -14, 134, 273, -30, 95, 175, -337, 137, -103, -485, 214, -106, -80, -292, -396, -32, -60, -254, -155, -72, -187, -210, -160, -98, 173, 126, 332, -179, 253, 343, -209, 383, 84, 84, 350, -80, -27, 146, -27, -10, 136, 207, 79, -289, -102, -191, -394, 129, 89, -221, -136, -100, 87, 154, -66, 215, 16, -91, 255, -130, 41, -202, 123, 87, 37, -182, 236, 23, -252, -48, 145, 127, -128, -124, -122, -106, -222, 44, -257, 42, -147, -248, 210, 25, -170, -348, -12, 115, 138, 202, 325, 0, 53, 59, 15, 309, 224, 152, 130, 30, 125, 130, 7, -148, -114, -114, 162, 111, -178, 206, -30, -32, -125, -316, -189, -98, -179, -156, 107, -59, 205, -170, 129, 339, 92, 202, 237, 168, 115, -86, -50, 150, 275, -159, -124]
3739a24J92k49K9J91l1j77L17j10k77R7j45J39O8J67J22p7q6K87l56J4mM8K5j0
3763E0j7J43j20J30J38m71M00j82q2j98J12j53J7K97N8j00l37L68j83J30j58r0
3785b48J94J89l13L35p4j44K25q9L37k22k02K28q2j23q8M26k09J1j70p6N4q7K19
3808I1o7m8m1MJ81k21J01o1l2j26N39o30K49O0J08K6l8J02j17J54j48L40n19K48
3832A55jk54O5J47j66n8j82J97j82K98K6l38J77j96QJ12K05m53N19k29J67P4q3
3855HJ82k9m8R9l22J73K11l73K60o4p9J64k56l3K78j76R5J69m57J56k73K39K84
3878B08m63L09j86RL04k59J63k6M6J85r3l35L74q7J52J10n58L04n5ORj55K5k6
3902c9J73m9k4j10J0O8k19K29k72K10l17N07N1n1m84L21O5Ko5J59j62K06o5M8
$$ y = [-124, 68, -181, -152, 39, 8, -169, 148, 38, -239, -142, -287, -148, -80, 87, 209, 132, 46, 333, -23, -9, -13, 35, 60, 50, 33, 176, 56, 186, 324, -147, 253, 71, -11, -209, -97, -250, -233, 64, 122, 22, -315, 53, -130, 0, -158, -248, -54, 135, -178, 157, 83, -61, 164, 75, 412, 190, -12, 216, 134, 11, -77, 349, 140, 151, -19, -95, -41, -128, 91, 24, -24, -65, -61, 120, -101, 0, -61, -93, -219, 320, -310, -61, -1, 107, 133, 95, 197, 80, 234, 86, 426, -93, 155, 154, -100, -35, 112, -54, -112, -294, -97, -279, 19, 45, -293, -116, -312, -304, -192, 13, -440, 79, -150, 17, 91, 8, 190, 161, 113, 212, -110, 63, 274, -99, 161, 97, 18, 182, -74, -107, 171, -5, 90, 259, -198, -42, -315, -76, 208, -255, 54, -132, -123, 181, -78, 85, 59, 105, 290, 197, -138, 236, 149, 301, 411, -147, 157, 102, 108, 117, -38, -13, -39, 134, 85, 61, -49, -39, 29, -190, 39, -233, -23, -340, 167, 218, 167, -317, 4, 69, 71, 6, 165, 3, 209, 144, 192]
3926A92j16j56K63k62L31j06l63J31K35k97J14k09O8P2k17K63M9k13J68j92M1
3947b04K6p8q0N54k68J94k18L40J38l64p3L41j04k30j7O9L3j0k4J42m14K29k57
3970b75K5J79M5J32k20R2J2j25r9L56k77K04j78q4K19K69k39r1R4Q7J93j66l47
3993a94L79j23P9k12k6MJ84p7p5J14Q6m78N46k12o6L36j78P3k81Q5r1l0J03j56
4017b10L83j30j2n3j41K99m12J08K94k35L02j08m6M5j84J10K06k86KQ8P6j61j72
4040b37J94q9M3n4J47j23N06m55L1J70m5R7j22q0k0J32m6P0p6J65p0k62K56k72
4064a40M3J87k32R5r6j1K52j78N2L2m30J47M81l41J44J43j92J60j64j50N03k41
4086F4J21k11J85Q5l65K59M8l11J14R1J1qk76K58q3j09K59j66j3K59m16J48Q1
$$ y = [192, 76, -80, 183, -79, 252, 146, -217, -86, 149, -148, -34, -243, -175, -103, -320, -57, -8, -221, -53, -245, -204, -178, -256, -336, 218, -50, 144, -74, 266, 404, 40, -33, 308, 204, -26, -43, 26, 59, 49, 25, 167, -247, -18, -275, -250, -71, -26, 106, -114, -22, -10, -135, -234, 122, -155, 49, -129, -213, 6, 275, 36, -55, 39, 126, 319, 153, -194, 185, 62, 141, -71, -97, -93, 91, 14, -61, 53, 139, -339, 207, -5, -71, 265, 87, 160, -121, -36, -127, -157, -54, -210, 173, 43, 31, -22, -163, 136, -276, -168, 126, -109, 193, 85, 39, 84, -100, 10, 216, -70, -68, 20, 96, -65, -237, -43, -132, -89, -143, 4, -119, 387, -68, -37, 133, 88, 185, 63, -17, -37, 95, 49, 119, 43, 208, 138, -124, 132, -140, -97, 90, -142, -47, -143, -154, 98, -80, -28, 4, -426, -279, 202, -139, 5, 148, -44, 116, -48, -198, 305, 64, 185, -26, 159, 244, -121, 138, 186, -125, -11, 80, 91, 83, -193, 65, -18, -127, 132, -34, -47, 212, -204, -56, 25]
4109B5q0j14K13m6j21K85m06L06o6K87j22j51J62r0J9kj01K3O0k21K04k61J25
4132g2K69j35lk6m8K81l10J5k9j32R6L30l48L75l70J35L69l01l01M42l56K26J14
4155B21o2kl95n8J66m3J56Q8l99N13l39q5K63J47p4o9N8j57j39L00l2j00J73j55
4179b4J40K97m32J37J5n3L7n3k25J15P1KJ22k80R2J76l50L13k6m4J52l67m1M94
4203B68l47J45j43J39l30K43m9l8J13n6r5KL45q7k89K00K63j07n0l48M65m9k64
4226f9J66j28R1M8m14L06MP1o6l23M52j97o6L12j70L6L0k14N9j6l0K70k71R0L11
4251B82L8m66K82P1m10L24j45K52m07R9r8o2J81J56j34n5J16n9l5J66k48K08j01
4274d5K38k45J23n6J50j53j79LJ25J02k56M26m02L37J20m22J66J67j97P8k15L9
$$ y = [25, -55, -169, 44, -2, -123, 162, -244, 62, -4, 283, 161, 10, 172, 82, 101, 99, -2, 21, 81, -140, 64, -197, -72, 197, 62, 59, 33, -15, 266, -44, -29, -58, -190, -94, 236, -112, 263, -107, 28, 397, 96, -205, 237, -119, 107, 221, 159, 157, -238, -296, -130, -173, -17, 71, -328, 185, -154, -239, 24, 171, 97, 28, 86, -71, -210, 90, 58, -42, 131, -24, 116, 413, -19, 118, 133, 80, 117, 64, -161, -46, 25, 27, 149, -131, -39, 137, -213, 100, 74, 30, 182, -185, -226, 268, -79, 66, -77, 62, -268, -25, -74, -112, 1, -55, -150, -148, 197, 110, -179, 21, 284, 177, 127, -221, 244, 195, -69, 97, -31, 60, 108, -306, 0, 4, 75, 9, -314, 138, -59, -125, 187, 17, 53, 83, -131, -72, -88, -118, 152, -119, -29, 282, 320, -146, 136, 207, -203, 121, -24, 228, -179, -80, -178, -240, -59, 97, -37, -92, 24, -35, -70, 96, -152, 56, -45, 193, -52, 71, 15, 165, 12, -167, -164, -39, 63, -193, 233, -169, 168, 288, -134, 32, 199, 2, 80, -135, -96]
4296i6L83l34j85j2J02O4j00L37qk28nK41m2P8m8j99L30l12J75n8M3J43m48K65
4320H6n7l27L51J03j58N9q3Q7J07k90j38L37l09K57J40l33L82k38K57m35J70M91
4342D59o62L69J66k86n8K16K4M0P8l70Q2k64R2P5q1n3L17j90r8pj25K87j45k16
4366c50N13R1j47oj76R7R0Rk40K34k35L02n0j9j63J07Q2q8j81P5j70L61j81J92
4390A47m04NJ61k1J82R6j20l33K09J51p9k1j30J47q5J48j09L31j41q5JJ13k1k07
4414f5J19Nj47L58m26K55q6m0N7jj56L72n57K42P0j11M20m53J78l3j68J28J87
4437A48j16K29j14O1Nm12J92L51n10L69j32r0l6M8J19q2l59L62K39l32J98j69
4459c1J71k04p1J30l3O7J63k36j14Q8K83j34q2R5k30J60n4M4K93k12j00J8J57
$$ y = [-96, 287, -47, -232, -244, -142, -78, -178, 159, 151, -77, -82, 159, 117, 195, 147, -52, 278, -34, 141, 83, 126, 269, -179, 86, 29, -298, 53, 156, -2, 57, -26, 61, 168, -122, -260, 77, -232, 25, 165, -168, 214, -24, 233, -202, -32, 459, -203, 166, 332, 46, -12, 204, 228, 268, 346, -24, 58, -206, -114, -39, -120, -173, 144, -46, -144, -151, -276, 11, -134, -350, 163, 254, 107, 101, -75, 22, 112, 121, -119, 115, -120, 182, 132, 113, -50, 57, 139, 51, -130, -55, -225, 136, -45, 147, -257, -252, -91, -112, 70, 166, 46, -287, -78, 73, -6, -27, -157, -10, -95, 53, -56, 275, 134, 49, 50, 163, 142, -65, 54, 59, -88, 270, -156, 99, 13, -27, 30, 29, -127, 245, -312, -70, 0, -111, 309, -144, 34, 1, -167, -39, 148, 32, 261, 147, 208, 213, -199, -7, 344, -166, 203, 71, -19, -55, -7, 112, 30, -329, 33, 272, -60, 138, -31, 140, -64, -135, -5, -38, 29, 192, -44, -158, -70, 213, 79, -3, 92, -138, 22, -32, 12, 305, 93, -7, 11, 168]
4482A68Q9j85J53l10L83l72j0L6l4J3L5j01O9N2J16k88n7J09K94m2k63O0K33N
4506A53O3j79l6j87J03K94m24N6K40l18L09k4j05o9J47j25J67k47Q2n5q1M11l33
4529a58M5J48j13J60j96K49j87M07l78K48k08J21j44o8Q6j10p7L80l93J13J70
4550I5r8N3kO0k09n7J5Q6K57k88J78j98J46r0m5J14k80L67k66J46K62k64J30j30
4574a8q2L92j15L5k91j2J81k02K70k04J83j36J22o5o7j32L1K23j88j00k8J97R4
4597H8K93m33k5K09L9q6j53o1n1L36P5k40K68l14K33o1j49N8J63j82M5jQ3j40
4621fo7j65J86k2J58Rk14K9J31J44k45J39oJ60k96R5J19j15K2N4n9R7J96k79p4
4646iK95j16m45K56p6R5L4r7k86L27R8j7q7k28L50j13KJ76k9K66j82l26jJ04j94
$$ y = [168, 257, 72, 225, -85, 298, -74, -84, -48, -82, -69, -34, -135, -66, -14, 102, -186, -243, -134, 160, 118, -145, -85, 148, 153, 216, 37, 1, -186, -83, 211, -213, -157, 83, -235, 74, 50, -55, -124, 23, -102, 65, -182, -100, -155, -236, 175, -158, -113, 35, -78, 82, -114, 135, -52, 355, -23, 225, 17, 138, -6, -74, 12, -98, -175, 205, -188, -75, 95, -3, 50, 48, 108, -101, -158, -143, -57, 200, -88, 90, -108, 38, -52, -97, 17, -263, 104, -162, -16, 246, -18, 112, -18, -100, 292, 177, 212, -79, -91, 90, -112, 158, -46, 137, 1, 123, 58, -9, -141, -110, 113, -75, -175, -203, -6, 88, 381, -52, -77, 132, 171, 85, -68, -129, -180, 156, 231, -9, 259, -55, 178, 117, -32, 26, 189, 7, 52, 51, 134, -6, -73, -238, -52, -74, 84, 93, -121, -92, 39, 183, -62, 77, 71, 231, -65, 30, 149, 34, 56, 110, 51, 148, 344, 65, -9, 286, 170, -275, -19, -95, 0, 34, -63, -349, -22, 76, 59, -28, -256, 94, -19, -17, 159, 130, 396, 214, -112, -113, -9, -203]
4671b03p9K05j41L54j8J6K24l88J38j50R0j88K26k68M0M9J01O5P1k66J44j62J08
4694c2k1J68k41r0M84j87K73k68j05O3o6Kk3K71rl90J18N5q6j14K36O5j40n2K2
4719f7P8l41J05j2L40k09K23m0j70l8J86K13q8j57Q8j16N9J65l51K38j69j12J40
4742c5J86j19j99L1K78o7q3Q2n3j7R2N1k46n8J09P2k82K58j2pn9K50j34q5J48
4767A01j3m5l3N2j68K2n9N8K41k09r1M6j90M26j91J23k35K68k46J82j1j81l1Q6
4791i8n0L6M91l42L5P4Q1r9o1L5Mk60K06K9L7l08O76o72K74j96p1K41j7j77N7
4816g5j02QJ26J9r7O3M3L7R5l40J74J37k79L21j33j51L41j97R3q6j07J85o8O4
4840G1N9l30J17j33K87k46M17k50p0jL2j13lL28l62K78k47K85r3Q8j60Q0o8J99
$$ y = [-203, -282, -77, -218, 136, 118, 134, 358, -30, 108, -42, 48, -140, 86, -182, -142, -93, 8, 73, 144, -122, 22, -140, -32, -53, 115, -126, -216, 268, 81, 354, 86, -19, 44, -22, -20, -43, 228, 219, -171, -53, 2, -84, -198, 38, 103, -37, -89, -67, 11, -330, -225, -237, 103, -106, 117, 77, -93, -131, 55, 268, 180, 23, 111, -5, 54, 219, -132, 106, -63, -175, -35, 151, 32, -167, -136, 142, 75, -8, 74, 21, 4, 96, 147, -99, -157, -48, 24, -258, 0, -12, -19, -78, 172, 38, -47, 101, 88, 43, 10, 62, -106, -84, -143, -85, 156, -53, -144, -98, -288, 138, -53, 70, -165, 103, -143, 39, 28, -153, -184, -98, -148, -112, 379, 37, 72, 146, 227, 128, 67, 102, 106, -154, 52, 81, 118, -190, 486, -186, 88, -108, -179, 62, 45, -132, -75, -177, -169, -43, -24, -121, -58, -15, 22, 117, -223, -49, 88, -191, 130, -3, -154, 187, -10, 83, -3, -110, 75, 7, 71, 130, -200, -83, -216, 71, -175, 242, -8, -78, -79, -47, -160, -163, 165, -197, 81, -166, 119, 26, 114, -46, 34, -34, 165]
4864A65k48pK03j45q6l8l4K22J6o0P1L9k09lj61M57j99p5j1M5R8m0M3N3q1J46
4890A61k46R7q3N0Nj18K42j50N0O9j97K12j55j91L57j87K80j17l20J54j64N07
4912B56k78k39M5j2J66J13k19N7L13jj80J08j08L0L7o5j13j06K01L4R0k9j15J51
4936A36k51K40q4j88J62K6j11K33j92n4J45j8J88k10N8l03M9K2J06j81L01k21
4958a47J43J21o5N0k24K79j16j65O4J09jp0J61r5R8j66n8j42J63J1j53K22P6j48
4982e3j46K90j05J08M7k39j54K04KJ59J11j45k42Lm9J36P7n7k2M1J02L2l59L32
5006G3j62m4L56o5l64J63N1j64k0J62J24j51J64j77K48k21q7K42k28O8r8m9K36
5029E7J58k56n5K25k63J63J05n4r9k15K91r5K08j40j33L66m67K31j92K1J03K0
$$ y = [165, -83, -90, 113, -32, -118, -156, -190, 32, 48, -12, 59, 98, -111, -114, -275, 182, -17, -92, -103, -58, 40, 0, 43, 96, 15, 161, -85, 12, -71, -21, -16, -134, 108, -42, 8, 77, -120, 92, -63, -254, 103, -84, 196, 79, -241, -87, -251, 256, -22, -261, -216, -228, -62, 51, -168, -111, 202, 201, 21, 129, 21, 51, 88, 23, -90, -196, 5, 39, 129, 100, -15, 136, -115, 125, 41, -147, 15, 41, -70, 163, -29, -83, 62, 44, 232, 22, 80, -223, -174, -152, -46, -227, 74, -147, -4, 117, 52, 102, -122, 157, 41, -124, -60, 49, 48, -22, 139, 44, 142, -24, -82, -224, -61, -50, -203, 19, 95, -53, -199, 91, -14, 94, 141, -98, -252, -48, -46, 113, 224, 79, -163, -160, -209, -73, 4, -53, -75, -34, 68, 100, -259, 73, -89, -133, 223, 158, -206, -43, 8, -156, -176, -14, 110, -41, 123, -54, 194, -27, -114, 128, -100, -32, -130, -179, 57, 215, -41, -96, 129, -134, 29, 134, 80, -19, -234, 57, -38, 170, 30, -103, 263, -204, 27, -165, -144, -41, -21]
5051b1j77J26K15r7K56j77q6k61J59L20l58n4N09n94L57k13L18j97rm2N4M1j74
5074a05K53K1l74K67j14j10J54L9k9j17J98q6j96k1M06L6j41p7k05J22J72k5K3
5097I1p9K6l8J28j37mK05l32L39rj71q1k2j55J58N6j36L35l38K42R3J7o4j05q4
5122f5J89j33J93k9j31N7J0j97J95o3O9K3k64R1lrJ3J87k20j9j81J45J62J58l91
5147b13J51J35j10P3m7o2K66n1k15q3K26Lj78K05M9m7j44J31j61j4J83j46M3m0
5171d6J8J26l22J16K18j13k60J91l7J69j13J16J17j38j50p9L07k20J31j15K09
5192A25O4l68J52p3K83J34n32Q8M09j11k38J8q4K81o6j81M21m24L6k9R3k7L98
5215C69j38l22q5L13R6j19J20j24M4j03l50M12M2j55j21J59J2k76QK96J19k17
$$ y = [-21, -198, -72, 143, 46, 302, 125, 39, -222, -63, 257, -101, -155, 354, -240, 117, -96, 222, 25, 16, -26, 28, 69, -105, 148, 169, -205, 62, -52, -162, -8, 31, 2, -115, 83, -3, -199, -220, 186, 222, 81, 4, -201, -79, 93, 68, 91, 12, 38, 0, 128, -9, -13, 192, -140, 199, 190, 19, -62, -84, -239, -81, -25, -161, 174, -164, 78, 171, 188, 124, 19, -65, 124, -9, 184, 155, 24, 81, 91, -106, 89, 26, 95, 118, -146, -55, -58, -67, -54, 133, -87, -106, -287, -142, 20, 178, -213, -62, 73, -37, 36, -11, -73, 193, 142, -73, -156, 70, 73, -105, 100, 149, 102, -42, 89, -72, -86, 97, -49, -6, -46, -28, 98, -224, -108, 110, -3, -263, -72, -109, 60, -53, 63, 180, 42, -108, -187, 120, -100, 31, -84, 125, 189, -179, -27, -100, 183, 317, -215, -127, 282, 171, -67, -49, -133, 148, 82, -99, 322, -102, -66, -95, -2, -29, 369, 231, -91, -176, 137, 233, 114, 234, 110, 154, 51, -299, 113, 155, 0, -121, 38, 50, -226, -218, 78, 197, -20]
5237b0J63k02J6L2m6Q5Jl92K10N2L19k14m8n8N0J65l46J96J50o3J67j71K0k01
5261a35K72k03J60j88l0K81m00J70j08J95r4O9J14k3l7J5j56j16J42O9j43K74
5283A28Om28J47M5Q7O6J87k0l09L32l49K49j86o9L34k73j94L06Ll91M81l48K80
5306H4j53J61j49l9K27J80j13k38M2l7J24L37k85k46O3m6K75p0O5k58M2J29j32
5329c7n2p0L43k97L37j47j18q6J01qK00K3l41k58L32K02J54m21qK59K15m87J2
5352a52R8K8l34L39J40k42K04o3%j47N0J1L1R4J99l18K3j14J25M8j32P3M3q6J66
5377H4k20J96J22k21J05Q9j78P7R7k82J85j48n0L41j66j16o1J93P9k23J94j54
5399e7k24K11K14p8K0j03k71L55k8k19M4J18n6j07K8K4K56K3k0J84l65k5J45l7
$$ y = [-20, 143, -59, -43, -11, -57, 28, 29, -363, -153, -101, 218, 4, -44, -102, -52, 113, -233, -37, 113, 50, 217, 46, 66, -135, 137, -66, 94, -94, -124, 157, -243, -73, -181, 14, -80, -11, 103, 80, 43, 58, -98, -214, -72, -3, -146, 128, 134, -294, -147, -102, -15, 51, 238, 218, -91, 241, -108, 141, -45, -114, 220, -53, -247, 59, 62, -329, 152, -196, 84, -69, 92, -57, -96, 131, 311, 198, -40, 2, -35, 89, 426, 141, -105, -42, -88, 187, 117, 182, -76, -34, 95, -37, -89, -159, 184, -113, 224, 77, -41, -127, -26, -34, 166, 189, -152, -410, -78, 124, 278, -143, -151, 108, 323, -164, -152, -54, -26, -360, -21, 119, -123, 81, 18, 18, -129, -79, -68, -37, 57, 256, -62, -39, -153, -28, 20, -112, -39, 4, -82, 84, -136, 60, 182, -39, 66, 155, -23, 54, 151, -131, 54, -94, -144, 197, 31, -85, -146, 47, 126, -97, 97, -57, -281, -70, 144, 66, 86, -17, -288, 67, 39, -180, -136, -18, -74, -181, -153, -129, 127, 150, 130, 314, -51, -76, 69, 32]
5423C2Lp2J20m3J0j13J13J43l96p7K60j61j4L6j24K94PM0n5j3j66PM96j70k79
5448a22%J92o4J13J47l02K34k40R6j26J6o2M4J36J09j41RM4j17q2L55k53K3m5
5472c6K00k29J6r0K11K02k60r2L03l51R2Q8j1l7k2J99J0r2p0J4l63K85j4j2O0
5497AM1r5J76j66Q8m7j10o4J87j19N8N4%J8Q6k4L04l12j4J76l14J96p5L0j99K79
5523A55k11J0J34k39K2j81L22j77L9k45N02j39J55k06J69K01l55k2p2j49K90K21
5545B24l10O1J93k44M3J2J50j85L04k23L0k61K05%j4j49J02J49j64J54j6J43l14
5568a10K20l55L62J15j32o8oj80K93j24O2l48J64j4L1J2Q7m4Nl4J39r7R9j2P1
5593A36j22l41K75P6jk1P4r5rq2J05k57K56j73L13O5k85N0J23p5r7J71P8j65j30
$$ y = [32, 35, -37, 83, 40, 50, -63, 50, 193, -203, -280, -20, -181, -195, -159, -283, 11, 18, 58, 3, -10, -176, -169, 327, 157, -122, -122, 70, 6, 119, 266, -36, 198, -42, 54, -72, -56, -118, -74, 62, 171, 30, 39, 83, -34, -116, 239, -14, 9, -36, 164, -65, -49, -139, 72, 274, 14, -78, 225, -126, -34, 54, 43, 6, -16, 183, 193, 101, 31, 45, -318, -33, -47, -59, 1, 42, -53, 123, -43, 45, -2, -112, -176, 11, -108, -50, 4, 4, 22, 108, 84, 388, 76, 62, 238, -76, 120, 45, 75, -124, 155, -56, -46, 88, -151, -129, -310, 12, -165, -126, -371, 131, -8, 147, -59, 110, 311, -44, -66, -138, -287, 3, 224, -86, -25, 168, -76, -33, -21, 129, -56, 248, 25, 55, -206, -1, -1, -15, -164, -62, 87, -77, 77, 61, 204, -110, 110, -245, 117, 232, 100, 32, 26, -154, 139, 15, 77, -271, -107, -121, -90, -78, 9, -35, -30, -64, 75, -22, 77, 65, 136, 14, -327, -52, 24, 23, 2, 76, -19, -28, -110, -5, -262, -6, -179, 134, 199, -86, -36, 87, 12, -85, 86, 164, -1, -131]
5618a31N7q4o7J63k5J71q2l67K52J55k08L85l89L52l06l06M96k58M5L62k49J11
5640G7ol6j56K14k20O8K1O1p0M8L21m14k9J70O2j49J47j86N2N8m3M0j1j34J67
5665E2j23j21R5K4K48k32K25l9r8j87K28j21K05N6j01m4K4O1j16r5J58O3m4M2
5689A60k89J21J7j29K70K1k38J10j68J67k3j18Q0J38j68mj61J12j16L69r3o1M8
5712D5R1j13j06J31J5L4k5n8j38K5K64k24J75Rl37J13n4K5O3rj3j52L66j22j12
5737a07J30j82J57O2R5j96q5L8o6J66K22j62nL6j05O0J5r7k0J23j49J33j59k5
5761a21J98n9l02L10k29O0K50NN6j01L2q7M0O0Q6k17o6J22j6N9m6M5j68n2K50
5786A09j86j80n7K77k0L8L9J08q0p2j08L6l6m3J24j26K63N7k08J60l59K29q6J32
$$ y = [-131, -74, -158, -225, -62, -87, 84, 2, -365, -113, 42, -166, 219, -170, 182, -124, -430, 66, -192, -147, 215, -34, 77, 71, 35, -121, 93, -127, -59, -38, 23, -47, 1, 322, -92, -121, 49, 111, -38, 109, -77, -25, 33, -10, 30, 19, -115, 52, -71, -192, -97, -73, 175, -57, 168, 129, 31, -156, 72, -49, 156, 212, 111, 67, 91, 152, 36, -59, 99, 162, 118, 160, -129, -8, 9, -120, 150, 171, -67, 43, -125, 42, 19, -99, -19, 119, -49, -53, -214, -102, -218, 151, 58, -3, 45, 136, 23, -83, 48, 63, 97, 72, 14, -124, -99, 165, -59, 116, 125, -212, -99, -153, -128, -65, -74, -87, -239, 127, 5, -107, 23, -159, -2, 60, 155, -41, -126, -88, -154, 12, 234, 72, 67, 103, -2, 58, 73, -24, -44, 79, -70, 63, -96, -121, 77, 18, -284, 26, -203, -143, 107, 112, 168, 67, 99, 12, 52, 112, 198, -19, -85, 37, 21, 80, 34, 79, -89, -141, 109, -77, -257, -314, -37, -57, -19, 20, 128, 48, -24, -132, -96, -132, -175, -51, -177, 86, 143, -65, 95, -264, -35, -121, 11]
$$ [...]
8191A27
##END NTUPLES=NMR FID
##END=
