##TITLE=1H_Pr 1111
 CDCl3
 8 sc, 
 8.04.2022
##JCAMPDX= 6.0         $$ Bruker NMR JCAMP-DX V2.0
##DATA TYPE= NMR FID
##DATA CLASS= NTUPLES
##ORIGIN= UXNMR, Bruker Analytische Messtechnik GmbH
##OWNER= root
$$ XWIN-NMR		Version 3.5
$$ Fri Apr  8 14:04:16 2022 Russian Standard Time (UT+4h)  she@DPX200
##.OBSERVE FREQUENCY= 200.13135
##.OBSERVE NUCLEUS= ^1H
##.DELAY= (6, 6)
##.ACQUISITION MODE= SIMULTANEOUS
##.ACQUISITION SCHEME= undefined
##.AVERAGES= 8
##.DIGITISER RES= 18
##SPECTROMETER/DATA SYSTEM= spect
##.PULSE SEQUENCE= zg30
##.SOLVENT NAME= CDCl3
##.SHIFT REFERENCE= (INTERNAL, CDCl3, 0, 15.7039)
##AUDIT TRAIL= $$ (NUMBER, WHEN, WHO, WHERE, WHAT)
$$ ##TITLE= Audit trail, XWIN-NMR		Version 3.5
$$ ##JCAMPDX= 5.01
$$ ##ORIGIN= Bruker BioSpin GmbH
$$ ##OWNER= she
$$ F:/spectra/data/she/nmr/H-F/1/audita.txt
$$ ##AUDIT TRAIL=  $$ (NUMBER, WHEN, WHO, WHERE, WHAT)
(   1,<2022-04-08 14:03:05.51 +0400>,<she>,<DPX200>,
      <created by zg, POWCHK disabled, PULCHK disabled
       configuration hash MD5:
       00 E9 B6 7A A2 85 ED C7 34 08 36 98 17 FE 4E 26
       data hash MD5: 16K
       CF 2C 73 BA D0 BF CF E2 F1 3C 61 9C 45 99 E8 3A>)
$$ ##END=
$$ 
$$ hash MD5
$$ A9 61 0F 5A AB 32 E0 52 4E C0 DD B7 B0 5B 10 F3
##$RELAX= 
##$RELAX= 
##$RELAX= 
##$RELAX= 
##$RELAX= 
##$RELAX= 
$$ Bruker specific parameters
$$ --------------------------
##$DU= <F:/spectra>
##$EXPNO= 1
##$NAME= <H-F>
##$PROCNO= 1
##$TYPE= <nmr>
##$USER= <she>
##$AMP= (0..31)
100 100 100 100 100 100 100 100 100 100 100 100 100 100 100 100 100 100 
100 100 100 100 100 100 100 100 100 100 100 100 100 100 
##$AQSEQ= 0
##$AQ_mod= 1
##$AUNM= <au_zg>
##$AUTOPOS= <>
##$BF1= 200.13
##$BF2= 200.13
##$BF3= 200.13
##$BF4= 200.13
##$BF5= 200.13
##$BF6= 200.13
##$BF7= 200.13
##$BF8= 200.13
##$BYTORDA= 1
##$CFDGTYP= 0
##$CFRGTYP= 5
##$CHEMSTR= <none>
##$CNST= (0..31)
1 1 145 1 1 1 1 1 1 1 1 1 1 1 1 1 1 1 1 1 1 1 1 1 1 1 1 1 1 1 1 1 
##$CPDPRG= <>
##$CPDPRG1= <>
##$CPDPRG2= <>
##$CPDPRG3= <>
##$CPDPRG4= <mlev>
##$CPDPRG5= <mlev>
##$CPDPRG6= <mlev>
##$CPDPRG7= <mlev>
##$CPDPRG8= <mlev>
##$CPDPRGB= <>
##$CPDPRGT= <>
##$D= (0..31)
0 1.2 0 0 0 0 0 0 0 0.06 0 0.03 0 0 0 0 0.0002 0 0 0 0 0 0 0 0 0 0 0 0 
0 0 0 
##$DATE= 1649412184
##$DBL= (0..7)
120 120 120 120 120 120 120 120 
##$DBP= (0..7)
150 150 150 150 150 150 150 150 
##$DBP07= 0
##$DBPNAM0= <>
##$DBPNAM1= <>
##$DBPNAM2= <>
##$DBPNAM3= <>
##$DBPNAM4= <>
##$DBPNAM5= <>
##$DBPNAM6= <>
##$DBPNAM7= <>
##$DBPOAL= (0..7)
0.5 0.5 0.5 0.5 0.5 0.5 0.5 0.5 
##$DBPOFFS= (0..7)
0 0 0 0 0 0 0 0 
##$DE= 6
##$DECBNUC= <off>
##$DECIM= 32
##$DECNUC= <off>
##$DECSTAT= 4
##$DIGMOD= 1
##$DIGTYP= 9
##$DL= (0..7)
0 120 120 120 120 120 120 120 
##$DP= (0..7)
150 150 150 150 150 150 150 150 
##$DP07= 0
##$DPNAME0= <>
##$DPNAME1= <>
##$DPNAME2= <>
##$DPNAME3= <>
##$DPNAME4= <>
##$DPNAME5= <>
##$DPNAME6= <>
##$DPNAME7= <>
##$DPOAL= (0..7)
0.5 0.5 0.5 0.5 0.5 0.5 0.5 0.5 
##$DPOFFS= (0..7)
0 0 0 0 0 0 0 0 
##$DQDMODE= 0
##$DR= 18
##$DS= 0
##$DSLIST= <SSSSSSSSSSSSSSS>
$$ [...]
##$SUBNAM2= <"">
##$SUBNAM3= <"">
##$SUBNAM4= <"">
##$SUBNAM5= <"">
##$SUBNAM6= <"">
##$SUBNAM7= <"">
##$SUBNAM8= <"">
##$SUBNAM9= <"">
##$SW= 18.05172834244
##$SWIBOX= (0..15)
0 0 2 0 0 0 0 0 0 0 0 0 0 0 0 0 
##$SW_h= 3612.71676300578
##$TD= 16384
##$TD0= 1
##$TE= 0
##$TE2= 300
##$TE3= 300
##$TEG= 300
##$TL= (0..7)
0 120 120 120 120 120 120 120 
##$TP= (0..7)
150 150 150 150 150 150 150 150 
##$TP07= 0
##$TPNAME0= <>
##$TPNAME1= <>
##$TPNAME2= <>
##$TPNAME3= <>
##$TPNAME4= <>
##$TPNAME5= <>
##$TPNAME6= <>
##$TPNAME7= <>
##$TPOAL= (0..7)
0.5 0.5 0.5 0.5 0.5 0.5 0.5 0.5 
##$TPOFFS= (0..7)
0 0 0 0 0 0 0 0 
##$TUNHIN= 0
##$TUNHOUT= 0
##$TUNXOUT= 0
##$USERA1= <user>
##$USERA2= <user>
##$USERA3= <user>
##$USERA4= <user>
##$USERA5= <user>
##$V9= 5
##$VALIST= <valist>
##$VCLIST= <CCCCCCCCCCCCCCC>
##$VD= 0
##$VDLIST= <DDDDDDDDDDDDDDD>
##$VPLIST= <PPPPPPPPPPPPPPP>
##$VTLIST= <TTTTTTTTTTTTTTT>
##$WBST= 1024
##$WBSW= 4
##$XGAIN= (0..3)
0 0 0 0 
##$XL= 0
##$YL= 0
##$YMAX_a= 232046
##$YMIN_a= -374579
##$ZGOPTNS= <>
##$ZL1= 120
##$ZL2= 120
##$ZL3= 120
##$ZL4= 120
##$ABSF1= 10
##$ABSF2= 0
##$ABSG= 5
##$ABSL= 3
##$ALPHA= 0
##$AQORDER= 0
##$ASSFAC= 0
##$ASSFACI= 0
##$ASSFACX= 0
##$ASSWID= 0
##$AUNMP= <proc_1d>
##$AZFE= 0.1
##$AZFW= 0.1
##$BCFW= 1
##$BC_mod= 2
##$BYTORDP= 1
##$COROFFS= 0
##$CY= 11.3945322036743
##$DATMOD= 1
##$DC= 2
##$DFILT= <>
##$DTYPP= 0
##$F1P= 2.36226072786647
##$F2P= -0.459571619588291
##$FCOR= 0.5
##$FTSIZE= 0
##$FT_mod= 4
##$GAMMA= 1
##$GB= 0.15
##$INTBC= 1
##$INTSCL= 1
##$ISEN= 128
##$LB= 0.24
##$LEV0= 0
##$LPBIN= 0
##$MAXI= 10000
##$MC2= 0
##$MEAN= 0
##$ME_mod= 0
##$MI= 1.114404
##$NCOEF= 0
##$NC_proc= 0
##$NLEV= 6
##$NOISF1= 3.799351
##$NOISF2= 2.8
##$NSP= 1
##$NTH_PI= 0
##$NZP= 0
##$OFFSET= 15.70392
##$PC= 1
##$PHC0= -18393.5
##$PHC1= 15.40078
##$PH_mod= 1
##$PKNL= yes
##$PPARMOD= 0
##$PSCAL= 0
##$PSIGN= 0
##$REVERSE= no
##$SF= 200.130013532006
##$SI= 16384
##$SIGF1= 3
##$SIGF2= 2
##$SINO= 400
##$SIOLD= 16384
##$SREGLST= <1H.CDCl3>
##$SSB= 0
##$STSI= 0
##$STSR= 0
##$SW_p= 3612.71676300578
##$SYMM= 0
##$S_DEV= 0
##$TDeff= 0
##$TDoff= 0
##$TI= <>
##$TILT= no
##$TM1= 0
##$TM2= 0
##$TOPLEV= 0
##$USERP1= <user>
##$USERP2= <user>
##$USERP3= <user>
##$USERP4= <user>
##$USERP5= <user>
##$WDW= 1
##$XDIM= 8192
##$YMAX_p= 0
##$YMIN_p= 0
$$ End of Bruker specific parameters
$$ ---------------------------------
##NTUPLES= NMR FID
##VAR_NAME=  TIME,          FID/REAL,        FID/IMAG
##SYMBOL=    X,             R,               I
##VAR_TYPE=  INDEPENDENT,   DEPENDENT,       DEPENDENT
##VAR_FORM=  AFFN,          ASDF,            ASDF
##VAR_DIM=   8192,          8192,            8192
##UNITS=     SECONDS,       ARBITRARY UNITS, ARBITRARY UNITS
##FACTOR=    0.0002768,     1,               1
##FIRST=     0,             0,               0
##LAST=      2.2672688,     0,               0
##MIN=       0,             -374579,         0
##MAX=       2.2672688,     232046,          0
$$ Real data points
##PAGE= N=1
##DATA TABLE= (X++(R..R)), XYDATA
0 0 0 0 0 0 0 0 0 0 0 0 -8 8 -8 8 -16 16 -24 26 -32 40 -48 57 -72 81 -96 112 -129 152 -176 201 -230 262
32 262 -297 337 -382 430 -482 542 -606 674 -751 833 -927 1026 -1134 1253 -1383 1526 -1681
49 -1681 1850 -2040 2248 -2478 2733 -3019 3342 -3707 4128 -4615 5188 -5874 6712 -7764 9128
64 9128 -10977 13636 -17802 25316 -43114 177824 -16523 -310664 107129 146345 -14199
75 -14199 -17610 10177 -90685 11765 79277 -96269 -133612 97370 61908 -70280 -43196
86 -43196 -54244 -19634 139912 44305 -136522 -36799 112700 15985 -42211 49320 -7168 -75992
98 -75992 78500 38292 -138612 16350 143267 -60110 -111975 62871 63236 -46249 16172
109 16172 51995 -61416 -2744 113948 -24058 -81649 64886 58905 -46896 -45489 -1792
120 -1792 21614 4093 -52450 -68431 12958 50183 -64320 -71105 64421 18051 -57592 43735
132 43735 42880 -48409 20680 98091 10698 -49849 40617 64072 -21680 710 27016 -39343
144 -39343 -6523 35143 -44418 -59800 10739 19559 -28495 -48072 -17671 7656 20638 6235
156 6235 -43627 -8590 55922 5212 -16769 28565 7520 -4213 28924 9060 -25111 7894
168 7894 42331 -16029 -47650 28501 25207 -38799 5888 27993 -28452 -19922 26534 22678 -13971
181 -13971 -19865 6316 7758 4018 -964 -24716 -2009 13887 -26510 -17520 8005 -10405 -6514
194 -6514 2331 -11469 -8376 16242 26402 -4089 -6403 31089 12291 -316 34694 13152 -16306
207 -16306 9930 19512 -1289 -17999 -7361 4778 -17336 -22393 -12139 -18795 -4023 -4121 -25628
220 -25628 -10626 2022 2797 8372 -4509 690 19343 13706 7073 4797 17260 21960 -6497 577
234 577 20892 -2422 -6761 4393 -3576 -5344 -8783 -4896 -82 -11111 -3529 -1243 -10827 2218
248 2218 -86 -7317 2595 -2823 839 2489 -10966 2719 7791 -8313 -4604 1058 5701 891
262 891 -9816 9220 10873 -4457 9251 8584 1789 12250 7420 4488 3988 -265 8842 -968 -9357
277 -9357 1501 -7676 -10010 -5916 -15044 -7992 -9757 -14684 -414 -7657 -11941 2976 3136 4047 2025
292 2025 2946 18652 9592 3765 16294 7650 8085 12757 623 3014 2329 -988 1615 -11902 -7748
307 -7748 2091 -12378 -10333 -6120 -8546 -1445 -9337 -6898 4072 -5847 -741 5042 -3012 4281 2942
322 2942 1537 7240 -2040 3587 8179 -3258 4374 4934 -1772 5745 2344 2147 4184 -3082 6128
337 6128 4584 -6160 3682 550 -3350 895 -7693 -3900 -1686 -10870 -3992 -5776 -8879 -2696 -8130
352 -8130 -3255 358 -6007 4694 3759 -2275 11311 8176 3308 10256 8660 10233 5826 3364 10680
367 10680 134 -1195 6836 -7908 -6593 542 -9965 -8037 -6934 -10441 -6308 -7402 -4090 -6211
381 -6211 -9185 5703 1727 -6350 7531 2545 599 13716 4543 -1887 7474 11351 4872 -4826
395 -4826 5101 9302 -5932 3055 5225 -12005 2389 9913 -9223 -7825 1965 -498 -5365 -2343
409 -2343 711 -10589 -5280 8797 -10661 -10729 11336 -4925 -12300 5959 2423 -4776 3729 8751
423 8751 -1870 -2994 16434 6992 -7102 17390 12273 -12368 6928 13180 -3952 1988 5798
436 5798 -11763 -14253 9364 7195 -25122 -12958 8939 -12347 -10899 2824 -13556 -3409 15491
449 15491 -6328 -18054 9248 24290 318 -6375 11725 909 3815 28387 -1436 -21526
461 -21526 16367 19172 -10939 -8408 4753 73 -2376 2309 -14313 -19279 17695 11086 -30682
474 -30682 -9297 13864 -6127 -3116 2869 -12399 -4516 17401 4727 -21663 -1138 24498 -650
487 -650 -7207 8008 -4270 6218 21041 -8535 -12126 19821 15309 -13924 -8325 15821 3668
500 3668 -7831 6201 -10255 -17074 15276 3292 -23568 -4652 2850 -9326 -5227 -558 -6978
513 -6978 -1510 14032 -6025 -24383 17799 31048 -9895 -7366 9442 3463 14634 15666 -8283
526 -8283 -6988 16142 10186 -16618 -4606 15109 -4958 -7176 -2152 -23720 -3253 27011 -7217
539 -7217 -33627 -6985 13472 3928 -5073 -2577 -8822 783 19730 -5511 -14717 20496 13205 -9967
553 -9967 1175 2690 1253 17179 13577 -16564 -19207 19551 22229 -12502 -8380 176 -6642 9610
567 9610 2461 -19893 -654 12278 -10396 -18583 1005 8222 -6276 -2294 -780 -18390 2761
580 2761 24464 -5562 -12196 8874 4825 3004 10472 4123 -1365 8769 11973 -8191 -3868 19738
594 19738 393 -13393 5653 -3531 -10627 7630 -1719 -18245 -5017 7044 -6998 -15688 2771
607 2771 2975 -8264 5724 -1212 -14300 15003 16704 -13557 -3263 18103 7920 -5024 3303
620 3303 7133 -1677 10562 10654 -18320 -5286 19303 -1417 -8104 2052 -9249 -7341 9593 788
634 788 -18611 -4477 15040 -9468 -19423 8905 4015 -6925 8634 -5347 -18018 11036 20914
647 20914 -4487 -11533 8626 8210 -3427 10517 8496 -9362 9270 12532 -14669 -2207 17719
660 17719 425 -11646 -2696 -1627 -7637 2897 5139 -18122 -11039 10198 -8577 -11000 10268
673 10268 -1729 -11689 4288 5404 -5584 3683 16277 -1183 -10897 13827 12174 -5296 7971
686 7971 6892 -6856 5331 7887 -6472 -3592 7070 -252 -13360 -2571 4647 -8764 -2916
699 -2916 1927 -13580 -3701 9139 -6937 -8666 4637 3042 -5162 97 7379 -1666 -1543 11452
713 11452 -48 -4957 11717 4919 -4417 5495 5165 -721 1356 3703 -115 -4855 3120 1649 -9279
728 -9279 -588 607 -8526 -802 -1480 -9271 -1716 720 -4463 -5269 629 3833 -3791 -1408 7257 -831
744 -831 1715 9176 -341 1297 8358 3528 1627 2494 4073 2505 -2461 1957 410 -4703 959 -3124
760 -3124 -6797 -19 -4298 -5724 -1527 -4457 -3801 -2309 -1639 417 -3528 684 3961 -2328 3039 4919
776 4919 -974 4889 4545 1063 3802 2578 4261 2319 -1587 4052 1395 -2163 1884 -2823 -1613
791 -1613 682 -4876 -2207 -1681 -5018 -1421 -4071 -3556 -751 -4186 -359 -295 -3638 2544 607 -762
807 -762 4397 844 2006 4517 1937 5088 2319 1337 6262 1251 454 3106 -1108 1383 -350 -4024
823 -4024 216 -3126 -3978 -1585 -5569 -2778 -2086 -5413 -1132 -3132 -3073 1677 -2494 -259 2957 -253
839 -253 3118 2986 1378 5039 2063 3122 4865 348 3663 2660 -1005 3413 185 -2118 1285 -2983
855 -2983 -1839 -1114 -4484 -1830 -3333 -3685 -666 -5411 -2210 462 -4208 165 382 -3174 2269 2069
871 2069 643 1842 1015 4844 2991 838 5306 1374 1638 5823 -844 -33 3968 -848 -935 -1100 -1350
888 -1350 -784 -3692 -1710 -2828 -6066 -100 -2076 -6819 767 -943 -4653 267 248 208 808 1697 2680
905 2680 -307 4421 7185 -1720 2389 7011 -177 2648 4193 -1433 1101 2413 -933 -4556 -1947
920 -1947 3732 -4024 -7050 653 -4407 -4218 3440 -5041 -7827 1884 2242 -2735 -2319 1857 1638 -213
936 -213 5047 525 -3481 9595 6659 -5447 2524 6448 915 2726 2316 -2696 -2587 4831 3141
951 3141 -8686 -2388 5059 -5940 -3641 1444 -8061 -3138 5177 -4879 -8940 1408 5231 -4227
965 -4227 -3850 5328 -1283 -1242 9728 -1020 -4989 10979 5937 -3935 3539 5108 -769 1211 6097
980 6097 -2760 -6633 7772 1324 -13282 2264 6061 -10206 -4543 1200 -6453 -2196 4921 -3703
994 -3703 -10764 3024 8235 -7054 -1062 9212 -4547 130 10587 -3620 -2434 13905 5680
1007 5680 -9115 -1362 10618 2149 -1020 5502 -7710 -7465 13032 -3 -14020 3119 4085 -9696
1021 -9696 -4409 2677 -4218 -3599 7343 -4605 -16838 7329 13998 -7623 -3077 4348 -3528 4618
1035 4618 11198 -2714 -5019 9827 7783 -8909 462 13043 -2282 -2878 5610 -9048 -4614 13762
1049 13762 -196 -14828 -2879 5327 -4115 -5420 2553 -5327 -5885 8442 -4014 -12814 9654
1062 9654 8957 -8001 -2443 5236 1849 3112 7072 -1537 -6094 10783 9886 -9446 -213 9041 -2431
1077 -2431 156 2709 -7610 -2310 7706 -1295 -12608 -1886 7752 -6184 -7255 3372 -4867
1090 -4867 -2483 7764 -6221 -9272 7530 7876 -3576 -3004 4330 2146 1532 7942 -1325 -4855 11494
1105 11494 4843 -9381 2796 8013 -609 -1461 -1669 -4827 -1345 7021 -556 -13778 -1623 6224
1119 6224 -6614 -3170 2341 -6063 -1426 4180 -4186 -4938 6436 7535 -5679 -4443 7502 2968
1133 2968 2664 7501 -3932 -4010 10103 4370 -4581 1089 3870 -2320 -3389 1990 -2114 -4073 4989
1148 4989 -2819 -12820 1784 5321 -5802 -3387 -392 -4058 -1057 4277 363 -5180 3114 6102
1162 6102 -4821 316 8712 336 1018 4711 -2070 39 7080 3429 -3964 -1651 4422 -1218 -3304
1177 -3304 2903 -3261 -5020 3125 -3132 -7420 1488 1039 -4344 -3377 -74 -547 -1903 2935 599 -4595
1193 -4595 3983 5244 -2895 1929 4967 547 2511 2823 390 787 3395 2964 -2767 -384 3641 -3063
1209 -3063 -2046 1406 -3807 -2545 841 -3663 -4282 -931 -133 -2269 -3154 641 -810 -1890 3349 251
1225 251 -1670 4096 1834 -301 3156 2678 2107 1786 1480 1894 36 2516 2301 -2905 581 1272 -3013
1242 -3013 100 -775 -3412 -1207 -1723 -2300 -2468 -1656 410 -2612 -2373 1535 -1345 -378 2800 -770 437
1259 437 2658 1318 2418 1540 2196 2751 638 2398 1715 -282 2439 234 -1601 1404 -1319 -1627
1275 -1627 -684 -2407 -1347 -2152 -2303 -483 -2914 -1513 446 -2780 -287 609 -1124 1320 656 604 2352
1292 2352 587 2670 2382 233 3061 1875 655 2693 188 745 1265 -1371 545 -770 -2262 -151
1308 -151 -2055 -1970 -772 -3274 -1378 -1385 -2799 -153 -1464 -1677 602 -912 424 937 135 2502 1419
1325 1419 844 2929 1017 1752 2669 455 2100 1324 -208 1938 -705 -855 473 -1781 -732 -1331
1341 -1331 -2517 -394 -2629 -2670 -368 -2922 -1514 -147 -1946 -124 -151 -336 1326 -186 1755 2463
1357 2463 188 2952 2211 511 3088 1603 500 1821 437 676 384 -1014 301 -1693 -1068 -370
1373 -370 -3440 -1109 -199 -3971 -1517 -480 -2365 -1124 -755 -357 -572 -154 2117 100 -247 4009 942
1390 942 321 3574 788 1487 3154 1091 279 746 2084 550 -1784 515 28 -2803 471 -1344
1406 -1344 -4245 75 -483 -3751 -1950 -769 -644 -1603 -432 106 -2082 1581 3335 -2442 445 4265
1422 4265 440 1117 2949 665 1113 3062 1737 -1500 80 3734 -1129 -2630 1986 -1816 -2625 1633
1438 1633 -2893 -4978 536 606 -3567 -3104 269 -435 -2254 1817 -584 -3570 4208 3097 -3651 1574
1454 1574 4885 115 691 2663 928 2 4273 2561 -4656 702 5214 -3150 -2019 2075 -3490
1469 -3490 -2296 2062 -2802 -5296 988 2205 -5782 -4131 3820 -528 -2685 3089 -2693 -3342 6915
1484 6915 3041 -4029 1078 5402 233 -724 4487 1093 -1872 5606 1439 -7464 3157 6713 -4254
1499 -4254 -3838 1116 -2157 -1730 2589 -2080 -7713 783 4451 -6904 -3510 5452 -2032 -3043 3292
1514 3292 -1881 -2295 6723 4237 -5623 -1306 8063 1938 -2201 4937 -246 -3078 6864 1519 -6849
1529 -6849 2335 5391 -4279 -5233 2162 162 -4049 1454 -1443 -8757 1881 5777 -6984 -3878 4211
1544 4211 -953 -2404 2601 34 -2568 4530 5224 -5404 -885 9477 402 -3299 4556 373 -1490
1559 -1490 5027 845 -5998 157 6073 -2547 -6927 2150 343 -4642 2340 -1493 -7661 1847 4056
1574 4056 -5372 -3913 3726 1771 -3322 1004 2084 -2087 4742 5251 -5773 -692 7984 992 -1239
1589 -1239 2767 439 -1345 2395 2348 -4616 -732 5492 -3795 -6691 2841 848 -3235 534 -3024
1604 -3024 -5459 1100 3983 -2790 -4277 3032 1699 -2937 2960 2857 -1901 3812 2640 -3952 1161
1619 1161 6570 1852 -2337 173 1608 -828 2192 1929 -5185 -1405 3565 -2975 -3894 1443 -525
1634 -525 -2980 -1684 -1457 -2186 203 3371 -2984 -4343 3268 1781 -1195 2167 637 -534 3062 2018
1650 2018 -492 714 3838 1740 -2148 1111 2171 -1139 1455 -78 -3937 96 1461 -2187 -2595
1665 -2595 -1145 -325 -1753 -1818 -793 -1830 -33 1640 -2189 -951 2227 380 749 1162 326 1997
1681 1997 1834 1342 579 929 2874 952 -848 1179 -311 -387 1406 -1626 -1852 181 -903 -1804 -1522
1698 -1522 -1057 -472 -1705 -1047 -1150 -1715 996 158 -2135 870 975 305 2276 783 466 1714 1700 1454
1716 1454 427 1606 2218 -818 340 1311 -1061 224 482 -2276 -1136 -348 -960 -1334 -1783 -565 -1507
1733 -1507 -1951 593 -1412 -1335 1198 -764 -584 1459 464 1040 1106 992 1119 763 2078 1582 -413 1932
1751 1932 1258 -1023 1382 255 -943 76 -747 -793 -1036 -1405 -369 -2131 -1784 147 -1966 -1050 238
1768 238 -1648 -354 658 -443 767 361 1109 1285 256 2006 1137 -5 2201 937 338 1792
1784 1792 179 0 499 -525 139 -686 -980 -167 -1879 -1169 -713 -2297 -793 -831 -1988 -231 -753 -612
1802 -612 255 -284 683 683 -49 1921 730 944 2176 701 1273 1529 212 1204 764 29 827 -756 -318
1821 -318 141 -1662 -246 -795 -1949 -435 -1249 -1703 -504 -1208 -662 -467 -1166 396 -581 -126 1518 -120
1839 -120 1144 1695 -38 1655 1893 672 1487 700 894 978 -247 874 -209 -1063 490 -1135 -1528
1856 -1528 216 -1480 -1110 -599 -1493 -1240 -1116 -718 -580 -1511 429 602 -1097 1289 1001 -100 1595
1873 1595 1239 370 1440 1256 1073 297 777 1895 -514 278 1265 -1655 -214 738 -1956 -1416 -41
1890 -41 -1074 -1618 -1371 -426 -1388 -1425 573 -1254 -1595 1861 147 -1412 1755 723 172 1417 1783 679
1908 679 604 2242 1454 -1296 1574 1730 -1255 856 552 -1893 16 538 -1777 -1976 -183 201 -2290
1925 -2290 -1353 379 -2278 -763 1126 -2071 -1227 2093 446 -458 797 1433 889 765 2167 -22
1941 -22 66 3158 610 -1817 1965 1319 -754 652 -405 -1437 -71 488 -1508 -3180 -123 444 -2915
1958 -2915 -905 164 -2005 -3 895 -2289 -236 2037 831 -1179 -78 2508 1007 1159 1945 -862
1974 -862 393 3568 -93 -1272 1339 657 -518 -531 -551 -688 -464 905 -2045 -3476 1069 606 -2787
1991 -2787 -789 -1247 -1186 1107 -387 -1284 -492 1678 1535 -1450 601 2339 489 1714 772 -1060 1985
2008 1985 3112 -330 -754 244 648 428 -452 -546 -1546 98 969 -2969 -2236 1192 -773 -1464 -714 -1709
2026 -1709 268 1188 -183 -1513 -494 2518 904 -981 1504 1009 995 2834 -84 -1206 2786 2018
2042 2018 -883 -885 512 660 -914 193 -1146 -2134 1822 16 -4298 -949 1266 -1110 -602 -473 -1584
2059 -1584 -647 1739 634 -2535 986 3663 -1042 -307 2967 413 1058 2672 -985 -1481 2963 3130
2075 3130 -1763 -1813 1956 -663 -1529 1868 -2237 -3192 1840 -384 -4420 -342 1846 -1262 -2220 189
2091 189 -792 -1683 3361 970 -4015 1646 3972 -1481 252 3224 168 -362 2448 709 -1893 2135
2107 2135 3671 -3181 -1958 3431 -1109 -1733 1789 -2190 -3287 1521 720 -3764 -1617 2353 -1656
2122 -1656 -2925 2491 102 -2136 2862 892 -3315 1900 3998 -624 -996 2634 1351 -974 2503
2137 2503 1636 -2984 1497 3304 -3112 -1243 2921 -830 -2057 681 -663 -2846 333 1478 -3327
2152 -3327 -1897 2798 -1343 -2644 1716 -125 -1719 2108 1382 -1844 574 3443 152 -1355 2961
2167 2961 1724 -1493 1969 1679 -1991 1133 2191 -2010 -1782 1623 248 -2327 -348 -104 -2814 -490
2183 -490 1451 -2879 -1709 1632 -1279 -1842 1201 518 -556 646 1359 -387 -187 3309 644 -1154
2199 -1154 2437 999 -614 1697 910 -722 151 1144 -698 -1450 547 77 -2250 -543 121 -2151
2215 -2151 -633 285 -1780 -1185 281 -164 -705 13 1181 -244 -233 2140 174 103 2309 479 -199
2232 -199 1609 986 401 547 614 198 -829 447 -255 -1618 66 107 -1690 -564 -329 -1201 -793 -668
2250 -668 -708 -781 -206 637 -673 -325 1076 157 253 1390 561 714 1254 621 956 227 838 453 -358 858
2270 858 151 -1005 475 -482 -788 -58 -794 -831 -787 -925 -408 -1069 -964 66 -948 -182 581 -520 318
2289 318 676 463 1046 693 898 1049 409 1159 880 -131 840 -84 -93 567 -284 -367 -6 -949 -427 -885 -1021
2310 -1021 -481 -1415 -625 -410 -1017 -86 -273 -750 450 -225 -17 771 135 716 851 382 1016 838 495
2329 495 1223 50 723 732 -322 644 244 -602 120 -488 -836 -299 -1226 -641 -802 -1107 -164 -1038 -616 193
2349 193 -776 -56 301 -316 664 584 113 968 857 1114 598 215 1316 668 78 962 -1 -213 798 -566
2369 -566 -580 -177 -550 -365 -829 -662 -619 -1352 -108 -428 -1338 -7 -36 -516 409 277 -17 744 559 653 440
2390 440 976 1645 80 813 1177 -189 905 810 -626 264 355 -323 -704 -766 -347 -866 -804 -199 -1410 -1065
2410 -1065 524 -980 -1173 625 -8 -388 203 241 174 593 1400 253 -327 1947 1110 -334 1282 889
2428 889 -477 1067 893 -902 -489 510 -58 -1760 -205 -106 -1540 -262 216 -2208 -613 1020 -1184
2445 -1184 -1175 279 177 -515 263 1137 -324 393 2253 -291 -850 2413 1240 -648 1307 553 -654
2462 -654 580 1401 -945 -1409 1001 150 -2473 177 336 -2089 -300 267 -2316 -816 1301 -762
2478 -762 -2034 630 1090 -908 235 1731 -1012 476 2959 -387 -848 2329 1242 -1076 296 1096
2494 1096 -233 -113 1740 -1135 -2326 1769 -50 -2842 107 282 -1881 -343 331 -1915 -1287 1709
2510 1709 202 -2641 745 2050 -1385 496 1701 -1005 582 2752 1 -1030 2010 2122 -1222
2525 -1222 -256 1833 -759 -258 1674 -1485 -2230 1726 -13 -2889 -400 860 -1361 -1409 640 -982
2541 -982 -1522 1926 258 -2850 927 2120 -770 405 1352 -77 352 2122 632 -1579 1747 2455
2557 2455 -1623 -361 1515 -429 -361 1177 -1509 -1789 848 420 -2018 -1695 987 -1163 -1397 949
2573 949 -960 -1351 1598 -166 -2052 771 1648 -195 -344 1016 511 -203 1952 699 -1403 1441
2589 1441 1766 -933 -307 859 -293 -305 -316 -613 -1542 379 617 -2392 -1310 951 -900 -1103 218
2606 218 -914 -768 779 72 -693 235 1411 241 -449 970 627 538 1737 358 -409 1167 844 -242
2624 -242 -315 -2 253 -199 -485 -328 -1024 -112 -137 -1554 -694 6 -459 -216 -721 -548 106 37 -8 -146 216
2645 216 1305 471 -85 787 432 626 784 -81 423 505 274 192 -557 -122 435 -464 -303 -997 -486 5
2665 5 -746 -1104 -428 -626 -134 -3 -536 -58 403 153 351 371 783 656 137 925 195 355 1132 427 -122
2686 -122 356 442 93 70 -218 -190 -303 12 -484 -1276 -132 57 -1290 -466 -104 -472 -243 -282 -208 -227 185
2707 185 694 -252 297 1123 261 166 1147 228 290 928 107 244 507 337 48 -217 179 -136 -803 226
2727 226 -485 -1104 -193 -660 -774 -414 -639 -465 -355 -154 191 -383 445 687 -67 749 1044 31 700 795
2747 795 214 508 433 588 141 6 450 -210 -346 459 -322 -616 40 -669 -654 -507 -242 -522 -759 -372 -98
2768 -98 -564 111 292 -446 644 634 -181 779 790 479 456 261 850 318 291 679 13 1 193 -613 -158 214
2790 214 -502 -520 -606 -449 -524 -769 -356 -524 -838 -249 -330 -628 260 131 26 426 424 562 410 518 839 225
2812 225 496 741 124 523 516 -181 -129 235 -254 -234 -568 -164 -287 -847 99 -447 -695 -121 -820 -702 360
2833 360 -728 -214 287 98 499 157 533 702 111 800 864 226 784 464 153 495 523 87 -83 -476
2853 -476 13 -310 -399 -135 -659 -497 -463 -977 -577 -164 -622 38 -163 -172 65 80 653 -24 233 886 271 169
2875 169 958 396 276 771 269 347 147 189 -16 -557 -69 -124 -732 -98 -500 -1025 -113 -191 -811 -98 -285
2896 -285 -384 -215 -80 5 -504 484 756 -146 368 956 142 531 810 221 361 652 249 69 -238 340 -205
2917 -205 -540 278 -693 -622 295 -478 -1074 -185 -419 -584 -532 -15 27 -291 308 172 -479 917 726 -175 326
2938 326 807 244 556 502 465 100 492 642 -560 203 861 -301 -400 -39 -872 -414 -71 -798 -976 -432
2958 -432 -40 -612 -648 -234 -251 -157 648 -172 -624 1090 494 40 267 666 709 409 566 396 -86 873 412
2979 412 -808 142 599 -734 -318 -284 -689 -468 -171 -679 -1199 -409 233 -907 -572 407 -574 204 540
2998 540 -435 -144 1115 686 34 208 793 449 56 690 -210 -289 1369 -118 -1120 198 125 -638 -301
3017 -301 -427 -739 -416 67 -327 -1232 380 271 -984 -164 380 -207 230 698 -800 -99 976 794 -208
3036 -208 426 916 -36 678 1204 -541 50 1176 -462 -1077 210 186 -641 -479 -140 -611 -734 677 -810
3055 -810 -1545 785 -43 -856 162 -25 -250 102 664 -213 -335 1255 1141 -816 589 1048 -251 917
3073 917 648 -889 -42 987 -121 -963 93 370 -933 -712 225 -1077 -401 858 -1358 -1159 612
3090 612 273 -797 -128 501 -112 191 1144 -229 -321 1426 666 -650 835 1006 65 327 432 -244 -343
3109 -343 822 -212 -1279 212 624 -1007 -293 -88 -958 -207 585 -748 -964 248 441 -599 -338
3126 -338 820 -261 135 949 -401 -9 1382 560 -87 579 819 82 289 487 -71 -447 738 -108
3144 -108 -1061 295 261 -899 -416 -315 -763 -352 103 -301 -1011 236 528 -738 -25 622 -72 169 749
3163 749 -276 203 789 463 -69 356 993 -70 -12 492 -202 -430 351 -299 -941 -155 -137 -465 -459 -178 -306
3184 -306 -492 55 -188 -674 400 401 -525 67 413 63 445 563 227 156 600 939 -94 213 660 -253
3204 -253 -11 371 -342 -244 143 -294 -582 -133 -268 -426 -847 -258 -249 -909 -32 -460 -410 250 182 -204 306 313
3226 313 449 270 242 671 -197 508 511 -57 316 306 -105 -100 76 -69 -179 -241 -387 -408 -522 -183 -597 -613 -227
3249 -227 -660 -696 -8 -205 -89 107 15 171 -16 251 446 124 537 397 182 570 618 143 511 317 128
3270 128 122 -245 -45 -192 -345 -49 -421 -128 -217 -691 -323 -122 -519 -253 -493 -248 94 30 94 394 115 612
3292 612 295 232 646 404 260 528 -39 -36 33 -7 -78 -382 91 -154 -332 -244 -111 -705 183 -558 -414 -201
3314 -201 -443 -287 -30 -135 27 -122 43 372 145 259 711 213 383 546 224 499 583 262 126 -127
3334 -127 231 -106 -307 289 -318 -566 -176 -618 -354 -230 -648 -361 -218 -275 -119 -252 64 270 -185 341
3354 341 431 26 610 335 172 562 222 413 358 220 301 136 294 257 -383 -267 -12 -390 -603 -217 -263 -239
3376 -239 -178 -429 -539 -331 -210 -357 -372 295 -3 -154 679 -40 347 631 399 297 405 613 -83 -138 398
3397 398 -56 -323 -5 50 -567 -69 -128 -428 -302 -188 -445 -412 -331 -224 -690 65 116 -512 -157 471 70 64
3419 64 470 211 504 402 458 134 326 847 -36 -88 493 -74 -199 550 -279 -647 148 -10 -293 -567 19
3440 19 -132 -461 -11 -251 -469 265 268 -616 158 456 -172 199 392 468 281 526 786 -106 359 924 -3
3461 -3 24 255 -212 -264 35 -478 -416 -112 104 -467 -526 -56 -105 -526 366 -359 -500 323 235 -465 110 440 119
3484 119 -5 249 341 74 1072 352 -516 646 694 -381 136 143 -232 -52 225 -172 -805 -128 333 -667
3504 -667 -346 272 -565 -294 344 -515 -438 371 20 -360 -151 467 -19 81 736 229 61 816 204 -185
3524 -185 793 530 39 -163 233 -36 -105 -42 -415 -692 140 187 -1110 -265 -1 -444 -295 -29 -654 -244 460
3545 460 261 -214 -51 852 -185 -35 746 104 182 785 409 -395 489 451 -223 -248 384 -142 -580 212 -509
3566 -509 -871 324 -192 -559 -139 -105 -290 -52 196 -279 -287 557 40 -658 319 664 -96 187 687 54 225
3587 225 319 91 -139 381 686 -501 -69 369 -457 -488 42 -621 -644 165 -186 -661 -227 309 -305 -400 349
3608 349 -170 -484 790 -48 -662 237 744 -7 147 703 178 -45 426 463 -537 382 662 -291 -94 101
3628 101 -455 -348 51 -391 -486 -246 34 -810 -450 404 -159 -339 348 -162 -227 605 464 -417 138 558 250
3649 250 -45 609 232 -148 464 193 -264 397 168 -381 -177 -23 -230 -303 -90 -164 -664 -163 63 -683 -378
3670 -378 429 -184 -262 325 -280 -92 557 386 32 303 641 490 -111 832 416 -56 649 27 -222 172
3690 172 170 -76 -219 13 -47 -346 -184 -93 -562 -169 81 -600 -396 -55 -279 -299 138 277 -77 -185 388 298
3712 298 107 636 292 -82 544 277 195 251 -83 -63 -129 -113 80 -437 -34 -210 -200 -186 -207 -708 -220 -275 -188
3735 -188 -247 -86 148 -81 -5 423 -3 170 453 247 324 178 100 388 -230 340 218 -41 -10 65 -197 36
3757 36 -224 -161 -82 -320 -227 -231 -262 -153 -259 -70 5 -104 4 47 -267 22 3 113 474 149 327 111 323
3780 323 331 422 75 263 146 -284 -39 -162 -172 -6 -261 -61 -154 -96 -184 -260 -280 28 -436 30 -66 -138 139 5
3804 5 -24 57 -9 78 294 -93 480 224 200 392 160 313 105 -162 198 -145 -256 -156 -139 -314 36 -225 -367
3827 -367 -203 -450 -285 -280 -62 -13 -333 41 130 -195 61 337 17 -12 295 378 184 213 208 118 -132 183 -112
3850 -112 -6 248 -310 -231 -47 -166 58 -458 -241 -228 -285 54 -62 -321 -47 58 -262 288 9 123 52
3871 52 131 39 130 239 467 135 226 472 -188 545 177 -126 -5 12 -199 -270 -426 -30 -305 -177 -45 -243
3893 -243 -59 -116 -198 -380 -95 20 -199 85 -78 197 173 209 32 81 287 86 70 421 379 -2 201 56
3915 56 -53 8 105 -187 -334 -278 -122 -275 -141 -7 -423 -115 146 -437 -331 -11 -225 -66 45 332 136
3936 136 222 522 160 -107 602 -41 78 343 -80 126 82 165 42 -435 201 105 -410 -59 -106 -591 -192 -214
3958 -214 -816 -105 23 -112 -306 -82 237 71 -97 390 -192 86 671 169 88 570 191 61 203 187 -89
3979 -89 175 395 -568 -387 301 -166 -784 -118 -219 -534 82 -188 -600 -96 3 -76 -410 293 251 -337 320
4000 320 420 -143 407 514 -57 203 504 375 -128 101 546 -287 52 353 -234 -215 298 -191 -215 220 -225
4021 -225 -330 -87 143 -226 -375 647 322 -503 378 328 -112 183 158 -41 269 657 339 -106 130 542
4041 542 -29 106 338 -324 -42 180 -275 -537 104 95 -197 -283 75 -343 -423 95 -300 -312 400 -169 -159 321
4063 321 109 341 -181 164 220 125 401 226 -173 374 395 -180 31 -110 -143 127 -68 -212 -94 -305 -58
4084 -58 -206 -38 77 -143 -155 -362 -340 26 83 -67 6 -154 305 313 124 292 228 58 453 438 3 338 -51
4107 -51 101 -123 -250 139 203 -420 107 -263 -324 -60 -520 -167 -358 -83 62 -270 -57 209 -93 30 -157
4128 -157 175 106 346 154 116 323 562 203 22 185 -14 -108 189 -69 -44 70 28 -90 -223 -304 -138 -77
4150 -77 -130 -136 -312 78 118 -394 -117 68 -28 50 339 266 178 199 396 6 96 494 176 -59 125 -74 235 -14
4174 -14 -244 -171 -61 63 -251 -324 173 -116 -669 -231 -100 -179 -98 -304 97 -156 122 -117 -68 124 399 -68
4196 -68 128 728 33 24 275 267 -76 362 142 -54 -85 49 -245 -197 168 -163 -529 156 174 -394 -79 -113 -126
4219 -126 72 -173 -193 -294 -11 182 -27 299 583 136 25 168 35 60 422 470 -111 51 221 -47 54
4240 54 218 -81 -339 123 -324 -208 12 -225 -320 -165 -53 -286 -134 -23 134 -114 174 169 6 15 111 350
4262 350 127 216 285 65 416 267 -78 80 55 -29 -318 117 -314 -215 -132 -86 -292 -244 -138 -27 -396 -125 37
4285 37 -233 173 -201 -96 126 181 313 190 175 437 125 93 240 12 6 391 -93 13 162 -118 -431 -226
4307 -226 -159 -421 -218 -226 -348 -290 -10 -123 -216 195 -262 -193 92 184 421 -64 162 266 -137 422 277 180 499
4330 499 155 173 329 248 -97 -73 -185 -147 -130 -209 -99 -262 -173 -162 -228 -180 -256 -239 57 -225 -37 -101 162 80 -30
4355 -30 280 362 72 313 357 125 125 -4 144 161 40 155 -9 -172 7 -223 -91 -115 -55 -232 -213 -32 -329
4378 -329 -161 -97 -102 101 -20 155 -148 27 65 -271 251 318 22 105 103 -83 124 258 -12 123 -24 56 -215
4401 -215 -145 -17 -198 -227 -31 -108 -118 36 -210 -239 -385 174 -147 -77 90 83 64 307 242 48 -24 18 265 270 177
4426 177 -12 171 38 42 88 -286 314 -209 -72 203 -389 -214 0 -130 -324 -321 -120 -301 -129 -56 109 -8
4448 -8 -23 -135 86 216 63 325 0 173 214 165 356 78 -111 221 -39 -9 63 -235 -366 54 -101 -233
4470 -233 166 -149 -362 -354 -96 -214 -173 1 -2 -340 154 53 -199 340 342 43 30 231 40 52 159 398 -54
4493 -54 276 227 136 -48 166 -69 -223 106 -203 -312 -170 -104 -384 -398 -45 -442 -475 -13 -326 -282 276 -23
4515 -23 -46 57 315 57 225 211 -39 85 431 452 -251 248 367 -59 -28 190 -43 -181 -180 -109 -304 -274 79
4538 79 -151 -240 142 -176 -181 138 -146 -143 272 249 -139 64 215 193 -69 487 -128 -296 304 -75 -253 152 387
4561 387 -175 -235 149 -70 -111 -157 -133 -335 -58 27 -553 -279 166 -61 -261 145 142 -78 364 314 -144 105 381
4584 381 43 224 575 305 -66 319 262 -452 -85 311 -53 -505 89 220 -426 -89 -38 -573 -211 38 -185
4605 -185 -173 -52 64 -167 96 266 29 -155 297 5 28 475 297 87 326 -112 134 208 289 91 -7 364
4627 364 -12 -682 -111 63 -299 -260 -189 -317 -255 -7 -202 -372 159 228 -326 -186 272 -22 -71 362 92 334
4649 334 476 37 11 187 304 11 144 369 -101 104 14 -262 -197 -15 187 6 -138 -56 -88 -100 8 -55
4671 -55 -373 116 339 74 122 49 -81 -19 -33 313 247 184 25 108 140 297 274 -202 135 39 -57 347 49 -207
4695 -207 -14 -225 59 -184 -100 26 -179 32 122 -89 41 -13 312 -107 59 -26 64 324 265 79 -24 256
4717 256 35 41 162 106 4 16 -145 -81 -365 73 -320 -118 87 -84 -267 -137 -33 -46 -62 -64 97 -104 147
4740 147 55 -383 86 292 -50 269 -41 -114 429 212 11 211 144 19 86 -340 -179 75 -34 -17 -153 15
4762 15 -28 -141 -264 -67 -229 -4 -137 -8 -10 -26 120 -261 147 -94 111 -6 123 354 264 307 -76 116
4784 116 -109 47 -19 -253 -173 -106 -241 -3 34 87 -115 -189 59 36 -409 73 104 24 -256 306 60 -2 57 200
4808 200 237 267 -163 18 212 140 36 -193 149 -9 73 -82 77 -222 -194 -158 -28 -170 177 -138 -307 -206
4830 -206 -135 -103 -156 -209 -43 24 -13 122 345 -35 108 -103 281 232 146 -27 269 167 187 -63 76 -92 -228
4853 -228 64 -141 -205 195 -65 -410 -16 -102 -30 -209 -144 -57 -51 -182 234 -242 -2 174 41 -12 14 2 145
4876 145 235 254 88 81 -33 33 129 89 -107 -69 109 -68 -172 -21 -108 -224 -43 -399 -20 -247 59 239 -156
4899 -156 147 33 47 140 117 -22 317 318 210 98 62 214 -4 -11 393 19 20 31 -135 4 149 -74 -259 31
4923 31 -79 -265 -332 -47 -135 -51 38 199 -50 209 -82 -3 83 -39 -163 63 339 85 36 286 131 5 16
4946 16 200 144 89 -24 -3 -274 152 -110 -114 -31 -94 -213 -164 80 67 -43 157 -66 -189 190 240 -82 147 110
4970 110 17 151 42 309 223 270 103 262 -60 289 -95 118 -66 232 -61 -125 55 -168 -1 -18 6 -26
4992 -26 -93 -169 70 -8 95 -47 18 102 153 154 431 24 -27 267 -67 -132 107 -30 -42 25 137 136 -231 71 -29
5017 -29 109 25 -99 -168 -67 -152 -297 -215 -216 -34 -337 -51 -28 24 -102 -185 131 61 3 71 87 285 171 196 6
5042 6 117 205 0 213 21 136 118 -175 6 -105 -409 -381 -230 -386 -119 -228 -156 30 -23 173 -42 -18 86
5065 86 158 -35 20 124 26 448 289 118 78 77 174 243 52 260 -74 -87 -55 -71 -194 -87 -193 -269 40 34 -279
5090 -279 178 -21 -31 -15 243 -110 39 141 42 124 -33 27 255 89 -52 -22 -204 100 -36 -124 288 -151
5112 -151 -183 166 25 3 -80 -174 -243 -3 -76 -42 -287 -16 -61 -73 29 186 42 100 198 121 84 -61 148 120 276
5137 276 181 52 208 179 -216 -6 264 -270 -193 129 -40 -121 156 -209 -279 -163 56 -417 -104 97 75 98
5159 98 104 239 -31 115 143 58 15 191 109 7 200 323 -240 61 -149 46 139 -4 4 -15 152 -58 -79 -111
5183 -111 76 -231 -196 54 -141 -165 -147 -28 -163 84 230 164 -59 17 36 -93 228 221 -9 72 11 187 149 184
5207 184 -65 110 69 -37 -146 -134 -101 -74 -184 -54 -38 -125 -29 11 -120 -67 0 -139 193 51 -74 78 -5 150
5231 150 -12 -151 211 -12 195 163 -104 -78 38 54 -102 -56 238 -173 138 181 -127 -147 -16 -84 -310 152
5253 152 72 -145 90 -33 218 88 -50 -3 73 -52 235 146 134 30 186 190 130 29 173 57 -256 -177 30
5276 30 194 134 40 18 -120 -190 -94 155 -168 -186 -13 -210 175 224 -139 67 18 24 215 42 112 58 11 186 165
5301 165 151 63 -79 -202 51 202 -166 -156 233 -107 -134 -269 -356 -304 -8 -78 -95 -45 -151 11 -154 9 46
5324 46 246 -46 208 185 -65 255 -179 205 67 -255 21 141 -196 -168 -77 119 100 72 -96 -134 -151 53 37
5347 37 -159 -4 -58 147 146 -64 -243 228 275 37 234 92 106 -61 140 110 -101 352 129 -94 -51 311 -208
5370 -208 -140 -225 -268 -29 -42 -181 -109 2 -100 -159 -64 -213 -17 93 148 -27 21 24 -63 -56 -146 124 305 162 191
5395 191 22 -70 103 -106 69 -100 62 -161 -203 -126 -96 -22 -32 -101 -82 -193 -42 -146 -123 -49 33 122 -46 -69
5419 -69 28 113 133 13 27 405 85 211 191 -79 -48 216 384 -94 -264 29 -95 -38 153 -90 -47 128 -95
5442 -95 -28 49 -29 -124 148 -96 -21 -144 46 81 52 180 118 17 30 80 156 281 210 42 62 342 264 -66 -101
5467 -101 72 9 -24 16 90 -23 -178 -58 -311 -40 54 -166 -55 30 35 -26 -26 56 -202 83 367 216 128 110 260
5492 260 240 -124 117 -93 16 306 -117 63 74 -163 35 -97 -64 -221 -251 -130 -430 -12 62 -157 -115 -14
5514 -14 -36 9 158 -18 215 164 105 243 -76 79 106 162 -125 66 -154 -39 -126 -262 50 -54 66 209 -144
5537 -144 -27 42 -152 -1 -269 -65 -95 -102 158 167 213 12 139 121 140 185 165 157 59 313 1 -134 227 -182 -75
5562 -75 191 96 -68 -75 30 -181 40 -336 -192 -67 8 -168 -222 -19 -189 3 28 125 121 49 122 289 221 -67
5586 -67 237 -63 203 -74 95 -156 -94 4 -231 -236 11 89 -156 -176 34 -131 22 -203 5 48 -44 -168 -84
5609 -84 112 -227 -105 -131 137 -9 185 151 74 244 -136 -51 5 -10 99 150 90 -95 -199 167 140 -384 -200
5632 -200 -136 -151 -349 -153 -133 84 -33 -269 -71 284 172 71 -97 157 122 60 58 -204 204 138 162 26 266
5655 266 26 -326 -83 22 -83 -111 -33 -49 48 -4 -45 -300 -130 -110 -147 -49 66 -60 -192 -208 -18 27 -9 150
5679 150 -6 48 378 98 114 221 164 116 118 167 72 -182 -223 -61 -148 95 -17 6 161 109 -120 -113 -210 -55 -66
5704 -66 71 236 -87 -64 174 -150 209 243 96 29 -163 290 -97 67 -132 -5 71 134 -47 -94 -132 -303 -141
5727 -141 10 -407 33 101 -43 -30 -140 -116 -53 -89 -41 -91 24 216 -24 -113 112 8 23 113 134 110 76 17 -58
5752 -58 40 -84 96 -197 -218 80 -43 23 231 163 -21 23 104 -147 -21 109 104 130 -130 -22 -92 21 77 -167
5776 -167 135 127 203 79 167 134 173 114 129 -72 65 6 101 85 104 148 -33 -225 3 -79 -157 -329 -21 148 -20
5801 -20 84 119 -121 -176 8 150 205 109 120 223 201 -164 135 -128 44 80 65 64 -75 153 136 -33 78 -44
5825 -44 -224 51 -80 -52 -182 -22 -362 -117 14 -66 1 -21 42 -154 181 -29 323 7 -42 -6 114 316 -45
5848 -45 -57 134 98 191 16 -140 -33 -134 -7 85 -11 19 118 -267 -108 -218 146 -201 7 75 -55 94 -85
5871 -85 -37 214 104 -158 93 -26 -87 208 -64 58 116 -152 -28 63 165 -282 67 4 349 -327 53 149
5893 149 -187 -113 -26 -243 -273 50 -78 -163 -172 121 52 -88 141 165 -140 91 -26 10 61 152 37 -123 -237 -196
5917 -196 -124 -228 52 -44 -154 66 -142 -6 -254 -96 70 -153 97 -114 41 66 -90 83 210 -56 -26
5938 -26 209 -92 153 5 205 103 183 107 63 -200 -119 -96 30 -5 -6 -217 -107 285 99 -78 -201 -64 57
5961 57 -98 104 -2 126 124 -12 195 272 153 97 252 -77 239 -105 14 107 240 147 52 90 0 319 1
5984 1 91 -176 -117 39 -134 -93 31 206 48 -190 126 -222 -28 13 61 63 -54 106 -140 135 207 138 237 158
6008 158 111 -151 152 39 -10 -74 145 25 31 -27 206 -248 -32 -23 -281 -37 0 -29 -93 396 -126 -241 -67 -102
6032 -102 52 97 40 -48 50 14 73 34 302 -177 -147 88 10 8 31 -70 -84 -151 190 45 -182 -82 126 -177 -10
6057 -10 -108 -108 95 -91 -49 -243 141 -12 -99 -47 20 -45 64 234 355 13 17 88 14 50 161 6 88 10 -39 -208
6083 -208 -131 -80 -151 -151 -118 -6 -131 -76 -35 -50 -99 -180 -90 324 82 3 -99 122 -64 114 154 39 40 226 -17
6108 -17 11 26 150 44 -29 -63 -46 -43 -20 -189 -133 -116 -71 101 -254 40 -138 -69 -191 -112 67 -127 80 82 149 28
6134 28 -11 118 -11 0 168 198 -152 -3 74 190 163 109 81 -88 -206 -281 121 -152 -24 -46 -43 -204 33 -36
6158 -36 -113 -106 -188 -84 49 -148 242 36 -132 179 32 199 150 63 254 -107 -161 118 -54 -131 79 179 -282
6181 -282 2 19 -243 -71 150 -16 -7 -4 -133 111 134 176 212 -3 126 40 177 -48 182 -198 81 -52 257
6204 257 47 -101 -297 -212 186 -8 -352 -61 -112 -76 66 -171 -31 -222 -57 -73 53 23 113 42 55 -20 -15 241
6228 241 38 134 197 -94 77 12 63 113 -5 169 -50 -111 -69 31 -75 -15 -131 -263 -69 -99 13 -302 -259
6251 -259 -25 -44 -159 57 68 -42 -53 -164 -81 30 8 67 -208 -76 -94 36 36 16 -137 -255 154 -12 -106 131
6275 131 48 -195 -40 -149 -70 32 -181 -314 -56 63 -96 -77 196 -50 54 144 -347 -60 72 -103 333
6296 333 111 179 -3 -76 236 -18 -24 103 -88 83 63 -106 -44 -521 37 241 -195 111 261 -214 -127 206
6318 206 -210 61 -40 11 -53 222 129 139 79 103 202 -41 134 67 100 106 -62 -41 129 68 26 132 77 -96 -114
6343 -114 83 -78 -88 78 -140 78 -176 34 -109 -134 99 189 -198 70 33 134 149 91 -69 -190 46 88
6365 88 -62 -34 118 -62 -171 -162 -13 -279 -2 263 -68 -223 -148 -145 -134 -152 18 -306 -94 174 -112 -11 -55
6388 -55 163 295 262 87 101 390 173 211 309 -104 -164 152 -66 102 -43 -104 -113 194 19 109 -69 -203 13
6411 13 -44 20 90 -426 -13 88 -166 -178 353 277 174 178 -48 -40 97 173 86 89 -32 -36 -107 -103 -40 -79 -21 9 -159 -145
6439 -145 9 -296 184 -145 -99 -221 -157 -129 11 46 -205 64 56 -131 -129 -6 -19 123 134 -47 50 313 36 -57
6463 -57 -130 -210 -63 -1 -94 311 106 126 -97 109 -60 3 91 -45 -106 22 -60 -47 -355 -29 -37 192 25 253
6487 253 67 109 77 -60 167 168 44 -38 -82 204 37 130 -114 -47 34 -182 -219 91 -237 -175 -352 1 -182 -46
6511 -46 9 -136 135 -125 59 16 253 -61 -29 -218 106 23 -127 -47 55 -41 51 -21 -81 120 -162 -123 -76 0
6535 0 27 -8 -234 59 27 -211 -58 15 -148 251 -136 -8 86 21 88 54 40 27 131 63 87 221 22 71 194
6560 194 -141 69 -30 -23 146 114 -91 177 -220 48 -100 181 102 -8 -108 -167 -169 -11 -125 -57 112 61 123 -31
6584 -31 12 -48 53 76 375 201 242 167 96 -57 103 3 72 49 -269 9 36 -164 101 -44 -183 65 135 44
6608 44 -190 -79 -50 170 67 -21 164 -23 126 21 99 91 302 -15 132 -195 135 -94 -101 -96 -148 59 17 -106
6632 -106 96 7 -199 -28 -72 -60 -5 65 49 -63 -265 263 147 -61 29 44 86 117 51 89 154 65 217 56 61
6657 61 -74 -78 -97 5 -48 -66 -264 84 -165 35 275 -125 -245 279 -141 -28 22 74 -2 -125 86 165 15
6680 15 108 -82 158 55 99 -25 89 -61 130 -46 17 57 -212 205 -97 -1 175 -158 -194 -69 -52 34 -135
6703 -135 28 -2 -45 -41 -40 146 259 -64 -58 -21 171 275 76 62 34 -181 -161 83 -108 97 -36 27 29 166 125
6728 125 -7 -131 -170 -33 -8 -77 -199 -179 -77 20 -87 -83 152 -130 381 29 92 101 85 -52 143 94 417 196
6752 196 137 14 -82 -141 143 53 -282 183 -98 29 -98 96 139 248 45 20 -149 -36 116 -161 3 39
6774 39 96 122 10 26 -183 145 312 -214 51 -10 16 117 164 -115 -73 -188 -45 134 45 -99 28 45 127 -239
6798 -239 -216 51 99 189 126 -244 -108 37 -23 56 -178 51 40 209 167 35 -172 -53 16 171 73 -42 -92 255
6822 255 126 123 59 -287 23 -128 173 -116 61 -146 -242 -54 -18 9 -76 -84 60 459 13 140 -130 78 104
6845 104 -41 41 170 -190 -18 -67 15 -104 206 -81 -139 -136 53 -79 -214 -67 -55 -201 -24 167 -53 46 120
6868 120 -72 186 -64 -74 -125 -48 51 -38 21 -39 -13 -135 19 80 115 71 88 73 3 -86 -114 -35 -36 -240 -99 225
6894 225 -1 -160 -291 -287 -158 89 103 -51 55 -204 96 21 186 293 120 -21 -21 42 -91 41 -140 11
6916 11 180 204 -169 -276 -300 86 -68 -317 146 -21 49 122 -180 13 210 40 -62 -52 176 -27 114 67
6938 67 56 -37 27 182 124 115 57 283 -22 129 -89 -72 45 330 -46 -44 -143 -66 -72 -65 -62 -92 -155 -39 -151 104 -83
6965 -83 -165 48 224 110 -52 247 80 -98 131 -1 -45 11 101 -59 -173 150 91 100 33 112 -104 -91 -83 -16 93
6990 93 -53 -164 48 47 -328 -177 -60 37 -60 -106 -108 13 33 -12 -30 71 -33 -258 -76 221 67 -54 101 32
7014 32 -124 -288 -98 -98 -162 -14 31 -19 5 93 -44 -180 -66 -123 189 -127 30 211 51 -111 120 -5 136
7037 136 78 88 140 195 -11 138 514 -157 -9 20 -30 -20 -218 -54 -261 -39 73 -95 -188 -355 -198 -7 50
7060 50 -86 -140 77 -12 168 38 6 85 190 -73 68 -65 -118 -2 15 170 -54 -153 223 87 -145 -124 -19
7083 -19 -171 17 -140 15 180 110 89 -158 126 200 169 -53 4 102 185 -59 -39 56 160 -1 107 215 179 58
7107 58 143 -63 1 115 12 -47 -216 -39 60 -136 59 59 76 63 131 -11 -123 -113 90 44 -130 4 7 68 61 -172
7133 -172 -52 -105 113 186 121 63 203 -166 -82 92 304 -134 45 305 -173 108 -27 81 -75 52 -28 -22 118
7156 118 -93 -82 44 51 24 126 229 91 30 -92 -173 -107 388 75 -81 62 27 32 21 -113 165 207 56 -24
7180 -24 -93 45 -118 32 -256 -10 -153 76 90 95 39 -82 -110 163 -61 -60 -45 88 18 163 67 162 103 137 90
7205 90 63 -16 118 209 247 117 -144 -37 -109 -169 -21 28 0 126 75 319 -24 168 91 -38 119 -259 226 83
7229 83 -72 221 69 -66 -12 109 -167 173 -7 235 216 73 -203 199 -18 -127 -50 64 46 -25 -17 -7 -58
7252 -58 98 38 13 9 -86 210 -237 -55 -14 99 75 -185 -128 144 31 -89 30 101 118 167 -55 90 -113 50
7276 50 -196 46 -33 -18 128 -22 -106 -227 14 2 -122 -51 -255 -67 -7 21 131 -48 -83 -118 255 -169 -45
7299 -45 83 20 118 -110 -176 110 -41 -8 -155 -270 37 3 -91 -130 87 70 -328 288 122 -207 -133 93 81 -37
7323 -37 176 25 -38 168 232 -169 145 45 -216 188 186 71 82 101 93 -28 -101 137 -386 116 -57 -154 -87 39
7347 39 -128 -154 -38 -122 -132 -98 32 -33 -82 15 -70 -176 213 243 -86 46 142 76 112 28 5 -45 -295 112 12
7372 12 132 50 -54 51 118 27 -236 34 -44 -84 -136 186 -37 -135 43 22 19 215 -81 12 13 -111 -192 -106 -174 266
7398 266 35 86 100 -217 81 -107 162 6 -26 -3 206 70 98 153 33 -121 205 -11 122 -146 24 118
7420 118 -33 396 -84 149 -155 -163 -144 11 142 171 -139 -30 223 135 127 116 -148 -181 -37 -21 21 -84 -208 -214
7444 -214 -261 29 -89 91 92 -76 163 200 16 31 168 40 -65 -75 -102 169 11 141 98 57 -64 137 66
7467 66 207 -35 -66 146 -46 -173 1 42 -157 -83 -194 -4 -89 -284 154 -76 -188 -186 -35 171 -217 21
7489 21 60 161 -17 -8 85 -34 124 9 50 39 93 -88 -87 72 -119 -32 58 31 134 -70 34 -219 -91 -47 124
7514 124 -253 -16 198 -122 17 129 -11 99 64 181 204 -216 305 133 291 -246 -79 172 264 53 -12
7535 -12 -61 -352 2 -312 -247 47 -25 -111 -230 -70 -114 35 -235 -200 -150 -236 -125 61 1 -69 43 110 282 4
7559 4 -17 173 55 67 -57 -53 -134 159 125 -53 -278 -69 145 -30 -210 82 49 -251 81 -64 177 60 58 -157
7583 -157 148 -30 95 -154 68 371 69 -114 -19 49 21 149 -2 59 15 -92 136 93 83 190 -220 -83
7605 -83 -112 -211 -181 115 -103 -5 -57 136 -138 -68 99 100 -69 116 -31 3 -22 345 16 97 213 148 82 -49 106
7630 106 82 -118 -227 -160 130 84 11 -266 -155 221 -213 -75 -7 -106 -125 102 96 -282 146 8 -54 -116 50 56
7654 56 -28 -200 -11 -87 95 17 -25 204 -119 -183 -376 -16 -74 -89 -74 144 15 -196 -208 90 9 -140 190 55
7678 55 175 -83 -29 86 214 20 88 24 62 142 -43 -162 18 6 -286 -33 -206 96 -134 91 -158 -172 31
7701 31 -200 114 -142 -100 154 192 -101 -171 62 65 -92 264 9 117 184 169 -80 158 4 47 -46 -65 8 -98
7725 -98 116 -73 203 28 -378 40 -49 -163 51 63 -45 -35 71 194 130 61 -26 85 -172 28 36 -62 107
7748 107 148 142 322 4 315 379 221 -12 29 -150 75 63 -224 -252 -91 225 -14 25 -115 -246 193 53 97
7771 97 42 -52 -3 -128 -40 -137 76 -22 60 108 104 -45 -122 6 25 77 55 139 -87 76 20 -142 112 34 -64 -244
7797 -244 25 75 -8 46 -52 -183 -253 50 49 226 66 207 76 77 215 -48 13 -3 -184 39 -106 40 131 0
7821 0 185 228 -153 -49 -143 -335 98 29 262 -15 -5 273 90 56 171 -55 -145 -60 -104 -158 29 15 -26 25 -222
7846 -222 188 -80 48 129 -25 15 45 240 -67 -118 -64 -82 -170 -153 -52 -132 -216 -116 -108 70 -251 26 57 -99
7870 -99 -194 86 -60 -170 -26 -86 -188 37 -71 3 49 177 -104 36 191 -262 -183 171 119 -181 85 -26
7892 -26 -268 -125 190 -137 67 61 231 -79 -24 -61 -164 -44 -84 -25 -139 -118 -165 146 76 64 -143 -49 -117 105
7916 105 73 0 43 155 122 39 -136 99 -95 95 41 -98 92 -132 -251 118 118 -20 92 183 213 -12 -49 193
7940 193 141 134 137 10 143 40 194 -8 88 -9 135 -101 -109 -18 38 -95 -62 2 -189 -239 40 -41 194 -31 194
7965 194 62 -117 -117 -239 -112 -52 88 134 237 143 31 226 -15 -57 -15 14 -16 122 136 -113 137 -185 -2
7988 -2 -11 -93 -40 110 65 161 -123 -85 25 93 -61 150 -11 -109 282 118 -56 -64 -305 144 155 -286 -14 124 -6
8013 -6 -138 14 243 173 -85 -34 -218 83 115 -167 32 21 142 -113 -12 207 -71 -23 48 -150 120 19 -147
8036 -147 193 78 69 36 60 86 17 145 -51 -4 35 70 42 86 -127 -35 -254 -6 -142 -48 62 67 7 -193 58
8061 58 -198 -162 1 -175 34 -155 -237 47 46 36 -11 35 165 15 158 45 -46 2 -135 32 -32 -68 -185 2
8085 2 -10 129 57 -184 -14 -90 44 -98 -82 71 19 93 149 188 -156 53 -79 -40 -29 88 -64 162 150 -110
8109 -110 -58 71 37 123 -126 -37 -115 172 35 -87 -233 -21 -149 -171 230 -74 -83 235 116 193 147 -163 -166 -40
8133 -40 -60 137 15 -61 -2 52 -141 169 -81 311 123 189 -41 41 14 -320 -45 46 184 -207 -63 -97 -113 83
8157 83 -4 3 25 108 -166 -23 147 -54 106 -83 -77 -112 -52 46 89 -1 100 -186 56 -50 162 -145 -39 128
8181 128 33 -102 -103 -383 -24 -72 34 347 64 65
8191F5
$$ Imaginary data points
##PAGE= N=2
##DATA TABLE= (X++(I..I)), XYDATA
0 0 0 0 0 0 0 0 0 0 0 0 0 0 8 -8 8 -8 8 -14 16 -16 23 -24 30 -32 40 -46 54 -62 70 -80 91 -104 118 -133 151
35 151 -168 189 -209 234 -260 290 -321 356 -393 435 -480 528 -583 642 -707 779 -857 946
53 946 -1044 1158 -1283 1430 -1600 1798 -2037 2328 -2695 3168 -3805 4707 -6085 8420 -13102
68 -13102 25960 -132047 -374579 109164 232046 -66724 -106792 2204 -34556 29553 110127
79 110127 -44220 -116234 109676 122569 -57003 -19345 31922 13668 105527 37563 -138602
90 -138602 -41164 119090 6769 -106685 -10275 -835 -87461 21562 37583 -139291 -30956
101 -30956 139352 -42457 -125363 72635 100081 -37921 -893 77772 -13812 -8976 109382
112 109382 1512 -92105 58494 75955 -60101 -54254 15104 24024 -4728 -47073 -47848 17910
124 17910 47585 -47697 -73978 60185 43610 -69113 11264 50702 -48908 -7302 76671 -5998
136 -5998 -75056 14827 61421 -28994 -29675 31487 -18092 -14291 45879 -15044 -41421 38010 46111
149 46111 -13286 -27108 12531 36678 23665 2554 -33141 -14233 46432 -1037 -50979 -465
161 -465 -4216 -34579 -3001 -7436 -38540 -9015 26958 -13741 -45919 27715 48753 -23400 4761
174 4761 51117 -2842 -5469 46318 35070 -8407 -14127 15014 16659 -3825 -7845 -23086 -13108
187 -13108 9275 -25940 -30177 6298 -10255 -19032 -2345 -11132 -9511 12459 17742 -7346 -14445
200 -14445 23939 18375 -9682 20495 14207 -21005 6295 24020 -1171 -13442 -203 14563
212 14563 -2917 -12986 5285 2061 3679 8355 -13600 -4851 13248 2643 286 -8420 -10604
225 -10604 6747 -1284 -14118 -11344 -3753 2793 -17456 -16532 12847 -2330 -12451 9396 6662
238 6662 3856 7846 9784 17326 8971 8869 16513 3912 8572 10775 -4533 1251 -1859 -8862 -4645
253 -4645 -16859 -12421 -1620 -19239 -17424 -5472 -4925 -5904 -12865 1260 11831 -5749 4511 14478
267 14478 2898 12430 12694 4895 8904 5581 9936 6794 -5839 4809 2275 -6882 976 -5752
281 -5752 -4726 -372 -9238 -112 -1031 -12170 1290 2215 -4966 -3588 -5645 4894 772 -11782 2407
296 2407 523 -5540 3832 -3476 -2733 5142 1222 5862 1022 1192 15953 4746 818 11123 5706
311 5706 7454 3943 -2218 7893 -1816 -6859 896 -9357 -9014 -5680 -12382 -6705 -11213 -11077 -598
326 -598 -9935 -5673 3912 -3620 3668 7425 3987 10360 5889 10109 14889 2218 8631 11380 1237
341 1237 5401 78 -2282 3014 -7390 -5719 -2393 -10118 -4788 -7364 -8361 -1935 -8418 -3638 1338
356 1338 -8351 1752 4339 -5550 2561 4069 1937 2554 -765 6788 3201 -2295 9162 1465 -2801
371 -2801 10345 2125 -568 5659 340 2626 2779 527 425 -5101 2777 2196 -12545 -2604 -1527
386 -1527 -11673 -449 -4436 -14731 -2926 1733 -3931 -9213 -635 9686 -2356 736 12785
399 12785 -1480 6237 20415 1269 -958 13331 9244 1738 1545 4615 -3743 -6260 7004 -7084
413 -7084 -17223 4995 -4820 -20861 -1021 416 -11984 -4240 2015 -5506 -7373 9165 7443 -10130
427 -10130 8644 14950 -11346 3295 19964 -568 -13 9463 -3003 -5393 13932 13872 -16057 -10678
441 -10678 18109 -1047 -12792 6718 -4946 -7587 10984 -7085 -22101 3430 16607 -9038
453 -9038 -20981 1604 1243 -7399 13481 -2627 -26649 11238 23889 -10851 -8373 13653 10221
466 10221 2695 7269 871 -5442 21051 20625 -22947 -9221 24228 -459 -11254 1442 -10410
479 -10410 -9433 8201 -2614 -26904 -10465 18016 -5352 -21677 2374 -209 -2139 15071 -5310
492 -5310 -13814 19775 18853 -11410 -5615 21675 13003 -6933 5999 3368 -9979 16107 12484 -21368
506 -21368 -5413 11276 -5862 -7347 414 -5099 -5533 4502 -6646 -24527 8335 25947 -18625
519 -18625 -22859 9151 3906 3175 8594 -10584 -9139 14995 12714 -11578 -3197 21669 4327 -8278
533 -8278 7077 -4246 2484 30103 -1197 -31210 411 22677 3997 -12566 -8268 -7080 -4546
546 -4546 9416 -8072 -24161 8381 9709 -21157 -8450 5224 -303 9025 7372 -14798 -12619
559 -12619 23740 28090 -10632 -10273 12798 5157 10158 10216 -12292 485 17099 -6233 -16839 3692
573 3692 11042 -7660 -11642 -2019 -13894 -4238 18555 -9382 -24008 4663 5144 -4370 3450 549
587 549 -4900 3577 9384 -4554 -4641 19124 7337 -13700 7858 9504 -5557 10057 7268 -11729
601 -11729 -60 12985 -1262 -12623 3196 7612 -9764 -2868 205 -15570 4002 11969 -19877
614 -19877 -14271 12810 2237 -13616 -3236 6625 -1378 2842 9586 -11307 -4595 25837 7267
627 7267 -9362 7675 3587 -496 14134 7118 -12356 -2693 16547 -3891 -20795 6990 8760
640 8760 -13865 -2633 -4543 -19384 4545 15772 -12089 -19945 3666 9298 -6160 2100 8728
653 8728 -8526 3178 15794 -8557 -2463 22311 5291 -10814 2089 8424 1015 4407 8161
666 8161 -10584 -10178 13767 -409 -14053 7299 761 -16243 -1014 4402 -8922 -4477 7049
679 7049 -5372 -16877 6088 12014 -10267 -1095 8348 -6529 2348 11680 -2199 -1133 11151
692 11151 6370 -6013 2475 13338 -328 -2478 7258 -5673 -3527 10925 -4548 -12343 2437
705 2437 1039 -9573 -6632 1686 -4907 -9153 3312 -1987 -11079 5933 5497 -8106 2864 7143
719 7143 51 2719 6422 4087 477 5846 8262 -2685 1876 8146 -3039 -114 3854 -6078 -1508
734 -1508 2605 -5182 -6217 -1677 114 -6099 -7294 2376 -3131 -6226 3705 -2995 -5026 5395 1268
749 1268 -1769 1930 3571 3542 159 3879 6212 -107 4186 4703 -1624 4861 3279 -2237 2572 14
765 14 -2267 -161 -1918 -1589 -4529 -4310 57 -5951 -4878 397 -5805 -2988 1209 -3603 -555 916
781 916 990 2529 -940 4332 5874 579 5169 4314 1717 6182 1362 1133 4439 -755 1187 91
797 91 -2908 -5 -3424 -3385 -1115 -6433 -2602 -1598 -6085 -1059 -2433 -4034 664 -1523 47 1111
813 1111 -1471 4125 2607 -210 5026 2525 2811 4685 363 3991 3770 -185 2984 299 -574 2159
829 2159 -2917 -851 -575 -4266 -242 -3105 -5009 -261 -4180 -3702 -886 -3887 -474 -828 -2247 2083
845 2083 -979 425 3587 -387 3885 4104 503 4813 3314 1963 4767 1139 1984 2467 -393 2079
861 2079 -1675 -2720 1188 -4199 -3256 -646 -6090 -2539 -1269 -4534 -2874 -2993 -402 26 -3431 1542
877 1542 1361 -965 4815 1413 136 6543 3144 1129 3628 2601 3312 1179 1097 2521 -2058 1319
893 1319 1581 -5245 -180 576 -6117 -2193 -675 -3464 -2850 -2995 -1914 -3498 -1265 2744 -4041 -2825
909 -2825 5526 -719 -944 4814 145 1640 5584 2295 168 2662 7195 1938 -3840 4107 2422
924 2422 -2448 4241 -1606 -7772 1726 2020 -5128 -5409 -1800 -1175 -4531 -1693 -1912 -6979 2850 4729
940 4729 -8874 -1728 7465 724 728 3479 149 1060 7132 6616 -3779 -598 10339 199 -3058
955 -3058 5442 -2489 -2806 6331 -3124 -9087 845 4148 -5691 -8098 1593 -1403 -7143 3522 -1996
970 -1996 -9912 5644 5342 -7872 -135 6128 -68 551 6246 1507 -3959 8437 7654 -8595 3008
985 3008 12805 -5523 -4218 6868 -1405 -2238 4563 -2820 -10482 677 7349 -8123 -8050 5815 -5356
1000 -5356 -8007 6191 -3786 -7877 8718 3582 -11310 -2535 11942 4501 -3500 4537 -209 -3868
1014 -3868 14402 7332 -11723 4043 10732 -5600 -2984 6057 -433 -4500 3542 -2406 -15088 3273
1028 3273 13458 -11446 -12253 3705 -3418 -1689 6373 -5357 -8831 5967 6789 -8000 -1952 14069
1042 14069 1147 -6037 7781 -247 -2398 15336 4642 -12954 413 11650 407 -5483 2678
1055 2678 -866 -6503 5338 -880 -14333 4405 8317 -12542 -8368 4425 -241 -2780 1208 -3022
1069 -3022 -7094 6198 9514 -9271 -3479 12590 869 -1598 6101 -1545 420 10869 2390 -8850
1083 -8850 862 11173 -2033 -8303 4942 -120 -5135 4610 -4494 -11740 4499 5627 -8322 -8067
1097 -8067 1472 1045 -3150 2244 -908 -7007 7335 6372 -9246 1624 11477 759 -2047 2348
1111 2348 1222 2583 8108 2316 -9973 -100 11322 -2888 -5687 3603 -3671 -4187 3241 -4264
1125 -4264 -7163 2804 3536 -8604 -8578 5222 2729 -3896 2556 -3582 -5970 8871 6120 -5487 677
1140 677 6251 1151 -642 4864 3475 -1321 5097 2449 -8825 3094 9745 -4499 -5461 928 -2931
1155 -2931 -2232 1614 -1898 -7620 -1723 3667 -6444 -5048 5891 -1301 -4795 2582 -1305 -1266 6475
1170 6475 3323 -3391 -360 6877 3589 -1601 4450 2571 -2525 5277 2201 -5082 2452 3937 -4090
1185 -4090 -3654 171 -691 -3349 -908 -1225 -6499 -631 2961 -6153 -2973 3256 -1753 -1216 1762 -33
1201 -33 134 3025 3265 -679 476 6097 1261 -571 5032 706 -791 4024 -136 -2435 1550 933
1217 933 -1677 -3178 -416 -642 -4169 -64 -1308 -5351 366 -401 -4200 7 927 -949 -204 74
1233 74 1439 1099 1928 3454 -702 1433 4767 260 1657 3113 -257 1161 1324 -173 -47 -348 424
1250 424 -1619 -4025 427 -1548 -3738 -209 -2688 -3351 -94 -1725 -1055 -520 -1009 749 -470 795
1266 795 2361 227 2372 2818 -183 3103 2646 922 2418 686 656 1239 -450 976 -696 -1630 529
1283 529 -2311 -2403 -164 -2937 -1713 -1400 -2802 -864 -1846 -1367 727 -1479 131 1481 -767 2138
1299 2138 1470 598 2869 880 1962 3253 469 2303 1519 247 1916 -37 -56 812 -2063 -297
1315 -297 -848 -3099 -1068 -2064 -2523 -857 -2748 -1173 -813 -2405 351 -390 -1009 1699 -82 739 2362
1332 2362 291 2605 2163 796 3014 1500 1151 2243 245 1859 919 -1562 1087 -734 -1986 161
1348 161 -2447 -2307 -1265 -2547 -1502 -2333 -2013 -157 -2294 -841 832 -1824 757 1377 -495 1706
1364 1706 1543 1096 2237 1215 2256 1984 1076 2515 344 528 2391 -1610 -970 1369 -1691 -1279 -561
1381 -561 -1729 -1807 -2093 -965 -1512 -3293 262 -714 -3146 826 -34 -1192 1676 461 -32 1406 2611
1398 2611 2418 408 1984 3344 -54 2254 2633 -1585 1660 2100 -2181 -1072 492 -465 -1963 -1991
1414 -1991 -1159 -2973 -1613 1282 -4146 -3301 2243 -1272 -2421 1126 -487 -150 2116 1178 -551 649
1430 649 4793 1539 -1962 3679 2587 -1001 3501 1106 -2656 2109 2750 -2393 -2697 682 104 -3308
1446 -3308 -860 -1082 -4942 509 1856 -6144 -2082 3325 -1726 -2633 1198 490 -378 2504 2729 -2936
1462 -2936 424 7341 99 -1873 4892 802 -855 4419 426 -2956 1916 3356 -3869 -4242 3756
1477 3756 334 -5558 285 -1872 -5738 3155 2001 -7385 -1959 3893 -1317 -3347 2362 1751 -2583
1492 -2583 3647 3608 -4986 2990 9484 -2173 -3715 4619 2233 -124 3146 357 -5063 921 5970
1507 5970 -4761 -5659 5372 -1058 -6717 1058 -1604 -4806 3052 1686 -7865 -3654 6450 1733
1521 1733 -5438 2285 1870 -3448 5007 4359 -5575 2396 8024 -1800 -3689 5027 4154 -2150 1249 1910
1537 1910 -5718 1320 7064 -6193 -6432 4454 -492 -5065 85 -740 -4314 569 2538 -6209 -3924
1552 -3924 7687 748 -6539 3203 3015 -1826 3988 2929 -3804 1373 7992 553 -5575 3522 5061
1567 5061 -2737 1500 1799 -5747 1059 5145 -5338 -5273 3156 935 -5620 -2018 1283 -2929 -9
1582 -9 3015 -6545 -3337 7507 1053 -4112 2014 1941 -525 2701 3727 -1664 -96 6750 -420 -5249
1598 -5249 5224 4633 -3019 554 -223 -3955 1537 3708 -3424 -5802 860 1579 -4826 -701 1503
1613 1503 -4174 -587 1640 -4291 -805 5567 973 -3550 101 3670 1270 2019 3603 -2011 -535
1628 -535 6427 128 -2831 3658 1796 -2143 -730 118 -906 -221 1801 -3013 -5598 1323 1878 -4317
1644 -4317 -1471 -585 -2758 689 715 -2096 -543 2439 1377 -2015 1003 3815 440 1326 2426 -1475
1660 -1475 1493 4449 -323 -1135 1306 904 -320 -1013 -326 -1146 -1221 778 -2587 -3207 765 -1064 -2361
1677 -2361 -747 -1324 -566 271 -772 -633 173 1622 1387 -1132 1301 2153 611 2708 872 -321 2505
1694 2505 1663 -51 357 198 447 -614 -1086 -424 -1526 -305 -383 -3706 -1316 -27 -2057 -457 -845
1711 -845 -1914 -171 500 20 -473 312 2099 -364 397 2635 743 1146 2551 -245 582 2427 997
1728 997 136 -155 423 -72 -1086 382 -754 -2281 88 -1349 -2567 -174 -864 -1487 -658 -1099 -556
1745 -556 -451 413 1074 -870 801 1996 -406 1583 2363 123 1717 1711 701 1284 786 1170 -200 -866
1763 -866 569 -593 -1194 425 -1691 -1750 -498 -1859 -1231 -1210 -1296 -734 -1334 -272 334 -1031 568 818
1781 818 -199 1672 973 423 1816 1081 1219 1149 624 1677 645 21 1391 -649 -212 586 -1583 -390
1799 -390 -437 -1708 -605 -1426 -1289 -576 -1877 -392 -503 -1332 372 -68 -298 1125 -1 546 1523 557
1817 557 1481 1127 867 1592 459 1078 1426 -602 791 553 -1167 131 -844 -937 -568 -1542 -767 -1261 -1740
1836 -1740 -301 -1506 -1117 -95 -1450 -597 665 -728 235 832 302 1358 672 1326 1664 450 1984
1853 1984 1260 -73 1983 829 -418 912 -183 -355 -344 -741 -370 -1888 -878 -346 -2458 -1065 40
1870 40 -1979 -936 117 -1469 -94 291 195 160 336 2012 286 344 2318 312 561 2950 193 -163
1888 -163 1877 648 -67 -35 135 -246 -1344 248 -840 -2873 331 -508 -3009 -255 -82 -1611 -246
1905 -246 -173 -901 -876 832 852 -1215 981 2560 -239 676 2207 -70 1143 2345 -41 -468 1233
1922 1233 1500 -755 -1139 1295 -687 -1607 713 -1864 -2416 1211 -803 -2862 -935 186 -973 -661
1938 -661 183 -140 -952 2091 864 -2058 2045 2923 -153 881 1470 356 1564 1913 213 -1275 1042
1955 1042 2378 -1405 -787 1060 -1640 -954 417 -2552 -1560 1021 -798 -2783 -1751 708 -58 -1345
1971 -1345 512 -977 -930 2863 546 -1462 2249 1940 303 1002 1119 1012 1114 1632 -2 -1811 1898
1988 1898 2112 -2244 -1070 -251 -1371 317 -514 -2372 -1181 269 -476 -2566 -1227 1391 -546 -682
2004 -682 79 -1441 1250 3046 -391 -1031 1500 2136 1388 233 731 794 1003 2028 -1081 -1434 2629
2021 2629 271 -1924 -483 -1104 -359 371 -1394 -2410 -874 1055 -261 -2987 -475 774 -989 854
2037 854 -361 -1684 2487 2219 -841 -226 1779 2199 408 789 1091 -263 2285 2084 -3292 -181 2906
2054 2906 -614 -1386 -453 -1483 -1074 711 -306 -3457 -1293 2513 -2030 -2901 1769 -13 -900 1374
2070 1374 -1006 -1665 2830 2966 -1197 -1620 2853 2017 -863 2523 814 -2217 2589 2140 -3355 32
2086 32 2872 -970 -2823 -161 17 -1938 722 395 -4936 -914 3530 -2270 -2566 2031 -394 -1722
2102 -1722 1611 1078 -1342 1459 3936 -1825 -1883 4525 1512 -1731 2428 519 -2052 2517 2362 -2517
2118 -2517 -1387 2528 -341 -3770 895 590 -3461 369 524 -4731 -330 3045 -2085 -3137 1220
2133 1220 1174 -1780 869 2351 -2103 1011 4447 -1369 -1365 4144 1170 -1493 1521 1451 -1107 783 2234
2150 2234 -2116 -2241 2549 -264 -3848 902 285 -2945 61 431 -2949 -1135 1607 -588 -2812 1196
2166 1196 1685 -1976 742 2552 -1280 931 3492 -773 -494 2663 1603 -1089 333 1741 -707
2181 -707 -512 2166 -1649 -1961 1789 -863 -2895 -47 195 -1860 -1140 161 -1376 -1447 1505 -66 -2549
2198 -2549 779 1589 -1427 1021 1740 -474 527 2050 591 52 1386 2069 -880 -177 1747 -753
2214 -753 -437 1147 -1204 -1497 722 -360 -1497 -866 -262 -998 -1701 339 -322 -1344 935 -40 -1283
2231 -1283 1036 925 -234 555 706 1003 173 1167 1272 -348 839 1639 -517 449 1297 -215 -430 -382
2249 -382 -554 -633 -996 -387 -1152 -1627 128 -658 -1289 69 -335 -739 253 18 185 477 378 1038 244 787
2269 787 1367 238 1118 1072 61 761 726 -43 552 -120 -246 53 -715 -13 -790 -1165 162 -979 -1016 -165
2289 -165 -968 -536 -509 -676 -2 -363 96 541 -187 619 1048 -79 1200 847 302 1099 306 703 675 300
2309 300 735 80 -77 226 -606 -554 -327 -1211 -579 -624 -1365 -428 -939 -697 -123 -726 -198 -29 -523 888
2329 888 401 359 853 202 804 988 111 1133 798 381 879 221 159 428 -328 210 -593 -813 -110 -1139
2349 -1139 -1136 -293 -1186 -746 -68 -1055 -449 -489 -261 85 -272 608 402 -44 1042 547 117 1537 754 518
2369 518 989 454 288 338 490 379 -104 -55 189 -1242 -507 -283 -1182 -593 -503 -1264 -391 -475 -771 -809 -365
2390 -365 627 -336 -305 827 41 302 1488 384 433 1643 731 279 536 850 639 88 850 -307 -918
2409 -918 898 -398 -1801 18 -190 -1113 -507 -844 -1107 -476 13 -285 -1220 184 658 -877 208 1306
2427 1306 -523 929 1494 -523 471 1869 1094 -312 324 1555 -75 -112 1032 -1033 -903 1402 -913
2444 -913 -1793 54 -116 -1325 -897 -197 -1123 -1147 1019 -600 -2231 1444 1055 -1466 387 1312 -238
2461 -238 965 1547 -106 -495 1892 1457 -1308 417 2150 -1063 -205 1310 -1499 -824 1222 -668
2477 -668 -2442 -266 939 -1535 -1616 597 -1256 -1321 1731 -541 -2175 1477 1265 -1392 -61 1824
2493 1824 235 47 2230 408 -1060 2634 2072 -1954 235 1906 -950 -507 641 -1051 -1513 994
2509 994 261 -2791 -413 1428 -1995 -1493 903 -1601 -1228 1454 -506 -1912 1014 1914 -1000 -703
2525 -703 2129 454 -363 2469 237 -1186 2413 1593 -1564 37 1967 -277 -1259 489 -136 -1804
2541 -1804 1140 343 -3508 -420 1731 -1860 -1566 572 -798 -695 960 396 -1574 613 2334 -1048
2557 -1048 -783 2486 552 -85 1942 47 -651 2066 1839 -1186 -779 1635 73 -1564 796 -120
2573 -120 -1762 640 -58 -2795 -284 1100 -1066 -1493 -33 -30 -702 638 643 -1249 724 2286 -754
2590 -754 -508 1664 636 18 963 467 211 977 1206 -1043 -1093 1599 -64 -1119 49 -777 -1127 289
2608 289 -565 -1505 -411 481 -288 -1506 -48 479 -704 575 218 -711 1028 1056 -184 -34 958 1155
2626 1155 530 248 724 443 802 862 -855 -389 545 -361 -589 -384 -903 -363 -516 -693 -792 -748 -11 -414
2646 -414 -1018 84 -41 -172 554 -394 313 739 584 754 409 590 884 511 228 582 410 687 -271 -625
2666 -625 221 -268 -192 -99 -838 -756 -384 -581 -703 -795 -369 -284 -837 31 -87 -604 633 273 -616 763 905
2687 905 429 662 474 498 632 531 753 -120 267 962 -506 -138 397 -662 -272 -190 -753 -607 -532 -224
2707 -224 -750 -818 -53 -474 -582 442 34 -182 682 198 -109 636 1101 161 -42 810 887 103 740 619
2727 619 -353 574 449 -391 -134 -20 -345 -248 -507 -370 -990 -497 -53 -1132 -637 152 -622 -412 104 -230
2747 -230 120 185 110 493 314 900 795 76 904 373 138 811 383 -260 439 -153 -188 -280 -241 -70 -915 -680
2769 -680 52 -1069 -618 -162 -853 -433 -4 -528 174 14 98 517 -119 535 361 269 783 455 110 840
2789 840 327 403 606 244 172 -266 37 87 -813 -435 -187 -930 -374 -411 -909 -151 -586 -558 -126 -593 78 -165
2811 -165 28 731 96 201 1009 178 389 636 291 644 459 115 539 180 357 273 -479 284 -300 -807
2831 -807 -103 -477 -740 -396 -573 -633 -639 -471 -39 -457 -80 444 -396 77 542 -196 333 565 253 745 477
2852 477 741 321 216 730 213 -6 783 -184 -259 400 -526 -379 -176 -613 -436 -519 -395 -566 -685 -160 -127
2873 -127 -519 289 97 -48 577 411 -94 342 497 639 273 543 734 101 461 585 -627 330 362 -607
2893 -607 -149 -175 -565 -643 -486 -374 -941 -736 147 -589 -729 290 -532 -505 457 -246 105 543 478 118 58
2914 58 921 504 78 508 376 -190 969 574 -555 491 188 -389 -536 -467 -78 -411 -385 -189 -1060 -149
2934 -149 392 -1131 -563 244 -501 66 197 125 296 444 757 31 -124 1004 396 -51 989 275 20
2953 20 591 88 -374 289 302 -231 -810 -196 -196 -729 -45 -498 -1407 109 37 -1220 -319 182 -64 95 39
2974 39 373 12 675 819 -313 798 1388 272 192 716 83 337 659 -200 -893 -137 561 -734 -1019
2993 -1019 195 -376 -593 127 -1003 -875 453 69 -783 -18 248 298 112 565 286 -263 1218 895 -680
3012 -680 635 1160 13 367 209 120 125 452 -100 -1010 226 599 -1209 -659 316 -842 -288 20 -1097
3031 -1097 -714 92 57 -800 -323 926 -140 -245 819 -262 18 1489 297 -535 936 961 -269 5
3049 5 733 142 -302 933 -7 -1194 414 377 -1291 -400 191 -801 -581 49 -858 -760 358 335 -1164 -7
3069 -7 1105 -250 36 936 -286 239 1502 586 -430 339 1309 53 -456 908 -193 -390 838 -597
3087 -597 -1206 430 -6 -1153 -605 81 -563 -731 160 -518 -996 426 598 -1323 279 992 -225 -158
3105 -158 675 201 3 902 508 -617 517 1563 -64 -103 1153 -446 -120 522 -494 -975 253 118
3123 118 -736 -702 314 -538 -966 72 -530 -872 687 273 -798 310 899 201 -28 662 240 123 1041
3142 1041 840 -559 895 1005 -461 203 362 -257 -402 353 -425 -803 -79 352 -1027 -752 166 -577
3160 -577 -619 459 -447 -610 429 75 -296 199 572 348 -273 904 519 -6 1115 486 -135 537 570
3179 570 14 -88 368 -13 -474 10 -54 -632 -288 368 -1007 -668 33 -564 -297 -94 -262 -271 132 221 -141
3200 -141 -59 719 390 -66 793 226 225 580 73 393 313 479 16 -462 28 22 -554 -36 123 -967 -119 -234
3222 -234 -759 -201 -424 -284 -338 -503 -28 -152 -12 593 9 -70 703 119 61 587 173 363 467 316 295
3243 295 -101 170 406 -214 173 -190 -648 -237 -476 -629 -144 -512 -301 -258 -219 -64 -442 -67 307 -183 146
3264 146 345 -255 431 414 218 435 311 409 597 283 242 25 38 392 -126 -113 27 -263 -147 -3 -768 -349
3286 -349 -384 -165 -341 -517 -162 -24 -318 333 -19 -62 271 322 99 577 339 538 314 361 607 94 336
3307 336 363 -27 234 451 -153 -53 -80 -326 -332 -553 -391 -341 -590 -46 -288 -446 -281 -326 -252 109 1 272
3329 272 124 224 666 155 395 443 80 299 207 -23 336 145 44 375 -54 -89 -141 -443 -201 -368 -148
3350 -148 -357 -564 -443 -198 -495 -57 -193 -398 -4 53 361 180 376 247 448 205 575 -98 115 627
3370 627 89 155 372 -126 100 145 -290 -101 -435 -110 -203 -384 -160 -278 -642 -321 -291 -417 -19 69 -179 -234
3392 -234 81 -3 33 113 762 39 667 624 -9 301 547 73 69 329 -125 -13 -194 -63 -442 -197 58 -598
3414 -598 -557 232 -521 -447 -85 -125 -224 126 -42 -359 -87 603 281 -400 822 456 106 700 571 -171 483
3435 483 394 26 -54 267 487 -379 119 46 -629 -142 183 -847 -492 96 -532 -442 -60 -149 -309 119 79 -382
3457 -382 116 775 293 -82 507 382 231 654 180 183 202 484 150 -180 479 148 -438 -303 -2 -728 132
3478 132 132 -687 -388 59 -201 -557 -34 130 -186 62 255 -361 339 867 -72 169 727 318 61 452 472
3499 472 -90 565 676 -167 -418 592 -296 -250 217 -290 -388 24 -424 -662 -348 278 -141 -591 96 -119
3519 -119 -311 268 -2 -509 184 792 -108 121 423 223 -11 194 207 -57 639 850 -691 -107 530 -151
3539 -151 -187 63 -435 -490 13 -110 -868 -629 377 -357 -659 120 -34 -333 322 -201 -231 526 643 -65 -107
3560 -107 586 634 -141 845 167 -337 528 415 -745 -43 343 -202 -430 -280 26 -785 59 307 -930 -372
3580 -372 323 -567 -297 -23 -318 -237 365 176 -237 253 818 183 -26 711 179 -172 668 203 56 611
3600 611 331 -483 -454 433 -157 -778 167 -263 -656 -130 -56 -924 -391 372 -502 -277 179 199 -148 310 512
3621 512 -178 419 993 -56 -36 749 449 47 394 179 -297 49 268 -362 -207 382 84 -469 -36 -220
3641 -220 -334 -135 -406 -482 -348 91 162 -372 197 458 -259 304 500 -210 354 780 137 32 614 511 82
3662 82 295 190 59 -83 152 -177 -449 347 -245 -682 -177 -263 -270 -90 -341 -158 -310 362 -28 -430 322
3683 322 509 158 260 288 37 361 390 39 79 358 639 69 88 271 -12 -120 80 -86 -358 -13 -408
3704 -408 -355 -365 -209 -531 -365 126 -288 -508 108 18 -118 437 302 -61 308 192 317 158 359 473 174
3725 174 444 473 -28 115 70 -261 106 37 -274 -288 -285 -391 -442 -275 -135 -241 -541 -32 -352 -131 167 -68
3747 -68 102 276 187 246 327 371 441 366 482 289 -57 411 99 188 273 -119 15 -29 -286 -146 -261 -31 -32 -411
3771 -411 -360 -53 -490 -32 -92 -279 239 -216 -196 211 -2 26 300 699 260 173 437 201 181 447 512 -37
3793 -37 300 53 57 149 -53 -218 -26 -188 -211 -446 -449 -70 -197 15 40 -339 -202 189 -99 47 253 370 236
3816 236 87 259 313 -63 477 468 32 577 -102 151 28 -113 -73 -152 -458 18 -517 -234 -75 -357 -196 -132
3838 -132 -318 -104 -104 -55 -8 -159 207 136 49 369 52 134 325 175 272 296 106 166 302 -7 158 83 -14 96
3862 96 -189 -19 5 -445 -29 -220 -224 -213 -426 -189 -242 -147 175 -75 -29 187 284 275 190 -91 114 373 22 170
3886 170 56 323 -56 62 310 55 -307 70 -83 -439 -119 -249 -437 -360 -296 -360 -288 -36 -158 -230 391 209
3908 209 -184 -17 345 -175 421 277 208 106 370 427 332 -67 396 -238 -24 307 -284 -149 142 -452 -236
3929 -236 29 -209 -187 -139 -227 -309 -367 30 -138 -440 256 300 -308 119 271 49 246 319 225 302 370 372 -42 142
3953 142 254 -135 59 65 -476 57 224 -20 -574 -364 -19 -428 -189 -4 -390 -99 298 -173 -253 300 252
3974 252 24 153 202 193 133 379 93 -319 503 224 -589 342 268 -335 202 -26 -413 -412 201 -148 -600 -67
3996 -67 90 -561 -334 115 -428 -194 518 -323 -196 20 194 23 -105 346 113 116 671 -77 -13 531 329
4017 329 -71 98 193 116 -206 5 -281 -292 110 -218 -547 -94 435 -282 8 20 -163 -151 -192 -181 -210 270 421
4040 421 -265 156 461 69 144 639 123 69 509 427 201 28 198 81 -334 -74 -11 -370 -193 -144 -572 -156
4062 -156 -78 -229 -142 -96 -149 6 203 201 -157 291 351 83 -47 353 93 304 274 104 267 66 390 -40 -142
4085 -142 378 93 -187 95 -133 -292 59 -195 -271 -122 -242 85 -308 -550 -180 -146 -33 62 12 253 321 167
4107 167 169 244 413 238 -60 87 37 175 123 -60 -61 143 -159 -156 -271 -459 -17 -331 -237 -227 -281 -51 21 -4 -149
4132 -149 -218 57 98 -132 143 290 41 183 335 128 330 413 34 -21 284 310 31 -21 269 -229 -112 -122
4154 -122 -435 -505 -158 0 -239 -235 -133 -94 -57 -85 -99 -168 294 -34 76 531 268 240 304 282 153 -25 451 310
4178 310 -171 114 383 -231 24 91 -153 -290 185 -475 -556 -217 -146 -411 -428 257 -375 -483 112 -143 -137 108
4200 108 -20 -140 155 203 222 22 313 319 128 312 81 -6 320 376 -71 -23 -64 -217 -346 -194 -297 -433 -146
4223 -146 73 -278 -172 157 -280 128 4 145 -198 286 270 261 -143 154 289 -38 101 172 25 202 162 -235
4245 -235 121 -53 255 117 -161 -57 -411 -274 13 -261 -251 44 -250 -129 63 -152 36 52 61 -254 -18
4266 -18 191 153 192 640 210 -13 443 176 -119 -83 -72 -92 36 -21 -276 -144 -185 -185 -257 -133 -113 -220 -291 -206 -205
4291 -205 -244 -107 -2 -150 151 294 149 -62 249 281 245 424 71 254 216 22 18 485 295 3 -264 83
4313 83 -138 -234 -77 -64 -354 -251 -283 -204 -83 -269 -21 -281 -43 218 -14 87 79 -96 296 164 -180 317
4335 317 240 228 249 142 14 181 -99 200 20 -10 123 64 9 15 -450 -75 -209 8 -95 -380 38 -251 -222
4358 -222 92 -167 -112 -15 51 -101 165 306 171 173 204 93 116 254 120 -62 -32 243 -72 -132 -159 -176 68 -246
4382 -246 -176 -178 -259 87 -42 -296 113 -346 -58 163 77 66 -32 218 74 352 281 258 93 384 -58 127 185
4405 185 230 -20 168 -36 -239 -89 -110 -220 -266 128 -98 -343 -41 -59 -364 -162 -167 -228 -96 162 95 37 107
4428 107 350 90 -57 320 111 -30 338 289 278 410 -30 -40 339 -83 -76 -146 -70 -246 -171 -61 -207 -128 -132 -188
4452 -188 -267 -6 -103 -176 22 1 141 156 195 201 66 242 126 97 41 193 -151 -11 200 43 -106 196 -66
4475 -66 -162 -13 -10 -73 -167 -12 -452 -514 166 -321 -163 41 -166 -1 -92 85 42 328 265 191 -219 330 269 132
4499 132 178 212 -49 188 145 -146 -260 170 -206 -360 -32 -162 -365 227 166 -386 63 101 -179 -80 37 294
4521 294 -40 140 515 -263 -49 493 -251 188 541 239 -14 277 193 45 315 216 -36 -410 213 17 -393
4542 -393 -104 -270 -450 129 -18 -157 -266 138 -14 -398 -1 82 -64 75 346 -301 261 607 175 -66
4562 -66 303 70 -221 195 366 -113 -147 417 -274 132 214 3 -186 -191 -47 -308 -162 24 113 -324 448 104
4584 104 -485 390 367 -236 333 110 -123 82 401 523 -154 455 464 -46 -155 272 -176 17 177 -118 -399
4605 -399 -124 62 -635 -334 160 -407 -537 -16 -19 -382 482 -89 -229 -59 238 -75 356 355 65 -318 483
4626 483 363 35 235 282 -102 47 212 -112 -229 -42 -60 -202 -108 146 -206 -152 108 -315 -457 113 -136
4647 -136 -232 -29 159 -375 -53 214 92 46 333 368 105 149 418 43 154 190 89 34 212 -62 -258 -34
4669 -34 -7 -385 -100 131 -459 -331 43 86 -186 -44 179 -280 -10 165 -15 53 403 -36 -109 342 175 107
4691 107 178 112 -54 291 237 48 23 -17 159 -3 130 -94 3 47 196 -117 55 -101 -243 -84 -360 2
4713 2 -291 -321 -196 -53 -363 236 235 -135 57 134 273 136 248 255 41 282 364 0 106 142 24 -219 -194 80
4737 80 -4 -41 -146 -290 -237 -12 -182 -69 77 55 31 215 161 -28 75 253 207 -147 267 237 -89 92 -199
4760 -199 -78 218 93 -123 -52 -99 -223 -147 -261 128 -208 -209 38 -30 -191 -62 1 -39 209 146 182 -59 8 79
4784 79 56 187 114 -118 198 297 58 85 -125 211 251 107 -21 -125 -64 239 -239 -3 -391 -127 -4 -173
4806 -173 -148 -263 -88 -33 -98 -99 157 -292 19 -16 19 23 222 351 243 37 236 153 42 -25 156 -89 -83 51
4830 51 -122 -115 -313 -177 8 -349 -211 -155 -424 78 -101 -7 186 -65 108 17 -172 57 54 63 140 202 319 183
4854 183 135 186 303 -93 58 15 -253 -38 11 14 26 -325 -44 -54 -301 -224 53 12 -182 -286 10 -95 -156 281
4878 281 -118 300 210 452 88 105 -114 336 132 -20 256 68 111 -134 -236 84 -16 -505 103 -266 70
4899 70 28 -532 154 -246 -324 236 -136 59 71 -52 299 183 -19 96 138 86 121 88 53 177 192 -49 -62 46
4923 46 -65 -8 -8 -39 -35 -145 -142 -202 -108 -173 -29 -122 20 -115 -164 -148 40 15 -116 379 3 -7 57 -41 39 149 242
4950 242 49 47 19 -184 20 89 92 -109 137 128 -112 36 52 -168 -212 -101 -126 -194 -181 -139 -14 52 112 -248 198
4975 198 328 -282 411 195 52 -34 80 300 56 65 51 -151 -26 -23 -116 -42 -99 -119 -82 187 -59 -11 -248 -231
4999 -231 -102 -183 0 76 -88 24 84 -117 34 153 59 120 160 78 127 117 414 26 -7 312 -227 -185 261 -114
5023 -114 -79 21 -247 -18 -23 -114 -215 -219 -62 167 -300 -188 229 134 -47 73 294 83 361 -71 20 17 432
5046 432 -39 60 -54 -85 258 221 12 -203 -80 -2 -26 60 -157 -106 -199 -53 -202 -179 24 -174 4 -76 39
5069 39 273 88 152 1 68 352 7 73 6 393 238 137 65 71 181 243 101 170 122 116 -185 -308 -180 -49
5093 -49 311 -229 -135 -80 -24 49 -114 -21 244 -94 48 12 156 -62 38 253 60 301 135 171 36 -150 47
5116 47 -12 21 193 -135 -339 -153 20 -301 -213 101 -36 -168 -286 -109 -186 -16 -135 -25 133 -107 396 -261
5138 -261 -196 150 53 -119 223 146 10 82 151 -99 46 -77 294 89 52 60 -123 53 -67 -437 -274 -81 -166
5161 -166 -32 1 -200 20 71 -58 -231 -26 115 -6 74 129 108 86 202 336 85 -14 192 -30 -55 126 54
5184 54 -143 143 -63 93 34 -167 -507 -21 -110 -2 -106 -168 61 -34 75 177 -145 -224 139 -118 277 271 -18
5207 -18 56 156 158 191 -41 328 63 94 76 -147 74 0 144 -193 -1 -104 -45 -137 -24 -200 -219 -88 208 18
5231 18 114 -43 119 70 69 28 216 276 13 124 -107 219 48 141 -5 40 -44 23 -15 -104 -196 -8 5 -131 -55
5256 -55 -100 -342 -100 -52 -55 -11 -112 222 21 41 311 128 132 251 -51 261 230 -34 28 106 -173 82 264 -242
5280 -242 -178 146 -200 -99 -226 -83 -22 -272 -126 -96 31 -188 45 -215 -278 -86 -304 -12 -35 -6 21 145
5302 145 54 -16 213 -42 230 69 210 47 328 235 110 -131 -80 133 -149 -378 18 -96 159 -64 -151 137
5324 137 -15 -88 -53 -248 176 36 -132 41 -220 9 376 149 -119 227 69 75 296 25 -15 -20 74 -308 -226
5347 -226 -200 -159 -400 -118 48 -349 102 10 63 -46 -178 -132 -177 128 116 -161 -131 130 123 94 74 130 -35 -32 -7
5372 -7 81 91 119 137 -237 12 9 -244 -17 -209 -50 59 -89 -196 120 -107 -155 126 140 280 -191 1 -157
5395 -157 279 124 89 128 39 -7 -86 -182 9 169 163 -93 153 81 -51 19 -21 -192 -11 -5 -37 -69 -144 295 -25
5420 -25 -65 -25 90 194 50 85 7 -237 -30 240 34 -108 -102 -70 60 215 44 273 247 -2 58 38 96 164
5444 164 -19 81 -145 -237 12 17 -279 -107 -201 73 -95 -210 190 94 -38 209 37 135 44 173 16 -98
5466 -98 54 79 170 126 229 -139 -27 25 -5 119 -20 -46 -136 -29 -113 -182 -77 -202 -208 -272 107 -382 -341 7 55
5491 55 481 112 139 -10 165 151 83 -52 322 56 192 189 128 81 -102 184 -97 -78 -35 -77 -179 -136 -103 -123 -126
5516 -126 -5 151 43 -86 -143 -17 -236 114 124 -19 81 -105 211 88 -176 -120 32 -117 -42 144 -143
5537 -143 -22 -19 -120 -96 -206 -52 145 -202 -382 75 4 220 -83 -113 -167 136 27 -220 5 -162 19 166
5559 166 92 134 375 194 184 414 -50 -195 -181 -27 154 -97 222 157 -113 -102 -6 -71 -62 -76 -149 -230 -116 -128 -77
5584 -77 -46 212 -118 -5 200 69 -114 21 84 -72 233 -5 79 67 -49 17 19 -5 -124 138 -6 9 283
5607 283 -114 85 -8 -60 -27 -15 -99 -5 -107 -98 117 115 -207 104 29 87 -89 -25 403 206 112 115 -78 -113 161 -84
5633 -84 -101 0 -89 -81 -172 -266 13 165 -42 -289 -7 -145 -41 -213 98 -105 -120 78 150 -133 124 -76 16
5656 16 201 -41 133 170 259 100 207 61 24 -218 -153 202 -209 223 -56 -81 188 -97 -96 -76 -251 132 -6
5679 -6 -271 -76 -40 -210 -67 -263 26 -155 158 -128 99 148 145 181 -106 96 148 208 59 -71 63 21 -18 120
5703 120 142 20 -230 1 -67 -28 -201 -64 139 -252 -118 179 -71 -141 91 30 -85 191 -47 -113 150 87
5725 87 -32 275 -97 326 163 -94 447 -63 -39 12 -56 -440 -61 -393 -91 -176 47 -41 106 -63 -154 19
5747 19 -158 -14 104 196 -43 -3 163 34 7 85 112 -12 217 150 -202 -11 -206 -36 -120 -4 -113 -114 -13
5770 -13 -144 -234 42 -61 103 62 -233 34 12 -75 97 155 41 -23 234 291 256 -8 209 20 5 210 10
5793 10 109 -73 -96 -30 -168 -50 -152 -16 11 -34 -86 -290 -270 -89 -130 -135 -47 -35 -44 255 70 -313 37 119 105 292
5819 292 -3 -2 -96 40 5 -99 -50 93 -45 -250 108 -250 -120 -76 -429 -153 -98 -84 -131 -281 -98 28 111
5842 111 50 -60 -241 27 -23 -11 -56 180 256 42 167 91 46 48 41 -167 -15 92 195 89 -144 -223 -242 150
5866 150 -49 48 14 -1 -203 -34 -118 59 -176 -82 -102 206 16 38 144 -34 275 441 5 242 173 64 142
5889 142 -111 -204 -39 70 -155 -60 -63 86 171 -60 -48 -372 -336 -70 -115 -104 -5 9 -146 -188 -57 129 34 -7 -225
5914 -225 79 380 135 156 102 128 -91 355 172 -127 84 41 34 19 -212 -104 -237 -46 92 -21 -171 -68
5936 -68 -231 139 -220 -64 -101 -217 377 -42 113 -42 1 38 -12 120 179 -141 -68 -40 49 132 -54 80 -4 85
5960 85 -74 -164 46 299 -114 -50 -92 9 -242 45 -37 -278 139 13 -53 -126 -257 92 -120 -30 59 -1 -177
5983 -177 3 -188 73 111 59 -250 -120 -76 -68 -300 -112 -71 -207 -134 119 -261 -149 -150 64 -85 -102 54 70 -135
6007 -135 -269 -17 229 -10 -140 117 44 230 83 253 -161 46 282 99 -12 -290 96 135 -128 102 -325
6028 -325 -266 -163 -26 -11 35 -154 -215 -286 148 48 -31 94 36 95 109 355 164 23 -30 194 -41 -127 73 182
6052 182 189 232 -92 -96 68 6 -58 88 -73 -272 73 107 39 -271 197 58 -173 204 -228 -233 -141 -162 -274 168
6076 168 120 -26 257 -30 176 18 461 214 65 15 47 200 -199 144 -26 -56 -257 -69 -10 -125 16 -128
6098 -128 -50 368 -108 125 -32 84 218 80 60 76 78 202 26 -55 38 320 172 229 15 40 29 -161 -105 -237
6122 -237 -78 -197 -225 -134 -194 33 81 -167 -61 -99 124 197 -40 -6 74 108 -63 33 87 190 27 143 -83 -247
6146 -247 -42 181 -48 -23 -301 52 -104 -1 -244 -145 139 -173 -263 -140 -80 60 -43 -127 7 -96 41 192
6168 192 114 -25 246 -120 25 36 -32 80 -10 250 -39 120 -21 -166 -169 129 75 3 -100 -159 62 -184 -120
6191 -120 46 -119 3 -234 32 90 196 -46 87 10 -26 259 27 168 166 45 -165 147 138 316 163 66 232
6214 232 70 -38 10 153 165 -91 -142 56 17 -324 90 -220 66 -188 -82 -59 -259 -252 71 60 70 116 375
6237 375 46 65 200 81 -40 28 -22 53 279 13 -31 95 -177 126 -129 -93 92 -208 -282 109 -51 -233
6259 -233 -182 -99 116 -6 -35 224 -76 9 57 -75 198 76 134 143 334 -112 110 3 244 -2 22 -67 128
6282 128 -236 48 -82 92 90 53 124 -192 -44 79 105 393 78 119 -269 -73 28 33 155 -9 245 286 170
6305 170 2 -3 282 -22 -49 -22 -223 71 -180 117 -129 -198 -108 92 96 -106 -265 -98 -115 -114 -86 200 39 -55
6329 -55 25 -13 29 -234 72 -32 230 249 114 -215 83 181 -24 -60 119 -70 60 27 178 -61 -36 3 -256
6352 -256 -64 57 -98 -47 217 -347 52 90 34 184 141 143 -43 -203 186 223 54 -58 -98 27 66 -119 -59
6375 -59 -148 74 -63 123 56 -6 16 -200 28 202 -128 -83 -43 55 84 -299 110 28 -3 -101 185 67 -91 58
6399 58 -136 262 85 -70 123 -93 52 357 320 -19 36 -156 79 -110 46 60 -92 142 -271 25 -134
6420 -134 142 -54 102 23 -118 -212 244 -70 -146 77 147 -132 25 -291 -97 121 205 36 190 -105 -232 -15
6442 -15 -108 -268 -233 -117 -339 -124 -222 -119 -206 -62 -172 -252 -152 -238 79 -227 30 -27 10 43 -48 43 -14 134
6466 134 -2 -38 89 85 46 57 -34 -20 -191 -8 -118 -188 -153 -126 -416 -119 -37 -129 -47 -59 -75 -161 -143 58 149 214
6492 214 157 -258 201 92 103 121 103 287 0 -54 109 341 -188 131 -14 -35 -272 -72 50 92 -28 -18 -93
6515 -93 -17 -32 -249 245 -85 68 155 197 -7 -120 0 -103 88 2 -57 -149 143 -140 -59 45 -88 49 192
6538 192 65 101 -208 84 -101 -151 -269 -226 -91 -97 -161 146 -69 -272 6 132 80 118 13 204 -173 -74 38
6561 38 -35 -9 -70 17 68 113 49 -89 38 61 -97 -62 -333 -248 75 -58 129 -27 39 -130 -239 -61 47 -172
6585 -172 15 253 -23 -284 -184 -43 34 -9 34 81 25 109 152 -173 297 14 156 7 42 101 -156 21 25 138
6609 138 -2 -394 -94 -185 -113 154 -34 311 -127 114 70 -80 -12 -67 197 -139 1 69 0 30 94 334 -19
6632 -19 -11 41 -9 -61 101 249 112 267 97 51 75 6 58 -112 145 -32 -250 65 -36 69 78 -70 -53 169
6656 169 63 116 107 264 -13 -222 72 138 -120 223 310 32 -115 -73 -164 1 -11 -185 -74 93 -151 -14 8
6679 8 99 -131 -204 -113 95 107 -88 66 -89 118 -188 -110 157 274 195 135 82 102 -42 -46 261 47 -80 105
6703 105 262 -273 104 -140 -237 165 -111 -273 -21 111 35 166 98 -44 -83 37 -107 -61 72 176 233 -135
6725 -135 88 95 -113 14 -183 -159 -54 32 -69 -65 -95 246 -54 56 44 -100 9 -83 46 -252 -170 -66 -342
6748 -342 -10 -115 27 46 -86 27 32 146 197 134 165 134 20 -95 143 -161 -106 191 64 -208 1 -5 -85 -211
6772 -211 85 46 -15 -56 -82 -98 -189 55 -26 -129 11 -220 -129 221 93 -119 -99 6 104 129 16 172 -26 38
6796 38 -68 -66 14 129 46 -84 57 -201 -146 -175 -127 -195 -8 -87 -61 -79 -94 131 -40 547 -128 10 185 -106
6820 -106 -22 12 262 9 -96 150 200 -236 125 25 -156 -20 -14 -243 174 -227 -224 47 -13 -107 -6 114 -114
6843 -114 160 42 95 85 54 153 86 -65 55 -38 256 10 -44 227 244 115 135 -205 128 -140 18 11 90 165
6867 165 57 47 -119 -136 61 -63 110 -68 -106 31 -63 -154 -144 165 -77 99 127 59 192 290 -83 261 284
6890 284 63 -201 -131 -30 306 73 -91 -30 -135 116 -108 -22 -4 -109 -149 -40 -6 -117 -53 71 -1 -75 -129
6913 -129 -71 164 209 88 272 -127 189 -147 1 12 -115 -241 190 0 -45 92 -89 49 -5 -131 107 118
6935 118 -232 -18 3 -186 -414 -73 51 -112 197 -172 48 -195 -155 90 193 131 -12 139 237 117 5
6956 5 -54 171 16 -112 126 -139 37 139 39 -2 -7 -357 -140 -132 -162 -85 265 -9 -185 -124 -46 164 243 123
6980 123 190 6 -12 147 34 178 -96 -65 23 69 6 -178 53 75 -143 -156 149 30 64 156 -49 -212 -130 -125
7004 -125 168 173 144 116 8 42 -68 -79 -8 39 -12 210 112 -91 146 49 -240 71 -127 22 -26 1 -250 -239 201
7029 201 -180 -214 -252 9 -149 42 -76 137 -321 86 138 10 22 118 27 37 -95 -96 -200 408 6 -146 -20
7052 -20 233 168 130 38 47 104 -172 166 -168 190 -311 -97 -110 -125 -82 -191 8 -142 78 67 -20 137 25 111
7076 111 82 -21 23 164 107 146 -77 128 86 -132 -171 -130 -96 -34 -83 -143 -165 61 38 -29 183 31 -58 -93 -93 6
7102 6 146 196 -74 -16 44 -88 -195 244 335 -55 -152 0 -143 139 -145 78 191 -42 90 6 51 120 -33
7125 -33 -6 -38 -168 105 75 -34 -84 -79 -287 -161 101 103 -10 -101 28 17 80 -11 50 100 -23 57 -95 -21 -83 58
7151 58 5 141 -48 -174 -206 -182 -185 -91 -38 -131 74 -175 -59 -191 -102 -122 -275 -92 214 80 -131 -26 164 -172
7175 -172 305 -37 102 -67 -27 182 31 -20 -52 -11 -137 -69 -123 19 -16 17 -63 -139 -136 -189 -66 -140 -71 -28 34 1
7201 1 -1 -34 22 -201 184 27 154 128 102 73 -17 -89 -198 50 223 -160 -75 109 12 -66 53 1 -228 -12 47
7226 47 -76 -25 -104 274 -355 19 -53 -95 167 -87 94 141 378 -114 -73 32 224 198 8 158 189 75 -134
7249 -134 44 51 -23 -59 -39 126 -58 -53 -2 -208 -10 21 14 -150 -6 -264 -62 0 13 -91 41 60 -106 -16 -17 186
7275 186 223 -63 321 -84 81 31 -79 -126 92 -183 33 2 -121 -50 -80 -133 17 -21 47 -91 -55 -153 193 95
7299 95 -153 179 11 25 -231 -70 -108 -99 190 230 14 -132 41 195 -192 45 -119 11 -241 226 10 -146
7321 -146 -75 -56 -80 -329 -42 -99 -43 -185 -117 -24 102 -9 11 -99 174 241 16 16 -68 28 -249 171 355 -293
7345 -293 117 -157 15 -39 45 142 -58 18 -15 -14 -96 -215 -55 108 99 11 214 -27 -76 102 60 192 60 3 -368
7370 -368 34 -109 162 96 70 23 -93 -93 239 110 -248 -135 134 -146 -32 -21 10 -146 -295 -108 -85 -153 286
7393 286 47 -91 -42 -196 -170 255 87 121 -105 -153 17 110 68 0 -45 -77 211 244 -86 -98 -11 -119 -174 -329
7417 -329 -2 -139 -130 20 -92 -43 -83 85 180 226 -86 72 -27 -76 25 0 215 -33 277 122 -49 4 -38 -73
7441 -73 -61 -87 -95 66 -27 58 158 42 -155 18 124 64 -323 61 3 23 133 -180 -124 -66 -166 87 -106 105
7465 105 -25 -79 35 40 66 123 180 19 205 30 201 3 -118 -103 -3 80 151 -163 11 -80 1 -214 -132 -67
7489 -67 -179 -127 -385 -109 236 -20 -209 -35 -62 257 80 -81 -150 -146 185 143 -2 108 75 90 49 -77 -83 13
7513 13 -161 -56 -56 62 -31 -34 -163 54 -56 28 105 10 161 177 -75 67 28 155 32 98 -7 -61 -165 173
7537 173 285 -74 -38 -271 89 -131 -225 -189 -111 -138 109 -206 -30 -203 -188 117 11 -23 -109 -241 -190 6 30
7560 30 87 26 80 187 59 -90 265 47 10 146 -65 -129 -73 -82 216 -6 -44 46 -51 -101 -7 28 -68 -305 83
7585 83 130 89 166 19 -11 -78 329 98 29 97 251 21 -1 263 101 -17 328 14 -74 -26 -157 130 -93 -51
7609 -51 77 208 -286 -131 199 -59 43 -50 -39 -227 217 155 67 75 74 -10 82 134 108 96 234 -14 307 -28 65
7634 65 -49 -4 -120 167 51 -206 -85 -25 -58 64 30 117 4 -32 158 169 -94 64 7 -337 104 -44 138
7657 138 176 144 21 61 137 -300 207 190 -6 181 98 44 28 -42 -164 -3 212 1 -51 19 19 82 -38 -109 35
7682 35 375 -183 70 -59 131 -96 -204 -103 -222 -52 -16 2 -150 54 34 16 60 -37 71 102 -47 -195 -71
7705 -71 184 -204 50 -259 21 2 38 -5 136 102 -55 43 -279 -91 116 -194 -103 42 134 70 113 -109 -71 152
7729 152 351 -177 -56 -100 -35 95 -58 -13 -66 -21 42 -99 60 -126 -205 -7 -61 75 -223 106 -59 -56 248
7752 248 -87 -16 19 -13 44 -117 114 46 -116 -33 -11 -40 -71 -104 113 -142 59 110 79 0 -96 64 151 -232 170
7777 170 62 41 -105 -205 -60 27 -146 35 48 -85 30 24 34 25 19 69 -129 -92 114 -39 76 125 -143 113
7801 113 -24 -225 36 246 -196 -120 60 -84 99 220 -159 209 -271 -171 394 -267 -139 -136 67 158 348
7822 348 153 58 144 -255 288 56 -68 -142 -235 83 159 32 60 208 -330 -29 -230 -11 -31 39 91 -442 -202
7845 -202 -52 138 -133 -91 -127 112 62 -74 51 48 -121 1 -7 -110 -56 33 -222 -83 -48 -154 28 -49 117 30
7869 30 40 -13 44 -36 -64 97 39 270 -1 -13 146 -7 -42 -211 -122 -125 73 135 83 -103 3 57 28 311 220 86
7895 86 -99 22 -280 95 12 -65 202 -35 47 51 243 -22 -91 2 5 -54 65 108 29 149 13 -79 -71 -71 210 183
7921 183 81 -127 130 -102 137 145 129 -79 116 -81 -202 -248 -355 72 13 -139 -188 -82 127 -114 -150 -152 -77
7944 -77 132 -76 -44 74 -58 24 -23 -57 -57 112 219 -49 138 -22 -147 -35 99 193 -131 51 219 -44 169
7967 169 12 -26 -78 32 -164 59 328 177 152 -107 -194 206 -178 29 226 154 -191 109 -113 24 102 -424
7989 -424 122 75 -144 -8 -112 -130 -119 -170 -97 136 8 4 151 4 8 -51 -35 -3 -28 70 -78 46 -22 138 402
8014 402 -76 139 307 -54 -203 167 23 -60 -112 105 96 102 -53 -308 -298 262 -157 -126 -102 -31 -155 -190 -298 132
8038 132 -62 38 -116 -151 -108 195 -27 -42 -68 -60 -66 66 195 104 52 80 200 -38 28 -99 11 -345 41 -99
8062 -99 -21 -30 -156 125 -44 -108 13 -98 -30 241 134 -60 145 -250 -360 -153 23 -41 163 10 -66 112 -108
8085 -108 -22 -134 200 4 34 -220 223 -105 -36 34 8 -44 13 79 -74 -41 -244 -121 -61 -116 -63 -129 192 -26
8109 -26 3 -19 -29 -101 91 123 122 90 77 -69 201 98 -68 -132 4 13 10 36 1 -268 -39 -27 231 116 17 -33 -89
8136 -89 163 61 16 17 103 -57 60 14 -188 3 -163 -24 24 -25 -191 4 11 -47 -210 -213 -66 76 -397 28
8160 28 -3 210 72 -276 181 41 -181 182 66 -166 2 -184 -11 -63 -32 16 243 -66 78 125 -112 -26
8182 -26 -148 -273 85 -180 179 -259 6 72 -89
8191h9
##END NTUPLES=NMR FID
##END=
