##TITLE=1H_Pr 111
 CDCl3
 8 sc, 
 8.04.2022
##JCAMPDX= 6.0         $$ Bruker NMR JCAMP-DX V2.0
##DATA TYPE= NMR FID
##DATA CLASS= NTUPLES
##ORIGIN= UXNMR, Bruker Analytische Messtechnik GmbH
##OWNER= root
$$ XWIN-NMR		Version 3.5
$$ Fri Apr  8 11:23:24 2022 Russian Standard Time (UT+4h)  she@DPX200
##.OBSERVE FREQUENCY= 200.13135
##.OBSERVE NUCLEUS= ^1H
##.DELAY= (6, 6)
##.ACQUISITION MODE= SIMULTANEOUS
##.ACQUISITION SCHEME= undefined
##.AVERAGES= 8
##.DIGITISER RES= 18
##SPECTROMETER/DATA SYSTEM= spect
##.PULSE SEQUENCE= zg30
##.SOLVENT NAME= CDCl3
##.SHIFT REFERENCE= (INTERNAL, CDCl3, 0, 15.7039)
##AUDIT TRAIL= $$ (NUMBER, WHEN, WHO, WHERE, WHAT)
$$ ##TITLE= Audit trail, XWIN-NMR		Version 3.5
$$ ##JCAMPDX= 5.01
$$ ##ORIGIN= Bruker BioSpin GmbH
$$ ##OWNER= she
$$ F:/spectra/data/she/nmr/H-F/1/audita.txt
$$ ##AUDIT TRAIL=  $$ (NUMBER, WHEN, WHO, WHERE, WHAT)
(   1,<2022-04-08 11:22:07.82 +0400>,<she>,<DPX200>,
      <created by zg, POWCHK disabled, PULCHK disabled
       configuration hash MD5:
       00 E9 B6 7A A2 85 ED C7 34 08 36 98 17 FE 4E 26
       data hash MD5: 16K
       96 65 17 79 3E 47 AD BD 3D 54 A2 2E 33 90 BC 31>)
$$ ##END=
$$ 
$$ hash MD5
$$ 83 0B 67 F7 98 46 34 43 5B 19 67 8E D4 DC 09 74
##$RELAX= 
##$RELAX= 
##$RELAX= 
##$RELAX= 
##$RELAX= 
##$RELAX= 
$$ Bruker specific parameters
$$ --------------------------
##$DU= <F:/spectra>
##$EXPNO= 1
##$NAME= <H-F>
##$PROCNO= 1
##$TYPE= <nmr>
##$USER= <she>
##$AMP= (0..31)
100 100 100 100 100 100 100 100 100 100 100 100 100 100 100 100 100 100 
100 100 100 100 100 100 100 100 100 100 100 100 100 100 
##$AQSEQ= 0
##$AQ_mod= 1
##$AUNM= <au_zg>
##$AUTOPOS= <>
##$BF1= 200.13
##$BF2= 200.13
##$BF3= 200.13
##$BF4= 200.13
##$BF5= 200.13
##$BF6= 200.13
##$BF7= 200.13
##$BF8= 200.13
##$BYTORDA= 1
##$CFDGTYP= 0
##$CFRGTYP= 5
##$CHEMSTR= <none>
##$CNST= (0..31)
1 1 145 1 1 1 1 1 1 1 1 1 1 1 1 1 1 1 1 1 1 1 1 1 1 1 1 1 1 1 1 1 
##$CPDPRG= <>
##$CPDPRG1= <>
##$CPDPRG2= <>
##$CPDPRG3= <>
##$CPDPRG4= <mlev>
##$CPDPRG5= <mlev>
##$CPDPRG6= <mlev>
##$CPDPRG7= <mlev>
##$CPDPRG8= <mlev>
##$CPDPRGB= <>
##$CPDPRGT= <>
##$D= (0..31)
0 1.2 0 0 0 0 0 0 0 0.06 0 0.03 0 0 0 0 0.0002 0 0 0 0 0 0 0 0 0 0 0 0 
0 0 0 
##$DATE= 1649402527
##$DBL= (0..7)
120 120 120 120 120 120 120 120 
##$DBP= (0..7)
150 150 150 150 150 150 150 150 
##$DBP07= 0
##$DBPNAM0= <>
##$DBPNAM1= <>
##$DBPNAM2= <>
##$DBPNAM3= <>
##$DBPNAM4= <>
##$DBPNAM5= <>
##$DBPNAM6= <>
##$DBPNAM7= <>
##$DBPOAL= (0..7)
0.5 0.5 0.5 0.5 0.5 0.5 0.5 0.5 
##$DBPOFFS= (0..7)
0 0 0 0 0 0 0 0 
##$DE= 6
##$DECBNUC= <off>
##$DECIM= 32
##$DECNUC= <off>
##$DECSTAT= 4
##$DIGMOD= 1
##$DIGTYP= 9
##$DL= (0..7)
0 120 120 120 120 120 120 120 
##$DP= (0..7)
150 150 150 150 150 150 150 150 
##$DP07= 0
##$DPNAME0= <>
##$DPNAME1= <>
##$DPNAME2= <>
##$DPNAME3= <>
##$DPNAME4= <>
##$DPNAME5= <>
##$DPNAME6= <>
##$DPNAME7= <>
##$DPOAL= (0..7)
0.5 0.5 0.5 0.5 0.5 0.5 0.5 0.5 
##$DPOFFS= (0..7)
0 0 0 0 0 0 0 0 
##$DQDMODE= 0
##$DR= 18
##$DS= 0
##$DSLIST= <SSSSSSSSSSSSSSS>
$$ [...]
##$SUBNAM2= <"">
##$SUBNAM3= <"">
##$SUBNAM4= <"">
##$SUBNAM5= <"">
##$SUBNAM6= <"">
##$SUBNAM7= <"">
##$SUBNAM8= <"">
##$SUBNAM9= <"">
##$SW= 18.05172834244
##$SWIBOX= (0..15)
0 0 2 0 0 0 0 0 0 0 0 0 0 0 0 0 
##$SW_h= 3612.71676300578
##$TD= 16384
##$TD0= 1
##$TE= 0
##$TE2= 300
##$TE3= 300
##$TEG= 300
##$TL= (0..7)
0 120 120 120 120 120 120 120 
##$TP= (0..7)
150 150 150 150 150 150 150 150 
##$TP07= 0
##$TPNAME0= <>
##$TPNAME1= <>
##$TPNAME2= <>
##$TPNAME3= <>
##$TPNAME4= <>
##$TPNAME5= <>
##$TPNAME6= <>
##$TPNAME7= <>
##$TPOAL= (0..7)
0.5 0.5 0.5 0.5 0.5 0.5 0.5 0.5 
##$TPOFFS= (0..7)
0 0 0 0 0 0 0 0 
##$TUNHIN= 0
##$TUNHOUT= 0
##$TUNXOUT= 0
##$USERA1= <user>
##$USERA2= <user>
##$USERA3= <user>
##$USERA4= <user>
##$USERA5= <user>
##$V9= 5
##$VALIST= <valist>
##$VCLIST= <CCCCCCCCCCCCCCC>
##$VD= 0
##$VDLIST= <DDDDDDDDDDDDDDD>
##$VPLIST= <PPPPPPPPPPPPPPP>
##$VTLIST= <TTTTTTTTTTTTTTT>
##$WBST= 1024
##$WBSW= 4
##$XGAIN= (0..3)
0 0 0 0 
##$XL= 0
##$YL= 0
##$YMAX_a= 226030
##$YMIN_a= -373463
##$ZGOPTNS= <>
##$ZL1= 120
##$ZL2= 120
##$ZL3= 120
##$ZL4= 120
##$ABSF1= 10
##$ABSF2= 0
##$ABSG= 5
##$ABSL= 3
##$ALPHA= 0
##$AQORDER= 0
##$ASSFAC= 0
##$ASSFACI= 0
##$ASSFACX= 0
##$ASSWID= 0
##$AUNMP= <proc_1d>
##$AZFE= 0.1
##$AZFW= 0.1
##$BCFW= 1
##$BC_mod= 2
##$BYTORDP= 1
##$COROFFS= 0
##$CY= 11.3945322036743
##$DATMOD= 1
##$DC= 2
##$DFILT= <>
##$DTYPP= 0
##$F1P= 2.36226072786647
##$F2P= -0.459571619588291
##$FCOR= 0.5
##$FTSIZE= 0
##$FT_mod= 4
##$GAMMA= 1
##$GB= 0.15
##$INTBC= 1
##$INTSCL= 1
##$ISEN= 128
##$LB= 0.24
##$LEV0= 0
##$LPBIN= 0
##$MAXI= 10000
##$MC2= 0
##$MEAN= 0
##$ME_mod= 0
##$MI= 1.114404
##$NCOEF= 0
##$NC_proc= 0
##$NLEV= 6
##$NOISF1= 3.799351
##$NOISF2= 2.8
##$NSP= 1
##$NTH_PI= 0
##$NZP= 0
##$OFFSET= 15.70392
##$PC= 1
##$PHC0= -18396.6
##$PHC1= 18.20078
##$PH_mod= 1
##$PKNL= yes
##$PPARMOD= 0
##$PSCAL= 0
##$PSIGN= 0
##$REVERSE= no
##$SF= 200.130013532006
##$SI= 16384
##$SIGF1= 3
##$SIGF2= 2
##$SINO= 400
##$SIOLD= 16384
##$SREGLST= <1H.CDCl3>
##$SSB= 0
##$STSI= 0
##$STSR= 0
##$SW_p= 3612.71676300578
##$SYMM= 0
##$S_DEV= 0
##$TDeff= 0
##$TDoff= 0
##$TI= <>
##$TILT= no
##$TM1= 0
##$TM2= 0
##$TOPLEV= 0
##$USERP1= <user>
##$USERP2= <user>
##$USERP3= <user>
##$USERP4= <user>
##$USERP5= <user>
##$WDW= 1
##$XDIM= 8192
##$YMAX_p= 0
##$YMIN_p= 0
$$ End of Bruker specific parameters
$$ ---------------------------------
##NTUPLES= NMR FID
##VAR_NAME=  TIME,          FID/REAL,        FID/IMAG
##SYMBOL=    X,             R,               I
##VAR_TYPE=  INDEPENDENT,   DEPENDENT,       DEPENDENT
##VAR_FORM=  AFFN,          ASDF,            ASDF
##VAR_DIM=   8192,          8192,            8192
##UNITS=     SECONDS,       ARBITRARY UNITS, ARBITRARY UNITS
##FACTOR=    0.0002768,     1,               1
##FIRST=     0,             0,               0
##LAST=      2.2672688,     0,               0
##MIN=       0,             -373463,         0
##MAX=       2.2672688,     226030,          0
$$ Real data points
##PAGE= N=1
##DATA TABLE= (X++(R..R)), XYDATA
$$ [...]
2066a518J525K868l415J436K620n054N21L566j485j544R00J50j879J2K844j918
$$ -1518 7 2875 -540 896 3516 -1538 -1017 2549 1064 -480 420 570 -1309 -1297 1547 -371
2082c71k320L985k364k783M540O17k766P91O01j193J32K832K96m129K122K126
$$ -371 -2691 1294 -1070 -3853 687 1304 -1462 -671 -70 -1263 -1131 1701 1997 -2132 -10 2116
2098B116l468K197K574l580K07J482j212p30J672J264l328j143L368k240q18L627
$$ 2116 -1352 845 3419 -161 46 1528 316 -414 1258 2522 -806 -1949 1419 -821 -1639 1988
2114A988k772k403L155R7j410N50J254j197j486K719N23l157L495O38l985J903
$$ 1988 -784 -3187 -32 65 -1345 -795 459 -738 -2224 495 1018 -2139 1356 1994 -1991 -88
2130h8K447k056K04R48o33j639J559J985l599j10L512l083p44L114k172j154J684
$$ -88 2359 303 507 1455 822 -817 742 2727 -872 -982 2530 -553 -1297 1817 -355 -1509 175
2147A75l62j754N14K242j184k065L086o37k337L264K13k925K357J020j700M4J274
$$ 175 -187 -1941 -1427 815 -369 -2434 652 15 -2322 942 1155 -1770 587 1607 -93 -49 1225
2164A225L26j986J319J768l855J285K523l225k62K794k357j075J507K08j312j61
$$ 1225 1551 -435 884 2652 -1203 82 2605 -620 -882 1912 -445 -1520 -13 195 -1117 -1278
2180a278J975j948j696L944j248j828K643n99j986K287Q85j214m60J498J71k009
$$ -1278 697 -1251 -2947 997 -251 -2079 564 -35 -2021 266 1151 -63 -523 975 1146 -863
2196h63J652J849l308J194J420k812P48J915j342q97L82J76o97n44K250k014j333
$$ -863 789 2638 -670 524 1944 -868 -120 1795 453 -444 -62 114 -583 -1127 1123 -891 -2224
2213b224L047j547j134K365p93j170Q12R28m31p73J737J98k004J674J178k325
$$ -2224 823 -724 -1858 507 -286 -1456 -644 284 -147 -920 817 1015 -989 685 1863 -462
2229d62J496N21j593M37N28j94o63N1J060j608o89K005j323p63J788j662m50J383
$$ -462 1034 1555 -38 399 927 733 70 121 1181 -427 -1116 889 -434 -1197 591 -1071 -1521 -138
2247a38p30J94R2p2N61r61J571K44j734J663K71j424J559N8o57M93k02J82m32
$$ -138 -868 -674 -582 -654 -93 -1054 517 761 -973 690 961 -463 1096 1154 497 990 788 970 538
2266E38m34J401j770l0J263j590K10Q04j178L21q9m19N56q61R20J74j490J608
$$ 538 104 1505 -265 -295 968 -622 -412 392 -786 -465 -554 -973 -417 -1278 -358 -184 -1674 -66
2284f6K34j208J674o23l84J234q30O89L03o95R61p55N1P50j190K11N91j495J026
$$ -66 168 -1040 634 11 -373 861 31 720 1023 328 1289 534 585 1335 145 356 947 -548 478
2303D78o27m43P13r88L63M08j227J078k72p89J176n90k58J335r79O12L74n43Q65
$$ 478 -149 -592 121 -867 -504 -96 -1323 -245 -517 -1306 -130 -720 -978 357 -622 -10 364 -179 686
2322F86k93Q0N21p96N44L50j072J174q88l91J009r81j24N09r84L89j67l72O99
$$ 686 393 473 994 198 742 1092 20 1194 306 -85 924 -57 -181 328 -656 -267 -434 -806 -107
2341a07p12j71P85r94O87K49q88J135l05j61J049r17P87L12q34Q61l8o40J063
$$ -107 -819 -990 -205 -1199 -512 -263 -1151 -16 -321 -482 567 -350 437 749 -85 776 738 98 1161
2360A161q10J53O59j293O21l7q03P69p50k02Q21j324M67K02p98J084o64j91J042
$$ 1161 351 504 1163 -130 491 454 -349 420 -330 -532 289 -1035 -568 -366 -1164 -80 -744 -935 107
2379A07p84L10M41p32Q05J41n10Q31n55J91R83j075O36o6l84O65o82j54N93j176
$$ 107 -677 -367 74 -658 147 288 -222 609 54 245 1228 153 789 723 339 1004 322 168 761 -415
2399d15L50M63j302N80M2o59M88l32K57J08o07J008o45k27J184l72o86J506o52
$$ -415 -65 398 -904 -324 -282 -941 -453 -785 -528 -420 -1027 -19 -664 -891 293 -79 -765 741 89
2418H9K41L96l58K70p8K03J99o00K71O17j219N12k15o09N80j86m89l04m10J046
$$ 89 330 726 368 638 560 763 962 362 633 1250 31 543 328 -281 299 113 -376 -680 -1090 -44
2438d4l34n35P96p21k18J260q42k6J055m59o3J14R7N45m34P16j34j043J250L86
$$ -44 -378 -913 -117 -838 -1056 204 -638 -664 391 -68 -131 -17 80 625 191 907 773 -270 980 1366
2458A366j698J269k42j063O75j47j4n94n0P11j090j92J540j573j06J330j659P86
$$ 1366 -332 937 695 -368 307 160 146 -448 -498 213 -877 -1069 471 -1102 -1208 122 -1537 -751
2476g51J182p63o6k03R19K12j167J671l06r96J445k70j240J522k59n54j38o1J84
$$ -751 431 -332 -398 -601 318 530 -637 1034 728 -268 1177 907 -333 1189 930 376 238 177 361
2495C61o44N71M05j937O26J376j851K27R26r68P4N82j27l06O7J389j070q85K401
$$ 361 -283 288 693 -1244 -618 758 -1093 -866 60 -908 -834 -252 -379 -685 -618 771 -299 -1184 1217
2514A217r23p87J551l97r25J477k58o83m40J151J75j374P52Q4j815J573O71k318
$$ 1217 294 -493 1058 661 -264 1213 955 272 -168 983 1158 -216 536 620 -1195 378 1049 -1269
2532a269N87Q70j103j95M90P13j231J0J663j654R9K692j982q96J860l07j56M05
$$ -1269 -682 188 -915 -1110 -620 93 -1138 -1128 535 -1119 -1020 1672 -310 -1206 654 347 191 596
2550E96N38j161k81J622l24j641J801k41j983J377M97j783Q11N65p50j232J350
$$ 596 1134 -27 -308 1314 990 -651 1150 909 -1074 303 800 -983 -172 393 -357 -1589 -239
2567b39O94j478rJ549j866L09K041j400m00J107l32k99M09J123p03j004J939j010
$$ -239 455 -1023 -1032 517 -1349 -1040 1001 -399 -799 308 -24 -323 86 1209 506 -498 1441 431
2585D31j203K398k74k174J241K42q75Q9Q40o56j310J168P05k187P38J953k474
$$ 431 -772 1626 1352 -822 419 661 -214 -125 715 59 -1251 -83 622 -1565 -827 1126 -1348
2602a348J17J667j509M83J108j31j392L66J909j072q83K168j135j057K222o54
$$ -1348 -1231 436 -1073 -590 518 387 -1005 -639 1270 198 -685 1483 348 -709 1513 859
2618H59j035R12L26j083k13R05l78j207J079M11k063J244J080k219N78R59p66
$$ 859 -176 736 1062 -21 -234 671 293 -914 165 576 -1487 -243 837 -1382 -804 155 -611
2635f11m04P13L27j039P14J314j614k02J812j040m62J737o17r10P72M31o11k50
$$ -611 -1015 -302 25 -1014 -300 1014 -600 -802 1010 -30 -492 1245 628 -282 490 921 310 60
2653F0J044k51j665J723l55j679J500J11j721M41R22o69j78L64M57j335O98J300
$$ 60 1104 853 -812 911 556 -1123 377 488 -1233 -792 130 -539 -717 -353 104 -1231 -533 767
2671G67j521J64J607j339m1J224j17o99L75K23n19k46J334o63j037J395n16j201
$$ 767 -754 -590 1017 -322 -363 861 744 45 420 643 124 -122 1212 549 -488 907 391 -810
2689h10J099K70r34Q1J08K2p56L17R20j609M62J146j561Q05R71j130L95M31P5
$$ -810 289 559 -375 -294 -186 -164 -920 -603 317 -1292 -830 316 -1245 -440 531 -599 -204 227 302
2708C02P5k70N14l06n52J374p82n19J328n11r89P46j27m26M6k4J77r29O02N98
$$ 302 377 107 621 315 -237 1137 355 -164 1164 653 -336 410 283 -143 -97 -121 56 -873 -271 327
2728C27j309P03L12j133N83N21o48L06J33L00M8j78Q50q95j09J311r58l13J177
$$ 327 -982 -279 33 -1100 -517 4 -644 -338 -205 95 143 -35 815 -80 -189 1122 164 -149 1028
2747A028p91M1M01l34j00j81K18o6p99P59j07j022Q83j13p86O25Kl27M59j96O07
$$ 1028 237 278 679 345 245 64 282 216 -583 176 69 -953 -70 -183 -969 -344 -342 -669 -210 -406 201
2768B01l55r6R28q67K37Q41q70K61N26o28M17J47k38L29n01R8j23o61O94l22o94
$$ 201 -154 -250 678 -189 48 889 19 280 806 178 595 742 504 833 332 430 307 -354 340 18 -676
2789f76P24k35m81N12m03J07K35m75N52n62K06P20p37N70J81j71M42k51j30O46
$$ -676 48 -187 -668 -156 -559 -452 -217 -692 -140 -702 -496 224 -513 57 238 67 509 258 128 774
2809G74p48L35L34n31O39n62l84P96p29J09L59q12M09k71m86N96n92oO34k90M7
$$ 774 26 361 695 164 803 241 -143 653 -76 33 392 -420 -11 -282 -768 -172 -764 -770 -136 -426 -379
2830c79K95p24P99m8o7P17p92L38M62l75P19n05m32J064r41J61Q4n75Q13m34m63
$$ -379 -84 -808 -9 -57 -124 593 -199 139 601 226 945 440 8 1072 131 292 376 -199 614 180 -283
2851b83N96o16K9M00o22M3K59m51L38m9j94N51m49L40J15l61O53L5l78P18n46
$$ -283 313 -303 -274 126 -496 -453 -194 -645 -307 -356 -550 1 -448 -108 7 -354 299 334 -44 674 128
2872A28N3O40m07J62ok77N44p26L4M54p93O7J03m76M57r5o23N58n29L36M83o79
$$ 128 181 821 414 576 570 293 837 111 145 599 -194 -127 -24 -500 -43 -138 -761 -203 -732 -396 87 -592
2894e92M33j92J75M92m77K52L43m74L20o1j98N33j8k25K70o00M54j43j97M29l83
$$ -592 -159 -351 -176 316 -161 91 434 -40 280 219 21 554 536 311 581 -19 435 292 95 524 141
2915A41l34K70l15j60L26m11K76j11j89K19J0k60N35m38J71L98l56J96J82k12
$$ 141 -193 77 -238 -398 -72 -483 -207 -318 -507 -288 -278 -538 -3 -441 -270 128 -228 -32 150 -62
2935f2N63k89K83J56l35J95m7l67M49o64L64Jl97j08O7l9K09m37j75N32n34K4
$$ -62 501 212 495 651 316 511 464 97 546 -118 246 247 -150 -258 -191 -230 -21 -458 -633 -101 -635 -611
2957f11N83p15N25K63q46J057l58L9K74k36L26l2j69N76m55l34P73l46J65M27
$$ -611 -28 -743 -218 45 -801 256 -102 -63 211 -25 301 269 100 676 221 -113 660 314 479 906
2977I06j044J57l0K5K10n81L8L46o32J82K39n38O89l05k75N93m09M86j79j49N35
$$ 906 -138 19 -11 14 224 -357 -319 27 -605 -423 -184 -722 -33 -338 -613 -20 -429 57 -122 -271 264
2998B64pj44M45n22J28O19q49M69j50k42L16l48J78O0p86Q64l54p23P95l81j85
$$ 264 257 113 558 36 164 783 -66 403 253 11 327 -21 157 217 -569 295 -59 -782 13 -368 -553
3019e53N08n75J33K15p2J74j96O5K77p6L02K01n20J67J99l78O28k49N09k65n94
$$ -553 -45 -620 -487 -272 -344 -170 -366 -301 -24 -100 202 403 -117 50 249 -129 499 250 759 494 -100
3040a00K07J85j94J88o00l05P66n09P3J78o81N11j09k62N27l51M47O2n21M05L57
$$ -100 107 292 98 286 -314 -619 147 -362 -289 -111 -792 -281 -390 -652 -125 -476 -29 33 -488 -83 274
3061B74m45N09k69j09M91l00P11o26m50P65m34Q3J88m87m5N36l66K8k38l04N06
$$ 274 -171 338 69 -40 451 151 862 236 -214 551 117 200 388 -99 -144 392 26 54 -184 -488 18
3082A8l41k99L95m59P71m74k18O47l5m4K09k11L28J1l7J65j98j7P17q39J44q0
$$ 18 -323 -622 -227 -686 85 -389 -607 40 5 -39 170 -41 287 298 261 426 228 211 928 89 233 153
3104A53k62K63N7k80M04m95L87n43l76N35m4l93L78n25O7P03l46J71J30k81L22
$$ 153 -109 154 211 -69 335 -160 227 -316 -692 -157 -201 -594 -216 -741 -674 29 -317 -146 -16 -297 25
3125B5r8J23M08o53O10J59o74M69M98p45L36l19L6j5j37j51R5k16L46m51N0K16
$$ 25 -73 50 458 -195 415 574 -100 369 867 122 458 139 175 160 23 -128 -33 -249 97 -354 -304 -88
3147h8n44L50K82l42k85L48K8L20n97O55M9k75L40j98k17O60o4l39R3n3J61j06
$$ -88 -632 -282 0 -342 -627 -279 -251 69 -528 127 176 -99 241 43 -174 486 422 83 176 123 284 178
3169A78o3L61l68j70L10p19J23N16n31J68j13l55N81j76J01j27k66M88J82k36
$$ 178 115 476 108 -62 248 -471 -348 168 -363 -195 -308 -663 -82 -258 -157 -284 -550 -62 120 -116
3189a16L22n02K44M30j83Q8L77l99M91l85k64N22m47j36M52n55K11j93n12M44
$$ -116 206 -296 -52 378 195 283 660 261 752 367 103 625 178 42 494 -61 150 -43 -555 -111
3209a11q6q9J02k76K34j33rN10n24L22N4k79K42Q3k51M61Q0l13L30K7k99M34m90
$$ -111 -197 -286 -184 -460 -226 -359 -368 142 -382 -60 -6 -285 -43 40 -211 250 330 17 347 374 75 509 19
3232A9O12k54m84M79l52l03K50k13JJ86j92K13r6o71O37k07J62K43m65O6L52l40
$$ 19 631 377 -107 372 20 -283 -33 -246 -245 -59 -251 -38 -134 -805 -168 -375 -213 30 -435 -369 -17 -357
3254c57M33l62K53O5k38L92K10l17L95k36j29M33n55N24m00j93K68j73l36K57
$$ -357 76 -286 -33 32 -206 186 396 79 474 238 109 542 -13 511 111 -82 186 13 -323 -66
3274f6k65r2K73k09M7K15n56O81k43R6P6k05L63j61NN09j09k55O32n79L00k01
$$ -66 -331 -423 -150 -359 -312 -97 -653 28 -215 -119 -43 -248 115 -46 -41 468 359 104 736 157 457 256
3296B56k52L27j23l07O39o72O6K01o75O43k49n43O91l86n8M83n74J29M49k28K60
$$ 256 4 331 208 -99 540 -132 -66 135 -540 103 -146 -689 2 -384 -442 41 -533 -404 45 -183 77
3317G7l31K74K80l34J04K54j44J54m9j32L59k96o8J45l57L59r1m40M72n86J06
$$ 77 -254 20 300 -34 70 324 180 334 285 153 512 216 148 293 -64 295 204 -236 236 -350 -244
3338b44K46m43J57Mk15M85l07j63L15j37K35L11l28J66j4j06K60j8P6K94l79j3
$$ -244 2 -441 -284 -280 -495 -10 -317 -480 -165 -302 -67 244 -84 82 68 -38 222 204 280 574 195 182
3360A82P3j93M7Q0j94L56l60j13N4j16J24j60k39M96n55J02K86k12K05j3j49N12
$$ 182 255 62 109 189 -5 351 -9 -122 -68 -184 -60 -220 -459 37 -518 -416 -130 -342 -137 -150 -299 213
3382B13P8k17K28k49K22J23n93L20J43J48P1j55l01M71l26j42Lk81L72k82m3j88
$$ 213 291 74 302 53 275 398 -195 125 268 416 487 332 31 502 176 34 37 -244 128 -154 -197 -385
3404c85J36J50k78k24O03n01J55M97l59R0P5N0J46j01J33J66k59p2M14m83L96
$$ -385 -249 -99 -377 -601 2 -499 -344 153 -206 -116 -41 9 155 54 187 353 94 22 436 -47 349
3425C49l0k95K20k54j82K15J64l51p8J40J12l34NL93n00J0N73o36J62K76k16K28
$$ 349 319 24 244 -10 -192 23 187 -164 -242 -102 10 -324 -319 74 -426 -416 157 -479 -317 -41 -257 -29
3447b9L1M0M76n99M12J85o09O35k35l42O39k98j68j50l0J30j98QL30o23J17L62
$$ -29 2 42 518 -81 331 516 -93 542 307 -35 604 306 138 -12 -42 88 -110 -102 228 -395 -278 84
3469H4p20M42n1k96L72q0O1L5J64L38m81J01L10l31M0N48l76j42K76j22M7l0l0
$$ 84 -636 -194 -245 -541 -169 -249 -188 -153 11 349 -132 -31 279 -52 -12 536 160 18 294 172 219 189 159
3492A59P9m07L26Q6m74J99L90p62J1L56k12j70R7J08k66j06Q74l93p9M52l69j97
$$ 159 238 -169 157 243 -231 -32 358 -404 -393 -37 -249 -419 -322 -214 -480 -586 288 -105 -184 268 -101 -298
3514b98Q69l51%j51K47K1l79N20j28m75L06O6j18J24L0p47M32k51K18k52j51N61
$$ -298 571 220 220 69 316 337 -42 478 350 -125 181 247 129 253 283 -464 -32 -283 -65 -317 -468 93
3536I3l62MK18m07MQ60n68N0L04Mj1k10N25m33J01P99o98m54P52k67n07J72K49
$$ 93 -269 -265 -47 -454 -450 410 -158 -108 196 200 189 -21 504 71 172 971 273 -181 571 304 -203 -31 218
3559B18l67L70j26j85p6o1K74q47N10K05l96J86L65l86p0M08J33l96Q0N46k31
$$ 218 -149 221 95 -90 -166 -227 47 -800 -290 -85 -481 -295 70 -316 -386 22 155 -241 -161 385 154
3580A54l05Q42n23m58Q67k72m71M50Om12o3M15k5o30M17J52n57K00O49q36OK01
$$ 154 -151 691 168 -290 577 305 -166 284 290 -122 -185 230 205 -425 -8 144 -413 -213 436 -400 -394 -193
3602a93o2J26j44K28M9k48P37n59k79P39k58q3K27N4p9p7M32k45m98O06r9q51
$$ -193 -255 -129 -273 -45 4 -244 493 -66 -345 394 136 53 280 334 255 178 610 365 -133 473 374 -477
3624d77M49M55o85J74L66m27L1j04l3j42K8M34m19J92O37o03k37P57m42j3M39
$$ -477 -28 427 -258 -84 282 -145 -114 -218 -251 -393 -365 69 -350 -158 479 -124 -361 396 -46 -59 380
3645C80r5j44R9R6j94n42Q87m49l49M36J03n75M07J96m06l9jK61n09L14L74j088
$$ 380 285 141 240 336 142 -400 487 38 -311 125 228 -347 60 256 -150 -189 -190 71 -438 -124 250 -838
3667h38O78L47m77J8K84l4r8J88K20k81l19Q70m31l00P34l87j95N05m21j94J84
$$ -838 -160 187 -290 -272 12 -22 -120 68 288 7 -312 558 127 -173 561 174 -21 484 63 -131 53
3688E3J43r6k88K50j37l42J45L49n50J02P14r63N54km3m8M1M1P6j04L58k53L26
$$ 53 196 100 -188 62 -75 -417 -272 77 -473 -371 343 -620 -66 -68 -111 -159 -118 -77 -1 -105 253 0 326
3711C26J00k77l94N74j33j18L18k92J42n74L46L54o15JK65m34J89J76l49P4J72
$$ 326 426 149 -245 329 196 78 396 104 246 -328 18 372 -243 -242 23 -411 -222 -46 -395 -321 -149
3732a49q1k3J32M68n55l4J95p3J50O36m25j89K61j53q2r4J62J81m54K15%l30L43
$$ -149 -230 -253 -121 347 -208 -242 -47 -120 30 666 241 52 313 160 78 -16 146 327 -127 88 88 -242 101
3755A01K8m57L95k08J45L5j60P9j68l1L81m38M10m2k57k75R17n17P6L58l45M49
$$ 101 129 -328 67 -141 4 39 -121 -42 -210 -241 140 -298 112 70 -187 -462 455 -62 14 372 27 476
3777D76n02L57j14k95O41k23m01L07k14j4jM6qk77K25j00k7j51L89l64LJ15j5
$$ 476 -26 331 217 -78 563 340 -61 246 32 18 17 63 55 -222 3 -97 -124 -275 114 -250 -247 -132 -147
3800a47j01K42J59O7j93L03j49n8J22j94J06L11o70L66N5j45o2J2k41K20k69J00
$$ -147 -248 -6 153 220 27 330 181 123 245 51 157 468 -202 164 219 74 12 24 -217 3 -266 -166
3822a66J55l55J20K25l63M0M11r7p1L5R9k23L11m7l49L74Po6R6J44j85j23L03
$$ -166 -11 -366 -246 -21 -384 -344 67 -30 -101 -66 33 -190 121 74 -275 99 106 40 136 280 95 -28 275
3845B75j27r9j09K92l03j1J15j66o4J42L1k94J00q6j48J22J03K49kl72M38j67
$$ 275 148 49 -60 232 -71 -82 33 -133 -197 -55 -24 -318 -218 -304 -452 -330 -227 22 20 -352 86 -81
3867h1K14j02k14K60K66p1j62LR8O0j36K27l19j7L72l20n8J33j92j99K35q6J76
$$ -81 133 31 -183 77 343 272 110 113 211 271 135 362 43 26 398 78 20 153 -39 -238 -3 -89 87
3890H7l39m2M59o41M62K50n77L32r8L82j72j05K28Kj10J3l5lJ79j04k2R0k36j27
$$ 87 -252 -294 165 -476 -14 236 -341 -9 -107 275 103 -2 226 228 118 131 96 93 272 168 146 236 0 -127
3914a27L66n29M26j42k88M45n08J06J46m41N68L9m69L12k3O9Q9R0l16K39O4J36
$$ -127 239 -290 136 -6 -294 151 -357 -251 -105 -546 22 61 -408 -96 -119 -50 39 129 -187 52 116 252
3936B52k69J55J14j40j47K15l60K08K73m51K62j13j05K26n43K14K33j81K37k03
$$ 252 -17 138 252 112 -35 180 -180 28 301 -150 112 -1 -106 120 -423 -209 24 -157 80 -123
3956a23l74L81j6Nj1M11k12m39L84M7j90K81K21n49M72j0j21k8j8J02j34q5O3
$$ -123 -497 -116 -132 -127 -138 273 61 -378 6 53 -137 144 365 -184 288 278 157 129 111 213 79 -6 57
3979E7j84q2L63k93O9J86j62j76m6J48j03K11p0mj16N12r5m17L9N90n88J39M53
$$ 57 -127 -209 154 -139 -70 116 -46 -222 -268 -120 -223 -12 -82 -86 -202 310 215 -202 -163 427 -161 -22 431
4002D31l12o6J56Qk22J9M75l89l52R09q05j89N23k59k17J42P0k83j1K85O0n35
$$ 431 119 53 209 217 -5 14 489 100 -252 657 -148 -337 186 -73 -290 -148 -78 -361 -372 -87 -27 -562
4024e62P74j21m64M98k1k73K00K91j75KJ05J74o48M15L81n80j06O74n69P8Q1k95
$$ -562 212 91 -373 125 104 -169 31 322 147 149 254 428 -220 195 576 -4 -110 564 -5 73 154 -141
4046a41j12K91p7j36k26L72j92l13O24q4m47L44L60n69J77K95l23k2K97K32o23
$$ -141 -253 38 -39 -175 -401 -29 -221 -534 90 6 -441 -97 263 -306 -129 166 -157 -179 118 350 -273
4067b73L39M00q20K16O57m65m5N16n17L8k16O83q53q1P78l35o74M55J69n58N85
$$ -273 66 466 -354 -138 519 54 9 525 8 46 -170 513 -340 -421 357 22 -652 -197 -28 -586 -1
4088aq1l90J66P33n08k61L66J17l58M02L48m19j76N34l37k79L62m6l30L96P9m95
$$ -1 -82 -472 -306 427 -81 -342 24 141 -217 185 533 114 -62 472 135 -144 218 172 -158 238 317 -178
4110a78R1K00l18p4P25n19k14P9K03k61J29L17q4o24Q86j59m91L20K20k60m8N73
$$ -178 -87 113 -205 -279 446 -73 -287 -208 -5 -266 -137 180 96 -528 358 199 -292 28 248 -12 -60 513
4132E13m60n8K97R0j72q8J38n85K59M06l65j74K33l6m97L46K34k42j12L65k06
$$ 513 53 -5 292 382 210 122 260 -325 -66 340 -25 -199 34 -2 -499 -153 81 -161 -273 92 -114
4153a14k10L26J24p02Q37Q8n72L50J07k61j56N57n8n12K58K49m61K57J03k94P8
$$ -114 -324 2 126 -576 261 349 -223 127 234 -27 -183 374 316 -196 62 311 -150 107 210 -84 -6
4174fQ6jk81L41j29k80L3O62q39j79Q30k19m74O58Pl48K32P2j22j01L13N9l17
$$ -6 80 79 -202 139 10 -270 -237 425 -414 -593 237 18 -456 202 209 -139 93 165 43 -58 255 314 -3
4197cK29J26n89N43l2l97N6M60k90k75Q9K25l99j74N00l93R2K69l06N2M56k93
$$ -3 226 352 -237 306 274 -123 -67 393 103 -172 -83 142 -257 -431 69 -324 -232 37 -269 -217 239 -54
4219e4k08O5L70p8k72K43J74n89O81Q5n46L44Q8l52M5O2J46j92N7lj49k13M22
$$ -54 -262 -197 173 95 -177 66 240 -349 332 417 -129 215 303 -49 -4 58 204 12 69 66 -83 -296 126
4242A26o03L01O9j1mO3J87k48NM4J64m81N68L1l65NL74j49J30n7P8L5k08n5p4
$$ 126 -477 -176 -107 -118 -122 -59 128 -120 -115 -71 93 -388 180 211 -154 -149 225 76 206 149 227 262 54 -1 -75
4267g5N6P6j17ML12m92R8R2P1K4K3k48o0k21N46k64j37L48O3j41KJ95k00M30n49
$$ -75 -19 57 -60 -56 256 -236 -138 -46 25 49 72 -176 -236 -457 89 -175 -312 36 99 -42 -40 155 -45 385 -164
4292a64L18r8J32j83n2m1K76j28N9J65m67J65r3J90k26P3j18R3k51M75j89r5J23
$$ -164 154 56 188 5 -47 -88 188 60 119 284 -183 -18 -111 79 -147 -74 -192 -99 -350 125 -64 -159 -36
4315c6l72K66K23m4j32J81j00K25l56L74K1k98OQ4j01J90r1j5q0M7j11j07R8L00
$$ -36 -408 -142 81 37 -95 86 -14 211 -145 229 250 -48 -42 42 -59 131 40 25 -55 -8 -119 -226 -128 172
4339A72n34K33K14j34k56K51j24J76j57p4L34k24J5Q7L41l05J25k60N86k36j49
$$ 172 -362 -129 85 -49 -305 -54 -178 -2 -159 -233 101 -123 -108 -21 320 15 140 -120 466 230 81
4360H1J82p4O4P4l27J54j81K52o0j50j13K26k85n8M53l77M2j55R2K20m61N08j35
$$ 81 263 189 253 327 0 154 -27 225 165 15 -98 128 -157 -215 238 -139 -97 -252 -160 60 -401 107 -28
4383b8o6K86j46q4L43l01r1J24j4J46k34rJ59k85L31k2j35J70l64J56J90np7k37
$$ -28 -94 192 46 -38 305 4 -87 37 23 169 -65 -74 85 -200 131 109 -26 144 -220 -64 126 121 44 -193
4407a93Q3o5j02k4L08Jm2K48j44JJ66p4j08J1J06K58l40Q6L00m89K44kl23J15
$$ -193 -110 -175 -277 -301 7 8 -34 214 70 71 237 163 55 66 172 430 90 176 476 -13 231 229 -94 21
4431B1l4J30k88L5m1j10J68J01l1l02K67J66j11K2M4nQ4j37Q0m8K10Rj94J89K3
$$ 21 -13 117 -171 -136 -177 -287 -119 -18 -49 -351 -84 82 -29 -7 37 32 116 -21 59 11 221 230 36 225 248
4456B48m81O27M8o61K63j68R1J60k1J3q7k43L46m34K55L17k10k85M46k69j46L8
$$ 248 -233 394 442 -219 44 -124 -33 127 106 119 32 -211 135 -299 -44 273 63 -222 224 -45 -191 -153
4478a53Q6j16J20L69k98k0Q5M9l37N54l45j1M87m22n0n5K9J5N0M8l5n31L51R4
$$ -153 -67 -183 -63 306 8 -12 73 122 -215 339 -6 -17 470 48 -2 -57 -28 -13 37 85 50 -481 -130 -36
4502c6l56L90ol63J05R1J37m42K00L27k74P9L79n58j10O01K13l65M16k34k25N
$$ -36 -392 -2 -8 -371 -266 -175 -38 -480 -280 47 -227 -148 231 -327 -437 164 377 12 428 194 -31 -26
4524b6P5J15l96M74j91l01L38mk36L8J86l55j8K90J27k69N7K70l36K09J43j29
$$ -26 49 164 -232 242 51 -250 88 84 -152 -114 72 -283 -301 -11 116 -153 -96 174 -162 47 190 61
4546F1q3P9M9k25L63j07o2k02K10j59K02P6k41j46K30M0m56R7K77l6k37K84J02
$$ 61 -22 57 106 -119 244 137 75 -127 83 -76 126 202 -39 -185 45 85 -371 -274 3 -33 -270 14 116
4569A16m81L07Oj60J95n8K54l33L11j86j11L13J16k68k89N49m51j26M32Rk18M53
$$ 116 -365 -58 -52 -212 -17 -75 179 -154 157 -29 -140 173 289 21 -268 281 -170 -296 136 145 -73 380
4591C80l2l42j55L53l79Q9N28n46j52K31q7j21J93J02j83o4K27J04m46L20L66
$$ 380 348 6 -149 204 -175 -86 442 -104 -256 -25 -112 -233 -40 62 -121 -185 42 146 -300 20 386
4612C86o36J34J12J13P3l8j38K7J80m3m2k74O4j59lL51r7j85R0J52k57K27k17
$$ 386 -250 -116 -4 109 182 144 6 33 213 170 128 -146 -82 -241 -244 107 10 -175 -85 67 -190 37 -180
4635a80L16o26N05N3l21L2K78j84M9K38l03J74J50j18k04M23l24k16K25K79k76
$$ -180 136 -490 15 68 -253 -221 57 -127 -78 160 -143 31 181 63 -141 282 -42 -258 -33 246 -30
4656c0j9L18m91k38K29L83l18l4P2k64J09K50Q7k18J72K19k62L0Nj1k66O35j61
$$ -30 -49 269 -222 -460 -231 152 -166 -200 -128 -392 -283 -33 54 -164 8 227 -35 -5 0 -11 -277 358 197
4679A97k41L2J65l67L33K40k33k01K38r7j28N0K1j35q7M74l98n5L64l15j92Q6
$$ 197 -44 -12 153 -214 119 359 126 -75 163 66 -62 -12 9 -126 -213 261 -137 -192 172 -143 -335 -249
4701b49M35l63K77L1l30J80P8oj28mJ05m1R4L23m37M4R7k8J18J55k68k63j15M11
$$ -249 186 -177 100 131 -199 -19 59 53 -75 -79 26 -15 79 402 -35 9 106 78 196 351 83 -180 -295 116
4725A16M5k15l6o2P3J46k48o2K47rn9j15mK86k20j62K07J42J32j0j62KK8M5l9
$$ 116 161 -54 -90 -152 -79 67 -181 -243 4 -5 -64 -179 -183 103 -117 -279 -72 70 202 192 30 32 60 105 66
4750F6K28k54J25j66M53m67q1K42k85j17J02nN9K9J16o0j34j31J67J2L42k53j51
$$ 66 294 40 165 -1 452 -15 -96 146 -139 -256 -154 -159 -100 -71 45 -15 -149 -280 -113 -101 241 -12 -163
4773a63K12J21q7r9R2K12q4q0o5K8K1o7K94m32L47j35nk61K20o3k15J49K99l47
$$ -163 49 170 83 -16 76 288 204 124 59 87 108 41 335 -97 250 115 110 -151 69 6 -209 -60 239 -108
4797a08j96K82j25j00M63m46L93L3q1j30P6K3n8J16k21J34p1K03l34N13m16M5
$$ -108 -304 -22 -147 -247 216 -230 163 196 115 -15 61 84 26 142 -79 55 -16 187 -147 366 -50 -5
4819eK23k58n7l5J39k06K16m31L32Q3j56P7K35l86K10K30Jk21P3l09J51M6K58
$$ -5 218 -40 -97 -132 7 -199 17 -414 -82 1 -155 -78 157 -229 -19 211 212 -9 64 -245 -94 -48 210
4842B10O1n29L26p3L67k81P5k02L1J09j9R7m85K70qj3j34L1K04l26J45J27k36
$$ 210 271 -258 68 -5 362 81 156 -46 -15 94 75 172 -313 -43 -51 -64 -198 -167 37 -289 -144 -17 -253
4865b53J16J69K2M7k03K0J68m18K82J35j30k0M9M7K13o4o7J30j72L2j41n7o3j73
$$ -253 -137 32 54 101 -102 -82 86 -332 -50 85 -45 -65 -16 31 244 180 113 243 71 103 -38 -95 -158 -331
4889c31L65j20q5j9K28j12j34N8ON3k6J0L25j94J18j24K69l31O9R3j26P3R6m2
$$ -331 34 -86 -171 -190 38 -74 -208 -150 -144 -91 -117 -107 218 24 142 18 287 -44 25 118 -8 65 161 119
4913A19j85J13P2j35J3j55o5P0N5R4j43J33l5J19o6l59q7J62J67j12K86r7J67
$$ 119 -66 47 119 -16 -3 -158 -223 -153 -98 -4 -147 -14 -49 70 4 -355 -442 -280 -113 -225 61 -36 131
4936A31J82l49K90l64K77k48K78o1p0p3N7O1k75Q3o4J20J06k37qj3q4L63j5k47
$$ 131 313 -36 254 -110 167 -81 197 136 66 -7 50 111 -164 -81 -145 -25 81 -156 -164 -177 -261 102 87 -160
4960a60m3R9j24K10j30K26k45M57j20k83L06J38k45j16J96k07P7M3r0l0r4K84
$$ -160 -203 -104 -228 -18 -148 78 -167 290 170 -113 193 331 86 -30 166 -41 36 79 -11 -41 -135 149
4982A49j99J3J93pk16j03K0K13j7Oj16j00K08l0k90K87N5l13L18m8j08K95J12
$$ 149 -50 -37 156 149 -67 -170 -150 63 46 52 -64 -164 44 14 -276 11 66 -247 71 23 -85 210 322
5005C22k41J47J1j85j26j40K54m7lj34M05l85O4j7J4n5k1J39J87j48O9k29J08
$$ 322 81 228 239 54 -72 -212 42 -5 -8 -142 263 -122 -58 -75 -61 -116 -137 2 189 41 110 -119 -11
5028a1n7K7J67j57L0J40l42R3%L98l76J64R7q1K5j69k7j80J35K04j80m3l9K3J33
$$ -11 -68 -41 126 -31 -1 139 -203 -110 -110 288 -88 76 173 92 117 -52 -79 -259 -124 80 -100 -143 -182 -159 -26
5053b6m8r5j03K60k18K92k21M24l36j17J90P3k80M11k65K16j07J07J67o04L62
$$ -26 -74 -169 -272 -12 -230 62 -159 265 -71 -188 2 75 -205 206 -59 157 50 157 324 -280 82
5074H2J07k24K74k29o4j98J72J58q6m9J15J58l38J3KrJ54q7Roo8O6oJ74r9K4K9
$$ 82 189 -35 239 10 -54 -252 -80 78 -8 -57 58 216 -122 -109 -107 -116 38 -49 -40 -46 -114 -48 -54 120 21 45 74
5101G4P0m31L14L64o18K66K25j69K1p4K7J3j18J57l85K14N1q3k5J4K13k70J96
$$ 74 144 -287 27 391 -227 39 264 95 116 42 69 82 -36 121 -264 -50 1 -82 -107 -93 120 -150 46
5124D6J51Ml20K54j78q0L06k98q2K23j74K24P1k13j51K20n5Or3Q1K27l34L19k67
$$ 46 197 201 -119 135 -43 -123 183 -115 -197 26 -148 76 147 -66 -217 3 -52 -46 -139 -58 169 -165 154 -113
5148a13O3rj20K19l9P6j52J25L9j16k90L08R9m4m8J4M2k64K72j14J57j42K46o8
$$ -113 -50 -59 -179 40 1 77 -75 50 89 -27 -317 -9 90 46 -2 12 54 -210 62 -52 105 -37 209 141
5172A41k10Q3N9j86l2J27k97J46K41j29o8j04K15P2k2O5J0l89N69k60K47j44k2
$$ 141 -69 14 73 -113 -145 -18 -315 -169 72 -57 -125 -229 -14 58 36 101 111 -278 291 31 278 134 112
5195A12j80J20l3j43L21K47m79P6o7J72J15k42J38j6o7k0K30l13j96K46j32M7
$$ 112 -68 52 19 -124 197 444 -35 41 -26 146 261 19 157 141 74 54 284 -29 -225 21 -111 -64
5217f4RM7j57J36n6J18J72k31J75j10M2j7J70l22J19K6j03l6Q0P6M0j99L82m17
$$ -64 -55 -8 -165 -29 -85 33 205 -26 149 39 81 64 234 -88 31 57 -46 -82 -2 74 114 -85 297 -120
5241a20J28k29M41j35j98r1k5J58j57N8J8K4k17L57Nl3R1l8J13K2j19m1K2j37
$$ -120 8 -221 220 85 -113 -204 -229 -71 -228 -170 -152 -128 -345 12 17 -16 75 37 150 172 53 12 34 -103
5265a03N0P6r0K15j63j47K83J3J58l07k47J39J56k32K59J1j29qj95K67P6j08j63
$$ -103 -53 23 -67 148 -15 -162 121 134 292 -15 -262 -123 33 -199 60 71 -58 -66 -261 6 82 -26 -189
5288a89J64M7J04q9L5J13k83n4N20jl86P0J31j67n8KJ66O1k72L7j74N2j97M99
$$ -189 -25 22 126 37 72 185 -98 -152 368 367 -19 51 182 15 -43 -41 125 186 -86 -49 -223 -171 -368 131
5312A31l40K04j14J31m06L98j07K2N4j82P5P2K84k00L7p2L31p2k8k38m5k1J87
$$ 131 -209 -5 -119 12 -394 4 -103 -81 -27 -209 -134 -62 222 22 59 -13 318 246 218 -20 -65 -86 101
5335A01j95L04k21l6L23j53j67l21K53mJ3j39L44j92K24k18K16j80j52J56j91
$$ 101 -94 210 -11 -47 276 123 -44 -365 -112 -116 -103 -242 102 -90 134 -84 132 -48 -200 -44 -235
5356b35L02r6j07N7J3J66Q9l95K33k33N16m55N4m5p3K07j5j46J05j7N4q7L5J57
$$ -235 67 -29 -136 -79 -66 100 189 -206 27 -206 310 -145 -91 -136 -209 -2 -17 -163 -58 -75 -21 -108 -73 84
5380H4p0K51j97j73j0J70J0K1j28l2J01k5k0R9n8o2P5j01R4J68j02l45K81j84
$$ 84 14 265 68 -105 -115 55 65 86 -42 -74 27 2 -18 81 23 -39 36 -65 29 197 95 -250 31 -153
5404a53J36j17J64P9j49K51k99k5P4j08J67q7K81N7k51p2m3L45l15K27j49N6j72
$$ -153 -17 -134 30 109 -40 211 -88 -113 -39 -147 20 -67 214 271 20 -52 -95 250 -65 162 13 69 -103
5427a03J70K6n3l20R6J73Q6k45JK22j63K01R2j02j36j30qK04j71J24J22k51J54
$$ -103 67 93 40 -280 -184 -11 75 -170 -169 53 -110 91 183 81 -55 -185 -193 11 -160 -36 86 -165 -11
5450a1P7j40J32k22P5J82o4J88k6k05K76J10j64j18j91J88p1j24Q7o5J9J17j98
$$ -11 66 -74 58 -164 -89 93 29 217 191 -14 262 372 208 90 -101 87 16 -108 -21 -86 -67 50 -148
5473a48J09k79K05K41k20K06j1j65J36k4J12n8k44K57j64J61l12J79K6R8Lo3K56
$$ -148 -39 -318 -113 128 -92 114 103 -62 74 50 162 104 -140 117 -47 114 -198 -19 7 105 108 45 301
5496C01k89o3M5J80k25P1n7k7N0k27K56j48J55p9j03J66j83K19j38J14n5J45J2
$$ 301 12 -51 -6 174 -51 20 -37 -64 -14 -241 15 -133 22 -57 -160 6 -177 42 -96 18 -37 108 120
5519A20q1L37j61n8J1l15l9L29k04J96j74O5O4j19R3K26j97j56j8J0L1j28r6L13
$$ 120 39 376 215 157 168 -147 -186 143 -61 135 -39 26 90 -29 64 290 93 -63 -81 -71 -40 -168 -264 49
5543D9r0n6K7k73L70p0l9J6J54O4J00k85L34l75R0n5J94j90n6J77j79J0L8J31
$$ 49 -41 -97 -70 -343 27 -43 -82 -66 88 152 252 -33 301 -74 16 -39 155 -35 -91 86 -93 -83 -45 86
5567H6j67L0j89o6L78q1j84L12k20L07m47P2K08q5P9K47j76j62K82n9Q1m38J39
$$ 86 -81 -51 -240 -306 72 -9 -193 119 -101 206 -241 -169 39 -46 33 280 104 -58 224 165 246 -192 -53
5590e3J08Oj17J38k76K00o7k2J75j73L22j90j08j23Q3R6r9O9k6j08O9K97m5k39
$$ -53 55 61 -56 82 -194 6 -61 -83 92 -81 241 51 -57 -180 -97 -1 -100 -31 -57 -165 -96 201 156 -83
5614h3J88K2K29m74K67L6l72J98J62k21K10j07j5r5n4N2J98l65L34o6l37L21k2
$$ -83 105 127 356 -118 149 185 -187 11 173 -48 162 55 40 -55 -109 -57 141 -224 110 44 -293 28 6
5637FPm3j36J62j74J56K46l36J09L0J20J49k69J04J99j65j39l0P2n3p0J92j39
$$ 6 13 -30 -166 -4 -178 -22 224 -112 -3 27 147 296 27 131 330 165 26 -4 68 15 -55 137 -2
5660bMJ1L6j08K2m8M2N6q8J1k50L97k26k8K75j86J52p8l7L36k3j02J5k67J18L6
$$ -2 2 13 49 -59 -37 -85 -43 13 -75 -64 -314 83 -143 -171 104 -82 70 -8 -45 291 268 166 181 -86 32 68
5686F8M1k28K30l9oj16q8j48L16k2k14J89K37l20j30K33lJ9kJ43l91K33R2l5P3
$$ 68 109 -119 111 72 66 -50 -138 -286 30 8 -206 -17 220 -100 -230 3 0 19 17 160 -231 2 94 59 132
5711A32K1n7o6k48K74r2P7K4j40J83P6j16k8O1l8Q5lk23nJ25Nk11qJ57j33K97
$$ 132 153 96 30 -218 56 -36 41 65 -75 108 184 68 40 101 63 148 145 -78 -83 42 47 -164 -172 -15 -148 149
5737A49m55L86j78l0J6j17K57j34K8K32k15k4M69m46M0o3J28p2k16K06n9N8j63
$$ 149 -306 80 -98 -128 -112 -229 28 -106 -78 154 -61 -85 384 -62 -22 -85 43 -29 -245 -39 -98 -40 -203
5760b03L29j77p3k6k63K53K5M6L55l39q1J73K3j17K17j47o0K67j54L8j51J16o3
$$ -203 126 -51 -124 -150 -413 -160 -135 -89 266 -73 -154 19 42 -75 142 -5 -65 202 48 86 -65 51 -12
5783a2K12m4l1k41N0J9k3K42k83r4K62j95J23M8j16R9n8L2k69L50j51L71m32L7
$$ -12 200 156 125 -116 -66 -47 -70 172 -111 -205 57 -138 -15 33 -83 16 -42 -10 -279 71 -80 291 -141 -104
5807a04K99l1p5k78Q2J46J0q7P6o9J24n1J97o1l11J86k28K02J9j36M5O8o6q1j00
$$ -104 195 164 89 -189 -107 39 49 -38 38 -31 93 42 239 178 -133 53 -175 27 46 -90 -45 23 -43 -124 -224
5832b24k2M12j98L7L19l94J93qk12J21q1l5J07R4R8l82N7K17j76J39op3K73J4
$$ -224 -246 166 -32 5 324 -70 123 115 -97 24 -57 -92 15 109 207 -175 -118 99 -77 62 56 -17 256 270
5856B70m26J24N2j83J47qP0k15m4J93O2q1m1m6J9J72k29l6J65J90r6k06N4N5O2
$$ 270 -156 -32 20 -163 -16 -24 46 -169 -213 -20 42 -39 -80 -126 -107 65 -164 -200 -35 155 59 -147 -93 -38 24
5881B4N6p5P9p6l7J93P0l8k54M6j6p7K86l85m0Q0J79ol50M45J03k62L9j87M53
$$ 24 80 5 84 8 -29 164 234 196 -58 -12 -28 -105 181 -204 -244 -164 15 9 -341 104 207 -55 -16 -203 250
5906B50J1m77K28K14j91j38J56n0l5M0Qj23J49K05m55K64q7j54J90J03j37o3n5
$$ 250 261 -216 12 226 35 -103 53 3 -32 8 16 -107 42 247 -208 56 -31 -185 5 108 -29 -92 -147
5929a47j30N87k90L3j65J52o0l4J38k2j81Q5J94j14P7Kp7Q6k5k03M44l83J80l7
$$ -147 -277 310 20 53 -112 40 -20 -54 84 62 -119 -34 160 46 123 125 48 134 109 -94 350 -33 147 110
5953A10mj65N6l7J44K0k52J21j38L28k44l27M39k57j01M99k86k3J49j78L73q9
$$ 110 106 -59 -3 -40 104 124 -128 -7 -145 183 -61 -388 51 -206 -307 192 -94 -117 32 -146 227 138
5975A38l26J31J13M2m3n0j70K97j18q4N9n3J30k24K09o9j91J27L18k22o9M1J85
$$ 138 -188 -57 56 98 55 5 -165 132 14 -70 -11 -64 66 -158 51 -18 -209 -82 236 14 -55 -14 171
5998A71j15j21J30m9o8O3O2J21Q3k10j24j24J29M22l64q2O0J40p9k26J41r2q1
$$ 171 56 -65 65 16 -52 11 73 194 277 67 -57 -181 -52 370 6 -76 -16 124 45 -181 -40 -132 -213
6021b13M3K2j12L23l1N4k66L64l64J77r8J04K05k40M84p14L13J81k88j45N0J24
$$ -213 -170 -148 -260 63 32 86 -180 184 -180 -3 -101 3 208 -32 452 -262 51 232 -56 -201 -151 -27
6043b7o5R3J37J21k66K53j06n3l2j09J46p8k07L65j85R2l35K33J89k26J20j29
$$ -27 -92 1 138 259 -7 246 140 87 55 -54 92 14 -193 172 -13 79 -256 -23 166 -60 60 -69
6065f9L50l38p2K48N8J02qj32j27J37J20j83N4k42P3O1k66M08l49R9K9J47p5j30
$$ -69 281 -57 -129 119 177 279 271 139 12 149 269 86 140 -102 -29 32 -234 174 -175 -76 -47 100 25 -105
6089a05J34p4k4J03o2j30J04q2QL69j66J91j46j51Q2L7P7p8k08L13k22j70M70
$$ -105 29 -45 -69 34 -28 -158 -54 -136 -128 241 75 266 120 -31 51 88 165 87 -121 192 -30 -200 270
6112B70j50N6l07L14j68l35K37r5Q3J40o0L3Q6k0J83k37j69Q4J28L9p5j37qj3
$$ 270 120 176 -131 183 15 -320 -83 -178 -95 45 -15 18 104 84 267 30 -139 -55 73 112 37 -100 -108 -121
6136a21N8O3K56j00r9J69J27k42k08o3K69l36L54l2p1j16L85n75M23k89p9R4J95
$$ -121 -63 0 256 156 57 226 353 111 -97 -160 109 -227 127 95 24 -92 293 -282 141 -148 -227 -133 62
6159F2J57l30J86n2Mn2K83r9l5J72k63O5L9o5K7J13k7j87n1k49J02l8J32K35q5
$$ 62 219 -111 75 23 27 -25 258 159 124 296 33 98 137 72 99 212 185 -2 -53 -302 -200 -238 -106 129 44
6184D4j79N3j9O3P4o3j77L16k7q0j08J74R8m9o2k72O5L55j65J99J4k28J05p9N3
$$ 44 -135 -82 -101 -38 36 -27 -204 112 85 5 -103 71 169 120 58 -214 -149 206 41 240 254 26 131 52 105
6209A05n2p2j80M69l57K25R8l61J21K56j01j31L1N9j71k02K91n4O0k15P7K30j57
$$ 105 53 -19 -199 270 -87 138 236 -125 -4 252 151 20 51 110 -61 -263 28 -26 34 -181 -104 126 -31
6232c1o0L52r0n3j43KJ28N3j13q1J17J05k53JQ9o4O1M3k08L38j9l39Q7K76k69
$$ -31 -91 261 171 118 -25 -23 105 158 45 -36 81 186 -67 -66 23 -41 20 63 -145 193 174 -165 -78 198 -71
6257g1j8J30K1n4N9J45j62q3J80l22K56Q2k55O3J14r8L8Q7j30q1J97n9j69J39
$$ -71 -89 41 62 8 67 212 50 -33 147 -175 81 163 -92 -29 85 -13 25 112 -18 -99 98 39 -130 9
6281IQ6L5j95P3k23K83k28K56k04K23Q9k55K93j78J37j50j79K30J8o3J0r9J56
$$ 9 95 130 -65 8 -215 68 -160 96 -108 115 204 -51 242 64 201 51 -128 102 120 57 67 -32 124
6304A24o0LM6l69J68J90q8j47m3j6L45l53J71J76m32L85k51R7M18l32j3q7q8K04
$$ 124 64 67 113 -256 -88 102 14 -133 -176 -192 153 -200 -29 147 -285 100 -151 -54 364 32 19 -68 -156 48
6328D8K96k18kl2j44M8j59R3K25l43K45J42k52J80R2p8k15K54m02K82k47J43P0
$$ 48 344 126 124 92 -52 -4 -163 -70 155 -188 57 199 -53 127 219 141 -74 180 -222 60 -187 -44 26
6351B6j30K27k78K01n9Q1j20K52j69O2k31K92k90K66p7p8j34K47j90k59K73n1
$$ 26 -104 123 -155 46 -13 68 -52 200 31 93 -138 154 -136 130 53 -25 -159 88 -102 -361 -88 -139
6373a39j14O43n21J78j00j67P6R2O9l00N40j63k5J32l55K26J32j98J00qj94J22
$$ -139 -253 390 -131 47 -53 -220 -144 -52 17 -283 257 94 69 201 -154 72 204 6 106 98 -96 26
6395B6j77L7J60J3L59o17J17k0K02O4k25j26K69j25J74j84j08j4M0k0J47qL9J76
$$ 26 -151 -114 46 59 418 -199 -82 -102 100 164 -61 -187 82 -43 131 -53 -161 -175 -135 -155 -8 -16 23 199
6419A99q5p7L29l88K04k08j25P9O7J59J47k83j25qj27P8rM26l17K37j87q4L3j9
$$ 199 114 37 366 -22 182 -26 -151 -72 -5 154 301 18 -107 -115 -242 -164 -173 253 -64 173 -14 -98 -65 -84
6443h4j71J98l2J42k39J48J43j90n3N1MJ65j97m6K20k13K31o8P8J54k98J47J58
$$ -84 -255 -57 -89 53 -186 -38 105 -85 -138 -87 -83 82 -115 -161 59 -154 77 9 87 241 -57 90 248
6466B48j01j61J39j95M4J45k03k02O4J09J4J02j9J02j32j31J61J23k93K76j04
$$ 248 147 -14 125 -70 -26 119 -84 -286 -222 -113 -99 3 -16 86 -46 -177 -16 107 -186 90 -14
6487a4j27L87k44J39l56L41J11k33L6K46k94R2o0l97L63j06J48k15P7K64j29o1
$$ -14 -141 246 2 141 -215 126 237 4 40 286 -8 84 24 -373 -10 -116 32 -183 -106 158 29 -32
6509c2q5p7M34j44k70N6l4j96M76%k71P6r1J69O1P2r4l7j26J77L4M5L2l68J86
$$ -32 -117 -194 240 96 -174 -118 -152 -348 128 128 -143 -67 -158 11 72 144 50 13 -113 64 98 143 175 -193 -7
6534gO2o9J1n3Q0k0l1q7m7N9J51J53l50m3P7J95k14J14L8m3M2j6k35p0N85m12
$$ -7 55 -14 -3 -56 24 4 -27 -114 -161 -102 49 202 -148 -191 -114 81 -133 -19 19 -24 18 2 -233 -303 282 -130
6560a30J75J84j79j68m5L05o9j22j13L00j29k5K4O1o6k65L37k03J82k09J61j9
$$ -130 45 229 50 -118 -163 142 73 -49 -162 138 9 -16 8 69 3 -262 75 -128 54 -155 6 -13
6582a3j10K92k53J0L14k77K95P6m35Q9O0M3P4k35P1QKj6N1m1M08m01m8j60j07
$$ -13 -123 169 -84 -74 240 -37 258 334 -101 -12 48 91 165 -70 1 9 11 -5 46 5 413 12 -36 -196 -303
6607c03K32K42l49N1N7J08p1k15K45P5o5K38j91j79K84j12j5j49K59l67Q8J22
$$ -303 -71 171 -178 -127 -70 38 -33 -248 -3 72 7 245 54 -125 159 47 32 -117 142 -225 -137 -15
6629a5j47K26k98J47q8K5K92l39L04p0l18K58o6J39J8l9M2l0M1J39k41K0k03J50
$$ -15 -162 64 -234 -87 -175 -150 142 -197 107 37 -281 -23 -89 50 68 29 71 41 82 221 -20 0 -203 -53
6653e3J33K8o7l7K5K10m43J16j8M6o3J35J97j63j51N3l6j6K90l99R9L6K20p2j34
$$ -53 80 108 41 4 29 239 -204 -88 -106 -60 -123 12 209 46 -105 -52 -88 -104 186 -213 -114 -78 142 70 -64
6678f4J60M7l14K82OM2nnj5o2j17j00R5RM05l24r1lJ23p7J16m7j17K09l25K6K87
$$ -64 96 143 -171 111 117 159 154 149 134 72 -45 -145 -50 -41 364 40 -51 -54 69 -8 108 61 -56 153 -172 -146 141
6705A41j47q1P4m6K07k07K99k09j52L97j38k92J70n1j49K16J22j33j19j02K60
$$ 141 -6 -87 -13 -59 148 -59 240 31 -121 276 138 -154 16 -35 -184 32 154 21 -98 -200 60
6726F0qK0k74K60m15M38L9j65J06j77n1K72kk97N2N9k27J97K28kk34L6J79O0j66
$$ 60 52 72 -202 58 -357 81 120 -45 61 -116 -167 105 103 -194 -142 -83 -310 -113 115 113 -121 -85 94 154 -12
6751a2j7J36p5m4J48q5J96k60K5k28K12p1J19j5R9k07l3n5J64R5j08R0l6l67K45
$$ -12 -29 107 32 -12 136 51 247 -13 12 -216 -4 -75 44 29 128 -79 -112 -167 -3 92 -16 74 38 -329 -84
6776h4J43J4jk42K46L9J31m47J01P4J50k17K30p5j23J73j46o6R6J44j33m9lJ04
$$ -84 59 73 72 -170 76 115 246 -201 -100 -26 124 -93 137 62 -61 112 -34 -100 -4 140 7 -42 -45 59
6800E9n8j91K79j97j75L04N4J64k39l2J12J66l40J8O9n1K12q5Q4k11j54M00qq0
$$ 59 1 -190 89 -108 -283 21 75 239 0 -32 80 246 -94 -76 -7 -58 154 69 153 -58 -212 188 180 100
6824A00O5l02L7J2j5j34J82J08O6j05j71j12R0K1J75J92k37K00l62n4q0K66K5
$$ 100 165 -137 -100 -88 -103 -237 -55 53 119 14 -157 -269 -179 -158 17 209 -28 172 -190 -244 -324 -58 -33
6847c3K20J6l38M83m18K21o6m7K36j68k92J13K53k66J02j05L6O3o2J54Qr3M5j73
$$ -33 187 203 -135 348 -70 151 85 38 274 106 -186 -73 180 -86 16 -89 -53 10 -52 102 110 17 62 -111
6871a11J33L14k83q5P3j5J05J8j93J18r6M0N4k43M6L53o81N64J21l22L34k38K4
$$ -111 22 336 53 -32 41 26 131 149 -44 74 -22 18 72 -171 -125 228 -453 111 232 -90 244 6 30
6894C0k21J68J26k55Q7n1j1j47K28K30l59L09j5O3r8j28j09K16k38J7J41j27K98
$$ 30 -191 -23 103 -152 -65 -116 -127 -274 -46 184 -175 134 119 182 84 -44 -153 63 -175 -158 -17 -144 154
6917A54k0k76r7K93l4J12j90mJ6N4q8J82m1k70J79J92m7J66k95P7q2p7L66l0J28
$$ 154 134 -142 -239 54 20 132 -58 -62 -46 8 -80 102 61 -209 -30 162 115 281 -14 63 -19 -96 270 240 368
6942C68K5m40m2J00k61K76rj99K42o9j08K64j34j81K56l2Lj46P8q1r0K52N0q8
$$ 368 393 -47 -89 11 -250 26 17 -182 60 -9 -117 147 13 -168 88 56 59 -87 -9 -90 -180 72 122 34
6966C4j38kj28J31P7J87l89K73j15J19K9l6J59J68k53k16J21l57L53p8J31O1k25
$$ 34 -104 -106 -234 -103 -26 161 -228 45 -70 49 78 42 201 369 116 -100 21 -336 17 -61 70 131 -94
6989i4m4J22K09J02k89l7K67l99J36P2l1j40R7J39J18L6k67J07j15j1J20n3mR7
$$ -94 -138 -16 193 295 6 -31 236 -163 -27 45 14 -126 -29 110 228 264 -3 104 -11 -22 98 45 41 138
7013A38r5O5j47P9R4k63K43k12N6j63J96j57K56l1l2r9q4n2J8L38j49J09j62K26
$$ 138 43 108 -39 40 134 -129 114 -98 -42 -205 -9 -166 90 59 27 -72 -156 -208 -190 148 -1 108 -54 172
7037A72j61K13k02j61PR8k2J68q0Q7j47J14j93o3J47J19j42j09K30k53K3L72l50
$$ 172 11 224 22 -139 -132 -34 -56 112 32 119 -28 86 -107 -170 -23 96 -46 -155 75 -178 -155 217 -133
7060a33q8M36j27K20k46J8j32j01M9J99n9J58k02k22O32l10J26o4L3O0m90K68
$$ -133 -221 215 88 308 62 80 -52 -153 -104 95 36 194 -8 -230 402 92 218 154 187 247 -243 25
7082B5j93M26l35L3j88K24l59K35M38n88L05j10m1J89l80L52O4j07K06k42K0K54
$$ 25 -168 258 -77 -44 -232 -8 -367 -132 306 -282 23 -87 -128 61 -319 33 97 -10 196 -46 -26 228
7104B28j86j69J87K12k67Q0q6K64L3l19L28k51k60J85m6L1R2r0M4J0R0k25J85
$$ 228 42 -127 60 272 5 85 -1 263 296 -23 305 54 -206 -21 -67 -36 56 -34 10 20 110 -115 70
7127G0m6k32L79k32Q9l2J74o9j51Q9n3J48n6j09P5K41k68K47j87P6j46N7Pm08
$$ 70 24 -208 171 -61 28 -4 170 101 -50 39 -14 134 78 -31 44 285 17 264 77 153 7 64 71 -337
7151c37J79J67J5p0n1J8l32N22o0j57L74m89J16j7KJ69J3p5j04R7K10k07j51P0
$$ -337 -158 9 24 -46 -97 -79 -411 111 51 -106 268 -221 -105 -122 -120 49 62 -13 -117 -20 190 -17 -168 -98
7175i8M05n03M35j79m6M5n9M4k26J23K04n0J84o84K10K30m7J35k21J37j58K64
$$ -98 307 -196 239 60 14 59 0 44 -182 -59 145 95 279 -405 -195 35 -12 123 -98 39 -119 145
7197A45l24L68k41NJ72j13J77k66J86k93K64l2M7j55k20O49k01n2k63J33K1J7
$$ 145 -179 189 -52 -47 125 12 189 -77 109 -184 80 48 95 -60 -280 369 168 116 -147 -14 7 24
7219B4j58J91j12L54l93r9K21o3j57O1J09Q2Q5K4p0Op8l07M47J97k96j75K13P
$$ 24 -134 57 -55 299 -94 -193 28 -35 -192 -131 -22 60 145 169 99 105 27 -280 167 364 68 -107 106 113
7243A13k12P2j51K98q0o2J03k05k9J64j8j55K10j99J57L47l35J22j90m02O91j8
$$ 113 -99 -27 -178 120 40 -22 81 -124 -153 11 -7 -162 48 -151 6 353 18 140 -50 -452 239 221
7265B21j22JJ6q0p8K33r2j99J5L25j33l31L79k27Rj85j0K38j00p5n9K13K62j76
$$ 221 99 100 116 36 -42 191 99 -100 -85 240 107 -224 155 -72 -63 -248 -258 -20 -120 -195 -254 -41 221 45
7289D5R2j36K76j11k02Q8J13l05K08K6J44j51l47L25j08J89j91l1K55k43J2k33
$$ 45 137 1 277 166 -36 52 165 -140 68 94 238 87 -260 65 -43 146 -45 -76 179 -64 -52 -285
7311b85K28M2j52L6K12j50K76k1k39J68r2L18k80j05J49N5j06J1j15K76k80l1
$$ -285 -57 -15 -167 -131 81 -69 207 186 -53 115 23 341 61 -44 105 160 54 65 -50 226 -54 -85
7333h5R8O0p3j00R0J73l00ppJ72J30j2j00q1K26q5n1q6j53N24k20j19k02L05O1
$$ -85 13 73 0 -100 -10 163 -137 -144 -151 21 151 139 39 -42 184 99 48 -38 -191 333 113 -6 -208 97 158
7358A58j4m1O6J01k25J66k07O0J34k79K15j65J27r8J66k53J32r7j08K31j42J58
$$ 158 144 103 169 270 45 211 4 64 198 -81 134 -31 96 -2 164 -89 43 -54 -162 69 -73 85
7380H5j98J34k7mJ1J21j55M2L6m5J82j77l9K56l19P5L1p0L26j76l9k16J72j17
$$ 85 -113 21 -6 -10 1 122 -33 9 45 0 182 5 -34 222 -97 -22 9 -61 265 89 50 -166 6 -111
7404a11k8J84r2j9L23l25j4O2M3j69J08L44j34j17K0k75J59j63K02L7j04N3q1
$$ -111 -139 45 -47 -66 257 -68 -82 -20 23 -146 -38 306 172 55 75 -200 -41 -204 -2 35 -69 -16 -97
7427i7J34j43J41J10q1l4P6q5J6j31Ko7L4J57Q6k5q1n1K08r2Q3o9r1L3oj41K94
$$ -97 37 -106 35 145 64 30 106 21 37 -94 -92 -159 -125 32 118 93 12 -39 169 77 160 91 0 33 27 -114 180
7454A80o1k61K58r7J70o8p4n7J17P2j42J93k84Q4J37k39K6K37q0o6k72J18L14
$$ 180 119 -142 116 19 189 121 47 -10 107 179 37 230 -54 30 167 -72 -46 191 111 45 -227 -109 205
7477B05j91j21o1K35k78R4K63N7L3j41k3j53J66L4k36j26J77L5L56l04k8J34l83
$$ 205 14 -107 -168 67 -211 -117 146 203 236 95 72 -81 85 119 -117 -243 -66 -31 325 21 -7 127 -256
7500b56L5K68p6K72l18j85K48j07K20Q5l88JJ55J47Mq8J79k66M3n6J37K95l55
$$ -256 -221 47 -29 243 -75 -260 -12 -119 101 186 -202 -201 -46 101 105 17 196 -70 -27 -83 54 349 -6
7523fK09k30J2P9j20K52j90m2J55j18M2p6j38K41l86K78j26l20M33R4K2m9K72
$$ -6 203 -27 -15 64 -56 196 6 -36 119 1 43 -33 -171 70 -316 -38 -164 -484 -51 43 65 16 288
7546B88l39j8J91q6L5O1m2q0n5K38j28l24O86k84k66J28j29J11M1L15ql8k45k82
$$ 288 -51 -69 122 36 71 132 90 10 -45 193 65 -259 427 143 -123 5 -124 -13 28 343 335 297 52 -230
7570b30K93m2j55J5J60m9q4J88l21L81p1J90k21N9M2r7On1j12O9J02j81J30r9
$$ -230 63 21 -134 -119 41 -8 -92 96 -225 156 85 275 54 113 155 58 64 13 -99 -30 72 -109 21 -78
7594g8J22j92K59J40m20K27N9j00K37m75J23R4R0j82OK19k09j74L67n7J13j59
$$ -78 44 -148 111 251 -169 58 117 17 254 -221 -98 -4 86 -96 -90 129 -80 -254 113 56 169 10
7616A0J82k1j89j82L14k64J11J83k08J78J71n52L26J17j42q6K09k38Q9j06l1J48
$$ 10 192 171 -18 -200 114 -150 -39 144 -64 114 285 -267 59 176 34 -52 157 -81 8 -98 -129 19
7638A9j17J04n3J64NL4k17Q4k41M05l13M6L9J13NO2J34k66j67O1J34p1OL6M6L4
$$ 19 -98 6 -47 117 122 156 -61 23 -218 187 -126 -80 -41 72 77 139 273 7 -160 -99 35 -36 -30 6 52 86
7664H6j01J04o1mk5P5rj00n2K41j85J9R1j8Q8p1L9k63M95j92l32J90M4k18L5L16
$$ 86 -15 89 28 24 -1 74 65 -35 -87 154 -31 -12 79 61 149 78 117 -146 349 157 -175 15 59 -159 -124 192
7690A92j20j13j66K96R5J60k82j53l8K5J22Oj50K79k96K09L41m90R0k0k8k3J64
$$ 192 72 -41 -207 89 184 344 62 -91 -129 -104 18 24 -126 153 -143 66 407 -83 7 -13 -41 -64 100
7713A00k16j1L58J06k51J47m2k92J15j84M51l38K42j73j24P7L0P1k19J53k42J87
$$ 100 -116 -127 231 337 86 233 191 -101 14 -170 281 -57 185 12 -112 -35 -5 66 -153 0 -242 -55
7735e5lQ0l9p4K10q0J11l83M15N5l33J43J11J35m4k17Q3o7m7K24k90j33O0m4J23
$$ -55 -58 22 -17 -91 119 39 150 -233 182 237 -96 47 158 293 249 32 115 48 1 225 -65 -198 -138 -182 -59
7760e9J37j02j00K21l15qL45K0m07R0K56J54k29k83J49K13K09r5j19Q7k90J83
$$ -59 78 -24 -124 97 -218 -226 119 139 -268 -178 78 232 3 -280 -131 82 291 196 77 164 -126 57
7782E7K5L2kL2k07K05j54J18j76j44J48K35l95J17P9J22L8K7n1k57j45K62Q9j31
$$ 57 82 114 112 144 -63 142 -12 106 -70 -214 -66 169 -226 -109 -30 92 130 157 106 -151 -296 -34 55 -76
7806g6N4n8k9J99k86K89j37L78k08Q0j48k73K82j92K24o3N8j97Q5J14n1k10K58
$$ -76 -22 -80 -109 90 -196 93 -44 334 126 206 58 -215 67 -125 99 36 94 -103 -18 96 45 -165 93
7829I3j43J44j09k24J46o2L40k28O7j24J09J35r9J0l9M0k08K88k72K47j85NJ04
$$ 93 -50 94 -15 -239 -93 -155 185 -43 24 -100 9 144 45 55 16 56 -152 136 -136 111 -74 -69 35
7852C5p7Q6M6j20j50J77m9N9N2k07j7J48k28J97j9O1Q3j95K84O4p2q0j50PK33
$$ 35 -42 44 90 -30 -180 -3 -52 7 59 -148 -165 -17 -245 -48 -67 -6 77 -118 166 230 158 78 -72 -65 168
7877A68k65L37k62J3K11k10k9N6jl34L84m6j67L27k66n7J67k35n4L62j72O2L0
$$ 168 -97 240 -22 -9 202 -8 -37 19 18 -316 68 22 -145 182 -84 -141 26 -209 -263 99 -73 -11 19
7900A9k03J83m2R8n8q2P3O8k16J10J88n8o0K00k53J38J78l58K1n0K78q4l36K10
$$ 19 -184 -1 -43 55 -3 -85 -12 56 -160 -50 138 80 20 220 -33 105 283 -75 -54 -104 174 90 -246 -36
7924c6L0k21M67k83r4j1r7M1L8J20J6KJ34j33J37o2J71n9kl26J89o6J53l01K26
$$ -36 -6 -227 240 -43 -137 -148 -245 -204 -166 -46 -30 -28 106 -27 110 48 219 160 158 -168 21 -45 108 -193 33
7949C3Mj66m2J49J1o1J4J46J05j20J21m16L74j35J69k72J23L8j94J19n7J49jJ1
$$ 33 37 -129 -171 -22 -11 -72 -58 88 193 73 194 -222 152 17 186 -86 37 75 -119 0 -57 92 91 102
7973A02L9k03k45L36j48J65O8MJ0j92K4n7K93p3l58N0K86p9j9m9j74J37K5M10
$$ 102 141 -62 -307 29 -119 46 114 118 128 -64 -40 -97 196 123 -235 -185 101 22 3 -46 -220 -83 -58 352
7997C52k74k71L34j60l9o2j17J10J21K2n4M6K4J14ok5j92K50n7k03L1J46p5j09
$$ 352 78 -193 141 -19 -58 -120 -237 -127 -6 16 -38 8 32 146 140 115 -77 173 116 -87 -56 90 15 -94
8021i4K22j68N8k00K65j55J38k9M9o3l21M40K1n5k17J44k69L53q4j12J6L60l9
$$ -94 128 -40 18 -182 83 -72 66 37 86 23 -298 142 163 108 -109 35 -234 119 35 -77 -61 299 260
8044B60r7NL9j95K88j35L4k39j1J75l67J71j17J23j6J91j61j6P4k1L09m98K06
$$ 260 163 168 207 12 300 165 199 -40 -51 124 -243 -72 -189 -66 -82 109 -52 -68 6 -15 294 -204 2
8067BNK19k35rP3J76m7jk01L37k14J27k84K10k19r2J67k89L87j77Q4m2l4K03r0
$$ 2 7 226 -9 -18 55 231 184 183 -18 319 105 232 -52 158 -61 -153 14 -275 112 -65 19 -23 -57 146 56
8092E6j28j20J51Q6Q0K3k74J55Q4j22lO6j87O3J19M1k5k03J12J81j2Rk87J01J86
$$ 56 -72 -192 -41 45 125 148 -126 29 113 -9 -12 54 -133 -70 49 90 65 -138 -26 155 143 152 -135 -34 152
8117A52j37p9K17j50j22o5K46q5R6j10j11K19J0J3k03N4oO4k58M37k24L6j15P2
$$ 152 15 -64 153 3 -119 -184 62 -23 73 -37 -148 71 81 94 -109 -55 -61 3 -255 182 -42 -6 -121 -49
8141d9r2L77j65j39Nk65K74j47L57q7k20L23m4r9j06k03J83K3K18k14j9J27N9
$$ -49 -141 236 71 -68 -63 -328 -54 -201 156 69 -151 172 128 29 -77 -280 -97 -74 144 -70 -89 38 97
8164I7p1p0K27k42k1J33l8R1J2N4o5p7l1R7L7j95K61l76K73r8J1P2j94k59N28
$$ 97 26 -44 183 -59 -80 53 15 106 118 172 107 30 -1 96 133 -62 199 -177 96 -2 9 81 -113 -372 156
8189A56m27J17
$$ 156 -271 -154
8191a54
$$ Imaginary data points
##PAGE= N=2
##DATA TABLE= (X++(I..I)), XYDATA
0@%%%%%%%%%%%%%qJ6j6J6j6K4l2L3m1M8n6O8p7Q9j04J20j39J59j81K05k32K63
$$ 0 0 0 0 0 0 0 0 0 0 0 0 0 0 -8 8 -8 8 -8 16 -16 17 -24 24 -32 36 -41 48 -56 64 -75 84 -97 108 -124 139
35A39k95L31l70M12m60N12n68O31o98P71q50R36j033J137j251J378j518J675j849
$$ 139 -156 175 -195 217 -243 269 -299 332 -366 405 -445 491 -542 595 -656 722 -796 879 -970
54i70K045k268K521k813L156l564M058m673N456o490P929j0067J3552k0160L6765
$$ -970 1075 -1193 1328 -1485 1671 -1893 2165 -2508 2948 -3542 4387 -5680 7872 -12288 24477
69B4477j50008k47932M52004J47489k76386p0534J19465j6308o681P3192o2600
$$ 24477 -125531 -373463 78541 226030 -50356 -120890 -1425 -17733 -24414 48778 -13822
80a3822r2768J51337N4572j48272q986O0436K7951P7099o4813j38832N3434J30615
$$ -13822 -106590 44747 99319 -48953 -57939 2497 30448 107547 42734 -96098 -42664 87951
92H7951j6167q0119J2812r162n6539J11683M0054j84215L1692J63899j13253j06359
$$ 87951 71784 -8335 4477 -4685 -61224 50459 90513 -93702 -62010 101889 -11364 -117723
104a17723J26234N4375j11142J173R6497q5250n2329J67306k1538j64884Q8712
$$ -117723 8511 62886 -48256 -47083 49414 -35836 -88165 79141 57603 -107281 -18569
115a8569J08680r5214n5884Q6195N0713q0769l8666O9423K1024k4858l7787j6255
$$ -18569 90111 -5103 -60987 25208 75921 -4848 -43514 25909 46933 22075 -15712 -31967
127c1967Q2422l677j09981M5640P3818p3758l2905P3624O289q9003J5857R1981
$$ -31967 50455 46778 -63203 -17563 56255 -17503 -50408 23216 29505 -59498 -43641 48340
139D8340n7518m3776Q4398l4656n7941Q7655J8415q3918R721P8599k0493p7604
$$ 48340 -9178 -52954 31444 -3212 -61153 26502 44917 -39001 -29280 49319 28826 -48778
151d8778M6000N8481n4293l098K3318l9757J8765L6343k4516j6286o571k379J3800
$$ -48778 -2778 55703 1410 -1688 21630 -18127 638 36981 12465 -3821 -10392 -12771 1029
164A029J4131m619l8533O139L4887l2705R706L7261o2001j616Q0957l3561p6581
$$ 1029 15160 10541 -27992 -21853 13034 -19671 -9965 27296 -34705 -36321 44636 11075 -65506
177f5506N0617Q8762n0861r2473N6662N9683l6009M532q744m1372M1865L8183
$$ -65506 -14889 73873 23012 -69461 -12799 46884 10875 15407 6663 -34709 7156 45339
189D5339l7445k8909J7919K5505j8976j5381J3390j2480J4298J9159m8311m217
$$ 45339 7894 -21015 -3096 22409 3433 -11948 1442 -11038 3260 22419 -25892 -30109
201c0109L9100q094J690R63l1559K986M2416J5388n1728j9645O5580j692m9016
$$ -30109 8991 897 2587 3550 -28009 -25023 17393 32781 -18947 -38592 26988 25296 -23720
214b3720K7948J0699j8648J9710l271k7251O351L3927N00n0201N350M5428k2904
$$ -23720 4228 14927 -3721 15989 12718 -14533 -8182 25745 26245 -23956 -18606 26822 3918
227C918j6022J3901r174P700J700j6575J0421M410m526p98k677J1567r965l670
$$ 3918 -12104 1797 -7377 323 2023 -14552 -4131 279 -4247 -5045 -7722 3845 -6120 -9790
241i790K6682j8449j4004K9899q171j1147J3091m137k850J302Q695k203k5408
$$ -9790 16892 -1557 -15561 14338 6167 -4980 8111 3974 1124 2426 11121 8918 -16490
254a6490K1601K0030l6468r40K0678o161k581q249K944R715j0905N255o60j0523
$$ -16490 5111 25141 -11327 -12267 8411 2250 -331 -8580 -5636 4079 -6826 -1571 -2231 -12754
268a2754J7170l031r561R699p381P391P635j6239Q797M973p883O580l218K781
$$ -12754 4416 1385 -8176 1523 -5858 1533 9168 -7071 1726 6699 -1184 5396 2178 4959
282D959K69j2736J7932k35k2481J4015N892q090m52o799R771J202j2886J1070
$$ 4959 5228 -7508 10424 10189 -12292 1723 7615 -475 -927 -7726 2045 3247 -9639 1431
296A431n504n440J6198r675n346Q222k598Q314q051o754J9228p186p008R573n708
$$ 1431 -4073 -9513 6685 -2990 -8336 -114 -2712 5602 -2449 -9203 10025 2839 -4169 5404 -304
311c04N104p02p389J2450q645m788J4068j0981j179N163o509P415n959m274J1738
$$ -304 4800 4098 -3291 9159 514 -4274 9794 -1187 -2366 2797 -3712 3703 -2256 -6530 5208
326E208j1275J673R495j3360N595M843n501N188p763M320J0569j4146L883P016
$$ 5208 -6067 -4394 5101 -8259 -2664 2179 -3322 1866 -5897 -1577 8992 -5154 -1271 5745
340E745p413P259n311k161J0403j0428K660N518j0804P354n7n833N473o434M250
$$ 5745 -1668 5591 280 -1881 8522 -1906 754 6272 -4532 2822 2765 -3068 2405 -4029 221
355B21L898j4053J0111L595j2282R074p05l923M777m465O715j793q447J3231m075
$$ 221 4119 -9934 177 3772 -8510 564 -141 -4064 713 -3752 2963 1170 -7277 5954 1879
370A879n285J0092r254J922R696r551Q81O66j357P286q585o66M818o612R551l969
$$ 1879 -3406 6686 -2568 -646 9050 -501 380 1046 -311 6975 -1610 -2276 2542 -4070 5481 1512
386A512j4850J6117K315j0620L935k226J887K533p54L305j1755L154J8560j5097
$$ 1512 -13338 2779 5094 -5526 -1591 -3817 -1930 603 -151 3154 -8601 -5447 13113 -1984
400a984m606J3275q100K319N656q146j10L801O788o651j4107J6330L903j3915
$$ -1984 -6590 6685 -1415 904 6560 -1586 -1696 2105 8893 2242 -11865 4465 8368 -5547
414e547J0668n862j2341J6818K929j0737p09L605K406q940O583J0487j7818N007
$$ -5547 5121 -741 -13082 3736 6665 -4072 -4781 -1176 1230 -7710 -1127 9360 -8458 -3451
428c451J3343j9947N796J8477j3818o602J0364J586j0901O85K0821j0786j9422
$$ -3451 9892 -10055 -4259 14218 400 -6202 4162 5748 -5153 -4468 16353 5567 -13855
441a3855J8638k620j0176K1246o858k1061J0674R768o640m758R763k472j7903
$$ -13855 4783 2163 -8013 13233 6375 -14686 -4012 5756 -884 -5642 4121 1649 -16254
454a6254J8992R950l0352J3270K3970k5045p672J7192q36k824O461j093j8669
$$ -16254 2738 12688 -17664 -4394 19576 -5469 -13141 4051 3215 391 6852 5759 -12910
467a2910P527K7223k1159j3381K6945j3900j5075K7905l167k4450R707J7430j2812
$$ -12910 -5383 21840 681 -12700 14245 345 -14730 13175 10008 -14442 -4735 12695 -117
480a17j4702J9927P79k3392K1962R202l1260J0970J6797j6019M977R155j4236
$$ -117 -14819 5108 5887 -17505 4457 13659 -17601 -6631 10166 -5853 -876 8279 -5957
493e957n306K2896M671l5009Q679L7691k5059j6645K3075j1675m361K6110p974
$$ -5957 -11263 11633 16304 -18705 -10026 27665 2606 -14039 9036 -2639 -7000 19110 11136
506A1136k8192L239K4853j272j4474P869j2555q632L7351r743l9347K8816K4983
$$ 11136 -17056 -13817 11036 9764 -4710 3159 -9396 -18028 19323 9580 -29767 -951 24032
519B4032k9621j5549J8284J2617o028M822o933k9404K4154L7543k9322j5749J3788
$$ 24032 -5589 -21138 -2854 9763 3735 8557 1624 -27780 -3626 33917 4595 -11154 2634
532B634r868N417K0096j1639j9883J2113J7832k6766j0767M0944n771l1456J5079
$$ 2634 -7234 -1817 18279 6640 -13243 -1130 16702 -10064 -20831 20113 14342 -17114 -2035
545b035r84j2224K3496Q739k2894j1645J4555O273q430J7492j325l3442J8752
$$ -2035 -3019 -15243 8253 16992 -5902 -17547 -2992 3281 -5149 12343 11018 -22424 -3672
558c672K0361k7909J0803K6047k5547k2984K2585K0462j8912o204J8077j9471
$$ -3672 16689 -11220 -417 25630 83 -22901 -316 20146 1234 -4970 13107 -6364
570f364r224K8989j1318j1457K3741j4022k4551K0396J9631j5922j0990J7484
$$ -6364 -15588 13401 2083 -9374 14367 345 -24206 -3810 15821 -101 -11091 6393
582F393r449k0545L4109R791l7403J1775J8270k1469M400J8397j1504j1905J5547
$$ 6393 -3056 -23601 10508 20299 -17104 -5329 12941 -8528 -4128 14269 2765 -9140 6407
595F407N701k4790R837K4320k7462m279K8090k2519j2777L0762j426k6036M897
$$ 6407 12108 -12682 -2845 21475 -5987 -10266 17824 -4695 -17472 13290 11864 -14172 -9275
608i275K0137j2059j3216K2353n877k0349K6019K247k6358J3440R859j2326Q544
$$ -9275 10862 -1197 -14413 7940 2063 -18286 7733 9980 -16378 -2938 6921 -5405 3139
621C139R116j8145j2365K8931J2019l3694M236K3036k0962r90J8944j5177l349
$$ 3139 12255 -5890 -18255 10676 22695 -10999 -6763 16273 -4689 -5679 13265 -1912 -5261
634e261J7271q266k1334R598K5459j2449j7310J3834r279o936K9673m701k6214
$$ -5261 12010 3744 -17590 -7992 17467 5018 -12292 1542 -7737 -14673 15000 10299 -15915
647a5915Q950J1587o705j985R355N01j1847Q097K362j6242J7227J5148k3174n019
$$ -15915 -6965 4622 -2083 -4068 5287 5788 -6059 2038 4400 -11842 5385 20533 -2641 -7660
661g660R313k649O060O385r089j4563O910J7677j4719p938K0652r824j5397J3917
$$ -7660 1653 -996 5064 11449 2360 -12203 -5293 12384 -2335 -10273 10379 555 -14842 -925
675i25J951m150N568j077p615l934J3092N348j3363O035L988j2966R726Q058j0345
$$ -925 1026 -3124 2444 1367 -6248 -10182 2910 8258 -5105 930 4918 -8048 1678 9736 -609
690f09J796K658k956j043J708M454n459j361O737j2388R24J5824j1353p218Q998
$$ -609 1187 3845 889 -154 1554 6008 549 -812 5925 -6463 -5539 10285 -1068 -8286 712
705G12j532k894J436K641j901n295Q986m0j1605J1515M558j2088N636L551l768
$$ 712 -820 -3714 -2278 363 -1538 -6833 2153 2113 -9492 2023 6581 -5507 129 3680 -88
720h8J828J14J976k298j703N885m960p22N470q756L098O956j0891N28N293k678
$$ -88 1740 1854 3830 1532 -171 5714 754 32 5502 -3254 -156 6800 -4091 -3563 1730 -948
736i48Kk752J911K35l667P734l880o762J1829k496p411P221Q04o71m39j437M977
$$ -948 -946 -3698 -1787 -1552 -5219 2515 -1365 -8127 3702 1206 -6205 1016 1820 1149 710 -727 4250
753D250l372l1N656o999J421M261o682L975Q74n928M407k058j256K041m061L198
$$ 4250 878 847 6503 -496 925 5186 -1496 2479 3353 -2575 1832 -226 -1482 559 -3502 -304
769c04n66m040N731m409j139Q166o780j012N654k322J771j692j78N674n837J719
$$ -304 -870 -4910 821 -3588 -4727 3439 -3341 -4353 1301 -1021 750 -942 -1120 4554 -1283 436
785D36M508n725M063O87n089N272k727j050L362n536K810O19n398N100k271k353
$$ 436 4944 -781 3282 3969 -1120 4152 1425 375 3737 -1799 1011 1630 -3768 1332 -939 -3292
801c292L845n396L049L103p294M755J000k605L806l760J994L745n594M477P05
$$ -3292 553 -4843 -1794 1309 -5985 -1230 -230 -2835 971 -2789 -795 2950 -2644 1833 2538
816B538l844N795l060j193M640m676K602N75n033N318k749k910M699m795P33K379
$$ 2538 -1306 4489 1429 236 4876 200 2802 3377 -1656 3662 913 -1997 2702 -2093 -1360 1019
832A019n185L917j438k855N178l766j11L612m176L881J45l992O551k345j486M635
$$ 1019 -4166 -249 -1687 -4542 636 -3130 -3241 371 -3805 76 221 -3771 2780 435 -1051 3584
848C584m089K272K508m183L346k579l09N325o864M51M322m943K574o91m402M741
$$ 3584 -505 1767 4275 92 3438 859 550 5875 -989 -538 3784 -1159 1415 724 -3678 1063
864A063k635o89K030m569M200J29m279N480k977j503O521l897j69K958k836L821
$$ 1063 -1572 -2261 -231 -4800 -600 -471 -4750 730 -2247 -3750 2771 -1126 -1295 1663 -1173 2648
880B648q15j141L105m317L007K856o630M099J085n762M210j337k248J734k052
$$ 2648 1833 692 3797 -520 2487 5343 -1287 2812 3897 -1865 2345 1008 -1240 494 -1558
895a558J734j392l581N656l323j108N885o632m69O371k985O27M7r59K997j748
$$ -1558 176 -1216 -4797 859 -2464 -3572 2313 -4319 -4788 1583 -1402 -775 -728 -1687 1310 -438
911d38K901Q55n749O390M46o548O161m06l822L709k268j541M72R45K828o949j309
$$ -438 2463 3318 -2431 3959 4405 -2143 4018 3612 -210 3499 1231 -310 162 1107 3935 -3014 -4323
928d323O398n841J479N082p830N31M352j669Q14j020J226L61k114N892k538n312
$$ -4323 2075 -3766 -2287 2795 -5035 -4504 -152 -1821 -1007 -2027 -801 -440 -2554 3338 800 -4512
944d512J0530j763p691N947R1j068K086j383j076l367L350N341q950m44N025n461
$$ -4512 6018 4255 -3436 2511 2602 1534 3620 2237 1161 -2206 1144 6485 -2465 -2909 2116 -3345
960c345L690K114q941K723N538j985l973j238P088j892m302P326l957l510J0139
$$ -3345 345 2459 -6482 -3759 1779 -206 -4179 -5417 1671 -221 -4523 2803 -1154 -4664 5475
975E475l170o074N592J887l23k792l68J660j959O324n5j3615O266P615r091K033
$$ 5475 2305 -3769 1823 3710 3387 595 227 1887 -72 6252 6197 -7418 -1152 6463 -2628 -595
991e95L144n090j396J448L171k800r08O584q448l762J1845l279j432O549q260
$$ -595 2549 -2541 -3937 -2489 682 -2118 -3026 3558 -4890 -8652 3193 -86 -1518 5031 -3229
1006c229k874Q532K846l334k593N387k681r146J1588N058j0452L370j336q016
$$ -3229 -6103 2429 5275 1941 -652 4735 2054 -7092 4496 9554 -898 2472 1136 -6880
1020f880P296O149l566o004j332L006l263M233O899j2013p65Q929q316P15J0064
$$ -6880 416 6565 2999 -3005 -4337 -1331 -4594 -361 6538 -5475 -6240 2689 -5627 -4912 5152
1035E152k225n289k006L016K328R46O457o218r667J0123J289l933P533m783p537
$$ 5152 2927 -2362 -4368 -1352 976 1922 8379 2161 -7506 2617 3906 -27 7506 2723 -4814
1050d814N079L026j494l739L814K686j1389K171Q338o752K572K974r294J480N161
$$ -4814 265 3291 1797 -1942 1872 4558 -6831 -4660 3678 -3074 -502 2472 -6822 -5342 -181
1065a81J266j60l452R27k11N50Q104o789m789J0295k422m337M269j760J68J043
$$ -181 1085 925 -2527 -1600 -1811 -1261 6843 54 -4735 5560 3138 -1199 3070 1310 1478 2521
1081B521k03n09n099N045K733q377L153L080o147L796l80m872L444K817J0n465
$$ 2521 2318 1809 -3290 1755 4488 -3889 -736 2344 -3803 -7 -387 -5259 -1815 1002 1012 -4453
1097d453k066Q561j443k269M738n677p79O854k294p7K043j366J18l330K786L415
$$ -4453 -6519 2042 599 -1670 3068 -2609 -3388 3466 1172 1095 3138 1772 1890 -1440 1346 4761
1113D761l228K882l950p539Q374L894n329K09k485j515J625J282L173m456j607
$$ 4761 1533 4415 465 -7074 1300 5194 -135 74 -2411 -3926 -2301 -1019 2154 -2302 -3909
1128c909M178n862J877Q888m520j847R9k722M005M065N13k785n750M794J852k051
$$ -3909 269 -5593 -3716 5172 652 -1195 -1096 -3818 187 4252 4765 1980 -3770 1024 2876 825
1144H25N069k811n893M162j403j134M335j433j833m052J43M478j632J451J092
$$ 825 5894 3083 -2810 1352 -51 -1185 3150 1717 -116 -4168 -4025 453 -1179 272 1364
1159A364q705L311N890l110J309N60k785R12l3L676M5k802L990l072k473O210
$$ 1364 -7341 -4030 1860 -1250 59 619 -2166 -1254 -1287 2389 2434 -368 3622 550 -1923 4287
1175D287j426j284J841m118L60J912n47Q82l468L97J629l761L111Q46m845L449
$$ 4287 2861 1577 3418 -700 -340 1572 1025 1907 -1561 -1164 465 -3296 -185 661 -4184 -735
1191g35J8l155K952m06J92J057k453K980l12j090M218l092q9L757l040K36J576
$$ -735 -717 -3872 -920 -1326 -1134 -77 -2530 450 138 -952 3266 174 85 3842 802 1038 2614
1208B614k071K302j348j294J973l465J532J381l648K643j358k456L013j964K69
$$ 2614 543 2845 1497 203 2176 -1289 243 1624 -2024 619 -739 -3195 -182 -2146 -1877
1223a877J976k916J076J56j247M197k065p42K874l001K152K088k713K312r00j082
$$ -1877 99 -2817 -1741 -1585 -2832 1365 -700 -1442 1432 -1569 583 2671 -42 2270 1370 288
1239B88K798k442R82J786l995J812j70k287L288k377p68R21l174K440P61k836
$$ 288 3086 644 1626 3412 -583 1229 1059 -1228 2060 -317 -1085 -164 -3338 -898 -137 -2973
1255b973K445j298j243L249k398J600J185k804L218n43j268L318j710L80J505
$$ -2973 -528 -1826 -3069 180 -2218 -618 567 -2237 981 438 -830 2488 778 1158 2663
1270B663k969K688K01k773L460k550o33K008k770J268K08k977L071k193j429L058
$$ 2663 -306 2382 2583 -190 3270 720 87 2095 -675 593 801 -2176 895 -1298 -2727 331
1286C31k827P66J120k810K966l78j587L675k559J10L107k531J783L10j534L392
$$ 331 -2496 -1730 -610 -3420 -454 -832 -2419 1256 -1303 -1193 1914 -617 1166 1476 -58 3334
1302C334k359m93K699k980J276J090l118K211j324j152K343l003M25J405l255
$$ 3334 975 482 3181 201 1477 2567 -551 1660 336 -816 1527 -1476 -1051 354 -2901
1317b901K225k92k154L127k362M50J930k592K173P03j907K754r73k91K371k567
$$ -2901 -676 -968 -3122 5 -2357 -1907 23 -2569 -396 307 -1600 1154 181 -110 2261 -306
1333c06K222P91l059K681k84j821K180k335R03L70k918K399n68k320K513j857
$$ -306 1916 2707 -352 2329 2045 224 2404 69 972 1342 -1576 823 255 -2065 448 -1409
1349a409q32K050k561J841J85k406L047j370j51K656k366J396J576k208K189o80
$$ -1409 -2241 -191 -2752 -911 -726 -3132 -85 -1455 -1606 1050 -1316 80 1656 -552 1637 957
1365I57r59L060k186K90J523k552J860m38k084K548k035q75K240l162R74R19k126
$$ 957 -2 3058 872 1162 2685 133 1993 1555 -529 2019 -16 -891 1349 -1813 -839 80 -2046
1382b046J758j631k78K502k779Q35J676k330K344L24j116K054j496Q43J512k243
$$ -2046 -288 -1919 -2197 305 -2474 -1639 37 -2293 51 375 -741 1313 -183 660 2172 -71
1398g1K136R1j755K566j853r98K477j811mJ1k115J793p45n75J003k759J188J466
$$ -71 2065 2156 401 2967 1114 116 2593 782 778 789 -1326 467 -278 -853 150 -2609 -1421 45
1416D5k730J770R8j904K723q42l34J700j299J666k34j897L286m32j107K069k052
$$ 45 -2685 -915 -817 -2721 2 -840 -1174 526 -773 893 659 -1238 2048 1616 509 2578 526
1433E26N47J657k491J228l78j136K105k528j77J128k217J743l72k423K281q28
$$ 526 1073 2730 239 1467 1089 -47 2058 -470 -647 481 -1736 7 -365 -2788 -507 -1335
1449a335p87J626j918J617R03j948J583l06j1K848k222l35J762j476K249l35j373
$$ -1335 -2122 -496 -2414 -797 106 -1842 -259 -565 -576 2272 50 -285 1477 1 2250 1915 542
1466E42J870j911m8J629k186R84J059l244M15m25J081J765l391n03N07j342L943
$$ 542 2412 501 453 2082 -104 880 1939 -1305 -890 -1315 -234 1531 -1860 -2363 -1856 -3198 745
1483G45n63l017K300j215N03J903p31J093l89r64J734j933K164L224m174j020
$$ 745 182 -2835 -535 -1750 -1247 656 -75 1018 629 -335 1399 -534 1630 4854 680 -340
1499c40J347j325K936J47k509q22j461K290P10k460K329k222k709L997j308o81
$$ -340 1007 -318 2618 2765 256 -566 -2027 263 973 -1487 842 -1380 -4089 -92 -1400 -2081
1515b081L462k141j587n59J516L975j740j080N38k650L635K878l772J006K4j690
$$ -2081 1381 -760 -2347 -2906 -1390 2585 845 -235 303 -2347 1288 4166 394 1400 1424 -266
1531b66J818l29L92r1j934J870k613j270M881k010k671J321j872J449J930j809
$$ -266 1552 1223 1615 1524 -410 1460 -1153 -2423 2458 448 -2223 -902 -2774 -1325 605 -1204
1547a204N1j153J407J601l024K266J391k670K912m45k291K904K93n29q41o95K914
$$ -1204 -1153 -2306 -899 702 -2322 -56 1335 -1335 1577 1132 -1159 1745 2038 1509 668 -27 2887
1564B887j322k180K599k235J0L153m281r39K008Q6O36j522j055P95j430L096L40
$$ 2887 1565 -615 1984 -251 -241 2912 -1369 -2308 -300 -214 422 -1100 -2155 -1360 -2790 306 646
1581F46l650K877L17k945K959O89n8Q49k037K6J69K297L149m802j622K883k401
$$ 646 -3004 -127 190 -2755 204 893 835 1684 -353 -327 -158 2139 5288 486 -1136 1747 -654
1598f54K159K415m295q80Q35k84N5m93K962k128l973L105k38o86M507k469l887
$$ -654 1505 3920 -375 -1255 -420 -704 -649 -1142 1820 -308 -4281 -1176 -1414 -2100 2407 -62 -3949
1615c949K007J788J287K30n86l29k795K818K836l090J636J507n232J309K849q88
$$ -3949 -1942 -154 1133 1363 777 448 -2347 471 3307 217 1853 3360 -1872 -563 2286 1398
1631A398K97p61j295j991P34M362k834k569L057k839j158M789j563j513R80k24
$$ 1398 1695 934 -361 -2352 -1618 2744 -90 -2659 398 -2441 -3599 1190 -373 -1886 -906 -1130
1647a130j48o39L144R89l829J999R89k879L845J064m157J201J220m05m64M61O65
$$ -1130 -1278 -1917 1227 2216 -1613 386 1375 -1504 2341 3405 -752 449 1669 1264 800 1261 1926
1664A926k470l23L217l625p17L765l024j410K481j014l57L50O22k70j764L312
$$ 1926 -544 -867 2350 -1275 -1992 1773 -1251 -2661 -180 -1194 -1551 -1201 -579 -849 -2613 699
1680F99O5l674L701O99k603K686N7j925J352R23L13j833J26J821k699O38K510
$$ 699 764 -2910 791 1490 -1113 1573 1630 -295 1057 1980 2293 460 586 2407 -292 346 2856
1697B856l660r1K243k650j2J592o76o54j209J345Q9j452L008q04l084L370J1j179
$$ 2856 -804 -895 1348 -1302 -1314 278 -398 -1052 -2261 -916 -827 -2279 729 -75 -3159 211 222 -957
1715i57K006l33n63K4M46J474j525K50J938l471R06K269k657Q45P16k050M38l26
$$ -957 1049 716 153 177 623 2097 572 822 2760 -711 195 2464 -193 652 1368 -682 -244 -570
1733e70N03j9j823J930r54j833K958q55j369K367j391l71J620n53Q89o52M34J366
$$ -570 -67 -86 -1909 21 -933 -2766 192 -663 -2032 335 -1056 -1427 193 -360 529 -123 311 1677
1751A677k195J567J699k901J326O19j906J598n80n02K60j143Q33l07j370J957
$$ 1677 -518 1049 2748 -153 1173 1792 -114 1484 904 402 662 -481 352 45 -1325 632
1767F32j646j184K561j833j76J673j779R98m9l67J560j517J000J366k059J750
$$ 632 -1014 -2198 363 -1470 -1646 27 -1752 -754 -803 -1170 390 -1127 -127 1239 -820 930
1783I30M44j572K143o47j070J642j351M05K09j386J368j265n14J666k084J55J145
$$ 930 1374 -198 1945 1298 228 1870 519 924 1133 -253 1115 -150 -664 1002 -1082 -927 218
1800B18k076J002Q2j055J646j157N6J299j275J314L14j211J938r44l52J974j470
$$ 218 -1858 -856 -774 -1829 -183 -1340 -1284 15 -1260 54 368 -843 1095 151 -201 1773 303
1817C03P59O36j271J374q96o53J531j850L39J218k163J089l96j330J531j376l30
$$ 303 1062 1698 427 1801 905 252 1783 -67 272 1490 -673 416 20 -1310 221 -1155 -1485
1834a485J524j761P98L31j260J718o14k73K138j897P74J180j587J735m34q31J792
$$ -1485 39 -1722 -924 -593 -1853 -135 -749 -1022 1116 -781 -7 1173 -414 1321 887 56 1848
1851A848j340J54J120j797J324m66j285J405j108n05J298j725N31L23j472J341
$$ 1848 508 662 1782 -15 1309 843 -442 963 -145 -650 648 -1077 -546 -223 -1695 -354
1867c54q63m03J330j121Q79N49j470J828l63r97J901p50J81R58j212J278j48j006
$$ -354 -1217 -1620 -290 -1411 -532 17 -1453 375 12 -985 916 166 347 1305 93 1371 1223 217
1885B17J571r29q20J362j373O00k05j535J491q04n05Q59j541M97J040j645P43
$$ 217 1788 859 39 1401 28 628 423 -1112 379 -425 -930 -71 -1612 -1115 -75 -1720 -977
1902i77L76o23J153p18K04J008j136J613K61j435J560m88p95J691j328L82Q98
$$ -977 -601 -1224 -71 -789 -585 423 -713 900 1161 -274 1286 798 3 1694 366 748 1646
1919A646j168L53n41k62J114j955K16J265j793M32O80j985J086L79m33L42j094
$$ 1646 478 831 290 28 1142 -813 -597 668 -1125 -693 -13 -1998 -912 -533 -966 -624 -1718
1936a718J306L93r43J620j123o84K790j252l96J629q70O06m53l52J014j147O01
$$ -1718 -412 -19 -962 658 -465 -1149 1641 389 -7 1622 752 1358 905 553 1567 420 1021
1953A021M99k957J697J244k290R04l63j217R69q0J94o39p53K138j877p8K604j361
$$ 1021 1520 -1437 260 1504 -786 118 -245 -1462 -493 -573 -379 -1018 -1771 367 -1510 -1588 1016 -345
1971c45n28J749j533L17J466K81k54j311Q63R00j645J996j59l166K604J49k091
$$ -345 -873 876 -657 -340 1126 1407 1153 -158 705 1605 -40 1956 1797 -1369 1235 1384 -707
1988g07Q93L82q15o60k62J329j612N89J966l438j35L425j914R7J977j866n58J432
$$ -707 186 568 -247 -907 -1169 160 -1452 -863 1103 -2335 -2470 955 -959 -862 1115 -751 -1309 123
2006A23J210q41j114K862j077k902L761K80l024K720r16k279J287J582q76k127
$$ 123 1333 492 -622 2240 1163 -1739 2022 2302 -722 1998 1082 -1197 90 1672 796 -1331
2022a331R25J513l231J540K175m290J130L156l290n26K284J20j314M16J917j841
$$ -1331 -406 1107 -2124 -584 1591 -2699 -1569 1587 -1703 -2229 55 175 -1139 -723 1194 -647
2038f47l68L805k425k454M581q17k807K240K34j275N19J325j023l139L225J105
$$ -647 -1015 2790 365 -2089 2492 1675 -1132 1108 1342 67 586 1911 888 -2251 974 2079
2054B079m595K209J726m080J585J967k365k96J717K08k758P24L964k569p24L272
$$ 2079 -2516 -307 1419 -2661 -1076 891 -1474 -1770 -53 155 -2603 -1879 2085 -484 -1208 2064
2070B064l305r37N319j377k157Q42P11j069j03K316m42l641L054r3m197L797J414
$$ 2064 -1241 -2178 3141 1764 -393 449 1160 91 -12 2304 1862 -1779 1275 1182 -3015 782 2196
2087B196l881N14O06p15j31J720N25l938P35L695k858K39L523l081r69K836o08
$$ 2196 -1685 -1171 -565 -1280 -1411 309 834 -3104 -2369 1326 -1532 -1293 2230 -851 -1820 1016 408
2104D08p42J497R10k196j461L782n01k276L115j297l897L508J264k864M08Q20
$$ 408 -334 1163 2073 -123 -1584 2198 1697 -579 2536 1239 -2658 850 2114 -750 -342 478
2120D78r74j513J514J596l369J112K222m064J178L597k512o25J555l13p71J149
$$ 478 -496 -2009 -495 1101 -2268 -1156 1066 -2998 -1820 1777 -735 -1360 195 -118 -889 260
2136B60J850k139j043L763j756k115L631j002k415K350j2k142M88J688r19k419
$$ 260 2110 -29 -1072 2691 935 -1180 2451 1449 -966 1384 1372 -770 -282 1406 487 -1932
2152a932J827R15l493K157J607l830J662K155k457k39J720K93j236K82K047k140
$$ -1932 -105 810 -2683 -526 1081 -2749 -1087 1068 -1389 -1628 92 385 -851 -569 1478 -662
2168f62n17L654j912j430L200j483j529J872K38r72m34J100q01k061L019j0l247
$$ -662 -1179 2475 563 -867 2333 850 -679 1193 1431 459 25 1125 324 -1737 1282 1272 -1975
2185a975J810O51k559J378J239j605m46P47Q68j705R33K247k694j32L286k439
$$ -1975 -165 486 -2073 -695 544 -1061 -1507 -760 108 -1597 -664 1583 -1111 -1243 2043 -396
2201c96J59K457j381q28N86N54n31n87J645j030k168K601l26k030J864m31j774
$$ -396 -237 2220 839 11 597 1151 620 33 1678 648 -1520 1081 755 -1275 589 158 -1616
2218a616Q51M76j69p44O89N57j771N27K287k453O89J622j551O47J139r25L07k35
$$ -1616 -765 -289 -458 -1202 -513 44 -1727 -1200 1087 -1366 -677 945 -606 41 1180 255 562 327
2236C27P45j99j022J936p27j614K058p99j398J453m84o34J2p0L92j092N77R57
$$ 327 1072 873 -149 1787 1060 -554 1504 705 -693 760 276 -358 -346 -416 -24 -1116 -539 418
2254D18k033N17J420j836J061R34j437P71L6K87K9j48J196n61r92J990j002q59
$$ 418 -1615 -1098 322 -1514 -453 481 -956 -185 -149 138 167 19 1215 654 -338 1652 650 -209
2272b09J729j111k00N83n27N0n29K75N43j632P39M37j845J218J68j051J078n26
$$ -209 1520 409 209 792 265 315 -214 61 604 -1028 -289 148 -1697 -479 -311 -1362 -284 -810
2290h10j81Q37p15R17K62p02J074m66k41J482j178J95Q18q82O50o08LO25j099
$$ -810 -991 -154 -869 48 310 -392 682 216 -25 1457 279 474 1292 410 1060 452 455 1080 -19
2309a9O0O80j512J122k56j112R43p96k51J138r87M27L39j024J283k99m59J014
$$ -19 41 721 -791 331 75 -1037 -94 -890 -1141 -3 -990 -563 -224 -1248 35 -264 -723 291
2327B91n32N19N17r22J187m54l64Q91o84J06O47r78M12j85q71R18o96K6L10j159
$$ 291 -241 278 795 -127 1060 606 242 1133 449 555 1202 224 636 451 -420 498 -198 -172 138 -1021
2347a021M94J72p90J016n61j23O97o71M14N48q54Q55j44l70J238p75K46P73p55
$$ -1021 -527 -355 -1145 -129 -690 -813 -116 -787 -373 175 -679 176 32 -338 900 125 371 1144 389
2366C89M62Q9r41J112q02N0O10r36M03%r57M81l82l21O26n73L5M98q44N39K08
$$ 389 851 940 -1 1111 309 359 969 33 436 436 -521 -40 -422 -743 -117 -690 -655 -157 -1001 -462 -254
2387b54p78J062m79L12P05q66P62rm01Q33l98j38J026j100K83N12q79K36n8n77
$$ -254 -1032 30 -449 -137 568 -298 464 455 54 887 489 351 1377 277 560 1072 193 429 371 -206
2407b06Q92o98k97L36j025O73J42j219J020l07p6M93m53L80J38l49J027q99N38
$$ -206 686 -12 -309 27 -998 -325 -183 -1402 -382 -689 -765 -272 -725 -345 -207 -556 471 -428 110
2426A10J167q63k47Q83q64O80K31q24K87k95K79n9o79M32l57n85J192p05p78O62
$$ 110 1277 414 167 1050 186 866 1097 273 560 265 544 485 -194 238 -119 -704 488 -217 -995 -333
2446c33j12m48R2K79N16q27K09O31p23P51Q88j204J98J091p57L99L04j90k91j67
$$ -333 -445 -893 -801 -522 -6 -833 -624 7 -716 35 923 -281 -83 1008 251 650 954 764 473 306
2466C06P76q18l56J438j134r94J218o98n94J400j004n24N2M68K79p15N22N10j779
$$ 306 1082 264 -92 1346 212 -782 436 -262 -856 544 -460 -984 -932 -464 -185 -900 -378 132 -1647
2485a647J257R78j557J174O87j148N01J12N33m61p1J025j583K16J982j721q57
$$ -1647 -390 588 -969 205 892 -256 245 357 890 429 358 1383 -200 16 1998 277 -580
2502e80J509r25l66M71k24l31k85P43m31j293J619J31j527J587j85j065J336L37
$$ -580 929 4 -362 109 -115 -446 -731 12 -419 -1712 -93 38 -1489 98 -87 -1152 184 521
2520E21r35J87N86P06j320K08J823k112Q96J210k056P5J357p71l29K20J29n41
$$ 521 -414 -227 359 1065 -255 -47 1776 -336 560 1770 -286 -211 1146 375 46 266 395 -146
2538a46p40J396q38j269K699j290j784J845K63r55P99Km08l67J388O35k236J007
$$ -146 -886 510 -328 -1597 1102 -188 -1972 -127 136 -819 -20 -18 -426 -793 595 1230 -1006 1
2556AJ458k240R78J646j799L23R59r08j013R05J303j715q20J595j157q48K556
$$ 1 1459 -781 197 1843 44 367 1326 418 -595 310 1613 -102 -922 673 -484 -1332 1224
2573A224j412j562J695l80n86M79O89l50j056J588J33j750K188N06k226J143J065
$$ 1224 -188 -1750 -55 -435 -1021 -542 147 -203 -1259 329 462 -1288 900 1406 -820 323 1388
2590A388r60l16R38j03j612R81J265j860l88K094j966m06J757r37q78J240k85
$$ 1388 428 112 1050 947 -665 316 1581 -279 -667 1427 -539 -945 812 -125 -1003 237 -48
2607d8j475N27J520o00j558J827k01j599J925N91j885J266O79r98k98J013M22
$$ -48 -1523 -996 524 -76 -1634 193 -8 -1607 318 909 -976 290 969 -29 -327 686 1108
2624A108j386M73J036j542L01J537j747J3R37p91o52P38P2p28l03J595j447j092
$$ 1108 -278 195 1231 -311 -10 1527 -220 -207 730 -61 -713 25 97 -631 -934 661 -786 -1878
2642a878J995k18j339J768k52j067J048N14m36n16R79K58j516J181Q67j676P47
$$ -1878 117 -101 -1440 328 76 -991 57 571 135 -381 598 856 -660 521 1388 -288 459
2659D59P47j495J26J106n62m84O8N70j110j94J541j473m90J507j127o54J500l9
$$ 459 1206 -289 -163 943 381 -103 -35 535 -575 -769 772 -701 -1191 316 -811 -1465 35 -4
2677dq68L86O70l07k60J017n3j423J282N34j294Q41P21j205M47N4J5o32J16P25
$$ -4 -872 -486 184 -123 -383 634 581 -842 440 974 -320 521 1242 37 484 538 553 -79 37 762
2697G62j153l26J332j192l88J318j043m16O94j02j81m5O48Rp30J037L84j557J578
$$ 762 -391 -717 615 -577 -965 353 -690 -1106 -412 -514 -695 -740 -92 -83 -813 224 608 -949 629
2716F29J36j062J035L9l58M26k04K16p44N6O90j181O8Q94j476M08Q51q75N3J98
$$ 629 765 -297 738 777 419 845 641 857 113 169 859 -322 -254 640 -836 -428 423 -452 -399 -201
2736b01k27j10j27M43Q8r15J288m02n69J248n15l58Q17r3l4J17R0L74o93J07R58
$$ -201 -428 -538 -665 -222 -134 -1049 239 -163 -732 516 1 -357 460 367 333 450 540 914 221 328 1286
2757A286j441L86M33q07M04rm44J81j56k11m4n12R16m76m52J111n47n75J071k10
$$ 1286 -155 231 664 -143 261 252 -192 -11 -167 -378 -422 -934 -18 -494 -946 165 -382 -957 114 -96
2777i6l8L41k84N55k50j1M84q21N11M90p41M78l0m38K52j42l57M30p79L89k0m30
$$ -96 -134 207 -77 478 228 217 701 -120 391 881 140 618 588 150 402 260 -97 333 -446 -57 -77 -507
2799e07N78r20L9O90m77K04K35k94N49k12j92O56o60M83K67o48N66Ml05P04k39
$$ -507 71 -849 -810 -120 -597 -393 -158 -452 97 -115 -307 349 -311 172 439 -209 357 361 56 760 521
2820E21k03L45m38K55l61n88Q27m58k90N79n48K26O6n88K77rk22N26l66K13L50
$$ 521 318 663 225 480 119 -469 358 -100 -390 189 -359 -133 -67 -655 -378 -387 -609 -83 -449 -236 114
2841A14o27O85l16k24J030k52j07P14r15L20K75o76O45l98Q9R1m73K32p6n30N64
$$ 114 -513 172 -144 -368 662 410 303 1017 102 422 697 21 666 268 357 448 -25 207 131 -399 165
2862A65j76n42N83m22O9k02k25N05J40m61O71l78L81K18k85M77J0n09N57j80j89
$$ 165 -11 -553 30 -392 -323 -525 -750 -245 -105 -566 105 -273 108 326 41 518 528 19 576 396 207
2883B07N35o52K02J60m33L45j27o15N94m59M6J24q01Q15l58k33O11m78K14L7n55
$$ 207 742 90 292 452 19 364 237 -378 216 -243 -197 -73 -874 -59 -417 -650 -39 -517 -303 -266 -821
2904h21M91K08m21P70j63k95Q75m76J53L43n95N40k27p3K29k59j93N40q05R7M9
$$ -821 -330 -122 -543 227 64 -231 644 168 321 664 69 609 382 309 538 279 86 626 -179 -82 -33
2925c3m49K79j96k10M47k32J06K08p99P30j9o1J76l08K81M98n00L77k34n6O61
$$ -33 -482 -203 -399 -609 -162 -394 -288 -80 -879 -149 -168 -229 -53 -361 -80 418 -82 295 61 5 666
2946F66n33r0N14k11n4l3l90M78n1m81J79k87n7M00m23L8J00m87O02m56J10N47
$$ 666 133 43 557 346 292 259 -131 347 296 -185 -6 -293 -350 50 -373 -335 -235 -722 -120 -576 -466 81
2968H1n34P23k7o17N37J3m46P11k96j94Q16o00L52j76k91O80r03J61M35o89K76
$$ 81 -453 270 243 -374 163 176 -270 441 145 -49 767 167 519 343 52 732 -171 -10 425 -264 12
2989A2k78k93N00j07k88K68l16M46k38n45P37n67N32M02l07k44N18j45K03J65
$$ 12 -266 -559 -59 -166 -454 -186 -502 -56 -294 -839 -102 -669 -137 265 -42 -286 232 87 290 455
3009D55k75M78l96J97J51p83M82N35r16N59o91j95M34m2l58m7j37P07n36j95P94
$$ 455 180 658 262 459 610 -173 309 844 -72 487 -204 -399 35 -7 -365 -412 -549 158 -378 -573 221
3030B21r03P2N03k86L08O3k9L19l15L42L46p26O44j18m21P47j93p48O61m58N8
$$ 221 -682 -610 -107 -393 -85 -22 -51 268 -47 295 641 -85 559 441 20 767 574 -174 487 29 87
3051H7L44o12N39n33j71L84q37O06K73o16K48J74o43P27R4j90k17k42R02Q7k96
$$ 87 431 -181 358 -175 -346 38 -799 -193 80 -536 -288 -114 -757 -30 64 -126 -343 -585 317 404 108
3072A08O39m67j93O09o22L75Q5m86J08k2k82M23o25L98l8o04L63Mn32N13o6j68
$$ 108 747 280 87 696 74 449 534 48 156 134 -148 275 -350 48 10 -594 -231 -227 -759 -246 -312 -480
3094d80M43k78K50k25N2P12q31J05Q03m03r4N93n76O61l08k73L49n29M89K3p42
$$ -480 -37 -315 -65 -290 -238 474 -357 -252 551 148 54 647 71 732 424 151 500 -29 460 483 -259
3115b59P18k95k41M31n08j51j10p6J65j23k5L75m59J35O00n74J73K63m31M64L4
$$ -259 459 164 -77 354 -154 -305 -415 -491 -326 -449 -474 -99 -558 -423 177 -397 -224 39 -392 72 106
3136A06m4K94No5J04l58N28k36l50N30n19k78O65k69m78N64o49R7Q1K8K57m04
$$ 106 62 356 361 296 400 42 570 334 -16 514 -5 -283 382 113 -365 199 -450 -353 -272 -244 13 -391
3158c91k2K55l83M18J14o5P4L1l18L08J7O6J98j80N11o17J21M10m50J04J55m08
$$ -391 -413 -158 -541 -123 -9 -74 0 31 -287 21 38 104 302 122 633 16 137 547 97 201 356 -52
3180e2L42m00k12K93n24K53K03m52L71l2k88K31k63K10L84l63J62K75j26L44l78
$$ -52 290 -110 -322 -29 -553 -300 -97 -549 -178 -210 -498 -267 -530 -320 64 -299 -137 138 12 356 -22
3201b2R5L04l71M05L37q64L17K29n31K69j29j06L34m97K42j12m93N51l6m79K39
$$ -22 73 377 6 411 748 -116 201 430 -101 168 39 -67 267 -230 12 -100 -593 -42 -78 -557 -318
3222c18m09N28J13m25K75j44J26M31k04L05R6k55O6M65p62N87L4l19K59l70J78
$$ -318 -727 -199 -86 -511 -236 -380 -254 177 -27 278 374 119 185 650 -112 475 509 190 449 79 257
3243B57P7m63L23m15j38M60n27R6K72m11o1K20k00L55l21J53L82p53P17K18l80
$$ 257 334 -129 194 -221 -359 101 -426 -330 -58 -469 -530 -310 -510 -155 -476 -323 59 -694 23 241 -139
3264a39J76J68q5L47k40K47J07l85M65m31q8L40m72J10J61p90M34j0k81K31l98
$$ -139 37 205 120 467 227 474 581 196 661 230 142 482 10 120 281 -509 -75 -85 -366 -135 -533
3285e33J69J72l07K43J02l84N97K3l09M64n03K46L19j96J60m6k75P33p04M42K99
$$ -533 -364 -192 -499 -256 -154 -538 59 82 -227 237 -266 -20 299 103 263 217 -58 675 -29 413 712
3306G12p29K20K9j39j0l89q7L59j30q2k82q7J62j09J62M27k48rM25m95L89j25
$$ 712 -17 203 232 93 83 -306 -393 -34 -164 -246 -528 -615 -453 -562 -400 27 -221 -230 195 -300 89 -36
3328c6K85m2j85K16J25j87J55R4n08P81p25jK93l95K49J4l09J70k26r7K88n20
$$ -36 249 207 22 238 363 176 331 425 -83 698 -27 -28 265 -130 119 133 -176 -6 -232 -329 -41 -561
3350e61R7M39n27M08J39m58K67q5J25K89k06M16j26j94M38j01k05L56k96J56k14
$$ -561 -464 -25 -552 -144 -5 -463 -196 -281 -156 133 -73 343 217 23 461 360 155 511 215 371 157
3371A57l30N24j13j36j6k71K09k17J19j68l6k8k9j31l2M02m9K54kR6J39k99m7
$$ 157 -173 351 238 102 86 -185 24 -193 -74 -242 -278 -306 -335 -466 -498 -96 -145 109 107 203 342 43 -4
3394dM55l69KL05j92M5jk21k6J92k38K94l21K54j09m91K16r3L7K34j51j41J25
$$ -4 451 82 84 389 197 242 241 20 -6 186 -52 242 -79 175 66 -425 -209 -302 -265 -31 -182 -323 -198
3417a98j45J54J8J17Qj10j72O10m81N01J38l11K23n9l71O48k98J24n9k6n4m11
$$ -198 -343 -189 -171 -54 -46 -156 -328 282 -199 302 440 129 352 293 -78 570 272 396 337 311 257 -154
3439a54J25%j3j25K17l6k54j03L13J1k91J80K14o20M71m8j08J77N29l73P8K33
$$ -154 -29 -29 -42 -167 50 14 -240 -343 -30 -19 -310 -130 84 -536 -65 -113 -221 -44 485 112 190 423
3461D23j22K2k38M81l91j98M61m95j02N65m89L8j65n8j20K40L4j60j93L64o5k90
$$ 423 301 323 85 566 175 -23 438 -57 -159 406 -83 -45 -210 -268 -388 -148 -114 -274 -467 -103 -168 -458
3483d58L64n1k17M81J52l57k74M33K40k87l2M64m77M7N30m35j84L50k88K03p7
$$ -458 -94 -145 -362 119 271 -86 -360 73 313 26 -6 458 -19 28 558 123 -61 289 1 204 127
3504A27M1j80m64O25n04k66O32P0p88M04K09m88O33o7k60o5O07m9n63M46M62o40
$$ 127 168 -12 -476 149 -355 -621 11 81 -707 -303 -94 -582 51 -16 -276 -341 266 217 -346 100 562 -78
3526g8K19K99n30J80L78j76j52k94L38k82k82N10l91k11O92k57j60K98m67J39
$$ -78 141 440 -90 90 468 292 140 -154 184 -98 -380 130 -261 -472 220 -37 -197 101 -366 -227
3546b27m3j6K38l18L15K34n01L53K97o80N62J2l3K4n9J81m09JP01m25n87O34n56
$$ -227 -270 -286 -48 -366 -51 183 -318 35 332 -348 214 226 193 217 158 339 -70 -69 632 207 -380 254 -302
3569c02RM90m00K8j54K86k84k10N21K4o04P85r8n90M13L26n43L66Q5r9j05K43
$$ -302 -293 197 -203 -175 -329 -43 -327 -537 -16 8 -596 189 91 -499 -86 240 -303 63 148 49 -56 187
3591A87L4k77R2M40m40k3M77n33L1J40j4l80j43M15k76r6N01m71k79Q02k26l22
$$ 187 221 -56 36 476 36 13 490 -43 -12 128 114 -266 -409 6 -270 -366 135 -336 -615 187 -39 -361
3613c61J33K80l38K32M74k84l62O15q6m76N23N5m66L70L04o16J67K70j76n09K5
$$ -361 -228 52 -286 -54 420 136 -226 389 303 -173 350 405 -61 309 613 -3 164 434 258 -251 -226
3634b26K87j56k68M12n33j95Q87o20J43M16m04Q2j12K77q6j09M86P3n34N37K34
$$ -226 61 -95 -363 49 -484 -679 208 -412 -269 147 -257 -175 -287 -10 -96 -205 281 354 -180 357 591
3655E91q05N42P8m76K38O3L2l1l99M30m34k95P04m26k65N82l87m3K38k07J3n1
$$ 591 -214 328 406 -70 168 231 263 232 -167 263 -171 -466 238 -188 -453 129 -258 -301 -63 -270 -257 -308
3677c08L97j32m53O84j16m34L23M15l89K51J1j20k2K40K33o93J79L36n41J41N35
$$ -308 89 -43 -496 188 72 -362 -39 376 -13 238 249 129 107 347 580 -113 66 402 -139 2 537
3698E37o84j26L39k35l2j19L23k53k41N82l01k84P13k32l83O12Rm00M27k20J20
$$ 537 -147 -273 66 -169 -201 -320 3 -250 -491 91 -210 -494 219 -13 -396 216 225 -175 252 32 152
3719A52k11J62K56k75K27j03m27M68J65l10j71M3QK8j06K19j82m63O35m41m0M32
$$ 152 -59 103 359 84 311 208 -219 249 414 104 -67 -24 -16 12 -94 125 -57 -520 115 -326 -366 66
3741F6n9n23O52j75p9J40R4J85m01K66J35m09N19j79j53J61L43l48K9k30O5j3
$$ 66 7 -516 136 -39 -118 22 116 301 -100 166 301 -108 411 232 79 240 583 235 264 34 99 86
3763H6j98J88j33r8J00k06J0J63j67j09J06K20J20j63K1J76j57N27k62k59L29
$$ 86 -112 76 -57 -155 -55 -261 -251 -88 -255 -364 -258 -38 82 -81 -60 116 -41 486 224 -35 294
3784B94o4j13K97l79M1L6K3J46j97k59L63j78l25L30q1m4j28R0M2K47q5l64L5
$$ 294 230 117 414 35 76 112 135 281 84 -175 188 10 -315 15 -66 -110 -238 -148 -106 141 56 -308 -273
3807b73L23ln3L0qJ97J1N7l07K98n6J27j67j67J15o1J5K52l44K27j69l24J04K29
$$ -273 50 47 -6 24 16 213 224 281 -26 272 216 343 176 9 124 63 78 330 -14 213 44 -280 -176 53
3831E3l65K91m30J47J31l27L41p2lL47q5k58M9M34NN8l08K96j78j70L20j15J09
$$ 53 -312 -21 -451 -304 -173 -500 -159 -231 -234 113 28 -230 -181 253 258 316 8 304 126 -44 276 161 270
3854B70j14k41J67J2j76R2pJ0p9l82K94K1k12K09K6k81O55k56J33k28Q0j3m6J15
$$ 270 156 -85 82 94 -82 10 3 13 -66 -448 -154 -133 -345 -136 -110 -391 264 8 141 -87 -7 -20 -66 49
3878D9J44k15K37J59k14J42j03j40K00P4l78L32k07J18l12j86M58m23R1L82m74
$$ 49 193 -22 215 374 160 302 199 59 259 333 -45 287 80 198 -114 -300 158 -265 -174 208 -266
3899b66J04J5j20J19J22j72J14O4L1J7K09M1R1m90M53j92j0Q8kj06j66j67L03
$$ -266 -162 -147 -267 -148 -26 -198 -84 -20 11 28 237 278 369 -121 332 140 130 218 216 110 -56 -223 80
3922H0o1j50L65n26L09J23m23J51K42k75O7k61M05M2m29M03k85P6L53j39j78M19
$$ 80 19 -131 234 -292 17 140 -283 -132 110 -165 -98 -359 46 88 -341 62 -223 -147 206 67 -111 308
3944C08j92j24J60OJ50m09K02J55j81M9J53n36J52Nm4j04M28j41m55L99J61k88
$$ 308 116 -8 152 158 308 -101 101 256 75 124 277 -259 -107 -102 -146 -250 178 37 -418 -19 142 -146
3966a46k9K90k43l32N68k67j4J67K16k10Q2J49J11m29L11n4k30L09M8m91L03j9
$$ -146 -175 115 -128 -460 108 -159 -173 -6 210 0 82 231 342 -87 224 170 -60 249 297 -194 109 90
3988I0k64L63l54J11l81L01p7j67M3K23k66m5M52l20RK10J9j90R7N88k51k58K37
$$ 90 -174 189 -165 -54 -435 -134 -211 -378 -335 -112 -378 -423 29 -291 -282 -72 -53 -243 -146 442 191 -67 170
4011A70l09j67P58m34l65L86j14O3j12K51J7l67M38K03q11J13N53p18K7M84m19
$$ 170 -139 -306 452 18 -347 39 -75 -12 -124 127 144 -223 215 418 -393 -280 273 -445 -418 66 -353
4032c53N2K62M8l63P5P57l71l10P92n22j46P87m15m85L06L38k70l65L66K43n60
$$ -353 -301 -39 9 -354 -279 478 107 -203 589 67 -79 708 293 -192 114 452 182 -183 183 426 -134
4053a34Q1L34q91L08O06q22M17J76l26p4M56O2m48r4O87l61j34N15l03n4J75J03
$$ -134 -53 281 -610 -302 304 -518 -101 75 -251 -325 131 193 -255 -349 338 -23 -157 358 55 1 176 279
4075B79k42J20J41Jl88P26o31k18N19r2o55M90m8l26Q2K42j77j82P9J59j75N3
$$ 279 37 157 298 299 -89 637 6 -212 307 215 -440 50 2 -324 -242 0 -177 -359 -280 -121 -296 -243
4097b43O77p45l1P68o26K8L37ol04O5O24n70J79K96l75j00M47j77m37J86K6k26
$$ -243 434 -311 -342 426 -200 -172 165 159 -145 -80 544 -26 153 449 74 -26 421 244 -193 -7 19 -207
4119b07M3M03m24j96L81J79o32K30M55o50J28L67k25n4N78j28l62P4L53n10J45
$$ -207 -164 239 -185 -381 0 179 -453 -223 232 -418 -290 77 -148 -202 376 248 -114 -40 313 -197 -52
4140e2N11m51j79O04k71j72N6J68m28p0N82m64m43P13mn17M28jm17R8J67j12j23
$$ -52 459 8 -171 433 162 -10 46 214 -214 -284 298 -166 -609 104 100 -417 11 10 -407 -309 -142 -254 -377
4163c77M57J44p05M81K70l69L47J62q5n06M82o4k68O1L66m97q9M36j21o18O40
$$ -377 80 224 -481 0 270 -99 248 410 325 -181 301 237 -31 30 396 -101 -190 246 125 -493 147
4184A47j28o4J08l3j95J70K4M2l57L42k3j37R9K22k03k35P52n03l42N80l3m3Q0
$$ 147 19 -45 63 30 -165 5 29 71 -286 56 33 -104 -5 217 14 -221 531 28 -314 266 233 190 270
4207B70k33j30l42R50n42j78O53n02j51J49O5l05J43K63nl76K11K13n63J58N70
$$ 270 37 -93 -435 515 -27 -205 448 -54 -205 -56 9 -296 -153 110 105 -271 -60 153 -410 -252 318
4228C18l73P3K64k81l7j15J44J84%QP4k38L85l27k12J39M1m15K82J52J90m64J55
$$ 318 -55 18 282 1 -36 -151 -7 177 177 185 259 21 406 79 -133 6 47 -368 -86 66 256 -208 -53
4251e3J98m18J00J78l27M10j38j20L22r3r5j6P1J37j32j11P9k93L87q7K3N0J65
$$ -53 145 -273 -173 5 -322 88 -50 -170 152 59 -36 -52 19 156 24 -87 -8 -301 86 -1 22 72 237
4274B37j40l3K91m94K66k43J30j40r0L28j63o9J84k93K1p7M21n3k38J64Q0l51
$$ 237 97 64 355 -139 127 -116 14 -126 -216 112 -51 -120 64 -229 -208 -285 136 83 -155 9 89 -262
4296b62J94K93j59K65j52k53R6j8J43l3m1P6k80M0P3j39n5J83K39l94J07k14J79
$$ -262 -68 225 66 331 179 -74 22 4 147 114 73 149 -131 -91 -18 -157 -212 -29 210 -184 -77 -291 -112
4319a12J81j89j69K74Q7j89N2p9L25j93l0J06j02L20l30J1P9R7J17k26m0J36j81
$$ -112 69 -120 -289 -15 72 -117 -65 -144 181 -12 -42 64 -38 282 -48 -37 42 139 256 30 -10 126 -55
4342e5n0J51k5j6N2j01j84l5K17p7Kr0J99k03K29J9k31N1o1J96J94k24K48P4k69
$$ -55 -105 46 21 5 57 -44 -228 -263 -46 -123 -121 -211 -12 -215 14 33 -198 -147 -208 -12 182 -42 206 280 11
4367A1K68n15J14P2J05L06q5l42K83m99M14j44q7J38N5l13J03K76n95M41j69N
$$ 11 279 -236 -122 -50 55 361 276 -66 217 -282 132 -12 -99 39 94 -219 -116 160 -435 6 -163 -158
4389a58J03QQj13L92L3k07j19J23J50l50L06j26o7J42k9J63j16k12K59m63K29
$$ -158 -55 -47 -39 -152 240 273 66 -53 70 220 -130 176 50 -17 125 96 259 143 -69 190 -273 -44
4411d4J58r8K3j7j56k52L66q6m0K50k34N8j90M71j90K13j32r0J26J39j66J00j6
$$ -44 114 16 39 22 -134 -386 -20 -106 -146 104 -130 -72 -262 209 19 232 100 10 136 275 109 209 193
4434A93K93l74k06P0l3J64J53k20j93k9N7j23J78o2QK0J45k40q6L49J16m02K58
$$ 193 486 112 -94 -24 -57 107 260 40 -153 -182 -125 -248 -70 -132 -124 -104 41 -199 -285 64 180 -222 36
4457C6K04l10j44L78R2j92K9P7j26n6K86n19L34N59j009J9L37r0j39J80n3M4K23
$$ 36 240 -70 -214 164 256 64 93 170 44 -12 274 -245 89 648 -361 -342 -5 -95 -234 -54 -107 -63 160
4480A60j56o3j23J44Q7l66J40M66n29J10K49j62k17L72J66l20J63J2k95L29j66
$$ 160 4 -59 -182 -38 49 -317 -177 289 -240 -130 119 -43 -260 112 278 -42 121 133 -162 167 1
4501AR2n7K45l37L71j60Kk79k47L59j23j98J44L20n78O03l05l0J79J09o3k44L40
$$ 1 93 36 281 -56 315 155 157 -122 -369 -10 -133 -331 -187 133 -445 158 -147 -177 2 111 48 -196 144
4524A44o4p6j16M29k76J21N6J13o00O75k16n26L30J15n07M24K4n22K69K57j82
$$ 144 80 4 -112 317 41 162 218 331 -269 406 190 -336 -6 109 -398 26 50 -472 -203 54 -128
4545a28j34L30l0n0o1pK21k47J00r0m48Q13P2l90K53M4r4m6j47L06n51M03J63
$$ -128 -262 68 38 -12 -73 -80 141 -106 -6 -96 -544 269 341 -49 204 248 154 108 -39 267 -284 119 282
4568B82k77o9M28o44J00L01k23r0J33q3J5J63Q5j02j57J73qk82L76L7l27J21R9
$$ 282 5 -64 364 -280 -180 121 -102 -192 -59 -142 -127 36 121 19 -138 35 27 -255 121 158 -169 -48 51
4591E1r7l9J55k3j41M71j58k25r6K80m84J13L30l95k49M98j77k05J14M25k16l77
$$ 51 -46 -85 70 47 -94 377 219 -6 -102 178 -306 -193 137 -258 -507 -9 -186 -391 -277 148 -68 -445
4613d45M34M7j53J4Kr3L55J74l18j27M41j24k94K49K25n13K70P8k51J45J90j14
$$ -445 -11 36 -117 -103 -101 -194 161 335 17 -110 331 207 -87 162 387 -126 144 222 -29 116 306 192
4635A92l44q4L51l65j07M25m09J94K61J0l78J76J87l52K20p8N8j12L84p3m53M54
$$ 192 -152 -236 115 -250 -357 68 -341 -147 114 124 -254 -78 109 -243 -23 -101 -43 -155 229 156 -297 157
4657A57J88k15j64M50o51L70m7j49kJ9K43l93K16Q3l97K96N9o1j5j48j22M9L72
$$ 157 345 130 -34 416 -235 135 88 -61 -63 -44 199 -194 22 105 -292 4 63 2 -13 -161 -283 -234 138
4680A38j38l02K20K41j25j25J47J95l22K36j02k4J17J0l66L67j56K00m24J56L62
$$ 138 0 -302 -82 159 34 -91 56 251 -71 165 63 39 156 166 -200 167 11 211 -213 -57 305
4701C05l75p4J90j36k45K15R5l91K29L20j39J93J40k92l12K57l9j08K06j36L32
$$ 305 -70 -144 46 -90 -335 -120 -25 -416 -187 133 -6 187 327 35 -277 -20 -59 -167 39 -97 235
4722B35r1P3K0l14K29j5n06M10l3m0k39M10n6r0l01M12l26K91j65J26k43J67r1
$$ 235 144 217 237 -77 152 137 -369 41 8 -32 -271 139 83 -7 -308 104 -222 69 -96 30 -213 -46 -137
4745a37L17P7j46j25p2K13R1l77M31l3o5P1Jk57K32J1j67M3mk85j22J47R2K8j08
$$ -137 180 257 111 -14 -86 127 218 -159 272 239 174 245 246 -11 221 232 65 108 104 -181 -303 -156 -64 -36 -144
4770a44K35k93j82K52j26P6K26n7K14k52J23l37J46n5J37k4P1L6L3R3Q8l08L73
$$ -144 91 -202 -384 -132 -258 -182 44 -13 201 -51 72 -265 -119 -174 -37 -61 10 46 79 172 260 -48 325
4793C25l84J05O0j54L6k88K96mJ02j31J22k47N9K1k37%J78O4P6j04p5Lq5L59j12
$$ 325 -59 46 106 -48 -12 -300 -4 -8 94 -37 85 -162 -103 -82 -319 -319 -141 -77 -1 -105 -180 -177 -262 97 -15
4818a5O8J66k68J87j18Q7J52l32K93r3m52M86m7j42K71k96J52K07n29J18J62k96
$$ -15 53 219 -49 138 20 107 259 -73 220 127 -325 161 114 -28 243 -53 99 306 -223 -105 57 -239
4840b39M75m28K3K12K2Q0k36MK95o8qj14j84J40L33l94M6K54j64K8M5q2P0j37
$$ -239 236 -192 -169 43 65 145 -91 -87 208 140 132 18 -166 -26 307 -87 -41 213 49 77 122 40 110 -27
4864b7k54M33k54J99k62J5L8j28p7J16J9J92L4r1N8O9L7o0j40K06M3J7l2j17n9
$$ -27 -281 152 -102 97 -165 -150 -112 -240 -317 -201 -182 10 44 -47 11 80 117 57 -83 123 166 183 151 34 -25
4889b5L9M2K51l90j15K40O1r4p3j8k29M90l6k16L53k30j27j46oJ05l8K86K4l21
$$ -25 14 56 307 -83 -198 42 103 9 -64 -82 -311 179 143 -73 280 50 -77 -223 -229 -124 -162 124 148 -173
4913a73K11J94j80j9J12j32K3k73M65l16J92L2r9q9J78j2n7k24m2K17j21K0J3
$$ -173 38 232 52 33 145 13 36 -237 228 -88 104 136 37 -52 126 114 57 -167 -209 8 -113 -93 -80
4936h0m8l7k8l4M8L92k22Lo4K6q7L64k7q1J24k10l1m3J19l58J10M37l82j59J76
$$ -80 -128 -165 -193 -227 -179 213 -9 -6 -70 -44 -131 233 206 125 249 39 8 -35 84 -274 -164 273 -109 -268 -92
4961i2Q8QJ17P4l06J2J12m1J03M6p9k79L08j92J56j33J49O7k15L12rj60K78k23
$$ -92 -4 4 121 195 -111 -99 13 -28 75 121 42 -237 71 -121 35 -98 51 118 -97 215 206 46 324 101
4985A01j76q7L23P4PJ7l70K29k82n9K57p8K6j69K48k14R4m5K32j79n3K43k66K41
$$ 101 -75 -162 161 235 242 259 -111 118 -164 -223 34 -44 -18 -187 61 -153 -59 -104 128 -51 -104 139 -127 114
5009A14M7j27K4k21P9J68j61J29k69J57j02J03L36k14M4l83M62j68J49m16K48
$$ 114 161 34 58 -163 -84 84 -77 52 -217 -60 -162 -59 277 63 107 -276 186 18 167 -249 -1
5030ak60J30j51K4K13l4J70j50N3N8l7j81K27k07J73j08R0O2K02j75j47J97l37
$$ -1 -261 -131 -282 -258 -45 -79 91 -59 -6 52 15 -166 61 -146 27 -81 9 71 273 98 -49 148 -189
5053a89J20K24k42K14k03o5Q4K52k09j34L28n57J52K19J21l20%P7%o0L07m4L7
$$ -189 -69 155 -87 127 -76 -141 -57 195 -14 -148 180 -377 -225 -6 115 -205 -205 -128 -128 -188 119 75 112
5076A12K29j88l4O8P8k03k56K85K26l69J6J08n7J61k82k09L97l15K16k62M91l23
$$ 112 341 153 119 187 265 62 -194 91 317 -52 -36 72 15 176 -106 -315 82 -233 -17 -279 212 -111
5098a11J73l4J48n4j33L48k24j53K04Q8k27j0J9q0J2N7N6n2K24k32j26O6K07j03
$$ -111 62 28 176 122 -11 337 113 -40 164 252 25 15 34 -46 -34 23 79 27 251 19 -107 -41 166 63
5122F3l6Q5l94N8R7J30pp2N3k24L28J47j78l03K52k2J31K2R4L6K2j72J20j42r9
$$ 63 27 112 -282 -224 -127 3 -4 -76 -23 -247 81 228 50 -253 -1 -23 108 130 224 260 282 110 230 88 -11
5147a1j15o9K55k46O1K34L4l01P1R9k37K13k05M3L6J09p8K09l26R6K73k30L58
$$ -11 -126 -195 60 -186 -125 109 143 -158 -87 12 -225 -12 -217 -174 -138 -29 -107 102 -224 -128 145 -85 273
5170B73k99R9l1L4k24J17J2K21J8k77K68l23J52l3K79m59J2o6J77L3K16k93J5
$$ 273 -26 73 42 76 -148 -31 -19 202 220 -57 211 -112 40 7 286 -173 -161 -227 -50 -17 199 -94 -79
5193g9L7J89j02k11J3M8K67l73J95m0L58k46K02j42l00M74n04K62K7M9ok33q2
$$ -79 -42 147 45 -166 -153 -105 162 -211 -16 -56 302 56 258 116 -184 290 -214 48 75 124 118 -115 -197
5216a97J53K62l6L6l10K21K23k13k15p1K2N6qL0j23J75k2J13j41L73k35L7r7K02
$$ -197 -44 218 182 218 -92 129 352 139 -76 -147 -125 -69 -77 -47 -170 5 -17 96 -45 328 93 130 33 235
5240B35j42l5j85K21K8k02l4L97l42j12K74j59J78k26K20j17J93j78j76J70k76
$$ 235 93 58 -127 94 122 -80 -114 283 -59 -171 103 -56 122 -104 116 -1 192 14 -162 8 -268
5261b68K33Q2J37k20J16J3K85q8l49M20m79M8K22l66K41m0k2J1J80n0p1J00k08
$$ -268 -35 47 184 -36 80 93 378 290 -59 361 -118 -70 152 -214 27 -13 -35 -24 156 106 35 135 -73
5284g3K90k98j80M2L95j98L8l23M82k85J75j36K05k01j68Q4K56M9j64K42j58L9
$$ -73 217 -81 -261 -219 176 -22 16 -307 175 -110 65 -71 134 -67 -235 -151 105 154 -10 232 74 113
5306A13K8L3K1j79m6J74m9k61P8rO3J4J38j86j30J29J37j70M7K29j72O6p7j22
$$ 113 141 174 195 16 -30 144 95 -166 -88 -97 -34 -20 118 -68 -198 -69 68 -102 -55 174 2 68 -9 -131
5330a31J28J5J78j26j3J01m13J64J53P4n3N3p6j63j79L74l12J52j18J73j08K44
$$ -131 -3 12 190 64 51 152 -261 -97 56 130 77 130 54 -109 -288 86 -226 -74 -192 -19 -127 117
5352A17j44m7J18k69J62K66k33j01J01p9J64N5r0J20k84J84J51j43P9p4N3j1k8
$$ 117 -27 -74 44 -225 -63 203 -30 -131 -30 -109 55 110 20 140 -144 40 191 48 127 53 106 95 67
5375F7L9L8j75Q0q4J5K13r3q0j54J12O4l11m7J47mJ69l7J92k42l6J18MO1J63p4
$$ 67 106 144 -31 49 -35 -20 193 100 20 -134 -22 42 -269 -316 -169 -173 -4 -41 151 -91 -127 -9 -5 56 219 145
5401A45p3J71j47p6M6o7J16k96K07p9j14k77N25p6j57K89k08K58j17l02Q8K2M6
$$ 145 72 243 96 20 66 -1 115 -181 26 -53 -167 -444 81 5 -152 137 -71 187 70 -232 -144 -122 -76
$$ [...]
8191I6
##END NTUPLES=NMR FID
##END=
