##TITLE=1H_Pr 1100
 CDCl3, 8 sc, 
 7.07.2021
##JCAMPDX= 6.0         $$ Bruker NMR JCAMP-DX V2.0
##DATA TYPE= NMR FID
##DATA CLASS= NTUPLES
##ORIGIN= UXNMR, Bruker Analytische Messtechnik GmbH
##OWNER= root
$$ XWIN-NMR		Version 3.5
$$ Wed Jul  7 12:54:17 2021 Russian Standard Time (UT+4h)  she@DPX200
##.OBSERVE FREQUENCY= 200.131506
##.OBSERVE NUCLEUS= ^1H
##.DELAY= (6, 6)
##.ACQUISITION MODE= SIMULTANEOUS
##.ACQUISITION SCHEME= undefined
##.AVERAGES= 8
##.DIGITISER RES= 18
##SPECTROMETER/DATA SYSTEM= spect
##.PULSE SEQUENCE= zg30
##.SOLVENT NAME= DMSO
##.SHIFT REFERENCE= (INTERNAL, DMSO, 0, 15.7039)
##AUDIT TRAIL= $$ (NUMBER, WHEN, WHO, WHERE, WHAT)
$$ ##TITLE= Audit trail, XWIN-NMR		Version 3.5
$$ ##JCAMPDX= 5.01
$$ ##ORIGIN= Bruker BioSpin GmbH
$$ ##OWNER= she
$$ F:/spectra/data/she/nmr/H-F/1/audita.txt
$$ ##AUDIT TRAIL=  $$ (NUMBER, WHEN, WHO, WHERE, WHAT)
(   1,<2021-07-07 12:53:08.87 +0400>,<she>,<DPX200>,
      <created by zg, POWCHK disabled, PULCHK disabled
       configuration hash MD5:
       00 E9 B6 7A A2 85 ED C7 34 08 36 98 17 FE 4E 26
       data hash MD5: 16K
       81 06 E8 4D 46 65 47 78 0E 67 35 D6 62 1D 61 58>)
$$ ##END=
$$ 
$$ hash MD5
$$ 18 A8 7B 5F 4A 2C 83 C8 E8 75 CC BE 02 C6 B9 BE
##$RELAX= 
##$RELAX= 
##$RELAX= 
##$RELAX= 
##$RELAX= 
##$RELAX= 
$$ Bruker specific parameters
$$ --------------------------
##$DU= <F:/spectra>
##$EXPNO= 1
##$NAME= <H-F>
##$PROCNO= 1
##$TYPE= <nmr>
##$USER= <she>
##$AMP= (0..31)
100 100 100 100 100 100 100 100 100 100 100 100 100 100 100 100 100 100 
100 100 100 100 100 100 100 100 100 100 100 100 100 100 
##$AQSEQ= 0
##$AQ_mod= 1
##$AUNM= <au_zg>
##$AUTOPOS= <>
##$BF1= 200.13
##$BF2= 200.13
##$BF3= 200.13
##$BF4= 200.13
##$BF5= 200.13
##$BF6= 200.13
##$BF7= 200.13
##$BF8= 200.13
##$BYTORDA= 1
##$CFDGTYP= 0
##$CFRGTYP= 5
##$CHEMSTR= <none>
##$CNST= (0..31)
1 1 145 1 1 1 1 1 1 1 1 1 1 1 1 1 1 1 1 1 1 1 1 1 1 1 1 1 1 1 1 1 
##$CPDPRG= <>
##$CPDPRG1= <>
##$CPDPRG2= <>
##$CPDPRG3= <>
##$CPDPRG4= <mlev>
##$CPDPRG5= <mlev>
##$CPDPRG6= <mlev>
##$CPDPRG7= <mlev>
##$CPDPRG8= <mlev>
##$CPDPRGB= <>
##$CPDPRGT= <>
##$D= (0..31)
0 1.2 0 0 0 0 0 0 0 0.06 0 0.03 0 0 0 0 0.0002 0 0 0 0 0 0 0 0 0 0 0 0 
0 0 0 
##$DATE= 1625647988
##$DBL= (0..7)
120 120 120 120 120 120 120 120 
##$DBP= (0..7)
150 150 150 150 150 150 150 150 
##$DBP07= 0
##$DBPNAM0= <>
##$DBPNAM1= <>
##$DBPNAM2= <>
##$DBPNAM3= <>
##$DBPNAM4= <>
##$DBPNAM5= <>
##$DBPNAM6= <>
##$DBPNAM7= <>
##$DBPOAL= (0..7)
0.5 0.5 0.5 0.5 0.5 0.5 0.5 0.5 
##$DBPOFFS= (0..7)
0 0 0 0 0 0 0 0 
##$DE= 6
##$DECBNUC= <off>
##$DECIM= 32
##$DECNUC= <off>
##$DECSTAT= 4
##$DIGMOD= 1
##$DIGTYP= 9
##$DL= (0..7)
0 120 120 120 120 120 120 120 
##$DP= (0..7)
150 150 150 150 150 150 150 150 
##$DP07= 0
##$DPNAME0= <>
##$DPNAME1= <>
##$DPNAME2= <>
##$DPNAME3= <>
##$DPNAME4= <>
##$DPNAME5= <>
##$DPNAME6= <>
##$DPNAME7= <>
##$DPOAL= (0..7)
0.5 0.5 0.5 0.5 0.5 0.5 0.5 0.5 
##$DPOFFS= (0..7)
0 0 0 0 0 0 0 0 
##$DQDMODE= 0
##$DR= 18
##$DS= 0
##$DSLIST= <SSSSSSSSSSSSSSS>
$$ [...]
##$SUBNAM2= <"">
##$SUBNAM3= <"">
##$SUBNAM4= <"">
##$SUBNAM5= <"">
##$SUBNAM6= <"">
##$SUBNAM7= <"">
##$SUBNAM8= <"">
##$SUBNAM9= <"">
##$SW= 20.0188882624521
##$SWIBOX= (0..15)
0 0 2 0 0 0 0 0 0 0 0 0 0 0 0 0 
##$SW_h= 4006.41025641026
##$TD= 16384
##$TD0= 1
##$TE= 0
##$TE2= 300
##$TE3= 300
##$TEG= 300
##$TL= (0..7)
0 120 120 120 120 120 120 120 
##$TP= (0..7)
150 150 150 150 150 150 150 150 
##$TP07= 0
##$TPNAME0= <>
##$TPNAME1= <>
##$TPNAME2= <>
##$TPNAME3= <>
##$TPNAME4= <>
##$TPNAME5= <>
##$TPNAME6= <>
##$TPNAME7= <>
##$TPOAL= (0..7)
0.5 0.5 0.5 0.5 0.5 0.5 0.5 0.5 
##$TPOFFS= (0..7)
0 0 0 0 0 0 0 0 
##$TUNHIN= 0
##$TUNHOUT= 0
##$TUNXOUT= 0
##$USERA1= <user>
##$USERA2= <user>
##$USERA3= <user>
##$USERA4= <user>
##$USERA5= <user>
##$V9= 5
##$VALIST= <valist>
##$VCLIST= <CCCCCCCCCCCCCCC>
##$VD= 0
##$VDLIST= <DDDDDDDDDDDDDDD>
##$VPLIST= <PPPPPPPPPPPPPPP>
##$VTLIST= <TTTTTTTTTTTTTTT>
##$WBST= 1024
##$WBSW= 4
##$XGAIN= (0..3)
0 0 0 0 
##$XL= 0
##$YL= 0
##$YMAX_a= 304727
##$YMIN_a= -308827
##$ZGOPTNS= <>
##$ZL1= 120
##$ZL2= 120
##$ZL3= 120
##$ZL4= 120
##$ABSF1= 10
##$ABSF2= 0
##$ABSG= 5
##$ABSL= 3
##$ALPHA= 0
##$AQORDER= 0
##$ASSFAC= 0
##$ASSFACI= 0
##$ASSFACX= 0
##$ASSWID= 0
##$AUNMP= <proc_1d>
##$AZFE= 0.1
##$AZFW= 0.1
##$BCFW= 1
##$BC_mod= 2
##$BYTORDP= 1
##$COROFFS= 0
##$CY= 11.3945322036743
##$DATMOD= 1
##$DC= 2
##$DFILT= <>
##$DTYPP= 0
##$F1P= 15.9154993809931
##$F2P= -4.1035820241983
##$FCOR= 0.5
##$FTSIZE= 0
##$FT_mod= 4
##$GAMMA= 1
##$GB= 0.15
##$INTBC= 1
##$INTSCL= 1
##$ISEN= 128
##$LB= 0.24
##$LEV0= 0
##$LPBIN= 0
##$MAXI= 10000
##$MC2= 0
##$MEAN= 0
##$ME_mod= 0
##$MI= 1.114404
##$NCOEF= 0
##$NC_proc= 0
##$NLEV= 6
##$NOISF1= 3.799351
##$NOISF2= 2.8
##$NSP= 1
##$NTH_PI= 0
##$NZP= 0
##$OFFSET= 15.70392
##$PC= 1
##$PHC0= -12269.69
##$PHC1= 5.001002
##$PH_mod= 1
##$PKNL= yes
##$PPARMOD= 0
##$PSCAL= 0
##$PSIGN= 0
##$REVERSE= no
##$SF= 200.130013532006
##$SI= 16384
##$SIGF1= 3
##$SIGF2= 2
##$SINO= 400
##$SIOLD= 16384
##$SREGLST= <1H.CDCl3>
##$SSB= 0
##$STSI= 0
##$STSR= 0
##$SW_p= 3612.71676300578
##$SYMM= 0
##$S_DEV= 0
##$TDeff= 0
##$TDoff= 0
##$TI= <>
##$TILT= no
##$TM1= 0
##$TM2= 0
##$TOPLEV= 0
##$USERP1= <user>
##$USERP2= <user>
##$USERP3= <user>
##$USERP4= <user>
##$USERP5= <user>
##$WDW= 1
##$XDIM= 8192
##$YMAX_p= 0
##$YMIN_p= 0
$$ End of Bruker specific parameters
$$ ---------------------------------
##NTUPLES= NMR FID
##VAR_NAME=  TIME,          FID/REAL,        FID/IMAG
##SYMBOL=    X,             R,               I
##VAR_TYPE=  INDEPENDENT,   DEPENDENT,       DEPENDENT
##VAR_FORM=  AFFN,          ASDF,            ASDF
##VAR_DIM=   8192,          8192,            8192
##UNITS=     SECONDS,       ARBITRARY UNITS, ARBITRARY UNITS
##FACTOR=    0.0002496,     1,               1
##FIRST=     0,             0,               0
##LAST=      2.0444736,     0,               0
##MIN=       0,             -308827,         0
##MAX=       2.0444736,     304727,          0
$$ Real data points
##PAGE= N=1
##DATA TABLE= (X++(R..R)), XYDATA
$$ [...]
2006a097J031J865k26j524j038N52J466M41l62j458n81J224J615j24j427j167
2022h10R07J652L61p43j313k10J320J265l23j394j360R73J392M76j060k141J03
2039i05J547Q85k12j654j371J091J175K83j216j577l2J942M44m83j537q62J518
2056i64J233L70j125j679O21J680M20k91j432l91R70J182L73j210j143M48J326
2073C88P54n33j727j90J285R79P4j319r16L28J556R02j006j579J51R96J264J32
2091A539j488o00L86J429N68p19j227J1O79J379l54j493n11N25J144J57r76j328
2109h79NJ197J088o80j319p88O25J329L24j522r38J25J132P79m46j312m63O44
2127a099J222K02j294r33J03J508P08p59j220l43R97J618k08j165q30J5J458Q79
$$ y = [-1097, -66, 1799, 1573, 49, -989, -437, 1029, 1470, 1108, -350, -931, 293, 1908, 1784, 357, -810, 97, 1749, 2110, 1367, 54, -156, 1164, 2429, 2106, 712, -648, 325, 1717, 2193, 1133, -1008, -905, 642, 1527, 1315, -339, -1710, -619, 556, 839, -377, -1954, -1986, -44, 400, -83, -1620, -2482, -964, 269, 639, -486, -2165, -1544, 136, 556, 265, -1167, -1558, -588, 594, 967, -243, -1386, -938, 388, 1142, 609, -1118, -1308, -23, 956, 1030, -289, -1205, -877, 679, 1581, 575, -1004, -853, 143, 1407, 1539, 51, -549, -163, 1266, 1834, 1115, -112, -101, 578, 1957, 1603, 110, -401, 124, 1268, 1425, 449, -879, -874, 323, 1411, 731, -588, -1376, -751, 578, 902, -620, -1558, -1433, -301, 478, 32, -1280, -1743, -1099, 123, 325, -969, -1902, -1799, -291, 417, -342, -1562, -1905, -908, 710, 502, -663, -1493, -1478, -20, 859]
2145H59p62j021p43J109J592n27p97j052L49J466O92q96p69l34J177R73l73r18
2163B5r75O28J432O69j177j082m8Q32J230l09p29j273Q17J187M21o53j462J4J065
2182F12P74m67r53o75M1J586L1p86j154j92J443P41l34j511p26P15J264J50r49
2201c90j109J93J250O00l09j324n72J067J107p0j072q77N18J025P09m99j052l99
2219a204J174J159k5j213m49L05J192L01k94j110m03J085P65P2j018q72Q06Q82
2237A153N90j046j112K45Q51Q62m18r47q86Q58Q01R22j210r95J94J043P39m82
2255A162j168n01M26Q09K57j018r61rQ01J096n36j277n86O46J001Q4j101j073
2273a948K10Q43J080o49j114l6K83J194q6n61q93L72R27O93p39n85n33Q48Q92
$$ y = [859, 97, -924, -1667, -558, 1034, 507, -290, -1342, -993, 473, 1165, 269, -500, -834, 343, 1316, 943, 25, -950, -322, 1110, 1779, 602, -480, -528, 304, 1534, 1225, 496, -777, 40, 1227, 1648, 995, -467, -453, 612, 1386, 919, -34, -709, -668, 918, 949, 163, -991, -1183, 260, 1001, 667, -844, -1570, -855, 409, 559, -390, -1499, -1306, -56, 544, 235, -1089, -1661, -594, 513, 443, -629, -1506, -988, 37, 746, 247, -805, -1204, -30, 1129, 1104, -109, -558, -253, 939, 1240, 946, -164, -567, 518, 1283, 1355, 337, -535, 271, 1153, 1743, 697, -415, -170, 681, 1543, 1125, 178, -708, 150, 951, 1873, 663, -332, -138, 905, 1644, 1162, -6, -507, -81, 728, 985, -33, -994, -1003, -202, 894, 358, -919, -1505, -859, 142, 226, -875, -1948, -1738, -895, 185, -464, -1578, -1614, -1331, -137, -223, -784, -1677, -1305, -378, 315, -424, -1009, -1542, -694, 198]
2292A98J98p44n16J00J021L92m62j246J22O78J152l06p28m80J03J447P9l25r38
2311b55m86J100R38j81n92q11O20J170K18p78o79l08J053Q20l98j018n74N81O89
2330A109K55o77q97l92J185M60k74j073p14N41P64Q4p20r09l5R49M78l40j135
2349a341k72P19Q12L10q95p95L93O58Q05k10j503J52O85N70J54o68q45L06Q95
2368g0N77m28j044o6P85O43j15p20n06pJ456M48o73q90N5Q89L87L29q73m36K78
2389A9J278N29r30r76L53N46O14N0r91l98L1J137M71j053o35r2Q48N33o1j526
2409b53n8K60P65J19o19q12M6N49N02o50m91l29M96R01l53o64l66K04N56O95q71
2430c73o54k41N20P32j9n67o24m9Q94K99k38q40l26M93R91k50m57p52N46P82K56
$$ y = [198, 396, -348, -864, -764, 257, 649, 187, -1059, -937, -259, 893, 587, -141, -621, -518, 929, 1008, 683, -255, -741, 359, 1297, 1116, 524, -287, 333, 1503, 1721, 943, 264, -44, 1009, 1829, 1431, 413, -161, 420, 1109, 1364, 687, -210, -602, 583, 1043, 769, -304, -1018, -477, 287, 371, -349, -1258, -1293, -344, 134, -206, -1341, -1613, -894, -82, 228, -667, -1462, -1069, -411, 394, 184, -1319, -1167, -482, 88, 242, -426, -1271, -965, -70, 507, 79, -965, -1031, -246, 397, 282, -438, -944, -951, 505, 953, 280, -610, -555, 334, 721, 1050, 177, -259, 19, 1297, 1826, 896, -80, 273, 819, 1433, 1483, 492, 94, 125, 1262, 1733, 680, 45, -47, 801, 1334, 1273, -253, -311, -51, 714, 833, 214, -598, -552, -3, 499, -151, -642, -971, -475, 426, 73, -591, -957, -753, -197, 498, -373, -1027, -1268, -748, -16, -35, -602, -1226, -1275, -381, -82, -320, -1160, -1486, -993, -2, -252, -709, -1461, -915, -133, 123]
2451A23l93k71m29P08J096k73q46m53Q31P78R8l05q89K35P55L68m4o50p40P77
2471D76N01J34l05r01j22P62P98n52p73l29K29O31K97m27p43J41R49j09j98p43
2491b84k29M28Q14M1q09o73N72L76K48k71r35q3L87N99J64n61q99L90L98L03k30
2512b54p79J97L47K34M00p83o34L41N21L81l73m55j56O87P95k56o69m27N91Q11
2532E19n7l13m81K02J72O79J75q86k88N13L69K48l42o94J64O94M26n48l05m11
2552a64N43L50J16m28m51q0R07J46l71n58j26O6P74o3n85l35Q4P70K69o17m00
2573a53m83N19M98K28q75j58k27O70M62o95m96Q8K84P44m32m14l23M2P00J45k96
2594a72n75k89P04L20J13m44o50O39N56M46n10n71k76P92K68J05q07j24K01P13
$$ y = [123, -270, -541, -970, -262, 834, 561, -285, -738, 93, 871, 969, 664, -225, 10, 765, 1133, 1089, 439, -301, 476, 977, 1111, 806, -95, -217, 545, 1343, 791, 18, -311, -82, 549, 846, 419, -324, -183, 766, 657, 459, -284, -513, -85, 729, 770, -39, -712, -140, 236, 484, 213, -722, -805, -418, 181, 345, -216, -1115, -725, -327, -24, -254, -1033, -836, -489, -255, 145, -638, -1272, -931, -410, -29, -402, -857, -1013, -326, 469, 213, -456, -883, -292, 519, 462, 149, -332, -130, 42, 721, 896, 10, -278, 235, 604, 852, 510, -184, -20, 674, 1100, 552, 247, -164, 379, 729, 845, 417, -34, -114, 793, 939, 568, 10, -116, -50, 724, 661, 76, -259, -175, 595, 864, 247, -153, -636, -117, 381, 609, -266, -424, -651, 19, 481, -214, -710, -622, -338, 406, -26, -440, -763, -721, -21, 124, -172, -747, -1036, -332, -12, 101, -343, -993, -354, 202, 648, 138, -433, -709, 83, 351, 456, -351, -475, -274, 439]
2614D39p7K13r28j58O94J86j88l35n73P37M94J66l35m56r5O26M18j50n24n30M77
2635A01J70L43m59q31N26P14J63l12p68j17O79J52L5m20o16L47N4R41q12n23j1
2656f44K37N20J64o30l79K88K60K94k81l45m16P04L67o8o38j80L06M38M51m96
2676d8m35J04K04P58k3r01j76K19L99L08k39n79K38L59L95j46l49j99j25O53K96
2697G13m20m79J60L21N53l94l97m00M36K36M02k71p37Q7K91N08k93l29n35N54
2717FN29n7o61O1k37O34L29l38p06NN84j3j29m25p3j30Q76k43j13k73m48M47N37
2740A62l83p0l61O05j01J49n7o74R1L55O15m07j91l52M41N00j88j80j28q9N52
2761B89JK19m67n97K98M71J62k34n58R3N05K60k74k50k92N81J85J1l62n44j3P61
$$ y = [439, 362, 575, -353, -511, 183, 369, 181, -154, -727, 10, 504, 670, 335, -121, -216, 410, 828, 678, 154, -376, 101, 271, 614, 155, -676, -150, 564, 727, 415, -353, -470, 209, 361, 396, -24, -640, -293, -239, 702, -110, -633, -644, -407, 113, 277, -353, -732, -444, -184, 110, -171, -516, -932, -228, 139, 71, -567, -747, -441, -3, 448, -48, -483, -379, -175, 583, 560, -341, -517, -298, 101, 409, 170, -409, -171, 188, 583, 437, 88, -111, -236, 417, 713, 293, -186, -26, 295, 848, 454, 57, -343, 93, 329, 731, 460, -277, -190, 101, 609, 316, -13, -548, 6, 535, 478, -183, -122, -359, 275, 604, 266, -440, -435, 149, 136, 7, -418, -491, -621, 255, 12, -101, -374, -822, -375, 162, -221, -291, -652, -47, -148, 1, -56, -730, -639, -284, 331, -76, -267, -619, -178, 322, 134, -46, -174, -263, 289, 290, 509, 42, -555, -257, 214, 376, 142, -416, -323, 182, 442, 168, -82, -374, 207, 392, 403, 41, -503, -516, 245]
2783B45K82o8o22k68M75L50q2j31l87j71N25K30k75m19QL77L97m5n27l46J41K89
2805b2NL15q18o7J81O35m25j60l92R2O28K16q0r13K75O62K15Jm42k98L7N98M7
2828B90m77k48N39O8M48j25o12k5J9M51p3j63l23R0K23N04j94o08m1J14K95N37
2850F89o33Q4j85L48M30n1q05j6L61K2M51l90m23J16L64R1n5n35k72M04L12j08
2872A99j16k42q0L47J33l55m16K4M16J21J17m33k85J9O13L3r7n28l5M28K40j48
2894d5L6m09O2O10P4m42j82J30L81L7k97n01K08K31K55N0j41k23k39P80j52n1
2916A72k15n33N09N43l8l12n46L56N04k81L55o72j47O16J89k70p8m19L3J43L94
2937C03j1o46K71Q6K57j03k57m45K27J46N98m17k18%J09M23m18L4j98J2N9M25
$$ y = [245, 527, 459, -163, -431, 44, 394, 312, 181, -206, -377, 148, 378, 103, -316, -308, 69, 466, 421, -106, -452, -311, -22, -17, 298, -520, -587, -406, 229, -196, -356, -748, -656, -28, 188, 108, -805, -530, 132, 347, 348, -94, -392, -355, 243, 290, -187, -435, 104, 172, 620, 495, -117, -142, -123, 328, 255, 92, -231, -141, 82, 586, 392, -216, -257, -143, 152, 689, 56, 140, -45, 303, 733, 682, -123, -139, 222, 244, 695, 305, -118, -2, 362, 453, 398, -137, -409, -5, 307, 199, 83, -159, -239, 108, 241, -114, -530, -506, -90, 31, 148, -285, -570, -551, 62, 95, -2, -530, -565, -137, 103, -45, -9, -418, -356, 254, 328, -114, -296, -166, 215, 252, -45, -546, -338, -107, 148, 198, 57, -166, -405, 375, 223, 172, -43, -576, -67, 476, 438, 126, -420, -64, 440, 159, 514, -158, -305, 311, 500, 230, 152, -267, -234, -91, 303, 292, -354, -83, 3, 260, 157, -100, -545, -318, -172, 426, 9, -209, -209, -100, 323, -95, -61, -259, -247, -188, 237]
2959B37n08K69p27N61K72J39m10j13n5O28j73l23K3p0O2N29j27k69J43k40L40
2980A88Qr9m05M30J04K79l95k09K56k01L13K55m24j03j38K51M52j73n68j6K48
3001E3L07O5l33l72J64K80L31n19L0l1J20K09Ml48k02K93K11J36m69j45k90M12
3023i4L94k06j16l88l1O94k87j32k20J3K64K23r3k22n75P44m03L88k64K1k41M13
3045a18j11J91r6m26L67K44lR1o42J92N00J03n9m16j66J72M15K85m66k06L25J5
3067A91J37j20l61P9J19J12N2j71j12Q3J18J89j01l07j47J57K78J73n09r2m8M30
3089A50J30j06j44k23p3J72L70l86k71J06K50J98l78j46M1Q5M20k44l36N9K08
3110a18k8Q7j94K27j57L31L36m41m37K7L20L09j10k29m14L30N08j58l0j75k05
$$ y = [237, -271, -2, -729, -168, 104, 243, -167, -280, -335, 293, 120, -203, -180, -250, -188, 341, 214, -55, 88, -152, 188, 196, 97, -308, 122, 226, 505, 110, -99, 157, -44, 269, 524, 100, -3, -141, 110, 562, 389, -179, -195, 53, 360, 425, 92, -280, -116, 164, 495, -24, 6, -25, 95, 304, 308, -40, -242, 51, 262, 398, -71, -216, -506, -94, 300, 94, -22, -410, -441, 253, -34, -166, -386, -373, -109, 114, 21, -201, -776, -32, -435, -47, -311, -290, -531, -118, -229, -38, -134, -560, -193, 51, 48, 139, -503, -311, 189, 292, 233, -183, -349, -177, 238, 523, 57, -149, 176, 191, 328, 208, -153, -74, 45, 157, 209, 38, -74, 9, 127, 316, 215, -92, -239, -82, 196, 369, -140, -232, -280, 150, 280, 174, 30, -193, -266, -94, 276, -110, -381, -275, -25, 173, -205, -351, -310, -225, 195, -49, -385, -326, -118, -146, -59, -253, -26, -183, 148, 484, 43, -394, -367, -47, 262, 152, -77, -491, -161, 347, 189, 159, -16, -221]
3131b21J35M41l09K72l89M4J83L46l61j85J44j30O32j08j52l64j14N34%j01j55
3152A42l90L44N22m39J00k32m7O7K31n2l53p4R5L45l60J58k32o8J41K87l07k12
3174c34n1J66K86k43L0n75K89N29J33k74k55j91P63j94l42k05O9M72m9M2l59R0
3196b03n5K78L4p3j59j1N2K54Q6j48l43J66J76P0Q1k37k40P5L30j28M46k59k25
3219c3M21k18J44k17j32K64J84Q4m69Q4j11K33N1p8j72j47K38r8J17k10K1K13
3241A69lJ84o33K3O3K1L47k27l37J2K34O9Pj35j22p2L23R1k73k0j07J68K9M30
3265B41k03k87j39M13l3l21p3J24Q3L09J84l71O1k13L72k11L68j90l25J06K34
3286A29M4l79M9J1K78J96k85J46k81K71M45m26r2J84l03L77J20l53j5l15M54j27
$$ y = [-221, -86, 355, 46, 318, -71, -27, 156, 502, 141, -44, 100, -30, 602, 494, 342, -22, -136, 398, 398, 297, 142, -248, 96, 618, 179, 279, 47, 0, 67, 298, 246, -107, -181, -86, 259, -101, 57, -175, -243, -102, 185, -122, -334, -385, -219, 67, -176, -146, -721, -432, 97, 230, -44, -299, -490, 273, 79, -263, -468, -399, 73, 24, 66, -293, -203, -258, 20, 54, -19, -178, -189, -137, 117, 203, 55, -288, -122, 54, 124, 205, -32, -272, -197, 133, 5, 451, 192, -33, 388, 170, 314, 97, -35, 229, 413, 497, 28, 112, 1, 234, 285, 207, 35, -112, 126, 28, 145, -65, -44, 169, 166, 350, -283, -260, -197, -176, 171, -56, -393, -381, -147, -78, -71, -206, -328, -400, -77, 14, -259, -279, -386, -218, -189, 241, 38, -249, -388, 25, -8, -329, -402, -278, -195, 114, 298, -73, -12, -225, 147, -64, 304, 114, -211, -105, 129, 173, -206, -157, -146, 132, 328, 43, 189, -92, 179, 624, 198, 106, 290, -13, 364, 484, 131, 116, -199, 255, 128]
3308A28o0K07k13k15N23ql41m5k0Q0l1J99j71n44L23L22M2l18k63K60O3j90P3
3331a99j47R3L8J68J01k21m23N3N56J22j98l08r0L93K1J67k85j49K0M45r0n0j66
3354a49k89M20m1R8r0k03M22Rj6K66m14p5M97j33J41m83k65M41P1m1J19m37J98
3377D6R4N8J82n11K38q6p9L51j51k62J34j85J89ok63L20j07J27k9j02j32r6N7
3400b13M08l25J10j15N2L02J06n10j49L07j38Q1J9m6p8J47k2K11m14J53j81o8
3422c63M36k06K2O5J1J99j37k04J16j94M49J71k07N4k31J10N2n5j92K65k33O13
3444E41l23r0L2k88J67L74j46l47Q4l7K53N3l55J4k4L27O7j89j46M2rl6J72j20
3468A6o9J5K73l06M8K33m58M54n5J72r1m76J02J85r5M9J32P1m31M18J06j89j22
$$ y = [128, 68, 275, 62, -153, 370, 362, 21, -24, -44, 36, 5, 204, 33, -511, -188, 134, 176, -142, -405, -145, -82, -272, -199, -346, -253, -215, -47, 54, -167, -590, -537, 19, 141, -57, -365, -455, -62, -41, 126, -159, -308, -288, 157, 67, 17, -149, -438, -18, -59, 39, -51, -254, 168, 177, 161, 427, 13, -62, 435, 302, 443, -40, -305, 136, 207, 166, 285, -152, 46, 140, 198, 380, -131, 107, 21, -58, 293, 142, -120, 14, -171, 18, 12, -251, 69, -38, 89, 60, -42, -174, -270, -213, 195, -130, -20, -135, -83, 219, 325, -185, -334, -27, -165, -84, -65, -111, -189, -42, -64, 147, -267, -114, -295, -363, 73, -133, -111, -46, -35, 164, 27, -177, -61, -255, 194, 365, 158, 212, -19, 91, 143, 88, -104, 161, -72, 541, 218, 128, 160, -128, 39, 413, 267, -80, 4, -33, 220, 273, -82, -68, -92, 235, 302, 113, -33, 9, 0, -36, 136, 16, -53, -38, 235, -71, -23, 210, -248, 206, 151, 323, 232, -244, -142, 43, -52, -3, 129, 200, -231, 187, 293, 104, -18]
3491a8l2k5j16L34J23m85P9J51M0j90J48J45k60L36p0l06J35k7o6K69m68L56P5
3514A28N5k30K94l54j15M13n67N56j25k05K38q1R9o1k07J46j17L32L9j13N0q4
3536I1L2q2k45L16k15L49p6j3j01N6Q7l4k88j7m5J37K00J97k09j93j6Q1k7l9k31
3561b85J14Q7oK36k56P0k42Q9J62K08j42j51j28L58j81J35j4k87L33P0O2m82j13
3584c63K89Lj42m8L36j80O5K78j16k49j7R5J38j30J69j61j23K24K17l44J0k4P1
3607bk1R0Q8k77k2J28J4K57j70k00J78J1J37j88j25m4j16K48J8kl13L88q0k84
3631b87K06k25J69J56k60J97k23Q7K1K35l1qm66M69m3q5p6M5N7K52j35J99m42
3654a88J30L89j89n3q3k4j5J26k04L93j8q0k91r8M19J13m86J12n5O0o4K30n5k24
$$ y = [-18, -50, -75, -191, 143, 266, -219, -140, 11, 51, -139, 9, 154, -106, 230, 160, -146, -11, -38, -104, 165, -303, 53, 128, 183, -47, 247, -107, -222, 191, -376, 180, 55, -150, 88, 7, 106, 45, -162, -16, -133, 199, 238, 125, 175, 91, 123, 41, -204, 112, -103, 246, 170, 157, 56, 112, 199, 165, -123, -140, -185, -48, 152, 349, 140, -53, -69, 12, -15, -54, -285, -171, -84, -90, 146, -110, -40, -282, -193, -31, 177, 35, -116, -244, 114, -67, 68, 54, -233, 100, 170, 232, -250, -363, -74, -71, -213, -261, 75, -105, -40, 238, 122, -127, -144, -49, 89, -41, 128, -33, -156, 68, 285, -59, -49, -73, -2, -23, 67, 155, -122, -144, -16, -2, 255, 85, -115, 63, 74, 211, 23, -102, -146, -262, -14, 4, 2, -311, 77, -3, -287, -81, -306, -137, 19, -241, -44, -267, -180, -159, 76, 45, 37, -429, 40, -3, -88, -164, -119, -62, 190, 55, 254, -188, -58, 331, 142, 89, 6, -18, -33, 93, -111, 282, 264, 184, -107, -205, 214, 327, -159, -47, -102, -42, -106, 124, 69, -155]
3678a55K83J17l19J74j56l4N0J43j90K36l90K14r1J76Jl28K12J95j62J79j41j98
3700a84J7K42k09K56j14J16j34k44J45j1K81l38J37j40m6M51rJ18l99j20K76k0
3722G1J07k96R6k48K01K13qj58K49l20K53l0k0P5l31N4K72j94l4J19k72L54M5
3745A98j29k17j67L42J77k22k4k08K20l3K0J95j65J7%N4L1O8o0m4M9j58J20K5
3769H9r5K52k51Pk15M0n9J11L21j48k75j9J50k75N29l26N6M41l72l4K17l25K69
3792H8Mk13k7m38N76J99j51O5j53R7j58J53j77J95j43J50J97k03rj78%n6P1L7
3816g4K58l75K90l9L1L6j46q2l6M72l61op0J89n4j9n2J80Jk49J32o3lp1Q2j62
3842a91K74k65L51k92Kk42K37J01O6j22j06K10k53L50j17k85L90j20j09pJ69j91
$$ y = [-155, 128, 245, -74, 100, -56, -90, -40, 103, -87, 149, -241, -27, -118, 58, 59, -269, -57, 138, -24, 155, 14, -184, -167, 75, -134, 122, 8, 124, -10, -254, -109, -120, 161, -177, -40, -180, -226, 225, 216, 334, -65, -185, 91, 71, 178, -118, -22, -270, -69, 144, 136, -22, 227, -93, 160, 130, 110, 185, -146, -92, 180, -14, -48, 71, -201, 153, 198, 69, -148, -315, 27, 204, -18, -42, -250, -30, -63, -43, 152, -13, 4, 4, 58, 89, 157, 97, 53, 102, -56, 64, 89, -6, 246, -5, 2, -213, -173, -232, -121, 200, 52, -223, -242, -92, -367, 162, -164, -108, 333, -39, -73, 144, -181, 88, 92, -121, -148, -586, -10, 189, 38, 103, -50, 47, -111, 42, -135, 60, -83, 67, 264, 61, 52, -126, -126, -182, -111, -74, 184, -191, 99, 60, 91, 127, -19, -101, -137, 335, -26, -32, -102, 87, 33, 14, -38, 142, 143, -106, 26, -37, -40, -111, -29, -191, 83, -182, 169, -123, -121, -363, -126, -25, 41, -81, -187, 23, -230, 120, 3, -282, 108, -12, -121, -128, 41, -150]
3864a50J70Nj36K66m17M25k10j31M27l29J54J5m9r8K70j43k38q9L05K26k84J85
3886A74o5j60J04q4J56nq6o5Q8J18j12K8J53j97J29k0l88J91J24l26R7J37J55
3909A46n6k54M8K23j9k46k08P6J45J94k92L19j87J28Q2pl0j58n7K65k2q0L5j32
3933h7L61m15k2J80o7j04L7n5J33n8k43O39R6k30n3Qk25J58k14J50J45K15k29
3956A20j21m3j42J13Q2J39j80j7K9Q4J80m01K70k66J42R7o9J96j6k25P5k0lk00
3980a76qo4J70J13j00m7Q8lP2l19L14k68K2K79P5q3o8j46J78Jj11K43l38M43j29
4005A38m32J89K38j08p0K91j60j78j02L18p3j59M24k99L27k00j08q8j09K29K14
4026B82k71K6q4J26p8R2j52K02m72Q9L60j13J76k46Rl3m9R9K99o53L71J80j90
$$ y = [-150, 20, 25, -111, 155, -262, 163, -47, -178, 249, -80, 74, 89, 40, -58, 212, 69, -169, -258, 47, 273, -11, 174, 109, -51, 53, -31, 125, 120, 34, -31, 57, 175, 63, 91, 244, 47, 176, 156, -232, -41, 83, -243, -146, -9, 146, 90, -164, -116, 107, 88, -158, -366, -290, -145, 49, -243, 76, -111, 17, 99, 92, 62, -96, -153, 112, 90, 10, 45, -87, 274, -141, -163, 17, -50, -154, -117, -172, -39, -97, -340, 299, 395, 165, 112, 120, -105, 53, -161, -11, 134, 349, 120, -1, -44, -186, -73, 9, 148, -32, -49, -20, 64, 244, -157, 113, -153, -11, 86, 17, 213, 197, -28, 47, 27, 24, -176, -184, -248, -78, 35, -65, -112, -24, -27, 45, -274, 40, -228, -206, 73, 148, 65, -3, -149, 29, 30, -81, 162, -176, 267, 138, -294, -105, 133, 25, -45, 246, 86, -92, -194, 124, 51, -108, 316, 17, 344, 144, 36, -52, -161, 68, 282, 11, 37, -47, 79, 1, 93, -59, 143, -329, -240, 120, 7, 183, -63, -54, -87, -136, -37, 262, -391, -20, 160, -30]
4049c0o9Q5k31k8L37N6k91J81O3l58J24J79j00j85K20k50J01P4L8K02k64K67j61
4072d0k07L27k62J89J87k46k9j5NM78n21J49j19L73k25LJ63k37K18L5k95J20j65
4095a14p7M29j1j34j90J98Q0J85J30k76k78L96l51K17j07j44l07K52J05q8j04
4116a89J93k13P8L09m65K99K7k20R5j4k4K4r5J32l03K99r1J51J16j12p4L41n11
4139b47J02K74k58Q2m5k43K08J81J6L36q61K60J63L96k22j41j18L57n6p3lk49
4161a41J63K79o6j48j53K27k6k20L54l87J45J84J19k17J45n32K16N8J39P0k60
4182e1m3J39m3nq1l5K04p0q2N8l7l88O67q7Q7j70j91L31q8j34N2l15J64J13Q9
4207H4j84k11L10m05M43Jl14j2N3K97J54l39j24J06j50L82J8n57M95j25j25J61
$$ y = [-30, -99, -14, -245, -273, 64, 120, -171, 10, 73, -285, -161, 18, -82, -267, -47, -297, -196, -122, -84, 118, -146, 121, -40, -247, 80, -182, 7, 194, -52, -81, -96, -91, 387, -134, 15, -104, 269, 44, 47, 210, -27, 191, 226, -69, 51, -114, -191, 238, 227, 93, -97, 101, 181, 366, 496, 220, -58, 338, -13, 204, 97, -47, -354, -102, 3, -85, -189, 4, -209, -131, 178, -287, 12, 39, -181, -86, -100, -124, -100, -195, -63, -366, -67, -158, -7, 109, -3, -77, 264, -247, -145, 129, -129, -47, -92, -335, -127, 54, 70, 406, -455, -195, -32, 364, 142, 1, -117, 240, 184, 111, 108, -141, 22, 301, 235, 87, -66, 161, 135, -85, 269, -118, 27, 211, 330, 113, 258, -274, -58, 0, 139, 209, -51, -94, 45, 2, -3, -84, -119, 85, 15, -67, -9, -46, -434, 233, 146, 233, 63, -128, 203, 115, -19, 33, -282, -118, -5, 84, -100, -311, -1, -406, 37, 38, -276, -288, -235, 62, 216, -123, -247, -141, -291, 91, 109, -448, 47, -78, -203, -42]
4229d2j61J14J43j11K74j68K48l53R1j87N68n54J36K11j9m6j99Q2n1K0J49J48
4251B93j48rM1M8j13Q4j49j20j43L76n25N21l03l8K94M1j49J9j73J84J42k6j94
4274d7j51r1K37N5j43J38n4j88J18Q2L48m41l7Q5j50rR1n7L15l68J34K00m56M17
4298B8j28p2KL03l19pJ99J2L8j24K24l57K32J00k84J2Q1J34N5n6j77J96J46j6
4322B22j52J33l51N5P9J44k46j7J33K19k21J21j70K11OJ87J71l82k50k2J44J20
4344A34k8J70l28j74K07J52k26J94m0k52K65r4k96L65j45J77l25J90L5k13J21
4365a11L00l65J00j28J83M8J28j96j12J21N0J19j87L5J63j59k1M7r6M2k50L61
4387G2mlMN0J9j45R9R2k37J1L36k63L5j94K81J33rj27m23M53o2L49k96k67J60
$$ y = [-42, -203, -89, 54, -57, 217, 49, 297, -56, 35, -152, 416, -138, -2, 209, 190, 144, -55, 27, -24, -4, 145, 293, 145, 136, 177, 225, 112, 196, 47, -73, -216, 160, -365, 156, -147, -185, 109, 150, 1, 20, -153, 31, 173, 147, -47, -198, -289, -52, 3, -140, -2, -56, -244, -126, -44, 304, -137, -174, -89, -239, -248, -157, -214, 101, -267, -133, 67, -389, 28, -100, -172, -170, 133, -186, -193, 6, 18, 56, -68, 156, -201, 31, 131, -153, -141, -60, 74, 129, 73, -104, 92, 238, 222, 70, 203, -148, -93, -14, 130, -116, -133, 0, 219, -2, 119, -51, 160, 166, 353, 524, 142, -108, -130, 14, 134, 106, 276, -52, -226, -19, 133, -93, 101, 61, -191, 74, -20, -316, 49, -96, 81, -244, -54, -19, -232, -111, 189, -176, -76, -204, -21, 27, 155, -41, -153, -32, 18, 137, -50, -15, 148, -11, -32, 15, -81, -39, -289, 72, 68, 65, 69, 119, 138, -7, 92, 184, -53, -42, 294, 31, 66, -128, 153, 286, 277, 150, -273, 180, 118, 467, 171, -96, 64]
4412F4l4j37K23j7j70m6Q0n6J93k04K17k98J93k63K74Q1m37L33MJ22j13j57n0
4435a98J78j25Q8j29j55K13J53p6R9l45O5K01J21p2m56K86K55l41K92r8J3p2J73
4458G0j79L26j28r3P5j47K96k81O8K24j82J68j55k65K74K9n8n4KJ89k44M20l33
4481B2k79p8L87j05M43j93j58%oQ5J04k52j4O9o3K06k61KK41n8k38K83j57P5J33
4506A88m22L51o4k58Q1o9K92k0k27J09j79J66J51j82p1o3l6K29p2NJ4j48J15L79
4530B69m38n8J24M33k31K0k30O1K12j38J83k97q1K76j2P1j32L9j64L56j31Q3l04
4553h9O9L02k86K8LK69l96ML13K8j28j12j64K14K47l66O1l45L68n5j8N6l86N40
4577A57m02J61P6Q0k0p9pK55k38k68K11J5L25o68L48r1K27k49K19r4k29K58K09
$$ y = [64, 30, -107, 116, 99, -71, -117, -37, -93, 100, -104, 113, -185, 8, -255, 19, 100, -337, -4, 0, 122, 9, -148, -198, -20, -145, -57, -186, -341, -128, 25, -51, 48, -297, -232, -31, 90, 18, -438, -152, 103, -238, 54, -44, -31, -103, 70, -109, 217, 89, -4, 71, -76, 220, -61, 7, 231, 49, 217, 62, -203, 71, 100, 42, -12, -10, 179, -65, 355, 22, -257, -335, 52, -53, 390, 197, 39, 39, 33, 118, 222, -30, -44, 25, -38, 168, -93, -91, 150, 92, -146, 137, -20, 55, 188, -234, 117, 53, -205, -124, -193, 99, 79, -148, -39, -218, -52, 99, -83, -154, -217, -253, -24, -96, -91, -77, -225, -110, 269, -169, -227, -103, 330, 99, 119, -111, -50, 162, 24, 207, -90, -171, 105, 93, 164, 32, 71, -93, 263, 132, 215, -89, -20, 282, -4, 24, 27, 296, -100, -96, 217, 245, 117, 5, -159, 55, 302, -64, -3, -348, 20, -35, -53, 3, -383, 157, -245, -84, -8, 72, 52, -27, -34, 221, -17, -285, -74, -59, 266, -402, -54, -145, 82, -167, 52, -42, -271, -13, 196]
4600A96l21J08j48K12K9k07L18l72Q3P2M75k04o3k66P0q0M57l54o0k4J83mLp5
4624B8l99M12J4J26k01j87J96J09J26q0l3m50L14j17J80j1l18M95l9r0j33l23
4646c81L46o1K31J75m70j23K81j78J49o6j2J36q4n1L49k39l29l3PM48j73J17l44
4669c05M45j70M11n61j28L0J34m6K12Q8k93J86lr5J24o7r4K12k30K33K3k38K62
4692A30J79k14p1n5J12J20j9J32k27m76M87Q4k46K08l40K55K14l01L34k63K8q5
4714a4j97M83l44l02O40j77J74k09J16m88K05K26J03r2l07k0J35L0j1J1m55M73
4736b0J2j6%l13K63J43k02m3M1L36l42J24K38k62j13J96m7J31j99l8K9Ok8K72
4760A68l30K91O1j61M6j17J29j81J77n5k26J92l14K69L18Q9o6m96M20Nk87K83
$$ y = [196, -125, -17, -165, 47, 76, -131, 187, -185, -102, -30, 445, 241, 178, -88, -18, -98, 359, 5, -55, -79, 104, 100, 103, 28, -371, 41, 55, 181, -20, -207, -11, 98, 224, 144, 111, -339, -25, -142, 38, 27, -291, 204, 165, 75, -58, -381, -35, -96, 135, 310, -160, -283, -2, -180, -31, -97, -109, 27, -57, -108, 241, 2, -327, -360, -353, 95, -78, 39, -305, 140, -30, 381, -180, -308, -278, -144, -190, 22, 110, -183, 3, 0, -95, 29, -38, -132, 80, -150, 83, 106, -132, 130, 309, 95, 24, -31, 81, 201, 182, 314, 87, -389, 98, 182, -64, 144, -196, 59, 273, -28, 306, 43, 71, -14, -211, 272, -72, -374, 266, 89, 263, 54, 170, -318, -113, 113, 216, 124, -183, -203, -68, -38, -49, -38, -493, -20, -8, -24, -24, -337, -74, 69, -133, -176, -135, 201, -141, -17, 221, -41, -154, 42, -5, 126, -73, -111, -82, -76, -104, 168, -162, 129, 190, 29, 75, -42, 87, -94, 83, 28, -198, -6, -320, -51, 267, 356, 290, -206, 214, 219, -68, 215]
4782B15k77o5N4Q0L63m92O1p5Q0P0N3j75J57J56l09L1k22L67j52J1L45l40n8q5
4806b07J85J99j59n6j62Q9J35k3k01J47n1k5J56j58q1N1J72J06o5jk63j74M13
4829B7O8K0r6k14o7N20k95k7o0N1L46k00J86k83l8J8J02K56j61l07kN58k41M9
4853B10l06q9L28K8r1j79O7J78j51L44k57j45j8K46j19O6j83qK46ok31K7k46j
4877b90K98O9J8j37m08M77P7J20K6p14N05j37K06j77J98l15P9J87o8l6l54K37
4899a39J24J28m7Q5j62P8j8j23J9J85j63P3J47lj35k42K88o3oQ9k33J25j07K54
4923A54n2j98Q0j17K74P8m75p1J5M76j09J34j64O5k23L34j16n5k28K33M6M2n8
4946F5k68J26p3J68j14l11K33k22K56L08k43K7l00K70L63k87K06m42J03N1M25
$$ y = [215, -62, -127, -73, 7, 370, -122, -61, -136, -56, 14, 67, -108, 49, 205, -104, -73, -295, 72, -80, -69, 276, -64, -122, -207, -22, 177, 18, -38, -200, -111, 24, 1, -200, -53, -104, -129, 27, -131, -212, -161, 11, 117, 52, 51, -212, -386, 27, 95, 115, 19, -195, -262, 258, -37, -64, -124, -73, 273, 73, 259, -24, -62, -44, 58, 314, 153, -154, -156, 402, 161, 210, -96, -185, 143, 171, 80, -99, -32, 146, -5, 339, 82, -63, -81, 165, 46, 112, -71, -79, 167, 161, -70, -43, -289, -290, 8, 77, 95, -42, -450, 27, 104, 224, 250, -464, 41, -96, 110, -67, 131, -184, -105, 82, 14, -22, -376, -139, -15, 113, 66, 151, -11, 67, 49, -74, -55, 130, -33, 40, 187, 184, 49, -193, 95, 32, 26, 115, -118, 7, -100, 154, 102, -96, -16, -133, 141, 219, -256, -327, -312, 164, 55, 189, 25, 90, -133, 201, 85, 30, -198, 35, 81, 123, 65, -203, -77, -150, 18, -96, -407, -174, -396, -140, 168, -75, -48, -348, -78, 285, -2, 204, -238, -135, -84, 341]
4967C41m58j0K20r1L30m55J62q8K16j40j17L26o6m70L93R7m29J39j04L40K12l15
4989C3j57j70L35J76n6k56n0J1K1K84J88l28j68J34M4L1K94p61N51j83K7J5Pj16
5013i4n7J17L3J71m51K68K90m66J88J31k04P5L9k26K67l63J72j31K59J46n19L13
5035d2M6k2J40k27j49L90j66J23m5J33k05M1J66k07o1j9J66j62J24P5j14o2R7
5058B0J96j76L2K41k25N5J54j49J41l56J22K20K41l16M5J29l79L24j40l10K64
5079A33j52J33K5l94J31K58j4Q7k83j27K9M69k49L7m08J05J49J06J01l26J98j46
5101a38O3K13m6k18r9j5L81n3k38k14K05k3J60K25k90j08R1K06k61J84k34Q4J28
5124CL6q7pj35L71k19j54K15q2l05N38J23l40l7M5K76j52q2J78q6N0K55m45M13
$$ y = [341, -117, -127, 93, 2, 332, -123, 39, -49, 167, 27, -90, 236, 170, -300, 93, 190, -239, -100, -204, 136, 348, 33, -124, -294, 41, 217, 161, -95, -145, -134, -113, 171, 359, 31, -137, -3, 41, 72, 366, -395, 156, -27, 0, 15, 22, -94, -151, -34, -1, 170, -281, -13, 277, -189, -1, 130, -74, 1, 40, -186, 81, -282, -110, -241, 18, 164, -355, -42, 4, -18, 122, -105, -254, 136, -30, 93, 48, 181, -24, 17, 183, -24, -85, -104, 62, -100, 24, 99, -15, -77, 20, 216, 40, 72, 313, 88, 143, 297, 148, 289, -67, 55, 275, 516, 200, 245, 374, -5, 319, 179, -131, 133, -19, 114, 139, -255, -124, 134, 120, 207, -76, -203, -174, 295, 46, 83, -325, -220, -71, 35, 136, -190, 8, -138, -75, 138, 92, -126, -225, -240, 141, 88, -150, -364, -159, -182, -22, 203, -87, -195, -104, 102, -159, 25, -209, -125, 3, 39, -48, -55, -190, 181, -38, -192, 23, -59, -364, 174, 297, -43, -80, -35, 241, 89, 7, 185, 99, 149, 404, -41, 372]
5148C72l42J42q3m2L21m76J34L75k3j83k56L57m02K42j40J15lP2j3lj15j56k02
5171c09M01K16p2k10j64j19L07oq5j26Q9N1K52Kk01j09l31J96K91%k25k1p0L98
5195A55j75%J38n18L97J91q0m71J52K62L33l74j55J23j13L96l22J9K27l20NJ89
5217E9J40j43m8J70k17N6l4r9j47L55M9MK1j69r4j2L60J46n46M0K66Kj09j38m1
5242a29r0L67j2J36m08J22k78L51J52l89J51q6m2K01j81K59l79o6J63l3j14P7
5264b28K09j62K71r8k35p9K50J60nk83p3K59P9j30J50k09P0qJ16qQ2k47k37M95
5288A39j71R8K13l41J72j89J31J28r2l4N3p3O8N3j99J89q4j86Q4O9k75M89q1M2
5312B03k44Q1j18J76m0k42K50o6J06L9l65J66j16J86n9K85m44o4N2K48M5j69K94
$$ y = [372, 30, 172, 89, 47, 368, -108, 26, 401, 378, 195, -61, 296, -106, 136, -4, 111, 108, 180, 167, 164, 49, -107, -309, 92, 308, 236, 26, -138, -257, 50, 44, -41, -167, -78, -27, 225, 227, 26, -83, -414, -218, 73, 73, -152, -173, -243, 155, -20, -20, 118, -400, -3, 188, 108, -363, -211, 51, 384, 10, -145, -22, -135, 261, -61, -42, 185, -135, -130, 59, 199, 56, 8, 178, -39, 17, -17, -116, -263, 92, 141, 145, 166, -3, -97, -109, 251, 397, -149, -109, 157, 159, 50, -88, -129, -219, 148, 136, 272, -136, -14, -292, 59, 211, -178, -27, -113, -155, 46, -135, 124, -255, -321, -158, -191, -305, -228, -19, -181, 90, -8, -243, -322, -72, 88, 83, -200, -273, -14, 65, -65, 85, -124, -54, -62, 54, 46, 128, -119, -356, 139, -32, 66, 279, -62, 110, -79, 52, 180, 88, 54, 107, 34, 102, 155, -44, 145, 61, -125, -41, 28, -247, 242, 161, 203, -41, 40, -78, 98, 58, -184, 66, 0, 106, 145, -220, -54, -170, 16, -43, 242, -202, -266, -214, 34, 79, -90, 204]
5335B04m15J21j33m1K33L3l38K33L41l21LK8N6L8J06o4j61K21J59l80J2r5K24
5358F4K09l20K06l47K63qR1k81K38m0qj82J75Oj75L50j86P0m4j56O6l8K87k0j42
5383G8j27K81j69r0Q6M8l21K00K58k8m00J54%J34r7o7J5J04P9k36K41N9l89%J05
5408h2J91q5k36k8r2M04K1j85J17j38K77l3m61K69j60K45P2j14K09k26J6L18l68
5431f9O3l14M16j68K65j2j88K06l22M58j03j95JJ44R1M3j51j77j09M16J38l19
5453A14O0l39J35m1L83j72l30J54L18k56J86j01k22q7M12l00K58l05K2J46J05
5474A40j09l04J72l08M56J13L4l02k75L38L2J46k10j15R9J80J26k55Qo9J34j22
5496i1O0j27l8P11n03O0m1Ko5K68j40j95K58k43J85J9ql3oK72l51K18p8j78J05
$$ y = [204, -211, -90, -223, -264, -31, 2, -336, -103, 238, -83, -80, -52, 4, 42, 148, 84, -77, 144, 303, -77, -65, -160, 64, 273, -47, 159, -188, 75, 67, 158, -123, 115, 75, 67, -115, 60, 66, -109, 241, 55, 125, 81, -75, -9, -47, 240, 220, 78, -49, 232, 63, -27, 59, 107, -214, -14, 244, 216, -184, -30, -30, 104, 7, -60, -45, 59, 138, -98, 143, 202, -187, -187, -82, 109, 24, -212, -240, -332, 72, 93, -92, 25, -113, 164, 131, -330, -61, -221, 24, 96, -18, 191, -35, -19, 299, -69, -6, -320, 96, -72, 193, 181, -7, 199, -123, 335, 232, 37, 38, 182, 273, 316, 165, -12, -121, 295, 433, 114, 174, -165, -30, -71, 312, 140, -190, -36, 282, 26, 212, 111, -111, -198, 214, -86, 172, -133, -111, 35, 140, 31, -273, -101, -409, 47, 160, 194, -108, -383, -45, -13, 133, -77, -192, -93, 87, 213, -42, -34, -103, 31, -91, -31, -158, -196, 515, 12, 72, 31, 33, -32, 236, 96, -99, 159, -84, 101, 120, 112, 79, 73, 345, -6, 212, 134, -44, 61]
5521F1qnK72l04K19n5J20j9k20l37K96L01k22P4P0n32K38J79k9R3l61K93j23k8
5545b7K42l36r8J40L8L2j25J69l39J88K72O0n69O3N4L67J29m06O6k79L70k66J42
5568a13k04M02Q2P3k26Jn1J51j79J39J3P7m1l42K95R8jl19J2J89j6N6k50j48N66
5593B64K00n9k56l08L1L70j61M6k73l1L72j67J00R8k90J12k9J33k62j8L64j70
5615F6J12j64J10k14J5J67O9k61j19L1K9J67J70k21k62N85j48o4k39P1R1M3K66
5638C00l74r5J76O0Q1J03l29o3k12M19p0J43j44k40K13O9K1j02p1J48N8J17k03
5661Ej98o5J27M54M3k32k04J6K81n5j0j30J59K18m01o7j01L67j68O6K85n63j92
5684c65L61K40j25k14L35j45l7L43l18p6j81p7M22J8k28j07Q2j04Q1K21j83j92
$$ y = [61, 53, 48, 320, 16, 235, 180, 300, 281, 61, -276, 20, 321, 99, 173, 243, -289, -51, 128, 99, 192, -169, 124, 1, -27, 215, -121, -219, -79, -41, -9, -134, 35, -304, -116, 156, 216, -353, -290, -236, 131, 260, -146, -80, -359, 11, -255, -113, -317, 85, 167, 240, 14, 15, -36, 115, -64, 75, 88, 165, 124, -218, 77, 175, 174, -145, -133, 56, 40, 96, -154, -302, 264, 464, 405, 149, -159, -128, 242, 81, 127, -146, -177, 195, 28, 128, 226, -64, 48, 19, 152, -110, -128, 236, 66, 178, 14, 124, -90, -75, 92, 161, -100, -219, -188, -159, 8, 178, -43, -305, 280, 132, 68, -171, -100, -9, 34, 300, -74, -169, 7, 67, 148, 251, -78, -141, -353, 66, -4, 139, -5, -245, -32, 37, 58, -44, -115, 33, 91, 208, 5, -193, -258, -131, 323, 366, 134, -70, -54, 227, 172, 162, 32, 191, 409, 8, -59, -160, 207, 39, 105, 390, -173, -365, -4, 236, 111, -103, 232, 87, 50, 393, 75, -1, -182, -259, 163, 181, -47, -154, -72, -176, -95, 126, -57, -249]
5706b49J20J22J07q7j70j50R8J26j5J4o2k2K21o4J35k77J14l6K16j2k50j95J71
5729a45J48l5j71K17O0j93M19k74j48RM9K10k12J31K9n6k02M63r5j11l13L3K21
5752C4R5j75N8j26N9K0j27J73j1j7K45k38j26nK00J3o9J56j25l2J29K9q2p4p7
5777g3k00M41q4j46n6J31l45M08o8lj21j6L56j44J41k63j06R9j42J24j06j9l4
5800b26M55n9k67J96k29J7K06O2k1r3r1R8O7l70J86M2QM4J20m2l46K63L05l28
5824cpj62n4K82L5J04m71O05j89k10P5k30j8K84J23M9j40k52J50J10o4k06L06
5847A17m9J6j14L0L1p8o3p8L11j72J21k12J97n3L46m06l0j44J34J66J20qm59J00
5871a77R4M7l15K10K57k74N20l11j97R8N7Q9K36l66l9n9N3R3J86l75J96k6Q4K50
$$ y = [-249, -129, -7, 100, 13, -157, -307, -209, -83, -98, -84, -146, -168, 53, -11, 124, -153, -39, -75, 141, 129, -121, -316, -145, 3, -32, -203, 14, 74, -119, 300, 26, -122, -113, -64, 146, -66, 65, 94, 38, -164, 299, 204, 93, -220, -187, 34, 129, -46, 12, -114, -55, -35, -162, 11, 0, -17, 228, -10, -136, -141, 59, 72, 3, 159, 34, 2, 131, 160, 78, 4, -73, -273, 168, 84, -62, -118, 13, -332, 76, 8, 5, -116, -132, 224, 80, 221, -42, -148, -49, -191, -67, -173, -192, -226, 229, 170, -97, 99, -130, -113, 93, 155, 134, 41, -50, 48, 115, -255, -69, -27, -19, 25, 145, 103, -243, 20, 325, -3, -10, -172, -226, 56, 91, 195, -276, 329, 140, -70, 5, -225, -243, 41, 164, 213, 73, -179, -29, 81, 17, -189, 117, 68, 84, -30, 0, 31, -47, -110, -188, 123, -49, 72, -140, 57, 4, 350, -56, -86, -230, -96, 70, 190, 182, -277, -177, -83, -36, -351, -141, 116, -158, 362, 51, -146, -48, 9, 98, 334, -32, -71, -130, -77, 16, 202, -173, 23, -3, 81, 331]
5895C31k95j23N7K5L61n4l76l52K91K60j59J5j26L3L55k08m6o3J0K77N4Ll00k70
5919c00M18k1q9j26J35j51q1M08j31k64K67l0L7j98O9K03j5j37j63J05l7j00L3
5942a68L52P2k46K6j0j72J18l01M09p1L8p5J12j26J28k88K43j10N6J90l40j01
5964b64L15J36k02j03M6J12j57K33Mk9M8k00L78k82J20k58J08j4P8j05n6K07l8
5987G7J04k4k60M8M20k36Q3j91j3n6J45j8j43k44J49O00m95n9J95n2l06M80k92
6010h8j26k30K69K73J22k18o4j83L04k0k3j93p7L00l92K55K44l6l3J76k50L9J17
6033A66k75RM10j77j11q0n4R6N8K27l9q8r5P3L88o53n1J65PM45m59J5k77M65p7
6058H8N7l7p8K7J68L7j55j51k83M43kP2k09r9j83L54j41k6m7K24p9K61l52k41
$$ y = [331, 36, -87, -30, -5, 356, 302, -74, -426, -135, 125, -34, -19, -145, -112, 243, 35, -11, -74, -64, 213, 267, 270, -30, -300, 118, 97, 8, -118, 17, -134, -215, 193, 62, -202, 65, 35, 72, -126, -57, 146, 131, -6, -169, -64, -101, -201, -168, 184, 256, 10, 36, 26, -146, -28, -329, 80, 9, 47, -28, 84, -42, 86, -202, 41, -69, -13, 177, -163, -264, 51, 187, -15, -118, -72, 40, -117, 116, 120, 91, 139, -61, 317, 35, 155, -103, 5, -9, 69, -36, -92, 115, 77, 181, 157, -103, -55, 365, 129, 212, 21, 8, -48, 97, 79, -64, -308, -159, 441, -54, -113, 82, 30, -276, 204, -88, -214, -444, -175, 98, 220, 2, -62, -245, 59, 39, 16, -177, -254, 46, -346, -91, 153, 117, 84, 260, 10, 49, 166, -109, -100, 310, 133, 22, -58, -112, -16, 42, 269, 230, 142, 47, 120, 508, -145, -196, -31, -24, 421, -38, -23, -300, 165, 88, 145, 108, 30, 57, 225, 262, 107, -44, -327, 116, 114, 186, -23, -122, -305, 49, -92, -118, -165, 59, -20, 241, -111, -352]
6082c52J6J60J16J92l56K60J03k84K73j68J23j61j77K17K42m08K99j07R9l7J14
6103A64j87k92K39J7K02M7l44J73r3J90J17l50J56l7J6J58k02k7J62j80M89n10
6125i2M41l79J18K25l37K54k9Rk44L87k37j71q3J09j27L26j86j69P8j3J46o7J44
6148A03j75j3J77j32r2K17j86K90k76m7N6n9K14q5k14J8k51L24N5K54k76j58K59
6171Cj92R7q2N8J71k42L34k66k8L00k58m8J33O8pl46L37k05L10k52j56M82n3k48
6195i0K13j57J46k17K68k92J11k56K06J07M8M4j99jj33M00j4j29N6r6K8J53j80
6218A6o5%L15l62L95m19K1J34J31n7l50K68K9p2k06K32j18J48j93L54N3l13K32
6241A73l11j06J90n3J33PJ7J21l48jk2j2L63P6k84M2j31K77J27j28j75n7J70O
$$ y = [-352, -336, -176, -60, 132, -224, 36, 139, -145, 128, -40, 83, -78, -255, -38, 204, -204, 95, -12, 87, 50, 164, -23, -315, -76, -59, 143, 190, -154, 19, -74, 116, 233, -117, 39, 2, 18, 176, -26, -53, 109, -71, 418, -92, 349, -30, 88, 313, -24, 230, 201, 210, -34, 353, 116, -55, -138, -29, -156, 170, -16, -185, -107, -120, 26, -41, 103, -72, -85, 92, -40, -132, 85, -101, 189, -87, -134, -78, -137, 77, -8, -222, -204, -455, -131, -76, 178, -98, -256, 3, -189, -92, -174, -116, 55, -187, 147, -119, -147, 153, -105, -153, -20, 48, 41, -305, 32, -173, 137, -115, -271, 211, 158, -90, 123, -34, 112, -105, 163, -129, -18, -274, -68, 39, 87, 131, -68, -69, -202, 198, 184, 55, 111, 15, 43, 196, 16, -49, -49, 266, -96, 299, -120, -99, 35, 166, 109, -241, 27, 56, -16, -222, 10, -108, 40, -153, 201, 254, -59, 173, -138, -244, -54, -107, 26, 33, 50, 171, -177, -178, -200, -212, 151, 227, -57, -15, -146, 131, 258, 130, -45, -102, 68, 74]
6265G4Q1k09l04K6K69J89J80m79N8K77j92J69K4l9M0j47J79J1q1J74k03J29o3
6288A63j01M5j08j14M19p1p8pj25l1J6j62O8J1Nj16K2K6J6J00QL01j42q0l16L69
6314A18o9j0j3o1O5o9j97J21n7J98J66p3J27l08J83l5Nk36J50j03K7J10J21l09
6338a49P7K59l8j83K05M2O0n73M96j33k00J62J96k39J16J79n41K4R4J41J30j45
6360b0j1j29K78J37L9j52j44J36j46r3L19l58j1K75m22K54Q0p1Q2k60L42m83L22
6383c6k7k79N48j81j76J57qJ4j12j4R1j8R0J01j80J21%l57N94j72j29j17m7J11
6407b6J90N9o18N74N5m2K22n56L59m4q2k4l01J62j58L15K86k47P8q5J45l02R8
6430E8J21m63K32J20J20L4Q5m05N7N8J10j90l5J4L6J20j34o0N7j91R8K47p8M0
$$ y = [74, 155, -54, -358, -332, -63, 126, 306, -173, -115, 162, -30, 139, 163, 124, 164, 17, 196, 207, 126, 300, 97, 226, 163, 62, 107, -1, -115, 304, 233, 155, 148, 23, -8, 8, -154, -86, -75, -70, -186, -164, -138, -122, -22, -14, 287, 145, 65, -251, 118, 49, 39, 26, -35, 30, -39, -236, -115, -172, 26, 192, 119, 246, -62, 121, 86, 91, -145, 5, -98, -71, 39, 160, -149, -72, 187, 149, -34, 171, 213, 273, -300, 196, 63, -137, 25, 221, -18, 98, 277, -264, -240, -146, -5, 125, -20, -31, -160, 118, 255, 294, 142, -2, 134, -12, -105, 214, -144, -155, 120, -302, -48, 32, -39, 43, -217, 125, -358, -36, -63, -342, 206, 25, -151, 6, -2, 12, -100, -114, -23, -41, 49, 150, -30, 91, 91, -266, 328, 156, 27, -90, -137, -26, 164, 223, -395, 179, 234, 192, 414, -142, 217, 173, 91, 67, -234, -72, -230, 85, 371, 124, 202, 117, 262, -40, 58, 179, -284, -52, 68, 188, 222, 307, -98, -41, 17, 127, -63, -98, -84, -48, 72, -62, -122, -65, -256, -158, 89, 11, 51]
6454E1j85k27M68n9K9R7k14M3j0k3k88K88N1N9j55p4J37L5J78j65q6j83K39q6
6478h0%P1J25k56lL66j68N7k27J84M54k09j38n97M06J97j49J19j56O1o0L0L00
6501C27ql88J12r6m0P6j46qk1J61J38k12k9J8J34j57K90k29J73q7O1j55j7j39
6525b42L21J26No4m14K75N2j06Q4N8k14l9l8P0Q1p9n3k38K69J96p9j77J66j5K12
6550A57o0l60L15q4R9q7O5r3k43O16r7L15m90l6j5K10j58m6R9p4j40J15K40q1
6574A67p1K75l27J83p8p0k31J95mn9mJ2Q0N1o6l90K75o5RJ20Qm2k19M91nj79J8
6601G4m53L96K62o8k34j9J57j43n5lk47K81n2L21k76j1J60k99Pk0K24j31N5K98
6625B24m05J98l16J51J75J6j51K87j41m2k56L70l3J5j35j23M24l10Q8Q3l3N9l70
$$ y = [51, -134, -361, 107, 48, 77, 174, -40, 3, -7, -30, -318, -30, 21, 80, -75, -149, -12, 23, 201, 36, -50, -233, 6, -80, -80, -9, 116, -140, -143, 223, 55, 112, -115, 69, 523, 314, 176, -421, -15, 182, 33, 152, -4, 57, -3, 27, 327, 319, -69, 43, -53, -93, -17, -163, -171, -192, -31, 107, -105, -134, -116, 18, -139, 151, -78, 95, 8, 69, -86, -103, -242, 79, 205, 210, 146, -268, 7, 59, -47, 37, 95, -119, -158, -196, -126, -45, -124, -177, -415, -146, 50, -29, -206, -40, -55, 157, 97, -263, 52, -32, 67, -20, 45, -48, -291, 325, 228, 543, 53, 17, 2, 212, 54, 8, 107, 33, -107, 8, 248, 167, 96, 371, 44, 227, 149, 79, -152, 43, 39, -20, -24, -12, 68, 119, 53, -337, -62, -127, -118, 2, 10, -32, -251, 240, 235, 56, 74, -379, 17, 279, 211, -23, -42, 115, -28, -83, -86, -333, -52, -104, 217, -59, -70, 90, -209, -202, -222, 2, -129, -74, 224, -181, 17, -299, -148, 27, 43, -108, 179, 38, -4, -260, 110, 77, 92, -43, -166, 258, -52, 36, 119, 86, 145, -225]
6648b25J89J95j53J77j46l5mk9K59j26l06K96j23J62K29l10Rr4j03K55j49M70
6670D38n35j19j67L44q7J84J25l97L04k67O6J72m5k18J63l05K52K0m3L2L50J20
6692C87m89k17L65n9q1J57K0m99K47L15Rl62M76m50N48j84q4K5m55J99L00j46
6714B2q0L27m15J10N6O8j78o2o0M44j32K7k7j91M7R6l9j2J00j35j6q8J9R1L4j25
6740a19K13j62L90l46J52K05l28R3j57J22R3k69N0j06J01O5N3j0p3n5R6L42k09
6763A41K9j25m8K58l59J87m8j16K83K05n54K53k36o5K41K07j86j66p6J54P9L67
6785D25r7m28P5J2R9J3q5o1J50j25J53k54j13K65n0m7j31J50o2k01M85k06l9N6
6809a6j2K31K7k36k99N0L53k45K27j43J43l37K36J7M2j15O3j44K95j08k59K4Q5
$$ y = [-225, -36, 159, 6, 183, 37, 2, -2, -31, 228, 102, -204, 92, -31, 131, 360, 50, 59, -35, -138, 117, -32, 438, -97, -216, -383, -39, -126, 58, 183, -214, 90, -177, -111, 61, 16, -202, -39, -344, -92, -72, -115, -83, 267, 387, -102, -319, 46, -13, -94, 63, 83, -416, -169, 146, 155, -207, 269, -181, 367, 183, 99, 124, -331, -132, 168, 22, -58, 269, -146, -36, 20, 88, -90, -152, -212, 232, 100, 127, 100, -91, -44, 52, 13, 1, 101, -34, -50, -138, -119, -28, 6, -119, 94, -68, 322, -24, 128, 333, 5, 98, -59, 63, 156, -113, -63, -169, -68, -3, 50, 40, -33, -88, 8, 350, 141, 170, 45, -3, 255, -104, 83, 35, -81, 202, 407, -147, 106, -130, -195, 46, 253, 67, -99, -175, -21, 58, 425, 328, -100, -25, -13, 86, 99, 14, -47, 103, -22, 131, -123, -236, 29, -21, -68, -199, -49, -111, -312, 173, -33, -72, -16, -28, 203, 230, -6, -305, -255, 98, -147, 80, -63, 80, -257, -21, -4, 38, -77, -14, -158, 137, 29, -230, -206, -121]
6832a21M48k68J67k68J22Lq4P7q8l4J20j88J24n0j74j40M74P0l20O0j43K10n8
6855f1R7k34J49n5L1L23p9N8l51j84O55m07l7K01k58L8K40J1j55J59m71L78P2
6878A20l0r8j31J41l9n4J39k87L55j72j7j24J14K22j09j02J67k18j2M8J76k52
6900a63K46k84J31K02j34K75k85k73L28lk19J40j53kK23j7j87R9J04M3r1L38r1
6923B27l68KK12K3j19K4K54n1r5M8p2N1J97k90K34l92m6J39j7K01J9j33K3j44
6947g3N4K46j29m00K65N2MN7r6J6j82M83l37l12M12m55K14J37o1J7q5J63N4J91
6971B35n15J72J06K12n08M09k99P1p8P4K06n19K07K26N7J65l18K06r1j46K20m14
6993c22K15R8j32K85k20j21j12L35N3m3Q0j70j57K14K1lk0k39m1N79j10l2j73
$$ y = [-121, 327, 59, 226, -42, 80, 83, -1, 76, -12, -46, 74, -114, 10, -40, -214, -354, 120, 190, -130, -70, -213, -3, -61, 36, -198, -49, -104, -73, 250, 171, 229, -122, -306, 349, -58, -95, 106, -152, -114, 126, 137, -18, 141, -330, 48, 120, 90, -8, -139, 2, -37, -91, 48, -239, 116, -56, -73, -197, -83, 139, 30, -72, 95, -123, -135, -87, 89, -163, 83, -201, -70, 132, -2, 273, -12, -285, 43, 40, -179, -39, -192, -194, 29, 12, -175, -76, 28, 71, -20, 318, 227, -141, -139, 73, 96, -23, 1, 255, 204, 109, 157, 85, 136, 333, 43, 277, -115, -161, -22, -39, 162, 181, 48, 71, -73, -19, 227, 98, -302, -37, 15, 19, 76, -20, -4, -186, 297, -40, -352, 60, -395, -181, -44, -105, -88, -173, -10, 44, 235, -280, -108, -2, 210, -298, 111, -188, -117, -195, -121, 85, -434, -227, -1, 56, 221, -97, 109, 18, -128, 92, -322, -107, -9, -141, 144, -76, -197, -309, 26, 79, 36, 116, -54, -211, 3, 24, 21, 1, -238, -279, 300, 190, 158, -15]
7016a5k11K09J64o2m8j63mK53o8k12K44Q0j20O8Q3p9o7k21J33p2J79rj64j2L86
7041B72k55N1j15kJ8J64r9O7m37J15K66m09L04L4J06J43k30j84N58l89J63n1J15
7064B05j54J6K07k24O8k17Nj21J87j52J72j82O0P4M4m4q3J92q9k4R8Q6j66k0j1
7089g3J10J9j4m4O7K81m55L41k94J4nL05p1l05P0p8k5J65K0n2l2Q6j11m0j74K99
7115Dl9K18l80L04p0o2J66j45J91l65K45k10J84Q7P2ll00q6M01j57k18J24m7O9
7139a7J08np9J00k80L23j65R1k54N5L69j70L6j26P9j85K97l59K41m3k30K5J30
7162e9K2k34K27J62j29j01Nj62K94N2K5m6l66J59J52J30j42K0k9j29J66M6j26
7185f3o6J80J34k54J36k33K25k8J36j22j89J75L1J76k20R0j5k23L28j30N4K9j25
$$ y = [-15, -226, -17, 147, 85, 37, -126, -130, 123, 55, -157, 87, 167, 47, 115, 198, 119, 52, -169, -36, -108, 71, 62, -102, -114, 272, 17, 68, -47, -49, -31, 133, 34, 101, -336, -221, 45, -364, -60, -26, 80, 223, -7, -191, 367, -22, 141, 90, 205, 51, 67, 274, 50, 118, -99, -94, -215, -28, -180, -8, -190, -130, -56, -12, -56, -139, 53, -36, -60, 38, 124, -42, -62, -73, 37, 56, 42, -2, 65, 346, -109, 232, -62, -48, -53, 252, 181, -124, -54, -132, -157, 8, 28, -24, -56, 30, -81, -121, -295, 4, -35, 183, -197, 107, 37, -25, 141, -4, 187, -178, 67, -143, 41, 128, 200, 197, -103, -189, 212, 55, -163, -39, -86, -17, 91, 86, 7, 107, -173, 150, -15, 76, -178, -123, 246, 76, 112, -14, 65, -120, 177, -182, 59, 16, -214, -189, -59, -37, -271, -44, 118, -11, -112, -107, -269, 25, 77, 102, 56, -310, -151, 1, 131, -11, 9, -20, -149, 17, 63, -63, -129, 51, 185, -69, 67, -166, 59, 31, 167, 45, -144, 31, 62, 238, 18, 108, 93, -130, 198, 68, 122, 151, 26]
7208B6j66J39n5n1R0K34j76q9L96n01J37r2J68J73l42K08l7J18k52Q4j86J42L64
7231C32m26K35k60P5K82r1k43Q6j95K49j25L4K58m15K11P3j60K81k13K96j96l59
7253b71N21l14l78M31J97k40O8k0k56K84K7jJ13j05m24K13J02K22l23R6j13K29
7275E8J78j30j16j57K7J07j10J21L5J96q7q0o6r6nJ06L7k67L92r9r9j2K00p5j52
7300i4J20q4J51J4j66K42j68J11m6J47k39K8j92L4R2J67p6j62L06q2l51J46rJ05
7324fO8lm8k85R3L28mk23J8j05K76j35J01j13j15J91K33k83o2J02m31M78r1n2
7348f8J42q2P4L1k38J66j83K02m2j33O9j85k1L71Qj41K61n06L60M5j30J52r2j73
7372a13O3K26qj95O0p5N0L1j3q3K5K75k37L2J00Q8j42Q9l04K32q6j94N42m3n01
$$ y = [26, -140, -1, -56, -107, -17, 217, 41, -48, 348, -153, -16, -108, 60, 233, -109, 99, 62, 180, -72, 12, -174, -32, 332, -94, 141, -119, -44, 238, 147, -96, -10, -205, 44, -81, -47, 211, -204, 7, 80, -80, 201, -12, 284, 88, -271, 250, -64, -442, -11, 186, -54, 14, -6, -262, 22, 49, 48, 161, 56, -368, -155, -53, 169, -154, -58, -171, 58, 236, 106, -10, -167, -140, -33, -143, -22, 13, 209, 122, 42, -24, -120, -125, -19, 18, -249, 143, 44, -55, -67, 133, 58, -94, 26, -58, 93, 107, -59, 183, 15, 126, 80, 227, -12, 16, -176, -142, -50, 117, 41, -121, 185, 103, -248, -102, -111, -6, 62, 59, 11, -274, -181, 147, 143, -80, -62, -167, 109, -26, 75, -38, -153, 38, 271, -12, -74, 28, -403, 75, -16, -68, 74, -8, 66, 97, -141, 25, -158, 44, 2, -131, -62, -247, -268, 103, 111, -30, 231, -275, 85, 130, 0, 152, 60, -113, -50, 176, 168, -27, 33, -42, 8, 39, 26, -57, -32, 243, 6, 38, 138, 226, 84, 173, -131, 101, 15, -179, 363, 320, -181]
7397a81K71j11p6O7K16j56rj2j75J25J31m1m42L21K91j28k38R7j33J48J4Q9m71
7420d03L39Lk4M3k32J13n2J04K96m34K25k40J19K90l65J26j38J91Q2k6Q8j80P6
7443AL3P5R3j06R9m60K18j39Q0L30k6m3J56j32k82J59r7L50k01k42K43K20j96
7466A33p1J00J08m21K02PJ51l63M23l44j28M08l87Q4P8kR2j63L23l87K89L2k60
7489i6Q8J07j37J38K9o9k41J8N7k7J58r0JJ0K8L0J15Mj41K02L9k4j75k06K07l6
7515a1p4N8l7j21K49j59J01J45p6N3M3j11J91m36K21l8J46Q2k26q2l4J56q9J18
7539F9j29J8N9R8R1j97j03L93m1k81oK21r3qL3N5k53NJ97j58M2QR4q3K22j89j03
7566c9K46m06K90j22L9j89kK96k66J25J12q4j21j1J88l56K95j77K88r1J03J03
$$ y = [-181, 90, -21, -97, -30, 186, 30, 21, 9, -166, -41, 90, 49, -393, -72, 219, 91, -147, -50, -183, -35, -21, 68, -403, -64, -61, -85, -42, -274, -161, -213, -109, 187, -247, -22, -262, -143, 147, -218, -92, -230, -39, 43, 17, 105, -75, 1, 34, 109, 202, 96, 195, -265, -47, -186, -106, 224, 198, 155, 311, 179, -103, 56, -41, 309, 108, -134, 109, 329, 133, 62, 162, 270, -151, 51, 58, 209, -154, 269, -75, -203, 205, -182, -98, -20, -22, 70, -93, 230, -157, 132, 164, -96, -8, 99, -38, 100, 129, 60, -181, -163, -106, -133, 25, -65, -64, -54, -26, 4, 119, 123, -18, 184, 223, 199, 24, -182, 25, -11, -85, -27, -64, -185, 64, -95, 6, 151, 75, 128, 171, 60, 251, -185, 36, -2, 144, 226, 0, -82, -116, 40, -49, 69, -60, -42, 17, 115, 206, 9, -94, 299, 258, -23, -29, 192, 99, 91, 124, 179, -74, -69, 128, -30, 12, 20, 114, 31, 253, 64, -39, 207, -199, 91, -31, 8, -181, -183, 113, -153, -28, 84, 0, -121, -132, 56, -300, -5, -182, 106, 15, 118, 221]
7588B21k62J73m13P5K60k52R1J74r5L9o2R9k6o2LJ8n6j18J10j27K98k00j97J81
7612a28R1p2J61R4p2k8J83j44j41L00p9j15J31k51K5qN0J16j55k2R6N0pj29K05
7637A51j03j24j76L67R4m46J26j79K44M8k26K15L7k8L36l04r8k01J70L46l70J96
7659G5j3j27q1J61k1q3r1R5K97l5l07mN8J20n9LQ5l21K89j2L66j03m96K02j54
7684a56J91m4J15k52Q3j80K67Jl81K08R0J60k68M0p1L61kj01N0k39K08O4k4j12
7708HJ0k33L99j06q4n0J52k98P5R8j3R2K6j71J5o5K95l37L67n00L28L51n72J77
7732c6Jj35K70j40k11L55J62j90j31N2L6P3qJ08k46K4K21K76m82j53J54j6mN7
7756C7j27o7N0J83j07O7p1j46l7L1K47J08r0j07P6k35K33K94j42K17o03O09n27
$$ y = [221, -41, 132, -281, -206, 54, -198, -107, 67, -28, 11, -51, 48, 22, -40, -37, -19, -75, -193, -83, -210, 88, -112, -309, -128, -37, -109, 52, 146, 74, 46, 229, 85, -56, 244, 165, 50, 181, -70, -45, -53, -3, 113, -42, -64, 32, 82, 75, -54, 151, 48, -76, -252, 115, 209, -237, -111, -290, -46, 2, -224, -9, 28, 0, 336, 32, -66, -267, -97, 249, -121, 75, 62, -65, -146, 15, -6, -89, -180, -85, 212, 177, -130, -134, -76, 44, -15, -12, 73, -248, 41, 29, 395, 292, -204, -2, -156, 35, -9, 106, -146, -63, -243, 24, 25, -356, -148, -58, 102, -166, -126, -197, 164, 162, 61, 111, -128, 80, 144, 120, 8, 18, -215, 184, 78, -6, -56, 96, -202, -127, -29, -42, 50, 76, -95, -80, -145, 150, -187, 180, -320, 8, 359, -213, -36, -35, -170, 100, -40, -251, 104, 266, 76, -55, -3, 33, 106, 98, 206, -40, -16, 205, 481, -1, -154, 0, -16, -20, 37, -90, -157, -107, 76, -31, 36, -35, -181, -218, -187, 60, 168, 78, -29, 47, -188, 45, 339, 197, 414, -189, 420, -107]
7779a07K17l7m8J04j63k4P3j91J07R3KJ5j06Q1K4r0R7o1K6j13J57l04L7J45L3
7804c3L32l33j20J71J05K1n0j68K79j80p9J45q4O6j36k01J23J20J97q0M5j33m48
7827d41L48O4J02k67J29J10P6j83Mq9n4K94j03j08M3k30N36k54k3m8J87J51r9
7850A45k18J16Nl7J9K23m30o0M62j08q3j49K05r2O5J06q2j4J2l79J80K20j36J58
7874A28j25j13j13K63k67Q7O4K01j11k23J89k46K66j18R1J0J5L03k63ko2O7oK4
7898E9k23n3L36o4L7o3K1p4Q8J0J01k00K10o3k03J56J88k25o2r0j30K92J19l67
7922b00O3J55J6k08K59K09m35J20j76K37j08k40K02K69r4R8k3j14N5m6K63M7l37
7945A2o7QJ51J2l58J50L2L05o41L77J86k94J10K3L6j75n0K19k06K13j49l5K09
$$ y = [-107, 110, 73, 25, 129, -34, -58, 15, -176, -69, 24, 26, 41, -65, 16, 40, -50, 47, -14, 12, -101, 56, -248, -211, -66, -33, 299, -34, -154, 17, 122, 143, 93, -75, 204, 24, -55, 90, 6, 72, -64, -265, -142, -22, 175, 95, 140, 7, -441, -93, -29, 73, -194, -65, 45, 121, -62, -58, -147, -201, 93, -10, -118, -75, -305, 231, -23, -46, -94, 93, 244, 145, -73, 43, 48, 11, 30, 253, -177, -237, 225, 117, 34, -115, 90, -2, 63, 169, 87, 73, 85, -294, -114, 106, -30, 128, 3, -110, -223, 40, -227, -140, -76, 125, 14, -209, -20, -266, 0, -118, -27, -17, -2, 301, 38, 36, -26, 41, 35, 59, -164, -217, 119, 55, 92, 29, 50, -24, 64, 74, 175, -25, 185, 122, -81, 75, 263, 38, -24, -114, -244, 48, 167, -200, -137, 18, 34, -174, 85, 294, -141, -21, -197, 40, -68, -308, -106, 163, 69, 167, 144, 30, 85, 39, 302, 349, 12, -55, -47, 104, 116, -242, -92, -60, 245, -396, -19, 167, -127, -17, 6, 42, -133, -183, 36, -170, 43, -106, -141, 68]
7968F8j04O1j4p5R8J40l60K15j28j2qm0L36n2j33J57l54K42Q4r8j29J37J9o5j19
7993a34j75O77o75O74k91M5k01J7r8L02k62L12j87L7K06j41%k48K92k63L4K1N0
8016hj81M29j06J47l23j85M57j43q4j51o4K08N5L9q9l2N8J13j53m04K32K82m70
8039c73M90mk32K73l08N0O2L4R2R1k49K13k66J86O3j72R1K08l76M46l58L6jL6
8063C2j85M1J90J2o9k42L27k96K78K1j49q9R3l7q3l8N3l4N8O6K04Q2m18K52n7
8088A2J43l09L50k05k65K66J95j31J3k64K33J51j16J10l62l6P5L38M7m98L41Q
8110I6m6k19L02J25k99L24m24J01j15K53j47Q6N0k5o1Kj51p7K8J55k6j32K73l2
8134D1j85L2K68j83K20j6k05L2Q1L6j78k49L76k73N63m02k6L4j19J22J02p0k87
$$ y = [68, -36, 25, 11, -64, 34, 174, -186, 29, -99, -111, -119, -159, 177, 125, -8, 149, -205, 37, 121, 23, -106, 31, 50, -15, -134, -309, 368, -307, 367, 76, 121, -80, -63, -161, 141, -121, 191, 4, 41, 247, 106, 106, -142, 150, -113, -79, -58, -8, -189, 240, 134, 281, -42, -227, 230, 87, 3, -148, -212, -4, 51, 90, 1, -31, 27, 140, -13, -417, -185, 97, -373, 117, 113, -119, 154, -154, -104, -42, -8, 84, 175, -74, 139, -127, 59, 122, -50, 41, 249, -127, 319, -39, -3, -4, 32, -153, -112, 78, 90, 21, -221, 106, -190, 88, 109, -40, -129, -36, -73, -156, -194, -141, -175, -117, -51, 153, 235, -183, 69, 12, 155, -154, 196, -9, -274, -8, 187, 56, 69, -195, 38, 189, 73, 183, -179, -215, -140, 198, 245, -253, 88, 96, 50, -169, 133, 258, -41, 283, -141, -40, -155, 98, -49, 37, 87, 62, 1, 3, -148, -225, -197, -42, -68, -200, 73, 41, -144, -112, 156, -27, 193, 177, -28, 4, 85, 121, -57, -306, 70, -203, 360, -42, -68, -34, -153, -31, 71, 1, -286]
8157b86L68j04M1J46Rj23k82J11L66m06K67r3P7j93L08k11k01K08J8J86m64J49
8179a09J87or8M5k3L6J03j05J08j47N3Q
$$ y = [-286, 82, -22, 19, 165, 174, 51, -231, -120, 246, -160, 107, 14, 91, -102, 206, -5, -206, 2, 20, 206, -258, -109, 78, 72, -26, 19, -4, 32, 135, 30, 138, -9, 44, 52]
8191E2
$$ Imaginary data points
##PAGE= N=2
##DATA TABLE= (X++(I..I)), XYDATA
0@%%%%%%%%%%%%QqQj6J6j6K4l2L2m0M8n6O6p4Q8j03J19j36J54j75K00k26K56k90
36a53L24l63M07m54N04n60O22o89P63q42R27j024J131j244J370j511J663j834
54i63K027k245K492k775L103l488L950m515N227o153P409r228J2108j7394L0293
69A9848j21440k07235P3862P8054O3881l8330r5475q1460J5393P7112N3954k2217
81a84053k464j796j6019q938r041Q299N7369N3809P311p8901p9372L0536J03128
94a20132R4081K4013q5417r1716o73R2694R9394J169o5472n4838k7366L4734M9641
107d9888o45j2101N736J2317p412k8705J1153N0511O2440N3344l2481q7208j8088
120d1027O5647R7886M6835m9432q5526m7885M3093R5036L0803l4617m6622k7597
$$ y = [0, 0, 0, 0, 0, 0, 0, 0, 0, 0, 0, 0, 0, 8, 0, 8, -8, 8, -8, 16, -16, 16, -24, 24, -32, 34, -40, 48, -55, 64, -72, 82, -93, 107, -119, 137, -153, 171, -192, 215, -239, 265, -295, 327, -362, 401, -441, 486, -538, 593, -651, 719, -792, 871, -963, 1064, -1181, 1311, -1464, 1639, -1849, 2101, -2414, 2813, -3340, 4069, -5159, 6949, -10445, 19848, -101592, -308827, -234965, -156911, -93030, -131360, -226835, -308295, -292902, -215790, -161836, -184053, -186517, -188313, -204332, -213270, -222311, -214012, -156643, -102834, -95523, -174424, -253796, -223260, -120132, -26051, -2038, -87455, -179171, -179844, -87150, 12244, 13413, -52059, -106897, -134263, -99529, -49888, -50533, -62634, -56898, -44581, -51993, -80698, -69545, -19034, 43406, 96750, 64269, -22939, -41027, 24620, 122506, 169341, 119909, 34383, -13502, 29591, 124627, 155430, 120813, 74191, 46594]
132D6594K0150K8712N712n043j2600O231k913n1389m0180N353L6753L5979k3606
145D9753p2126o1205K910Q1574O0377k4498n8359n0843P263O4669M2658j1298
157C0875m5775k8430J6332J2399o87m545j0523J7105K0154k0125l2562j1945L4445
170b3282N7904J3206l5776n4314k0493N0667N9160P658m0637n4692l427M3252
182g74L6794J0778k6431k0708K4294K6395O983q178p084K2112K5779J574k5162
195F6372l9796N564M6359K1171j6783m7059l6502J8362M3647K4167k3387n0918
207A1197j1107K3123K2556N680l2822k9408N919J6005N938k5560l1203O050K3548
220a0084J4809j0753l7949j1672K5728L2375R887l4535l4911M585K4167K3012
$$ y = [46594, 66744, 95456, 101168, 96125, 83525, 89756, 86843, 35454, -4726, 627, 37380, 73359, 49753, -22373, -83578, -80668, 906, 61283, 36785, -21574, -72417, -65154, -485, 42173, 30875, -14900, -43330, -26998, -14599, -15286, -19831, -30354, -13249, 6905, -13220, -45782, -57727, -23282, 34622, 47828, 12052, -42262, -62755, -12088, 47072, 54730, 14093, -40599, -44026, -774, 36020, 46798, 20367, -341, 23953, 50348, 57331, 49153, 42069, 64181, 89960, 91534, 66372, 26576, 32140, 78499, 99670, 82887, 35828, -674, 17688, 61335, 85502, 62115, 11197, 90, 23213, 45769, 51449, 18627, -10781, -4862, 11143, 17081, -8479, -39682, -33632, -10084, 4725, -6028, -43977, -55649, -29921, 2454, 12341, -22194, -57105, -52520, -28353, -5341]
232e341j2185m3343j8041J5052K5480O298l0887k4697O294K6524K7403j4489l4145
245g6077m103K0918L1129Q053k7757k1129N245K8826K4022j4862k1245K495K1641
258b2844L1000K848k3191p224J7895L7233J8249k6082k7486j812K6478L5121l270
271E6915l3616k5522L062L5368K0234j5084k0047j0883J4314K3782m641j7209
283B6673r243J0526K1997o024k8647j9612L629L3487K1302k3495l7171k0166K1069
296e675M4137J2158k3260l5381j4578K5331K5022j18j7598k2861J210J3441l692
309a864j0526j0045P971K3796j045k3022k2819k59L6548L1634p297l6122l6186
322d9236Q615M1824K4786n980l5244k7873J2093K7260J6647m166j7057J906J0448
$$ y = [-5341, -17526, -60869, -78910, -63858, -38378, -32080, -62967, -87664, -81370, -54846, -27443, -41932, -76077, -80180, -59262, -28133, -20080, -47837, -68966, -63721, -34895, -10873, -25735, -46980, -44485, -22844, 8156, 11004, -12187, -19411, -1516, 35717, 53966, 27884, 398, -1414, 25064, 60185, 56915, 23299, -2223, 839, 36207, 56441, 41357, 21310, 10427, 24741, 48523, 43882, 26673, 17430, 27956, 49953, 43929, 15282, -4330, -701, 32786, 54088, 30593, -6578, -26744, -5675, 38462, 50620, 27360, -8021, -22599, 2732, 27754, 27636, 10038, -12823, -11613, 1828, -1864, -12390, -22435, -14464, 9332, 8287, -14735, -37554, -37813, -1265, 30369, 23072, -13050, -49236, -40621, 1203, 25989, 20009, -15235, -43108, -31015, -3755, 12892, 8726, -8331, -6425, 4023]
335D023K183k638q629R662K6124N848j8431l1960j1694L1214L7076R004k8132
348B3650m4677p568L2924L7446J2150k8455l3065l291J5142J9993J151j7210n908
361B282K81k594q284j4917M745K2899J2618j0081l5195k3437J9542L7411K5286
374C0556j4608m6080k3873J5151L5772K4283j6039k9830j4825N421K1288Q073
386d711p376j242K045L247o405j6957K025K0885K0916K467l2468l2682K579L2451
400a5226L7051J30l6582k8880l42L2857L5518L02k0548j6479P91J8621R873j107
414A5979O21K289P465n271j8895m621J4322K7201J4510k3278l4037j2005K0229
427D509L9196J2490k4997l5518j8019J8341K9002N571j4654k1916q686J0992N370
$$ y = [4023, 6206, 3568, -5061, 4601, 30725, 36573, 18142, -13818, -25512, 5702, 42778, 51782, 23650, -21027, -28595, 4329, 41775, 53925, 25470, -7595, -10886, 4256, 24249, 25400, 8190, 2282, 2563, -31, -8315, -23232, -18487, 4412, 17030, 6949, -28246, -51683, -32141, 5270, 30556, 15948, -30132, -54005, -38854, -3082, 21201, 5162, -24668, -39493, -34072, -12784, -4711, -12087, -13329, -11284, -8037, -14442, -31399, -29374, -8489, 12427, 14894, -17574, -50256, -47677, -15226, 21825, 21955, -14627, -43507, -43849, -10992, 24526, 24828, 4280, -12199, -11408, 7213, 17086, 15979, 16600, 18889, 26354, 21083, 2188, -2433, 11889, 39090, 53600, 30322, -3715, -15720, 4509, 43705, 56195, 31198, -4320, -22339, -3998, 25004, 30575, 15921, -5995, -14681, -3689, 1681]
440A681j324j634K182J1453o03j7464j2838L457K6602K2327j0797k9560k5675
453c2193N644L6017K2149j0089l0630k4541Q585K5066J3502n036k0283q196P374
466a2631L347j258o193r6J3676L421j2698j6961p151K1469K8602N666j8725k8111
480b7643k423K9220K8082P574j9772k5888J639J9168J7153J499j5653q076N044
493I924M958J12r669l260J2518Q293l929j9062j8539R140K3392J1936j0780l0136
507a5102j5792J3481K4153J3709j4582k4698m473J1932J8035M919j3601o877M174
520d722Q343L147j1788p983P908J1927M614j5574k1436q25J5702J8503L17k4688
534a6555j9482L811J9148J7450p009k0169r764N858J7733O026j1260p340K325
$$ y = [1681, 357, -1277, 905, 12358, 11755, -5709, -18547, -15090, 11512, 33839, 23042, -6518, -32193, -26549, 9468, 31617, 21528, -9102, -33643, -25058, 8, 13510, 8474, -11809, -20005, -12631, -9284, -10542, -16735, -16831, -3155, 266, -12432, -29393, -36544, -15075, 13527, 19193, 468, -27643, -30066, -846, 27236, 34810, 15038, -10850, -9211, 9957, 27110, 28609, 12956, 4880, 9924, 14882, 14994, 5325, 2065, 14583, 22876, 18947, -115, -18654, -9514, 13878, 25814, 15034, -15102, -30894, -17413, 6740, 20449, 5867, -18831, -23304, -11372, 6663, 11582, -2019, -8896, -4722, 3621, 6768, -5020, -13003, -5095, 6832, 11446, -4128, -25564, -26389, -10687, 7816, 8133, -16555, -36037, -32226, -13078, 4372, -2637, -22806, -32570, -26712, -8979, -2953, -14213, -21553, -19228]
547a9228J2452R698q861q845M250J4363J6265l955j6991o773R371K2380R308j5349
561A8085j6995n187J3697J9117k330j6224j2597J987J6315O673j0628j1795l545
574c427J1968J0981o385j2915p830Q071J7416J025j3696j2006j86J6989J2579
587B2584o172j4898r419R594J7162R98j1799j4205k405J5215P760q049j5126j0467
601a9227Q758J3274r94j2547j4386J532J4456N934n489j3635o928J2594J2361
614d297o69j0557j0869P202J6638N875o510j4092j999J6905J3857O72j2933j2702
628a3479P696J6321Q303n937j6076m591J1024J0172J032j1736r322O409R704L115
642A2635p286j2416L238J3365Q087m146j6247o776J2229J5049N963j1963j6669
$$ y = [-19228, -6776, 2922, -5939, -14784, -10534, 3829, 20094, 16139, -852, -7625, 1746, 24126, 33434, 18085, 1090, -4097, 9600, 28717, 26387, 10163, -2434, -447, 15868, 22541, 11913, 118, -3427, 8541, 19522, 13137, 222, -7608, 463, 17879, 18904, 5208, -6798, -6984, 10005, 22584, 16412, 1514, -7905, 1689, 18851, 19849, 8050, -6155, -8560, 6655, 14415, 6366, -8760, -19227, -10469, 2805, 1811, -10736, -25122, -23590, -9134, -3200, -8689, -22324, -29252, -16658, -4297, -4966, -15523, -26392, -19190, -2552, 3323, -3187, -17279, -19278, -2373, 11484, 12156, -777, -13479, -5783, 10538, 18841, 12904, -3172, -7763, 3261, 13433, 14465, 2729, -6593, -184, 9520, 12635, 5349, -7067, -3829, 9536, 17623, 13477, -2770, -9546, 2683, 17732, 23695, 11732, -4937]
655d937R3J2978J3851Q33j5650q529M600R733N868q033r812R92O250N105p594
670E748j3742j167R648R636k136j7917j2145N222J5123J2286q590j8583p352Q401
684a5568J6767O109j0639j0172k028Q715J0192l854o956l12O597Q105l895j1065
698h004k046P902J4502M088j4770j4043j215J4594J6884k481j6016j2308N66J5520
712C173J0625m451j0266o795N160R544q23m524k733L699Q534k068j0343o534L955
727c847J5220P965j0687j5763p699R678J8436M008j1374j6714o019J1956J1434
740F594o78q474j0209J331O764j42m138n302K416R084jr155r557k45J5011J1417
756D716l451j4062j3655N062J8240J0573l694j5248r610P620J1973O480l556r676
$$ y = [-4937, -4844, 8134, 21985, 22818, 7168, -1361, 3239, 12972, 18840, 10807, 995, 1987, 8237, 13342, 5748, -7994, -9161, 487, 10123, 7987, -9930, -22075, -16853, -1730, 10556, 1966, -16617, -23969, -15568, 1199, 7308, -3331, -13503, -15531, -6816, 3376, -478, -7434, -7746, -1149, 6956, 3061, -8004, -10050, -2148, 12354, 16442, 1672, -12371, -13586, 1008, 17892, 15411, -605, -12913, -12347, 3173, 13798, 9347, -919, -7714, -2554, 6990, 6167, 1643, -1090, 2609, 11143, 9075, -1268, -7802, -3847, 11373, 19338, 8651, -7112, -14811, -5133, 13303, 17311, 5937, -10777, -16796, -4840, 6594, 5916, -2558, -12767, -11436, -4672, -4814, -8952, -14254, -11838, -2754, -2755, -11910, -21467, -21712, -6701, 4716, 1265, -12797, -26452, -21390, -3150, 7423, 3729, -11519, -21129, -13509, -1536, 4944, 1388, -8288]
770h288L07O213L408j450n313K475R894L261m537j1334m166J2366J3885L560j1084
785I197j6217r5J4242J3869K628j2992j1862K456R522Q533j975r034j282L282
799A0272L629j477p366n83P424N616j770j3011r066O179J2704P853p498j7154
813d248p161O832J3661O393j0101j3437l082N495R281l66p413l348J268M758o08
828b076p863k325N183Q191K520j0623j0654N46J1126J3039r45j4413r489K340
842a5443J3709J0592m584r916n550M424J0111K187n236l347J046O847K044p251
856c67l705K440R084P294o819j1055m366P622J4247L186j0004j0836l559J0408
870C570J1122q41p834q354J126Q791K690l651n324j068O664K107n094p103k509
$$ y = [-8288, -7981, -1768, 1640, 190, -5123, -2648, 7246, 10507, 5970, -5364, -9530, 2836, 16721, 20281, 9197, -7020, -7115, 7127, 20996, 23624, 10632, -1230, 1226, 10748, 19281, 17306, 8272, 6990, 10272, 13901, 12424, 5058, 4475, 11899, 17515, 15745, 2734, -6332, -153, 12551, 20404, 12906, -4248, -11409, -4577, 9084, 15477, 5376, -8061, -11143, -5648, 3633, 3267, -4146, -7494, -6226, -1468, -2076, -9939, -12264, -7081, 1110, 3630, -6993, -17647, -17101, -5975, 7064, 6119, -8294, -17783, -15443, -1734, 8858, 4274, -5642, -11192, -6768, 3343, 5530, 294, -3053, -2007, 4840, 6884, -367, -4072, -1632, 7452, 14746, 7927, -3128, -7494, 128, 14375, 17561, 7557, -3279, -6838, 3570, 14692, 13851, 6017, -2337, -1211, 7580, 10270, 6619, 1295, 227, 6891, 8998, 3904, -3199, -5708]
885e708P297Q665m162j0218r810J916J1895N343o085j2059q156O430R887J750
899c015o527r585n21P282L728j941o570k224P045N203j285o734m550O607J0224
914b863K803n259r645k87J0853R115P77q722q123M446R435N210k375q690j601
929d926O521N543Q83p277l413N408O534K026n371p471K712Q739O297k081r751
944D373l386O649Q817L952o491q356J264O931P133j698q999l415M266O251J589
959A8880p941o844Q96N590M067n099j0249k376M118O170l03r245o480P99O544
974a473M796n560q434k362M621P541k83q029m707J847P789M647m808p134j364
989a2913N720Q038j031o791m108J771P825L628n764n687o91O391O327k808o161
$$ y = [-5708, 1589, 10254, 6092, -4126, -13936, -12020, -125, 5218, -867, -12926, -21082, -14652, -4765, -3015, -9542, -19127, -19648, -12366, -8638, -10579, -17149, -19373, -12328, -7125, -8410, -15144, -19694, -13087, -2863, -60, -5319, -14964, -15251, -4398, 4717, 5494, -3228, -11351, -6905, 2530, 7740, 5365, -3325, -4926, 1595, 7138, 8021, 744, -2669, 2739, 9273, 11299, 5928, -1543, 1169, 9908, 16205, 14124, 4373, 987, 7636, 16453, 20405, 13914, 5558, 6822, 13753, 20886, 19188, 10189, 6774, 11040, 17291, 18880, 10939, 4095, 4991, 10581, 14648, 9549, -700, -3076, 1042, 7212, 6909, -2336, -8816, -8017, -1473, 3323, -2237, -10671, -13033, -8412, -871, -1154, -9183, -13890, -12043, -4254, 393, -4415, -11549, -12913, -7193, 845, -186, -6977, -11085, -9314, -1489, 2139, -3625, -9312, -10003, -3612, 2715, -93, -6254]
1004f254l237L375Q955K439n969n845j53Q438P657k767o082m158L566R350K141
1019A1456m175n580m87O485M912k746m940l538M439O290j354n734o212J283P750
1034G849K662n077q302m012N751P245l66o151p886k14O830L837j523o580l612
1049i549M091M195O8m471m426K839N934P29m092p370k7P752M903j737p659o757
1065a5577M040P946L845l712q742k141N314N428J702m954l773L049M405K298k356
1080c228m205L096O313L551k370o582j016P289P383K564o637p383J840O873P274
1095A4762k83p626m443K108N621L468l965m681K84K788K301k795n461L71L700
1110F149M161j513q078m013L340P055M648n881q498k559M280Q051J790o222n809
$$ y = [-6254, -9491, -6116, 2839, 5278, -691, -6536, -6689, 1749, 9406, 6639, 557, -3601, -35, 9315, 11456, 7281, 1701, 1214, 7699, 12611, 9865, 4925, 1387, 5826, 12116, 10762, 5028, -1184, 99, 7849, 10511, 5434, -2868, -6880, -1129, 6116, 5750, -401, -8287, -8501, -1671, 2166, 643, -5937, -9549, -5458, -1263, -1195, -5666, -10092, -7253, -1319, -590, -4682, -12052, -12079, -4327, 576, -1161, -8820, -15577, -11537, -3591, 254, -3458, -12200, -14341, -9027, -3599, -1897, -6851, -10624, -7575, -3170, -872, -3228, -7433, -4337, 1976, 5527, 3157, -3425, -4441, 2848, 10231, 12795, 6158, -1225, 615, 7488, 14762, 14479, 6853, 2410, 4518, 10139, 13607, 9642, 4961, 5245, 8033, 10334, 7539, 2078, 2449, 6149, 10310, 8797, 719, -3294, 46, 7101, 11749, 5868, -2630, -5189, -909, 7142, 8932, 2710, -3099]
1125c099j186M708M150k658l998j575J811L229j963n042j877L341N728k44p102
1140e777n604K02O613P342k637q028m748J773Q234M212l307m966k702M091N283
1155a9j5k546j813J943M660k24l892k225J966O912L265m667o036k824N955Q496
1171H936L10n367o912p80O631N491o67n157m157J959M463N12k256l272J109M269
1187E112L02l434m408m26O232L767k092o428n318K706P634K769l131p691l632
1202h038M748N099J278m023m878P09L340J385j617l878J11M508J738j840n423
1217f781j541M834N040J234m756o911J248O301N295p59o086m322K784N426L204
1232D210k506m562J93L197L271j028m274j40L873L333O1m907l426K578N862L310
$$ y = [-3099, -4285, 423, 4573, 1915, -2083, -3658, -1847, 1382, -581, -5623, -7500, -4159, 1569, 1325, -5777, -11381, -11179, -4566, 2776, 139, -7889, -12637, -10864, -2630, 1582, -1725, -6691, -9393, -5302, -19, -34, -2580, -4393, -2450, 2210, 1986, -1906, -4131, -2165, 4747, 8012, 3345, -2691, -5515, 440, 8936, 9246, 3879, -3033, -3813, 2818, 8309, 7642, 2485, -1672, 287, 4750, 5262, 3006, -266, 843, 5112, 5414, 1980, -2428, -2854, 3378, 7145, 5053, -1375, -6693, -3987, 3647, 6416, 3285, -4406, -8038, -3290, 1809, 3087, -936, -5814, -5105, -1765, -380, -1997, -5875, -5764, -1256, 482, -1358, -6781, -8322, -3488, 1552, 2786, -1970, -8881, -7633, -1332, 3963, 3204, -2882, -7204, -4420, 1006, 4210, 1704, -2858, -2665, 532, 3803, 2775, -1499, -1639, 2234, 5567, 5628, 721, -2705, -127, 5735, 9045]
1248I045l538p049j357M188N728J613n544m746L14L654M125k206m376j325J992
1263E18L723n42m475j882J605M120K049m944m406Q2M124M892j623n747l074J343
1279d237N607K802l947m292j675L720M286j189l810k457J394M275P69l602l152
1294e508K53M507L398k830m331j762L090N723P32l688l692K17N302L719j687l622
1310a79k198L133M865K70k738l378M60N111J899k462l472k160L396M381j067l989
1326A872l440R81M470J311k219m641j889L931L387n16m087l425J739M218J475
1341C167k647m394o25M192K965l74m085l608K511M156Q19k451m253o62L440K354
1357E05p26m455k165K452L229N74l137m220J088M163K118r62m499k024L282M312
$$ y = [9045, 5507, -1542, -2899, 1289, 7017, 8630, 3086, -1660, -1346, 2308, 6433, 4227, -149, -1474, 518, 4241, 3699, -776, -2658, -1053, 3067, 5116, 172, -4234, -4152, -28, 4864, 3241, -2506, -5580, -4237, 1370, 4172, 225, -4067, -5742, -2022, 2264, 1075, -2735, -5192, -3798, 477, 1246, -2356, -5508, -5255, -748, 2650, -180, -4511, -6273, -3183, 2540, 3272, -416, -4108, -3891, 1411, 5130, 3443, -179, -2377, 756, 5621, 5891, 3153, -225, 235, 5346, 7245, 4783, 1311, -849, 2547, 6928, 5861, 1872, -1568, -587, 3883, 5194, 2975, -1666, -3555, 376, 3763, 3247, -840, -4265, -2526, 1692, 3167, 520, -3874, -4499, -307, 2658, 2284, -1801, -5409, -2898, 1258, 2077, -374, -4627, -5289, -1849, 505, -221, -4676, -6841, -4389, -1160, -586, -3723, -7943, -6855, -2692, -574, -1536, -6035, -8059, -4777, -465]
1373d65J634l064l487J283L473L272L9l980p02K710L238P96l003k375J542L604
1389D515K073k560m208n49L307L659J3m987l357J272L661K984k262m559j118K334
1405B18L547J79l412j991J289K627J747k810k682L07L073L080j647m515j543J950
1421e83M172J138m089m109q61K918L769r80l891k850N24L395Q56k696k035m65
1437e787K743J905k012k463m59K690M131N9m075k054J038N167L099j673l476k026
1453c193K716M329R48k047k804l28L140J631j133k282r39K248K283j038k704k584
1469a757K255L922M41k660l718j013M252L668n79l263l439R84L924J992j006l103
1485I00j416K267J721Q2k407k054K023K070l94k312l582L35L391J816j624m772
$$ y = [-465, 1169, -1895, -5382, -4099, -626, 2646, 2685, -1295, -1997, 713, 3951, 4747, 1744, -631, 911, 4515, 6588, 4028, -180, -729, 2578, 6237, 6250, 1263, -2094, -822, 2839, 5823, 3561, -998, -2116, 218, 3765, 3944, 532, -1459, -170, 2457, 4204, 1394, -1288, -981, 2092, 5172, 3525, -990, -2533, -583, 3589, 4727, 638, -3471, -4332, -1414, 2355, 1375, -2516, -5366, -4842, -1447, -591, -3287, -5322, -5787, -3044, -1139, -3151, -5614, -6073, -3383, 748, 807, -3268, -5322, -4284, 883, 3982, 2309, -1167, -3193, -477, 3852, 4800, 2753, -51, -379, 2761, 4392, 3259, 977, 38, 2286, 4569, 3531, 827, -1757, 498, 4420, 4861, 2201, -1517, -2530, 1722, 5390, 4811, 1548, -1891, -907, 3017, 5009, 4003, 900, -516, 1751, 3472, 3554, 1147, -907, 1116, 3186, 2792, 480, -3102, -2767, 624, 2440, 816, -3956]
1501c956k499K475L457O90k422m351l89K798K539L6k959j936J994K041J028k019
1517c473j861J821K561J352j375l189o28L908L132L43l720k886J365L751K778
1532C879j458l891r94J724L276Q86k292k261R04J976K012j907k394N50K174K507
1548D691l87l425j550J902L370K131k776l591l92K739L252l19l217k269N38K668
1564C365J497k308k767k59J943J911j496l131j005J373K945p6l059k636K14L253
1580b36K636j869l559j530J764L150J130j942k897l67K857K109j152j981j426
1595c313J706K984l50k469j752Q71L378J263k077k708p05K417L319n35k457k308
1611b736P60L382J673j525k409j203K869K353k51j945j900J237K887O77j708k880
$$ y = [-3956, -6455, -3980, -523, 167, -2255, -6606, -6995, -4197, -1658, -1622, -4581, -6517, -4523, -2482, -1454, -3473, -5334, -3513, -952, 400, -975, -4164, -4792, -884, 2248, 2591, -1129, -4015, -2650, 1101, 3879, 2421, -1470, -2464, -740, 2536, 3422, 1130, -1131, -227, 1749, 3761, 1854, -540, 10, 2184, 4691, 4304, 879, -671, 1231, 4601, 6732, 3956, 365, -27, 2712, 5964, 5645, 2428, 159, 697, 3365, 4862, 2554, -213, -472, 1471, 3382, 1886, -1245, -2250, -877, 2068, 1992, -1067, -3703, -3489, -236, 2400, 531, -3028, -4558, -2794, 356, 1486, -456, -3353, -3720, -863, 1246, 94, -1887, -3313, -1607, 1377, 1027, -1442, -3194, -2323, 1055, 2318, 241, -2467, -3172, -755, 2564, 2029, -428, -2736, -1976, 1406, 3079, 1554, -855, -2058, 811, 3164, 2913, 968, -932, 305, 3192, 3869, 2161, -719]
1627g19j33K854K111q06l341j706J768K820K23j784l082l35K434K233j051k887
1643a401j809J678K430R6k038k470L80K178J333n25l201j286J936K367N83k509
1659b258k310O26K536J445m55l165p94J944K272N51k230k187J098K546J667j344
1675e8k626l61K065K287K53k068j798P20K288K123j745k467m0J885K526p8k780
1692A26j266J151K197J444j902k297j32K285K308m96k924j212J175K557R70k231
1708A753j595o44J905K411j055k395j167Q68K392M98k680j815J07J951J945j454
1724A025l017q38J125K885k11k268j758j49K307K158j286k191q62J227K316M36
1740H99j722j757Q21K151J494j476k070m80K204K491n67k450j477O62L018J228
$$ y = [-719, -852, 2002, 4113, 3307, -34, -1740, 28, 2848, 3071, 1287, -1795, -2130, 304, 2537, 1486, -1401, -3210, -1532, 898, 994, -1044, -3514, -3134, -956, 377, -148, -3349, -4635, -2699, -332, 251, -2258, -4568, -3942, -1406, 39, -416, -3581, -4375, -2431, -159, 392, -1838, -4025, -2927, -381, 1286, -58, -2684, -3045, -980, 1307, 1560, -508, -2306, -1586, 702, 2825, 1080, -1387, -1427, 458, 2984, 2906, 126, -1140, 11, 2208, 3652, 1750, -547, -679, 1606, 3914, 3418, 494, -718, 457, 3014, 3984, 1753, 158, -486, 1419, 3830, 2775, 380, -787, 81, 2473, 2971, 291, -1524, -1417, 534, 2479, 1025, -1992, -2830, -1705, 1180, 969, -1299, -3057, -3206, -899, 1259, -27, -2218, -3080, -1853, 463, 899, -823, -2580, -1759, 392, 1886, 410, -1660, -2140, 64, 2555, 1988, -462, -1939, -1277, 1741, 2969]
1756B969j455k525o99K151K066k19j716j502L27K307P91j206j835k8J998J647
1772C071n43k400r07J568K374O33j772k676o8K582J889p92k412j617M97K388M25
1789B240j627k046l55J734R98j032k058j079J513J657r1k146j752R87J993J109
1805D5r06k407o48J323K419N23j745j968N92J898J650p77k155m34J307J832r0
1822D59j968p98N71K134M30j337j824j55J871J997k43k195j522J180K279J510
1838B389j430j752o2J595J845R6j859p63R76K110P68j548j543M98J401J028q78
1855B871j975q01Q37K096M10k264k017q2J733J524j025k305q30Q55J626Q20k228
1872g55j178j44J903J062q86j864l37J080J989k34j657j216J68K589P79j213k023
$$ y = [2969, 1514, -1011, -1710, 441, 2507, 2288, 572, -930, -603, 1704, 2495, 1289, -546, -574, 1424, 3071, 2528, 128, -779, 789, 3163, 3796, 2024, -652, -720, 1862, 3751, 2959, 547, -1070, -573, 1815, 2240, 613, -1433, -1788, -54, 944, -88, -2146, -3225, -1712, -55, -146, -2292, -4044, -3057, -1064, 45, -861, -3268, -3916, -2593, -174, 349, -1396, -3364, -2772, -874, 776, -1, -2156, -2590, -1283, 549, 459, -1509, -2307, -1736, 398, 828, -509, -2333, -2488, -617, 1380, 1137, -1058, -2580, -1400, 879, 2389, 959, -793, -855, 740, 2585, 2681, 822, 59, 1035, 3145, 3913, 2365, 822, 1320, 2721, 3749, 2871, 896, 95, 932, 3028, 3438, 1174, -843, -925, 808, 2332, 1307, -998, -1828, -973, 653, 1473, -755, -1933, -2077, -174, 888, 2, -1862, -2199, -1119, 870, 636, -1021, -2237, -2069, 520, 1299, 86, -1937]
1889a937m92J111K100l18j411j844P69J767M24r41j230n99J453J580k36j922j083
1906b809J334K289N20j346j312p0K276J205K81j670j202J174J825M39q53j518
1922E63k50J417J081l04j616o91Q28J400o2r61k076K04J828P63n21k548o84J482
1940a47J575J51j526j650M13J546Q21l11j915m57J050J387J95j575j276M36J403
1957A20P68j000j789j65J161J335o4k070j235Q56J324R08j060j723j88J492J336
1974Fj4j768r44R69J889M53q14j633N55J324J784m98j749o21J142J635O60j139
1992A237j606K00J624J116n67j699o94O14J626M26j228j489P4J536J067r22j701
2009c86l95J162J345Q8j257j259K63J405J219r75j791m29J178J365j46j157j376
$$ y = [-1937, -2429, -1318, 782, 464, -947, -2791, -2022, -255, 169, -772, -2002, -2601, -1148, 432, 196, -1726, -2809, -1475, 814, 1334, -12, -1324, -1394, 882, 2087, 2368, 698, -504, 670, 2495, 2934, 2081, 563, 313, 1730, 2811, 2507, 891, 200, 1028, 2428, 2366, 1405, -671, -467, 1361, 2124, 1603, -945, -1629, -147, 1428, 1579, 53, -1597, -1184, 362, 1183, 872, -1043, -1500, -450, 937, 1132, -443, -1719, -1283, 120, 888, -112, -1901, -2066, -905, 430, 366, -1704, -2939, -2083, -759, 149, -911, -2634, -2822, -1330, 6, -8, -1776, -2720, -1751, 138, 591, -223, -1856, -1301, 23, 1807, 1309, -440, -1061, 81, 1716, 2376, 1237, -369, -169, 1455, 2571, 2004, 305, -389, 225, 1851, 2277, 1049, -440, -366, 1170, 2237, 1315, -386, -781, 381, 1726, 1814, 557, -702, -439, 966, 2185, 1210, -581, -1010, 168, 1533, 1387, 230, -1146]
2026a146J06J560R64j228j929J13P93J605q12j042j170J80J831N80j044j239m48
2043b326J340J269o29o89j010N33J609N57q13j551J30J482J123m15j107o54N84
2060e67J564N15j196j351K08J583P36m08j410p88R93J386J99q57j778M32J386
2077F47J108o87j627l69R18J567Pj089j246K73J562O99m96j507p31J262J109k05
2095A195j016j376L75J223N50q31j025m58Q79R71J30j756o88O44R91N55p87j362
2113a786k24J218J048j36j452n85O41J243Q97j185j223J10J040J449l34j468n63
2130a310O61J344P00j282r45Q3J164J484q51j174n59O60J142N58j249r48K3J336
2148H37R62o20j329k77P57J111L66j749n82M96J055O96o38j419k17Q96J136l4
$$ y = [-1146, -1040, 520, 1484, 256, -1673, -1560, -767, 838, 26, -1016, -2186, -2006, -175, 405, -639, -1878, -2326, -986, 283, -346, -1035, -2045, -1512, 97, 654, -159, -1710, -1580, -98, 1025, 610, -497, -1151, -567, 997, 1512, 316, -1035, -827, 756, 1492, 1084, -326, -1114, -121, 1265, 1464, 607, -1171, -739, 647, 1755, 1068, -559, -928, -10, 1557, 1564, 475, -771, -498, 1064, 1763, 1267, -240, -971, 291, 1400, 1195, 179, -1197, -822, 401, 951, 120, -905, -1363, -484, 487, 617, -1139, -1827, -1183, -192, 363, -424, -1786, -2010, -792, 256, 120, -1332, -1917, -1276, -33, 864, -321, -1544, -1434, -394, 1055, 721, -747, -1310, -649, 695, 1395, 113, -832, -749, 415, 1899, 1048, -126, -685, -25, 1117, 1675, 426, -522, -499, 837, 1799, 1179, -150, -427, 330, 1441, 1807, 58, -524, -28, 1027, 1723, 1085, -334, -551, 345, 1481, 1447]
2166A447j209r20K12J123M99m73j509j96O51J310k12j284m26M1J253N19j084p81
2184a039m47J213J096n52j140p25N80J182J72m47j190j28J242J178o01j011n45
2201a162N16J323K03m91j204O8J410M03l9j465p1O21R98K02q80o68J7J227Q67
2220A875p80j152m65Q56J039L8q78j042K50J164N57p34j032m94Q40N07M13q53
2238A09j276O63J060K39m21j463j85J086Q16p1j125p78K65J088J10l92j278J51
2256a402O83P93j6j530m84O58Q24N88r47j044K34O66J189l71q26n63P77J031N57
2275H17q14j135K8J412M59j43r46k46K66J198L62j049k26p7P69O32l18j148l03
2294d62P13J126r8j080m54PJ177O03p06j059k42Q69P17K89j075l91r1J106O86
$$ y = [1447, 238, -682, -470, 653, 1152, 679, -830, -1026, -375, 935, 723, -561, -987, -946, 307, 826, -258, -1039, -1486, -273, 823, 271, -869, -1594, -1014, 168, 340, -107, -1297, -1425, -183, 995, 394, -617, -1162, -646, 677, 880, 389, -815, -747, 663, 1066, 1027, -438, -509, 112, 1110, 1312, 432, -236, -219, 1008, 1875, 1095, -57, -522, 334, 1373, 1411, 533, -509, -259, 905, 1462, 728, -304, -798, 42, 549, 962, 109, -1167, -504, 556, 795, 374, -1089, -1274, -188, 628, 557, -568, -1346, -1081, 7, 117, -275, -1553, -1402, -719, 74, 58, -1472, -1956, -1298, -474, 114, -833, -1877, -1643, -977, 212, -159, -985, -1548, -771, 260, 817, 3, -1132, -1104, 308, 767, 624, -322, -568, -302, 896, 1258, 209, -17, -94, 675, 1307, 989, -159, -462, 251, 1377, 1279, 199, -255, -248, 929, 1532, 826, -233, -475, 394, 1111, 1400, 325, -66, -157, 949, 1635]
2313A635m36j493k14J127N78r3j406k22r5J250J19r00p76m20R29Q75m95q58o22
2332a517K54Q49N5l82j055K56P21N48J7p78m22L73J286K63p39n72j78P87R45j63
2352E48n98q00O36R15L12o32j010J55J259N89n27j022m14J141M93J16q83p72l1
2371e25J333O75n08r15j60M58R94p2p30q89K70J276M37m81j197K45N77N12o9j317
2391h6k27J96O33L36m69q37r2N95M81j55j232m75O75Q38j10m17r61j25P68O56
2411hk95p56l60M15P39M32j013m84J85N38P14J6j013k34K16R45J53o91m04j9N24
2432d00R24n75n81k82M15P53K59l34j023M98R23N06n40m76m71M93R31K31q78m54
2452h1M67O43M84p81k53k90M22J046l28p88p88N11N06L29l77p17l63M31N93j47
$$ y = [1635, 1199, -294, -508, 619, 1197, 1104, -302, -524, -619, 631, 750, -150, -926, -1346, -417, 458, -37, -895, -1517, -1263, -414, -359, -741, -1796, -1540, -819, -271, -254, -1032, -1454, -1081, 205, 468, -271, -843, -1021, -234, 711, 548, -50, -850, -214, 701, 1013, 381, -629, -474, 785, 1374, 847, -175, -589, 552, 1045, 1161, 278, -494, -525, 808, 1483, 975, 60, -100, 358, 1352, 1280, 550, -339, -69, 1207, 1644, 1163, -34, 211, 788, 1300, 1231, -86, -313, -117, 516, 852, 383, -454, -546, 49, 530, 375, -857, -1332, -657, 181, 71, -346, -1307, -1432, -664, -8, -303, -1059, -1419, -1004, -265, 167, -846, -1330, -1145, -607, 107, 123, -890, -1124, -908, 37, 190, -501, -905, -924, -400, 524, -51, -632, -914, -499, 254, 513, 179, -844, -346, 577, 1083, 543, 67, -404, 89, 1020, 1251, 373, -81, 386, 1029, 1513, 732, 479, 189, 611, 1657, 1329, 541, -247, 264, 770, 1099, 722, 5, -358, 73, 666, 519]
2472E19r65n42M97Q26ol14r04k2R18L95l85k52r66N09N98L76m91o35p3P13L85
2493A81k96o94k88O61M53R9n68p49m2J086L38m04p17m8J76J214l06l77p20K20
2513g81Q97L43j79m62l09Q71L64J86o19o28M03O16N06l26p87r7O90N61l10n35
2533D04k20K71K58K06l13o93J97L53M13J22r16m58K66O70K55p67j62l48M80O07
2553F25m46l25q24O51L51M55m07q33J46O73O2K50r55k28J55O62K06o26n54J61
2573h01N05M89j54r71R4K21P08j99l97k76O9L65Q00k42o99j30M21L86N47q96j94
2594c54k5O00M61k17o12l39N11Q41k62m65n38L27O03J96l75j22o13O54M35k38
2614D68o15n2K9O70L20p85k36q9K82N98l20j80m82P0Q30J54q33j89k00Q12J2L00
$$ y = [519, -446, -988, -491, 335, 329, 15, -889, -911, 7, 402, 17, -235, -1201, -692, -94, 282, -209, -844, -917, -204, 181, -115, -809, -1097, -436, 17, 116, -452, -1201, -1243, -157, 181, -223, -940, -988, -812, 402, 96, -281, -1001, -781, 116, 459, 280, -182, -491, 380, 744, 930, 311, -317, 86, 702, 1208, 882, 95, -2, 688, 1249, 939, 404, 184, 455, 713, 919, 606, -87, 110, 463, 876, 998, 82, -376, -110, 560, 815, 48, -114, -462, 18, 625, 179, -146, -970, -319, 32, 487, 80, -753, -607, 66, 128, 378, -577, -805, -650, 12, 218, -408, -962, -801, -296, 193, 39, -932, -838, -617, 91, -108, -505, -781, -712, -347, 453, 211, -488, -618, -197, 189, 736, -160, -354, -379, 221, 682, 465, -147, -486, 25, 866, 604, 139, -399, -72, 531, 727, 352, 230, -383, 271, 706, 468, -147, -199, -170, 500, 820, 35, -201, -290, -8, 590, 270, 90, -392, -322, 508, 662, -171, -360, -560, 252, 264, 564]
2636E64q73m94M00Q45j67l90l24k49O24M88l10n99k49K1P92J87j99r13K77N99
2656C0R3K1m60l54P69N88q8m22o80K94J73M58l29m79K40L39K76K29m39m14K02
2677D7N65K00o67k31r2M07O17k96l76m90L10N74%l63m28R0L24K34J8m68m30L55
2699a00N04m3j18o21pL79L16l17j56l24K15M92L23q40m67M01K22M48j66o57k30
2720g46K76N97L20q63j79j28N01M52m11l76NJ66N08k3m42j40J77L40P28n70n32
2741c40j18J79P46l91k71J39l00P86p1Q4k86l95L73O67l97k91k82j48O98K99k53
2762D28p32K66J19M85k08j63o23M01N04k22N1q08j79O67O83n83m9l85L68R7J86
2783C03j46p66L87N9M19k90k02k75N71pP2j36m80J12O90p6l90k20j32J64P5M00
$$ y = [564, -309, -803, -403, 442, 275, -115, -439, -688, -64, 424, 114, -485, -734, -713, 79, 266, 67, -846, -569, 30, 123, 144, -316, -670, 99, 687, 599, 177, -503, -209, -36, 422, 93, -386, -146, 193, 469, 698, 259, -155, 47, 612, 812, 145, -86, -178, 229, 846, 550, 174, -316, -6, 568, 568, 205, -223, -133, 191, 425, 443, -25, -455, -100, 404, 361, 243, -378, -385, -6, 310, -7, -163, -487, -272, 220, 543, -297, -764, -363, -141, 307, 141, -516, -746, -470, 127, 447, -416, -595, -723, -222, 230, -181, -557, -552, -386, 122, 99, -343, -483, -306, 34, 762, 192, -340, -458, -279, 467, 76, -195, -56, -356, 430, 359, 443, 157, -238, 135, 802, 405, 114, -168, -316, 382, 681, 428, -304, -38, 81, 566, 358, 195, -428, -27, 477, 255, 306, -502, -681, -14, 669, 86, 37, -348, 20, 117, 303, 157, -609, -222, -163, 256, -34, -236, -511, 60, 53, 125, -11, -491, -379, 311, 235, -155, -375, -507, -343, -268, 132]
2805A32l25l83K4P38K35j8n06m41P05K46J52o10k30K39J96N28j66n18k4L04L51
2826F29R9l33n13n2M58K21J31q47j43N23K72K0o03j70L85J67M29m11r27O21K38
2847A94Q8l0j58l77K15L83J11p55jk85M56K70Lk73l74M55l90O99n53m13L51K25
2869a59L13k74m69n0J14N31M6m02j83J55J89O61l72l60k92N38K40r5m27J34L5
2890a27K46L37l56k02r4K31N08p4j96n41K87L88O4l09k7l12J26N07l9k17n38M28
2912I0p8N30l91n19J62K11K21k76K14j90NK29J77j23p97M2Q13K20n52q6l32Q4
2934c46L23J85k96l40J03P7O29j90n16P0K10J79p4n4n56J96N43J49m74p2l8M74
2956A82j27M44o83j42M13r4M22k29j99l92N01L51O8o79j19N9L26M83m41k56J00
$$ y = [132, -193, -576, -552, 186, 421, 403, -103, -544, 161, 407, 559, -51, -281, -42, 154, 682, 516, -2, -26, 278, 629, 728, 395, -118, -170, 288, 509, 640, -207, -350, 173, 445, 465, -138, -308, 77, 244, 673, 262, -665, -44, 194, 282, 252, 94, -283, -68, 315, 426, -329, -330, -615, -159, 111, 114, -159, -533, -78, -468, 231, -322, -735, -384, -159, 154, -120, -589, -639, -525, 6, 52, -350, -533, -378, -189, 472, 100, -260, -552, -14, 226, 131, -296, -162, -127, 119, 456, 100, -102, -196, 35, 543, 469, 273, -268, 19, 407, 471, 162, 135, -177, -51, 456, 417, 200, -338, 90, 12, 542, 151, -368, -206, 5, 226, -50, 164, -26, -21, 208, 385, 262, -535, -493, 320, 540, -12, -98, -430, -346, -23, 162, -134, -474, -371, -294, 335, 145, -371, -301, -91, 88, 14, -40, -596, -400, 143, 292, -182, -254, -292, 182, 55, 499, -184, -326, 87, -7, 415, 186, -13, -405, 96, 447, 515, -164, -283, -224, 102, 585, 144, -112, -12]
2977a2k13P15jn87M2N9K03J63k52k21j00K41K95k6n22R8p5L59N92q25p1K53Rl5
3001H9J06n43O2q9N77J54l66m62j30N45L27l59j23j99N3K65L6k53r4J95L19K59
3023C69m74k78q5L02K35J79j04m77k1L60q5J80l46m2R5N59k15l30J40O9O5M86
3045E82l9l81k00J40M09j33m42J32j7M24J38j03l49k08M92J0k41j43JJ77O7L6
3067C52j00l60j97K29P6J80l48k1L15J79k67k04K48m24M90r8J95l17m37K84M12
3088A87Rk32j17j36K28J79k6m29J03k14Q72l72j5m83J75N73n0r0l98K24P1L62
3110D21q9l87K97m27K88K62l29K3k05J77J81J44l70j49L4N35k03k0j38j58J93
3131H0K60j41p0l05O1L36Mk60q4k44M81J51L38p32Ok4L22K1k44o3m5J46M59o51
$$ y = [-12, -225, 490, 489, -98, -56, 3, 206, 369, 117, -104, -204, 37, 332, 306, -216, -118, -193, 166, 758, -67, -138, 115, 124, 89, 195, -348, -286, -375, 202, 356, -10, -472, -602, -57, 270, -89, -212, -411, -358, -93, -57, -310, -404, -209, 110, 369, -105, -383, -468, -166, 69, 248, 144, -333, -354, 6, -79, 101, -245, -287, -192, 367, 152, -178, -38, 31, 96, 582, 543, 162, -38, 102, 511, 378, -64, 68, 51, 475, 613, 510, 161, -47, 445, 455, 214, 71, 72, 249, 316, 352, 252, -108, -305, -76, 0, 180, -168, -189, 126, 305, 38, -166, 82, -342, 148, 50, 245, -72, -509, -225, 187, 196, -36, -153, -289, -61, 118, 92, -337, -234, -448, 424, 52, 37, -446, -271, 302, 252, 162, -236, -12, 59, 421, 332, -55, 242, -185, 103, 365, 36, 59, -146, 31, 212, 356, -14, -163, -129, 406, 203, 183, 45, -113, 80, 340, 199, 129, -176, -115, 221, 225, -35, -119, -363, 118, 269, 607, -125, -119, -143, 179, 200, -44, -107, -152, -6, 453, -198]
3155a98Q5j86j7L95q6k59m7Jj7L19k58J28l29K29L74km96r9J47N4L04o1k85p3
3179c77L85J20j66r4m12L97K76J06k04j14o5K05K34J12Pm30l3J47J77l04Q8r1
3201c6L27k2J4k06l31M68j01R2L46o99K60k0J52Q4l78k58O00n8K7j04n33M27j59
3224a08J52K32l38k41J61K24l51P4k88K20K57p6P7k14k24K90k15L65j04l10J82
3245b35J83r5R2l8n2k4M6L07l23j35L45J31J02m87J57k11J12K10J65j64n3k5J20
3268A28O3K59q26M00J57j2L86n02k57J76K99M4q2n7j72J78N7m2j10j22J97K22
3290C84j40l18k16K04K16L18m31k30L3KO95n44q2j24J52j15M09k71r0J50k2k4
3312d4o8q2L1k70M33J21o5j47l78K59J46J25l47r9K0J32L78l49l6j89N55K27l54
$$ y = [-198, -113, -299, -316, 79, -7, -266, -313, -312, -329, -10, -268, -140, -469, -240, 134, 132, -364, -463, -316, -262, 42, -19, -304, -377, 8, 128, -38, -132, -544, -147, 129, 235, 31, -83, -148, 57, 291, 403, 410, -20, -53, 94, 271, -33, 55, -36, 291, 269, 283, 77, -254, 214, 113, 205, 551, -148, 112, 92, 244, 328, -50, -308, 292, 234, 261, 157, -376, 51, -108, 44, 276, -62, -303, -142, 82, -269, -195, -483, -263, -6, -82, -5, -219, -443, -153, -368, -3, -107, -417, -235, -52, -147, -55, -93, -145, -169, -123, 184, -139, -274, 71, 202, 304, -183, -26, -237, -125, 85, 250, 86, 33, 8, 128, 191, 450, -376, 24, 181, 169, 555, 53, -204, -28, 271, 315, 233, 176, 4, 182, 239, 197, 87, -35, 162, 384, 244, -74, -290, -86, 130, 448, 17, -213, -180, -178, 517, -27, -109, -233, -81, -196, 213, -58, -148, 2, -20, -44, -112, -194, -163, -433, 0, 121, 56, -91, -469, -210, -64, 61, -286, -385, -365, -233, 145, -204, -240, -429, 126, 353, -1]
3335am4l15O0L13J68M1l54n8K72j6M7k96o6L47J79qr6k08k65N56l18K36k13K14
3359A75p6K66j39j62J07m03N64k03M8J62p65N37L1K5k48K35m48Q8Q2P0jk21N51
3382B75j83j40k1j09m1K42Q1k23k07K99K1K59j9m33q5j33L11L64p4n19k38M28
3404a45m7N38m59k37L47O7J50j29j47k80J78L66Q7m87k5J40L34m2Km16J13k7J14
3427eK94j48l18L08J9J40j77J3k06K48J53k86O2k02n7K93K05n03K48k49J04M8
3449a6J1L8j45j8K83j02l1j32j74K83L0L0j50j09K20L62k68k99N1k72O17p4j29
3472Fk47R1J18lk81J57J40l27J45M21p0j78l24N48r8j48J68j60Q7J18j32K79m95
3495a85k4L30J42J49l44j55K53L8m33N9L09l16M53j6k38q9p9J72J02J42m41M16
$$ y = [-1, -45, -360, -300, 13, 181, 222, -132, -190, 82, 66, 113, -183, -249, 98, 277, 269, 173, -35, -300, 256, -62, 174, -39, 175, 99, 365, 226, 64, 171, -232, 332, 129, 177, 339, -426, 111, 142, 167, -81, 154, -294, -206, -124, -54, -55, -276, 275, 92, -48, -69, -178, -219, 23, 104, -119, -326, -27, -6, 253, 234, -199, -284, -417, -106, 258, 184, -335, -573, -145, -192, 346, -113, -350, -3, 64, 214, 85, -62, -342, -164, 202, 289, -198, -223, -83, 251, 209, 211, -205, -92, -119, -5, 289, 141, -177, 131, 150, 290, 113, 126, -80, 168, 321, 35, 97, -105, -162, 131, 336, -167, 81, -168, -64, -16, -5, 33, -112, -130, 153, 51, 20, -112, -286, -3, 27, 57, -93, -202, 18, 380, 112, -187, -136, -408, 209, 135, 6, -241, -150, -32, -35, -316, -159, -19, -346, -201, 220, 150, -28, -352, 196, 98, -50, 118, -42, 45, 163, 31, 310, -185, -209, 121, 263, 412, 68, -87, 166, 204, -229, -170, 139, -177, 276, 260, 22, -67, -146, 26, 128, 270, -171, 245]
3517B45k54k6R3J90j02m77L93k32L41k74n9QM19j03j46k54K30k4k1M02l68j88
3539b07J14J37p0K28j88J9j53J5L07j62o3M6o0J19Nj51j64L12j98L50k09m42M24
3562Ik48K96J28k45j21M25K2k19K04r8k90L31m1m8k01j11K31M8j38j40M15k43
3584c4J63P2l82J49J10J16N3k66k66M08k36K17L2k72j5j45L79l9k99J40K26k62
3606a51J96j25N6M3M5p7O9j92K77l32O2J83j27n8Pp7J76l5L0N4j88Q7K18k10J4
3631e5J6J5r0J13J65j59k11J18o4M10j07j17p7P8j86M69k47l09P55o65M47m87
3653a88K26P0K1k93J73K63k8j98j85K2j39L34Q9Q9k36j5rj21J79q0j36J46q7K85
3677A82l78M59l02J25n9l3Q8j87J28N1o5p9P2j68P1J6Jq2o7K89K85m35K15p3l
$$ y = [245, -9, -35, 58, 248, 146, -331, 62, -170, 171, -103, -162, -154, 265, 162, 16, -238, -8, -32, -53, 349, -19, -207, -93, 44, -26, 202, 14, 33, -120, -105, 202, 40, -23, 23, -37, 82, 87, -64, -228, 84, -114, 236, 27, -415, 9, -239, 57, 185, -60, -181, 244, 266, 47, 251, 153, -137, 194, 153, 105, -96, -207, 24, 72, -66, -206, 209, -34, 129, 201, -181, -32, 78, 194, 247, -19, -285, 123, -113, 104, 136, -136, -151, -296, 83, 44, -255, -115, 111, -151, 45, -80, -24, 19, 64, -13, 56, -136, 141, -191, -129, 54, -73, -131, -124, -201, -25, -60, -30, 24, -164, -77, 141, -69, -55, -39, -24, -114, -1, 164, 5, -206, -88, -152, 258, 151, 34, -43, 35, -151, 318, 71, -238, 517, -148, 299, -188, 38, 108, 129, -164, 9, 272, 244, 46, -139, -117, -256, 78, 167, 256, 20, 5, -4, -125, 54, -26, -162, -16, -103, 182, -196, 263, -39, 86, 27, -6, 82, -105, 23, 74, 9, -70, 2, -166, -95, -79, -78, -160, -227, 62, 347, -88, 127, 54, 51]
3702E1k06J56J57j00J9j91J65j2J53l4n0l25K2M41j70O9j72O7j96Q1Q1n1J80k98
3726a63O1K07k86L9L07jj45M6n5J73j68K42j98J0k87L31j25j46K32j26N5j84L14
3749A33l16J50k30J60j87M72j92q4R3j72m3K38q4j16N6J83K7q9O2k87K91j23p2
3772a30r6K26l1K05l45L4NJ4K83k47J72mk59J94K15j35j45L8nJ08j23j2K8j09
3796a19J73l36L43n3k07J6K68l69L80j21j9L98k94j40j44J27J56J7j45K77l94
3817a86J70k71M43q7o5j41Q4J31l5p2J14L5r1j75j61K99j38K90j95J06j77M9J65
3840I2O9N0kn89L76q2Q4J77O4m57M47l03J22j40mQ7k64J32K19j32j84L52l26L84
3864A72m51K83P8q0Q6N1l27jK37nK7r7j37J51M1n9K03l19L83k54k3J51j44j1P8
$$ y = [51, -155, 1, 158, 58, 77, -114, 51, 39, 192, 158, 108, -217, -195, 246, 76, 145, -27, 40, -156, -75, 6, -45, 135, -163, -102, 105, -181, -142, 165, 164, 19, 65, 10, 183, 15, 257, 59, 69, -218, 113, -12, -158, 74, -52, 3, -181, 133, -183, -33, -263, -103, -290, 182, -10, -94, -1, -173, -216, 22, -62, -178, -122, 61, 88, -1, 61, -226, 65, -58, -130, -226, 0, -31, 174, -171, -137, -132, -118, 165, -82, 90, 86, -173, 21, 236, 101, -44, -6, -11, 97, -26, -38, -10, -119, 54, -282, 61, 8, -199, -183, 85, -284, 96, -25, -44, 354, 60, -80, -224, -97, 59, 76, -69, 208, -186, -16, -287, 156, 69, 4, -137, -53, 78, 43, -29, 85, 120, 29, -146, -307, -8, -146, 144, -51, 55, -122, -73, 92, 161, 211, 209, -380, -4, -86, -2, 175, 239, -218, 229, -74, 48, -92, -96, -9, -273, -141, 78, -54, -238, 114, -212, 172, -279, 4, 82, 2, 88, 139, -188, -189, 48, 43, 70, -27, -164, -13, 28, -31, 172, -147, 236, -18, -41, 110, -34, -45, 33]
3889C3l44N57p1m8J2j38L23l00k37p9Q6n6J81l32M84n1N3k28K00J32k04j0jL07
3913B69n2Kj74p7j35R4J41k09K36j9o5k62P2L74k3j82J18k44M26j38%j19j42J92
3937H3P3r9M5j80K86j67R1j22j24K56k34J81j4p4M7j1J20l9l35j04J16K37j46
3960a14J44L0r6O9k01J52k03J0K42l89N07j68n5J18k82M03o0l22J99P2l52M26
3982A30k15Q8o5J54O9j83KJ0L20k26K23l18L5K07k78M2q4K36l30J67J45n2m3j14
4006h0k36K99L68n80M17k28j79M67j63q0l7k48N1L6J51K58r1m19L17Kj44J7o0
4029a62L19j48J34k81k00L86J14k13P7k03J22L13j27l42L02k71j0L01J04j99j51
4050a35K16mNk20QJ92j91R0R7O5l1l76M54l13K59n6q4J96J00r2l56r2M27P9j40
$$ y = [33, -311, 246, 175, 127, 139, 1, 324, 24, -213, -292, -206, -262, -81, -413, 71, 20, 73, -155, 45, 177, -27, -37, -38, 269, 217, 219, 45, -32, -167, -73, 68, -141, 95, 76, 11, -251, -179, 195, 172, -10, 108, -136, 290, 152, 152, 33, -109, 83, 156, 57, 102, -78, 208, 41, 132, 10, -114, 142, -92, 89, 75, 1, 48, 37, 157, 118, -217, -321, -205, 32, -114, 30, 60, -36, 33, -168, -16, -219, -209, 33, -356, 151, -17, -72, 46, -236, 167, 107, -215, -16, 56, -296, 130, -85, 3, -62, 92, 161, -22, -20, -10, 310, 84, 307, -11, 24, 231, -47, -5, -89, 147, -183, -16, 129, 77, 34, -80, -316, -17, 351, -229, 188, -40, -219, 248, 85, 5, -32, -280, -229, -193, -42, 216, 125, -294, 23, 25, -119, -102, -162, 157, 9, 143, -138, -338, 48, 162, -51, 26, -177, -55, 258, 131, -211, 91, -180, -190, 111, 215, 16, -135, 81, 77, 82, -138, -130, 62, -129, -39, 58, 123, 92, -284, 170, -143, 116, 60, -24, 172, 272, 180, -176, -268, 159, 238, 98]
4075I8M54o13j00J16J24K1m0Q0j03j68J29K29j57J33k17J14J60k37j29L30m19
4096a95K82k00l4J97kl2%J6j50J93J09k00k66Q2RK24n0j13k0j86L65l3J11k93
4120a86Q2l93L25L67j57j4o5n0K16m8r8P4j69J94J14r9j96M0J11J17r2l4J74j88
4144B5p9K43j47j68J96Q6J21n1l14K40j27J79Lmp1l97L95q8j41RK08L4L0l08l0
4169a56J14k15K52K03k12k20N01n59K10L5m1j16j2L57J10j62o6j83J76k25j5o8
4191b92O0R4L08O0m89J08p2l56M81lL58n06J3K47j70Q5k72J04K14j66J14j7J25
4214B8J8O4m8r8j9j52L3K21K96n59J38L75j27r4j43J12Q1J88k38L46k53Q0r0J04
4238B63l2k76Q8J2J61k66L25j15k07N7j10j58J60j59J58Q2L91j77k31j21k28M40
$$ y = [98, 552, -61, -161, -45, 79, 100, 60, 140, 37, -131, -2, 227, 70, 203, -14, 100, 260, 23, -106, 224, -195, 87, -113, -147, 50, 48, 16, 16, 32, -118, 75, 184, -16, -282, -200, -191, 33, -17, -130, -150, -336, 29, -4, 107, -186, -104, -497, -172, 195, 38, 24, -41, -91, 125, 77, -21, 53, -116, 78, 192, 93, -103, -63, 48, 165, 73, 39, 213, 25, -54, 189, 42, -126, 70, 156, 277, 226, -88, 152, 25, 204, 207, 203, 132, -265, 130, 42, -99, -90, 118, 152, 182, -126, -156, -42, -257, -5, 198, -14, -234, 267, -292, -82, -47, -88, -204, -216, 141, 251, 89, 23, -160, 16, -209, -224, -292, -232, -138, 170, 230, -259, -151, -223, -579, -98, -101, 257, -249, -236, 11, -159, -74, -346, -242, -28, -194, -80, -97, 28, 46, 110, 62, -36, -55, -207, -174, 47, 343, -216, -78, 297, 170, 76, -67, 45, 126, 314, 76, 422, 169, 249, 159, 263, 231, -45, 43, 55, 216, -50, 275, 160, -47, 10, -100, -258, -98, -257, -99, -17, 374, 197, -34, -155, -383, 57]
4260E7J15k71j5okJ71J95m92K54k60L46k77j0Q6j65J66Q1j50O4k76K12J06JN3
4284a7r6%j22J69L9j77K9R5J98J18k62q5q1L04n5L4J43l72j7N73l73n3q5J28K03
4309B38j03j25Q4m4J03K1n4r8R6j31N5J66j50l19J27O1R3J91n16K31k3L17l13
4332i3O2q1J08K5m07L68j83J47on4O1j34L0q5J92q1n0j68L72j02K22m0p4j20j81
4357b72L21J17k94k2k11K62k78M92l52l16N55Q0qL36n47O8j70K75j3N5k35o4M83
4380B62Mj86qp2K2J05qk28M4K76lR9l09Ko4o6J80Q3m3l2K4J18k85k4P1n3Q4J02
4408I5J9n0mj87J60J26m18K0mL07J06l91o5j23J48K04J37k96j15p7M02q7K51k51
4432i3j05M5J59P6j87J4k14K94j37L70j51k36J76k34K79k67Q5K00J97j14r8n1
$$ y = [57, 172, -99, -114, -120, -122, 49, 244, -248, 6, -254, 92, -185, -195, -109, -274, -108, -27, -177, -113, -389, -177, -71, -70, -17, -113, -113, -235, -66, -27, -204, -175, -80, 118, 236, -26, -111, -192, 112, 57, 91, 234, -138, -155, 418, 45, -8, -93, 35, 238, 135, 10, 94, 50, 153, 174, 120, 22, 118, -13, 42, 208, 58, -261, -134, -73, 20, 211, -305, -74, -97, 220, -93, -31, -112, -4, 21, -386, -18, -201, -54, -60, -114, -53, -187, -157, -242, -50, -131, -181, -349, 23, -79, 143, 103, 29, -91, -272, 49, 166, -128, -150, -361, -99, -377, 115, -237, -553, 2, 82, 74, 410, -137, -69, -239, 36, 23, 78, -157, -221, 262, 266, 80, 72, 0, 22, 127, 119, -109, -65, 211, 208, 307, -2, 0, -64, -130, 50, 133, 90, 58, 82, 200, -85, -109, -38, -91, -7, 95, 114, 64, 60, -127, 33, 159, -259, -239, -243, 64, 170, -221, -286, -409, -261, -57, 80, -216, -331, -408, -6, -93, 158, -93, -198, -153, 6, 82, -105, -91, -305, -11, -148, 222, 71, -165, 11, -223, 56, -211, -126, 74, 271, 157, 59, 8]
4454HQj8J10N6k04P7J80J8p9r0M4k12R3J03k46M0j44R0K81p0j13j92K73oN5J25
4480A87j05j77J03j1l0Mj35J66k53K74M4n3k34L9kJ26K01l33L7Q0J5J29n48J39
4504c37J02K42L17n14QJ14J18N4j21j61j52L26j30L08m64J84K5J00r4L49k37j11
4526g4J21KK2o2r4L0O3J27m04M34j11m20M01J61l23j16L29k15J87n4j54K78n1
4549G7K1J00l80M1J38J40j0l6k49M2K10r0J5k66J48o5J21J80k71K67R2l68M45
4572C02p42K32j31J78K03P9j99k79L02M7L2n3Pr7l2K88m16J59l4M8J77k07J59
4595B3j17J56j68K34Q5o9l40L69J0l6j00o3JK61J0k72r7rK21L15m3j22m89K91
4619E1O4j13O1j38O3j31O6L7J0k95L86J87j75j21k82N66j62R4j57p2R0m0Q0j50
$$ y = [8, 16, -2, 108, 164, -40, 37, 217, 235, 156, 66, 110, -102, -9, 94, -152, -112, -256, -166, 115, 45, -68, -260, 13, 7, 62, 187, 82, -95, 8, -3, -33, -29, -164, 2, -251, 23, 67, 14, -220, -181, -183, -57, 144, -189, -152, -72, -57, 72, -476, -337, -235, 7, 324, -190, -182, -68, 50, 104, -17, -178, -330, -4, -134, 174, -290, -106, -81, 19, -75, 274, 37, -74, 47, 49, 71, 9, -85, -55, 8, 135, -269, 165, 54, -366, 35, 196, -127, -243, 86, -129, 58, 4, -150, 128, 77, 98, 198, -182, -141, -3, 137, 127, 91, -158, -116, 94, 4, 19, -247, -99, -164, -43, 137, -134, 133, 225, -143, 302, -440, -208, -339, -161, 42, 121, -78, -357, -55, -8, 24, -29, -22, -119, -151, 137, -279, -120, -154, -106, 71, -136, 23, -94, 62, -106, 128, 213, 144, -196, 173, 183, 147, 47, -16, -15, 246, 256, -16, -113, -122, 99, 414, 371, 249, -240, 51, 115, 2, 63, -75, -12, -143, -77, -40, -30, -325, 61, 248, 73, -48, -330, 236, 74, 168, 11, -61, 29, -11, 69, -81]
4643h1J18j59O4p5K07N9j20m42J28L93J3J09l29nR4j02R5J63j83R8m5K2l4j44
4667a56K0L6J24L70l47j01N9N1k5j99q2J92J51J71J37p08L36K68l63L99l06j90
4689a63J83N8M02n34o9m7N27k31j26L0k79N29k63k2K58j42l76K66j08n8J80k67
4711b52J85o8J63j4l92J57K28J16j29O4q8j88L51j06n5k55K47O3p0K5P8l17r3
4734c50O67n0l92P1j16N73l75J07k20j46J01K3J01N3k32j2K46J63k15j9j0P3K09
4757B50k98J58k7l15M99j05q2j67r7K02N9m4l6j02K59k84J84R9j7l9j71L47N0
4780C23l47J5r3K06K3J9j29j39p7K27Jj80J00k30K06k4M8k48L46j75oJ29K6L3
4804E4j86K28j08n0R3M1L5j76O0J6k02K2q3M52k22NO8k85J76L15j80j24m6J68
$$ y = [-81, 37, -122, -58, -133, 74, 133, 13, -429, -301, 92, 105, 214, -115, -120, -26, -128, -33, 130, -53, 45, 0, 22, -12, -156, -136, -100, 24, 394, 47, -54, 5, 56, 31, -168, -250, -58, 93, 264, 401, -307, 29, 297, -66, 333, 27, -163, 20, 78, 480, -54, -123, -170, 357, 126, 0, 30, -249, 280, 17, -5, 253, 111, -265, 1, -107, -165, 15, -252, -67, -135, 28, 14, -378, -221, 7, 123, -6, 58, -30, -218, 133, 27, -28, -283, -36, 27, -43, -18, 60, -257, -350, 317, 267, -125, -54, -170, 403, 28, 135, -85, -231, -130, -107, -6, 47, -185, -197, 49, 212, -3, -22, -32, 41, 250, -48, 110, 83, -232, 267, 162, 80, -87, -184, 18, 77, 33, -3, -105, 154, -130, 54, 153, 136, 97, -74, 273, 323, -24, -9, -102, 104, 127, 146, 17, -122, -199, 28, 29, -151, -51, -281, -75, -99, -51, -299, 47, -128, -134, -5, 21, 54, -132, 96, -12, -62, 31, 72, 107, -69, -9, 7, -195, -173, -256, 196, -26, -21, 47, -238, -62, 253, 73, -51, -97, 71]
4828G1J75k75k14M43k17L87l11j15r9N3L6L64l62n6K98m6K60l46j53K24Nj31J28
4851A19j02m3L8J78o1J95m67JN2M17j63k03O0l82N42N4l68k18K23J93K4M5j03
4874C1j60n0L55Q0n14J41j02K51M4j01L9q4J86j07qK47l73M4Q4q8J71k9k4j78
4898a45o9K87L17n63K01l12K84l0Q1k69J78J52j27p9J36j64M3o1J00J09l02K73
4920D0J20Qm17M72j69J9j03j9m2j17L08j71J30k61K65m56K27L60j92j50M3o5N8
4943a12K73m89J27K99k03m2J83j47J58P0J76k03k54o1M03k20K7K3r0J25o4K31
4965B10k36k6o7K5K58N1l48K59o5L0j21M6L6O0j9O7j1j07P1r5R2K65o72K42l2
4990h7M5J36k1k44J94j15J85Q6m1n0k54n6K66j09N4L9l68M09J95J17o32r8K05
$$ y = [71, 246, -29, -243, 200, -17, 370, 59, -56, -155, -102, -66, 298, -64, -120, 178, 132, 392, 46, -107, 117, 122, -9, 119, 17, -26, 12, 190, 129, 324, -143, -142, -90, 327, 164, -39, 21, -361, 181, 235, -133, -351, -128, 65, 89, 134, 31, -129, -179, 176, 256, -258, -117, -219, 32, 76, -25, 14, -70, 116, 9, 1, 248, -125, -81, 3, -85, 86, 57, 33, -145, -214, 73, 390, -173, 28, -284, 0, -30, 51, -218, -40, 112, -15, -94, 42, -122, -79, -140, -40, 69, -233, 40, 160, 168, -249, 223, 54, 73, -30, -49, -91, -208, 100, -71, 59, -202, 63, -393, -166, 194, 2, -148, -105, -170, -112, 161, -328, -201, 98, -105, -147, 36, -111, 47, 117, 293, 90, -164, -225, 178, -42, -15, 8, -82, 43, -21, 210, -26, -52, -119, -94, 164, 215, -133, 126, 61, 91, -30, 16, 52, 112, 93, 160, 149, 42, 113, 18, 110, 375, -297, -55, -87, -42, 94, 73, -171, 23, -92, 93, 179, 138, 88, -166, -222, 44, -65, -11, 28, -340, 69, 264, 381, -251, -349, -144]
5013a44J23K43k35j36N3K31M9k93O8L9j39L69K4k64j8j50J39q0J57k2q6j07L46
5036A67k51K45k85Q9J34P4j4j36r9m7M37J02o17j57P50j61k22MJ18j84J45Q1K44
5059D17n54n3Q7L09j32Q1k60J35l6K3l4n9NM7m4J71J57m21%K40k00L9J20k15N5
5084a22J19P5m33L1J80K81P0m66m1K19n0j3L48k74k73M36k15K46j1k25J39j21
5106a00M10N3k38k99J9L36k40R8l3jJ38Q1Q8k6l90J04K51Mm63K56j22J39K14l34
5130e5J43N2j29K42L6k79P5J26n3J41m88J44J10K34L6K9m19p7J80j50K49k94K18
5153G1l93M09k03n0K49j73n3J30n7j30J36k91J06K47P9k43r8K19j41L81j6m68
5175b89j25L32J0J04j24J9n3K05j14j32r6L15j35J55J7k99J94j37K30M7J51m08
$$ y = [-144, -21, 222, -13, -149, -96, 135, 184, -109, -41, -2, -141, 228, 252, -12, -30, -180, -41, -121, 36, 14, -72, -179, 167, -84, 161, -124, -35, 99, 173, 159, 23, -76, -123, 314, 416, -201, -358, 392, 231, 9, 13, 131, -53, 92, 173, 417, -137, -190, -103, 206, 74, 155, -105, 30, -6, 17, -17, -76, -71, -24, -68, 103, 260, -161, -161, 79, -121, -82, 38, -177, -122, -3, 72, -361, -330, -150, 131, 201, -265, -306, -87, -137, -150, 198, -76, -349, 87, -128, 118, 107, -118, 21, -100, 310, 363, 125, -174, -155, 181, -59, 39, 6, 5, 143, 224, 312, 286, -104, 0, 251, 255, -208, 48, -74, 65, 279, -55, 88, 140, 11, 253, 289, 10, 85, 211, 158, 299, -189, -45, 65, 299, 335, 364, -55, -132, 48, -102, 147, -147, 71, -322, 87, -116, -166, 83, -90, -143, -13, -70, -200, -64, -355, -249, -2, 77, -166, -264, -45, -186, 195, 179, -289, -414, -82, -72, 32, -92, -73, -126, 79, -35, -167, -263, 52, -83, 72, 89, -210, -16, -153, 77, 124, 275, -133]
5197a33Q3J50j36K80o6k21L58k35K73m71J28R5J84p7Q1m9l48k3K29j12r4K9L75
5220C00l6N5j73p1Q5j66L33j01l16P3J1J04j0q9k15J9J15K18l6k94R1J38j59J05
5244a9l96K62p4L18K5j79k39o4J04K94k9k35J81j43J51J76j61k2p3p5L83J98j73
5267B10k39j68L44K6j06N4Q9P3jj15j94N5J96J30k17j79P2k79J65L63K6l94k9
5290a18k07O65k63q3j71N0J57rK24j03l82K37J69o4K6M6n8j44J24o5j78K50j02
5313AK44k71j33m05O15j32K29l16n2j08L81Rk01J45n52K56K75J47j10j46K21k79
5335a82J69l8k86K53k22N48qj95n2K6k5K25J0j11m06P8L96n1L5k27O1J89nJ57
5359C39o02k3L22q3J28M6o8mR1j68J09j70O0J23o3l7K0j63l4R1J55j76j36MJ87
$$ y = [-133, -50, 100, -36, 244, 178, -43, 315, 80, 353, -118, 10, 105, 289, 212, 293, 244, -104, -127, 102, -10, -104, -75, 300, 264, 319, 146, 75, 160, -6, 327, 226, -90, -17, -6, 98, 88, -1, -216, -197, -82, 136, 100, -194, -103, 35, -124, -19, -415, -153, -227, 91, 116, -63, -302, -366, -262, 32, 3, -232, -51, -194, -43, 133, -28, -50, -123, -198, 185, 383, 210, -29, -197, 147, 173, 67, 121, 210, 283, 282, 167, -27, 28, 224, 354, 137, -42, 30, -249, -84, 279, 305, -89, -118, -325, 340, 77, -6, -177, -127, 30, 21, 245, 142, -240, -3, 166, 102, 128, 174, 116, -28, 96, 31, -147, 103, 1, 245, -26, -159, -564, 51, -81, 148, -168, -220, -328, 53, 62, -139, 6, -546, -290, -15, 132, 22, -124, 97, -182, -13, -51, -337, -84, -306, 242, 234, 39, -13, 13, -12, 213, 223, 112, -294, -216, 180, 129, 164, -63, -2, 187, 182, 339, -263, -286, 36, -47, 81, 127, 59, 55, 146, -22, 87, -83, -23, 100, 37, 0, 20, -143, -177, -86, 69, -107, -243, -239, -52]
$$ [...]
8191A96
##END NTUPLES=NMR FID
##END=
