##TITLE=1H_Pr 11
 CDCl3
 8 sc, 
 6.04.2022
##JCAMPDX= 6.0         $$ Bruker NMR JCAMP-DX V2.0
##DATA TYPE= NMR FID
##DATA CLASS= NTUPLES
##ORIGIN= UXNMR, Bruker Analytische Messtechnik GmbH
##OWNER= root
$$ XWIN-NMR		Version 3.5
$$ Wed Apr  6 14:04:25 2022 Russian Standard Time (UT+4h)  she@DPX200
##.OBSERVE FREQUENCY= 200.131346
##.OBSERVE NUCLEUS= ^1H
##.DELAY= (6, 6)
##.ACQUISITION MODE= SIMULTANEOUS
##.ACQUISITION SCHEME= undefined
##.AVERAGES= 8
##.DIGITISER RES= 18
##SPECTROMETER/DATA SYSTEM= spect
##.PULSE SEQUENCE= zg30
##.SOLVENT NAME= CDCl3
##.SHIFT REFERENCE= (INTERNAL, CDCl3, 0, 15.7039)
##AUDIT TRAIL= $$ (NUMBER, WHEN, WHO, WHERE, WHAT)
$$ ##TITLE= Audit trail, XWIN-NMR		Version 3.5
$$ ##JCAMPDX= 5.01
$$ ##ORIGIN= Bruker BioSpin GmbH
$$ ##OWNER= she
$$ F:/spectra/data/she/nmr/H-F/1/audita.txt
$$ ##AUDIT TRAIL=  $$ (NUMBER, WHEN, WHO, WHERE, WHAT)
(   1,<2022-04-06 14:03:34.71 +0400>,<she>,<DPX200>,
      <created by zg, POWCHK disabled, PULCHK disabled
       configuration hash MD5:
       00 E9 B6 7A A2 85 ED C7 34 08 36 98 17 FE 4E 26
       data hash MD5: 16K
       F8 E9 B4 30 47 D7 29 55 8D 9D FE 51 2F 45 FF 51>)
$$ ##END=
$$ 
$$ hash MD5
$$ A9 A2 88 EB 5A 76 15 D1 37 88 50 AC 09 87 B6 05
##$RELAX= 
##$RELAX= 
##$RELAX= 
##$RELAX= 
##$RELAX= 
##$RELAX= 
$$ Bruker specific parameters
$$ --------------------------
##$DU= <F:/spectra>
##$EXPNO= 1
##$NAME= <H-F>
##$PROCNO= 1
##$TYPE= <nmr>
##$USER= <she>
##$AMP= (0..31)
100 100 100 100 100 100 100 100 100 100 100 100 100 100 100 100 100 100 
100 100 100 100 100 100 100 100 100 100 100 100 100 100 
##$AQSEQ= 0
##$AQ_mod= 1
##$AUNM= <au_zg>
##$AUTOPOS= <>
##$BF1= 200.13
##$BF2= 200.13
##$BF3= 200.13
##$BF4= 200.13
##$BF5= 200.13
##$BF6= 200.13
##$BF7= 200.13
##$BF8= 200.13
##$BYTORDA= 1
##$CFDGTYP= 0
##$CFRGTYP= 5
##$CHEMSTR= <none>
##$CNST= (0..31)
1 1 145 1 1 1 1 1 1 1 1 1 1 1 1 1 1 1 1 1 1 1 1 1 1 1 1 1 1 1 1 1 
##$CPDPRG= <>
##$CPDPRG1= <>
##$CPDPRG2= <>
##$CPDPRG3= <>
##$CPDPRG4= <mlev>
##$CPDPRG5= <mlev>
##$CPDPRG6= <mlev>
##$CPDPRG7= <mlev>
##$CPDPRG8= <mlev>
##$CPDPRGB= <>
##$CPDPRGT= <>
##$D= (0..31)
0 1.2 0 0 0 0 0 0 0 0.06 0 0.03 0 0 0 0 0.0002 0 0 0 0 0 0 0 0 0 0 0 0 
0 0 0 
##$DATE= 1649239414
##$DBL= (0..7)
120 120 120 120 120 120 120 120 
##$DBP= (0..7)
150 150 150 150 150 150 150 150 
##$DBP07= 0
##$DBPNAM0= <>
##$DBPNAM1= <>
##$DBPNAM2= <>
##$DBPNAM3= <>
##$DBPNAM4= <>
##$DBPNAM5= <>
##$DBPNAM6= <>
##$DBPNAM7= <>
##$DBPOAL= (0..7)
0.5 0.5 0.5 0.5 0.5 0.5 0.5 0.5 
##$DBPOFFS= (0..7)
0 0 0 0 0 0 0 0 
##$DE= 6
##$DECBNUC= <off>
##$DECIM= 32
##$DECNUC= <off>
##$DECSTAT= 4
##$DIGMOD= 1
##$DIGTYP= 9
##$DL= (0..7)
0 120 120 120 120 120 120 120 
##$DP= (0..7)
150 150 150 150 150 150 150 150 
##$DP07= 0
##$DPNAME0= <>
##$DPNAME1= <>
##$DPNAME2= <>
##$DPNAME3= <>
##$DPNAME4= <>
##$DPNAME5= <>
##$DPNAME6= <>
##$DPNAME7= <>
##$DPOAL= (0..7)
0.5 0.5 0.5 0.5 0.5 0.5 0.5 0.5 
##$DPOFFS= (0..7)
0 0 0 0 0 0 0 0 
##$DQDMODE= 0
##$DR= 18
##$DS= 0
##$DSLIST= <SSSSSSSSSSSSSSS>
$$ [...]
##$SUBNAM2= <"">
##$SUBNAM3= <"">
##$SUBNAM4= <"">
##$SUBNAM5= <"">
##$SUBNAM6= <"">
##$SUBNAM7= <"">
##$SUBNAM8= <"">
##$SUBNAM9= <"">
##$SW= 18.0517287032376
##$SWIBOX= (0..15)
0 0 2 0 0 0 0 0 0 0 0 0 0 0 0 0 
##$SW_h= 3612.71676300578
##$TD= 16384
##$TD0= 1
##$TE= 0
##$TE2= 300
##$TE3= 300
##$TEG= 300
##$TL= (0..7)
0 120 120 120 120 120 120 120 
##$TP= (0..7)
150 150 150 150 150 150 150 150 
##$TP07= 0
##$TPNAME0= <>
##$TPNAME1= <>
##$TPNAME2= <>
##$TPNAME3= <>
##$TPNAME4= <>
##$TPNAME5= <>
##$TPNAME6= <>
##$TPNAME7= <>
##$TPOAL= (0..7)
0.5 0.5 0.5 0.5 0.5 0.5 0.5 0.5 
##$TPOFFS= (0..7)
0 0 0 0 0 0 0 0 
##$TUNHIN= 0
##$TUNHOUT= 0
##$TUNXOUT= 0
##$USERA1= <user>
##$USERA2= <user>
##$USERA3= <user>
##$USERA4= <user>
##$USERA5= <user>
##$V9= 5
##$VALIST= <valist>
##$VCLIST= <CCCCCCCCCCCCCCC>
##$VD= 0
##$VDLIST= <DDDDDDDDDDDDDDD>
##$VPLIST= <PPPPPPPPPPPPPPP>
##$VTLIST= <TTTTTTTTTTTTTTT>
##$WBST= 1024
##$WBSW= 4
##$XGAIN= (0..3)
0 0 0 0 
##$XL= 0
##$YL= 0
##$YMAX_a= 227373
##$YMIN_a= -312382
##$ZGOPTNS= <>
##$ZL1= 120
##$ZL2= 120
##$ZL3= 120
##$ZL4= 120
##$ABSF1= 10
##$ABSF2= 0
##$ABSG= 5
##$ABSL= 3
##$ALPHA= 0
##$AQORDER= 0
##$ASSFAC= 0
##$ASSFACI= 0
##$ASSFACX= 0
##$ASSWID= 0
##$AUNMP= <proc_1d>
##$AZFE= 0.1
##$AZFW= 0.1
##$BCFW= 1
##$BC_mod= 2
##$BYTORDP= 1
##$COROFFS= 0
##$CY= 11.3945322036743
##$DATMOD= 1
##$DC= 2
##$DFILT= <>
##$DTYPP= 0
##$F1P= 2.36226072786647
##$F2P= -0.459571619588291
##$FCOR= 0.5
##$FTSIZE= 0
##$FT_mod= 4
##$GAMMA= 1
##$GB= 0.15
##$INTBC= 1
##$INTSCL= 1
##$ISEN= 128
##$LB= 0.24
##$LEV0= 0
##$LPBIN= 0
##$MAXI= 10000
##$MC2= 0
##$MEAN= 0
##$ME_mod= 0
##$MI= 1.114404
##$NCOEF= 0
##$NC_proc= 0
##$NLEV= 6
##$NOISF1= 3.799351
##$NOISF2= 2.8
##$NSP= 1
##$NTH_PI= 0
##$NZP= 0
##$OFFSET= 15.70392
##$PC= 1
##$PHC0= -18032.36
##$PHC1= 17.00078
##$PH_mod= 1
##$PKNL= yes
##$PPARMOD= 0
##$PSCAL= 0
##$PSIGN= 0
##$REVERSE= no
##$SF= 200.130013532006
##$SI= 16384
##$SIGF1= 3
##$SIGF2= 2
##$SINO= 400
##$SIOLD= 16384
##$SREGLST= <1H.CDCl3>
##$SSB= 0
##$STSI= 0
##$STSR= 0
##$SW_p= 3612.71676300578
##$SYMM= 0
##$S_DEV= 0
##$TDeff= 0
##$TDoff= 0
##$TI= <>
##$TILT= no
##$TM1= 0
##$TM2= 0
##$TOPLEV= 0
##$USERP1= <user>
##$USERP2= <user>
##$USERP3= <user>
##$USERP4= <user>
##$USERP5= <user>
##$WDW= 1
##$XDIM= 8192
##$YMAX_p= 0
##$YMIN_p= 0
$$ End of Bruker specific parameters
$$ ---------------------------------
##NTUPLES= NMR FID
##VAR_NAME=  TIME,          FID/REAL,        FID/IMAG
##SYMBOL=    X,             R,               I
##VAR_TYPE=  INDEPENDENT,   DEPENDENT,       DEPENDENT
##VAR_FORM=  AFFN,          ASDF,            ASDF
##VAR_DIM=   8192,          8192,            8192
##UNITS=     SECONDS,       ARBITRARY UNITS, ARBITRARY UNITS
##FACTOR=    0.0002768,     1,               1
##FIRST=     0,             0,               0
##LAST=      2.2672688,     0,               0
##MIN=       0,             -312382,         0
##MAX=       2.2672688,     227373,          0
$$ Real data points
##PAGE= N=1
##DATA TABLE= (X++(R..R)), XYDATA
$$ [...]
$$ plain form
2620 927 -2203 -1954 1115 2557 894 -1921 -1610 1184 2155 -311 -1752 -982 348 1478 683 -2134
2636 -2134 -851 165 838 308 -1345 -2022 706 2434 1296 -2947 -1782 1037 1907 -987 -3256 -1447
2652 -1447 1439 1308 -9 -1621 -2384 -827 2294 1832 -1137 -3279 729 3104 1898 -2239 -2111 -312
2668 -312 2304 2157 -1668 -2983 -674 2147 1690 -1055 -2681 -902 1025 2250 -142 -1946 -2403 1375
2684 1375 1239 -86 -1435 -123 1037 1305 -391 -1621 -1096 468 1926 199 -1080 -497 455 2120
2700 2120 138 -2424 -1233 885 1746 -181 -2091 -599 259 1542 -113 -1078 -790 972 1492 642
2716 642 -998 -1354 526 2016 1069 -1223 -1982 1188 2594 88 -152 -2471 151 1974 1058 -1042
2732 -1042 -1858 -566 194 213 -772 -2044 -947 1543 625 -697 -1699 -382 965 1762 -716 -374 -872
$$ packed form
2620I27l130K49L069J442j663k815L11K794R71k466j441P70J330J130p95k817
2636b134J283J016O73n30j653o77K728J728j138m243J165K819Q70k894k269J809
2652a447K886j31j317j612p63J557L121m62k969k142M008K375j206m137J28J799
2668c12K616j47l825j315K309K821m57k745j626J779J927J225k392j804m57L778
2684A375j36j325j349J312J160K68j696j230N25J564J458j727j279N83R52J665
2700B120j982k562J191K118Q61j927j910J492Q58J283j655r65K88J762N20q50
2716F42j640l56J880J490r47k292p59L170J406k506k40k319K622J823r16k100
2732a042q16J292P60J9r85j272J097K490r18j322j002J317J347P97k478L42m98
$$ plain form
2749 -872 985 962 194 -459 -721 858 1633 417 -503 -697 432 965 -148 -821 -1268 1015 578 -185
2767 -185 -1025 -446 -20 -768 -621 917 126 -319 363 -535 -1530 -636 -668 923 -192 -849 -535 905 1589
2786 1589 -642 -1605 -654 406 1011 323 -1770 -1099 -133 305 1270 -971 -1122 63 842 1777 -714 -1363
2804 -1363 -1421 736 1265 -69 -883 263 440 -58 1437 -446 -832 289 653 210 548 -415 -514 1432
2822 1432 -121 1507 872 73 71 -1015 -19 1103 -222 -1263 -388 172 997 -202 -259 -807 -73 -165 666
2841 666 314 295 -949 -953 1275 1932 -1237 -961 -1489 -75 653 84 -1635 -1057 -314 1257 772 -21 -852
2860 -852 -2036 1119 817 1147 -2065 -649 -547 -1 1004 -349 -737 -63 -786 723 1311 974 -1523
2877 -1523 -135 271 1313 -134 -757 -741 -319 1354 1656 -169 -3033 -1709 186 1598 -3 127 -1501
$$ packed form
2749h72J857k3p68o53k62J579P75j216r20j94J129N33j113o73m47K283m37p63
2767a85q40N79M26p48J47J538p91m45O82q98r95Q94l2J591j115o57L14J440O84
2786A589k231r63R51J060O05o88k093O71R66M38R65k241j51J185P79R35k491o49
2804a363n8K157N29j334q14J146J77m98J495j883l86J121L64m43L38r63r9J946
2822A432j553J628o35p99kj086R96J122j325j041Q75N60Q25j199n7n48P34r2Q31
2841F66l52j9j244mK228O57l169K76n28J414P28n69j719N78P43J571m85p93q31
2860h52j184L155l02L30l212J416J02N46J005j353l88O74p23J509N88l37k497
2877a523J388M06J042j447o23J6M22J673L02j825k864J324J895J412j601J30j628
$$ plain form
2894 -1501 -311 610 1005 -130 -1301 -324 -116 828 756 -1313 -1185 -870 1003 1946 807 60 -1072 -631
2912 -631 1830 2114 -1638 -1029 -659 768 775 1538 -911 -1400 -135 41 1847 -3 -776 -1953 479 1992
2930 1992 1386 -632 -1389 -845 531 1679 479 -987 -1054 -226 220 919 -9 -803 -1083 884 1916 1626
2948 1626 -664 -1584 112 525 630 405 -1706 -373 589 2567 383 -1700 -2006 -1054 1223 1988 844
2965 844 -2128 -1150 154 2203 1897 137 -1787 -1832 1296 1005 790 -468 -565 -817 585 863 110 -1274
2983 -1274 -1206 -1272 2250 -856 -929 -1705 -383 1003 -203 -243 -1204 -412 -1736 82 820 -566 -1893 -1280
3001 -1280 -525 1462 1779 -1472 -1475 -1179 798 1439 209 -843 -1393 -432 1044 522 -1254 -393 -403 1077
3019 1077 1733 194 -1665 -543 -387 1260 392 -679 -1220 -1037 1370 2097 732 -1238 -857 1133 1433
$$ packed form
2894a501J190R21L95j135j171R77K08R44p2k069J28L15J873R43j139p47j132M41
2912f31K461K84l752O09L70J427PP63k449m89J265J76J806j850p73j177K432J513
2930A992o06k018p57N44J376J148j200j466o7Q28M46O99r28p94k80J967J032k90
2948A626k290r20J696M13J05k25k111J333R62J978k184k083l06R52K277P65j144
2965H44k972R78J304K049l06j760j924m5L128k91k15j258r7k52J402K78p53j384
2983a274O8o6L522l106p3p76J322J386j206m0r61P92j324J818P38j386j327O13
3001a280P55J987L17l251lK96J977O41j230j052n50R61J476n22j776Q61j0J480
3019A077O56j539j859J122J56J647q68j071n41J83K407P27j365j970L81J990L00
$$ plain form
3036 1433 167 -445 -180 298 -687 -580 208 -520 47 -127 -230 557 -709 161 -149 -478 -436 718 375
3055 375 973 -1162 -146 49 474 1031 -1565 -1357 427 1451 -155 -978 -1958 801 -169 1770 448
3072 448 -1760 -643 1660 2508 -239 -1928 -793 833 500 17 -769 -513 -621 1243 217 -279 -587
3089 -587 -414 1146 811 -907 -522 -276 939 848 -780 242 558 43 226 -1003 -2028 1426 738 472
3107 472 -886 -754 -163 -204 415 -481 -721 -421 2181 671 -498 -567 85 1696 94 -1463 -729 566
3125 566 386 392 480 -570 -366 2396 580 -1349 -1174 -1219 1114 693 59 -1561 -828 1082 25 -741 -1633
3144 -1633 316 1419 1570 -354 -1991 -1042 1026 1165 90 -428 83 1712 422 384 -1252 -1388 1264
3161 1264 1200 1067 -1693 -73 1400 472 1251 -882 -1399 419 1258 401 -1149 -802 -9 897 138 -753
$$ packed form
3036A433j266o12K65M78r85J07P88p28N67j74j03P87j266Q70l10l29M2J154l43
3055C75N98k135J016J95M25N57k596K08J784J024j606q23r80K759r70J939j322
3072D48k208J117K303Q48k747j689J135J626l33m83p86K56j08J864j026m96l08
3089e87J73J560l35j718L85K46J215r1j628J022L16n15J83j229j025L454o88k66
3107D72j358J32N91m1O19q96k40L00K602j510j169o9O52J611j602j557P34J295
3125E66j80OQ8j050K04K762j816j929J75m5K333m21o34j620P33J910j057p66q92
3144a633J949J103J51j924j637R49K068J39j075n18N11J629j290l8j636j36K652
3161A264o4j33k760J620J473r28P79k133n17J818Q39q57j550L47P93R06p59q91
$$ plain form
3179 -753 -307 209 725 1228 -515 -662 -139 -204 985 -201 -906 873 726 245 -36 -1348 149 975
3197 975 -284 -739 -26 -580 1238 -193 -293 -674 -542 2044 328 -981 -1756 -289 1740 1295 -718
3214 -718 -916 -425 1632 1807 1032 -876 -1105 -156 2117 -377 -842 -1136 -220 1765 713 -725 -1108 -556
3232 -556 1208 -384 -1030 19 -660 1226 723 894 370 -386 -566 65 -757 53 -734 310 799 63
3250 63 -73 734 879 204 -1996 228 649 1006 147 389 -66 -521 -1003 632 18 -1069 -1635 1517 -754
3269 -754 -988 -846 202 269 182 -669 -745 -448 1215 570 -612 130 -560 -401 355 967 -411 -336 689 1919
3289 1919 1259 -319 -599 -195 1194 579 -223 385 -562 -408 -532 -542 453 504 -54 -85 -686 -63 -82 429
3309 429 -862 113 461 -429 795 -638 -961 138 143 710 -386 -1147 -629 461 587 -97 539 141 1026
$$ packed form
3179g53M46N16N16N03j743j47N23o5J189j186p05J779j47m81k81j312J497Q26
3197I75j259m55P13n54J818j431j00l81J32K586j716j309p75J467K029m45k013
3214g18j98M91K057J75p75j908k29R49K273k494m65k94R16J985j052j438l83N52
3232e56J764j592o46J049o79J886n03J71n24p56j80O31q22Q10p87J044M89p36
3250F3j36Q07J45o75k200K224M21L57q59K42m55m55m82J635o14j087n66L152k271
3269g54k34J42J048O7q7q51p6K97J663o45j182P42o90J59P56O12j378P5J025J230
3289A919o60j578k80M04J389o15q02O08r47J54j24j0R95N1n58l1o01O23j9N11
3309D29j291R75L48q90J224j433l23J099NN67j096p61N18J090J26o84O36l98Q85
$$ plain form
3328 1026 780 663 -543 708 -181 133 -957 234 77 -675 -47 938 46 182 -173 -148 577 27 -1269
3347 -1269 183 329 -873 636 582 -285 -387 261 274 126 -206 -781 -1090 257 -345 -508 112 -981 514
3366 514 746 344 627 1059 -1160 457 -831 -88 -311 66 126 164 1217 -572 -27 -611 293 -105 691
3385 691 -271 365 25 -208 1005 -441 -1979 630 319 290 1177 -76 -556 -194 1465 -511 -90 157
3403 157 -471 -391 61 -382 -33 699 604 -515 -582 1164 -100 -205 -4 -513 -609 -465 -884 -396 -14 -132
3423 -132 115 777 -766 -237 102 211 -411 -1309 9 430 -104 544 -195 -835 -938 589 443 -1142 -698
3442 -698 -767 291 431 94 -474 -535 -382 -302 780 -362 242 -1176 365 1167 -450 506 -699 -332 53
3461 53 385 -513 -1120 -274 -1231 317 1200 -350 -1071 374 -69 331 -33 -792 -399 -1191 31 1487 323
$$ packed form
3328A026k46j17j206J251q89L14j090J191j57p52O28R85q92J36l55K5P25n50j296
3347a269J452J46j202J509n4q67j02O48J3j48l32n75l09J347o02j63O20j093J495
3366E14K32m02K83M32k219J617j288P43k23L77O0L8J053j789N45n84R04l98P96
3385F91r62O36l40k33J213j446j538K609l11k9Q87j253m80L62J659j976M21K47
3403A57o28Q0M52m43L49P32r5j119o7J746j264j05K01n09r6J44m19M88L82j18
3423a32K47O62j543N29L39J09o22q98J318M21n34O48p39o40j03J527j46j585M44
3442f98o9J058J40l37n68o1J53Q0J082j142O04j418J541Q02j617R56j205L67L85
3461E3L32q98o07Q46r57J548Q83j550p21J445m43M00l64p59L93p92J222J456j164
$$ plain form
3480 323 -442 -1062 4 -42 1933 268 -497 182 349 734 -456 534 -1091 54 -295 1223 347 -497
3498 -497 99 -368 368 700 -75 -643 237 170 370 406 -39 -1602 -485 247 -326 -320 -1305 -1275 -1057 -191 427
3519 427 -1019 -1041 1792 295 33 -1407 -325 -861 53 1827 -457 -376 -359 -1090 463 158 74 30 -720
3538 -720 -747 596 -101 145 239 -899 200 170 675 -1151 -1191 -606 1238 90 -143 -1011 -696 -591 -52
3557 -52 1535 -65 -80 -1009 197 953 -313 -1206 -735 321 671 568 -192 -295 -973 224 1145 264 -847
3576 -847 -1169 263 1840 410 -858 -750 -172 -149 -371 -11 -330 830 -70 110 -255 215 638 97 -58
3595 -58 903 116 -92 -116 339 -574 130 958 109 -980 -1295 -163 -51 -857 -296 -599 30 714 704 -636
3615 -636 -556 -481 820 814 -490 -1059 -228 268 1447 -316 202 -93 -34 240 -100 285 5 206 -16 337
$$ packed form
3480C23p65o20J066m6J975j665p65O79J67L85j190R90j625J145l49J518q76q44
3498d97N96m67P36L32p75n68Q80o7K00L6m45j563J117P32n73Or85L0K18Q66O18
3519D27j446k2K833j497k62j440J082n36R14J774k284Q1J7p31J553l05q4m4p50
3538g20k7J343o97K46R4j138J099l0N05j826m0N85J844j148k33q68L15J05N39
3557e2J587j600j5r29J206P56j266q93M71J056L50j03p60j03o78J197R21q81j111
3576h47l22J432J577j430j268J08N78K3k22L60l19J160r00J80l65M70M23n41j55
3595e8R61p87k08k4M55r13P04Q28q49j089l15J132J12q06N61l03O29O84j0j340
3615f36Q0P5J301oj304n69Q31M96J179j763N18k95N9K74l40L85k80K01k22L53
$$ plain form
3635 337 570 -407 -845 22 789 -135 -1002 -449 973 612 -101 -846 -693 212 -793 -354 -905 -213 25
3654 25 184 -696 -714 45 951 1119 -508 -32 376 -348 1130 -350 -806 436 1429 -349 -1295 -725 -428
3673 -428 307 27 -788 31 -204 696 34 806 -116 473 603 183 1512 -1604 -423 299 776 544 828
3692 828 223 802 1211 260 -958 -354 -237 -166 583 -1091 -110 -307 -123 237 10 -1714 -1186 550 184
3711 184 -1119 25 -255 -11 1007 21 -200 145 1010 -7 -7 -344 124 1182 -276 473 -570 -152
3729 -152 797 25 147 -206 831 212 517 -124 -145 446 -174 -25 -294 3 -293 94 618 -328 266 -213
3749 -213 170 314 -226 -230 -607 809 1360 -341 -819 -186 26 418 -832 792 -353 -248 639 1327 -382
3768 -382 -836 291 231 603 -371 -754 -118 763 1033 -432 -184 -711 261 134 1554 -97 -181 -396 -51
$$ packed form
3635C37K33r77m38Q67P67r24q67N53J422l61p13p45J53R05j005M39n51O92K38
3654B5J59q80j8P59R06J68j627M76M08p24J478j480m56J242R93j778r46N70K97
3673d28P35k80q15Q19k35R00o62P72r22N89J30m20J329l116J181P22M77k32K84
3692H28o05N79M09r51j218O04J17P1P49j674R81j97J84L60k27j724N28J736l66
3711A84j303J144k80K44J018r86k21L45Q65j017%l37M68J058j458P49j043M18
3729a52R49p72J22l53J037o19L05o41k1N91o20J49k69K97k96L87N24r46N94m79
3749b13L83J44n40ml77J416N51j701m78O33K12L92j250J624j145J05Q87O88j709
3768c82m54J127o0L72r74l83O36Q81K70j465K48n27R72j27J420j651q4k15L45
$$ plain form
3787 -51 -304 -342 645 -472 288 -431 -269 72 956 -418 -784 -543 1105 625 -712 -1094 245 -94 360
3806 360 578 342 80 -1052 518 1178 -324 -1039 -442 538 520 -69 -772 348 169 -24 1166 -195
3824 -195 -174 -850 5 -477 -346 -965 -82 604 907 -106 288 150 166 1924 735 47 403 55 415 336
3844 336 662 671 225 137 221 -109 216 -15 -154 -289 12 481 368 418 -775 381 437 535 -362 -370 -520 -835
3866 -835 253 -211 645 -130 220 141 51 -371 -280 48 -8 671 179 -710 115 -295 -229 -1133 70 -130 -693
3887 -693 -230 694 -510 -87 396 527 205 -8 356 -317 -444 -196 97 391 -96 -259 -524 196 606 -1141
3907 -1141 -635 423 -292 639 631 -346 -82 -184 1067 -307 89 81 58 -669 -139 148 -659 -577 271 449 51
3928 51 -917 -301 -400 621 -409 -238 1064 -532 -155 452 335 131 -163 362 -201 -585 372 27 460
$$ packed form
3787e1k53l8R87j117P60p19J62L41Q84j374l66K41J648m80j337l82J339l39M54
3806C60K18k36k62j132J570O60j502p15N97R80j8n89p03J120j79j93J190j361
3824a95K1o76Q55m82J31o19Q83O86L03j013L94j38J6J758j189o88L56l48L60p9
3844C36L26Rm46q8Q4l30L25k31j39j35L01M69j13N0j193J156N6R8q97qj50l15
3866h35J088m64Q56p75L50p9r0m22R1L28n6O79m92q89Q25m10O6r04J203k00n63
3887f93M63R24j204M23M83J31l22k13L64o73j27K48K93K94m87j63k65P20M10j747
3907a141N06J058p15R31qr77K64j02J251j374L96qk3p27N30K87q07Q2Q48J78l98
3928E1r68O16r9J021j030J71J302j596L77O07j17k04k94N25n63l84R57l45M33
$$ plain form
3947 460 -1205 181 193 -169 103 1299 -594 684 795 180 290 -185 -362 -725 -98 763 717 -860 678
3966 678 526 247 -63 557 1112 777 306 1133 -955 471 1272 561 -218 66 -15 -651 -120 -224 655 175
3986 175 -1 8 938 -609 -208 -92 -119 732 1033 -241 -317 252 5 87 310 -583 1022 -21 383 -49
4006 -49 -326 75 -740 247 246 -767 -1446 -572 -87 1174 -184 -972 -64 -665 658 -1608 126 0 -61
4025 -61 -281 487 995 597 1613 -284 495 661 419 -627 -344 -52 290 376 -61 -140 -16 -705 -196 -59
4045 -59 467 1449 -427 166 797 -32 120 783 1395 534 397 -211 576 217 255 579 889 -677 97 374
4065 374 880 1326 -62 462 -134 909 245 889 -1093 37 1233 513 691 460 127 -540 747 329
4083 329 346 -206 597 87 -542 348 330 -183 -470 -698 373 867 -405 410 193 -1162 651 1090 825
$$ packed form
3947D60j665J386J2l62K72J196j893J278J11o15J10m75j77l63O27Q61m6j577J538
3966F78j52k79l10O20N55l35m71Q27k088J426Q01p11p79K84q1o36N31j04Q79m80
3986A75j76RR30j547M01J16k7Q51L01j274p6N69k47Q2K23q93J605j043M04m32
4006d9k77M01q15R87jj013o79Q74M85J261j358p88R08o01J323k266J734j26o1
4025f1k20P68N08l98J016j897P79J66k42j046K83K92L42Q6m37p9J24o89N09J37
4045e9N26R82j876N93O31q29J52O63O12q61j37o08P87l59L8L24L10j566P74K77
4065C74N06M46j388N24n96J043o64O44j982J130J196p20J78k31l33o67J287m18
4083C29J7n52Q03n10o29Q90j8n13k87k28J071M94j272Q15k17j355J813M39k65
$$ plain form
4102 825 -153 -232 -155 824 438 -137 -919 755 1111 -112 1161 903 -31 112 -402 -374 -497 375 771 799
4122 799 1139 302 -848 701 180 162 48 901 1302 -4 756 -147 1181 63 21 297 1101 -170 -506
4141 -506 840 304 -421 451 349 655 -358 1326 -852 347 -357 -192 232 42 119 1094 -592 -193
4159 -193 335 1313 273 274 -1813 644 -832 -25 1412 -1000 -699 -378 -405 3 -399 -262 -318 -511 -796
4178 -796 639 754 360 -188 -362 975 891 -257 237 1085 748 538 -204 1251 853 801 -643 768 871
4197 871 25 1016 -293 -682 1410 702 -408 325 469 -7 876 -345 114 783 -344 1082 125 -757
4215 -757 397 -47 432 -312 -120 -118 -539 -459 454 -321 121 -798 80 421 273 1561 667 -516 73 -531
4235 -531 -29 227 662 -288 -465 -230 -333 582 452 -102 -253 -3 -434 883 -418 59 150 -511 -215 -1233
$$ packed form
4102H25r78p9P7R79l86n75p82J674L56j223J273k58r34J43n14K8j23Q72L96K8
4122G99L40q37j150J549n21j8j14Q53M01j306P60r03J328j118m2K76Q04j271l36
4141e06J346n36p25Q72j02L06j013J684k178J199p04J65M24j90P7R75j686L99
4159a93N28R78j040Jk087K457j476Q07J437k412L01L21k7M08m02J37n6j93k85
4178g96J435J15l94n48j74J337q4j148M94Q48l37k10p42J455l98n2j444J411J03
4197H71q46R91j309l89K092p08j110P33J44m76Q83j221M59O69j127J426r57q82
4215g57J154m44M79p44J92Km21Q0R13p75M42r19Q78L41j48J288q94j183N89o04
4235e31N02K56M35r50j77K35j03R15j30n54j51K50m31J317j301M77R1o61K96j018
$$ plain form
4255 -1233 530 247 122 -65 333 -1 73 -62 489 548 131 -471 -150 838 4 -254 -7 -9 208 683 279
4276 279 -824 -181 -289 323 -252 680 424 1013 690 1045 339 227 267 -532 -615 168 1043 -73 -162 -796
4296 -796 434 1501 428 68 -524 -390 -362 1 -12 336 606 120 852 -13 67 -376 -4 233 -196 312
4316 312 735 -363 -621 -353 -124 -210 222 -211 814 280 -563 -27 510 700 412 -218 142 455 642 -150
4336 -150 187 762 -420 814 541 152 304 -54 278 1435 -380 -45 -776 -661 491 -575 -195 48
4354 48 -654 1317 396 -71 -1158 546 -328 -469 30 365 -7 1461 47 -894 41 -198 683 639 68
4373 68 196 444 664 160 -116 -244 -199 530 -692 -309 781 -375 245 171 130 -197 95 161 -473 225 -828
4394 -828 1188 105 -171 901 -900 728 -1229 -103 96 1116 -717 -715 456 -225 93 -655 415
$$ packed form
4255a233J763k83j25j87L98l34P4j35N51N9m17o02L21R88q34k58K47kK17M75m04
4276B79j103O43j08O12n75R32k56N89l23L55p06j12M0p99q3P83Q75j116q9o34
4296g96J230J067j073l60n92J34K8L63j3L48K70m86P32q65Q0m43L72K37m29N08
4316C12M23j098k58K68K29q6M32m33J025n34q43N36N37J90k88o30L60L13J87p92
4336a50L37N75j182J234k73l89J52l58L32J157j815L35p31J15J152j066L80K43
4354D8p02J971r21m67j087J704q74j41M99L35l72J468j414r41R35k39Q81m4n71
4373F8J28K48K20n04k76j28M5P29j222L83J090j156O20p4m1l27K92O6o34O98j053
4394h28K016j083k76J072j801J628j957J126J99J020j833KJ171o81L18p48J070
$$ plain form
4411 415 1072 55 -1010 206 731 983 -587 626 -79 -697 -865 -517 -351 1053 311 -18 -939 10
4429 10 144 -299 -291 -1062 275 -591 4 -285 351 425 -513 -1096 622 -63 -353 139 109 -52 217 588 -149
4450 -149 -700 -137 -562 66 714 -39 1049 826 757 354 -235 124 787 111 -762 159 -178 680 80 455
4470 455 413 79 -48 219 -151 309 348 350 232 455 295 370 -341 726 664 -1017 451 537 186 -413 -668
4491 -668 329 -312 446 -307 -594 -1 345 739 36 201 334 -50 612 368 18 -6 -390 51 -438 -461 300
4512 300 -79 225 604 -269 143 -350 -633 -85 340 -345 931 145 -106 -637 -42 -968 106 300 -1277
4531 -1277 -354 -169 138 782 -16 -355 158 625 524 -411 1278 -419 -167 874 783 -188 635 -27 297
4550 297 -1003 386 187 548 -389 -35 -301 1020 668 363 518 -2 65 -40 1259 -163 -123 90 327
$$ packed form
4411D15O57j017j065J216N25K52j570J213p05o18j68L48J66J404p42l29r21R49
4429A0J34m43Qp71J337q66N95k89O36P4r38n83J718o85k90M92l0j61K69L71p37
4450a49n51N63m25O28O48p53J088k23o9m03n89L59O63o76q73R21l37Q58o00L75
4470D55m2l34j27K67l70M60L9Kj18K23j60P5p11J067o2j681J468Q6l51n99k55
4491f68R97o41P58p53k87N93L46L94p03J65J33l84O62k44l50k4l84M41m89k3P61
4512C00l79L04L79q73M12m93k83N48M25o85J276p86k51n31N95r26J074J94j577
4531a277R23J85L07O44p98l39N13M67j01r35J689j697K52J041r1r71Q23o62L24
4550B97j300J389j99L61r37L54k66J321l52l05J55n20O7j05J299j422M0K13K37
$$ plain form
4569 327 -270 -706 -189 -645 -327 -2 -320 46 -168 327 595 -220 -518 586 -246 4 741 571 249 1024
4589 1024 637 -1145 -126 531 -688 281 -139 -1122 218 422 -68 544 440 -139 -295 -443 -778 959
4607 959 209 19 -330 151 -374 -3 1026 -864 -26 -360 -27 156 -232 422 -389 -262 -580 543 541 -350
4627 -350 -41 -84 -62 -77 310 -546 -635 -441 767 -182 415 -1042 -346 307 576 -38 302 330 -986 405
4647 405 312 -107 -438 -213 -359 1180 364 414 74 -932 -112 229 467 154 -791 50 587 361 -192 882
4667 882 607 31 524 -272 -97 517 339 142 149 857 -88 -158 820 119 -250 -6 233 -268 -64 18 658
4688 658 627 125 462 -72 306 -186 -378 217 -518 48 39 794 -1043 250 -544 182 -597 -947 -316 -679
4708 -679 -59 216 707 -269 556 110 688 1 342 -371 -830 -470 84 -159 491 76 25 1257 -310 720
$$ packed form
4569C27n97m36N17m56L18L25l18L66k14M95K68q15k98J104q32K50P37j70l22P75
4589A024l87j782J019O57j219R69m20r83J340K04m90O12j04n79j56j48l35J737
4607I59p50j90l49M81n25L71J029j890Q38l34L33J83l88O54q11J27l18J123kq91
4627c50L09m3K2j5L87q56q9J94J208r49N97j457O96O53K69o14L40K8j316J391
4647D05r3m19l31K25j46J539q16N0l40j006Q20L41K38l13r45Q41N37k26n53J074
4667H82k75n76M93p96J75O14j78j97PP08r45p0R78p01l69K44K39n01K04Q2O40
4688F58l1n02L37n34L78m92j92N95p35N66rP55j837J293p94P26p79l50O31l63
4708f79O20K75M91r76Q25m46N78o87L41p13m59L60N54k43O50m15n1J232j567J030
$$ plain form
4728 720 -224 152 348 1188 -524 1 699 -288 -378 -154 -1212 217 -362 358 466 -312 -181 -557 142
4747 142 371 26 228 1135 -912 537 -880 56 -351 120 313 -297 637 134 761 -157 -124 83 68 300
4767 300 128 578 678 -1302 -266 -957 2 361 -459 -218 -288 48 -1027 148 -561 419 853 -648 1329
4786 1329 -439 -684 642 -628 152 172 -291 -32 8 791 -171 -417 113 -234 -498 -308 -489 -788 427
4805 427 569 410 1088 633 -888 -139 -80 437 -79 1466 362 117 -191 -100 -73 -1098 412 14 -212
4824 -212 -829 193 -604 625 -73 -808 -1439 -205 -61 587 -858 -755 662 -387 -302 -761 -815 -410 -1095
4843 -1095 539 -14 112 -543 -353 -660 -615 -65 32 590 -59 -1394 -776 1277 -226 -107 309 -115 70
4862 70 -1147 -748 -1302 33 88 -415 395 -253 -884 -1089 -1129 -713 -822 -510 -922 355 764 649 214 622
$$ packed form
4728G20r44L76J96Q40j712N25O98r87r0K24j058J429n79P20J08p78J31l76O99
4747A42K29l45K02R07k047J449j417R36m07M71J93o10R34n03O27r18L3K07j5K32
4767C00j72M50J00j980J036o91R59L59q20K41p0L36j075J175p09R80M34j501J977
4786A329j768k45J326j270P80K0m63K59M0P83r62k46N30l47k64J90j81k99J215
4805D27J42j59O78m55j521P49N9N17n16J545j104k45l08R1K7j025J510l98k26
4824b12o17J022p97J229o98p35o31J234J44O48j445J03J417j049Q5m59n4M05o85
4843a095J634n53J26o55J90l07M5N50R7N58o49j335O18K053j503J19M16m24J85
4862G0j217L99n54J335N5n03Q10o48o31k05m0M16j09L12m12J277M09j15m35M08
$$ plain form
4882 622 -72 -1016 1853 858 -1036 416 -535 56 -489 -265 -228 -605 890 303 -78 -142 -333 794 -801
4901 -801 91 338 113 -1058 -896 -907 480 171 -706 1201 666 927 -224 -166 -133 -22 -617 509 430 -1015
4921 -1015 279 -400 308 672 -823 -811 61 434 449 386 -317 -470 -942 1119 1032 291 526 -108 331 499
4941 499 -442 467 -333 -914 -1140 80 -277 -1040 440 -1062 951 -22 -255 597 498 154 55 423 -353
4960 -353 -86 -1358 -1095 -412 -137 -1302 364 -276 369 472 -129 202 158 -104 569 275 -298 97 517
4979 517 59 663 -331 -84 1261 472 198 68 -419 -366 297 263 -266 64 -249 1486 329 678 733 -236
4999 -236 284 465 -1697 128 -979 -796 -578 201 -162 572 1207 -979 -506 637 581 747 72 -290 -502
5018 -502 -165 93 -716 -848 -529 587 448 -590 -99 798 245 226 56 -363 -9 -88 -267 224 -1140 -167
$$ packed form
4882F22o94r44K869r95j894J452r51N91n45K24L7l77J495n87l81o4j91J127j595
4901h01Q92K47k25j171J62j1J387l09q77J907n35K61j151N8L3J11n95J126p9j445
4921a015J294o79P08L64j495J2Q72L73J5o3p03j53m72K061q7p41K35o34M39J68
4941D99r41R09q00n81k26J220l57p63J480j502K013r73k33Q52r9l44r9L68p76
4960c53K67j272K63O83K75j165J666o40O45J03o01L31m4k62O73k94n73L95M20
4979E17m58O04r94K47J345p89k74j30m87N3O63l4n29L30l13J735j157L49N5r69
4999b36N20J81k162J825j107J83K18P79l63P34O35k186M73J143n6J66o75l62k12
5018e02L37K58q09j32L19J116j39j038M91Q97n53j9j70m19L54p9j79M91j364R73
$$ plain form
5038 -167 -547 1185 -324 527 -705 927 185 -380 479 -246 -817 -648 -608 632 -441 -254 -80 -326
5056 -326 350 171 -315 -343 63 310 -81 46 -722 -279 -211 -799 311 881 111 961 -554 -324 620 -396
5076 -396 -3 -808 -428 -1569 -708 -107 -193 -587 815 763 80 -699 341 -155 354 -47 498 -1119 -802
5095 -802 269 250 -46 264 -412 -302 -254 81 25 622 -168 -1084 0 719 -342 -99 -793 825 869 -3
5115 -3 -446 -755 -696 61 -416 455 -983 31 210 -154 344 19 197 -549 -581 388 456 -120 492 -634 97
5136 97 356 525 -139 -98 229 -259 -653 -754 -469 691 -92 750 778 -100 273 -742 -722 304 -151 411
5156 411 397 228 -825 -1046 -57 121 520 83 -13 -44 26 974 241 490 262 -822 -209 -1016 434 110
5176 110 559 -77 696 42 195 -321 -510 846 337 -246 -419 132 -62 -209 309 499 508 -38 -1176 577
$$ packed form
5038a67l80J732j509Q51j232J632p42n65Q59p25n71J69M0J240j073J87J74k46
5056c26O76j79m86k8M06K47l91J27p68M43O8n88J110N70p70Q50j515K30R44j016
5076c96L93q05L80j141Q61O01q6l94J402n2o83p79J040m96N09m01N45j617L17
5095h02J071j9k96L10o76J10M8L35n6N97p90r16J084P19j061K43o94J618M4q72
5115cm43l09N9P57m77Q71j438J014J79l64M98l25J78p46l2R69O8n76O12j126P31
5136I7K59J69o64M1L27m88l94j01K85J160p83Q42K8q78L73j015K0J026m55N62
5156D11j4j69j053k21R89J78L99m37r6l1P0R48p33K49k28j084O13q07J450l24
5176A10M49o36P73o54J53n16j89J356n09n83j73N51j94j47N18J90Rn46j138J753
$$ plain form
5196 577 -72 -431 888 63 -145 1207 -654 -245 573 539 -66 -123 376 631 674 -35 138 -5 430 644
5216 644 -301 -110 332 8 -129 -415 42 -468 300 277 -195 192 -243 226 65 -172 -187 -436 213 -91 546
5237 546 -1 956 -104 -160 -154 34 -126 -669 382 724 115 -101 4 -519 895 740 929 -483 517
5256 517 237 -450 -666 -683 -699 270 -255 250 444 496 -459 70 -116 -294 -3 552 109 31 -434 269 9
5277 9 103 494 344 -263 -130 185 404 -344 306 -542 319 -414 -506 163 -459 393 -637 -180 -562 51 -21
5298 -21 -202 177 652 -294 -104 -251 -329 421 -27 355 294 207 -522 -54 352 603 24 407 -330 -401 68 29
5320 29 303 245 60 -335 -62 -52 -901 834 -442 510 -32 -175 544 -516 62 409 27 -184 -642 122
5340 122 127 104 -707 -338 758 -465 129 83 -75 349 94 149 126 154 -532 -487 15 -121 -110 839 -165 117
$$ packed form
5196E77o49l59J319q25k08J352j861M09Q18l4o05n7M99K55M3p09J73j43M35K14
5216F44r45J91M42l24j37k86M57n10P68k3m72L87m35M69j61k37j5k49O49l04O37
5237E46n47R57j060n6OJ88j60n43J051L42o09k16J05n23J414j55J89j412J000
5256E17k80o87k16j7j6R69n25N05J94N2r55N29j86j78K91N55m43p8m65P03k60
5277IR4L91j50o07J33L15K19p48O50q48Q61p33r2O69o22Q52j030M57l82O13p2
5298b1j81L79M75r46J90j47p8P50m48L82o1q7p29M68M06K51n79L83p37p1M69l9
5320B9K74n8j85l95K73J0q49J735j276R52n42j43P19j060N78L47l82k11m58P64
5340A22Nk3q11L69J096j223N94m6j58M24k55N5k3K8o86M5N02j36J1R49j004K82
$$ plain form
5362 117 349 -48 784 73 119 651 177 -341 -56 716 -86 -234 -438 -368 -368 -93 -219 -351 -590 -10 602
5383 602 -104 212 14 -255 376 557 -521 660 -275 -576 83 -118 196 -248 -444 53 42 -393 587 33
5403 33 119 362 -326 177 209 276 302 218 -249 520 -16 366 113 -120 596 -385 -40 -472 223 230 499 -231 189
5426 189 -238 190 858 -68 -920 -351 608 -263 -326 82 -382 -122 222 327 302 250 348 97 -214 -181 -176 518
5448 518 211 805 -142 -455 -272 -331 -915 127 367 -733 -445 -221 631 269 15 74 -117 105 378 -405
5468 -405 118 139 201 41 505 -463 -140 77 -672 348 95 -270 240 415 109 671 -6 -249 199 -450
5488 -450 636 -217 134 49 -265 -107 257 31 -443 -373 -138 -508 959 -144 344 -538 493 -87 212
5507 212 188 -819 381 512 70 -373 174 214 367 -20 171 330 687 -574 257 363 67 -564 -255 162
$$ packed form
5362A17K32l97Q32p11M6N32m74n18K85P72q02j48k04P0%K75j26j32k39N80O12
5383F02p06L16j98k69O31J81j078J181r35l01O59k01L14m44j96M97j1m35R80n54
5403C3Q6K43o88N03L2O7K6q4m67P69n36L82k53k33P16r81L45m32O95PK69p30M20
5426A89m27M28O68r26q52N69R59q71o3M08m64K60L44J05k5n2R8k51l11L3NO94
5448E18l07N94r47l13J83n9n84J042K40j100K88K24Q52l62k54N9j91K22K73p83
5468d05N23K1O2j60M64r68L23K17p49J020k53l65N10J75l06N62o77k43M48o49
5488d50J086q53L51q5l14J58L64k26m74P0K35l70J467j103M88q82J031n80K99
5507B12k4j007J200J31m42m43N47M0J53l87J91J59L57j261Q31J06k96o31L09M17
$$ plain form
5527 162 18 51 433 -126 443 -275 641 -593 -51 -235 539 189 -521 50 -46 -191 -262 -95 -157 310 -87
5548 -87 164 63 -9 -62 -423 -71 730 406 583 161 -39 654 354 385 -230 -554 -552 398 264 474 530 176
5570 176 -508 -457 388 -70 -149 229 -72 -234 -191 -644 376 465 -1010 145 261 2 -728 -227 -46 436
5590 436 422 403 401 197 288 545 279 511 291 773 693 242 41 161 -53 360 888 37 -143 189 395 -265
5612 -265 -261 -508 3 94 -289 -559 1018 -58 -721 -235 -281 -38 641 -338 -133 389 -3 -136 19 586 137
5633 137 -309 -1 -1031 -486 -117 -336 518 -10 -484 -6 128 -716 454 243 -464 -353 375 636 560 -423
5653 -423 193 656 27 -101 355 203 -454 500 57 115 -35 -327 -584 -129 175 -229 -301 -430 164 -41 127
5674 127 -346 -105 -427 905 215 469 438 -178 406 103 734 -640 -495 -51 -163 96 44 114 318 -394
$$ packed form
5527A62j44L3L82n59N69p18R16j234N42j84P74l50p10N71r6j45p1J67o2M67l97
5548h7K51j01p2n3l61L52Q01l24J77m22k00O93l00L1o15l24KR50j34K10N6l54
5570A76o84N1Q45m58p9L78l01j62M3m53J020Q9j475J155J16k59p30N01J81M82
5590D36j4j9kk04R1K57k66K32k20M82q0m51k01J20k14M13N28q51j80L32K06o60
5612b65Mk47N11R1l83k70J577j076o63M86m6K43O79r79K05N22l92j33J55N67m49
5633A37m46L08j030N45L69k19Q54n28m74M78J34q44J170k11p07J11P28K61p6r83
5653d23O16M63o29j28M56j52o57R54m43N8j50k92k57M55L04m04p2j29N94k05J68
5674A27m73K41l22J332o90K54l1o16N84l03O31j374J45M44j12K59n2P0K04p12
$$ plain form
5694 -394 732 -353 -479 29 681 212 43 339 672 -282 -58 374 432 -332 -118 -130 -393 507 300 -137
5714 -137 -750 -434 125 823 535 -446 447 299 -72 -394 -1 -430 28 15 -187 238 164 -203 239 1062 -284
5735 -284 -270 -246 -175 351 20 -553 -79 -776 168 112 -440 -554 -688 -497 67 507 -96 93 -53 -357 905
5756 905 578 -798 530 217 171 -180 287 -866 -80 -414 375 -467 -90 -18 -328 -121 347 570 -238 -101
5776 -101 520 205 -10 -44 626 172 -58 226 -113 -107 -619 474 -118 262 -38 677 -157 -17 651 424 832
5797 832 345 14 -183 174 1 -163 105 219 -65 -41 -318 -1044 -162 -94 -312 -274 -248 -204 -873 407 644
5818 644 -356 449 200 370 358 282 -34 67 -948 234 357 506 9 -210 668 -22 -186 161 463 89
5838 89 612 -583 102 -67 349 -443 -520 -125 -208 -804 -309 92 442 74 -447 -116 56 58 1 326 -277 212
$$ packed form
5694c94J126j085j26N08O52m69j69K96L33r54K24M32N8p64K14j2k63R00k07m37
5714a37o13L16N59O98k88r81Q93j48l71l22L93m29M58j3k02M25p4l67M42Q23j346
5735b84J4K4P1N26l31n73M74o97R44n6n52j14j34J91N64M40o03J89j46l04J262
5756I05l27j376J328l13m6l51M67j153P86l34P89q42L77P2l10K07M68K23q08J37
5776a01O21l15k15l4O70m54k30K84l39On12J093n92L80l00P15q34J40O68k27M08
5797H32m87l31j97L57j73j64K68J14k84K4k77p26Q82O8k18L8K6M4o69J280K37
5818F44j000Q05k49J70j2p6l16J01j015J182J23J49m97k19Q78o90j64L47L02l74
5838H9N23j195O85j69M16p92p7L95q3n96M95M01L50l68n21L31J72Kn7L25o03M89
$$ plain form
5860 212 -91 7 75 -91 -363 515 238 -431 647 428 -42 624 -90 246 -109 -58 -710 -52 -164 220 -83
5881 -83 430 2 -851 200 -242 -462 -427 256 -97 -42 -739 -26 -437 417 186 554 -191 281 473 51 92
5902 92 -891 -82 515 211 467 -19 -337 12 -675 -769 74 519 -336 -489 83 925 146 347 -347 140 -224
5923 -224 -158 216 -187 569 -1304 65 -150 -963 355 206 805 -210 -347 -203 -22 6 59 941 -97
5942 -97 -71 586 104 -112 138 -368 0 205 55 96 421 -627 -501 369 126 172 580 439 441 465 -192 -10
5964 -10 -149 -382 -700 247 -28 -546 -227 -204 -725 48 -21 -181 392 284 152 204 197 67 11 139 -64 -178
5986 -178 -189 -719 -279 -114 -143 -690 588 115 -619 48 549 -291 -657 2 364 153 -332 -314 600 561 80
6007 80 142 -47 465 73 -899 140 17 167 153 262 -465 -10 569 294 -166 140 -361 -109 -202 609 -357
$$ packed form
5860B12l03R8O8j66k72Q78k77o69J078k19m70O66p14L36l55N1o52O58j12L84l03
5881h3N13m28q53J051m42k20L5O83l53N5o97P13m11Q54k31L68p45M72J92m22M1
5902I2r83Q09N97l04K56m86l18L49o87r4Q43M45q55j53N72Q42p79K01o94M87l64
5923b24O6L74m03P56j873J369k15q13J318j49N99j015j37J44J81K8N3Q82j038
5942i7K6O57m82k16K50n06L68K05j50M1L25j048J26Q70k43M6M08j41KK4o57J82
5964a0j39k33l18R47k75n18L19K3n21P73o9j60N73j08j32N2pj30n6J28k03j14
5986a78j1n30M40J65k9n47J278m73p34O67N01q40l66O59L62k11m85J8R14l9m81
6007H0O2j89N12l92r72J039j23J50j4J09p27M55N79k75m60L06n01K52r3Q11r66
$$ plain form
6028 -357 214 609 -186 1 -193 101 -434 -789 133 -69 -93 -393 577 -556 -166 283 83 448 -210 -474
6048 -474 311 343 -639 -1057 162 2 971 575 124 -553 316 381 -118 -182 -421 167 411 -367 351 178 -170
6069 -170 610 -533 274 660 -529 606 -729 123 154 -502 123 -172 291 583 574 134 348 210 427 -128
6089 -128 -423 23 458 -438 714 -602 -57 -511 199 375 522 791 -895 -302 457 226 158 561 328
6108 328 -2 -441 468 139 264 -114 20 27 254 -88 -200 -185 395 503 528 -753 348 762 216 -62 84
6129 84 -82 173 79 -250 94 120 -690 251 383 306 455 917 136 -225 -98 -210 138 -383 99 663 -573
6150 -573 -123 -58 614 709 934 158 177 -402 332 200 -57 -133 -480 -285 -35 -275 294 254 -926 -119 564
6171 564 632 396 -719 293 -374 352 -132 -186 641 461 540 256 564 165 383 -91 16 1120 117 201
$$ packed form
6028c57N71L95p95J87j94K94n35l55R22k02k4l00R70j133L90M49k00L65o58k64
6048d74P85L2r82m18J219j60R69l96m51o77Q69O5m99o4k39N88K44p78P18j73l48
6069a70P80j143Q07L86j189J135j335Q52L1o56O25k95M63K92rm40K14j38K17n55
6089a28k95M46M35q96J152j316N45m54P10J76J47K69j686N93P59k31o8M03k33
6108C28l30m39R09l29J25l78J34PK27l42j12J5N80J08K5j281J101M14n46k78J46
6129H4j66K55r4l29L44K6q10R41J32p7J49M62p81l61J27j12L48n21M82N64j236
6150e73M50O5O72R5K25p76J9n79P34j32k57p6l47J95K50k40N69m0j180Q07O83
6171E64O8k36j115J012o67P26m84n4Q27j80P9k84L08l99K18m74J07J104j003Q4
$$ plain form
6191 201 357 -224 -394 -826 676 281 5 625 -379 -83 99 -554 -59 326 -481 60 259 -41 -319
6210 -319 223 220 -199 -26 -239 166 -160 -777 -665 -860 -51 105 -787 631 85 -628 315 1305 -152 -369
6230 -369 60 410 775 -169 -548 -433 152 -831 -901 -575 -108 56 -140 156 -386 686 -808 937 447
6249 447 -648 424 -82 -922 543 -316 68 -306 -575 297 479 -285 542 624 40 523 -634 -518 -148
6268 -148 -255 -119 -106 172 27 -108 277 -405 198 -67 468 -322 -386 197 463 -380 -993 -316 297 454 -417
6289 -417 643 75 1227 -62 -444 -70 -827 -717 -172 212 220 -538 210 100 1264 176 302 -642 -543
6308 -543 203 -397 904 -170 709 860 412 -50 540 143 -330 10 -406 -7 -429 292 476 282 -309
6327 -309 -138 -61 27 -64 -113 209 -656 879 1066 175 -45 -766 -743 250 -288 -493 -66 -996 -85 105 -341
$$ packed form
6191B01J56n81j70m32J502l95k76O20j004K96J82o53M95L85q07N41J99l00k78
6210c19N42lm19J73k13M05l26o17J12j95Q09J56q92J418n46p13R43R90j457k17
6230c69M29L50L65r44l79J15N85r83p0L26M67J64j96K96n42J072j494J745m90
6249D47j095J072n06q40J465q59L84l74k69Q72J82p64Q27Q2n84M83j157J16L70
6268a48j07J36J3K78j45j35L85o82O03k65N35p90o4N83K66q43o13O77O13J57q71
6289d17J060n68J152j289l82L74p57J10N45L84Qp58P48j10J164j088J26r44R9
6308e43P46o00J301j074Q79J51m48m62N90l97m73L40m16L99m22P21J84j94n91
6327c09J71P7Q8r1m9L22q65J535J87q91k20p21K3R93n38k05M27r30R11J90m46
$$ plain form
6348 -341 -233 -225 75 -536 -63 62 -380 -184 697 -153 561 -142 652 278 323 -439 154 -715 -160 498 -128
6369 -128 105 736 551 170 -21 505 -50 -443 592 139 -252 -371 198 -477 487 348 720 563 -788
6388 -788 -308 1055 -60 274 -82 -79 200 -464 -147 -286 105 191 55 580 -182 215 -217 -705 721 -6
6408 -6 99 -231 288 79 -402 -143 -330 388 -222 301 201 455 4 230 120 351 -719 140 -152 52
6428 52 -52 -658 -126 -471 281 789 64 -112 -3 488 595 -214 -295 209 233 235 191 259 -961 -427 -289 510
6450 510 682 420 -80 -1129 455 -642 -217 599 -219 227 -451 -460 139 -245 46 -216 -674 187 -366 574
6470 574 239 602 321 -22 10 1078 299 -557 -128 536 258 236 26 231 202 71 -729 -911 404 174
6490 174 -492 -250 -517 -643 178 -769 328 -588 -350 233 235 206 -255 -453 -330 324 -2 -11 -710 -625 378
$$ packed form
6348c41J08QL00o11M73J25m42J96Q81q50P14p03P94l74M5p62N93q69N55O58o26
6369a28K33O31j85l81j91N26n55l93J035m53l91j19N69o75R64j39L72j57j351
6388g88M80J363j115L34l56LK79o64L17j39L91Q6j36N25p62L97m32m88J426p27
6408fJ05l30N19k09m81K59j87P18o10N23j00K54m51K26j10K31j070Q59k92K04
6428E2j04o06N32l45P52N08p25j76J09M91J07q09q1N04K4Km4O8j220N34J38P99
6450E10J72k62n00j049J584j097M25Q16q18M46o78rN99l84K91k62m58Q61n53R40
6470E74l35L63k81l43L2J068p79q56M29O64k78k2k10K05k9j31q00j82J315k30
6490A74o66K42k67j26Q21r47J097r16K38N83Kk9m61j98J23O54l26ro99Q5J003
$$ plain form
6511 378 -736 466 -565 -271 152 -172 788 790 -180 -1618 -604 -473 281 -576 159 433 176 -326 172
6530 172 240 -309 33 664 -727 96 383 -386 -365 661 233 -459 113 -757 -485 523 948 112 263 -22
6550 -22 -226 -213 396 171 302 271 -342 -149 -223 27 90 -598 386 20 491 347 252 -566 -970 -510 -69 -224
6572 -224 -25 254 621 631 -234 141 -499 388 159 -54 -190 441 385 72 328 282 -125 -493 -293 -185 10
6593 10 -649 237 37 45 -275 19 148 -138 224 -251 -115 -3 -119 145 550 -275 170 1114 101 193 427
6614 427 1030 996 606 -193 -103 1076 -211 424 -485 254 276 -332 -695 -590 -500 -280 616 -124 465 -985
6634 -985 86 354 488 -475 10 -387 -1269 -271 98 -50 758 710 98 -109 49 426 513 -575 89 -681
6654 -681 70 -514 49 77 280 470 -171 363 -309 -248 -576 609 92 -518 -694 -227 -61 -744 486 -940
$$ packed form
6511C78j114J202j031K94M23l24R60Kr70j438J014J31P54q57P35K74k57n02M98
6530A72O8n49L42O31j391Q23K87p69K1J026m28o92N72q70K72J008M25q36J51k85
6550b2k04J3O09k25J31l1o13J93p4K50O3o88R84l66M71j44r5q18m04M60M41j55
6572b24J99K79L67J0q65L75o40Q87k29k13j36O31n6l13K56m6m07l68K00J08J95
6593A0o59Q86k00Ql20K94J29k86L62m75J36J12j16K64M05q25M45R44j013R2K34
6614D27O03l4l90p99R0J179j287O35r09P39K2o08l63J05R0K20Q96p40N89j450
6634i85J071K68J34r63M85l97q82R98L69j48Q08m8o12k07J58L77Q7j088O64p70
6654f81P51n84N63K8K03J90o41N34o72O1l28J185n17o10j76M67J66o83J230j426
$$ plain form
6674 -940 -38 525 112 -283 157 -157 -385 -715 476 -201 -907 555 -124 149 -9 -362 -898 -191 -246 -489
6694 -489 -338 776 -532 490 -477 145 426 -984 311 525 155 -122 -818 401 202 -322 52 -75
6712 -75 -147 -1217 759 226 -214 -931 -311 8 385 51 -1027 -530 379 77 73 -947 170 306 421 -550
6732 -550 -358 -210 1 -513 344 -426 401 -307 280 236 -82 673 -14 -734 82 139 -416 480 -1192 216
6752 216 -554 -308 204 -3 214 -421 -7 166 196 -423 -926 -185 -79 336 585 527 -232 124 -169 -323 256
6773 256 255 -573 356 109 -110 -367 308 120 -228 11 -117 -275 522 552 839 -581 72 -1050 -88 561
6793 561 -743 -79 -36 323 236 577 -35 -1165 -287 366 1087 366 -373 178 299 216 207 -1113 292 660
6813 660 -165 84 91 -3 -357 -201 -440 14 346 63 -260 -340 -330 541 210 381 -57 -120 -239 -1212 804 264
$$ packed form
6674i40R02N63m13l95M40l14k28l30J191o77p06J462o79K73j58l53n36P07n5k43
6694d89J51J114j308J022r67O22K81j410J295K14l70k77o96J219j99n24L74j27
6712g5p2j070J976n33m40p17O20L19L77l34j078M97R09l02mj020J117J36J15r71
6732e50J92J48K11n14Q57p70Q27p08N87m4l18P55o87p20Q16N7n55Q96j672J408
6752B16p70K46N12k07K17o35M14J73L0o19n03P41J06M15K49n8p59L56k93j54N79
6773B56jq28R29k47k19k57O75j88l48K39j28j58P97L0K87j420O53j122R62O49
6793E61j304O64M3L59q7L41o12j130Q78O53P21p21p39N51J21q3rj320J405L68
6813F60q25K49Pr4l54J56k39M54L32k83l23q0J0Q71l31J71m38o3j19r73K016n40
$$ plain form
6835 264 -41 514 -841 -1126 -663 -579 -5 705 23 314 -322 217 126 -274 -1368 -40 -679 544 488 528
6855 528 48 -410 -508 -677 -673 469 177 774 -557 129 -656 -567 -165 117 -106 273 773 -757 -633 -486
6875 -486 1248 104 247 155 -425 -161 165 1350 -127 69 310 -420 208 -85 1077 2092 -1527 142
6893 142 -503 -415 1323 -398 752 -361 852 -1215 -245 52 -458 -411 -872 -1040 -472 -667 411 -47
6911 -47 -777 -522 -1103 336 1316 -302 567 135 53 171 -136 505 -726 647 678 26 -286 -695 177 925
6931 925 -1356 304 -488 -345 772 -29 -405 -694 -40 237 -743 -95 -734 120 743 -323 794 360
6949 360 226 709 580 -343 399 -173 120 -70 -176 139 -1212 -353 850 -587 -849 -575 32 -1428 342
6968 342 -534 357 363 568 286 885 584 264 546 1119 30 203 -413 -128 342 935 -385 251 -855 373
$$ packed form
6835B64l05N55j355k85M63Q4N74P10o82K91o36N39r1m00j094J328o39J223n6M0
6855E28m80m58r8j69MJ142k92N97j331O86p85Q9M02K82k23L79N00j530J24J47
6875d86J734j144J43r2n80K64L26J185j477J96K41p30O28k93J162J015l619J669
6893A42o45Q8J738j721J150j113J213k067R70K97n10M7m61j68N68j95J078m58
6911d7p30K55n81J439R80j618Q69m32q2J18l07O41j231J373L1o52l12m09Q72P48
6931I25k281J660p92J43J117q01l76k89O54K77r80O48o39Q54O23j066J117m34
6949C60j34M83j29r23P42n72K93j90j06L15j351Q59J203j437k62K74O07j460J770
6968C42q76Q91OK05k82N99l01l20K82N73j089J73o16K85M70N93j320O36j106J228
$$ plain form
6988 373 -1098 436 312 -104 130 -694 395 -169 265 28 152 -281 -350 -103 84 -576 -586 21 500 1008
7008 1008 -470 -413 -149 -69 458 -68 572 592 -787 -114 -41 -178 -84 168 135 257 567 128 -897 587
7028 587 330 -351 161 -328 882 -125 -104 394 545 298 136 -1140 -388 -319 -169 -1144 553 -499 -98
7047 -98 -1156 335 239 -669 -479 101 -422 -471 576 645 99 -299 533 200 160 865 20 -486 566 -375
7067 -375 169 -109 883 -109 -297 560 523 163 -302 -626 -512 103 -98 -666 -775 290 520 314 -564 566
7087 566 556 -317 -723 -164 885 -48 739 -522 303 453 653 -366 -226 69 173 -185 725 -94 21
7106 21 -169 -322 -199 714 465 -238 27 -69 -412 272 375 -865 927 372 733 -386 49 439 14 -364
7126 -364 -1285 -156 -880 -296 545 -190 -813 100 794 143 54 -82 218 -96 -952 299 -39 368 95 217
$$ packed form
6988C73j471J534j24m16K34q24J089n64M34k37J24m33o9K47J87o60j0O07M79N08
7008A008j478N7K64Q0N27n26O40K0j379O73P3j37R4K52l3J22L10m39j025J484
7028E87k57o81N12m89J210j007K1M98J51k47j62j276P52O9J50r75J697j052M01
7047i8j058J491r6r08J90N80n23m9J047O9n46l98Q32l33m0P05q45n06J052r41
7067c75N44k78R92r92j88Q57l7l60m65l24J14O15k01n68j09J065K30k06q78J130
7087E66j0q73m06N59J049r33P87j261Q25J50K00j019J40K95J04l58R10q19J15
7106B1j90j53J23R13k49p03K65r6l43O84J03j240J792n55L61j119M35L90m25l78
7126c64r21J129p24N84Q41p35o23R13O94o51q9j36L00l14q56J251l38M07k73J22
$$ plain form
7146 217 213 407 31 -234 212 456 344 -35 -315 851 -44 302 425 -797 906 -588 1452 -247 210
7165 210 358 -381 564 370 178 -180 37 682 143 820 -453 -682 166 -239 254 -581 225 157 153 -16 553
7186 553 187 368 -230 80 737 332 602 679 225 203 -323 636 886 985 -17 325 242 20 -382 -324 227
7207 227 368 -43 612 -115 643 275 -159 91 50 531 -555 435 454 139 258 -588 53 -69 -151 606 781
7228 781 -320 -120 -457 -532 71 -400 -119 344 276 -475 -637 -450 176 -278 -330 -103 -344 -417 459 -134 54
7249 54 1 -860 -10 -530 139 88 422 -126 78 -309 -149 -94 -310 -13 323 275 -245 415 193 -347 285 -159
7271 -159 -132 -130 126 -15 74 -48 364 331 -185 703 -26 -274 26 -288 32 469 -384 26 178 279 483 316
7293 316 474 416 -596 122 -411 -32 213 377 157 -705 -339 449 578 -344 -1147 5 384 -32 34 -534
$$ packed form
7146B17mJ94l76k65M46K44j12l79k80J166q95L46J23j222J703j494K040j699M57
7165B10J48p39R45j94j92l58K17O45n39O77j273k29Q48m05M93q35Q06o8mj69N69
7186E53l66J81n98L10O57m05K70P7m54k2n26R59K50R9j002L42q3k22m02N8N51
7207B27J41m11O55p27P58l68m34K50m1M81j086R90J9l15J19q46O41j22q2P57J75
7228G81j101K00l37p5O03m71K81M63o8p51j62J87O26m54n2K27k41p3Q76n93J88
7249E4n3q61Q50n20O69n1L34n48K04l87J60N5k16K97L36m8n20O60k22n40O32m44
7271a59K7KK56j41Q9j22M12l3n16Q88p29k48L00l14L20M37q53M10J52J01K04j67
7293C16J58n8j012P18n33L79K45J64k20q62L66P88J29r22q03J152L79m16O6n68
$$ plain form
7313 -534 -479 -324 338 217 386 386 631 64 169 414 221 84 88 -59 478 314 -31 -107 -330 -606 -417 -274
7335 -274 349 155 -207 15 -61 -53 -247 261 -50 -681 -457 644 -920 287 -343 -402 120 226 896 178
7355 178 -157 172 414 181 41 230 422 380 663 -171 296 471 368 -563 94 -267 -424 -274 829 994
7375 994 732 -760 150 -83 724 311 -577 592 9 570 -307 -899 -240 -270 -319 -66 -278 -18 639 -52
7395 -52 707 -36 -73 253 285 671 268 557 -249 -290 505 442 -260 -992 158 -586 -582 1053 216 -422 -226 -291
7417 -291 616 -42 -38 -89 642 -442 192 375 -642 -693 871 -157 -310 778 -387 -678 -713 529 808
7436 808 -787 41 220 167 -713 -1100 256 163 38 -217 323 901 424 -340 -167 561 -385 48 365 -366
7456 -366 24 -578 648 513 653 -92 391 -66 96 -104 -374 69 209 442 762 957 -31 160 670 105
$$ packed form
7313e34N5J55O62j21J69%K45n67J05K45j93j37Mj47N37j64l45p6k23k76J89J43
7335b74O23j94l62K22p6Qj94N08l11o31K24J101j564J207o30n9N22J06O70p18
7355A78l35L29K42k33j40J89J92m2K83q34M67J75j03r31O57l61j57J50J103J65
7375I94k62j492R10k33Q07m13q88J169n83N61q77n92O59l0m9K53k12K60O57o91
7395e2P59p43l7L26L2L86m03K89q06m1P95o3p02p32J150p44MJ635q37o38J96o5
7417b91R07o58Mn1P31j084O34J83j017n1J564j028j53J088j165k91l5J242K79
7436H08j595Q28J79n3q80l87J356r3j25k55N40N78m77p64J73P28r46M33L17p31
7456c66L90o02J226j35J40p45M83m57J62k00k70M43J40K33L20J95r88J91N10n65
$$ plain form
7476 105 324 -17 684 506 355 -282 606 467 -312 -915 -349 256 -641 323 134 -144 -588 305 439 -255
7496 -255 487 -804 188 221 -14 -720 692 361 362 130 22 97 -511 -1114 539 844 513 -26 -67 258 233
7517 233 -26 -67 -471 163 -151 225 393 -126 -753 -210 7 570 354 61 1166 -503 507 -106 637
7536 637 107 104 -492 -112 68 -212 442 369 -238 -426 146 -374 -473 1180 -499 140 61 67 484 -529 -460 125
7558 125 -350 -481 -345 -467 155 -469 690 52 857 -336 465 -180 470 -6 -80 -804 -37 -162 -288 5
7578 5 391 41 -676 -95 71 -59 77 513 950 -75 434 -115 401 -124 -316 -2 -163 181 -586 -393
7598 -393 618 602 439 -486 178 -449 861 -624 -260 462 633 124 983 860 377 -369 -233 220 535
7617 535 -478 -348 12 226 459 -588 15 113 87 -629 -189 404 893 -44 -285 531 -585 18 495 -406
$$ packed form
7476A05K19l41P01j78j51o37Q88j39p79o03N66O05q97R64j89k78m44Q93J34o94
7496b55P42j291R92L3k35p06J412l31Jk32j08P5o08o03J653L05l31n39m1L25k5
7517B33k59m1m04O34l14L76J68n19o27N43K17N63k16k93J105j669J010o13P43
7536F37n30ln96L80J80k80O54p3o07j88N72n20r9J653j679O39p9OM17j013O9N85
7558A25m75j31J36j22O22o24J159o38Q05j193Q01o45O50m76p4p24P67j25j26K93
7578EL86l50p17N81J66j30J36M36M37j025N09n49N16n25j92L14j61L44p67J93
7598c93J011j6j63r25O64o27J310j485L64P22J71n09Q59j23m83p46J36M53L15
7617E35j013J30L60K14K33j047O03R8k6p16M40N93M89r37k41Q16j116O03M77r01
$$ plain form
7637 -406 343 1056 156 424 474 -224 485 -317 -444 -566 -31 615 639 199 -498 -184 -409 512 -145 -118 340
7658 340 534 842 912 73 -24 -655 -496 48 259 833 139 -623 690 -328 -32 -703 -436 -490 441 390 704
7679 704 1022 103 628 423 157 -491 -522 475 193 -590 9 162 220 352 -126 -713 -286 -33 310 984 77
7700 77 -452 -179 -767 -597 -171 476 185 160 -151 -472 -30 46 91 -379 -772 -288 532 -247 -643 188 995
7721 995 215 -778 33 -290 23 -328 -567 288 219 645 -23 -231 836 55 -508 574 290 749 149 -612
7741 -612 -133 237 -613 -541 -72 -38 116 -427 742 86 451 250 47 217 -316 665 229 287 125 566 473
7762 473 -98 232 -28 739 288 494 1094 122 -639 -365 570 140 -844 422 383 -154 206 -567 -286 154
7782 154 546 -109 188 428 -234 238 441 18 -14 263 -586 713 -856 545 -39 -468 476 205 -18
$$ packed form
7637d06P49P13r00K68N0o98P09q02j27j22N35O46K4m40o97L14k25R21o57K7M58
7658C40J94L08P0q39r7o31J59N44K11N74o94p62J313j018K96o71K67n4R31n1L14
7679G04L18r19N25k05k66o48l1R97k82p83N99J53N8J32m78n87M27K53L43O74r07
7700G7n29K73n88J70M26O47k91k5l11l21M42P6M5m70l93M84Q20p79l96Q31Q07
7721I95p80r93Q11l23L13l51k39Q55o9M26o68k08J067p81n63J082k84M59o00p61
7741f12M79L70q50P2M69L4J54n43J169o56L65k01k03J70n33R81m36N8j62M41r3
7762D73n71L30k60P67m51K06O00r72p61K74R35m30r84J266l9n37L60p73K81M40
7782A54L92o55K97K40o62M72K03m23l2K77q49J299j569J401n84m29R44k71k23
$$ plain form
7801 -18 183 -704 -591 7 -840 709 -197 -111 357 -186 -129 903 -208 251 -580 -624 634 -123 -423 -16
7821 -16 -21 -289 -61 492 371 -688 -429 159 -712 -130 125 602 621 616 -235 168 -89 -746 425 37 423
7842 423 674 79 279 -288 460 -56 -276 -543 656 171 836 -472 327 257 -211 73 443 134 131 -21
7862 -21 -107 14 -707 325 -30 -99 -439 -204 286 13 161 -210 253 -159 355 1115 -153 -632 -497 -290
7882 -290 -490 -184 -342 237 -529 -117 -256 -304 439 442 -166 -796 466 482 222 1299 -583 1033 44 281
7902 281 60 208 -493 73 -9 479 434 -97 -837 -147 660 114 347 468 -547 194 77 387 54 494
7922 494 496 318 -700 -417 155 -8 -69 793 151 68 179 52 105 247 469 105 630 326 811 3 -81 -107
7944 -107 -557 111 -368 615 0 -54 -358 311 -594 -203 -360 -158 -365 562 153 -172 663 906 -243 487
$$ packed form
7801a8K01q87J13N98q47J549r06Q6M68n43N7J032j111M59q31m4J258p57l00M07
7821a6nk68K28N53j21j059K59N88q71N82K55M77J9nq51M03k57o57J171l88L86
7842D23K51n95K00n67P48n16k20k67J199m85O65j308P99p0m68K84L70l09lj52
7862b1q6J21p21J032l55o9l40K35M90k73J48l71M63m12N14P60j268m79J35K07
7882b90k00L06j58N79p66M12j39m8P43Lo08o30J262J6k60J077j882J616r89K37
7902B81k21J48p01N66q2M88m5n31p40O90Q07n46K33J21j015P41j17L10l33M40
7922D94Kj78j018K83N72j63o1Q62o42q3J11j27N3J42K22l64N25l04M85q08q4k6
7944a07m50O68m79R83o15n4l04O69r05L91j57K02k07R27m09l25Q35K43j149P30
$$ plain form
7964 487 -69 346 399 -114 932 65 403 -419 29 20 -305 560 167 389 996 -123 348 -76 585 -740
7984 -740 563 53 -473 441 -706 -189 -171 631 444 426 122 122 -203 -426 -117 60 219 399 -333 674
8004 674 216 8 -46 -274 -725 304 26 587 623 -376 99 -30 217 -943 129 316 -450 115 -203 95
8024 95 -118 -245 98 639 -67 -240 228 -548 -1126 -306 211 12 184 -125 -27 -249 1207 954 -170 489
8044 489 -662 277 843 430 152 201 610 -356 545 74 -213 222 -358 55 110 26 426 255 -88 226 435
8065 435 -246 -201 -254 243 870 83 392 -124 -102 206 -211 -463 -459 -128 -697 -78 -249 525 424 -351 20 107
8087 107 91 -191 -233 212 -21 -392 -85 82 -187 -321 -308 612 -108 104 50 423 340 -123 243 18 78 -165
8109 -165 175 -545 -288 -114 15 -631 98 -60 -313 -124 42 185 -258 549 -295 244 165 -147 337 430 -47
$$ packed form
7964D87n56M15N3n13J046q67L38q22M48rl25Q65l93K22O07j119M71m24O61j325
7984g40J303n10n26R14j147N17J8Q02j87j8l04%l25k23L09J77J59J80p32J007
8004F74m58k08n4k28m51J029k78N61L6r99M75j29K47j160J072J87p66N65l18K98
8024I5k13j27L43N41p06j73M68p76n78Q20N17j99J72l09R8k22J456k53j124O59
8044D89j151R39N66m13k78M9M09r66R01m71k87M35n80M13N5q4M00j71l43L14K09
8065D35o81M5n3M97O27p87L09n16K2L08m17k52ML31n69O19j71P74j01p75L71Q7
8087A07j6k82m2M45k33l71L07J67k69j34J3R20p20K12n4L73q3m63L66k25O0k43
8109a65L40p20K57J74J29o46P29j58k53J89J66J43m43Q07q44N39p9l12M84R3m77
$$ plain form
8130 -47 -435 125 -590 -126 -94 393 -162 358 182 42 45 93 -160 370 665 37 521 507 -309 44 -413 -305
8152 -305 350 -8 229 -20 148 -16 -56 479 -3 -326 245 29 -483 656 -555 -188 89 345 -309 284
8172 284 440 179 -130 -484 235 125 -636 148 212 415 -206 476 -272 -130 469 210 -217 124 10
$$ packed form
8130d7l88N60p15M64L2M87n55N20j76j40LM8k53N30K95o28M84j4q16L53m57J08
8152c05O55l58K37k49J68j64m0N35m82l23N71k16n12J139j211L67K77K56o54N93
8172B84J56k61l09l54P19j10p61P84O4K03o21O82p48J42N99k59m27L41j14
8191A0
$$ Imaginary data points
##PAGE= N=2
##DATA TABLE= (X++(I..I)), XYDATA
$$ plain form
0 0 0 0 0 0 0 0 0 0 0 0 0 0 0 0 0 -7 8 -8 8 -8 10 -15 16 -19 23 -27 31 -34 40 -46 51 -58 66 -74 85 -95 106
37 106 -120 133 -146 163 -182 201 -222 245 -271 298 -327 363 -398 438 -483 534 -589 652 -724
56 -724 805 -901 1015 -1149 1314 -1523 1790 -2154 2672 -3469 4830 -7610 15497 -83796 -312382
71 -312382 -64249 227373 172053 -84081 -149421 -38252 47704 74891 84675 -3798 -139434
82 -139434 -102239 115501 186195 -25644 -195748 -54917 144084 87881 -84753 -73909 50979
93 50979 32755 -64279 -23422 78674 32808 -82031 -61067 50126 52872 -18741 -11497 21544
105 21544 -33688 -64204 48770 137081 4745 -173681 -87507 148455 169591 -52944 -178208
116 -178208 -47595 110738 97718 -1707 -63753 -82335 -38412 79428 133866 -7153 -178962
$$ packed form
0@%%%%%%%%%%%%%%%pJ5j6J6j6J8k5L1l5M2n0N8o5P4q6R7j09J24j40J59j80K01
37A06k26K53k79L09l45L83m23M67n16N69o25O90p61Q36r21J017j123J241j376
56g24J529j706J916k164K463k837L313l944M826o141Q299j2440K3107r9293k28586
71c12382K48133K91622n5320k56134o5340J11169Q5956K7187R784q8473j35636
82a39434L7195K17740P0694k11839j70104J40831J99001n6203j72634J0844J24888
93E0979j8224r7034M0857J02096m5866j14839K0964J11193K746p1613P244L3041
105B1544n5232l0516J12974Q8311j32336j78426Q6174K35962K1136k22535j25264
116a78208J30613J58333j3020r9425o2046j8582M3923J17840N4438j41019j71809
$$ plain form
127 -178962 -107169 129357 171750 -35952 -171807 -56299 102152 86763 -16103 -52987 -28867
138 -28867 -8672 26480 61854 25225 -66466 -65682 40665 85937 30 -71089 -13316 50274
150 50274 5637 -44824 5554 53176 -2861 -71756 -26463 60155 46941 -32450 -52467 -13682
162 -13682 18600 29465 27745 -5884 -61295 -46707 53713 100690 2990 -108662 -66885 74071
174 74071 106542 -2916 -87356 -51016 33335 61392 30255 -22470 -61979 -39612 42604 78159
186 78159 4487 -83635 -57992 44099 72714 -2465 -57970 -31149 18743 28712 6666 -6756
198 -6756 -10274 -14078 825 22758 19218 -8834 -20656 1589 16032 2253 -2481 9641 4831
211 4831 -21005 -18396 20045 34457 -4722 -40172 -22484 20375 33723 3972 -29688 -29373 -1488
$$ packed form
127a78962P1793K36526M2393k07702j35855J15508J58451j5389j02866l6884K4120
138b8867K0195L5152L5374l6629r1691P84J06347M5272q5907p1119N7773O3590
150E0274m4637n0461N0378M7622n6037o8895M5293Q6618j3214p9391k0017L8785
162a3682L2282J0865j720l3629n5411J4588J00420M6977r7700j11652M1777J40956
174G4071L2471j09458q4440L6340Q4351K8057l1137n2725l9509K2367Q2216L5555
186G8159p3672q8122K5643J02091K8615p5179n5505K6821M9892R969k2046j3422
198f756l518l804J4903K1933l540k8052j1822K2245J4443j3779m734J2122m810
211D831k5836K609L8441J4412l9179l5450J7688M2859J3348k9751l3660L15K7885
$$ plain form
224 -1488 27129 28242 -7881 -38450 -24128 24449 47473 7051 -39923 -30706 19083 41578 11887
237 11887 -23879 -24850 133 22174 21710 -3137 -23029 -16900 9979 22754 4649 -18246 -17145
250 -17145 89 12298 6848 -6516 -9835 -3608 349 3207 3544 2741 -2967 -6860 1149 8415 6773
265 6773 1220 -4680 -4597 1832 8961 9607 -2793 -11294 -5049 6367 9935 639 -11074 -10747 1480
280 1480 10628 4842 -8109 -12589 -2370 5587 5696 -1955 -7808 -6358 3202 7594 3831 -3965 -3972 2591
296 2591 6276 5180 236 -1928 -1926 2811 4741 3099 -1986 -2441 -43 -680 -187 -484 -2777 -4389 -2673
313 -2673 -1248 11 -1635 -1352 -1637 -244 1682 -250 -1071 -225 2016 1471 1118 733 1903 973 1168
330 1168 1885 456 -613 1061 1830 859 -2009 407 950 -1094 -1177 -1270 -2355 -1451 -6 -1169 -1193 -2473
$$ packed form
224a488K8617J113l6123l0569J4322M8577K3024m0422m6974R217M9789K2495k9691
237A1887l5766r71K4983K2041m64k4847j9892O129K6879J2775j8105k2895J101
250a7145J7234J2209n450j3364l319O227L957K858L37q03n708l893Q009P266j642
265F773n553n900Q3O429P129O46j2400q501O245J1416L568r296j1713L27J2227
280A480R148n786j2951m480J0219P957J09p651n853J450R560M392l763p796pO563
296B591L685j096m944k164KM737J930j642n085m55K398o37M93k97k293j612J716
313b673J425J259j646K83k85J393J926j932q21Q46K241n45l53l85J170r30J95
330A168P17j429j069J674P69r71k868K416N43k044q3r3j085R04J445j163k4j280
$$ plain form
348 -2473 197 681 -1213 1081 60 -1579 369 2644 2049 2762 987 910 7 1781 5557 1451 -1574
365 -1574 -1983 2101 3172 698 -2569 -4262 -2308 1929 2773 -4329 -5334 -1412 1091 1825 -503 -4781
381 -4781 -1278 1836 5377 -263 -5266 -1088 5458 5579 1342 -2148 -2082 4732 5567 1047 -5117 -4791
397 -4791 5314 7305 143 -6589 -5599 3143 5908 -637 -8310 -8856 -126 8266 2536 -9579 -8945
412 -8945 1412 8340 3040 -5220 -5952 1584 7856 4982 -4461 -5036 3187 6865 3459 -4150 -4479 2218
428 2218 9483 3536 -8625 -9849 5623 11771 -268 -14562 -10420 6998 13719 135 -14408
441 -14408 -12990 3780 16256 10325 -12289 -19369 -2317 22446 19729 -9542 -25941 -5558 24362
454 24362 24663 -7156 -25391 -7941 16525 19879 837 -17712 -15390 3189 19149 11118 -13926
$$ packed form
348b473K670M84j894K294j021j639J948K275n95P13j775p7r03J774L776m106l025
365a574m09M084J071k474l267j693J954M237Q44p102j005L922K503P34k328m278
381d781L503L114L541n640n003M178O546J21m237l490O6O814Q35m520o164L26
397d791J0105J991p162o732R90Q742K765o545p673n46Q730Q392n730j2115O34
412h945J0357O928n300q260p32P536O272k874r443n75Q223L678l406p609l29O697
428B218P265n947j2161j224J5472O148j2039j4294M142J7418O721j3584j4543
441a4408J418J6770J2476n931k2614p080J7052K4763k717k9271j6399K0383K9920
454B4362L01l1819j8235J7450K4466L354j9042j8549K322J8579J5960q031k5044
$$ plain form
467 -13926 -22606 -1112 21042 10274 -17105 -17535 5387 15624 112 -13268 -3622 9281 4177
480 4177 -6853 -5267 4133 7606 4480 -1141 -6802 -6593 8828 21866 2458 -29391 -19598 25718
494 25718 37380 -6440 -43509 -19343 27518 32135 -3142 -32744 -24411 7354 28644 23903 -15035
507 -15035 -42238 -17649 38586 47053 -11745 -56672 -17237 43599 40334 -14354 -37097 -7470
519 -7470 20298 17795 5247 -6763 -18827 -10380 15366 24521 -5716 -30848 -8373 25999 10916
532 10916 -21962 -14219 19719 14080 -22245 -21930 18513 28849 -7558 -30713 -7906 19725 17144
545 17144 2874 -6762 -19359 -16806 22111 47893 4554 -59857 -40108 45811 66807 -8635
557 -8635 -69379 -30847 39748 45020 -2087 -31592 -29848 -6106 26029 39466 1434 -55920 -39819
$$ packed form
467a3926q680K1494K2154j0768k7379m30K2922J0237j5512j3380R646J2903n104
480D177j1030J586R400L473l126n621n661K09J5421J3038j9408l1849R793M5316
494B5718J1662m3820l7069K4166M6861M617l5277k9602Q333L1765K1290m741l8938
507a5035k7203K4589N6235Q467n8798m4927L9435O0836l265n4688k2743K9627
519g470K7768k503j2548j2010j2064Q447K5746R155l0237k5132K2475L4372j5083
532A0916l2878P743L3938n639l6325L15M0443J0336l6407k3155K2807K7631k581
545A7144j4270r636j2597K553L8917K5782m3339o4411J9749Q5919K0996p5442
557h635o0744L8532P0595N272m7107k9505J744K3742L2135J3437l8032n7354J6101
$$ plain form
570 -39819 39938 64228 -5285 -62587 -22930 42973 35826 -15027 -22920 1963 5735 -2209 8990
583 8990 15221 -7786 -25602 -614 25085 3661 -21029 -2841 18635 -4693 -30597 3229
595 3229 42643 8565 -50663 -33537 36697 49670 -9844 -43982 -17480 18429 26282 15800
607 15800 -2866 -31692 -33542 24465 64957 13203 -69327 -53822 42712 74360 475 -64931
619 -64931 -32487 25644 35658 7783 -12887 -25215 -23155 10206 45853 17651 -44551 -44546 21935
632 21935 53565 2583 -40761 -13268 22589 11185 -11396 1232 16823 -5776 -23641 2046
644 2046 27169 9175 -18624 -13591 7610 2664 -1132 14666 10011 -25076 -35294 14660 53483
657 53483 8794 -55273 -38198 29710 49126 2536 -34923 -25854 3045 24224 27909 5045
$$ packed form
570c9819P9757K4290o9513n7302L9657O5903p147n0853p893K4883L772p944J1199
583H990O231k3007j7816K4988K5699k1424k4690J8188K1476k3328k5904L3826
595C229L9414l4078n9228J7126P0234J2973n9514l4138K6502L5909P853j0482
607A5800j8666k8826j850N8007M0492n1754q2530J5505R6534L1648p3885o5406
619f4931L2444N8131J0014k7875k0670j2328K060L3361L5647k8202o2202NO6481
632B1935L1630n0982m3344K7493L5857j1404k2581J2628J5591k2599j7865K5687
644B046K5123j7994k7799N033K1201m946l796J5798m655l5087j0218M9954L8823
657E3483m4689o4067J7075O7908J9416m6590l7459R069K8899K1179L685k2864
$$ plain form
669 5045 -34623 -36343 17160 58938 18879 -49075 -45434 20965 51212 11141 -31929 -24203 2236
682 2236 14346 13232 6393 -13076 -27593 -5643 27575 20418 -17469 -27613 1041 20213 5505
695 5505 -7289 678 3549 -9409 -9087 14789 21795 -3124 -25416 -9291 18118 17895 325 -13443
709 -13443 -12754 -3740 12852 22040 5796 -28073 -28284 12542 37779 10486 -32282 -30557 9267
722 9267 30081 14433 -13859 -23391 -9960 13164 25933 9363 -19907 -27619 2037 30150 17876
735 17876 -15327 -24709 -348 18427 13375 -2463 -10165 -7961 -2000 7457 13468 942 -15018
748 -15018 -11859 4976 12868 3823 -7546 -8381 -4632 1849 9442 7169 -3430 -13654 -7896 11051
762 11051 17423 2469 -14464 -12149 5739 16143 10117 -5790 -14066 -6511 8671 16411 3740
$$ packed form
669E045l9668j720N3503M1778m0059o7954L641O6399L0247m0071m3070P726K6439
682B236J2110j114o839j9469j4517K1950L3218p157l7887j0144K8654J9172j4708
695E505j2794P967K871j2958L22K3876P006k4919k2292J6125K7409k23j7570j3768
709a3443O89R014J6592R188j6244l3869k11M0826K5237k7293m2768J725L9824
722I267K0814j5648k8292r532J3431K3124J2769j6570k9270p712K9656K8113j2274
735A7876l3203r382K4361J8775n052j5838p702K204N961R457O011j2526j5960
748a5018L159J6835P892r045j1369q35L749O481P593k273j0599j0224N758J8947
762A1051O372j4954j6933K315J7888J0404o026j5907q276P555J5182P740j2671
$$ plain form
775 3740 -14260 -16212 2348 16186 8179 -8617 -16057 -5993 10758 11456 -69 -10733 -10818 2210
789 2210 10528 8903 -2243 -9924 -5246 7338 10042 3259 -5188 -7200 10 7278 7622 657 -7985
804 -7985 -7456 2115 7649 4461 -3300 -9846 -4466 3682 6926 1614 -7726 -7271 -298 5770 5603 -1826
820 -1826 -6783 -3788 3240 7967 3276 -4131 -5251 -362 6470 6227 688 -4286 -3243 1846 4672
835 4672 2999 -2638 -4356 -2056 1805 3389 337 -4047 -4396 -989 2609 1440 -752 -3781 -3409 1882
851 1882 4956 1429 -1654 -2833 -532 3474 3202 681 -1595 -1580 1339 3272 1776 -1325 -2326 -864
867 -864 1226 523 -56 -1777 -1571 -1194 -321 -376 -590 -2506 -1479 -339 875 1028 -700 -1445 -566 1029
885 1029 1544 1245 -756 -1207 896 2702 2769 -370 -1558 793 980 2135 95 -3014 -475 1705 1132
$$ packed form
775C740j8000j952J8560J3838q007j6796p440J0064J6751O98j1525j0664q5J3028
789B210Q318j625j1146p681M678J2584K704o783q447k012P210P268L44o965q642
804g985N29R571N534l188p761o546N380Q148L244n312r340M55O973O068j67p429
820a826m957K995P028M727m691p407j120M889O832k43n539m974J043N089K826
835D672j673n637j718K300L861J584l052m384l49L407L598j169k192l029L72N291
851A882L074l527l083j179K301M006k72k521k276J5K919J933j496l101j001J462
867h64K090p03n79j721K06L77Q73n5k14j916J027J140J214J53j728p45Q79J595
885A029N15k99k001m51K103J806O7l139j188K351J87J155k040l109K539K180n73
$$ plain form
902 1132 -2456 -3502 -1316 1212 634 -1195 -2572 -1926 2405 2841 -1149 -3014 -1553 3443 2997 -1123
918 -1123 -1530 -1338 3021 4863 520 -3377 -3270 2919 4579 941 -4874 -2500 2403 4696 1298 -4787
934 -4787 -3498 1329 3833 307 -5279 -4323 815 4098 623 -4612 -3981 1645 5133 2979 -4072 -4785
950 -4785 2864 7324 2767 -4424 -5518 3267 8301 2294 -5451 -6258 1307 6785 4155 -5577 -7281
965 -7281 -20 7209 4825 -4327 -8466 -2159 7300 5980 -4889 -8233 -817 8057 7047 -3657 -8926
980 -8926 -271 8847 8788 -3104 -10119 -1485 8348 9312 -1831 -10171 -4792 7828 10578 -254 -12661
995 -12661 -7507 7947 13124 -1618 -13776 -8702 6806 13587 100 -11218 -9600 4025 12117
1008 12117 4427 -8024 -10577 347 11911 8869 -7454 -11394 1340 13782 6855 -8446 -10440
$$ packed form
902A132l588j046K186K528n78j829j377O46M331M36l990j865J461M996m46m120
918a123m07J92M359J842m343l897J07O189J660l638n815K374M903K293l398o085
934d787J289M827K504l526n586R56N138L283l475n235O31N626L488k154p051p13
950d785P649M460m557p191j094Q785N034o007p745q07P565N478k630r732j704
965g281P261P229k384r152m139O307R459j320j0869l344P416Q874j010j0704n269
980h926Q655R118n9j1892p015Q634R833R64j1143q340N379J2620K750j0832j2407
995a2661N154J5454N177j4742j2158N074J5508O781j3487j1318J618J3625Q092
1008A2117p690j2451k553J0924J1564l042j6323l940J2734J2442o927j5301j994
$$ plain form
1021 -10440 2183 10620 1969 -8243 -6534 2366 5275 2224 -5432 -8077 325 9200 6367 -8210
1035 -8210 -14281 776 16796 7972 -13747 -17341 4536 19943 7516 -13018 -14411 2914 14794
1048 14794 10336 -5240 -15601 -7803 12107 19467 365 -21424 -15725 13588 24083 -711 -22296
1061 -22296 -13519 11634 16155 -422 -12550 -8427 2002 8974 7238 -3053 -10294 -5252 10211
1074 10211 12434 -4615 -14057 1872 14349 3727 -13025 -6082 12957 10175 -8788 -12906 1961
1087 1961 10172 4367 -6148 -8011 -5738 2950 12202 7037 -15645 -21696 4403 27699 11711 -25312
1101 -25312 -25348 11126 29992 7105 -20459 -17067 2616 16330 13043 -312 -16636 -16248 8689
1114 8689 27203 9617 -23974 -22528 11806 26937 1364 -22118 -10547 10608 9381 -2779
$$ packed form
1021a0440J2623Q437q651j0212J709Q900K909l051p656k645Q402Q875k833j4577
1035h210o071J5057J6020q824k1719l594K1877J5407j2427k0534j393J7325J1880
1048A4794m458j5576j0361P798J9910P360j9102k1789N699K9313J0495k4794k1585
1061b2296Q777K5153M521j6577j2128M123J0429O972j736j0291p241N042J5463
1074A0211K223j7049r442J5929J2477j0622j6752O943J9039k782j8963m118J4867
1087A961Q211n805j0515j863K273Q688R252n165k2682o051K6099K3296j5988l7023
1101b5312l6L6474J8866k2887k7564L392J9683J3714l287j3355j6324L88K4937
1114H689J8514j7586l3591J446L4334J5131k5573k3482J1571K1155j227j2160
$$ plain form
1126 -2779 -4833 -1119 -3664 -3669 6208 6478 -5308 -9128 4783 8822 -3473 -8500 7910 13878 -6384
1141 -6384 -18356 1417 23032 8264 -18003 -17309 7193 18956 4998 -8737 -12105 -7781 5390
1154 5390 17854 10031 -18463 -28180 3629 34160 13680 -26601 -28276 7562 27999 9063 -13835
1167 -13835 -14987 -3254 7620 14040 8994 -10616 -19868 -56 23055 13245 -15223 -20390 4032
1180 4032 15759 2416 -8204 -1663 2633 -3169 -4243 6360 9016 -5694 -11672 -663 8660
1193 8660 3432 -1877 -1215 -1135 -6533 526 14995 9651 -13875 -19825 5532 25975 9001 -17911
1207 -17911 -18136 4481 17493 9377 -4696 -13213 -11849 2713 19244 11930 -13728 -25197 -534
1220 -534 24603 14489 -14129 -19462 -1264 13662 9662 -1302 -7967 -8336 -1596 9439 12378 -1416
$$ packed form
1126b779k054L714k545nR877K70j1786l820J3911M039j2295n027J6410N968k0262
1141f384j1972J9773K1615j4768k6267O94K4502J1763j3958j3735l368M324J3171
1154E390J2464p823k8494r717L1809L0531k0480m0281j675L5838K0437j8936k2898
1167a3835j152J1733J0874O420n046j9610r252J9812K3111r810k8468n167K4422
1180D032J1727j3343j0620O541M296n802j074J0603K656j4710n978J1009R323
1193H660n228n309O62Q0n398P059J4469n344k3526n950K5357K0443j6974k6912
1207a7911k25K2617J3012q116j4073q517J364J4562J6531p314k5658j1469K4663
1220e34K5137j0114k8618n333J8198J4926m000j0964o665l69O740J1035K939j3794
$$ plain form
1234 -1416 -14250 -7674 8822 12176 213 -7947 -3373 575 1198 3769 6055 -1141 -10309 -7487
1248 -7487 8174 11469 -1210 -12078 -7872 3998 8527 5513 -2476 -9076 -8216 4105 15138 7612
1262 7612 -11441 -14309 1645 17030 10114 -6783 -13579 -3983 8466 10699 3030 -8336 -11812
1275 -11812 -1197 11465 10099 -5005 -15235 -6661 8464 10403 -822 -8477 -7638 193 6017
1288 6017 6577 -65 -6125 -6934 2256 9193 5709 -4208 -7847 -2753 6477 7516 2220 -4721 -6225
1303 -6225 -1330 7231 7105 -14 -8325 -7450 2537 7355 3980 -6002 -8728 -3010 7058 7360 1288
1318 1288 -8024 -7454 1137 8255 6032 -4062 -8332 -2099 6975 7604 996 -5673 -5692 1087 7745 6100
1334 6100 -824 -5750 -3370 2796 6576 3070 -4691 -6091 -1727 5174 5400 -339 -5054 -4607 1215
$$ packed form
1234a416j2834O576J6496L354j1963q160M574L948O23K571K286p196r168K822
1248g487J5661L295j2679j0868M206J1870M529l014p989o600Q60J2321J1033p526
1262G612j9053k868J5954J5385o916j6897o796R596J2449K233p669j1366l476
1275a1812J0615J2662j366j5104j0230Q574J5125J939j1225p655Q39P831N824
1288F017N60o642o060q09R190O937l484r917l639N094R230J039n296o941j504
1303f225M895Q561j26p119q311Q75R987M818l375r982k726N718J0068L02o072
1318A288r312N70Q591P118k223j0094m270O233R074O29o608o669j9O779O658j645
1334F100o924m926K380O166L780l506p761j400M364O901K26n739m715M47N822
$$ plain form
1349 1215 6335 4066 -2213 -5313 -2675 3853 7156 1426 -4886 -3700 203 5680 5151 -412 -4565
1364 -4565 -3185 3058 5033 1824 -2921 -4089 -1467 3760 2670 -1168 -3784 -3545 557 3907 2530
1379 2530 -1773 -4884 -1666 1823 3774 855 -2864 -2533 799 3310 3017 -43 -2714 -1282 2496
1394 2496 3734 431 -2162 -1966 388 2384 908 -1216 -1726 -1436 -86 1467 139 -1012 -1814 -1061
1410 -1061 526 967 59 -322 -193 -17 -71 1804 174 -24 -841 337 2002 1733 42 -1234 -1636 1005
1428 1005 2754 496 -1462 -2352 -666 2152 925 -1789 -3029 -847 3318 2606 -779 -3280 -1328
1443 -1328 1768 2094 -1213 -3230 -1349 1696 2965 -785 -2754 282 3057 2971 551 -2827 -1691 2103
1459 2103 3233 197 -3069 -2421 2164 3583 -181 -3648 -3613 1663 3617 1689 -2906 -4060 1464 3866
$$ packed form
1349A215N120k269o279l100K638O528L303n730o312J186L903N477n29n563m153
1364d565J380O243J975l209m745j168K622N227j090l838k616K39M102L350j377
1379B530m303l111L218L489J951k919l719L31L332K511k93l060k671J432L778
1394B496J238l303k593J96K354J996j476k124n10K90J350J553j328j151q02P53
1410a061J587M41r08l81J29J76n4J875j630j98q17J178J665k69j691j276m02K641
1428A005J749k258j958q90J686K818j227k714j240K182M165p12l385k501J952
1443a328L096L26l307k017J881L045J269l750j969L036K775q6k420l378J136L794
1459B103J130l036l266O48M585J419l764l467L5N276J954j928m595j154N524K402
$$ plain form
1475 3866 1936 -3256 -3262 1883 4314 2349 -2881 -2733 946 4073 1582 -1796 -3450 -593 4727 2647
1491 2647 -2985 -3912 -36 4878 3189 -3456 -4482 -845 4624 3140 -2825 -5121 -988 5457 3574
1506 3574 -2781 -5933 -158 5384 4959 -530 -5579 -2370 5444 6368 -1380 -7899 -2767 4248 6968
1521 6968 -672 -7351 -3865 3358 6355 275 -7947 -5442 3290 6545 922 -6163 -5904 2532 6589
1536 6589 1762 -6061 -5195 4008 7402 1277 -5800 -4959 2833 8626 3456 -5118 -6221 1993 7175
1551 7175 3197 -4830 -6558 1028 6527 3800 -4552 -7629 -450 7971 3944 -5770 -8029 -1416 6649
1566 6649 4124 -4892 -7310 -218 5783 5479 -3043 -6737 -1457 6389 6310 -2329 -7417 -2842 7116 7188
1582 7188 -2241 -9707 -2667 7671 7524 -2483 -9433 -2903 6664 7103 -2002 -9165 -4695 4406 8870
$$ packed form
1475C866j930n192oN145K431j965n230J48L679L127k491l378j654K857N320k080
1491B647n632r27L876M914j689o645j026L637N469j484n965k296M133O445j883
1506C574o355l152N775N542m25n489n049L209P814R24p748o519N132P015K720
1521F968p640o679L486P223K997o080q222K505Q732L255n623p085K59Q436M057
1536F589m827p823Q66R203L394o125p077Q41P792N793n170q574j103Q214N182
1551G175l978q027j728P586N499k727q352l077P179Q421m027r714k259O613Q065
1566F649k525r016k418P092O001l04q522l694N280P846p9q639n088M575R958P2
1582G188r429p466P040J0338j47j0007o950O530R567M39r105p163M470R101M464
$$ plain form
1597 8870 1256 -8449 -8891 3457 11618 3294 -8669 -8941 4673 11223 2792 -6971 -6390 2962 8125
1612 8125 2997 -3497 -5831 -1659 4903 4995 -2731 -7638 -2723 5788 5724 -5388 -8045 160 8079 2148
1628 2148 -6970 -6138 3419 5672 -471 -4647 -4123 1996 6343 2469 -3542 -6889 -2099 9423 8246
1643 8246 -5209 -11393 -1102 13417 8037 -6987 -12159 -684 9142 7000 -3037 -8304 -4898
1656 -4898 2810 9801 4612 -7345 -11151 1210 12863 5537 -7949 -8974 2520 9681 2543 -5627
1670 -5627 -3545 1421 2401 1444 1339 -357 -2916 -1081 3688 2245 -4130 -2364 2679 1497 -4595 -2844
1686 -2844 4899 6098 -3615 -10199 -1146 8434 5312 -4006 -7636 -854 4078 5696 2074 -5038 -7847
1701 -7847 -1171 11701 9919 -5679 -14146 -1776 12667 8975 -6129 -11643 -2602 6264 6853 313
$$ packed form
1597H870p614r705m42J2348Q161q324j1963k72J3614O550q431r763N81R352N163
1612H125n128o494k334M172O562R2p726m907M915Q511o4j1112k657Q205P919n931
1628B148r118Q32R557K253o143m176N24O119M347l874o011l347M790J1522j177
1643H246j3455o184J0291J4519n380j5024n172J1475R826k142j0037n267L406
1656d898P708O991n189j1957l806J2361J1653p326j3486j025J1494P161p138q170
1670e627K082M966R80r57j05j696k559J835M769j443o375J766N043j182o092J751
1686b844P743J199r713o584R053R580l122r318l630O782M932J618l622p112k809
1701g847O676J2872j782j5598q467J2370J4443l692j5104n514R041Q866N89o540
$$ plain form
1715 313 -5544 -6968 -1840 6986 7741 -2798 -10122 -3789 7792 7028 -2453 -6382 132 2754 1256
1730 1256 609 1998 -702 -3546 -2077 4772 4540 -934 -4416 -2686 1350 2019 2127 1790 -3350 -7692
1746 -7692 -4 7550 5745 -5892 -10547 -962 8813 6499 -3491 -8243 -3382 3151 7546 3993 -4436
1761 -4436 -8996 -2088 9036 8875 -2443 -10491 -3861 7269 8334 -143 -5792 -4516 139 4204
1775 4204 4843 -4 -6155 -5825 2415 6869 2682 -5563 -6074 -1018 3464 4227 -335 -2755 -3429 -1699
1791 -1699 3321 6458 1213 -5281 -5205 2150 6801 3570 -3381 -4645 -2013 3022 5724 1395 -5218
1806 -5218 -6450 3 5719 5030 -2790 -8505 -3039 4269 6978 327 -5483 -5110 419 5876 4746
1821 4746 -1363 -5967 -3835 2788 6642 2718 -4329 -5607 -148 4482 5073 52 -4753 -3902 617
$$ packed form
1715C13n857j424N128Q826P55j0539p324O333J1581p64r481l929O514K622j498
1730A256o47J389k700k844J469O849k32n474l482J730M036O69J08l37n140m342
1746g692P688P554j805j1637m655R585R775k314r990m752M861O533M395l553q429
1761d436m560O908J1124j61j1318q048O630J1130J065q477n649J276M655M065
1775D204O39m847o151L30Q240M454m187q245n11N056M482P63m562k420o74J730
1791a699N020L137n245o494P6P355M651l231o951j264K632N035K702m329o613
1806e218j232O453N716o89p820n715N466P308K709o651n810L73N529N457j130
1821D746o109m604K132O623L854l924p047j278N459M630N91n021m805Q51M519
$$ plain form
1836 617 5053 3961 -1956 -6695 -3696 3944 5822 812 -4604 -5638 216 4098 3858 -1260 -5165
1851 -5165 -4046 1757 5008 2804 -3217 -4828 -464 4591 4603 -259 -5198 -3561 1679 4702 2947
1866 2947 -2377 -4481 -1991 2664 4559 1034 -4451 -4769 -395 3630 3377 -1519 -4682 -2758 1663
1881 1663 4152 1951 -2207 -3300 -771 3271 3790 285 -4067 -2930 1014 4634 2296 -1785 -3791
1896 -3791 -1517 3445 3986 548 -3606 -3726 -510 3254 2136 -1232 -3094 -2418 1167 3188 1423 -2239
1912 -2239 -3657 -162 3569 2553 -279 -2876 -2003 662 2550 2866 -323 -2002 -1587 2004 3393 1089
1928 1089 -2834 -2338 199 2471 1986 -1343 -3537 -1668 1895 1873 456 -2246 -1715 134 1474 1678
1944 1678 -1428 -1697 -691 1127 894 475 -213 -909 -466 841 1732 465 -360 -260 -223 368 455 474 -523
$$ packed form
1836F17M436j092n917m739K999P640J878n010n416j034N854L882k40n118l905
1851e165J119N803L251k204o021j611M364N055J2m862m939J637N240L023j755
1866B947n324k104K490M655J895l525n485l18M374M025k53m896l163J924M421
1881A663K489k201m158j093K529M042N19l505m352J137L944L620k338m081k006
1896c791K274M962N41l438m154j20L216L764j118l368j862O76L585K021j765l662
1912b239j418L495L731j016k832k597Q73K665J888L16l189j679M15L591J389k304
1928A089l923M96K537K272m85l329k194J869L563k2j417k702N31J849J340K04
1944A678l106k69J006J818k33m19o88o96M43J307Q91j267q25J00L7N91Q7J9r97
$$ plain form
1963 -523 -1991 -1386 260 2550 1592 -1912 -1607 737 1934 1225 -1562 -1519 -748 1121 2292 -260 -2025
1980 -2025 -1960 1637 2861 -30 -2655 -2473 1525 2505 -456 -2448 -2303 969 2119 497 -1489 -2034
1996 -2034 -96 1693 638 -2154 -2170 812 2351 560 -3488 -1710 220 2553 1350 -2317 -2376 167
2012 167 2673 1401 -879 -2038 -96 2746 3185 -2481 -3544 -433 2881 2721 -2472 -3183 -402 2800
2028 2800 1590 -1548 -3630 -1511 2245 2356 -773 -3525 -1207 2787 3262 -1448 -3805 -527 3564
2043 3564 3560 -1489 -3383 -1 3187 2614 -759 -3409 -1762 2962 4149 -251 -3546 -2675 1743 4665
2059 4665 -144 -4869 -3498 2018 3824 -51 -4155 -2638 1897 5149 1351 -3045 -3697 586 4369
2074 4369 2807 -2608 -4386 -213 4260 3179 -2599 -4204 200 4426 1825 -2053 -3909 338 2812
$$ packed form
1963e23j468O05J646K290r58l504L05K344J197p09k787M3P71J869J171k552j765
1980b025O5L597J224k891k625J82L998R80k961j992J45L272J150j622j986n45
1996b034J938J789j055k792j6K982J539j791m048J778J930K333j203l667n9K543
2012A67K506j272k280j159J942K842M39n666j063L111L314j60n193p11K781L202
2028B800j210l138k082K119L756J11l129k752K318L994M75m710k357L278M091
2043C564mn049j894L382L188n73l373k650J647M724J187m400l295Q71M418K922
2059D665m809m725J371N516J806l875m104J517M535L252l798m396o52M283L783
2074D369j562n415j778M173M473j081n778j605M404M226k601l878j856M247K474
$$ plain form
2089 2812 1735 -1197 -3760 -1093 3845 2623 -1474 -3856 -1309 4299 1905 -1650 -4411 63 4188
2104 4188 3391 -2032 -4520 -197 3674 4396 -1329 -3779 -1658 3392 4162 -98 -4618 -2647 3102 4356
2120 4356 -963 -4536 -3168 1810 4374 399 -5361 -3566 1774 4909 678 -3641 -3704 735 4913
2135 4913 1706 -3396 -3539 1650 4801 2413 -3761 -3523 666 3360 2005 -2478 -3700 837 4216
2150 4216 1593 -3076 -3885 -540 3242 3033 -2125 -2888 143 3183 1359 -1627 -3566 -478 3974 1935
2166 1935 -695 -2734 -1244 2720 3495 516 -3082 486 3544 2125 -1165 -3517 -1082 2613 3276
2181 3276 -607 -3352 -887 2950 3127 -502 -3491 -2167 3003 4022 -676 -3902 -2618 2704 4391
2196 4391 -1264 -5388 -1846 1719 4348 1754 -2387 -3614 24 4763 2614 -1574 -4655 197 4585
$$ packed form
2089B812j077k932k563K667M938j222m097k382K547N608k394l555k761M474M125
2104D188p97n423k488M323L871P22n725k450K121N050P70m260m520J971N749J254
2120D356n319l573J368M978K564l975n760J795N340L135m231m319o3M439M178
2135D913l207n102j43N189L151k388o174K38M189K694j355m483j222M537L379
2150D216k623m669q09L345L782k09n158p63L031L040j824k986j939L088M452k039
2166A935k630k039J490L964P75k979l598L568L058j419l290k352K435L695O63
2181C276l883k745K465L837J77l629k989J324N170J019m698l226J284N322J687
2196D391n655m124L542L565K629k594m141j227L638M739k149m188l081M852M388
$$ plain form
2211 4585 3228 -2425 -2144 54 1477 1209 -2081 -420 -1139 493 1009 -1440 -1048 -583 -437 745 -136
2228 -136 -1766 -3 1840 1210 -1964 -1724 1267 3450 508 -3228 -2110 2812 2675 1953 -3070 -3013 -763
2245 -763 3208 3757 -624 -4515 -2172 2576 4701 -65 -4168 -3389 2914 3763 1018 -2736 -2816 159
2261 159 2739 2243 -276 -2630 -2694 1741 3198 1791 -1663 -953 575 2442 413 -764 332 -425
2277 -425 -659 -540 1479 557 -2009 -1359 53 1369 345 -1477 -873 -1191 -163 2019 1751 109 -3064
2294 -3064 -410 3287 3796 -439 -3891 -1919 2949 4428 451 -2660 -2742 -127 2363 3283 -1200 -3455
2310 -3455 -1980 739 3177 661 -4442 -3138 -601 2079 2798 -836 -2906 -2574 658 3345 2512 -1014
2326 -1014 -3572 -1102 2435 2890 164 -3002 -2422 -55 1906 1430 -1041 -3008 -1987 78 3297 2110
$$ packed form
2211D585j357n653K81K198J423k68l290J661p19J632N16k449L92M65J46J182q81
2228a36j630J763J843o30l174K40K991K183k942l736J118M922j37p22n023N7K250
2245g63L971N49m381l891K343M748K125m766m103P79O303Q49k745l754q0K975
2261A59K580m96k519k354o4M435J457j407l454P10J528J867k029j177J096p57
2277d25k34J19K019r22k566O50J412J316j024j822O04l18J028K182k68j642l173
2294c064K654L697N09m235l452J972M868J479l977l111q2K615K490R20m483k255
2310c455J475K719K438k516n103J304K537K680P19l634k070L32L232K687q33l526
2326a014k558K470L537M55k726l166N80K367J961m76k471j967J021K065L219j187
$$ plain form
2342 2110 -2630 -4130 -889 2783 2469 -169 -2797 -2378 1268 3090 1625 -439 -2776 -986 2054
2357 2054 3750 759 -2815 -2354 677 3421 2750 -445 -2223 -1711 560 2809 1448 -2360 -3110 -640
2373 -640 2677 2926 -109 -3595 -2229 314 2896 2881 -1075 -2471 -1260 2347 3803 484 -2439 -2859
2389 -2859 -86 3508 2519 -661 -3140 -1595 1251 4243 1318 -2553 -3733 -1217 2380 2143 -579
2404 -579 -2439 -2825 689 2504 1477 -1392 -2386 -473 1715 2525 1015 -2224 -1841 63 2261 2200 -584
2421 -584 -2258 -1642 1018 3188 865 -2744 -2429 -216 2469 2319 -494 -2135 -1455 1572 1610 1590 -1534
2438 -1534 -2805 -1470 1799 2192 284 -1715 -1423 588 1865 1221 -157 -1660 13 1307 2581 1487
2454 1487 -1348 -2025 -926 1691 2550 -32 -1652 -2441 -94 2247 1976 -245 -2744 -1481 929 2891
$$ packed form
2342B110m740j500L241L672l14k638k628M19L646J822j465k064k337J790L040
2357B054J696k991l574M61L031K744o71l195j778N12K271K249j361l808p50K470
2373f40L317K49l035l486J366K543K582j5l956j396J211L607J456l319k923m20
2389b859K773L594r89l180k479J545K846K992k925l871j180K516L597k37k722
2404e79j860l86L514J815j027k869r94J913K188Q10j510l239L83J904K198o1k784
2421e84j674O16K660K170k323l609L15K213K685j50k813j641O80L027L8k0l124
2438a534j271J335L269L93j908j999K92K011J277o44j378j503J673J294J274j094
2454A487k835o77J099K617Q59k582j620p89K347K341k71k221k499J263K410J962
$$ plain form
2470 2891 923 -1827 -2063 588 2328 807 -1471 -1979 -582 1599 2120 1255 -1022 -1355 177 2548
2486 2548 2079 -1668 -2001 -254 1451 937 -414 -668 -758 -402 -97 790 -88 -306 -1025 -59 80 -127 125
2505 125 -577 186 262 513 317 1344 -607 -1597 464 2521 1080 -1033 -1930 -398 1700 2259 -154
2522 -154 -1429 -1226 -66 1944 658 -1806 -2162 267 2695 651 -1519 -2427 -257 1271 625 -1118
2538 -1118 -737 263 1051 1575 -672 -1893 -931 999 1140 -348 -1820 -965 1973 1508 -567 -2036 263
2555 263 1321 875 -620 -1768 -440 794 1315 -513 -1890 -1441 1612 1637 -567 -2145 -1333 1915 2371
2572 2371 481 -1808 -920 1648 1959 544 -1044 -1007 1013 1773 445 -2409 -1625 968 2149 478
2588 478 -2281 -1210 724 1652 202 -1037 -1071 667 1755 524 -1589 -2362 78 1713 807 -1499
$$ packed form
2470B891j968k750k36K651J740j521k278n08J397K181N21q65k277l33J532K371
2486B548m69l747l33J747J705n14j351k54r0L56L05Q87q78k18p19R66J39k07K52
2505A25p02P63P6K51j96J027j951r90K061K057j441k113q97J532K098N59k413
2522a54j275K03J160K010j286k464l56K429K428k044k170r08K170J528o46j743
2538a118L81J000P88N24k247j221R62J930J41j488j472Q55K938m65k075j469K299
2555B63J058m46j495j148J328J234N21j828j377M49L053K5k204j578Q12L248M56
2572B371j890k289Q88K568L11j415j588L7K020P60j328k854P84K593J181j671
2588D78k759J071J934R28j450j239l4J738J088j231k113p73K440J635r06k306
$$ plain form
2604 -1499 -1786 890 2945 1124 -1794 -2789 -309 2578 2266 -1713 -2200 -899 2369 2127 -1107 -3184
2620 -3184 -1622 1348 2456 -381 -2882 -1257 1734 2473 -561 -2493 -937 1394 1553 -120 -1704
2635 -1704 -433 157 1380 43 -485 -472 2129 2032 -605 -2131 -163 1410 2478 -554 -3111 -431
2651 -431 1561 1819 -614 -2072 -1100 1629 1455 682 -2313 -2633 980 3192 1418 -2897 -1374 879
2667 879 2691 1573 -995 -2561 -291 2242 1168 -1394 -1945 308 1034 1757 -447 -1797 -785 974
2683 974 1969 -1175 -2132 -65 1495 1130 -761 -1489 601 892 1513 256 -835 -954 783 953 277
2700 277 -1685 14 1728 1230 -490 -1340 436 1894 921 -732 -1113 -872 1043 671 -743 -1665 -1068
2717 -1068 1053 2044 30 -2108 -1830 551 1694 -377 -2460 -908 2131 1405 -116 -2068 -596 481
$$ packed form
2604a499k87K676K055j821k918r95K480K887l12l979m87J301L268k42l234k077
2620c184J562K970J108k837k501J625K991P39l034j932J556K331J59j673j584
2635a704J271N90J223j337n28J3K601r7k637j526J968J573J068l032k557K680
2651d31J992K58k433j458R72K729j74p73k995l20L613K212j774m315J523K253
2667H79J812j118k568j566K270K533j074k562n51K253P26P23k204j350J012J759
2683I74R95l144r57K067J560l65j891p28K090K91O21j257j091j19J737J70o76
2700B77j962J699J714m98j720q50J776J458r73j653l81K41J915l72j414r22N97
2717a068K121R91k014k138K78K381J143k071k083J552L039p26j521j952J472J077
$$ plain form
2733 481 2164 785 -858 -1175 -116 2047 976 -344 -1716 -6 1044 1458 -969 -1567 560 1975
2749 1975 1590 -1221 -1314 -48 681 1017 262 -1022 -447 1621 1256 -95 -1136 105 1360 -107 -934
2766 -934 -2010 -312 1005 326 -194 -324 1286 -50 1558 344 -823 -574 1023 -140 -492 -582 -431
2783 -431 739 1328 -808 -1268 -660 95 1362 148 -552 670 1273 1740 804 172 -134 621 1619 1188
2801 1188 107 -2355 547 1183 330 -676 -337 -701 144 947 556 -29 -998 16 1298 616 156 3
2819 3 329 787 953 1151 112 -480 -17 -147 382 1567 -1002 -1104 -232 910 2051 411 -902 -843 -462
2838 -462 532 1448 1018 -1532 -2279 720 2324 1375 -902 -1121 -1123 667 294 -110 192 -367 538 847 982
2857 982 -492 -1178 -536 467 1656 -26 -1192 -1068 -327 1482 1155 -1041 -279 -628 1110 1661 -153
$$ packed form
2733D81J683j379j643l17J059K163j071j320j372J710J050M14k427n98K127J415
2749A975l85k811r3J266P29L36p55j284N75K068l65j351j041J241J255j467q27
2766i34j076J698J317o79n20j30J610j336J608j214j167K49J597j163l52r0J51
2783d31J170N89k136m60O08P55J267j214p00J222O03M67r36o32l06P55R98m31
2801A188j081k462K902O36q53j006L39l64Q45Q03l91n85r69J014J282o82m60j53
2819CL26M58J66J98j039n92M63j30N29J185k569j02Q72J142J141j640j313N9L81
2838d62R94R16m30k550p47K999J604r49k277k19kJ790l73m04L02n59R05L09J35
2857I82j474o86O42J003J189j682j166J24P41J809l27k196P62l49J738N51j814
$$ plain form
2874 -153 -933 -543 -51 978 1192 -308 -1495 -276 121 2118 814 118 -877 105 1728 1964 -88
2891 -88 -1902 -844 181 1459 851 514 -1447 -464 77 785 808 -969 -1032 -80 2280 1624 -568 -876
2909 -876 306 368 1845 1014 446 0 349 1194 580 -1217 -743 -296 -412 1821 613 -303 -887 -1402 1474
2928 1474 1483 829 -878 -2150 772 1196 806 419 -849 -850 543 3086 -107 -176 -1460 -252 1051 1001
2946 1001 352 -1611 -885 -330 825 -102 35 -1325 -1367 923 1250 600 -1246 -2056 392 854 265 -436
2964 -436 -1318 -443 1095 1525 1369 -291 -1825 -46 1782 2466 -686 -1372 -617 968 1473 401 -1449
2981 -1449 -834 -809 919 1329 -82 -1947 -1802 454 948 -361 -201 -858 -520 147 1213 1258 -251 -304
2999 -304 -1393 -254 1200 -453 -691 -469 808 1142 730 264 -1085 -1259 1708 1554 606 -1687 -1927
$$ packed form
2874a53p80L90M92J029K14j500j187J219L97J997j304o96r95R82J623K36k052
2891h8j814J058J025J278o08l37j961R83N41P08K3j777o3R52K360o56k192l08
2909h76J182O2J477q31n68m46L49Q45o14j797M74M47j16K233j208r16n84n15K876
2928A474Ro54j707j272K922M24l90l87j268jJ393K543l193o9j284J208J303n0
2946A001o49j963P26N55J155r27J37j360m2K290L27o50j846q10K448M62n89p01
2964d36q82Q75J538M30j56j660j534J779J828O84l152o86P55J585N05j072j850
2981a449O15K5J728M10j411j865J45K256M94j309J60o57L38O67J066M5j509n3
2999c04j089J139J454j653k38K22J277L34m12m66j349j74K967j54r48k293k40
$$ plain form
3016 -1927 -771 2010 2156 -1744 -1094 -1187 1253 1056 230 -190 -1350 143 345 15 -63 -1602 -690 2202
3034 2202 -575 -634 -984 -1889 1322 1099 -467 9 -539 -147 299 647 600 165 -1006 -310 100 564 530
3053 530 475 -1879 -1280 -482 770 1540 -699 -1485 -1916 1677 941 -266 -886 -558 1002 412 -579 -237
3071 -237 -1555 -118 1925 340 -1719 -1062 89 1323 2676 -653 -1429 -145 718 1308 495 -616
3087 -616 -153 -673 447 -841 -242 -862 418 90 -182 -1048 -1208 573 2077 377 -1794 -328 903
3104 903 424 -392 -1926 -713 665 1128 -345 -1612 -474 967 1489 282 -1248 -1478 1024 2335
3120 2335 310 -796 -1447 186 1205 144 -829 -872 -1303 1887 1451 -373 -1651 -9 401 371 75
3137 75 -56 169 1223 720 -538 -2045 -410 1054 297 -1224 -1245 -284 308 791 -137 -1349 -503 683
$$ packed form
3016a927J156K781J46l900O50r3K440j97q26m20j160J493K02l30p8j539R12K892
3034B202k777n9l50r05L211k23j566M76n48L92M46L48m7m35j171O96M10M64l4
3053E30n5k354N99P98J252P70k239p86m31L593p36j207o20L28J560n90r91L42
3071b37j318J437K043j585k059O57J151J234J353l329p76J284Q63N90q13j111
3087f16M63n20J120j288N99o20J280l28k72q66j60J781J504j700k171J466J231
3104I03m79q16j534J213J378M63j473j267J138J441N22j207j530k30K502J311
3120B335k025j106o51J633J019j061r73m3m31L190m36j824j278J642M10l0k96
3137G5j31K25J054n03j258j507J635J464p57j521k1R61N92M83r28j212Q46J186
$$ plain form
3155 683 1067 454 -1631 -662 977 421 -561 -1196 -880 185 858 1040 -1007 -1346 549 496 -148 -1431
3173 -1431 -1066 457 1081 670 -793 -1837 -1269 360 1093 -126 -939 -103 1822 -990 -526 -1708 150
3190 150 -144 13 -972 -1418 -61 594 -830 -1207 -192 -524 773 433 -942 -469 64 1152 1043 -424
3208 -424 -756 -638 1421 374 -1378 -1166 -246 898 732 147 -1672 -549 -54 1497 1054 -940 -781
3225 -781 -484 1059 -86 -205 -1148 441 1039 33 -44 -199 415 977 8 241 -552 110 -120 -166 -420
3244 -420 -1500 2155 1420 -1068 -1312 -1012 226 55 -574 -399 -336 808 866 -359 -663 -1325 936 1540
3262 1540 562 -671 -899 -185 2077 765 -170 -1257 -748 1024 365 -291 -566 -181 -120 906 -431 -1110
3280 -1110 -108 511 362 -572 -932 -1246 -281 493 1196 -161 473 356 -232 102 -157 -1077 1637 706 732
$$ packed form
3155F83L84o13k085R69J639n56r82o35L16J065O73J82k047l39J895n3o44j283
3173a431L65J523O24m11j463j044N68J629P33j219q13Q36J925k812M64j182J858
3190A50k94J57r85m46J357O55j424l77J015l32J297l40j375M73N33J088j09j467
3208d24l32J18K059j047j752K12R20J144j66n85j819J123M95J551m43j994J59
3225g81K97J543j145j19r43J589N98j006p7j55O14N62r69K33p93O62k30m6k54
3244d20j080L655p35k488k44L00J238j71o29J75O3J144N8j225l04o62K261O04
3262A540r78j233k28P14K262j312r35j087N09J772o59o56k75L85O1J026j337o79
3280a110J002O19j49r34l60l14R65P74P03j357O34j17n88L34k59r20K714r31K6
$$ plain form
3299 732 -512 -421 488 -287 -1158 -293 -234 260 231 -1152 -939 588 281 -1212 -487 -1003 -979 -376 356 -162
3319 -162 -2 -763 -474 244 209 -731 -1402 -195 933 -54 336 -856 793 744 -1257 837 -541 -170
3337 -170 -265 -788 508 -850 1009 -674 1038 232 -1561 -940 68 1398 -1 -232 141 -457 1038
3354 1038 -742 1151 -515 -187 -62 697 1905 -63 -1803 -1017 -923 -49 589 -931 106 148 -906
3371 -906 547 193 -424 -114 736 849 -887 -481 4 -406 696 607 705 415 -223 -279 654 1122 340 -716
3391 -716 -610 724 1096 -36 793 -474 -162 -467 680 -17 254 -290 -379 772 1068 -1354 -378 495
3409 495 445 -357 529 -502 602 -477 428 1430 195 -101 -783 -80 532 403 -1252 -415 1247 365
3427 365 -1239 263 -875 278 733 605 79 -1298 -165 -498 1227 380 -430 -96 -904 645 1010
$$ packed form
3299G32j244R1R09p75q71Q65N9M94k9j383K13J527l07j493P25n16K4O03P32n18
3319a62J60p61K89P18l5r40o71J207J128r87L90j192J649m9k001K094j378L71
3337a70r5n23J296j358J859j683J712q06j793O21J008J330j399k31L73n98J495
3354A038j780J893j666L28J25P59J208j968j740P86R4Q74O38j520J037M2j054
3371i06J453l54o17L10Q50J13j736M06M85m10J102q9R8k90o38n6R33M68p82j056
3391g16J06J334L72j132Q29j267L12l05J147o97K71n44q9J151K96k422R76Q73
3409D95n0q02Q86j031J104j079R05J002j235k96o82P03O12j29j655Q37J662q82
3427C65j604J502j138J153M55j28n26j377J133l33J725q47q10L34q08J549L65
$$ plain form
3444 1010 354 -449 -369 -219 1247 -174 -505 124 -9 -56 1385 987 -536 244 -271 -428 1517 93
3462 93 -503 -245 -288 1108 -247 -325 -501 -652 -97 -216 802 -653 -1462 1012 976 537 166 -785 -241 -126
3482 -126 528 738 -423 -266 15 609 320 39 873 -911 496 925 48 -257 319 -82 344 447 840
3501 840 -77 -518 110 1226 -225 -72 -1713 -1552 754 363 -87 989 1220 -876 741 -139 807 -1457
3519 -1457 -1179 419 527 136 -690 402 595 1001 521 651 59 -175 202 1994 454 -358 -648 -563 407
3538 407 384 -189 -640 -994 22 -139 1334 -184 -332 260 -253 1517 625 -592 -754 54 275 -165 780
3557 780 -400 -1147 -436 118 1386 80 -814 -1008 1458 544 -122 -1226 -1351 449 76 392 -98 275
3575 275 -361 870 96 -41 -1098 -412 -5 192 -250 -130 3 -443 -615 -391 519 -41 -366 512 56
$$ packed form
3444A010o56q03Q0J50J466j421l31O29j33m7J441l98j523P80n15j57J945j424
3462I3n96K58m3J396j355p8j76j51N55j19J018j455q09K474l6m39l71r51N44J15
3482a26O54K10j161J57K81N94k89k81Q34j784J407M29q77l05N76m01M26J03L93
3501H40r17m41O28J116j451J53j641J61K306l91m50J076K31k096J617q80R46k264
3519a457K78J598J08l91q26J092J93M06m80J30n92k34L77J792j540q12k90Q5R70
3538D07k3n73m51l54J016j61J473j518j48N92n13J770q92j217j62Q08K21m40R45
3557G80j180p47P11N54J268j306q94j94K466r14o66j104j25J800l73L16m90L73
3575B75o36J231p74j37j057O86M07J97m42J20J33m46j72K24R10n60l25Q78m56
$$ plain form
3594 56 -625 -51 -185 -407 -121 -579 733 1084 -582 -745 -1400 195 254 -172 -908 -830 -16 -224 923 15
3614 15 -565 -139 495 1348 -636 -1515 -924 312 1375 358 -982 -1311 1031 663 696 -447 -445 239 656
3633 656 -247 74 -166 -590 434 -571 -308 782 7 638 757 -80 302 885 648 -124 -1053 -995 633
3652 633 -130 814 -498 -253 -259 353 -244 -821 -161 -411 1011 1112 -425 -853 460 989 285 276 -1636 -1022
3672 -1022 967 119 -902 -171 -949 101 552 -351 -456 -210 889 662 -355 -404 -524 387 799 -266
3690 -266 -601 189 603 1445 -188 -770 -63 590 555 -81 -1308 413 564 -125 -228 -1129 168 952 438
3709 438 285 -380 -857 -318 6 -839 -992 436 -136 272 696 -194 -1767 240 704 156 -318 -638 387
3728 387 -331 -591 -59 -507 -969 1207 1450 35 -513 499 180 -253 41 69 98 350 38 -913 -1462 774
$$ packed form
3594E6o81N74j34k22K86m58J312L51j666j63o55J595N9m26p36P8Q14k08J147r08
3614A5n80M26O34Q53j984q79N91J236J063j017j340l29K342l68L3j143KO84M17
3633F56r03L21k40m24J024j005K63J090p75O31J19q37L82N83k37p72r29N8J628
3652F33p63R44j312K45oO12n97n77O60k50J422J01j537m28J313N29p04rj912O14
3672a022J989q48j021P31p78J050M51r03j05K46J099k27j017m9j20R11M12j065
3690b66l35P90M14Q42j633n82P07O53l5o36j227J721J51o89j03r01J297P84n14
3709D38j53o65m77N39L24q45j53J428n72M08M24q90j573K007M64n48m74l20J025
3728C87p18k60N32m48m62K176K43j415n48J012l19m33K94K8K9K52l12r51n49K236
$$ plain form
3748 774 468 915 -989 -197 -979 1033 1475 -243 462 370 517 -165 -54 -693 -790 50 347 314 110 -824
3768 -824 987 319 719 -270 -983 1049 472 611 37 -576 91 -171 677 143 111 -511 291 40 253 -451
3788 -451 764 1345 -1565 338 335 -167 810 -597 -464 181 220 -233 -310 -37 -1040 135 90 336 -1285
3807 -1285 263 -491 641 449 -1300 -1596 -1011 386 834 196 67 -1104 402 -833 95 386 489
3824 489 -192 471 249 772 64 -701 328 -149 667 -179 -1010 648 -828 187 -874 765 -717 -716
3842 -716 258 -518 -472 172 591 -411 1064 184 187 -307 14 -131 688 940 448 -211 -303 -85 94 -966
3862 -966 -870 -297 -548 -1108 -265 909 289 542 431 623 -634 -512 186 -378 96 -757 -616 349 -149 618
3882 618 -204 27 521 -566 -349 388 514 -506 -499 7 -530 557 30 756 -709 945 190 498 -59
$$ packed form
3748G74l06M47j904P92p82K012M42j718P05r2J47o82J11o39r7Q40K97l3k04r34
3768h24J811o68M00r89p13K032n77J39n74o13O67k62Q48n34l2o22Q02k51K13p04
3788d51J215N81k910J903ln02R77j407J33O45L9m53p7K73j003J175m5K46j621
3807a285J548p54J132j92j749k96N85J397M48o38j29j171J506j235R28K91J03
3824D89o81O63k22N23p08p65J029m77Q16q46q31J658j476J015j061J639j482J
3842g16R74p76M6O44M19j002J475q80Lm94L21j45Q19K52m92o59r2K18J79j060
3862i66R6N73k51n60Q43J174o20K53j11J92j257J22O98n64M74q53J41R65m98P67
3882F18q22K31M94j087K17P37J26j020PN06n37J087n27P26j465J654p55L08n57
$$ plain form
3901 -59 -272 560 751 111 -528 -112 -247 -50 -271 66 -24 -525 -168 -180 984 -362 676 271 -2 904
3921 904 -1112 -334 -603 1125 -517 -293 423 -215 104 51 683 -575 -68 -595 828 142 -158 311 -430
3940 -430 -18 304 -598 517 -257 -746 -1339 -94 268 -417 -970 -281 104 39 -133 -363 -205 -165 -130 -279
3960 -279 -867 -204 -770 -174 287 -201 -55 -600 -447 -153 514 -407 214 -244 -466 1115 -1176 -76 546
3979 546 23 -161 539 -399 -256 -293 -769 881 -432 -189 162 376 250 -375 1023 41 559 -250 327
3998 327 -734 629 114 162 976 757 142 -399 -1238 242 1042 -548 604 -845 261 -196 -734 -143
4016 -143 -39 -624 -815 69 -189 -381 -402 124 610 674 -756 778 -46 -266 358 717 278 455 595 548
4036 548 683 1090 -210 -346 993 858 -537 1116 -381 250 -460 409 372 -1060 -412 -75 -142 988
$$ packed form
3901e9k13Q32J91o40o39M16j35J97k21L37r0n01L57j2J164j346J038m05k73R06
3921I04k016P78k69J728j642K24P16o38L19n3O32j258N07n27J423o86l00M69p41
3940d30M12L22r02J115p74m89n93J245L62o85n53O89L85o5j72k30J58M0L5j49
3960b79n88O63n66N96M61m88J46n45J53K94O67r21O21m58k22J581k291J100O22
3979E46n23j84P00r38J43l7m76J650j313K43L51K14j26o25J398r82N18q09N77
3998C27j061J363n15M8Q14k19o15n41q39J480Q00j590J152j449J106m57n38N91
4016a43J04n85j91Q84k58j92k1N26M86O4j430J534q24k20O24L59m39J77J40m7
4036E48J35M07j300j36J339j35j395J653j497O31p10Q69l7j432O48L37o7J130
$$ plain form
4054 988 -189 -687 -855 281 -419 -6 -309 -490 -404 -687 948 -29 -420 -434 -365 240 1162 165 -1317 7
4074 7 -590 -243 -184 559 -1071 -377 -60 -768 383 -709 248 129 -389 -712 306 -961 -930 -59 881 27
4094 27 -169 -915 -431 -276 629 28 -1155 1701 165 -49 252 25 -193 -967 150 -198 -164 227 -1019
4113 -1019 808 902 658 -244 922 -1662 109 600 391 -355 -737 79 96 54 328 -151 -347 -111 860
4132 860 -542 468 -133 112 34 -1562 -345 -409 -221 560 932 -71 384 -844 -20 -826 -463 -571 675
4151 675 554 -516 -294 598 -465 -905 -180 -1159 548 -86 809 409 85 -489 764 333 -830 451
4169 451 -883 1384 -570 -643 297 482 -154 -953 -291 -1356 -74 -138 -238 -394 729 830 -51 459 -195
4188 -195 461 1379 312 1586 -1057 -315 633 537 273 -505 -768 434 540 35 284 451 526 363 -352
$$ packed form
4054I88j177m98j68J136p00M13l03j81Q6k83J635r77l91j4O9O05R22r97j482J324
4074Gn97L47N9P43j630O94L17p08J151j092R57j19n18l23J018j267L1Q71R40q54
4094B7j96p46M84J55R05o01j183K856j536k14L01k27k18p74J117l48L4L91j246
4113a019J827R4k44r02J166k584J771M91k09p46l82Q16J7m2K74m79j96K36R71
4132H60j402J010o01K45p8j596J217o4J88P81L72j003M55j228Q24q06L63j08J246
4151F75j21j070K22Q92j063m40P25r79J707o34Q95m00l24n74J253m31j163J281
4169D51j334K267j954p3R40J85o36p99O62j065J282o4j00j56J123J01q81N10o54
4188a95O56R18j067J274k643P42R48r6k64p78k63J202J06n05K49J67P5j63p15
$$ plain form
4207 -352 59 -252 -465 1122 247 810 -535 -76 684 -106 -42 -275 169 -175 -106 465 -824 -508 -458 -89
4227 -89 166 -631 -723 77 469 408 -782 -860 -411 -540 1237 -618 -48 166 -830 -222 -311 -1013 715 98
4247 98 584 94 -280 475 285 -1701 564 -69 -148 -37 -14 -339 -39 -111 -117 1097 188 -233 -1124 -713 132
4268 132 129 382 -359 139 -696 -700 106 -1216 200 -630 -637 -1389 312 -543 -209 -109 -337 -11 -437 1008 446
4289 446 369 57 366 756 798 -57 88 570 605 -71 -669 -498 -484 1307 -72 -673 272 -39 330 -359 -144
4310 -144 -793 436 -464 -449 -479 -530 -874 778 -69 -315 548 405 -36 416 331 1091 -1165 -218 15 -560
4330 -560 497 -269 747 3 1322 232 651 604 -723 159 703 392 -698 -513 -996 -687 923 73
4348 73 -259 -310 -246 659 185 -282 -54 -274 -593 78 298 721 -287 942 141 -83 -409 -193 327 -185
$$ packed form
4207c52M11l11k13J587q75N63j345M59P60p90O4k33M44l44O9N71j289L16N0L69
4227h9K55p97r2Q00L92o1j190p8M49j29J777j855N70K14r96O08q9p02J728o17
4247I8M86m90l74P55j90j986K265o33p9J11K3l25L00p2oJ214r09m21q91M11Q45
4268A32lK53p41M98q35mQ06j322J416q30pp52J701q55L34J00k28L26m26J445n62
4289D46p7l12L09L90M2q55J45M82L5o76n98J71J4J791j379o01R45l11L69o89K15
4310a44o49J229r00J5l0n1l44J652q47k46Q63j43m41M52q5P60k256R47K33n75
4330e60J057p66J016p44J319j090M19m7j327Q82N44l11j090J85m83L09J610q50
4348G3l32n1O4R05m74m67K28k20l19O71K20M23j008J229q01k24l26K16N20n12
$$ plain form
4368 -185 8 586 -713 -221 -223 347 -365 524 -54 -454 -99 -167 -103 -241 -304 -593 -86 181 726 -770 -269
4389 -269 -659 -369 -472 187 420 -825 455 998 -275 20 -495 -279 576 -107 -670 872 -1031 400
4407 400 637 -227 -274 -402 -435 -539 -1084 531 399 -96 170 -696 -605 -120 -264 705 -523 -734 15 94 -463
4428 -463 -340 -449 -758 431 -219 -339 -768 -814 1088 541 281 686 -157 -568 436 -192 -585 -496 90 153
4448 153 -327 108 -322 572 128 -227 -432 -148 21 423 -539 -146 25 -368 -310 12 -55 462 506 -627 985
4469 985 343 -477 -53 -349 661 -728 1066 -559 -43 -516 393 10 -253 464 176 -34 -1368 171
4487 171 -443 -518 478 285 272 -273 -312 408 -732 479 265 378 -346 -210 550 -491 -372 -133 200 222
4507 222 -217 140 -45 -1099 113 -814 -128 -234 97 -145 273 -540 490 -1216 23 818 -1017 830
$$ packed form
4368a85J93N78j299M92kN70p12Q89n78m00L55o8O4j38o3k89N07K67N45j496N01
4389b69l90K90j03O59K33j245J280N43j273K95n15K16Q55o83n63J542j903J431
4407D00K37q64m7j28l3j04n45J615j32m95K66q66R1M85j44R69j228k11P49P9n57
4428d63J23j09l09J189o50j20m29m6J902n47k60M05q43m11J004o28l93Q9N86O3
4448A53m80M35m30Q94m44l55k05K84J69M02r62L93J71l93N8L22o7N17M4j133J612
4469I85o42q20M24k96J010j389J794j625N16m73R09l83k63P17k88k10j334J539
4487A71o14p5R96j93j3n45l9P20j140J211k14J13p24J36P60j041J19K39L33K2
4507B22m39L57j85j054J212r27O86j06L31k42M18q13J030j706J239P95j835J847
$$ plain form
4525 830 680 -576 -219 653 -840 626 -679 -202 -667 365 -837 229 147 -513 -566 55 494 -21
4543 -21 259 -117 699 555 -229 50 -357 171 -634 184 614 108 843 22 -153 -694 251 -673 -707 348
4563 348 322 109 40 -266 162 -764 547 141 -653 -101 -570 -1363 -597 536 -267 -160 -75 979 285 920
4583 920 -173 37 -283 658 -196 372 813 65 -1119 834 -347 -935 326 334 409 6 -235 279 -80
4602 -80 -140 -232 142 -257 204 -358 -237 -260 72 -1616 -919 -611 -971 154 -1280 806 50 458 115 275
4622 275 -373 1187 -154 -1080 -527 -303 232 -1086 -743 -1149 -88 -789 781 -212 -489 -235 -84 -44 -432
4641 -432 1032 1537 -1329 402 -460 579 246 -399 -541 403 1559 74 748 170 -836 29 399 -944
4659 -944 382 100 210 872 423 -596 -25 -701 298 -162 278 445 -173 217 974 -280 -465 496 -1474
$$ packed form
4525H30j50j256L57Q72j493J466j305M77m65J032j202J066q2o60n3O21M39n15
4543b1K80l76Q16j44p84K79m07N28q05Q18M30n06P35q21j75n41R45r24l4J055
4563C48k6k13o9l06M28r26J311m06p94N52m69p93P66J133q03J07Q5J054o94O35
4583I20j093K10l20R41q54N68M41p48j184J953j181n88J261QP5m03k41N14l59
4602h0o0r2L74l99M61n62J21k3L32j688O97L08l60J125j434K086p56M08l43J60
4622B75o48J560j341r26N53K24N35j318L43m06J061p01J570r93k77K54J51M0l88
4641d32J464N05k866J731q62J039l33o45j42R44J156j485O74n78j006Q65L70j343
4659i44J326k82J10O62m49j019N71o76R99m60M40J67o18L90P57j254j85R61j970
$$ plain form
4678 -1474 863 303 1089 310 -174 109 67 -41 507 -220 -196 -47 363 226 -208 -576 623 -314 -406 457
4698 457 -531 358 50 898 -389 309 -481 385 -223 -35 306 -445 -185 -940 652 -276 882 -225 -341
4717 -341 920 -61 -771 -176 356 -572 1114 172 183 543 427 780 -460 -84 826 1483 297 694 607
4736 607 -17 634 361 884 -528 -821 172 372 -685 258 276 -56 113 315 211 -1346 -615 -1121 -910
4755 -910 99 -488 -472 1340 193 -260 -719 -596 -136 -16 -47 -529 -415 -259 498 344 648 -302 -964 522
4775 522 -771 1481 171 -123 -1195 -150 -369 -958 135 418 667 1256 426 1346 -451 60 701 195
4793 195 -111 905 891 381 1040 -403 -681 -231 660 148 323 306 125 -175 -105 -128 223 -89 -495 -413 652
$$ packed form
4678a474K337n60P86p79m84K83m2j08N48p27K4J49M10j37m34l68J199r37r2Q63
4698D57r88Q89l08Q48j287O98p90Q66o08J88L41p51K60p55J592r28J158j107j16
4717c41J261r81p10N95N32r28J686r42J1L60j16L53j240L76R10O57j186L97q7
4736F07o24O51k73N23j412k93R93K00j057R43J8l32J69K02j04j557P31n06K11
4755i10J009n87J6J812j147m53m59J23M60J20l1m82J14J56P57j54L04r50o62J486
4775E22j293K252j310k94j072J045k19n89J093K83K49N89q30R20j797N11O41n06
4793A95l06J016j4n10O59j443k78M50Q91n12J75j7j81l00P0k3L51l12m06Q2J065
$$ [...]
8191e2
##END NTUPLES=NMR FID
##END=
