##TITLE=1H_Pr 11-A
 CDCl3
 8 sc, 
 6.04.2022
##JCAMPDX= 6.0         $$ Bruker NMR JCAMP-DX V2.0
##DATA TYPE= NMR FID
##DATA CLASS= NTUPLES
##ORIGIN= UXNMR, Bruker Analytische Messtechnik GmbH
##OWNER= root
$$ XWIN-NMR		Version 3.5
$$ Wed Apr  6 16:22:17 2022 Russian Standard Time (UT+4h)  she@DPX200
##.OBSERVE FREQUENCY= 200.131346
##.OBSERVE NUCLEUS= ^1H
##.DELAY= (6, 6)
##.ACQUISITION MODE= SIMULTANEOUS
##.ACQUISITION SCHEME= undefined
##.AVERAGES= 8
##.DIGITISER RES= 18
##SPECTROMETER/DATA SYSTEM= spect
##.PULSE SEQUENCE= zg30
##.SOLVENT NAME= CDCl3
##.SHIFT REFERENCE= (INTERNAL, CDCl3, 0, 15.7039)
##AUDIT TRAIL= $$ (NUMBER, WHEN, WHO, WHERE, WHAT)
$$ ##TITLE= Audit trail, XWIN-NMR		Version 3.5
$$ ##JCAMPDX= 5.01
$$ ##ORIGIN= Bruker BioSpin GmbH
$$ ##OWNER= she
$$ F:/spectra/data/she/nmr/H-F/1/audita.txt
$$ ##AUDIT TRAIL=  $$ (NUMBER, WHEN, WHO, WHERE, WHAT)
(   1,<2022-04-06 16:21:07.45 +0400>,<she>,<DPX200>,
      <created by zg, POWCHK disabled, PULCHK disabled
       configuration hash MD5:
       00 E9 B6 7A A2 85 ED C7 34 08 36 98 17 FE 4E 26
       data hash MD5: 16K
       17 CF BA 07 8D 2B 92 8F CC B5 9D 03 34 A4 50 EF>)
$$ ##END=
$$ 
$$ hash MD5
$$ BF BE 2D 68 35 86 D5 37 1E DE 70 F7 23 FD 1D 40
##$RELAX= 
##$RELAX= 
##$RELAX= 
##$RELAX= 
##$RELAX= 
##$RELAX= 
$$ Bruker specific parameters
$$ --------------------------
##$DU= <F:/spectra>
##$EXPNO= 1
##$NAME= <H-F>
##$PROCNO= 1
##$TYPE= <nmr>
##$USER= <she>
##$AMP= (0..31)
100 100 100 100 100 100 100 100 100 100 100 100 100 100 100 100 100 100 
100 100 100 100 100 100 100 100 100 100 100 100 100 100 
##$AQSEQ= 0
##$AQ_mod= 1
##$AUNM= <au_zg>
##$AUTOPOS= <>
##$BF1= 200.13
##$BF2= 200.13
##$BF3= 200.13
##$BF4= 200.13
##$BF5= 200.13
##$BF6= 200.13
##$BF7= 200.13
##$BF8= 200.13
##$BYTORDA= 1
##$CFDGTYP= 0
##$CFRGTYP= 5
##$CHEMSTR= <none>
##$CNST= (0..31)
1 1 145 1 1 1 1 1 1 1 1 1 1 1 1 1 1 1 1 1 1 1 1 1 1 1 1 1 1 1 1 1 
##$CPDPRG= <>
##$CPDPRG1= <>
##$CPDPRG2= <>
##$CPDPRG3= <>
##$CPDPRG4= <mlev>
##$CPDPRG5= <mlev>
##$CPDPRG6= <mlev>
##$CPDPRG7= <mlev>
##$CPDPRG8= <mlev>
##$CPDPRGB= <>
##$CPDPRGT= <>
##$D= (0..31)
0 1.2 0 0 0 0 0 0 0 0.06 0 0.03 0 0 0 0 0.0002 0 0 0 0 0 0 0 0 0 0 0 0 
0 0 0 
##$DATE= 1649247666
##$DBL= (0..7)
120 120 120 120 120 120 120 120 
##$DBP= (0..7)
150 150 150 150 150 150 150 150 
##$DBP07= 0
##$DBPNAM0= <>
##$DBPNAM1= <>
##$DBPNAM2= <>
##$DBPNAM3= <>
##$DBPNAM4= <>
##$DBPNAM5= <>
##$DBPNAM6= <>
##$DBPNAM7= <>
##$DBPOAL= (0..7)
0.5 0.5 0.5 0.5 0.5 0.5 0.5 0.5 
##$DBPOFFS= (0..7)
0 0 0 0 0 0 0 0 
##$DE= 6
##$DECBNUC= <off>
##$DECIM= 32
##$DECNUC= <off>
##$DECSTAT= 4
##$DIGMOD= 1
##$DIGTYP= 9
##$DL= (0..7)
0 120 120 120 120 120 120 120 
##$DP= (0..7)
150 150 150 150 150 150 150 150 
##$DP07= 0
##$DPNAME0= <>
##$DPNAME1= <>
##$DPNAME2= <>
##$DPNAME3= <>
##$DPNAME4= <>
##$DPNAME5= <>
##$DPNAME6= <>
##$DPNAME7= <>
##$DPOAL= (0..7)
0.5 0.5 0.5 0.5 0.5 0.5 0.5 0.5 
##$DPOFFS= (0..7)
0 0 0 0 0 0 0 0 
##$DQDMODE= 0
##$DR= 18
##$DS= 0
##$DSLIST= <SSSSSSSSSSSSSSS>
$$ [...]
##$SUBNAM2= <"">
##$SUBNAM3= <"">
##$SUBNAM4= <"">
##$SUBNAM5= <"">
##$SUBNAM6= <"">
##$SUBNAM7= <"">
##$SUBNAM8= <"">
##$SUBNAM9= <"">
##$SW= 18.0517287032376
##$SWIBOX= (0..15)
0 0 2 0 0 0 0 0 0 0 0 0 0 0 0 0 
##$SW_h= 3612.71676300578
##$TD= 16384
##$TD0= 1
##$TE= 0
##$TE2= 300
##$TE3= 300
##$TEG= 300
##$TL= (0..7)
0 120 120 120 120 120 120 120 
##$TP= (0..7)
150 150 150 150 150 150 150 150 
##$TP07= 0
##$TPNAME0= <>
##$TPNAME1= <>
##$TPNAME2= <>
##$TPNAME3= <>
##$TPNAME4= <>
##$TPNAME5= <>
##$TPNAME6= <>
##$TPNAME7= <>
##$TPOAL= (0..7)
0.5 0.5 0.5 0.5 0.5 0.5 0.5 0.5 
##$TPOFFS= (0..7)
0 0 0 0 0 0 0 0 
##$TUNHIN= 0
##$TUNHOUT= 0
##$TUNXOUT= 0
##$USERA1= <user>
##$USERA2= <user>
##$USERA3= <user>
##$USERA4= <user>
##$USERA5= <user>
##$V9= 5
##$VALIST= <valist>
##$VCLIST= <CCCCCCCCCCCCCCC>
##$VD= 0
##$VDLIST= <DDDDDDDDDDDDDDD>
##$VPLIST= <PPPPPPPPPPPPPPP>
##$VTLIST= <TTTTTTTTTTTTTTT>
##$WBST= 1024
##$WBSW= 4
##$XGAIN= (0..3)
0 0 0 0 
##$XL= 0
##$YL= 0
##$YMAX_a= 1001357
##$YMIN_a= -1096564
##$ZGOPTNS= <>
##$ZL1= 120
##$ZL2= 120
##$ZL3= 120
##$ZL4= 120
##$ABSF1= 10
##$ABSF2= 0
##$ABSG= 5
##$ABSL= 3
##$ALPHA= 0
##$AQORDER= 0
##$ASSFAC= 0
##$ASSFACI= 0
##$ASSFACX= 0
##$ASSWID= 0
##$AUNMP= <proc_1d>
##$AZFE= 0.1
##$AZFW= 0.1
##$BCFW= 1
##$BC_mod= 2
##$BYTORDP= 1
##$COROFFS= 0
##$CY= 11.3945322036743
##$DATMOD= 1
##$DC= 2
##$DFILT= <>
##$DTYPP= 0
##$F1P= 2.36226072786647
##$F2P= -0.459571619588291
##$FCOR= 0.5
##$FTSIZE= 0
##$FT_mod= 4
##$GAMMA= 1
##$GB= 0.15
##$INTBC= 1
##$INTSCL= 1
##$ISEN= 128
##$LB= 0.24
##$LEV0= 0
##$LPBIN= 0
##$MAXI= 10000
##$MC2= 0
##$MEAN= 0
##$ME_mod= 0
##$MI= 1.114404
##$NCOEF= 0
##$NC_proc= 0
##$NLEV= 6
##$NOISF1= 3.799351
##$NOISF2= 2.8
##$NSP= 1
##$NTH_PI= 0
##$NZP= 0
##$OFFSET= 15.70392
##$PC= 1
##$PHC0= -18029.44
##$PHC1= 10.20078
##$PH_mod= 1
##$PKNL= yes
##$PPARMOD= 0
##$PSCAL= 0
##$PSIGN= 0
##$REVERSE= no
##$SF= 200.130013532006
##$SI= 16384
##$SIGF1= 3
##$SIGF2= 2
##$SINO= 400
##$SIOLD= 16384
##$SREGLST= <1H.CDCl3>
##$SSB= 0
##$STSI= 0
##$STSR= 0
##$SW_p= 3612.71676300578
##$SYMM= 0
##$S_DEV= 0
##$TDeff= 0
##$TDoff= 0
##$TI= <>
##$TILT= no
##$TM1= 0
##$TM2= 0
##$TOPLEV= 0
##$USERP1= <user>
##$USERP2= <user>
##$USERP3= <user>
##$USERP4= <user>
##$USERP5= <user>
##$WDW= 1
##$XDIM= 8192
##$YMAX_p= 0
##$YMIN_p= 0
$$ End of Bruker specific parameters
$$ ---------------------------------
##NTUPLES= NMR FID
##VAR_NAME=  TIME,          FID/REAL,        FID/IMAG
##SYMBOL=    X,             R,               I
##VAR_TYPE=  INDEPENDENT,   DEPENDENT,       DEPENDENT
##VAR_FORM=  AFFN,          ASDF,            ASDF
##VAR_DIM=   8192,          8192,            8192
##UNITS=     SECONDS,       ARBITRARY UNITS, ARBITRARY UNITS
##FACTOR=    0.0002768,     1,               1
##FIRST=     0,             0,               0
##LAST=      2.2672688,     0,               0
##MIN=       0,             -1096564,        0
##MAX=       2.2672688,     1001357,         0
$$ Real data points
##PAGE= N=1
##DATA TABLE= (X++(R..R)), XYDATA
$$ [...]
$$ plain form
1765 -866 -290 722 948 118 -855 -622 128 882 -17 -1123 -894 -123 525 -133 -401 -634 114 498 220
1784 220 196 -661 -54 325 746 492 35 -219 296 783 404 -87 -420 -297 125 412 374 -522 -753 -192 565
1805 565 196 -676 -656 -200 467 543 -193 -438 -191 567 590 370 -373 -516 380 933 601 -214 -898 121 605
1826 605 654 -113 -364 -179 66 532 294 -551 -903 103 379 229 -462 -775 -212 152 463 -119 -596 -577
1846 -577 113 797 416 -128 -218 133 382 500 -143 -99 -239 518 528 194 -478 -501 -52 439 134 -499 -576 -166
1868 -166 272 170 -402 -663 -22 53 561 123 -403 -342 222 458 534 -22 -246 149 473 606 178 -238 -323
1889 -323 144 703 64 -503 -258 -157 -43 319 -228 -750 -198 -6 323 13 -118 -166 14 412 37 -405
1909 -405 61 426 370 217 -194 -139 -27 283 292 189 -215 -255 -166 137 186 -119 -382 -328 192 -103 321 -334 -409
$$ packed form
1765h66N76J012K26q30r73K33P50P54q99j106K29P71O48o58k68k33P48L84k78
1784B20k4q57O07L79M21k54m57k54N15M87l79m91l33J23M22K87l8q96k31N61P57
1805E65l69q72K0M56O67P6p36k45K47P58K3k20p43j43Q96N53l32q15o84J019M84
1826F05M9p67k51J85K45M66k38q45l52J006K76j50o91l13N63L64L11n82m77J9
1846e77O90O84l81n44r0L51K49J18o43M4j40P57J0l34o72k3M49M91l05o33p7M10
1868a66M38j02n72k61O41P5N08m38n26O1N64K36P6n56k24L95L24J33m28m16q5
1889c23M67N59o39n67K45J01J14L62n47n22N52J92L29l10j31m8J80L98l75m42
1909d05M66L65n6j53m11N5J12L10Rj03m04m0Q9L03M9l05k63N4N20k95M24o55p5
$$ plain form
1932 -409 231 96 6 -303 -140 130 299 -39 90 -56 21 383 144 -87 -206 67 460 218 -228 -119 19
1953 19 -297 38 -118 -230 -244 -216 86 68 -174 -191 -55 -88 -312 -301 235 133 -89 -107 236 320 35 -153 -196
1976 -196 293 351 -154 -393 -104 165 220 -140 -241 -81 -7 -70 210 -323 -532 -45 23 16 -409 -280 175 9
1998 9 147 -181 -110 329 305 101 -71 -50 459 415 -26 -224 19 246 212 -142 -69 36 -159 188 -250 -493 -288
2021 -288 60 231 -457 -485 -80 336 47 -428 -369 350 303 140 -206 -48 276 364 -73 -289 -47 163 327
2042 327 4 -387 -360 -168 220 22 -539 -26 108 -90 -318 -240 -297 182 253 -410 -460 218 299 167 -479 -331
2064 -331 125 600 118 -391 -164 374 462 53 -288 -673 75 436 -82 -239 -445 -122 353 226 -667 -477
2084 -477 196 308 -340 -611 -226 287 617 -119 -226 -144 328 589 4 -170 142 705 459 -58 -540 306
$$ packed form
1932d09O40j35r0l09J63K70J69l38J29j46P7L62k39k31j19K73L93k42m46J09J38
1953A9l16L35j56j12j4K8L02j8k42j7J36l3k24J1N36j02k22j8L43Q4k85j88m3
1976a96M89N8n05k39K89K69N5l60j01J60P4o3K80n33k09M87O8pm25J29M55j66
1998IJ38l28P1M39k4k04j72K1N09m4m41j98K43K27l4l54P3J05j95L47m38k43K05
2021b88L48J71o88k8M05M16k89m75N9P19m7j63l46J58L24Q8m37k16K42K10J64
2042C27l23l91K7J92L88j98n61N13J34j98k28P8n7M79P1o63n0O78Q1j32o46J48
2064c31M56M75m82n09K27N38Q8m09l41l85P48L61n18j57k06L23M75j27q93J90
2084d77O73J12o48k71L85N13L30p36j07Q2M72K61n85j74L12N63k46n17m82Q46
$$ plain form
2104 306 646 122 -60 -382 -106 356 36 -367 -469 -169 356 79 -386 -242 127 480 132 -583 -349 125
2124 125 423 41 -282 -236 596 418 -113 -315 -269 252 228 59 -543 -179 213 493 -273 -511 -147 384 210
2145 210 -418 -413 -123 518 244 -453 -348 184 559 262 -389 -177 450 583 374 -203 -238 20 215 303 -57
2166 -57 -348 -148 237 61 -268 -183 -57 103 -186 -654 -266 432 200 -95 -160 29 265 259 2 72 49 402
2188 402 164 -152 -327 412 663 40 -397 -427 268 321 -177 -638 -148 313 371 170 -378 -281 71 526 336
2209 336 -661 -505 103 735 366 -406 -623 -46 685 156 -183 -62 -23 417 462 -5 -325 -126 41 176 -130
2230 -130 -318 9 8 101 -116 189 -172 -318 -238 88 267 -81 -326 -40 302 181 179 -130 -94 -163 336 556 121
2253 121 -581 -52 621 396 -158 -595 -78 266 213 -154 -100 -497 28 295 135 -724 -598 -40 409 19 -473
$$ packed form
2104C06L40n24j82l22K76M62l20m03j02L00N25k77m65J44L69L53l48p15K34M74
2124A25K98l82l23M6Q32j78n31k02M6N21k4j69o02L64L92K80p66k38L64N31j74
2145B10o28NK90O41k74o97J05N32L75k97o51K12O27J33k09n77l5K58J95Q8l60
2166e7k91K00L85j76l29Q5J26J60k89m68L88O98k32k95o5J89K36ok57P0k3L53
2188D02k38l16j75P39K51o23m37l0O95N3m98m61M90M61N8k01n48R7L52M55j90
2209C36r97J56O08O32l69p72k17N77P31n29l39J21L9M40M5m67l20J99J67J35l06
2230a30j88L27jR3k17L05l61j46Q0L26J79l48k45K86L42j21kl09L6o9M99K20m35
2253A21p02N29O73k25n54m37N17L44n3l67N4l97N25K67j60q59J26N58M49l90m92
$$ plain form
2274 -473 -52 94 318 64 92 -66 57 133 -82 400 -124 -305 -70 308 173 -34 -186 -59 88 239 336
2295 336 -267 -264 -182 398 244 -211 -574 -148 284 457 -78 -96 -122 -28 489 287 -499 -210 -136 552 405 137
2317 137 -181 -81 304 253 -325 -254 -327 58 287 249 -178 -467 -272 265 72 -313 -277 -93 178 245 -160 -186
2339 -186 -141 268 383 504 44 -169 -83 383 335 -189 -293 -276 276 333 54 -683 -444 -144 487 478 63 -467
2361 -467 -476 63 151 -20 -290 -320 -65 -7 183 -25 -314 -31 568 250 -106 -108 -400 21 192 49 -165 -225 -38
2384 -38 74 182 -87 -444 -295 137 297 -24 -215 -247 200 335 -7 -80 -117 296 330 453 84 -112 13 301
2406 301 432 350 -99 -162 223 64 225 -229 -368 59 211 83 -210 -466 -168 27 250 -38 -283 -300 200
2427 200 206 610 39 -253 -174 200 160 62 -179 -199 195 178 80 -94 -181 145 97 -103 -391 -331 -108 26 -140 -173
$$ packed form
2274d73M21J46K24k54K8j58J23P6k15M82n24j81K35L78j35k07j52J27J47J51R7
2295C36o03LQ2N80j54m55l63M26M32J73n35j8k6R4N17k02p86K89P4O88j47k68
2317A37l18J00L85n1n78P1p3L85K29l8m27k89J95N37j93l85L6J84K71O7m05k6
2339a86M5M09J15J21m60k13Q6M66m8n24j04J7N52N7k79p37K39L00O31rm15n30
2361d67rN39Q8j71k70l0K55N8J90k08k89K83N99l18l56kk92M21J71j43k14o0J87
2384c8J12J08k69l57J49M32J60l21j91l2M47J35l42p3l7M13L4J23l69j96J25K88
2406C01J31q2m49o3L85j59J61m54j39M27J52j28k93k56K98J95K23k88k45j7N00
2427B00OM04n71k92P9L74m0r8k41k0L94j7r8j74q7L26m8k00k88O0K23J34j66l3
$$ plain form
2451 -173 -79 -84 -34 179 -4 27 47 -285 205 152 17 78 122 32 -93 91 112 -116 42 391 283 11 -147 -134
2475 -134 249 334 12 105 -309 -145 221 -134 -176 -181 86 -153 138 3 -249 72 204 249 -139 -42 -119 -34 83
2498 83 4 -10 66 -48 194 -101 -120 98 143 94 -203 138 133 -224 -200 -300 22 150 -184 -119 -42 23 -61 -175 -172
2523 -172 36 20 236 190 -100 -167 -212 356 61 -237 2 100 93 36 -297 -183 111 -60 -99 -351 -314 26 252
2546 252 -70 -14 -197 -37 243 -55 -37 344 212 91 45 -61 180 450 184 -38 -79 -136 169 266 -220 -333
2568 -333 182 24 31 -89 -189 -131 205 13 -336 -127 -68 249 -100 -157 -333 -3 423 31 -196 96 229 284
2590 284 -100 -244 175 289 18 174 -149 20 246 97 -219 -542 -65 117 38 -172 -147 -91 218 18 -114
2611 -114 -307 223 417 80 -5 -184 269 520 49 -286 -211 219 331 138 -253 -215 12 146 -112 -208 121
$$ packed form
2451a73R4nN0K13j83L1K0l32M90n3j35O1M4r0j25J84K1k28J58L49j08k72j58J3
2475a34L83Q5l22R3m14J64L66l55m2nK67k39K91j35k52L21J32M5l88R7p7Q5J17
2498H3p9j4P6j14K42k95j9K18M5m9k97L41nl57K4j00L22J28l34O5P7O5q4j14L
2523a72K08j6K16m6k90o7m5N68k95k98K39R8pn7l33J14K94j71l9k52L7L40K26
2546B52l22N6j83J60K80k98J8L81j32j21m6j06K41K70k66k22m1n7L05R7m86j13
2568c33N15j58Pj20j00N8L36j92l49K09N9L17l49n7j76L30M26l92k27K92J33N5
2590B84l84j44M19J14k71J56l23J69K26j49l16l23M77J82p9k10K5N6L09k00j32
2611a14j93N30J94l37q5j79M53K51m71l35P5M30J12j93l91L8K27J34k58r6L29
$$ plain form
2632 121 175 252 -213 -108 -114 110 384 37 -140 -62 38 -41 58 -192 -225 120 330 -95 -233 131 217 -67 -10
2655 -10 -145 85 88 -141 -223 -247 34 -49 -53 -77 -205 -53 108 197 -326 -165 -68 172 154 -400 -88 300 164 88
2679 88 -300 -131 115 126 80 295 83 68 181 92 -115 -302 256 204 -137 5 109 169 -179 -437 -318 -50
2701 -50 181 58 -193 -2 139 -189 -73 -231 -151 -127 337 -25 -53 -32 67 178 2 -169 -2 -21 364 -99
2723 -99 10 -3 -97 -19 -127 -79 63 340 -67 -7 -281 -2 256 -113 -219 74 343 191 -60 -78 -208 -64
2745 -64 54 88 166 -211 26 304 -136 -149 -219 105 151 -119 -146 -11 97 214 -23 44 -284 171 -41 65 46
2768 46 -127 36 254 192 7 149 -44 -184 129 -234 59 -42 -170 -13 16 194 -123 -58 -227 122 62 -28
2790 -28 -344 -36 41 6 71 23 -89 221 -206 1 9 108 157 52 -147 -50 -142 61 101 -200 -113 -148 -67 261 166
$$ packed form
2632A21N4P7m65J05oK24K74l47j77P8J00p9R9k50l3L45K10m25j38L64Q6k84N7
2655a0j35K30Lk29q2k4K81q3mk4j28J52J61Q9n23J61R7K40j8n54L12L88j36p6
2679H8l88J69K46J1m6K15k12j5J13q9k07j87N58n2l41J42J04O0l48k58J19K68
2701e0K31j23k51J91J41l28J16j58Q0K4M64l62k8K1R9J11j76j71J67j9L85m63
2723i9J09j3r4P8j08M8J42K77m07O0k74K79K58l69j06K93K69j52k51j8j30J44
2745f4J18L4P8l77K37K78m40j3p0L24M6k70k7J35J08J17k37O7l28M55k12J06j9
2768D6j73J63K18o2j85J42j93j40L13l63K93j01j28J57K9J78l17O5j69L49o0r0
2790b8l16L08P7l5O5m8j12L10m27K07QR9M9j05j99R7r2K03M0l01Q7l5Q1L28r5
$$ plain form
2815 166 210 -69 -85 72 87 32 -224 -344 -189 50 233 -147 -49 42 74 148 120 22 33 -9 226 274 -130 102
2839 102 -99 -38 -33 23 -14 -129 22 247 104 -208 -248 60 24 11 -40 -246 -122 39 126 -82 -39 -55 -19 41 151
2864 151 137 -166 -275 23 138 104 -166 77 85 43 -112 -396 14 -81 103 200 -238 -111 -163 -85 -95 -20 -168 -255
2888 -255 121 162 106 -147 -166 63 229 43 80 -112 87 191 143 83 193 20 -1 -6 -106 -207 -60 63 219
2911 219 152 53 -86 -337 41 164 78 -71 -97 -38 44 274 47 19 132 203 82 -238 -24 -57 127 134 159 29
2935 29 88 -75 236 54 -16 -210 -210 59 37 -220 -252 -325 22 -109 48 -104 -85 147 100 169 -116 52 -112 258
2959 258 20 -85 -30 39 47 23 48 38 48 -48 -104 239 -169 -172 -94 47 312 159 -418 -161 109 -115 200 -122
2983 -122 -199 -3 87 217 7 -327 184 -10 343 -15 -176 -113 -46 93 -31 -91 -73 169 -143 75 -22 130
$$ packed form
2815A66M4k79j6J57J5n5k56j20J55K39J83l80R8R1L2P4k8r8J1m2K35M8m04K32
2839A02k01O1NN6l7j15J51K25j43l12m0L08l6j3n1k06J24J61Q7k08M3j6L6O0J10
2864A51j4l03j09K98J15l4k70K43Qm2j55k84M10r5J84R7m38J27n2P8j0P5j48q7
2888b55L76M1n6k53j9K29J66j86L7j92J99J04m8o0J10j73k1nj00j01J47J23J56
2911B19o7r9j39k51L78J23q6j49k6N9Q2K30k27k8J13P1j21l20K14l3J84PK5j30
2935B9N9j63L11j82p0j94%K69k2k57l2p3L47j31J57j52J9K32m7O9k85J68j64L70
2959B58k38j05N5O9Qk4K5j0J0r6n6L43m08lP8J41K65j53n77K57K70k24L15l22
2983a22p7J96R0J30k10l34N11j94L53l58j61O3O7J39j24o0J8K42l12K18r7J52
$$ plain form
3005 130 -48 -20 164 -24 51 85 135 -128 27 34 139 263 -179 401 -86 185 21 -125 260 277 -177 -180 -14
3028 -14 152 191 -181 -230 -156 262 -89 133 -159 -222 -208 62 -7 15 -207 21 50 -17 -102 -14 -172 131 139 -37 200
3053 200 -128 109 77 -183 -52 -60 105 -12 50 95 211 4 -105 -98 -71 125 193 -85 45 128 183 93 -75 -44
3077 -44 210 258 -5 -169 7 148 147 113 96 2 149 17 100 -87 201 193 153 272 -330 -227 -42 27 143 -148
3101 -148 -322 90 52 -229 -49 106 191 261 -6 -185 -110 89 -102 -214 70 6 -14 -165 -72 -26 137 101 -34
3124 -34 -77 -168 -24 135 -4 -100 -32 -103 62 -260 -171 -147 -105 -90 -83 -61 60 120 105 163 68 -151 110 83 15 97 93
3151 93 32 71 -224 17 -55 115 -24 -283 -168 -27 104 -14 53 -237 12 149 -52 66 39 112 199 -114 134
3174 134 155 199 118 -247 6 -11 160 304 -52 -51 -286 -163 -234 -127 -93 137 322 37 158 -142 -246 -297 -3
$$ packed form
3005A30j78K8J84j88P5L4N0k63J55PJ05J24m42N80m87K71j64j46L85J7m54lJ66
3028a4J66L9l72m9P4M18l51K22k92o3J4K70o9K2k22K28K9o7q5Q8j58L03Qj76K37
3053B00l28K37l2k60J31qJ65j17O2M5J16k07j09PK7J96O8k78J30Q3N5r0j68L1
3077d4K54M8k63j64J76J41jl4j7r4J47j32Q3j87K88qm0J19o02J03J85O9J16k91
3101a48j74M12l8k81J80J55Q5P0k67j79P5J99j91j12K84o4k0j51R3M6J63l6j35
3124c4m3r1J44J59j39r6O8p1J65l22Q9K4M2J5PK2J21O0j5N8r5k19K61k7o8Q2m
3151I3o1L9k95K41p2J70j39k59J15J41J31j18O7k90K49J37k01J18k7P3Q7l13K48
3174A34K1M4q1l65K53j7J71J44l56Jk35J23p1J07L4K30J85k85J21l00j04n1K94
$$ plain form
3197 -3 -127 113 -20 79 -22 12 -112 115 299 29 31 -71 -143 178 143 -278 -91 183 -6 -3 -226 89 25 -150
3221 -150 171 -151 -101 -112 -8 35 240 -24 218 168 -18 -156 3 112 3 -125 123 6 49 118 -73 -61
3243 -61 137 33 286 -224 -43 1 134 -108 133 0 2 -26 -12 89 35 274 132 -231 -56 -25 107 -46 -31
3266 -31 -61 101 -173 120 126 -65 225 60 -5 -95 149 -26 57 294 225 -159 -121 156 -152 -208 -382 104 -68
3289 -68 -270 66 -131 -36 23 225 202 31 -25 64 101 -80 -91 -79 -26 -116 7 -138 -254 133 8 200 101 -92
3313 -92 307 -58 29 316 -372 -371 9 154 -107 -10 -19 138 -237 143 70 -9 17 114 -1 224 -34 -284 4 -2
3337 -2 -24 75 -159 79 102 122 -168 82 220 147 27 -236 -246 107 31 121 102 254 120 45 -93 30 153 -10
3361 -10 -177 26 -119 45 -94 43 -205 110 107 -213 31 -182 -84 80 117 -76 -253 -104 -109 -81 -133 301 8
$$ packed form
3197cj24K40j33R9j01L4j24K27J84k70Kj02p2L21l5m21J87K74j89Lk23L15o4j75
3221a50L21l22N0j1J04M3K05k64K42n0j86j38J59J09j09j28K48j17M3O9j91J2
3243f1J98j04K53n10J81M4J33k42K41j33Kk8J4J01n4K39j42l63J75L1J32j53J5
3266c1l0J62k74K93Oj91K90j65o5r0K44j75Q3K37o9l84L8K77l08n6j74M86j72
3289f8k02L36j97R5N9K02k3j71n6Q9L7j81j1J2N3r0J23j45j16L87j25J92r9j93
3313i2L99l65Q7K87o88JL80J45k61R7rJ57l75L80p3p9K6R7j15K25k58k50K88o
3337bk2R9k34K38K3K0k90K50J38p3j20k63j0L53p6R0j9J52j34p5j38J23J23j63
3361a0j67K03j45J64j39J37k48L15ll20K44k13R8J64L7j93j77J49nK8n2M34k93
$$ plain form
3384 8 -71 202 -78 45 37 -53 157 -114 -105 -200 -124 191 -53 181 -180 -193 60 53 -274 180 10 149 -82 -89 -11
3409 -11 -94 151 162 17 89 -6 -26 -8 -220 -90 -19 -12 68 89 -76 -28 -112 294 -64 -73 -83 209 -179 -112 138 -204
3435 -204 -216 47 175 161 41 -36 76 25 -62 -129 73 29 243 41 -131 -37 -5 197 -117 268 -32 -34 127 41
3459 41 105 -313 -84 -41 36 151 110 132 -196 146 152 -60 -170 -139 59 133 62 6 -88 -122 84 -105 203 259 -103
3484 -103 -195 169 -16 -97 -103 49 226 25 -85 -73 42 -26 -48 -33 96 6 -81 -94 -112 90 92 -214 166 87 -35
3509 -35 -105 -10 -216 234 -185 269 -157 190 249 122 -186 -111 -15 102 135 -3 -254 -104 -151 112 234 -86 83
3532 83 -218 -1 -29 -180 -216 -127 -180 -78 -123 -43 -125 -108 31 170 -295 -377 -78 107 -139 -83 -86 -158 -113 -6 109
3557 109 81 -151 -191 -93 -49 70 -108 162 14 242 77 184 -15 119 23 217 -38 38 -185 112 65 -98
$$ packed form
3384Hp9K73k80J23qr0K10k71Rr5P6L15k44K34l61j3K53pl27M54j70J39k31pP8
3409a1q3K45J1j45P2r5k0J8k12J30P1PQ0K1j65M8q4M06l58rj0K92l88O7K50l42
3435b04j2K63J28j4j20p7J12n1q7o7K02m4K14k02j72R4L2K02l14L85l00kJ61q6
3459D1O4m18K29M3P7J15m1K2l28L42Ok12j10L1J98P4p1n6r4l4K06j89L08N6l62
3484a03r2L64j85q1oJ52J77k01j10J2J15o8k2J5J29r0q7j3j8K02Kl06L80p9j22
3509c5p0R5k06M50m19M54m26L47N9j27l08P5R6J17L3j38k51J50m7K63J22l20J69
3532H3l01K17k8j51l6Q9n3J02m5Q0q2J7J39J39m65q2K99J85k46N6lp2M5J07J15
3557A09k8k32m0R8M4J19j78K70j48K28j65J07j99J34r6J94k55P6k23K97m7j63
$$ plain form
3579 -98 -316 -9 -275 62 128 -133 -24 73 -3 205 148 -55 235 62 138 -219 159 8 -24 -100 150 -100 -134
3602 -134 -76 13 148 -140 274 62 76 79 379 78 -19 142 -25 -103 63 -56 -251 -121 -179 256 -272 -59 55
3625 55 -183 -85 82 -230 -367 54 -130 79 -64 85 178 125 -181 108 -102 -97 -31 -154 44 206 4 -133
3647 -133 122 -123 -89 -21 -45 -372 -31 -46 246 46 -161 -28 -166 36 134 -236 -157 266 -48 -277 -91 79
3669 79 -40 263 -132 -128 -135 23 53 3 90 -52 108 58 -151 52 183 -71 101 136 1 -99 105 79 -61 44
3693 44 55 139 -54 201 -243 -75 -181 125 -201 145 157 -21 52 45 35 -265 0 -79 56 180 -49 -45 35 -3
3717 -3 -121 67 60 153 26 76 -61 44 51 -211 -212 54 50 -80 -155 -99 62 -68 -48 -276 78 -10 -58 -116 182 -57
3743 -57 -151 21 -53 228 39 158 110 80 -284 -53 -86 -44 173 174 -25 95 50 -48 -72 243 -24 -118 137 92 -93
$$ packed form
3579i8k18L07k66L37O6k61J09R7p6K08n7k03K90j73P6l57L78j51l2p6K50k50l4
3602a34N8Q9J35k88M14k12J4LL00l01r7J61j67p8J66j19j95J30n8M35n28K13J14
3625E5k38R8J67l12j37M21j84K09j43J49R3n3l06K89k10NO6j23J98J62k02j37
3647a33K55k45L4O8k4l27L41j5K92k00k07J33j38K02R8l70P9M23l14k29J86J70
3669G9j19L03l95MpJ58L0n0Q7j42J60n0k09K03J31k54J72L5j35j00K04k6j40J05
3693D4J1Q4j93K55m44J68j06L06l26L46J2j78P3pj0l00K65p9J35J24k29MQ0l8
3717cj18J88pR3j27N0j37J05Pk62jK66mj30p5N6J61j30K0k28L54q8m8n8K98k39
3743e7r4J72p4K81j89J19m8l0l64K31l3M2K17Jj99J20m5r8k4L15k67r4K55m5j85
$$ plain form
3768 -93 -96 81 -2 -33 -76 -51 -155 21 95 177 105 40 -197 -136 14 -121 -30 -121 -101 160 -99 -34 24 -135 157 -13
3794 -13 -2 -20 76 145 79 53 -84 -68 198 173 94 -214 148 5 20 54 10 -29 18 142 -59 53 162 62 37
3819 37 -76 39 -52 25 -81 -314 358 -35 273 55 18 59 -22 -53 139 -162 -3 146 87 -44 -61 -175 43
3842 43 -9 -21 46 -19 98 154 139 -18 130 -66 122 201 155 46 -15 29 75 -5 36 -33 15 -78 -33 26 122 -43 -10
3869 -10 -132 -151 89 177 -60 41 -161 -297 -7 -56 21 -10 -25 125 1 186 267 48 -152 47 142 -218 -115
3892 -115 -292 -14 -101 110 4 40 42 -107 -162 181 117 -260 214 126 277 24 94 139 -122 73 28 -26 -59 35
3916 35 288 -21 -109 51 25 -28 100 -8 54 -113 -95 2 37 64 73 107 72 112 76 122 84 262 82 96 151 24
3942 24 218 -89 -47 231 -20 -43 85 81 57 140 141 100 147 179 106 -134 -65 92 76 32 152 -67 322 -244 15
$$ packed form
3768i3lJ77q3l1m3K5j04J76P4Q2p2o5k37O1J50j35R1r1K0K61k59O5N8j59K92j70
3794a3J1j8R6O9o6k6j37J6K66k5p9l08L62j43J5L4m4l9M7J24k01J12J09j00k5
3819C7j13J15r1P7j06k33O72l93L08k18l7M1q1l1J92l01J59J49n9j31j7j14K18
3842D3n2j2O7o5J17N6j5j57J48j96J88P9m6j09o1M4M6q0M1o9M8r3M5N9R6j65L3
3869a0j22j9K40Q8k37J01k02j36K90m9P7l1j5J50j24J85Q1k19k00J99R5l60J03
3892a15j77K78q7K11j06L6Kj49n5L43o4l77M74q8J51k53P0M5k61J95m5n4l3R4
3916C5K53l09q8J60k6n3J28j08O2j67J8R7L5K7RL4l5M0l6M6l8J78j80J4N5j27
3942B4J94l07M2K78k51k3J28mk4Q3Jm1M7L2p3k40O9J57j6m4J20k19L89n66K59
$$ plain form
3967 15 137 37 30 -193 -216 22 -44 -104 68 99 122 -47 55 84 -149 53 66 68 -20 -232 127 123 -22 103 -169
3992 -169 25 -91 21 -27 -67 -13 73 119 238 235 -143 -37 32 -87 16 8 137 -61 -21 -44 27 -104 -62 136 -253
4017 -253 117 67 -34 151 119 19 202 -135 -112 -210 210 140 -188 -154 -233 165 102 -3 -80 42 -140 59 -32
4040 -32 -101 -196 -217 200 68 -197 -15 105 40 165 39 -75 136 -175 88 -73 -230 -48 -152 107 141 57
4062 57 304 -17 -65 248 -107 156 140 -131 -93 22 -20 226 190 67 104 67 94 -64 20 -229 174 -258 -203 167
4086 167 137 21 -125 -149 -71 42 -133 144 190 190 -388 65 -21 -167 2 -128 -16 1 32 -189 10 37 -118
4109 -118 -175 -32 -12 213 59 -83 -90 -16 -189 -120 170 237 40 -33 -217 149 -186 -16 -128 -52 38 -38 311 -69
4133 -69 -4 62 -71 24 162 191 8 -193 181 -10 8 90 -67 252 189 270 121 -18 -198 -170 -239 66 226 -199
$$ packed form
3967A5J22j00pk23k3K38o6o0J72L1K3j69J02K9k33K02J3Kq8k12L59mj45J25k72
3992a69J94j16J12m8m0N4Q6M6J19ll78J06O9j19J03qJ29j98M0k3P1j31M2J98l89
4017b53L70n0j01J85l2j00J83l37K3r8M20p0l28L4p9L98o3j05p7J22j82J99r1
4040c2o9r5k1M17j32k65J82J20o5J25j26j14K11l11K63j61j57J82j04K59L4q4
4062E7K47l21m8L13l55K63j6k71L8J15m2K46l6j23L7l7K7j58Q4k49M03m32N5L70
4086A67l0j16j46k4P8J13j75K77M6%n78M53q6j46J69j30J12J7L1k21J99K7j55
4109a18n7J43K0K25j54j42pP4j73O9K90O7j97p3j84L66l35J70j12P6R0p6L49l80
4133f9O5O6j33R5J38K9j83k01L74j91J8Q2j57L19o3Q1j49j39j80K8o9L05J60m25
$$ plain form
4157 -199 -24 -95 -197 -55 69 31 -148 -219 -67 -29 114 42 -211 -31 -66 92 -69 -203 163 -45 91 -10
4179 -10 222 -187 24 -229 -40 139 -44 244 88 -88 112 -21 94 168 -253 88 -8 -179 36 145 -52
4200 -52 -213 213 -15 53 188 233 -65 -62 -32 -152 -29 -101 -138 73 -109 -251 182 46 -223 60 16 36 -17 281
4224 281 98 115 97 79 206 -23 -66 85 81 -71 -137 217 -63 164 -104 -9 -128 41 40 49 82 -103 -42 -152 7
4249 7 -166 51 63 -18 -173 160 -87 -49 39 -2 -13 101 107 -47 -274 93 -96 85 8 172 -38 88 -38 -44
4273 -44 118 121 164 114 367 -160 -5 47 -15 105 314 48 -143 69 -316 36 40 -83 30 -177 65 -1 -12 54
4297 54 -284 -129 31 -100 43 -224 10 51 43 -175 -32 189 -187 177 -77 110 166 99 198 20 227 -39
4319 -39 -169 76 -146 -148 -66 -89 -90 23 -31 -151 86 -83 -110 57 -11 -263 -79 93 122 8 126 56 -93 -178
$$ packed form
4157a99J75p1j02J42J24l8j79p1J52L8J43p2k53J80l5J58j61j34L66k08J36j01
4179a0K32m09K11k53J89J79j83K88j56j76K00j33J15P4m21L41r6j71K15J09j97
4200e2j61M26k28O8J35M5k98LL0j20J23p2l7K11j82j42M33j36k69K83m4K0n3K98
4224B81j83J7j8j8J27k29m3J51mj52o6L54k80K27k68R5j19J69jRL3j85O1j10J59
4249Gj73K17J2q1j55L33k47L8Q8m1j1J14Oj54k27L67j89J81p7J64k10J26j26o
4273d4J62LM3n0K53n27J55N2o2J20K09k66j91K12l85L52Mj23J13k07K42o6j1O6
4297E4l38J55J60j31J43k67K34M1qk18J43K21l76L64k54J87N6o7R9j78K07k66
4319c9j30K45k22kQ2k3jJ13n4j20K37j69k7J67o8k52J84J72K9j14J18p0j49q5
$$ plain form
4343 -178 19 -167 -57 197 87 179 -178 46 70 54 105 -299 243 134 57 -154 79 -13 55 195 244 -80 -226
4366 -226 141 4 -51 67 -80 -164 -111 -35 95 203 -32 147 30 -107 79 -169 49 82 -89 123 93 -19
4388 -19 168 -202 55 61 -28 -80 -76 177 -89 -34 -118 -15 158 298 240 -163 -177 35 -258 267 154 12 90 -62
4412 -62 -71 -117 -40 0 -207 -68 -84 -287 -104 -96 369 243 -274 106 28 -36 44 -22 69 -41 -118 43 -9 78 83 18 166
4439 166 165 111 134 84 127 -76 25 -190 -38 -126 104 69 78 -13 1 151 121 -226 -190 23 -32 183 120 122 282 103
4465 103 11 -161 -39 -80 -7 52 -109 -165 99 29 8 269 31 -67 94 -105 -58 76 -209 153 -137 61 34
4488 34 271 71 -268 -78 -90 265 -103 -71 85 72 92 -115 121 -68 -39 117 106 -268 108 71 86 159 -18
4511 -18 -97 224 -154 -111 -161 -208 -54 -7 87 -80 125 157 -9 132 87 76 214 -196 87 270 -97 13 23 -112
$$ packed form
4343a78J97j86J10K54j10R2l57K24K4j6N1m04N42j09p7k11K33r2O8J40M9l24j46
4366b26L67j37n5J18j47q4N3P6J30J08k35J79j17j37J86k48K18L3j71K12l0j12
4388a9J87l70K57Oq9n2MK53k66N5q4J03J73J40n8m03j4K12k93N25j13j42P8j52
4412f2rm6P7M0k07J39j6k03J83QM65j26n17L80p8o4Q0o6R1j10p7J61n2Q7No5J48
4439A66jn4K3n0M3k03J01k15J52q8K30l5Rr1J4J50l0l47L6K13n5K15o3KJ60j79
4465A03r2j72J22m1P3N9j61n6K64p0k1K61k38r8J61j99M7J34k85L62k90J98k7
4488C4K37k00l39J90j2L55l68L2J56j3K0k07K36j89K9J56j1l74L76l7J5P3j77
4511a8p9L21l78M3n0m7J54M7R4j67K05L2j66J41m5j1J38m10K83J83l67J10J0j35
$$ plain form
4535 -112 84 26 120 142 -134 102 -344 127 76 86 41 239 11 -46 64 -115 129 -30 90 -64 -29 115 196
4558 196 -101 -53 182 -316 63 -170 16 24 -130 44 205 159 -61 -8 -203 -76 127 -62 -209 -22 136 -256
4580 -256 -232 -9 -56 82 -56 -153 -40 10 -182 -199 249 15 3 -39 22 252 194 -58 -35 -18 33 -125 41 53
4604 53 81 -35 -16 -10 192 219 146 44 237 158 120 -2 -145 143 153 143 -56 59 167 47 112 -71 163 -98
4628 -98 358 60 119 -113 -87 23 5 -58 41 209 -5 -147 46 -31 50 184 15 71 -68 -46 25 -122 169 69
4652 69 -153 72 59 -55 -173 94 -205 191 66 150 -14 193 33 -86 64 -84 41 3 145 88 169 -121
4674 -121 204 53 83 109 199 122 -32 88 180 -108 -79 -148 -152 -107 128 16 40 10 -137 87 77 9 61 91 4 78
4700 78 -142 -80 60 -130 -85 179 -147 52 118 -254 -36 -59 -166 -44 -48 117 -193 -171 -126 -47 -27 93 171 295
$$ packed form
4535a12J96n8R4K2k76K36m46M71n1J0m5J98k28n7J10j79K44j59J20j54L5J44Q1
4558A96k97M8K35m98L79k33J86Qj54J74J61m6k20N3j95J27K03j89j47J87J58l92
4580b56K4K23m7J38j38r7J13N0j92j7M48k34j2m2O1K30n8k52K3J7N1j58J66J2
4604E3K8j16J9OK02K7p3j02J93p9l8j22j43K88J0j0j99J15J08j20O5j83K34k61
4628i8M56k98N9k32K6J10j8o3R9J68k14j42J93p7Q1J34j69N6j39K2P1j47K91j00
4652F9k22K25j3j14j18K67k99L96j25Q4j64K07j60j19J50j48J25l8J42n7Q1k90
4674a21L25j51L0K6R0p7j54J20R2k88K9o9mM5K35j12K4l0j47K24j0o8N2L0q7P4
4700G8k20O2J40j90M5K64l26J99O6l72K18k3j07J22mJ65l10K2M5P9K0J20P8J24
$$ plain form
4724 295 -10 78 -41 121 -86 304 53 -70 44 -112 204 21 -20 -98 12 54 -110 -270 180 -200 -125 20
4746 20 114 -12 -295 -21 86 58 62 -36 -47 141 -144 68 219 52 -113 196 -65 62 29 -118 -157 15 54
4769 54 279 10 -238 -144 -154 35 156 -17 34 -54 77 239 -118 -110 -31 11 -151 52 -88 70 106 106 41 18 -43
4794 -43 -135 -72 92 -27 28 -30 -102 -54 25 29 60 -30 110 -154 40 -17 8 58 -21 19 -40 -121 128 65 -133 190 17
4821 17 130 -47 40 -53 -110 1 192 147 -47 -156 325 64 -356 -58 -225 92 -27 -112 113 -205 -82 -14
4843 -14 180 -190 11 -45 -134 -207 -179 -14 63 123 68 161 -79 -139 -159 -94 240 57 78 -82 135 -19 72 131 -9
4868 -9 -60 -186 -130 218 -274 -10 136 -135 -65 -16 -33 55 32 -45 55 -185 127 -141 116 17 197 -103 125 2
4892 2 223 124 225 134 -154 47 -248 -190 -97 -22 143 70 172 -86 56 32 -145 -64 -13 81 20 53 6 -3 21 -12
$$ packed form
4724B95l05Q8j19J62k07L90k51j23J14j56L16j83m1p8J10M2j64j60M50l80P5J45
4746B0R4j26k83K74J07k8Mr8j1J88k85K12J51j67j65L09k61J27l3j47l9J72L9
4769E4K25k69k48R4j0J89J21j73N1q8J31J62l57QP9M2j62K03j40J58L6%o5k3o1
4794d3r2O3J64j19N5n8p2M8P9ML1r0J40k64J94n7K5N0p9M0n9q1K49o3j98L23j73
4821A7J13j77Q7r3n7J11J91m5j94j09M81k61m20K98j67L17j19q5K25l18J23O8
4843a4J94l70K01n6q9p3K8J65P7O0n5R3k40o0k0O5L34j83K1j60K17j54R1N9j40
4868in1j26N6L48m92K64J46k71P0M9j7Q8k3p7J00k40L12k68K57r9J80l00K28j23
4892BK21r9J01r1k88K01k95N8R3P5J65p3J02k58J42k4j77Q1N1R4o1L3m7rK4l3
$$ plain form
4918 -12 -181 -144 -72 24 155 13 -48 -143 188 100 -123 -10 153 -68 -77 8 38 8 51 -114 188 -179 -232 68 56
4943 56 100 15 92 -65 69 8 -99 -9 -107 -273 -20 146 -53 33 -102 119 233 62 67 -112 -5 -75 7 -28
4967 -28 17 48 192 -257 44 124 61 -44 -25 -166 89 -76 -191 68 45 -96 -114 -6 -25 -120 71 60 -233 266
4991 266 -35 37 13 -30 -274 137 13 248 176 107 -81 65 30 107 5 158 -116 22 29 -175 154 -50 56
5014 56 -88 157 119 137 -63 -8 23 48 -9 111 -56 105 2 142 -134 67 -171 128 -83 -128 144 77 105
5037 105 -113 -73 96 151 -138 33 -53 -37 140 67 10 -41 -260 -89 106 -27 103 -6 159 42 1 49 17
5060 17 -61 -125 -37 118 136 265 8 -271 63 -87 -63 31 -109 102 143 -25 1 -139 -20 -145 206 7 -140
5083 -140 -145 -324 -28 -46 44 -60 -119 -77 21 -27 -127 -51 -126 97 172 30 164 29 -109 187 -158 -32 -32 -2 -273
$$ packed form
4918a2j69L7P2R6J31j42o1r5L31q8k23J13J63k21rQ5L0l0M3j65L02l67n3L00j2
4943E6M4q5P7j57J34o1j07R0r8j66K53J66j99Q6j35K21J14j71Nj79J07p0Q2l5
4967b8M5L1J44m49L01Q0o3j05J9j41K55j65j15K59k3j41j8J08j9r5J91j1k93M99
4991B66l01P2k4m3k44M11j24K35p2o9j88J46l5P7j02J53k74J38Pk04L29k04J06
5014E6j44K45l8J8k00N5L1K5n7J20j67J61j03J40k76K01k38K99k11m5K72o7K8
5037A05k18M0J69N5k89J71q6J6J77p3n7n1k19J71J95j33J30j09J65j17m1M8l2
5060A7p8o4Q8J55J8J29k57k79L34j50K4R4j40K11M1j68K6j40J19j25L51j99j47
5083a40nj79K96j8R0j04n9M2R8m8j00P6p5K23P5j42J34j35j38K96l45J26%L0k71
$$ plain form
5108 -273 28 151 -107 52 -38 160 -217 69 28 -140 420 -23 44 -263 -11 -51 15 -48 -12 -162 244 -35
5130 -35 32 203 5 -8 -128 109 -24 3 -32 144 -95 172 -14 -40 11 -103 -6 288 226 -18 -67 130 200 158
5154 158 -66 73 25 72 -16 -264 123 233 105 -107 55 -185 212 -133 -8 -61 -45 105 -240 7 181 -135
5176 -135 -61 -34 2 77 80 -142 204 69 109 -122 103 -173 25 84 -31 19 53 -279 -97 -107 9 -12 11 -71 38
5201 38 -45 -230 22 3 -57 -161 -45 -293 -88 312 -82 -184 21 -218 158 27 -218 -102 -116 58 5 -110
5223 -110 -128 -103 185 -11 157 -12 161 170 -116 -158 -131 -84 111 -205 -76 56 -31 19 -66 -107 52 120 -123 -95
5247 -95 113 -174 -40 13 63 30 235 -15 -297 -55 -211 -78 -46 -26 20 -4 15 -49 -105 -141 58 -172 -7 69
5271 69 34 194 -241 -19 -69 226 -157 17 119 -30 -20 -190 -41 -78 182 -287 -27 -70 -61 74 31 34 72 -126
$$ packed form
5108b73L01J23k58J59r0J98l77K86m1j68N60m43O7l07K52m0O6o3L6j50M06k79
5130c5O7J71j98j3j20K37j33K7l5J76k39K67j86k6N1j14R7K94o2k44m9J97P0m2
5154A58k24J39m8M7q8k48L87J10j28k12J62k40L97l45J25n3J6J50l45K47J74l16
5176a35P4K7L6P5Lk22L46j35M0k31K25k76J98N9j15N0L4l32J82j0J16k1K3q2J09
5201C8q3j85K52j9o0j04J16k48K05M00l94j02K05k39L76j31k45J16j4J74n3j15
5223a10j8K5K88j96J68j69J73Rk86m2K7M7J95l16J29J32q7N0q5m1J59O8k43K8
5247i5K08k87J34N3N0l3K05k50k82K42j56J33L2K0M6k4J9o4n6l6J99k30J65P6
5271F9l5J60m35K22n0K95l83J74J02j49J0j70J49l7K60m69K60m3RJ35m3LL8j98
$$ plain form
5295 -126 -66 159 245 162 -87 2 84 158 152 70 -198 37 101 31 -196 -23 1 -153 224 78 -105 -160 -66 -32 -332
5320 -332 -82 -213 -51 -111 -274 138 16 8 33 248 -121 -168 8 101 -95 153 269 -103 121 -150 53 146
5342 146 72 -134 103 45 28 144 215 -84 -90 18 49 -138 19 -17 97 18 -34 160 -21 22 2 -88 104 45 -285
5367 -285 -19 59 -41 180 111 -76 -32 -172 -219 -279 -42 -116 111 113 121 58 154 -19 150 22 2 -91 123 -40 72
5392 72 123 -22 136 -89 -53 -79 31 -75 -102 -166 -221 -6 56 35 46 43 -69 34 -18 103 2 175 -26 201
5416 201 79 81 -85 -44 -66 350 -30 -159 145 -117 245 82 -120 -41 13 -47 36 -155 -65 -135 -65 199 -103 4
5440 4 11 -195 141 171 172 -183 -203 17 45 -209 -36 -97 -46 182 95 -13 3 64 50 322 20 -108 -33 -191 16
5465 16 72 114 -5 -83 -142 126 86 87 -184 -20 120 167 -125 0 -207 -49 176 15 69 5 -229 146 18 40
$$ packed form
5295a26O0K25Q6q3k49Q9Q2P4oq2k68K35O4p0k27J73K4j54L77j46j83n5R4L4l00
5320c32K50j31J62o0j63M12j22qK5K15l69m7J76R3j96K48J16l72K24k71K03R3
5342A46p4k06K37n8j7J16P1k99oJ08L1j87J57l6J14p9n2J94j81M3k0r0J92n9l30
5367b85K66P8j00K21o9j87M4j40m7o0K37p4K27KQo3R6j73J69j28k0r3K14j63J12
5392G2N1j45J58k25L6k6J10j06k7o4n5K15O2k1J1lj12J03n2J21j01J73k01K27
5416B01j22Kj66M1k2M16l80j29L04k62L62j63k02P9N4o0Q3j91R0p0P0K64l02J07
5440DPk06L36L0Jl55k0K20K8k54J73o1N1K28q7j08J6O1j4K72l02j28P5j58K07
5465A6N6M2j19p8n9K68m0Jk71J64J40M7k92J25k07J58K25j61N4o4k34L75j28K2
$$ plain form
5489 40 28 149 319 -262 -109 240 -111 9 26 182 -130 -155 63 108 99 96 -140 221 127 -6 -217 -342 71
5512 71 124 318 -94 343 -99 105 -51 124 151 48 -215 -7 274 17 -13 47 88 -11 -170 89 10 138 13
5535 13 178 -228 -196 167 167 61 280 209 -126 226 -280 -59 82 -83 310 -58 -120 193 -65 43 116 95 -164
5558 -164 112 -211 -295 74 94 55 -1 387 56 -194 13 109 15 -104 12 180 32 -113 54 -151 37 137
5580 137 -108 -98 192 79 70 -134 -62 26 237 81 13 -85 118 75 33 -63 -4 -30 -140 -168 2 50 -104 -3 -4
5605 -4 -49 -61 -62 124 83 -92 74 49 1 -125 -13 -159 -156 137 103 -159 -89 157 131 -27 -63 114 -172 -9 -201
5630 -201 34 31 13 203 160 -114 -45 -11 -154 110 -90 -104 62 50 69 145 -21 -76 118 -68 -85 -35 21 246 124
5655 124 -5 -55 87 66 68 -33 -9 44 -73 105 133 231 43 183 114 -84 132 -47 -119 -95 9 -24 -132 -125 -212
$$ packed form
5489D0j2J21J70n81J53L49l51J20J7J56l12k5K18M5rlk36L61r4j33k11j25M13
5512G1N3J94m12M37m42K04j56J75K7j03k63K08K81k57l0O0M1r9j59K59p9J28j25
5535A3J65m06L2L63%j06K19p1l35L52n06K21J41j65L93l68o2L13k58J08P3k1k59
5558a64K76l23q4L69K0l9n6L88l31k50K07R6r4j19J16J68j48j45J67k05J88J00
5580A37k45J0K90j13rk04P2Q8K11j56o8r8K03m3m2r6N9k6j10k8J70M8j54J01j
5605dm5j2jJ86m1j75J66k5m8j26J12j46LK93l4k62P0K46k6j58l6J77k86J63j92
5630b01K35lj8J90m3k74O9L4j43K64k00j4J66j2J9P6j66n5J94j86j7N0N6K25j22
5655A24j29n0J42k1Kj01K4N3j17J78K8R8j88J40o9j98K16j79p2K4J04l3j08Pq7
$$ plain form
5680 -212 -75 68 250 170 41 -404 246 -111 90 -25 -226 135 -116 318 -51 152 76 162 -163 -40 -92
5701 -92 140 -67 66 -223 -71 -91 0 -31 -59 274 -106 -113 4 -256 48 177 -69 -92 -158 -290 187 212 117 -108
5725 -108 182 -120 -27 71 147 97 146 72 42 -52 -2 92 1 15 -175 55 -3 20 79 216 -207 19 136 68 -58
5750 -58 76 61 172 61 -168 64 115 -133 313 -239 -167 -88 142 204 9 -23 186 37 -127 81 88 -129 -211
5773 -211 32 -130 7 69 112 11 -233 -12 94 181 190 56 49 317 -217 249 214 37 88 -381 160 -135 -98
5796 -98 -214 265 -88 3 161 -134 -7 166 39 -153 124 -69 -82 167 -130 87 79 69 11 122 17 -58 -143
5819 -143 -85 206 220 34 -173 13 -6 -162 -200 -229 82 -286 19 79 -93 244 -25 202 -63 86 19 -298
5841 -298 49 -13 -291 200 126 164 -68 -162 -105 -14 -233 107 -82 89 181 47 -29 6 -174 -176 7 167 -193 -43
$$ packed form
5680b12J37J43J82q0j29m45O50l57K01j15k01L61k51M34l69K03p6Q6l25J23n2
5701i2K32k07J33k89J52k0R1l1k8L33l80pJ17k60L04J29k46k3o6j32M77K5r5k25
5725a08K90l02R3R8P6n0M9p4l0r4N0R4r1J4j90K30n8K3N9J37m23K26J17o8j26
5750e8J34j5J11j11k29K32N1k48M46n52P2P9K30O2j95l2K09j49j64K08Pk17q2
5773b11K43j62J37O2M3j01k44K21J06Q7Rj34pK68n34M66l5j77N1m69N41k95L7
5796i8j16M79l53R1J58k95J27J73j27j92K77j93j3K49k97K17qj0n8J11j05p5q5
5819a43N8K91J4j86k07J86j9j56l8k9L11l68L05O0j72L37k69K27k65J49o7l17
5841b98L47o2k78M91p4L8k32r4N7R1k19L40j89J71R2j34p6L5j80kJ83J60l60J50
$$ plain form
5865 -43 -146 -292 138 -27 -44 -71 30 -31 -7 104 -265 149 46 32 51 33 118 -165 -129 -10 15 28 -80 -122
5889 -122 -36 249 -23 -104 -153 -373 155 27 -104 9 50 16 244 167 236 36 7 125 180 76 -48 -49 -173 -34
5913 -34 -71 -29 80 -48 -10 -148 8 -72 192 57 14 45 -56 -235 -56 -214 -211 158 -49 45 -85 3 61 92
5937 92 114 -161 -144 161 30 -13 -222 20 -60 208 166 -130 57 235 148 -47 38 -43 -29 -67 20 118 148 -13 -31
5962 -31 56 -13 -91 173 92 24 161 54 14 -85 176 63 -197 170 -3 276 -82 85 122 -86 30 102 -100
5985 -100 103 191 8 -173 19 -80 -20 28 213 59 -77 -214 159 -75 65 53 64 -258 -178 -32 5 176 -58
6008 -58 -33 163 -44 -27 13 -16 -54 80 56 -193 77 -70 122 -93 -24 216 -98 55 -73 60 -101 -192 129
6031 129 41 34 -18 -104 178 161 -9 26 16 -117 -23 135 162 -12 -213 20 -202 151 -162 -3 8 125 102 -86
$$ packed form
5865d3j03j46M30j65j7k7J01o1K4J11l69M14j03j4J9j8Q5k83L6J19K5J3j08m2
5889a22Q6K85k72q1m9k20N28j28j31J13M1l4K28p7O9k00k9J18N5j04j24jj24J39
5913c4l7M2J09j28L8j38J56q0K64j35m3L1j01j79J79j58LL69k07R4j30Q8N8L1
5937I2K2k75J7L05j31m3k09K42q0K68m2k96J87J78q7j95Q5q1J4l8Q7R8L0j61j8
5962c1Q7o9p8K64q1o8J37j07m0r9K61j13k60L67j73K79l58J67L7k08J16P2k02
5985a00K03Q8j83j81J92r9O0M8J85j54j36j37L73k34J40j2J1l22Q0J46L7J71k34
6008e8K5J96k07J7M0k9l8J34k4k49K70j47J92k15O9K40l14J53j28J33j61r1L21
6031A29q8pn2q6K82j7j70L5j0j33R4J58K7j74k01K33k22L53l13J59J1J17k3j88
$$ plain form
6055 -86 103 195 -34 194 173 -211 102 259 135 218 -81 -46 -254 -17 -364 118 9 134 -210 25 -170 15
6077 15 29 -223 103 -264 -58 -67 -39 -109 -16 32 25 160 -2 -113 84 -95 309 -113 16 3 160 -30 -42 105
6101 105 29 25 60 140 -72 26 156 166 -81 -135 82 -89 39 -13 50 152 31 -93 -17 -53 -77 -67 125 25 51
6126 51 49 90 -59 -262 141 112 -235 151 94 -27 -124 120 -147 -59 -79 -191 48 26 30 -140 -185 -92 -7 56 130 33
6152 33 84 290 68 17 54 -84 16 266 159 -27 213 86 246 70 -203 -69 -179 84 51 -151 -98 48
6174 48 -55 -121 -137 -64 -186 -50 -56 -33 284 -108 -76 198 -125 -119 289 54 -60 -104 -136 165 129 36 67 156 2
6199 2 128 72 -39 22 -124 -158 -133 -13 -77 -17 -28 184 172 131 101 60 55 -24 1 -36 79 48 110 181 339 295 69
6226 69 19 108 -145 -20 55 -46 119 7 -274 -184 202 364 63 -59 -268 113 -182 -67 58 -130 61 -146
$$ packed form
6055h6J89R2k29K28k1l84L13J57j24Q3k99L5k08K37l47M82j09J25l44K35j95J85
6077A5J4k52L26l67K06rK8p0R3M8pJ35j62j11J97j79M04m22J29j3J57j90j2J47
6101A05p6mL5Q0k12R8J30J0k47n4K17j71J28n2O3J02j21j24P6l6k4J0J92j00K6
6126E1kM1j49k03M03k9l47L86n7j21r7K44k67Q8k0j12K39k2Mj70m5R3Q5O3P4r7
6152C3N1K06k22n1L7j38J00K50j07j86K40j27J60j76k73J34j10K63l3k02N3J46
6174D8j03o6j6P3j22J36oK3L17l92L2K74l23OM08k35j14m4l2L01l6r3L1Q9j54
6199BJ26n6j11O1j46l4K5J20o4O0j1K12j2m1l0m1np9K5l7J15l1O2P1J58m4k26
6226F9n0Q9k53J25P5j01J65j12k81R0L86J62l01j22k09L81k95J15J25j88J91k07
$$ plain form
6248 -146 -213 16 122 118 -37 -251 61 -74 -99 -34 57 -19 208 6 -351 1 20 157 -31 56 156 81 6 -292
6272 -292 -74 169 -110 59 35 96 161 261 31 -67 10 -226 72 119 -81 85 203 -185 -68 -117 -159 128 152
6295 152 -89 -40 130 -87 72 -165 73 -42 -152 -186 5 -20 -12 2 -128 13 -5 6 -69 73 188 54 268
6318 268 -7 55 19 55 -25 57 319 143 -134 32 51 -35 -27 -34 30 -52 57 336 -208 -138 -47 -34 -5 -110 -148 237
6344 237 -40 -36 -154 175 -200 -71 128 31 107 80 -5 -165 -65 71 -6 -55 -96 -69 21 49 151 -29 -72 -19 54
6369 54 -80 87 -216 284 248 -39 28 43 292 -224 -42 158 -240 21 144 46 -144 95 227 79 5 -36
6391 -36 -42 -115 -27 -54 -10 150 238 110 -12 14 20 175 28 -23 -92 -50 101 209 -61 256 -40 2 -26 84 142 -107
6417 -107 -5 62 -19 -18 -3 -24 138 -222 96 162 -262 -85 83 -40 -295 -218 69 -9 -50 76 -37 18 82 -131
$$ packed form
6248a46o7K29J06mj55k14L12j35k5O5R1p6K27k02l57L52J9J37j88Q7J00p5p5k98
6272b92K18K43k79J69k4O1O5J00k30r8P7k36K98M7k00J66J18l88J17m9m2K87K4
6295A52k41M9J70k17J59k37K38j15j10l4J91k5QJ4j30J41j8J1p5J42J15j34K14
6318B68k75O2l6L6q0Q2K62j76k77J66J9q6QpO4q2J09K79n44P0R1J3K9j05l8L85
6344B37k77Mj18L29l75J29J99r7P6k7q5j60J00J36p7m9m1K7R0K8J02j80m3N3P3
6369E4j34J67l03N00l6k87O7J5K49n16J82K00l98K61J23r8j90K39J32j48p4m1
6391c6op3Q8k7M4J60Q8j28j22K6OJ55j47n1o9M2J51J08k70L17k96M2k8J10N8k49
6417a07J02O7q1JJ5k1J62l60L18O6m24J77J68j23k55P7K87p8m1J26j13N5O4k13
$$ plain form
6441 -131 177 -196 83 -205 12 110 -141 -109 -21 181 79 49 -81 -78 -159 -74 -131 76 51 -36 43 87 -131 -91 -13
6466 -13 -75 13 152 -174 -67 89 31 93 -96 -129 86 -285 -79 75 14 89 -5 141 -32 106 -127 -32 13 11
6490 11 -99 225 91 167 57 45 61 -45 -9 200 19 -59 226 168 5 59 -61 -99 55 72 -20 -133 -132 -3
6514 -3 -137 105 101 -30 -109 -214 -92 293 78 -223 -16 -41 347 -217 -146 -14 33 -114 108 45 6 -210 27
6537 27 -173 -221 142 29 -190 -232 110 127 70 35 72 -125 -86 31 -33 105 -110 108 209 34 -149 -265 -142
6560 -142 -86 15 -121 -25 42 -131 -161 -316 243 14 74 -119 -262 -78 38 53 -146 -134 -98 14 -159 -372 110
6583 110 -109 192 20 -65 25 99 88 -45 15 -66 -184 -65 -39 -90 -85 68 -152 42 39 -162 -51 -57 -137 -70 70
6608 70 -84 108 123 -162 -84 168 -9 -170 249 112 -146 70 106 84 101 -165 135 13 -47 44 130 107 11 77
$$ packed form
6441a31L08l73K79k88K17R8k51L2Q8K02j02l0j30Lq1Q5n7K07k5q7P9M4k18M0P8
6466a3o2Q8J39l26J07J56n8O2j89l3K15l71K06J54o1P5r4J46j73J38k33R5M5k
6490A1j10L24j34P6j10j2J6j06L6K09j81p8K85n8j63N4j20l8J54J7r2j13JJ29
6514cj34K42mj31p9j05J22L85k15l01K07k5L88n64P1J32M7j47K22o3l9k16K37
6537B7k00m8L63j13k19m2L42J7n7l5L7j97L9J17o4J38k15K18J01j75j83j16J23
6560a42N6J01j36R6O7j73l0j55N59k29O0j93j43J84J16J5j99J2L6J12j73k13M82
6583A10k19L01j72q5R0P4j1j33O0q1j18J19K6n1NJ53k20J94lk01J11oq0O7J40
6608G0j54J92J5k85P8K52j77j61M19j37k58K16L6k2J7k66L00j22o0R1Q6k3r6O6
$$ plain form
6632 77 -80 -134 -157 -82 -148 0 72 116 173 286 72 -63 199 181 68 182 -58 76 -9 -96 131 118 -33 221
6656 221 -116 -138 24 154 -85 178 59 108 -63 -135 -115 199 269 -53 -300 -223 114 -20 -89 -217 32 -127
6678 -127 68 -102 -88 -34 -1 118 59 -142 -42 -30 -78 70 1 135 -123 42 27 -32 100 100 -48 142 -201 -1
6702 -1 -243 -125 -27 77 97 6 -390 46 -9 67 51 -107 1 -71 -38 -2 -171 -8 -2 -88 60 -95 62 26 -9
6727 -9 236 107 18 153 -30 255 -154 -114 -190 18 107 208 62 37 255 105 3 -114 -48 -19 237 -109 -150
6750 -150 -109 -245 177 -177 104 92 -108 112 -203 80 287 -41 -27 -159 -154 16 -10 -300 129 108 -71 115
6772 115 -71 199 -96 -44 39 -88 -121 50 58 -8 95 258 -117 -133 -148 100 -12 -9 46 61 16 -332 -111 -10
6796 -10 77 178 56 8 13 -148 52 -110 -136 -12 341 52 -88 -57 144 -101 -106 -248 -86 86 -200 -123 -192 -76
$$ packed form
6632G7j57n4k3P5o6J48P2M4N7J13k14j35K62j8j13J14k40J34q5q7K27j3j51K54
6656B21l37k2J62J30k39K63j19M9j71p2K0L14P0l22k47P7L37j34o9j28K49j59
6678a27J95j70J4N4L3J19n9k01J00J2m8J48o9J34k58J65j5n9J32%j48J90l43K00
6702ak42J18R8J04K0r1l96M36n5P6j6j58J08p2L3L6j69J63Oq6J48j55J57l6l5
6727iK45j29q9J35j83K85m09M0p6K08Q9J01j46k5K18j50j02j17O6K9K56l46m1
6750a50M1j36M22l54K81j2k00K20l15K83K07l28J4j32NJ70k6k90M29k1j79J86
6772A15j86K70k95N2Q3j27l3J71Qo6J03J63l75j6j5K48j12LN5J5m5l48K21J01
6796a0Q7J01j22m8Nj61K00j62k6J24L53k89j40L1K01k45nj42J62J72k86P7o9J16
$$ plain form
6820 -76 179 7 317 -241 70 79 144 -70 52 36 -133 52 190 29 72 -112 -73 -146 -142 74 42 -38 -84 -54 -102
6845 -102 32 -1 -229 -47 179 -381 142 93 144 161 73 110 -156 218 151 66 43 -208 -35 -211 90 -16 152
6868 152 -85 118 -107 -121 -33 -253 -96 100 -148 104 -198 -90 -7 -64 149 -44 147 -25 95 4 -24 63
6890 63 -59 -103 -79 -13 116 -269 -125 41 109 -8 109 101 -23 145 -400 271 -52 363 102 -121 -25 221 -26
6913 -26 -71 54 -31 -130 -8 -123 -42 50 149 123 -185 -15 106 44 -94 -55 27 -88 -159 -85 -175 253 -213 80 -229
6938 -229 112 -137 -94 4 -84 69 -23 -19 1 211 -84 24 -37 161 -148 44 -141 -19 -41 -62 -72 -88 88 -234
6962 -234 -149 281 -50 -52 62 -406 -36 53 -165 18 32 -6 -59 -58 -123 104 224 139 -84 -27 -40 -89 -16 25 -58 -104
6988 -104 -76 -163 -88 -74 99 79 62 190 70 11 -144 -125 -118 15 -6 128 -33 -23 -177 -133 131 81 143 57 -266
$$ packed form
6820g6K55j72L10n58L11RO5k14J22j6j69J85J38j61M3j84L9p3MK16l2q0m6L0m8
6845a02J34l3k28J82K26n60N23m9N1J7q8L7k66L74o7q5k3k51J73j76L01j06J68
6868A52k37K03k25j4Q8k20J57J96k48K52l02J08Q3n7K13j93J91j72J20r1k8Q7
6890F3j22m4K4O6J29l85J44J66O8j17J17qj24J68n45O71l23M15k61k23R6K46k47
6913b6m5J25q5r9J22j15Q1R2R9k6l08J70J21o2j38L9Q2j15p1P4r0M28m66K93l09
6938b29L41k49M3R8q8J53r2MK0K10k95J08o1J98l09J92j85J22k2k1j0j6J76l22
6962b34Q5M30l31kJ14m68L70Q9k18J83J4l8n3Jo5K27J20q5k23N7j3m9P3M1q3m6
6988a04K8q7P5J4J73k0j7J28j20n9j55J9PJ33k1J34j61J0j54M4K64n0O2q6l23
$$ plain form
7013 -266 -46 -42 -101 111 -80 -29 70 -24 -2 89 -50 94 4 -235 40 74 161 3 -58 -15 -159 -143 70 -31 -196
7038 -196 81 -1 -71 -79 -33 -182 -187 118 32 7 -27 -131 -279 135 125 276 -99 -191 91 -10 36 -85 234 6
7062 6 -38 -43 113 273 97 -7 78 69 -173 -75 228 -93 -3 232 136 -117 -11 250 221 120 192 309 -11 288
7086 288 -210 -17 62 -164 -381 -215 -1 -31 -138 30 -246 126 28 -46 260 -33 -20 -51 249 -241 -47 -228
7108 -228 -86 -164 -107 -68 -162 -176 -58 13 -51 -47 -71 -27 -155 82 -161 118 -76 12 -86 -142 -138 -1 -17 -245 27 -142
7134 -142 -194 12 52 39 -18 -74 36 72 2 106 100 -33 -100 273 -78 -130 35 54 210 -178 -5 -143 83 211
7158 211 135 -119 81 150 -31 78 51 21 6 8 121 230 179 -18 -23 5 -36 26 -61 184 52 -122 -25 34 55 -9
7184 -9 -51 -112 -123 140 122 169 -217 -90 -284 47 -137 153 60 -65 -88 -204 166 88 38 11 -36 -120 91 -19 118
$$ packed form
7013b66K20Mn9K12j91N1R9r4K2R1j39J44r0k39K75L4Q7j58o1M3j44J6K13j01j65
7038a96K77q2p0qM6j49nL05q6k5l4j04j48M14j0J51l75r2K82j01M6j21L19k28
7062Fm4nJ56J60j76j04Q5rk42R8L03l21R0K35r6k53J06K61k9j01P2J17l20K99
7086B88m98J93P9k26k17J66K14l0j07J68k76L72r8p4L06k93J3l1L00m90J94j81
7108b28J42p8N7L9r4j4J18P1o4Mk4M4j28K37k43K79j94Q8r8n6MJ37j6k28K72j69
7134a42n2K06M0j3n7n6J10L6p0J04oj33o7L73l51n2J65J9J56l88J73j38K26J28
7158B11p6k54K00O9j81J09k7l0j5KJ13J09n1j97nK8m1O2q7K45j32j74R7N9K1o4
7184im2o1j1K63j8M7l86J27j94L31j84K90r3j25k3j16L70p8n0k7m7q4K11j10J37
$$ plain form
7209 118 135 42 51 34 10 -148 214 -30 52 169 -174 -42 65 -160 -99 286 -28 -94 -187 118 -150 -212 72 -118
7233 -118 89 222 117 -139 25 97 47 -104 147 -121 99 206 59 -17 148 30 245 -139 0 23 22 24 81
7256 81 -196 138 -182 60 156 -121 74 94 -129 -77 385 -25 -201 124 -34 179 -38 193 -78 -59 -60 68
7278 68 194 -24 15 -71 -72 92 -10 -26 -108 190 -3 160 78 -109 34 -24 88 4 17 15 -3 -8 143 -160 -127 -118
7304 -118 133 88 -7 -88 -112 -97 257 55 -65 -49 207 55 154 125 193 183 130 37 42 230 -175 -104 -247 -39 52
7329 52 -22 -166 -99 -133 20 8 -95 61 144 -100 -140 111 -174 228 294 64 86 -46 46 101 39 -79 121 -34
7353 -34 -131 48 -119 -10 99 -145 79 -154 180 -3 -68 93 -108 104 375 -106 -88 -48 -94 -184 -98 -51 20
7376 20 18 237 -281 178 -79 75 99 -313 -161 -38 90 -36 77 152 -163 -36 -76 -98 113 80 151 -31 38
$$ packed form
7209A18J7r3Rj7k4j58L62k44Q2J17l43J32J07k25O1L85l14o6r3L05k68o2K84j90
7233a18K07J33j05k56J64P2n0j51K51k68K20J07j47p6J65j18K15l84J39K3jKN7
7256H1k77L34l20K42R6k77J95K0k23N2M62m10j76L25j58K13k17K31k71J9jJ28
7278F8J26k18L9q6jJ64j02j6q2K98j93J63q2j87J43n8J12q4J3kj8nJ51l03L3R
7304a18K51m5r5q1k4J5L54k02j20J6K56j52R9k9O8j0n3r3NJ88m05P1j43K08R1
7329E2p4j44O7l4J53j2j03J56Q3k44m0K51k85M02O6k30K2j32R2N5o2j18K00j55
7353c4r7J79j67J09J09k44K24k33L34j83o5J61k01K12K71m81J8M0m6r0Q6M7P1
7376B0kK19n18M59k57J54K4m12J52J23J28j26J13P5l15J27m0k2K11l3P1j82O9
$$ plain form
7399 38 -54 -157 45 -121 -44 154 188 -29 -22 -56 87 -103 -11 155 4 7 -9 36 18 4 -78 324 259 -134 -33
7424 -33 -60 242 -21 27 -222 84 -44 -30 229 278 28 -22 136 -5 113 42 -66 240 245 -191 39 -95 29
7447 29 -1 -245 -32 132 98 -220 -108 88 222 83 -174 98 -32 -101 89 -192 70 163 -132 84 133 10
7469 10 84 -200 150 3 10 130 5 371 217 -7 -33 88 -84 79 8 226 -37 -131 115 83 -104 133 -88
7492 -88 -128 125 -171 68 -133 182 32 -205 112 222 -64 75 73 34 -25 -4 -209 235 -24 -267 -29 87
7514 87 6 209 -159 -65 12 62 96 -57 -105 118 -100 150 -221 -39 50 311 2 63 288 -42 -167 -240 3
7537 3 -6 -23 155 -210 89 -90 -270 -232 -181 57 -140 54 -175 82 276 -33 -190 62 -173 69 64 2 -174
7560 -174 -40 -30 37 102 86 56 227 75 69 105 64 29 27 -167 130 18 -194 54 77 -13 -65 -167 97 156 -57
$$ packed form
7399C8r2j03K02j66P7J98L4k17Pl4J43j90R2J66j51Lj6M5j8j4q2M02o5l93J01
7424c3k7L02k63M8k49L06j28J4K59M9k50n0J58j41J18p1j08L06Nm36K30j34J24
7447B9l0k44K13J64l4l18J12J96J34j39k57K72j30o9J90k81K62R3k95K16M9j23
7469A0P4k84L50j47PJ20j25L66j54k24k6J21j72J63p1K18k63r4K46l2j87K37k21
7492h8m0K53k96K39k01L15j50k37L17J10k86J39kl9n9K1k05M44k59k43K38J16
7514H7q1K03l68R4P7N0L4j53m8K23k18K50l71J82Q9K61l09O1K25l30j25p3K43
7537Crj7J78l65K99j79j80L8N1K38j97J94k29K57J94l09j57K52k35K42no2j76
7560a74J34J0O7O5j6l0J71j52oL6m1l5kj94K97j12k12K48K3r0n2j02K64N9k13
$$ plain form
7585 -57 61 -44 111 -72 206 -234 -86 148 -57 -44 139 -86 -12 228 113 66 4 -86 83 -93 -124 4
7607 4 145 -141 12 -182 174 -27 -142 -94 118 227 47 174 -61 196 187 -298 45 -82 261 119 87 21
7629 21 147 6 70 144 97 -39 -42 191 -57 -104 -16 -98 -38 140 -80 2 18 84 -68 -181 -46 -63 309 63 9
7654 9 144 -41 57 49 119 86 94 242 -109 -43 -156 65 205 -211 -30 112 -38 104 -226 -269 140 154 54 -94
7678 -94 50 55 -112 -36 -117 83 -178 -226 -141 23 116 162 137 -79 102 59 90 106 159 111 -62 39 -330 -13 -77
7703 -77 -121 13 74 156 -119 -6 88 14 -16 121 17 169 191 -5 131 8 -175 69 15 -1 -90 -203 16 -92
7727 -92 -67 -68 -113 -111 -71 -22 61 240 104 67 -2 -29 -70 82 188 32 -176 80 -210 -192 135 92 198 71 76 90
7753 90 84 -112 75 73 -39 -168 -28 -48 254 -4 52 213 165 -13 -145 -90 89 13 361 34 116 -2 82 18
$$ packed form
7585e7J18j05J55j83K78m40J48K34k05J3J83k25P4K40j15m7o2r0J69j76l1J28
7607DJ41k86J53j94L56k01j15M8K12J09j80J27k35K57rm85L43j27L43j42l2o6
7629B1J26j41O4P4m7j36lK33k48m7Q8q2O0J78k20Q2J6O6j52j13J35j7L72k46n4
7654IJ35j85R8qP0l3QJ48l51O6j13K21J40m16J81J42j50J42l30m3M09J4j00j48
7678i4J44Nj67P6q1K00k61m8Q5J64R3M6k5k16J81m3L1J6N3m8j73J01l69L17o4
7703g7m4J34O1Q2k75J13R4p4l0J37j04J52K2j96J36j23j83K44n4j6q9j13K19j08
7727i2K5jm5KM0M9Q3J79j36l7o9k7m1J52J06j56k08K56k90J8L27m3J06j27NJ4
7753I0oj96J87kj12j29J40k0L02k58N6J61m8j78j32N5J79p6L48l27Q2j18Q4o4
$$ plain form
7777 18 83 172 145 77 -39 -58 -45 215 30 103 186 92 50 10 -23 76 -36 54 -6 -65 -73 41 33 -259 43 279 60
7804 60 135 -17 33 -135 114 126 -277 52 -145 0 16 75 117 -38 340 203 -131 63 -183 -92 217 -261 222
7827 222 137 -7 24 149 -33 21 -84 -90 -75 -42 140 -55 56 -47 80 91 211 83 -105 -106 -40 -75 137 -35
7851 -35 84 110 49 269 -139 -41 23 69 -14 -216 2 -47 73 -11 182 -128 94 -228 -122 100 133 -196 16
7874 16 190 -55 25 -16 74 170 9 72 171 -143 -3 -4 -28 56 4 132 -67 149 -27 -131 -32 143 132 -116 -193
7899 -193 98 48 -124 -17 -50 327 -95 -21 10 -308 -110 136 119 -82 -362 -38 -203 103 -16 64 271 48
7921 48 213 -150 164 166 -47 44 -66 -93 -48 157 -66 -106 183 70 -73 -167 -14 -71 107 45 231 -12 134
7944 134 58 237 85 189 277 137 -39 78 290 135 -241 -6 18 144 -111 134 334 -94 -70 205 -31
$$ packed form
7777A8O5Q9k7o8j16j9J3K60j85P3Q3r4m2m0l3R9j12R0o0n9qJ14qk92L02K36k19
7804F0P5j52N0j68K49J2m03L29j97J45J6N9M2j55L78j37l34J94k46R1L09m78M83
7827B22q5j44L1J25j82N4j05oJ5L3J82j95J11j03J27J1J20j28j88jO6l5K12j72
7851c5J19K6o1K20m08R8O4M6q3k02K18m9J20q4J93l10K22l22J06K22L3l29K12
7874A6J74k45Q0m1R0R6j61O3R9l14J40jk4Q4n2J28j99K16j76j04R9J75j1k48p7
7899a93K91n0j72J07l3L77m22P4L1l18J98K46j7k01k80L24j65L06j19Q0K07k23
7921D8J65l63L14Kk13R1j10k7M5K05k23m0K89j13j43r4J53n7J78o2J86k43J46
7944A34p6J79j52J04Q8j40j76J17K12j55l76K35K4J26k55K45K00m28K4K75k36
$$ plain form
7965 -31 -163 152 -72 88 -94 162 -60 28 110 54 49 108 -77 138 -136 -83 59 -175 93 92 396 231 -97
7988 -97 -214 3 155 71 120 188 -49 -46 -18 27 167 44 119 138 161 40 80 81 -292 87 -87 -228 -37 -113 -213
8013 -213 -380 -220 80 43 47 -76 16 2 -161 -99 -98 -135 20 398 65 -5 -190 4 -171 -209 39 7 275 96
8037 96 -17 -34 130 3 -2 241 -64 -4 11 55 65 -69 -182 -258 -392 -231 85 -349 53 110 51 36 30 247 112
8062 112 177 -160 214 -68 -64 -49 19 -114 -80 52 43 -204 105 6 29 37 -7 -31 25 32 37 104 36 -3 -120 73 118 115
8090 115 164 99 97 44 159 -132 -82 -12 100 54 201 -126 -182 -22 194 140 -111 -68 26 114 33 -19 138 61 -127
8115 -127 -50 -56 268 236 81 -135 -130 -11 -30 67 -189 -195 100 -148 129 25 -31 64 132 15 -64 -85 26 -95 -86 -45
8141 -45 48 4 72 114 52 37 -180 146 -72 107 74 -311 55 -167 -76 -220 196 -265 -133 134 -7 -157 -88
$$ packed form
7965c1j32L15k24J60j82K56k22Q8Q2n6nN9j85K15k74N3J42k34K68jL04j65l28
7988i7j17K17J52q4M9O8k37LK8M5J40j23P5J9K3j21M0Jl73L79j74j41J91p6j00
8013b13j67J60L00l7Mj23R2j4j63O2Jl7J55L78l33p0j85J94j75l8K48l2K68j79
8037I6j13j7J64j27nK43l05O0J5M4J0j34j13p6j34J61L16m34M02N7n9j5oK17j35
8062A12O5l37L74k82MJ5O8j33L4J32rk47L09r9K3Qm4k4N6PNO7o8l9j17J93M5l
8090A15M9o5kn3J15k91N0P0J12m6J47l27n6J60K16n4k51M3R4Q8q1n2J57p7j88
8115a27P7oL24l2j55k16NJ19j9R7k56oK95k48K77j04n6R5O8j17p9k1J11j21RM1
8141d5R3m4O8M2o2j5k17L26k18J79l3l85L66k22R1j44M16m61J32K67j41j50O9
$$ plain form
8164 -88 -161 -206 374 87 4 -69 119 194 38 76 -54 39 56 39 -74 56 3 -55 158 -200 93 48 75 16 -15
8189 -15 -22 -97
$$ packed form
8164h8p3m5N80k87q3p3J88P5j56L8j30R3J7j7j13J30n3n8K13l58K93m5K7n9l1
8189a5pp5
8191i7
$$ Imaginary data points
##PAGE= N=2
##DATA TABLE= (X++(I..I)), XYDATA
$$ plain form
0 0 0 0 0 0 0 0 8 0 0 -8 8 -8 8 -16 16 -16 24 -28 32 -40 48 -57 68 -81 95 -109 127 -146 168 -193 217 -247
32 -247 278 -316 357 -397 446 -497 554 -618 685 -758 841 -929 1023 -1129 1246 -1370 1509
49 1509 -1660 1831 -2016 2221 -2455 2717 -3016 3359 -3758 4230 -4794 5487 -6357 7485 -9015
64 -9015 11198 -14555 20312 -32047 65189 -353359 -1096564 196613 1001357 -12625 -632091
75 -632091 70252 296627 74615 78900 -27925 -258255 -53746 374175 124357 -375811
85 -375811 -49968 313599 116819 -84695 -50555 70255 86397 73132 21736 -140569 16464
96 16464 207480 16236 -115206 -15386 116922 79982 -36121 34921 2536 -72193 85039
107 85039 154764 -16879 -210487 -28026 320299 80672 -288299 -71272 245276 92468
$$ packed form
0@%%%%%%Qq%qJ6j6J6k4L2l2M0n2O0p2Q8j05J25j49J76k04K36k73L14l61M10m64
32b47N25n94O73p54Q43r43J051j172J303j443J599j770J952k152K375k616K879
49A509l169L491l847M237m676N172n733O375p117P988r024J0281j1844J3842j6500
64i015K0213k5753L4867n2359R7236m18548p43205J293177Q04744j013982o19466
75f32091P02343K26375k22012M285j06825k30330K04509M27921k49818n00168
85c75811L25843L63567j96780k01514L4140J20810J6142j3265n1396j62305J57033
96A6464J91016j91244j31442R9820J32308l6940j16103P1042l2385p4729J57232
107H5039O9725j71643j93608J82461L48325k39627l68971K17027L16548j52808
$$ plain form
117 92468 -191686 -4224 160814 -138991 -94475 237297 49858 -282904 -65857 298982
127 298982 44406 -279328 13308 167608 -58484 -61261 63445 3503 -91377 32446 96466
138 96466 -80796 -37983 72645 -46617 -30370 83855 3977 -121964 -5867 162735 -30499
149 -30499 -168296 51648 112910 -35313 -85421 -13198 52382 14473 -8840 -50279 -66137
160 -66137 81018 82479 -83974 -89086 32904 107631 9066 -95637 -31314 48268 73959 -8033
172 -8033 -94757 7922 63547 -5044 -19044 3647 165 -35261 15564 73189 -38672 -69074
184 -69074 29753 40853 3384 -25207 -22234 -4866 17502 45019 -34665 -62119 50016 42364
196 42364 -38391 -22041 33037 21884 -35675 4900 39089 -18610 -7625 13557 -4968 4504
$$ packed form
117I2468k84154J87462J65038k99805M4516L31772j87439l32762K17047L64839
127B98982k54576l23734K92636J54300k26092k777J24706n9942r4880J23823O4020
138I6466j77262M2813J10628j19262J6247J14225p9878j25941J16097J68602j93234
149c0499j37797K19944O1262j48223n0108P2223O5580l7909k3313m1439j5858
160f6137J47155J461j66453n112J21990P4727r8565j04703O4323P9582K5691q1992
172h033q6724J02679N5625o8591j4000K2691l482l5426N0825N7625j11861l0402
184f9074R8827J1100l7469k8591K973J7368K2368K7517p9684k7454J12135p652
196D2364q0755J6350N5078j1153n7559M0575L4189n7699J0985K1182j8525R472
$$ plain form
208 4504 2492 -2668 -8995 3640 11495 -26967 5321 35970 -31205 -31711 26645 29821 -18315 -34543
222 -34543 14813 11576 -2675 18766 -24158 -29484 35747 33472 -25633 -36501 31379 31983 -33740
235 -33740 -567 26663 -13757 -11403 11444 11144 -13367 -7486 14046 -16216 -5265 24613 -11047
248 -11047 -21744 1712 16057 4228 -17720 100 1698 -3836 16658 -1465 -13558 -754
260 -754 7211 18047 -5396 -18119 5896 16580 9426 -20628 -10230 30706 -130 -24085 2670
273 2670 13672 488 -15989 860 4688 -11598 12888 1843 -28334 5194 25440 -3937
285 -3937 -29273 4785 33137 -15622 -19304 24054 5122 -15189 2628 16007 -1585 -15197
297 -15197 13276 7354 -15242 9534 6440 -13157 -2295 10616 3912 -19341 -3134 19205 -8360
$$ packed form
208D504k012n160o327J2635P855l8462L2288L0649o7175n06N8356L176m8136j6228
222c4543M9356l237j4251K1441m2924n326O5231k275n9105j0868O7880O04o5723
235c3740L3173K7230m0420K354K2847l00k4511N881K1532l0262J0951K9878l5660
248a1047j0697K3456J4345j1829k1948J7820J598n534K0494j8123j2093J2804
260g54P965J0836k3443j2723K4015J0684p154l0054J0398M0936l0836k3955K6755
273B670J1002j3184j6477J6849L828j6286K4486j1045l0177L3528K0246k9377
285c937k5336L4058K8352m8759l682M3358j8932k0311J7817J3379j7592j3612
297a5197K8473n922k2596K4776l094j9597J0862J2911o704k3253J6207K2339k7565
$$ plain form
310 -8360 -13523 2458 5782 2840 -11396 -2374 9726 -51 -1479 -3829 3028 7547 -4191 3441
324 3441 1578 -5464 8841 5074 -7120 -5085 8362 9932 -15109 -5982 16310 -4567 -11614 4130
338 4130 4588 -7606 -6380 10986 -3231 -16130 11614 8696 -14296 -4131 12399 4155 -12660
351 -12660 2647 12889 -7624 -1373 10330 -3217 -3984 6917 6155 -8859 -4747 13288 -975
364 -975 -10822 2585 2151 -1567 -1697 -1769 -2234 -2657 4886 -1212 -8324 3317 1647 -2204 2241 -893
380 -893 -1200 1136 4589 875 -5217 5846 4429 -4728 4579 3216 -4106 -825 6050 1837 -10893
395 -10893 487 9732 -6589 -6387 3423 -328 -3291 -258 2758 -6134 -4014 10136 -1426 -8545
409 -8545 4722 3794 -3498 -643 6761 499 -7951 6109 8635 -4376 -152 1289 -1364 3582 5834
$$ packed form
310h360n163J5981L324k942j4236R022J2100r777j428k350O857M519j1738P632
324C441j863p042J4305l767j2194K035J3447J570k5041R127K2292k0877p047J5744
338D130M58j2194J226J7366j4217j2899K7744k918k2992J0165J6530q244j6815
351a2660J5307J0242k0513O251J1703j3547p67J0901p62j5014M112J8035j4263
364i75r847J3407m34l718j30p2m65m23P543o098p112J1641j670l851M445l134
380h93l07K336L453l714o092J1063j417r157R307j363p322L281O875m213j2730
395a0893J1380R245j6321K02R810l751k963L033L016q892K120J4150j1562p119
409h545J3267r28p292K855P404o262q450J4060K526j3011M224J441k653M946K252
$$ plain form
424 5834 -2708 -12478 2725 14588 -6093 -12650 -441 4190 3274 -3017 -6257 -4224 4251 10260
438 10260 -6265 -11240 6302 8734 984 -5547 -5220 4487 8741 4157 -11369 -9941 16880 14025
452 14025 -12803 -13997 5565 15487 1384 -10673 -7885 -2098 12032 8943 -15440 -16211 6342
465 6342 16096 126 -15751 -6149 6179 10001 5320 -9850 -8239 7819 10613 852 -5939 -2357
479 -2357 946 3423 9166 -2290 -13576 1494 13739 2124 -12460 -5048 8386 3406 -3628
492 -3628 -4104 -3998 2583 4687 -2781 -8251 -2998 7690 5708 -5313 -8893 -531 13919 9744 -11824
507 -11824 -13565 8656 19816 963 -16982 -6718 8519 12653 4532 -14049 -17036 7131 24534
520 24534 2065 -27959 -12712 20217 17208 -9652 -20019 -3556 13885 10823 -5731 -15805
$$ packed form
424E834q542r770J5203J1863k0681o557J2209M631r16o291l240K033Q475O009
438A0260j6525m975J7542K432p750o531L27R707M254m584j5526J428K6821k855
452A4025k6828j194J9562R922j4103j2057K788N787J4130l089k4383p71K2553
465F342R754j5970j5877R602J2328L822m681j5170J611J6058K794r761o791L582
479b357L303K477N743j1456j1286J5070J2245j1615j4584P412J3434m980p034
492c628m76J06O581K104p468n470N253J0688j982j1021l580Q362J4450m175k1568
507a1824j741K2221J1160j8853j7945J0264J5237M134q121j8581k987K4167J7403
520B4534k2469l0024J5247L2929l009k6860j0367J6463J7441l062j6554j0074
$$ plain form
532 -15805 -3490 13379 8355 -4452 -8742 -2112 10520 10528 -4201 -13092 2454 18200 145 -18223
546 -18223 -1602 15431 3395 -14846 -7089 9125 5414 -3467 -6003 -5630 1914 8273 3730 -9185
560 -9185 -11670 5865 14267 419 -12423 -7305 8943 10435 -1949 -4846 -1324 1051 3532 6906
574 6906 4108 -10061 -10374 10434 15246 -4920 -17260 -3828 12371 5068 -7603 -6685 -1583 2119
588 2119 2766 2576 -652 -8072 -3330 9923 8346 -6938 -11238 5834 12133 -4696 -8072 5680
602 5680 7090 -5109 -6181 6124 7312 -3341 -5395 -1926 2252 5810 1342 -8323 -10392 3434
616 3434 12833 237 -13307 -9347 5660 13820 2323 -13078 -9706 9015 14701 -891 -10912
629 -10912 -2499 4860 5208 4591 -1389 -8470 -3599 11012 8160 -8323 -8435 4422 5958 -2230 -3490
$$ packed form
532a5805J2315J6869n024j2807m290O630J2632Qj4729q891J5546J5746j8055j8368
546a8223J6621J7033j2036j8241P757J6214l711q881k536L73P544O359m543j2915
560i185k485J7535Q402j3848j2842N118J6248J492j2384k897L522K375K481L374
574F906k798j4169l13K0808M812k0166j2340J3432J6199p303j2671R18N102L702
588B119O47j90l228p420M742J3253j577j5284m300J7072O299j6829l376J3752
602E680J410j2199j072J2305J188j0653k054L469M178L558m468r665k069J3826
616C434R399j2596j3544L960J5007Q160j1497j5401L372J8721N686j5592j0021
629a0912Q413P359L48o17n980p081M871J4611k852j6483j12J2857J536q188j260
$$ plain form
644 -3490 1279 -577 -4219 -341 3509 905 -4999 -4849 1966 5575 604 -4444 -2287 2894 3064 941
660 941 1261 -11 -2350 -1370 4641 5865 -2499 -8237 -1071 8658 5245 -6958 -7866 1358 5578 2273
676 2273 -2907 -4795 -4183 1934 7486 447 -9288 -4598 5611 5534 -897 -2770 -1772 -770 4970 6788
692 6788 -2698 -6371 1294 6707 2505 -2520 -1862 -1370 869 3596 -147 -3848 -654 563 -1708 40
708 40 3460 -1817 -8349 486 8171 79 -6543 -1916 3162 1583 363 2297 -1017 -4171 1690 6290
724 6290 2984 -3618 -4773 1719 6177 3451 -4097 -6506 1107 5116 1553 -2954 -4863 -2325 2160
739 2160 3941 -438 -5593 -3312 2793 3710 969 -3132 -3453 1394 4370 1808 -1916 -1581 935 1533
755 1533 2376 1571 -2038 -1591 2086 1619 -290 565 -324 -3772 -2108 4678 2181 -5713 -4720 1941 2824
$$ packed form
644c490M769j856l642L878L850k604n904J50O815L609m971n048K157N181J70k123
660I41L20j272k339R80O011J224q364n738P166R729l413j2203r08R224M220l305
676B273n180j888O12O117N552p039r735M690J0209p7o431j873R98J002N740J818
692F788r486l673P665N413m202n025O58M92K239K727l743l701L194J217k271J748
708D0L420n277o532Q835P685q092o622M627N078j579j220J934l314l154N861M600
724F290l306o602j155O492M458k726p548k409P613M009l563m507j909K538M485
739B160J781m379n155K281O105R17k741m101l21M847K976k562l724L35K516N98
755A533Q43q05l609M47L677m67j909Q55q89l448J664O786k497p894R93O661Q83
$$ plain form
772 2824 38 -1833 -2750 -1574 2899 3580 -1366 -3522 53 2270 2139 1405 -971 -2743 679 4995
788 4995 1745 -3121 -1201 1498 723 236 610 -1647 -2633 50 1813 59 -1970 -1926 -1141 929 1744
805 1744 -776 -2777 -814 1965 2072 -221 -811 -329 773 2341 1593 -566 -641 394 883 1659 524
822 524 -1614 -1482 1135 1529 -1020 -1629 -578 -598 398 54 -1406 -1546 411 913 -962 -718 1054 -181
840 -181 -1403 1153 1879 207 -758 740 1431 665 854 248 -1077 417 1435 -185 -1241 -306 208
857 208 -354 -630 232 -1322 -1313 657 146 -1115 -705 -263 -90 106 653 -257 -885 1069 1100 455 536 301
877 301 145 875 1093 175 -998 680 848 -529 -810 -633 -432 380 -310 -1444 -1258 378 488 -1202
895 -1202 -1329 501 325 -117 -98 -311 -43 545 927 -237 -302 1502 916 -98 578 777 156 241 560 -135
$$ packed form
772B824k786j871r17J176M473O81m946k156L575K217j31p34k376j772L422M316
788D995l250m866J920K699p75m87L74k257r86K683J763j754k029M4P85K070Q15
805A744k520k001J963K779J07k293n90M82J102J568p48k159p5J035M89P76j135
822E24k138J32K617L94k549o09J051k0R96l44j460j40J957N02j875K44J772j235
840a81j222K556P26j672r65J498O91p66J89o06j325J494J018j620j056R35N14
857B08n62k76Q62j554RJ970n11j261M10M42J73J96N47r10o28J954L1o45Q1k35
877C01j56P30K18r18j173J678J68j377k81J77K01Q12o90j134J86J636J10j690
895a202j27J830j76m42J9k13K68N88L82j164o5J804n86j014O76J99o21Q5L19o95
$$ plain form
915 -135 -768 253 972 -981 -1181 325 -319 -360 -683 -760 -465 365 267 -1293 -472 1538 244 -1203 284
934 284 940 327 53 523 338 -79 945 754 -556 329 1105 -601 -581 199 678 -861 -1202 -190 -143
953 -143 -523 -425 -863 -546 438 -51 -420 -211 577 239 346 705 -49 -346 1494 1456 -606 -441 1207 601
973 601 -598 70 1084 -683 -629 803 249 -696 -786 -144 140 -474 -913 -1631 160 1654 -912 -1898 587
992 587 1170 101 2 188 93 546 2270 797 -1862 66 2788 1020 -1633 -1027 945 705 -165 -454
1010 -454 -1258 -605 922 136 -1168 -1430 -307 1207 868 -1600 -2159 539 2992 -109 -3158 308 3358
1027 3358 938 -2035 -34 1923 1229 538 181 -851 -24 1590 631 -1524 -1266 635 968 -324 -1638
1044 -1638 -1710 643 1831 -500 -2623 -261 1011 470 -168 -200 -560 -646 2079 2056 -1607 -2143 1781 3041
$$ packed form
915a35o33J021P19j953k00J506o44m1l23p7K95Q30r8j560Q21K010j294j447J487
934B84O56o13k74M70j85m17J024j91j310Q85P76j706K0P80M79j539l41J012M7
953a43l80R8m38L17R84m89l69K09P88l38J07L59p54k97J840l8k062J65J648o06
973F01j199O68J014j767N4J432n54r45r0O42K84o14m39p18J791J494k566r86K485
992E87N83j069r9J86r5M53J724j473k659J928K722j768k653O06J972k40q70k89
1010d54q04O53J527p86j304k62J123J514l39k468n59K698K453l101l049L466L050
1027C358k420k973K001J957o94o91l57j032Q27J614r59k155K58J901L33j292j314
1044a638p2K353J188k331k123K362J272n41o38l2l60q6K725k3l663n36L924J260
$$ plain form
1062 3041 536 -1679 -859 1213 2034 792 -1965 -1217 708 906 76 -1120 -2029 -765 1569 1308 -2516
1079 -2516 -2407 1693 2328 -1608 -1713 1238 1576 -137 -911 684 821 792 394 -454 -269 570 1324 636
1097 636 -741 -1576 512 2602 949 -3702 -3261 3110 3474 -2616 -4525 -252 2540 806 -1177 -1802
1113 -1802 -1493 896 3142 643 -2633 -1746 2378 3449 162 -2706 -658 2203 1868 -664 -661 293 -390
1130 -390 -343 1162 532 -2175 -1610 1558 1102 -2350 -1556 1111 689 -1636 -1336 1440 1181 -1235 -1596 1132
1148 1132 2337 669 -1469 -193 1241 699 784 599 -1295 -1978 1563 4358 -785 -5060 -796 4044
1164 4044 1972 -2775 -2825 178 1121 675 149 -1783 -2216 506 2877 1180 -2456 -2458 1604 3331 479
1181 479 -2575 -1012 2024 1413 -69 57 480 -338 57 862 456 -937 -856 58 6 -628 -320 326 -807
$$ packed form
1062C041k505k215Q20K072Q21j242k757P48J925J98q30j196r09J264K334k61l824
1079b516J09M100O35l936j05K951L38j713p74J595J37k9l98q48J85Q39P54o88
1097F36j377q35K088K090j653m651M41O371L64o090j909M273K792j734j983o25
1113a802L09K389K246k499l276Q87M124J071l287k868K048K861l35k532LR54o83
1130c90M7J505o30k707N65L168m56l452P94K667m22k325L00K776k59k416l61K728
1148A132J205j668k138J276J434n42Q5j85j894o83L541K795n143m275M264M840
1164D044k072m747n0L003R43m46n26j932m33K722K371j697l636kM062J727k852
1181D79l054J563L036o11j482J26M23q18L95Q05m06j393Q1R14n2o34L08O46j133
$$ plain form
1200 -807 -2074 -96 2153 238 -2560 -1513 1764 2149 -332 -1570 -333 642 1317 1391 -314 -1767
1216 -1767 -792 2832 2566 -1345 -2732 -229 2645 1313 -1598 -2254 -347 1340 708 -744 -1161 -1122 -260
1233 -260 1329 788 -1572 -1665 601 1859 323 -883 -155 636 626 711 743 -24 -525 -133 1603 785 -761
1252 -761 -964 -365 601 59 0 -468 -1549 -580 988 873 -554 -1752 -597 1075 1095 -202 -1093 -668
1270 -668 1100 1557 487 -714 -901 654 1574 1116 -424 -1376 67 1782 964 -1042 -1161 -323 538
1287 538 638 51 -960 -1146 -16 1078 -2 -1110 -1052 -37 524 591 196 -995 -342 924 894 426
1305 426 -182 -256 -197 920 1232 -47 -835 -344 1070 740 81 -631 -1116 -243 588 495 -716 -1476 -311
1324 -311 452 697 -271 -1167 -342 581 886 92 -518 -89 370 1029 764 -25 -880 177 1086 889 -212
$$ packed form
1200h07j267J978K249j915k798J047L277L85k481j238J237R75O75P4j705j453
1216a767R75L624k66l911j387K503K874j332k911o56J907J687o32j452m17L9Q62
1233b60J589n41k360r3K266J258j536j206P28P91j0Q5L2p67n01L92J736q18j546
1252g61k03N99R66n42n9m68j081R69J568j15j427j198J155J672K0j297q91M25
1270f68J768M57j070j201j87J555R20m58j540r52J443J715q18k006j19Q38Q61
1287E38J00n87j011j86J130J094j080j108N8J015N61O7l95j191O53J266l0m68
1305D26o08p4N9J117L12j279p88M91J414l30o59p12m85Q73Q31r3j211p60J165
1324c11P63K45r68q96Q25R23L05p94o10M29M59O59k65p89q55J057R09j97j101
$$ plain form
1343 -212 -590 -255 -32 691 110 -744 -882 26 339 261 -524 -867 -603 -89 660 -289 -540 -223 176 757
1363 757 430 123 -504 -238 1004 902 -328 -233 269 359 596 267 -322 -492 -90 540 140 -626 -575 -384
1383 -384 -54 62 -489 -475 -510 395 500 -223 -190 1 28 491 159 -167 -87 218 710 117 -36 169 -159 11
1405 11 88 -44 -399 -174 -21 -63 -65 -94 -146 -274 -136 -265 -93 168 76 -134 -107 -23 547 83 58 344 287 411
1429 411 -31 -125 178 430 505 -68 -474 142 472 132 -210 -619 -244 172 -52 -378 -630 -346 105 61 -299
1450 -299 -148 -207 492 437 52 -266 -179 1062 447 -240 -2 394 634 421 -243 -167 -105 497 205 -790 -415
1471 -415 -8 198 254 -761 -842 190 350 -219 -823 -469 303 479 -189 -332 -62 422 659 37 -202 -21
1491 -21 827 748 -183 -400 94 496 526 -378 -496 -315 468 496 -931 -793 3 637 174 -772 -731 243 680
$$ packed form
1343b12l78L35K23P23n81q54j38R08L13p8p85l43K64N14P49r49k51L17L99N81
1363G57l27l07o27K66J242j02j230R5N02R0K37l29n89j70M02O30m00p66N1J91
1383c84L30J16n51J4l5R05J05p23L3J91K7M63l32l26Q0L05M92n93j53K05l28J70
1405A1P7j32l55K25J53m2kk9n2j28J38j29J72K61r2k10K7Q4N70m64k5K86n7J24
1429D11m42r4L03K52P5n73m06O16L30l40l42m09L75M16k24l26k52K84M51m4l60
1450b99J51n9O99n5l85l18Q7J241o15o87K38L96K40k13o64P6O2O02k92r95L75
1471d15M07K06N6j015q1J032J60n69o04L54P72J76o68j43K70M84K37o22k39J81
1491b1Q48p9r31k17M94M02L0r04j18J81P83K8j427J38P96O34m63r46M1R74M37
$$ plain form
1512 680 214 -1081 -827 851 1046 -98 -431 42 790 730 179 -550 -375 537 1073 136 -650 -300 207
1531 207 737 -262 -912 -570 489 780 -639 -1477 -315 450 555 -285 -845 -81 1004 579 -447 -791
1549 -791 709 1331 584 -296 -691 260 980 478 -486 -744 280 1107 -108 -932 -646 -1 725 218 -1141
1568 -1141 -900 131 738 -130 -1054 -430 567 625 60 -760 79 1063 807 -238 -645 390 1270 455 -616
1587 -616 -458 84 1097 349 -887 -1099 204 1349 357 -1633 -1094 539 1154 163 -1215 -1213 278 1126
1605 1126 424 -937 -910 486 955 612 -618 -403 283 1190 925 -621 -826 379 1012 41 -658 -459
1623 -459 440 664 -371 -669 -498 361 219 -312 -349 -194 355 186 -636 -809 610 1026 144 -876 -294
1642 -294 1093 912 -316 -820 -169 803 1121 462 -855 -1209 667 1554 201 -1557 -1459 920 1403 -266
$$ packed form
1512F80m66j295K54J678J95j144l33M73P48o0n51p29J75R12N36r37p86L50N07
1531B07N30r99o50L42J059K91j419q38J162P65J05q40n60P64J085m25j026l44
1549g91J500O22p47q80l95R51P20n02r64k58J024Q27j215q24K86O45P26n07j359
1568a141K41J031O07q68r24O24R97N8n65q20Q39R84k56j045m07J035Q80q15j071
1587f16J58N42J013p48j236k12J303J145r92j990N39J633O15r91j378KJ491Q48
1605A126p02j361K7J396M69l43j230K15O86R07k65j546k05J205O33r71o99J99
1623d59Q99K24j035k98J71Q59j42n31l7J55N49j69q22j73J419M16q82j020N82
1642b94J387j81j228n04O51R72L18o59j317l54J876Q87j353j758R8K379M83j669
$$ plain form
1660 -266 -1547 -628 683 988 -332 -554 -736 -71 762 684 -375 -748 103 1309 693 -721 -116 656
1678 656 643 -184 -212 191 -122 -379 -106 444 -100 -514 -543 -121 150 -198 178 -554 -1248 -553 953 1139 -661
1699 -661 -1439 74 1223 844 -718 -823 8 1208 845 256 -1056 -597 906 1394 69 -1684 -733
1716 -733 967 1311 -531 -1194 -568 440 395 -268 -200 -789 -150 477 674 -203 -993 24 834 705 -140
1735 -140 -315 20 253 140 624 183 -334 -547 318 692 478 -840 -585 -142 423 249 -212 -646 -765 67
1755 67 669 245 -940 -698 -50 1262 363 -647 -615 204 1083 754 -196 -596 -158 626 868 -169 -973
1774 -973 -563 669 688 -116 -707 -815 80 334 19 -553 -738 -384 81 290 -95 -531 -344 250 810 145
1794 145 -118 -290 21 337 206 336 -430 -415 212 875 78 -498 -515 -63 720 145 -485 -871 -428 313 589
$$ packed form
1660b66j281R19J311L05j320k22j82O65Q33p8j059l73Q51J206o16j414O05P72
1678F56j3q27k8M03l13k57K73N50n44m14k9M22K71l48L76p32o94O95J506J86j800
1699f61p78J513J149l79j562j05Q31J200l63n89j312M59J503M88j325j753R51
1716g33J700L44j842o63O26J008m5o63O8n89O39O27J97q77p90J017Q10j29q45
1735a40j75L35K33j13M84m41n17k13Q65L74k14j318K55M43N65j74m61m34j19Q32
1755F7O02m24j185K42O48J312q99j010L2Q19Q79l29r50m00M38P84K42j037q04
1774i73M10J232J9q04n91j08Q95K54l15n72j85L54M65K09l85m36J87N94N60o65
1794A45k63j72L11L16j31J30p66J5O27O63p97n76j7M52P83n75o30l86M43P41K76
$$ plain form
1815 589 -218 -726 -794 213 634 154 -597 -576 216 794 325 -209 -472 -24 366 674 200 -251 -190 637 628
1836 628 275 -358 -560 -7 494 -121 -211 -522 -429 289 427 45 -409 -526 193 579 161 -196 -384 95 646
1857 646 442 105 -190 -53 488 674 29 -363 -363 157 646 233 -185 -518 -119 213 154 -198 -566 -324 212
1878 212 69 30 -268 -416 7 157 323 129 -258 -30 420 883 431 -562 108 280 203 424 -165 -355 18
1899 18 290 239 -17 -668 -50 -165 111 -262 -446 -363 2 134 107 -257 -335 -1 219 226 93 -75 15 291 539
1922 539 232 -341 -80 201 117 167 59 -268 -232 -27 376 -122 -244 -558 -26 -13 -220 -235 -117 -46 190 34
1944 34 -48 -102 90 413 292 9 -229 197 286 63 -205 -124 133 -74 142 -370 87 135 -22 -100 -253 -33
1966 -33 -234 -259 -176 -164 -13 293 -307 -126 287 333 455 105 -342 200 280 173 -160 -6 -19 162 120 376 -258
$$ packed form
1815E89q07n08o8J007M21m80p51K1P92N78m69n34k63M48L90L08m74m51O1Q27r
1836F28l53o33k02N53N01o15r0l11R3P18J38l82m54j17P19L86m18l57j88M79N51
1857F46k04l37k95J37N41J86o45l92%N20M89m13m18l33L99L32n9l52l68K42N36
1878B12j43l9k98j48M23J50J66j94l87K28M50M63m52r93O70J72p7K21n89j90L73
1899A8K72n1k56o51O18j15K76l73j84Q3L65J32k7l64p8L34K20Pj33j68R0K76K48
1922E39l07n73K61K81q4N0j08l27L6K05M03m98j22l14N32J3k07j5J18P1K36j56
1944C4q2n4J92L23j21k83k38M26Q9k23k68Q1K57k07K16n12M57M8j57p8j53K20
1966c3k01k5Q3J2J51L06o00J81M13M6J22l50m47N42Q0j07l33J54j3J81m2K56o34
$$ plain form
1989 -258 -135 298 72 -162 -461 -120 137 -89 -163 -163 -36 157 106 -172 -170 -115 364 252 -321 -120 33 352
2011 352 231 -352 -21 130 542 149 -63 -418 358 300 -105 -368 -502 38 421 39 -641 -369 315 215
2031 215 -227 -264 -148 139 170 -102 -265 9 245 394 -86 -469 348 466 456 -184 -336 184 463 194 -345
2052 -345 -565 -55 376 8 -452 -508 74 234 -73 -413 -414 363 489 152 -302 -66 314 397 25 -337 -81
2073 -81 430 520 97 -204 -121 523 539 -119 -687 -346 301 240 -331 -381 -219 526 333 -245 -664 -189 287 282 15
2096 15 -396 -127 422 307 -197 -471 -47 781 222 -267 -72 285 416 88 -371 -161 270 420 45 -419
2116 -419 -215 243 365 -250 -484 47 252 444 -278 -382 -119 470 481 -266 -414 76 421 471 144 -3 -55
2137 -55 554 271 -196 -294 236 942 223 -298 -517 -62 183 114 -524 -495 101 516 90 -601 -179 249 273 -91
$$ packed form
1989b58J23M33k26k34k99L41K57k26p4%J27J93n1k78KN5M79j12n73K01J53L19
2011C52j21n83L31J51M12l93k12l55P76n8m05k63j34N40L83l82o80K72O84j00
2031B15m42l7J16K87L1k72j63K74K36J49m80l83Q17J18j0o40j52N20K79k69n39
2052c45k20N10M31l68m60n6N82J60l07l40jP77J26l37m54K36L80Q3l72l62K56
2073h1N11R0m23l01Q3O44J6o58n68L41O47o1n71n0J62P45j93n78m19M75M76nk67
2096A5m11K69N49j15n04k74M24Q28n59m89J95L57J31l28m59K10M31J50l75m64
2116d19K04M58J22o15k34N31K05J92p22j04K63N89J1p47j48M90L45N0l27j47n2
2137e5O09k83m67r8N30P06p19n21k19M55K45o9o38K9N96M15m26o91M22M28K4l64
$$ plain form
2159 -91 -467 -207 256 440 370 -332 28 214 539 145 -136 -288 170 637 -174 -359 -96 41 170 -130 -456
2180 -456 85 30 -29 -257 -201 -193 243 -68 -486 -222 133 451 68 -286 -217 650 346 -202 -370 -26 743 374
2202 374 -249 -576 -74 -14 643 -29 -688 -380 197 516 -172 -595 -368 223 374 -30 -212 -221 -159 350 132
2223 132 -94 -84 154 197 206 -199 -96 -59 286 123 24 -22 137 -296 -220 348 353 -42 -491 -308 176 130 -76 -284
2247 -284 22 132 170 368 -94 -478 -42 385 487 -414 -727 376 622 400 17 -221 -251 188 410 59
2267 59 -268 -546 413 674 104 -509 -502 27 349 -185 -162 -325 -105 280 79 115 -339 -300 58 242 444 -219
2289 -219 -96 -173 337 485 179 17 -297 147 313 15 -180 -506 39 221 294 -321 -389 -68 191 289 -14
2310 -14 -359 -574 157 279 349 -269 -489 84 464 351 86 -171 -31 -58 397 37 -362 -287 118 437 270
$$ packed form
2159i1l76K60M63J84p0p02L60J86L25l94k81j52M58M67q11j85K63J37J29l00l26
2180d56N41n5n9k28N6QM36l11m18K64L55L18l83l54O9Q67l04n48j68L44P69l69
2202C74o23l27N02O0O57o72o59L08N77L19o88m23K27N91J51m04j82rO2N09k18
2223A32k26J0K38M3Rm05J03L7L45j63r9m6J59m33P6N68Nl95m49J83M84m6k06k08
2247b84L06J10L8J98m62l84M36M27J02r01l13J103K46k22l83k38l0M39K22l51
2267E9l27k78R59K61n70o13PN29L22n34K3j63K20L85k01L6m54L9L58J84K02o63
2289b19J23p7N10J48l06j62l14M44J66k98j95l26N45J82P3o15o8L21K59R8l03
2310a4l45k15P31J22P0o18k20N73L80j13k65k57J40k7M55l60l99P5M05L19j67
$$ plain form
2331 270 -403 -195 -75 277 96 -177 -408 -476 237 304 -7 -241 -233 -19 253 433 -85 -148 31 304 435 -28
2353 -28 -583 13 181 316 271 -216 -375 112 421 50 -93 -529 -303 146 595 0 -518 -565 291 166 262
2374 262 63 -400 67 386 270 -93 -215 -291 212 173 192 -109 -289 95 131 49 -202 -272 -10 252 -44 59
2396 59 -388 -497 100 215 47 -225 -278 -53 464 212 99 -286 26 361 369 122 -91 57 94 202 243 -183
2418 -183 -325 114 289 171 -11 -318 -189 187 191 -46 -427 -357 57 125 293 -228 -387 -101 -17 87 -28 -197
2440 -197 60 291 299 225 -215 -201 62 285 209 19 -123 91 92 185 -131 -354 -322 -202 -111 84 -108 -422 -222
2463 -222 -8 -142 25 78 122 242 368 330 -42 -203 -31 281 449 -95 27 -70 5 305 -7 -416 25 -170
2485 -170 169 -64 -282 -191 42 295 66 -230 64 31 81 203 72 -100 76 125 55 60 -50 99 -6 34 64
$$ packed form
2331B70o73K08J20L52j81k73k31o8P13O7l11k34QK14K72J80n18o3J79K73J31m63
2353b8n55N96J68J35m5m87j59M87L09l71j43m36K26M49M49n95n18m7Q56j25R6
2374B62j99m63M67L19j16l63j22p6N03l9J9l01j80L84L6q2k51p0K62K62k96J03
2396E9m47j09N97J15j68k72n3K25N17k52j13l85L12L35Qk47k13J48L7J08M1m26
2418a83j42M39J75j18j82l07J29L76Mk37l81P0M14O8J68n21j59K86Q4J04j15j69
2440a97K57K31Qp4m40J4K63K23p6j90j42K14JR3l16k23L2J20R1J95j92l14K00
2463b22K14j34J67N3M4J20J26l8l72j61J72L12J68n44J22r7P5L00l12m09M41j95
2485a70L39k33k18R1K33K53k29k96K94l3N0J22j31j72J76M9p0Nj10J49j05M0L0
$$ plain form
2508 64 233 51 189 -117 -191 -146 126 -107 -53 -276 112 262 -92 -105 10 64 136 21 -160 -46 84 35 -108
2531 -108 15 29 282 145 25 -209 50 310 106 -141 -49 -171 234 -9 -121 -133 64 284 116 -131 -225
2552 -225 23 -215 132 -233 -75 -193 285 92 -111 -55 105 21 180 27 -135 -51 -19 72 47 -74 156 377
2574 377 -133 -253 128 279 260 -186 -479 -124 -66 81 -77 -283 -78 254 -56 -182 -48 -117 169 17 -106
2595 -106 -5 -125 240 36 2 -132 22 72 9 -146 -134 125 -1 -113 -232 -239 24 125 -167 -418 -315 59
2617 59 195 160 -322 -198 402 358 70 86 -29 299 548 -131 -312 -230 265 -45 33 -165 -123 372 42 97 -378
2640 -378 84 27 -185 -353 129 -9 72 -112 -124 -37 213 245 221 -141 -383 399 154 239 -162 -220 268 393 -58
2663 -58 -257 12 89 116 32 -213 142 188 89 -334 -262 11 385 -186 -275 -89 43 55 10 39 -38 37 392 413 -9
$$ packed form
2508F4J69j82J38l06p4M5K72k33N4k23L88J50l54j3J15N4P2j15j81J14J30m9j43
2531a08J23J4K53j37j20k34K59K60k04k47R2j22M05k43j12j2J97K20j68k47r4
2552b25K48k38L47l65J58j18M78j93k03N6J60q4J59j53j62Q4L2R1k5j21K30K21
2574C77n10j20L81J51j9m46k93L55N8J47j58k06K05L32l10j26J34o9K86j52j23
2595a06J01j20L65k04l4j34J54N0o3j55J2K59j26j12j19pK63J01k92k51J03L74
2617E9J36l5m82J24O00m4k88J6j15L28K49o79j81Q2M95l10P8j98M2M95l30N5m75
2640c78M62n7k12j68M82j38Q1j84j2Q7K50L2k4l62k42P82k45Q5m01n8M88J25m51
2663e8j99K69P7K7q4k45L55M6r9m23P2K73L74n71q9J86J32J2m5K9p7P5L55K1m22
$$ plain form
2688 -9 -7 -88 230 406 -26 -65 23 396 206 -310 116 -118 86 -484 -305 -56 6 112 -15 -191 -178 195 138
2711 138 -28 -181 -5 178 135 -62 123 271 254 169 -192 0 -14 208 0 -11 -222 -153 78 100 -116 -185 -94
2734 -94 -155 -21 -24 -128 34 34 -182 41 -6 177 280 98 139 122 163 212 267 82 -12 88 242 -42 -31 -237 -122
2759 -122 61 -141 -120 -246 -164 54 75 -44 34 -64 172 -40 -173 -72 45 26 -56 -228 -48 36 -41 -8 5 -5
2783 -5 -69 -125 109 143 -124 -223 -199 61 121 -32 -72 -48 -56 -17 -221 -92 -260 -78 147 -191 -48 -12 -75 -84 232 293
2809 293 -95 -50 -36 231 46 130 26 -62 -112 -8 168 -91 2 -40 -88 276 -229 -17 -538 -23 -21 -203 -257 -37
2833 -37 128 93 79 -218 -5 121 21 271 46 -65 -76 120 56 40 -16 -81 224 69 71 76 -347 -14 -124 106
2857 106 73 -170 -186 -94 -111 -176 -474 165 -8 -71 116 -30 -119 103 259 121 104 -116 -11 192 38 26 -46
$$ packed form
2688iKq1L18J76m32l9Q8L73j90n16M26k34K04n70J79K49O2J06j27j76J3L73n7
2711A38j66j53J76J83m3j97J85J48j7q5l61J92j4K22k08j1k11O9K31K2k16o9R1
2734i4o1J34lj04J62%k16K23m7J83J03j82M1j7M1M9N5j85r4J00J54k84J1k06J15
2759a22J83k02K1j26Q2K18K1j19P8r8K36k12j33J01J17j9q2j72J80Q4p7L3J3j0
2783eo4n6K34L4k67r9K4K60O0j53m0K4qL9k04J29j68J82K25l38J43L6o3rL16O1
2809B93l88M5J4K67j85Q4j04q8n0J04J76k59R3m2m8L64n05K12n21N15Kj82n4K20
2833c7J65l5j4k97K13J26j00K50k25j11j1J96o4j6n6o5L05j55KNm23L33j10K30
2857A06l3k43j6R2j7o5k98O39j73o3J87j46q9K22J56j38j7k20J05K03j54j2p2
$$ plain form
2880 -46 -361 -101 256 326 -118 -280 -142 -346 77 -130 -324 -106 29 180 -107 129 -15 -207 -58 230 38
2901 38 -98 -150 -57 226 69 -102 -304 122 281 92 -19 37 47 89 99 99 -142 -302 217 165 169 -24 -194 141
2925 141 198 64 -136 -246 80 -22 311 75 -82 -198 -45 216 -170 151 65 235 0 50 -49 8 -71 126
2947 126 343 -19 -69 -264 22 193 74 -109 -59 167 285 -16 95 -151 200 183 -50 -18 14 -114 100 384
2969 384 160 86 -307 68 149 211 -65 -205 -42 -379 164 241 -173 -227 15 105 -38 225 -112 96 -74 65
2991 65 142 164 74 -281 162 137 -1 59 -20 78 -116 -134 244 249 -155 152 -120 124 -20 -132 165 117 -29 -164
3015 -164 -21 -174 94 -184 12 -209 198 142 -87 60 -112 -206 290 151 -5 129 167 -39 125 -51 -111
3036 -111 -162 -31 92 16 -193 -241 184 206 -92 78 92 129 -93 -34 75 -126 36 309 15 226 5 -24 -63
$$ packed form
2880d6l15K60L57P0m44j62J38k04M23k07j94K18J35J51k87K36j44j92J49K88j92
2901C8j36n2R3K83j57j71k02M26J59j89j11N6J0M2J0%k41j60N19n2Mj93j70L35
2925A41N7j34k00j10L26j02L33k36j57j16J53K61l86L21q6J70k35N0r9N7p9J97
2947A26K17l62n0j95K86J71j19j83N0K26J18l01J11k46L51j7k33L2L2j28K14K84
2969C84k24p4l93L75Q1O2k76j40J63l37N43P7m14n4K42R0j43K63l37K08j70J39
2991F5P7K2r0l55M43k5j38O0p9R8j94j8L78Nm04L07k72K44j44j12K97m8j46j35
3015a64J43j53K68k78J96k21M07n6k29J47j72r4M96j39j56J34L8k06J64j76o0
3036a11n1J31J23p6k09m8M25K2k98J70J4L7k22N9J09k01J62K73k94K11k21k9l9
$$ plain form
3059 -63 9 251 -90 201 219 -174 26 188 53 169 -185 166 -30 64 5 3 -67 71 150 -196 -230 -65 10 58
3083 58 -53 -403 76 289 163 -130 -84 -110 284 293 177 -212 -314 -49 245 -80 -172 -45 275 25 73 -101
3105 -101 -22 147 -16 -1 -90 89 8 122 56 -243 -77 216 -36 -106 -100 -37 -88 15 -76 94 26 122 -269 -257 -131
3130 -131 41 214 -35 -174 -13 -167 160 -200 108 264 -73 185 -137 -334 203 -140 138 97 -126 219
3150 219 176 -76 -142 27 247 13 51 -100 -123 -40 -172 38 72 56 12 15 -132 -60 139 -80 36 67 -97 -132
3174 -132 -162 203 27 -51 27 113 82 -91 71 150 250 42 -58 -212 -103 278 -112 -77 103 200 101 -238 45
3197 45 -196 186 123 45 -12 97 -281 -31 2 -11 122 155 209 -208 -156 -26 179 -101 85 -210 -38 -27 196
3220 196 -223 -113 -149 23 346 -117 -216 -97 -163 47 -39 139 -188 238 -41 -345 -188 -7 -15 158 17 -184
$$ packed form
3059f3P2K42l41K91J8l93K00J62j35J16l54L51j96R4n9kp0J38P9l46l4J65P5M8
3083E8j11l50M79K13j26k93M6k6L94Rj16l89j02K65K94l25r2J27L20k50M8j74
3105a01P9J69j63J5q9J79q1J14o6k99J66K93k52p0OO3n1J03r1J70o8R6l91J2J26
3130a31J72J73k49j39J61j54L27l60L08J56l37K58l22j97N37l43K78m1k23L45
3150B19m3k52o6J69K20k34L8j51k3Q3j32K10L4j6m4Lj47P2J99k19J16L1j64l5
3174a32l0L65j76p8P8Q6l1j73J62P9J00k08j00j54J09L81l90L5J80R7r9l39K83
3197D5k41L82o3p8n7J09l78K50L3j3J33L3N4m17N2J30K05k80J86k95J72J1K23
3220A96m19J10l6J72L23m63r9J19o6K10q6J78l27M26k79l04J57J81qJ73j41k01
$$ plain form
3242 -184 82 -81 116 -104 -2 179 158 127 -33 -2 -163 184 225 91 -36 -212 28 -29 -76 -76 112 3 -108
3265 -108 120 124 92 132 1 -118 -11 163 238 -50 -18 146 121 6 -261 -78 47 28 -141 -170 -29 431 -52
3288 -52 -94 57 -97 -59 30 -213 -30 -104 121 -154 252 131 -71 -82 103 75 -292 36 234 -195 43 49 203
3311 203 -22 73 -76 -147 57 77 -174 -238 184 42 433 -313 -9 54 81 -71 -80 -248 110 -119 -84 162 42
3334 42 73 13 57 -49 68 -184 -53 196 194 -153 -77 12 -96 -80 172 64 31 -78 172 -254 231 239 -288 94
3358 94 100 94 80 -20 -12 37 96 -7 22 -15 61 367 -178 83 -36 -77 -192 -8 -17 60 12 51 130 -101 236 -130 -2
3385 -2 -84 120 -148 -60 139 -181 -165 -61 88 176 -142 271 207 53 33 -1 43 49 -322 210 -369 -100 222 135
3409 135 103 -144 35 -94 -232 -138 -192 68 -57 -157 -82 139 214 133 -33 143 114 -47 48 170 32 233 -53
$$ packed form
3242a84K66j63J97k20J02J81k1l1j60L1j61L47M1j34j27j76K40n7m7%J88j09j11
3265a08K28Ml2M0j31j19J07J74P5k88L2J64k5j15k67J83J25j9j69k9J41M60m83
3288e2m2J51j54L8Q9k43J83p4K25k75M06j21k02j1J85k8l67L28J98m29K38OJ54
3311B03k25R5j49p1K04K0k51o4M22j42L91p46L04O3K7j52rj68L58k29L5K46j20
3334D2L1o0M4j06J17k52J31K49kl47P6Q9j08J6K52j08l3j09K50m26M85Qn27L82
3358I4Ooj4j00QM9N9j03K9l7P6L06n45K61j19m1j15J84rP7m8L9P9k31L37l66J28
3385bq2K04k68Q8J99l20J6J04J49Q8l18M13o4j54k0l4M4Ol71N32n79K69L22q7
3409A35l2k47J79j29j38R4n4K60j25j00P5K21P5q1j66J76k9j61R5J22j38K01k86
$$ plain form
3432 -53 -49 -38 137 -3 42 -46 -48 1 146 29 -34 86 -101 41 -53 203 -57 206 -307 41 148 128 35 127 -93
3457 -93 154 84 123 52 -181 211 76 24 -154 201 99 5 -21 2 4 165 -100 56 -11 -135 70 -172 4 -132
3481 -132 -34 166 179 13 38 214 -196 -8 43 3 -117 -68 66 51 152 -294 3 -34 -18 107 83 -198 -99 -74
3505 -74 172 -112 61 123 24 171 -125 -30 -50 -248 17 74 50 -193 73 -73 64 60 -4 -83 -28 34 43 219 -118
3530 -118 -408 214 -37 178 -8 -287 125 -62 -73 -198 -305 155 94 -49 4 49 -230 -232 135 -158 163 95
3552 95 65 212 -44 -238 16 -188 -73 154 -44 67 136 -12 55 -25 -104 -45 67 -67 27 -126 -112 -78 -3 -33
3576 -33 -95 -182 24 -125 68 319 -58 -20 -163 -28 -5 59 -329 144 53 -95 290 -32 -86 -60 162 -95 87
3599 87 132 -13 30 -280 -136 126 0 -240 -66 337 23 300 -109 109 -3 239 -43 23 13 -121 264 -56
$$ packed form
3432e3MJ1J75j40M5q8kM9J45j17o3J20j87J42r4K56k60K63n13L48J07k0r3R2k20
3457i3K47p0L9p1k33L92j35n2j78L55j02r4k6K3KJ61k65J56o7j24K05k42J76j36
3481a32R8K00J3j66K5J76m10J88N1m0j20M9J34j5J01m46K97l7J6J25k4k81R9K5
3505g4K46k84J73O2r9J47k96R5k0j98K65N7k4k43K66j46J37mo4p9N5O2RJ76l37
3530a18k90O22k51K15j86k79M12j87j1j25j07M60o1j43N3M5k79kL67k93L21o8
3552I5l0J47k56j94K54k04J15K27j98J11O9j48O7q0p9N9J12j34R4j53J4L4P5l0
3576c3o2q7K06j49J93K51l77L8j43J35K3O4l88M73r1j48L85l22n4K6K22k57J82
3599H7M5j45M3l10J44K62j26k40J74M03l14K77m09K18j12K42k82O6j0j34L85l20
$$ plain form
3621 -56 26 -143 -19 169 -187 134 82 113 67 37 154 -254 108 -17 -42 -176 49 -165 126 -62 -28 -11 -17 -86
3645 -86 86 -94 -152 -83 157 -107 -136 95 -5 -30 395 22 16 224 67 -27 -96 219 231 159 238 110 258 164
3669 164 12 162 420 118 121 166 82 -161 -1 97 35 -342 118 102 31 86 -92 -49 -158 192 -38 -119 -230 -48
3693 -48 -126 53 -207 133 -19 103 -128 134 -29 54 -27 -21 77 111 203 57 -277 114 -50 -33 168 -183 -92 209
3717 209 231 -2 120 99 -149 -196 112 -158 154 72 130 136 -158 -146 -132 61 23 67 -5 75 125 -239 -76 -29 139
3742 139 -56 118 -363 223 -49 -290 67 -120 168 -39 -271 -53 -71 132 -1 31 257 -215 136 36 -120
3763 -120 61 -83 -180 -66 -216 -219 -18 54 59 -171 -143 -61 -58 -141 -154 -320 113 16 -3 333 34 -261 124 -205 -214
3788 -214 15 -132 -16 116 -158 -233 -55 -61 232 243 2 209 200 51 12 14 -70 276 -34 -54 112 -96 15 50
$$ packed form
3621e6Q2j69J24J88l56L21n2L1m6l0J17m08L62j25k5j34K25k14K91j88L4J7oo9
3645h6J72j80n8O9K40k64k9K31j00k5M25l73oK08j57r4o9L15J2p2P9j28J48r4
3669A64j52J50K58l02LM5q4k43J60R8o2l77M60j6p1N5j78M3j09L50k30q1j11J82
3693d8p8J79k60L40j52J22k31K62j63Q3q1OR8L4R2j46l34L91j64J7K01l51R1L01
3717B09K2k33J22k1k48m7L08k70L12q2N8Ok94J2J4J93l8M4p2Q0N0l64J63M7J68
3742A39j95J74m81N86k72k41L57j87K88k07k32K18j8K03j33L2K26m72L51j00j56
3763a20J81j44r7J14j50lK01P2Nk30K8Q2Lq3j3j66M33r7j9L36k99k95L85l29r
3788b14K29j47J16J32k74p5J78oK93J1k41K07rj49l9Kq4L46l10k0J66k08J11L5
$$ plain form
3812 50 -135 -95 -165 99 67 -125 135 -72 120 26 113 -154 54 -197 -17 -61 1 22 -24 -359 57 86 92 46 -75
3837 -75 10 94 -93 13 51 -131 -24 -270 17 -19 51 -30 -84 21 -12 113 -106 123 36 131 -28 -94 -33 167
3861 167 201 -29 3 -16 50 74 -8 -103 151 67 -160 22 -81 -78 110 28 -174 6 47 -51 -158 -78 12 -208 -108
3886 -108 42 410 174 110 -146 -50 54 116 434 47 7 -99 -301 -20 -64 -80 -15 55 198 -17 -120 170 -58
3909 -58 201 14 118 47 -23 -78 19 69 -85 297 103 27 77 31 -157 -37 118 -46 -125 -107 -396 -179 101 -12
3933 -12 -113 -40 -296 74 -58 -31 17 -99 137 -93 83 162 -59 83 133 102 -12 -109 -61 136 -60 78 155
3956 155 114 1 273 172 -143 88 45 -153 46 -109 133 -16 238 -84 55 53 -203 167 93 264 -93 -61
3978 -61 -190 -11 -196 -51 -51 -2 -33 43 -222 151 92 -109 -71 -72 -105 24 1 154 -1 -4 34 -47 91 -39 8 -40
$$ packed form
3812E0j85M0p0K64l2j92K60k07J92r4Q7k67K08k51J80m4O2K1m6l35M16K9Om6j21
3837g5Q5Q4j87J06L8j82J07k46K87l6P0q1n4J05l3J25k19K29q7R5j59o6O1K00
3861A67L4k30L2j9O6K4q2r5K54q4k27J82j03LJ88q2k02J80M1r8j07Q0R0k20J00
3886a08J50L68k36o4k56R6J04O2L18l87m0j06k02K81m4j6O5P0J43k15j03K90k28
3909e8K59j87J04p1p0n5R7N0j54L82j94p6N0m6j88J20J55j64p9J8k89K17K80j13
3933a2j01P3k56L70j32K7M8j16K36k30J76P9k21J42N0l1j14r7M8J97j96J38P7
3956A55m1j13K72j01l15K31m3j98J99j55K42j49K54l22J39kk56L70p4J71l57L2
3978f1j29J79j85J45%M9l1P6k65L73n9k01L8jl3J29k3J53j55lL8q1J38j30M7m8
$$ plain form
4004 -40 -80 -64 79 -37 -73 -8 -130 230 -114 58 269 -54 43 12 -14 -34 109 344 106 171 121 -111 60 -108
4028 -108 -61 -15 -118 -8 149 -25 61 -264 -122 -17 -149 90 145 32 -162 37 -225 92 150 50 -4 112
4050 112 -209 -144 57 85 -39 108 -3 -192 31 188 -33 -183 66 28 67 -23 64 51 214 40 -21 -143 -137
4073 -137 -140 -190 -52 -13 -107 -129 -87 280 -40 2 -100 216 134 48 38 48 -45 86 49 -65 -106 232 230 138 -44 -164
4099 -164 41 -117 86 17 141 -24 -3 92 -110 -70 -96 -62 193 -95 101 100 -100 -66 -89 57 -106 -35 -18 222
4123 222 171 -156 50 -43 -84 -58 156 140 -60 170 46 -53 -232 84 147 -88 154 -16 -127 115 -129 90
4145 90 282 -264 51 27 -116 -187 -93 30 45 -8 -9 -69 111 90 215 9 -296 4 -14 -106 -246 117 102 38 -193
4170 -193 191 -22 -215 -233 -19 204 93 -24 217 154 123 105 -144 -61 -1 61 -33 158 -95 -105 65 -104 46
$$ packed form
4004d0m0J6J43j16l6O5j22L60l44J72K11l23R7l1k6k0J43K35k38O5n0k32J71j68
4028a08M7M6j03J10J57j74Q6l25J42J05j32K39N5j13j94J99k62L17N8j00n4J16
4050A12l21O5K01K8j24J47j11j89K23J57k21j50K49l8L9r0Q7j3J63j74o1j22O
4073a37ln0J38L9r4k2M2L67l20M2j02L16q2q6j0J0r3J31l7j14m1L38kr2j82j20
4099a64K05j58K03o9J24j65K1R5k02M0k6L4K55k88J96jk00L4k3J46j63P1J7K40
4123B22n1l27K06r3m1K6K14j6k00K30j24r9j79L16O3k35K42j70j11K42k44K19
4145I0J92n46L15k4j43p1R4J23J5n3jo0J80k1J25k06l05L00j8r2j40L63j5o4k31
4170a93L84k13j93j8K14K23j11j17K41o3l1j8k49Q3O0O2r4J91k53j0J70j69J50
$$ plain form
4193 46 -340 -85 -384 117 26 -8 -23 -184 -94 173 -21 85 -27 -156 65 -148 -8 -166 294 297 179 53
4215 53 65 -86 -54 101 112 255 126 19 -62 36 37 93 56 -28 83 -149 177 95 99 27 149 130 -26 2 -34 2
4241 2 -240 -15 220 -44 16 -196 -31 11 84 56 108 179 321 17 -25 96 -12 50 102 -242 -94 -61 17 75 -92
4266 -92 -13 79 89 -189 137 -281 143 -299 -205 82 183 29 254 65 -346 13 193 64 148 -85 64 -5
4288 -5 -22 148 -116 6 -20 -151 57 -1 -63 97 80 97 148 85 7 -143 -100 44 -218 58 -31 0 17 -189 -28
4313 -28 95 -45 -168 -14 -63 -21 -37 2 -208 68 -74 187 -75 2 149 7 46 -51 -57 115 -179 -51 292
4336 292 112 -256 -26 82 -72 58 -130 -55 -35 -172 181 72 -158 404 -186 -88 212 76 28 178 10
4357 10 23 14 -18 -118 -58 302 -83 17 2 -4 -107 -19 244 -29 -129 -142 -179 -114 180 8 44 -42 -183 93 242
$$ packed form
4193D6l86K55k99N01r1l4j5j61R0K67j94J06j12j29K21k13J40j58M60Lj18j26
4215E3J2j51L2J55J1J43j29j07q1R8JN6l7q4J11k32L26q2Mp2J22j9j56K8l6L6
4241Bk42K25K35k64O0k12J65M2P3k8N2P1J42l04m2J21j08O2N2l44J48L3P8N8j67
4266i2P9R2J0k78L26m18M24m42R4K87J01j54K25j89m11L59J80j29Q4k33J49o9
4288ej7J70k64J22k6j31K08n8o2J60j7J7N1o3p8j50M3J44k62K76q9L1J7k06J61
4313b8J23j40j23J54m9M2j6L9k10K76j42K61k62P7J47j42L9r7oJ72k94J28L43
4336B92j80l68K30J08j54J30j88P5K0j37L53j09k30N62n90R8L00j36m8J50j68
4357A0J3rl2j00O0L60l85J00j5oj03Q8K63k73j00j3l7O5K94j72L6q6j41K76J49
$$ plain form
4382 242 209 -27 88 84 -141 39 -55 -95 186 148 -206 -82 -188 87 37 108 -141 246 -156 -255 -74 -33 -121 -40
4406 -40 15 -81 58 33 61 17 23 -213 110 -137 -277 -5 84 75 38 81 84 121 -71 277 -28 -30 -36 -48 4 -51 -82 89
4434 89 -133 -12 45 -95 27 -82 -2 -120 -52 -74 76 156 73 143 131 -25 156 83 122 -2 28 130 -82 98
4458 98 11 -132 -64 -263 -231 79 -40 -233 107 42 -48 -54 12 108 -56 -57 -38 49 9 -198 -37 16 -146 -70 -302 -22
4484 -22 166 -22 -2 63 39 46 7 14 -113 182 -30 -88 52 29 10 143 63 84 39 -181 -235 -6 329 87 154 -229
4510 -229 -82 -85 -84 -16 141 139 -59 -108 5 -141 -176 35 42 70 -29 -30 62 -30 -164 28 1 34 -89 -207 79 277
4536 277 101 161 25 173 98 -34 -137 -12 66 44 94 -86 -27 -103 100 -214 -53 -34 169 89 105 -156 -62 -27
4560 -27 -80 40 284 8 0 112 87 172 77 1 5 160 -250 80 -351 -103 70 -68 185 159 108 -237 -5 -67
$$ packed form
4382B42l3k36J15mk25J80r4m0K81l8l54J24j06K75n0P1k49L87m02r9J81M1q8Q1
4406d0N5r6J39k5K8m4Ok36L23k47j40K72Q9rl7M3LL7j92L48l05koj2N2n5l1J71
4434H9k22J21N7j40J22j09Q0j18O8k2J50Q0q3P0j2j56J81p3L9j24L0J02k12J80
4458I8q7j43O8j99L2L10j19j93L40o5r0oO6R6j64jJ9Q7m0k07J61N3j62P6k32K80
4484b2J88j88K0O5k4Pl9Pj27K95k12n8J40k3j9J33q0K1m5k20n4K29L35k42O7l83
4510b29J47lJO8J57kj98m9J13j46l5K11PK8r9jR2r2j34J92k7L3j23j18K86J98
4536B77j76O0j36J48p5j32j03J25P8k2N0j80N9p6K03l14J61J9K03q0J6k61R4L5
4560b7n3J20K44k76qJ12k5Q5r5p6MJ55m10L30m31K48J73j38K53k6n1l45K32o2
$$ plain form
4584 -67 -134 -12 145 -1 113 -162 55 170 -237 29 -32 -159 35 95 106 6 -40 -75 -56 -57 15 -97 -65 137
4608 137 -15 -282 -122 21 15 11 12 -77 37 -155 208 -19 -188 -325 50 39 -84 115 -88 243 253 -78 207
4631 207 -136 136 -13 -176 -220 -222 40 -113 -78 -65 -94 69 82 -16 118 140 -145 228 189 -61 43 66 -204 -124
4655 -124 221 -5 -97 171 -197 -61 129 0 -202 -86 118 34 -91 -66 -43 -170 159 124 137 -23 82 -25
4677 -25 215 -144 5 -45 -124 139 -9 -160 -171 241 -172 -37 -45 114 -72 -64 20 -59 13 78 -333 126 21 -21
4701 -21 -171 -251 -41 147 53 37 -156 25 -20 -71 16 8 -71 88 -85 288 152 121 160 10 136 -17 151 -96
4725 -96 -17 -106 -53 180 115 -186 49 -189 -89 -55 -124 56 57 218 -225 -18 -24 -185 46 61 39 -138 -18 -249
4749 -249 215 89 -47 129 -82 -42 -194 24 254 -4 33 298 -67 -10 -140 2 -79 -124 -116 34 16 -185 -39
$$ packed form
4584f7o7J22J57j46J14k75K17J15m07K66o1j27J94O0J1j00m6l5J9jP2j12L2K02
4608A37j52k67J60J43omJq9J14j92L63k27j69j37L75j1j23J99k03L31J0l31K85
4631B07l43K72j49j63m4kK62j53L5J3k9J63J3r8J34K2k85L73l9k50J04K3k70Q0
4655a24L45k26r2K68l68J36J90j29k02J16K04q4j25K5K3j27L29l5J3j60J05j07
4677b5K40l59J49n0p9K63j48j51j1M12m13J35qJ59j86QQ4p9P2O5m11M59j05m2
4701b1j50q0K10J88r4j6j93J81m5n1Q7qp9J59j73L73j36l1L9j50J26j53J68k47
4725i6P9q9N3K33o5l01K35k38J00L4o9J80JJ61m43K07oj61K31J5k2j77J20k31
4749b49M64j26j36J76k11M0j52K18K30k58L7K65l65N7j30J42q1m5QJ50j8k01J46
$$ plain form
4772 -39 56 169 -187 7 -1 13 250 1 -20 89 174 -80 -9 75 -13 -47 -75 89 36 78 59 206 46 -78 108
4797 108 226 138 63 -168 415 -85 85 -110 93 -17 92 241 -148 78 -56 -144 165 -113 -53 194 -125
4818 -125 91 -86 -115 -164 104 143 -69 162 33 -194 20 14 178 -90 -149 166 61 267 33 134 -45 -21
4840 -21 200 110 14 -197 7 182 -117 66 36 -190 -81 46 79 204 11 -67 34 -91 -143 -125 -162 -61 143
4863 143 -68 -59 114 177 65 -52 -104 201 166 89 255 4 160 126 167 -8 -283 220 122 -27 -62 -17 98 48
4887 48 4 -14 -183 -244 70 116 -13 -40 -97 -6 145 -260 132 45 96 -53 77 -19 200 -109 129 -72 -186 76
4911 76 5 -138 -54 -84 -5 -8 102 80 118 168 113 -11 -52 -181 108 1 -9 40 -32 4 220 -129 62 -113 1
4936 1 141 -74 229 156 -83 157 111 50 101 -342 -157 155 14 -135 19 214 59 -208 -53 157 -104 -6
$$ packed form
4772c9R5J13l56J94qJ4K37k49k1J09Q5k54P1Q4q8l4k8J64n3M2j9J47j60j24J86
4797A08J18q8p5k31N83n00J70j95K03j10J09J49l89K26j34q8L09k78O0K47l19
4818a25K16j77k9m9K68L9k12K31j29k27K14oJ64k68n9L15j05K06k34J01j79K4
4840b1K21r0r6k11K04J75k99J83l0k26J09J27L3J25j93p8J01j25n2J8l7J01K04
4863A43k11RJ73O3j12j17n2L05l5p7J66k51J56l4M1j75k75N03r8j49l5M5J15n0
4887D8m4j8j69o1L14M6j29k7n7R1J51m05L92q7N1j49J30r6K19l09K38k01j14K62
4911G6p1j43Q4l0P9lJ10k2L8N0n5j24m1j29K89j07j0M9p2L6K16l49J91j75J14
4936AJ40k15L03p3k39K40m6o1N1m43J85L12j41j49J54J95j55k67J55K10k61R8
$$ plain form
4958 -6 -58 -41 35 85 73 -89 -162 23 4 51 -24 129 13 -23 -127 -126 184 398 -164 89 -32 44 -80 -181 -198
4983 -198 28 48 -104 -10 94 -40 52 75 -225 -66 106 -78 -262 -103 75 -80 -203 -45 -108 -22 -74 -122 25
5006 25 203 -101 -118 41 181 -128 -33 98 113 -24 -34 -35 -36 89 8 76 7 156 106 148 -289 154 62 -55 30
5031 30 218 -12 46 12 84 220 -199 68 -140 -78 134 -64 -164 32 107 73 -51 87 -131 -131 112 -138 58
5054 58 -12 132 -27 75 -135 114 212 14 -200 123 62 90 -171 233 -111 -243 -40 117 -158 -107 226 -1
5076 -1 -138 89 63 234 62 58 -61 21 -21 -57 316 -31 -113 45 -16 387 249 124 -120 -197 141 29 -87 -7
5100 -7 1 54 -59 -137 -79 98 -193 -44 93 48 32 -102 29 67 74 207 -38 -267 70 -179 -7 48 -53 -112 3
5125 3 -57 147 55 149 182 301 -225 -119 -160 154 -41 -12 -59 7 -107 117 -12 -113 86 -81 -89 185 45 -64
$$ packed form
4958fn2J7P6N0j2j62p3J85j9M7p5J53j16l6j04JL10K14n62K53j21P6j24j01j7
4983a98K26K0j52R4J04j34R2K3l00J59J72j84j84J59J78j55j23J58o3Q6n2m8J47
5006B5J78l04j7J59J40l09R5J31J5j37j0jjJ25q1O8o9J49n0M2m37M43r2j17Q5
5031C0J88k30N8l4P2J36m19K67k08O2K12j98j00J96P5l4j24J38k18%K43k50J96
5054E8p0J44j59J02k10K49R8j98k14L23o1K8k61M04l44j32K03J57k75N1L33k27
5076aj37K27k6J71j72mj19Q2m2l6L73l47q2J58o1M03j38j25k44p7L38j12j16Q0
5100gQN3j13p8N8J77k91J49J37m5j6j34J31L8PJ33k45k29L37k49J72N5j01n9J15
5125Co0K04r2R4L3J19n26J06m1L14j95K9m7O6j14K24j29j01J99j67qK74j40j09
$$ plain form
5149 -64 83 -28 -168 28 6 -61 108 -196 -152 82 108 181 74 86 167 163 145 157 76 29 134 -55 265 11 181
5174 181 -36 1 -143 108 118 -89 151 1 -188 135 110 70 -75 -89 -176 91 -195 1 -206 19 -118 55
5196 55 -16 7 121 -257 10 92 26 -1 -42 -47 64 -96 215 -60 -193 182 51 117 -47 -170 -171 -266 5 238
5220 238 -92 -57 77 -38 75 78 81 -31 -99 80 78 -3 16 164 -106 -140 173 -97 5 100 123 -62 248 152 172
5245 172 19 15 118 -39 82 55 8 -139 158 157 119 154 73 57 -265 99 49 -66 279 -6 86 67 92 186 0
5270 0 72 -84 351 -85 170 58 216 282 -121 -123 -249 -134 100 91 -81 7 -9 145 -18 -56 -132 -54 56 -100
5294 -100 67 134 31 -103 101 -143 -106 -157 1 -9 63 61 -147 -93 -65 -9 -33 -31 -250 57 4 1 24 -18 -154 -198
5320 -198 -242 3 129 -258 4 195 207 63 -159 130 -143 18 7 3 32 -129 91 50 -137 47 148 -184
$$ packed form
5149f4J47j11j40J96k2o7J69l04M4K34K6P3j07J2Q1mj8J2q1m7J05j89L20k54J70
5174A81k17L7j44K51J0k07K40j50j89L23k5m0j45j4q7K67k86J96k07K25j37J73
5196E5p1K3J14l78K67Q2o6k7m1nJ11j60L11k75j33L75j31O6j64j23jr5K71K33
5220B38l30L5J34j15J13LLj12o8J79kq1J9J48k70l4L13k70J02R5K3j85L10r6K0
5245A72j53mJ03j57J21k7m7j47K97jl8L5q1j6l22L64n0j15L45k85R2j9K5R4j86
5270@P2j56M35m36K55j12J58O6m03kj26J15K34rj72Q8j6J54j63l8p6P8J10j56
5294a00J67O7j03j34K04k44L7n1J58j0P2kk08N4K8N6k4Kk19L07n3lK3m2j36m4
5320a98m4K45J26l87K62J91J2j44k22K89k73J61j1mK9j61K20m1j87J84J01l32
$$ plain form
5342 -184 2 -56 62 -47 -81 117 -36 233 237 166 190 120 36 -57 113 48 155 -49 -176 66 28 7 70 -43
5366 -43 202 243 251 42 -136 -5 10 -71 17 -89 51 120 -122 49 -25 -273 -201 -303 -6 165 -42 350 100
5389 100 12 64 17 11 19 28 -113 155 -63 177 66 153 -257 -124 25 40 58 -55 -182 49 143 -78 109 -10
5413 -10 -111 -98 137 65 -271 -157 -183 12 -186 107 -16 41 121 -137 -181 -27 278 -44 -165 -148 210 -54 -54
5436 -54 -17 6 108 105 177 -124 34 34 80 -142 104 -26 -299 11 128 108 60 28 -34 -180 -23 0 127 217 -161
5461 -161 123 -27 -74 -231 -181 192 47 301 -32 -19 -120 35 186 -20 61 -20 143 211 198 -30 -122 44 70
5484 70 106 132 69 -22 56 -61 2 74 -110 128 92 2 -117 45 25 -164 -117 94 2 -68 106 -74 32 -81 -77
5509 -77 168 219 181 -80 -282 -136 -134 24 3 125 -71 196 86 96 32 -248 159 -9 29 43 -87 293 -149
$$ packed form
5342a84J86n8J18j09l4J98j53K69Mp1K4p0q4r3J70o5J07k04j27K42l8k1O3j13
5366d3K45M1Qk09j78J31J5q1Q8j06J40O9k42J71p4k48P2j02K97J71k07L92k50
5389A00q8N2m7oQRj41K68k18K40j11Q7m10J33J49J5J8j13j27K31R4k21J87j19
5413a0j01J3K35p2l36J14k6J95j98K93j23N7Q0k58m4J54L05l22j21J7L58k64%
5436e4L7K3J02lP2l01J58%M6k22K46j30k73L10J17k0m8l2o2j46J57K3J27R0l78
5461a61K84j50m7j57N0L73j45K54l33J3j01J55J51k06Q1q1J63O8j3k28r2J66K6
5484G0L6K6o3r1P8j17O3P2j84K38l6r0j19J62k0j89M7K11r2p0J74j80J06j13M
5509g7K45N1l8k61k02J46KJ58k1J22j96K67j10J0o4k80M07j68L8J4j30L80m42
$$ plain form
5532 -149 16 -100 -116 -121 155 -87 -41 78 -140 111 207 51 18 -114 -119 33 86 290 -2 -75 -70 -56 -129 -141 -71
5557 -71 -100 -155 157 65 33 104 -8 -29 65 151 -62 38 -149 -86 -65 -62 -44 169 -35 141 -116 368 -19 -170 -35
5582 -35 -38 105 4 -67 -130 132 -85 82 -135 134 3 30 -127 45 10 -147 -260 -76 -78 -96 -5 25 278 -182
5606 -182 7 120 83 202 79 -123 121 -173 -84 136 -86 -46 40 66 13 -127 -171 -129 18 -23 -347 22 -104
5629 -104 48 130 142 134 -148 166 -67 -226 -237 45 82 130 4 33 -18 -43 40 43 29 -54 -227 93 53 140 68 -107
5655 -107 13 403 78 3 -280 30 9 7 -154 -150 -94 -3 138 -152 -143 22 110 40 -70 -136 -107 89 -91 207 -180
5680 -180 105 116 80 -136 55 -113 289 -5 -47 48 -21 -129 -167 17 9 -13 -143 -22 26 -22 92 -98 -103 227
5704 227 -109 -190 -75 -86 0 325 -56 70 150 -287 15 -44 -190 -134 -29 2 40 -150 -3 -4 -53 17 50 -76
$$ packed form
5532a49J65j16j6nK76k42M6J19k18K51R6j56l3j32nJ52N3K04k92p3NJ4p3j2P0
5557g1k9n5L12r2l2P1j12k1R4Q6k13J00j87O3K1LJ8K13k04J76k57M84l87j51J35
5582c5lJ43j01p1o3K62k17J67k17K69j31K7j57J72l5j57j13J84kj8R1L0K53m60
5606a82J89J13l7J19j23k02K44k94Q9K20k22M0Q6K6n3j40m4M2J47m1l24L69j26
5629a04J52Q2J2qk82L14k33j59j1K82L7M8j26K9n1k5Q3Lj4q3j73L20m0Q7p2j75
5655a07J20L90l25p5k83L10k1kj61MN6R1J41k90RJ65Q8p0j10o6K9J96j80K98l87
5680a80K85J1l6k16J91j68M02k94m2R5o9j08l8J84qk2j30J21M8m8J14j90nL30
5704B27l36q1J15j1Q6L25l81J26Q0m37L02n9j46N6J05L1L8j90J47jm9P0L3j26
$$ plain form
5728 -76 -142 -33 54 -11 188 28 -37 124 -8 -63 175 336 -115 7 -132 -17 -17 -180 41 266 -49 -157 176
5751 176 196 61 323 70 -25 92 -131 -104 -29 -42 -29 107 -53 87 -50 127 -22 -251 92 235 61 -85
5773 -85 339 174 60 -250 -15 -159 -72 137 20 92 202 -73 100 -31 -146 -155 132 14 -102 -92 56 -24
5795 -24 -45 177 -133 68 -127 -146 6 -218 -137 -80 117 46 -18 82 -21 88 59 -173 -180 53 78 -117 28 -104
5819 -104 -81 160 -102 62 -191 162 -31 85 -70 -166 76 59 24 13 206 -149 -90 -191 17 -145 23 -10
5841 -10 -68 76 155 0 29 235 160 -140 -1 228 54 56 -102 43 -254 -67 -82 -6 -264 210 39 -99 -73
5864 -73 79 268 -172 147 69 -208 -81 -145 191 287 87 -242 116 190 201 -195 123 150 -86 157 -259 96
5886 96 158 120 -146 218 -61 92 -74 -64 229 -7 38 241 -274 114 -216 -111 -108 166 -38 361 -124 -107 153
$$ packed form
5728g6o6J09Q7o5J99j60o5J61j32n5K38J61m51J22j39J15%j63K21K25l15j08L33
5751A76K0j35K62k53r5J17k23K7P5j3J3J36j60J40j37J77j49k29L43J43j74j46
5773h5M24j65j14l10K35j44Q7K09j17P2J10k75J73j31j15rK87j18j16J0J48q0
5795b4k1K22l10K01j95j9J52k24Q1N7J97p1o4J00j03J09k9k32pK33K5j95J45j32
5819a04K3K41k62J64k53L53j93J16j55r6K42j7l5j1J93l55N9j01K08j62J68l3
5841a0n8J44P9j55K9K06p5l00J39K29j74Kj58J45k97J87j5P6k58M74j71j38K6
5864g3J52J89m40L19p8k77J27o4L36R6k00l29L58P4J1l96L18K7k36K43m16L55
5886I6O2l8k66L64k79J53j66J0K93k36M5K03n15L88l30J05LK74k04L99m85J7K60
$$ [...]
8191a29
##END NTUPLES=NMR FID
##END=
