##TITLE=1H_Pr 11-A-2
 CDCl3
 8 sc, 
 7.04.2022
##JCAMPDX= 6.0         $$ Bruker NMR JCAMP-DX V2.0
##DATA TYPE= NMR FID
##DATA CLASS= NTUPLES
##ORIGIN= UXNMR, Bruker Analytische Messtechnik GmbH
##OWNER= root
$$ XWIN-NMR		Version 3.5
$$ Thu Apr  7 16:04:40 2022 Russian Standard Time (UT+4h)  she@DPX200
##.OBSERVE FREQUENCY= 200.13135
##.OBSERVE NUCLEUS= ^1H
##.DELAY= (6, 6)
##.ACQUISITION MODE= SIMULTANEOUS
##.ACQUISITION SCHEME= undefined
##.AVERAGES= 8
##.DIGITISER RES= 18
##SPECTROMETER/DATA SYSTEM= spect
##.PULSE SEQUENCE= zg30
##.SOLVENT NAME= CDCl3
##.SHIFT REFERENCE= (INTERNAL, CDCl3, 0, 15.7039)
##AUDIT TRAIL= $$ (NUMBER, WHEN, WHO, WHERE, WHAT)
$$ ##TITLE= Audit trail, XWIN-NMR		Version 3.5
$$ ##JCAMPDX= 5.01
$$ ##ORIGIN= Bruker BioSpin GmbH
$$ ##OWNER= she
$$ F:/spectra/data/she/nmr/H-F/1/audita.txt
$$ ##AUDIT TRAIL=  $$ (NUMBER, WHEN, WHO, WHERE, WHAT)
(   1,<2022-04-07 16:03:24.67 +0400>,<she>,<DPX200>,
      <created by zg, POWCHK disabled, PULCHK disabled
       configuration hash MD5:
       00 E9 B6 7A A2 85 ED C7 34 08 36 98 17 FE 4E 26
       data hash MD5: 16K
       31 D6 25 BB C0 D0 90 AF EB FD CF 17 42 C0 D5 3F>)
$$ ##END=
$$ 
$$ hash MD5
$$ EA CD 73 AB E0 32 83 3A C1 09 E8 AC 66 77 BB 65
##$RELAX= 
##$RELAX= 
##$RELAX= 
##$RELAX= 
##$RELAX= 
##$RELAX= 
$$ Bruker specific parameters
$$ --------------------------
##$DU= <F:/spectra>
##$EXPNO= 1
##$NAME= <H-F>
##$PROCNO= 1
##$TYPE= <nmr>
##$USER= <she>
##$AMP= (0..31)
100 100 100 100 100 100 100 100 100 100 100 100 100 100 100 100 100 100 
100 100 100 100 100 100 100 100 100 100 100 100 100 100 
##$AQSEQ= 0
##$AQ_mod= 1
##$AUNM= <au_zg>
##$AUTOPOS= <>
##$BF1= 200.13
##$BF2= 200.13
##$BF3= 200.13
##$BF4= 200.13
##$BF5= 200.13
##$BF6= 200.13
##$BF7= 200.13
##$BF8= 200.13
##$BYTORDA= 1
##$CFDGTYP= 0
##$CFRGTYP= 5
##$CHEMSTR= <none>
##$CNST= (0..31)
1 1 145 1 1 1 1 1 1 1 1 1 1 1 1 1 1 1 1 1 1 1 1 1 1 1 1 1 1 1 1 1 
##$CPDPRG= <>
##$CPDPRG1= <>
##$CPDPRG2= <>
##$CPDPRG3= <>
##$CPDPRG4= <mlev>
##$CPDPRG5= <mlev>
##$CPDPRG6= <mlev>
##$CPDPRG7= <mlev>
##$CPDPRG8= <mlev>
##$CPDPRGB= <>
##$CPDPRGT= <>
##$D= (0..31)
0 1.2 0 0 0 0 0 0 0 0.06 0 0.03 0 0 0 0 0.0002 0 0 0 0 0 0 0 0 0 0 0 0 
0 0 0 
##$DATE= 1649333004
##$DBL= (0..7)
120 120 120 120 120 120 120 120 
##$DBP= (0..7)
150 150 150 150 150 150 150 150 
##$DBP07= 0
##$DBPNAM0= <>
##$DBPNAM1= <>
##$DBPNAM2= <>
##$DBPNAM3= <>
##$DBPNAM4= <>
##$DBPNAM5= <>
##$DBPNAM6= <>
##$DBPNAM7= <>
##$DBPOAL= (0..7)
0.5 0.5 0.5 0.5 0.5 0.5 0.5 0.5 
##$DBPOFFS= (0..7)
0 0 0 0 0 0 0 0 
##$DE= 6
##$DECBNUC= <off>
##$DECIM= 32
##$DECNUC= <off>
##$DECSTAT= 4
##$DIGMOD= 1
##$DIGTYP= 9
##$DL= (0..7)
0 120 120 120 120 120 120 120 
##$DP= (0..7)
150 150 150 150 150 150 150 150 
##$DP07= 0
##$DPNAME0= <>
##$DPNAME1= <>
##$DPNAME2= <>
##$DPNAME3= <>
##$DPNAME4= <>
##$DPNAME5= <>
##$DPNAME6= <>
##$DPNAME7= <>
##$DPOAL= (0..7)
0.5 0.5 0.5 0.5 0.5 0.5 0.5 0.5 
##$DPOFFS= (0..7)
0 0 0 0 0 0 0 0 
##$DQDMODE= 0
##$DR= 18
##$DS= 0
##$DSLIST= <SSSSSSSSSSSSSSS>
$$ [...]
##$SUBNAM2= <"">
##$SUBNAM3= <"">
##$SUBNAM4= <"">
##$SUBNAM5= <"">
##$SUBNAM6= <"">
##$SUBNAM7= <"">
##$SUBNAM8= <"">
##$SUBNAM9= <"">
##$SW= 18.05172834244
##$SWIBOX= (0..15)
0 0 2 0 0 0 0 0 0 0 0 0 0 0 0 0 
##$SW_h= 3612.71676300578
##$TD= 16384
##$TD0= 1
##$TE= 0
##$TE2= 300
##$TE3= 300
##$TEG= 300
##$TL= (0..7)
0 120 120 120 120 120 120 120 
##$TP= (0..7)
150 150 150 150 150 150 150 150 
##$TP07= 0
##$TPNAME0= <>
##$TPNAME1= <>
##$TPNAME2= <>
##$TPNAME3= <>
##$TPNAME4= <>
##$TPNAME5= <>
##$TPNAME6= <>
##$TPNAME7= <>
##$TPOAL= (0..7)
0.5 0.5 0.5 0.5 0.5 0.5 0.5 0.5 
##$TPOFFS= (0..7)
0 0 0 0 0 0 0 0 
##$TUNHIN= 0
##$TUNHOUT= 0
##$TUNXOUT= 0
##$USERA1= <user>
##$USERA2= <user>
##$USERA3= <user>
##$USERA4= <user>
##$USERA5= <user>
##$V9= 5
##$VALIST= <valist>
##$VCLIST= <CCCCCCCCCCCCCCC>
##$VD= 0
##$VDLIST= <DDDDDDDDDDDDDDD>
##$VPLIST= <PPPPPPPPPPPPPPP>
##$VTLIST= <TTTTTTTTTTTTTTT>
##$WBST= 1024
##$WBSW= 4
##$XGAIN= (0..3)
0 0 0 0 
##$XL= 0
##$YL= 0
##$YMAX_a= 1049209
##$YMIN_a= -1120002
##$ZGOPTNS= <>
##$ZL1= 120
##$ZL2= 120
##$ZL3= 120
##$ZL4= 120
##$ABSF1= 10
##$ABSF2= 0
##$ABSG= 5
##$ABSL= 3
##$ALPHA= 0
##$AQORDER= 0
##$ASSFAC= 0
##$ASSFACI= 0
##$ASSFACX= 0
##$ASSWID= 0
##$AUNMP= <proc_1d>
##$AZFE= 0.1
##$AZFW= 0.1
##$BCFW= 1
##$BC_mod= 2
##$BYTORDP= 1
##$COROFFS= 0
##$CY= 11.3945322036743
##$DATMOD= 1
##$DC= 2
##$DFILT= <>
##$DTYPP= 0
##$F1P= 2.36226072786647
##$F2P= -0.459571619588291
##$FCOR= 0.5
##$FTSIZE= 0
##$FT_mod= 4
##$GAMMA= 1
##$GB= 0.15
##$INTBC= 1
##$INTSCL= 1
##$ISEN= 128
##$LB= 0.24
##$LEV0= 0
##$LPBIN= 0
##$MAXI= 10000
##$MC2= 0
##$MEAN= 0
##$ME_mod= 0
##$MI= 1.114404
##$NCOEF= 0
##$NC_proc= 0
##$NLEV= 6
##$NOISF1= 3.799351
##$NOISF2= 2.8
##$NSP= 1
##$NTH_PI= 0
##$NZP= 0
##$OFFSET= 15.70392
##$PC= 1
##$PHC0= -18388.78
##$PHC1= 8.40078
##$PH_mod= 1
##$PKNL= yes
##$PPARMOD= 0
##$PSCAL= 0
##$PSIGN= 0
##$REVERSE= no
##$SF= 200.130013532006
##$SI= 16384
##$SIGF1= 3
##$SIGF2= 2
##$SINO= 400
##$SIOLD= 16384
##$SREGLST= <1H.CDCl3>
##$SSB= 0
##$STSI= 0
##$STSR= 0
##$SW_p= 3612.71676300578
##$SYMM= 0
##$S_DEV= 0
##$TDeff= 0
##$TDoff= 0
##$TI= <>
##$TILT= no
##$TM1= 0
##$TM2= 0
##$TOPLEV= 0
##$USERP1= <user>
##$USERP2= <user>
##$USERP3= <user>
##$USERP4= <user>
##$USERP5= <user>
##$WDW= 1
##$XDIM= 8192
##$YMAX_p= 0
##$YMIN_p= 0
$$ End of Bruker specific parameters
$$ ---------------------------------
##NTUPLES= NMR FID
##VAR_NAME=  TIME,          FID/REAL,        FID/IMAG
##SYMBOL=    X,             R,               I
##VAR_TYPE=  INDEPENDENT,   DEPENDENT,       DEPENDENT
##VAR_FORM=  AFFN,          ASDF,            ASDF
##VAR_DIM=   8192,          8192,            8192
##UNITS=     SECONDS,       ARBITRARY UNITS, ARBITRARY UNITS
##FACTOR=    0.0002768,     1,               1
##FIRST=     0,             0,               0
##LAST=      2.2672688,     0,               0
##MIN=       0,             -1120002,        0
##MAX=       2.2672688,     1049209,         0
$$ Real data points
##PAGE= N=1
##DATA TABLE= (X++(R..R)), XYDATA
0 0 0 0 0 0 0 0 -8 8 -8 8 -16 24 -24 32 -40 56 -64 80 -98 120 -144 176 -208 242 -288 336 -388 450 -520
29 -520 595 -682 779 -884 1001 -1131 1275 -1434 1606 -1796 2005 -2232 2481 -2752 3049 -3374
45 -3374 3729 -4115 4540 -5004 5514 -6073 6693 -7379 8139 -8993 9956 -11048 12300
58 12300 -13753 15460 -17508 20011 -23146 27215 -32729 40662 -53107 75535 -128458 503938
70 503938 -59676 -1087340 379728 897126 73686 -473864 -2375 140298 20024 156253
80 156253 19814 -407725 -201 394802 52682 -323910 -73421 254341 75363 -154449
90 -154449 -37696 -39742 30607 102884 -93910 -174603 10843 147153 17468 -182088 -24320
101 -24320 98948 -8417 6623 13014 -64434 -71825 55407 183864 -75824 -280344 69181
112 69181 282471 -31202 -279775 2498 260149 -62602 -177925 155224 56131 -208784
122 -208784 22098 259875 -55094 -309362 103096 291837 -141346 -183581 128852 82201
132 82201 -86169 -937 91008 -58466 -68240 122938 14288 -99880 47630 30807 -65936
143 -65936 19616 80399 -58216 -120864 105738 119152 -144776 -82925 117428 57570 -69184
154 -69184 -65409 32670 46267 4977 -16003 -75467 4340 114762 -7371 -100327 -19106 78362
166 78362 63245 -54767 -60468 22339 54079 33816 -54858 -42971 51084 7277 -20721 18757
178 18757 -6926 -43101 -8061 69944 14296 -93007 -5051 63795 3700 -14339 -20044 -15472
190 -15472 19407 33310 -3744 -59420 12105 68981 -36260 -41913 47669 23639 -33183 -20489
202 -20489 38864 20635 -33133 263 7142 -3956 20606 -15449 -22213 17217 5782 -18720
214 -18720 -9631 28334 1101 -52732 17081 46320 -25059 -24567 8276 11185 5666 2028 -2161
227 -2161 -27557 13442 49245 -29658 -36781 36593 22398 -22245 -14866 24718 7806 -26667 11443
240 11443 10178 -20588 10656 5623 -20194 -5178 16662 9781 -27798 -12759 27073 1661 -8478
253 -8478 -5545 -9160 14596 12698 -6305 -11889 -6650 23129 13372 -16277 -11368 3659 26672 5742
267 5742 -36036 2643 31798 -2697 -24926 -2870 25041 -4651 -23036 11213 436 -9345
279 -9345 11330 -5030 -17972 4711 21625 -6759 -32398 18783 27925 -27196 -10421 25787
291 25787 2922 -18010 2070 23058 -8115 -15521 18804 2753 -11447 8594 1450 -7648 63
304 63 10086 -2116 -19125 7650 15317 -15904 -10214 6428 7695 -3570 -14822 4827 11605
317 11605 -4980 -5372 -1145 8132 3493 -6913 5562 1572 -3718 10677 767 -9070 2034 12038
331 12038 1715 -16884 3948 17436 -12714 -9335 11252 -401 -10009 214 8219 -9466 -11029
344 -11029 15739 -647 -19066 6961 11961 -8288 -8690 8680 8546 -10445 1682 11165 -7515
357 -7515 650 10991 -3842 -5848 5425 9227 -5652 -8218 8842 1955 -5620 2287 -3291 -2167
371 -2167 2731 -1297 -2934 -4188 893 1312 -3900 2075 -3165 -3996 7731 394 -5887 1773 4427
386 4427 1337 -2342 3460 2299 -4547 6836 5483 -9959 321 9552 439 -8228 -283 8015
400 8015 -4346 -5057 5960 -4553 -5601 5764 494 -7291 -2846 4781 -981 -6303 6225 772
414 772 -9684 5322 9333 -3485 -5328 3067 6537 564 2123 774 -8655 4472 13529 -4978
428 -4978 -12041 863 10412 2767 -8803 -4937 108 5118 5519 -10495 -9033 7976 6484 -5093
442 -5093 -8582 -134 5625 1718 -273 -6895 -4262 14641 8871 -13444 -9381 12313 15610 -5586
456 -5586 -12746 1140 7272 8378 156 -14171 -6652 10974 10682 -6823 -14780 -796 8296 5473
470 5473 -908 -12666 -7725 10870 9066 -5778 -10292 -425 5700 3088 4526 -3070 -10989 4682
484 4682 15924 2003 -12385 -4950 11827 9336 -5012 -7907 -2100 7826 6382 -8879 -8886 3807
498 3807 8390 -814 -11279 -5170 7077 9106 -1728 -16790 -6365 18325 12072 -14670 -18415
511 -18415 7142 21037 3255 -14006 -11687 5237 21567 8875 -19541 -16962 14466 25003
523 25003 -4351 -24768 -4908 16266 11666 -7326 -17932 -3962 13137 8679 -7977 -13130 433
536 433 9127 4145 -3156 -8927 -3351 10921 6761 -10321 -8757 10040 11848 -8215 -9187 9193
550 9193 9964 -3940 -6618 1720 5788 2176 406 -3413 -7427 1457 9788 1547 -12472 -9725 8214
565 8214 10478 -5207 -10811 -1321 5652 2450 -157 675 -5757 -7558 8625 14900 -4422 -18096
579 -18096 -660 19887 7024 -13642 -7486 8420 8728 -2178 -4978 472 -366 -1697 3138 3148
593 3148 -5952 -8677 3808 8857 -6422 -9754 6296 7414 -8855 -8009 10813 9592 -10462 -9313
607 -9313 8618 9966 -2270 -6154 -746 2774 5410 5839 -3499 -9898 1425 12467 5234 -9408
621 -9408 -10155 4055 10550 1062 -10518 -7756 5258 6363 -3206 -5074 -1575 -1258 596 5495 982
636 982 -8807 -3428 9946 5009 -7407 -3182 6907 2280 -5038 1045 6895 -1441 -6735 2136 8497
651 8497 376 -7561 -2788 4996 2963 -2760 -3754 -1449 260 -14 171 -112 -2504 -2943 -369 3817
667 3817 3420 -3410 -6151 1621 9308 3821 -6677 -5417 4525 7443 2243 -3500 -4603 156 6347
682 6347 4799 -4455 -6875 1955 4907 -457 -1910 -1029 -3296 -2033 4068 2566 -5697 -4418 2498
697 2498 1346 -809 1436 -171 -4090 -353 6010 3384 -3180 -2013 1155 2851 4421 838 -5364
712 -5364 -2871 5914 5385 -3489 -4413 1056 1078 -630 775 590 -4138 -4111 2520 4738 -1443 -5875 -2625
729 -2625 3355 4202 -894 -4292 -1280 3005 3379 989 -1222 -1775 431 3635 3087 -858 -2826 -866
745 -866 2552 3711 -1088 -4881 -1651 3718 2137 -3109 -3055 -131 -66 367 227 -1951 -2248 507 763
762 763 -451 526 1106 -2247 -1941 4197 4000 -2262 -3029 2109 3426 1126 106 -772 -1680 793 3962
779 3962 521 -3606 -1887 1205 1931 309 -2348 -3426 -762 2901 658 -3526 -2105 878 900 -325
795 -325 222 -380 -1277 788 2273 1031 -567 -557 434 1988 1906 -230 -1419 -35 1321 798 -55 -937
813 -937 -1869 -420 945 86 -1533 -1675 -1000 384 915 -602 -2544 -1342 2115 1012 -1404 -732 468
830 468 416 792 953 33 -246 865 1153 -44 519 965 -713 -763 1280 1283 -1235 -1600 578 297 -813
849 -813 -570 -904 -1365 -287 438 -708 -1059 -501 -283 -218 1056 422 -801 172 1463 682 161 351 925
868 925 409 703 1259 118 -469 361 524 140 -476 -1074 -431 565 60 -1749 -1323 456 -63 -806 -693
887 -693 -944 596 590 -96 -904 -187 1767 753 -762 533 880 528 801 837 -82 197 1231 811 -824
906 -824 -305 455 -157 -408 -206 -683 -616 198 291 -1588 -1129 837 427 -967 -438 46 -28 307 404 -258 29
927 29 1249 698 -16 806 734 47 835 1093 -232 -982 797 1341 -758 -1423 253 695 -432 -1256 -1602
946 -1602 -262 526 -503 -1555 -766 954 256 -820 -359 -151 503 1124 556 -331 187 1441 1011 94
964 94 447 599 223 918 512 -450 -785 423 652 -764 -1007 186 -833 -840 92 -349 -1185 -676 4 246
984 246 171 -541 -1334 402 2629 -268 -2094 434 2682 865 -1396 100 1486 703 23 -539 -763
1001 -763 872 1082 -397 -1578 -205 998 -143 -983 -1010 -491 270 403 -1136 -1904 -89 1511 687
1018 687 -1218 -1220 283 2071 1710 -1252 -1892 1869 3288 -223 -2557 251 2573 313 -685 154 62
1035 62 -140 231 265 -893 -844 -370 357 40 -573 -1468 310 1709 -991 -1851 136 1516 166 -1020
1053 -1020 -86 539 1180 1547 -375 -1653 830 2817 1168 -1669 -1835 1154 2318 392 -1874 -2424
1069 -2424 436 2146 300 -2266 -2570 455 2256 1184 -2509 -3394 1378 3900 -696 -3665 -152
1084 -152 3660 1232 -2371 -133 2140 568 -78 221 140 179 836 811 -747 -1216 307 1751 373 -2589
1102 -2589 -2375 1844 3076 -1868 -4028 -34 2959 559 -2458 -1473 211 830 1333 -384 -2105 -946
1118 -946 2600 3062 -999 -2606 179 2817 1293 -949 -1014 438 606 300 230 -638 -1709 -93 1847
1135 1847 68 -3317 -1224 2275 619 -2453 -1092 1839 670 -2090 -587 1595 660 -841 -510
1150 -510 972 989 216 487 491 -577 -641 1687 2137 -1272 -3581 1275 4158 -185 -3918 -1664 2460 1369
1168 1369 -1030 -1385 -1332 -348 1446 1420 -1338 -2900 16 3082 940 -2057 -1496 1077 2059 261 -544
1185 -544 41 -19 554 1366 382 -426 -547 692 907 -377 -510 186 13 -1118 -701 861 861 -1721 -1703 499
1205 499 1651 -10 -1898 -741 817 945 314 253 -784 -848 1270 2946 132 -2585 -229 2569 1765
1222 1765 -1135 -1788 117 1293 692 -259 -1509 -819 91 508 319 -1103 -1449 -283 957 126 -1380
1239 -1380 -1075 372 542 -125 -277 143 -1 210 693 769 -149 -337 467 696 421 -21 -5 -122 -312 639
1259 639 540 -703 -1230 -495 1130 365 -1024 -1174 -282 587 672 -205 -770 -939 285 1415 347 -921
1277 -921 -562 579 1487 647 -800 -557 661 1188 450 -318 -466 -176 531 1168 262 -1028 -817 556
1295 556 662 -451 -767 -510 -381 289 318 -64 -616 -340 589 512 -72 -453 -430 495 967 499 -46 -354 32
1316 32 738 554 32 -496 -476 94 688 6 -829 -701 -190 486 162 -482 -943 -523 261 232 -168 -426 -494
1337 -494 376 827 277 -365 -273 679 665 662 322 -335 -40 635 352 -57 -237 -258 285 -65 -17 -358 -461 -69
1359 -69 57 -287 -314 -371 -168 -217 71 -67 -286 -420 297 289 105 6 174 456 192 464 306 -186 115 490
1381 490 411 183 -222 -189 107 345 -103 -582 -285 127 231 -35 -611 -369 -87 121 -298 -394 -228 168 144
1402 144 -81 123 51 340 375 189 47 86 191 315 247 277 -87 31 21 -244 -85 -174 29 -367 -697 -200
1424 -200 119 -118 -333 -264 -240 134 -47 -416 9 13 380 64 -41 156 174 238 216 118 208 -55 311 323 -46
1447 -46 -281 166 184 19 -436 -298 65 77 -16 -739 -583 65 -34 -495 -274 -117 334 243 -7 -381 -96 702
1469 702 569 70 -69 -44 564 907 -66 -355 15 503 517 -479 -507 196 257 0 -575 -188 -139 196 -20 -660
1491 -660 -155 419 91 -102 -510 -15 428 214 -62 -213 -16 876 482 -117 -80 249 736 445 -374 -406 -21
1512 -21 553 148 -722 -440 420 316 -392 -768 -618 230 -183 -294 -542 -305 262 205 203 -210 -281 788 886 158
1534 158 -429 -52 1062 873 -201 -425 198 920 469 -653 -379 64 426 -3 -704 -647 112 322 82
1553 82 -791 -290 -191 421 24 -374 -458 492 676 -279 -175 -165 756 685 185 -585 -250 756 939 -330 -427
1574 -427 365 520 67 -633 -344 278 275 -201 -630 -666 132 258 62 -552 -889 345 881 -84 -1055 -523 890
1595 890 1250 -151 -886 153 1361 713 -428 -554 182 1013 614 -606 -753 -98 214 286 -343 -613 -621
1614 -621 111 680 -193 -741 -228 415 88 -295 -570 277 266 -7 70 -91 455 363 -183 -312 514 522 368 -535
1636 -535 -504 711 634 179 -882 -458 346 501 -322 -587 -401 126 301 211 -959 -1182 224 1061 368 -1395
1656 -1395 -1061 675 1096 -70 -792 -270 685 404 197 274 -636 136 670 587 -266 -881 103 877 181 -749
1676 -749 -350 207 212 -338 -51 92 -121 -488 -12 317 4 -370 -104 112 216 322 221 -346 -642 442
1696 442 1360 208 -1146 -785 965 1011 97 -802 -512 201 782 609 -735 -903 -449 1012 1041 -1249 -1400
1715 -1400 142 1018 408 -714 -756 45 275 403 512 -501 -665 253 1118 820 -406 -591 208 682 -22
1734 -22 140 -206 -360 -153 369 663 -339 -650 -412 340 337 -338 -514 -231 -108 341 402 -443 -719 -191 1038
1755 1038 521 -763 -477 91 901 751 6 -600 -80 263 604 105 -688 -651 219 323 52 -704 -573 202
1775 202 334 27 -593 -237 46 93 409 -238 -444 -178 391 772 -197 -428 -59 289 665 262 -52 -69 47
1796 47 650 381 -159 -528 -201 42 504 -100 -407 -293 260 360 23 -534 -390 -242 506 309 -123 -387
1816 -387 -37 498 366 -67 -432 -308 174 749 476 -380 -469 52 479 327 -104 -448 -255 129 410 -358
1836 -358 -588 -339 50 231 27 -377 -488 -1 392 487 -131 -362 -379 451 379 149 -264 -407 424 621 455
1857 455 -106 -421 134 228 397 -313 -456 -40 121 417 -135 -798 -192 63 220 -27 -311 -372 82 296 225
1878 225 -18 -560 -183 266 393 9 -67 22 212 148 245 -121 -117 45 408 251 70 -201 -90 142 -35 109
1900 109 -375 -95 197 -127 -30 -374 -268 2 33 488 -168 -178 -11 392 266 255 -94 139 468 181 -42
1921 -42 -192 -41 -41 21 133 -345 -408 124 18 -198 -114 -576 -412 -31 263 -301 -225 -73 -61 238 -7 -267 -248
1944 -248 125 149 -19 -64 -388 -70 128 132 29 170 238 -80 56 115 -14 -161 -18 68 118 -207 -133 -171 -30
1967 -30 -18 -114 61 -154 -383 -42 127 -5 -49 -139 88 373 112 12 78 88 220 -91 -11 -121 376 329 269
1990 269 230 -279 -14 248 -98 -270 -555 -25 126 34 -265 -168 216 11 -295 -379 -55 28 159 -210 -195 -270
2012 -270 59 44 39 11 102 533 192 102 -331 -118 375 31 -491 -321 246 269 -25 -350 -475 -196 341 -156
2034 -156 -614 -91 146 -211 10 -233 -112 185 142 50 -321 -169 77 73 115 72 -10 155 111 34 -127 -96 157
2057 157 93 -29 -229 -118 223 -329 -367 182 15 103 -192 -320 -239 168 240 150 -177 -48 268 355 148 52 23
2080 23 249 293 -99 -207 -334 285 142 -417 -358 19 108 -104 -269 -435 42 88 244 -180 -339 -45 371 320
2102 320 -96 -200 168 395 220 -224 -194 184 174 102 -230 30 145 134 -432 42 9 224 -113 -209 -329 19
2124 19 117 -11 -300 -134 210 -66 -80 -194 -198 120 251 170 -235 -133 182 297 205 -556 -88 361 380 -19 -354
2147 -354 -205 427 35 -162 -457 -118 64 154 -276 -286 -248 131 396 -65 -316 -42 313 171 -29 -494 115
2168 115 292 232 -134 -115 60 232 109 -125 171 361 -163 210 109 1 96 -136 -135 213 -22 -23 -216 -167 -119
2191 -119 178 268 -103 -464 -77 182 65 -65 -315 54 312 288 -4 -130 -216 220 234 16 -482 -393 423 225
2213 225 17 -402 -321 -45 347 20 -50 -258 -5 275 -178 -175 -430 -54 212 -137 -290 -199 155 41 -16 167
2235 167 79 -127 -51 -39 302 -2 -184 -19 -149 217 83 139 -103 -418 291 170 123 -435 -298 252 452 -63
2257 -63 -349 -8 158 241 -148 -142 -321 56 378 248 -208 -534 -8 599 286 -188 -87 231 174 189 -51 -100
2279 -100 -188 163 251 -164 -295 -405 132 126 68 42 -256 49 26 247 -53 -278 -201 111 374 207 -15 -324 223
2302 223 301 353 190 -182 -128 309 588 211 -267 -235 107 409 124 -298 -549 -127 208 224 -156 -414 -374 61
2324 61 426 -297 -356 -399 -68 215 200 -197 -426 -2 256 289 -58 -437 -186 211 379 -99 -265 -396 60 338
2346 338 86 -273 -402 -63 328 290 -24 -255 -203 -91 366 60 -68 -37 15 242 318 -38 -20 -35 106 464
2368 464 69 -143 -55 185 230 -14 -185 -236 115 45 -202 -234 -366 -244 150 156 -158 -79 19 149 205 64 -127
2391 -127 -119 312 176 -62 -199 -126 -100 213 142 -297 -185 -121 171 240 197 -303 -442 52 171 -110 -172 -100 -151 243
2415 243 3 -99 -234 -134 225 255 -34 -87 -45 155 75 -157 -219 -328 146 394 -33 -106 -211 -255 102 374
2437 374 190 -164 -183 -359 110 -10 -215 35 -124 221 106 -150 -279 -114 65 186 89 -191 36 217 188
2458 188 169 -254 21 264 292 117 273 86 -3 -158 182 307 -238 -300 -95 -106 68 -75 -118 -132 8 180
2480 180 -150 12 -87 -99 -26 159 -144 -99 121 591 5 -45 -75 2 -16 5 -302 24 227 207 117 -228 1 55
2504 55 18 61 77 -73 29 -142 110 -233 62 -99 -180 -200 28 208 203 -121 -57 -91 -41 17 17 -122 143 149 -111
2529 -111 286 -48 206 330 287 167 -47 -20 -115 189 -6 -271 16 151 -37 -152 -198 8 346 -98 -185 -130
2551 -130 41 -62 -19 -119 110 360 -52 80 -1 140 178 164 -123 -495 -59 125 -117 58 -341 75 2 -104
2573 -104 -317 69 166 359 117 -74 -164 66 -89 110 -256 -143 -49 160 -64 -127 157 207 332 10 -124 105
2595 105 110 18 -44 22 -57 118 -16 19 7 268 202 -55 24 -213 37 47 -19 -303 -78 190 -2 -188 58 -292
2619 -292 -34 145 198 -35 16 41 174 -47 33 45 110 222 -67 -543 -98 -170 386 -60 -38 -84 325 25 -172
2642 -172 -265 -24 200 112 -199 -276 -131 -24 12 -89 193 134 243 -94 45 42 219 163 -304 -87 58 -3 12
2665 12 -107 -154 -258 35 -171 -19 -202 -243 42 170 -104 -31 -23 71 84 -23 -166 -8 325 -58 -120 45 37 31
2689 31 -68 27 60 199 44 -172 -216 -55 158 139 -199 -95 -100 236 85 -303 -230 -166 -63 162 -274 -235 50 141
2713 141 213 -70 -17 91 298 -436 -282 -3 51 124 75 -68 -35 -50 97 147 -388 -152 -30 186 -22 153 22
2736 22 33 34 33 -235 -49 254 -70 -114 -125 -228 42 101 -145 187 166 111 100 -425 52 298 -109 28 -173 -26
2760 -26 164 233 57 -235 41 47 136 -228 -443 -249 86 188 -68 54 94 202 125 47 -28 -181 -2 67 146 253
2784 253 26 45 137 -148 -36 -14 -157 -159 -71 124 12 279 19 -13 121 -89 -229 -434 -222 29 -195 -7
2806 -7 -213 -124 -8 293 -63 -136 32 301 283 -48 -149 -27 -20 236 180 -89 -326 21 -6 111 147 26 -175
2829 -175 -8 109 -50 -17 41 -130 23 329 -51 -13 -15 -110 -48 55 -61 -350 -54 66 217 -124 -276 -113
2851 -113 490 -2 -207 5 -2 74 119 -7 -226 -198 177 -4 171 -44 -61 -285 14 -38 -159 -8 78 -78 90
2874 90 95 1 -135 153 68 -60 126 -152 -73 162 -144 -168 -160 -103 200 24 -211 7 -117 -19 275 -117 -86 -131
2898 -131 13 185 79 -219 4 56 -23 -55 77 -158 -377 225 79 47 -58 -132 -29 3 110 11 -29 -154 278
2921 278 33 141 -69 99 43 -37 354 31 -39 105 102 258 -160 -223 153 434 -23 -58 -61 -145 219 266 181 146
2945 146 -190 165 132 180 22 -22 -222 261 -57 -18 -215 -156 -79 119 -259 54 -49 -92 144 9 91 -169 122
2968 122 -235 200 64 -100 155 213 -116 210 -136 -156 -151 40 318 -81 -255 -140 121 181 -194 53 103 156
2990 156 153 122 -59 -115 101 -156 -58 33 -121 17 37 -48 -89 54 44 -197 166 -6 95 -120 -93 205 202 -18
3014 -18 -77 72 -21 -215 170 -77 0 116 251 283 106 -92 -160 -98 111 -158 -165 94 -49 111 -33 136 137 88
3038 88 256 -121 -57 165 -30 -91 17 -422 -58 -30 268 -116 -121 71 27 -181 -118 -300 -69 48 91 122 -133
3061 -133 58 -96 -9 49 -9 -73 107 17 53 -212 133 146 -265 32 175 171 -196 42 -147 0 47 34 -92 -10
3085 -10 227 139 -21 -87 19 -50 327 216 -121 -110 207 196 206 17 55 -65 66 129 -181 -96 -112 -7 -4 -177
3109 -177 111 102 47 186 86 -240 250 -90 -179 55 51 -38 110 -111 -74 6 210 54 54 127 129 332 43 -63 92
3134 92 -18 142 148 -51 -62 71 124 -85 -124 -79 105 -18 85 48 86 90 -41 112 -135 75 51 -75 115 -95
3158 -95 71 -4 88 0 -212 72 81 56 137 169 -149 68 160 170 -218 -84 -75 -201 -134 133 274 160 -297 -162 -78
3183 -78 -117 244 66 107 240 22 92 -182 -170 -117 146 -15 66 -121 -184 211 -288 -197 62 222 136 10 107 -24
3207 -24 8 -121 -142 -99 -24 107 -83 -32 -93 382 169 24 -145 -435 -9 32 421 -58 -183 30 128 72 -44
3230 -44 -37 101 -147 -214 85 29 65 173 -106 -112 -64 209 11 110 104 -190 122 -12 157 -112 153 239 -298 -99
3254 -99 -212 237 -101 69 92 78 90 93 -116 -63 -130 81 51 71 -167 -169 302 -80 -305 -268 -162 66 31 123 -59
3279 -59 -19 113 43 166 -100 -122 167 -4 56 123 -28 -229 106 -378 -18 -161 -28 -168 -134 -108 -17 -154 -34
3302 -34 105 -254 56 76 139 -159 53 -189 83 -113 -113 83 -43 -407 463 56 173 287 -147 87 46 179
3324 179 146 -76 289 105 87 -35 -106 56 -261 18 284 27 58 -279 -80 -84 103 -293 -262 -91 98 85 -94
3347 -94 -36 -67 53 -1 -125 -138 -44 13 132 -46 -54 36 184 53 -12 -149 110 -233 113 52 -19 -227 57 -12 71
3372 71 214 138 -5 48 56 -40 195 172 45 42 92 -8 -13 193 -106 233 -116 34 -27 -248 66 106 -81 21 40
3397 40 -177 73 115 96 81 -252 199 147 -286 -23 -79 -135 -113 -175 8 -42 91 159 -52 25 -67 -64 88 80 11 184
3423 184 -34 -105 -148 -32 208 -48 -94 26 33 -106 -155 182 44 -13 -68 104 215 123 -15 14 65 -36 -243 -10
3447 -10 67 107 -44 232 14 -256 -201 -267 94 56 -330 -159 -79 8 46 -115 -6 9 -58 78 -25 7 106 -61
3471 -61 181 -157 -320 17 37 -68 20 -43 -56 49 -257 179 183 7 -88 -17 179 -268 -32 81 -8 -89 -184 -205
3495 -205 214 232 88 114 -150 -125 84 -134 -53 -1 8 74 163 -33 91 62 -170 -210 -81 -154 58 -4 -204 225
3519 225 -142 83 -20 -18 -175 297 101 17 -79 111 111 10 -28 -116 85 216 146 54 -130 6 92 3 13 88 20
3544 20 151 69 -159 69 -4 55 20 96 239 74 145 141 -18 76 -50 -83 128 61 127 111 118 32 39 241 -151 -157 260
3571 260 292 181 44 -154 -252 70 147 -179 -221 180 9 57 81 199 -108 -101 3 153 -31 83 37 66 256
3594 256 223 197 70 189 1 53 60 167 2 -144 52 172 -1 82 -16 59 -32 -46 -174 -334 126 40 124 74
3618 74 -56 149 -75 -267 -11 -62 67 31 255 245 -65 -156 174 133 142 99 164 -110 191 -118 61 141 262 -41
3642 -41 193 -92 -337 -23 12 64 -292 -45 158 112 -1 -115 94 -47 54 -174 72 -177 -98 -140 197 55
3664 55 100 224 -85 94 183 123 30 97 44 126 -227 -237 -68 -36 220 157 -204 -31 -197 -82 -52 -167 108 14
3688 14 -15 -29 160 -15 -81 80 116 -37 -143 -135 -112 -18 10 34 -87 -39 95 -77 -85 80 39 -79 24 58 2 -11
3714 -11 -18 -162 -15 -149 22 -128 -7 66 87 -2 148 -65 -152 -23 -4 -29 16 61 163 146 212 -286 -70 -13 170
3739 170 -102 48 53 -12 -113 -138 84 -194 121 -272 -39 -110 -202 190 197 174 16 48 -212 -61 225 204 15 110
3763 110 -54 -81 -87 -225 108 -165 172 101 -55 -23 -134 -269 -86 -17 -51 284 -183 -101 -112 149 4 -36 -3 74
3787 74 -160 -88 115 -60 8 -127 186 -46 -67 50 7 -39 59 -281 -86 95 201 -49 87 60 163 -170 -180
3810 -180 45 -190 9 -161 387 16 -6 -45 -23 64 168 -57 -29 -77 62 37 53 -223 182 -3 111 63 109
3833 109 174 127 -131 -19 -43 -174 288 -110 -55 -21 -232 -145 -55 179 136 245 -138 99 -132 -110 81 107 166 187
3857 187 -79 26 34 -125 136 22 31 -9 120 79 164 -176 76 47 -236 68 115 189 -113 -61 -161 11 48 -1
3881 -1 23 -109 38 48 70 -21 77 178 -142 118 24 -16 37 112 86 -229 -103 -7 231 -174 -33 -84 -31 10 -118
3906 -118 38 16 13 -22 -61 -56 455 -78 48 164 18 -270 58 -10 -92 175 195 -110 -109 -186 -62 98 101 -36 -157
3931 -157 -66 -243 -6 -204 -183 53 87 65 32 -271 110 102 175 404 125 169 170 -31 -172 -126 80 -37 -125 -158 -72
3956 -72 132 113 66 -14 289 107 -62 -247 -186 145 -36 72 -276 -208 -321 29 -201 143 92 231 150 177 -29
3979 -29 82 175 1 -68 -121 -94 -99 7 142 59 78 123 -10 41 195 112 23 123 -161 33 -331 6 56 25 -179
4004 -179 71 23 -98 106 76 23 75 80 -74 14 208 -30 20 -147 -86 94 237 -43 -40 134 -267 -38 54 124
4028 124 62 46 275 204 -40 -137 94 208 -118 106 4 -25 -110 -70 150 155 -141 -166 -67 -24 -272 17 210 -169
4052 -169 231 -42 44 -42 -68 -100 43 -138 -130 -138 -74 -116 104 29 -113 213 -140 116 29 50 -179 98 -19 265
4076 265 -240 118 87 136 -54 -72 47 -130 -88 -56 -11 -141 1 -140 -9 104 153 105 -36 8 -24 -205 54
4099 54 -73 -94 -196 63 64 65 34 -28 -103 18 52 125 -54 -95 -228 58 183 -227 14 219 -103 -99 50 -204 -396
4124 -396 -22 -252 15 -75 51 -51 -167 128 -33 254 -43 -66 -5 -223 -120 -70 157 86 222 -146 96 -282
4146 -282 -42 100 -157 -82 -6 94 -151 -135 -255 -316 -210 56 -94 -196 -100 -70 -195 -152 195 302 -4 69 13
4169 13 -13 -66 -94 -136 56 112 140 33 212 170 -92 -63 153 74 47 141 266 -159 -10 -108 87 -2 9 183 166
4194 166 -86 -93 -150 188 -70 150 -319 86 -139 52 181 -232 -246 -52 148 -370 -58 186 12 11 -108 182
4216 182 -183 -64 95 47 -72 -216 -115 -113 26 129 -53 -66 -45 -242 18 -151 116 -10 -32 257 -82 5
4238 5 105 126 -101 -53 -145 -234 34 94 -163 114 3 251 -25 -9 -62 45 -151 32 35 -8 -180 -114 -247 -19
4262 -19 72 4 -33 133 -63 55 -63 -8 103 26 50 166 194 -1 126 134 -81 -57 -100 193 25 -73 189 119 26
4287 26 86 102 -127 72 -37 184 -28 -58 132 134 121 151 -118 -192 113 -2 -198 71 -104 -216 263 -243 91
4310 91 201 -55 -248 -16 90 80 -58 33 -89 -51 -257 -139 -164 -60 159 -100 20 -320 297 119 158 -66
4332 -66 111 -83 -166 -125 71 173 53 -203 -29 -114 -4 107 -305 107 -103 -75 -77 25 -5 -50 36 37 -168 51
4356 51 -48 -167 -280 -131 -224 -49 -7 -28 213 -16 -235 8 -8 138 -20 -35 223 -24 -16 -125 -92 -132 100 55
4380 55 -204 -105 145 -191 143 -31 65 -162 128 -23 97 35 23 15 -37 22 -160 -178 -77 -132 73 13 65 38 116
4405 116 8 -53 -243 18 -67 83 273 -145 -21 214 -126 -59 -164 -1 -19 -142 147 -59 -60 127 55 -205
4427 -205 170 21 -8 162 13 -264 98 80 73 65 -169 -183 -113 -44 -40 -118 93 84 113 -39 99 -24 10 52 -229 52
4453 52 -157 16 197 90 -50 -214 249 -48 -79 102 10 -42 -131 -54 12 -162 -7 -271 26 -85 -300 65
4475 65 -159 -49 121 -153 -352 76 -167 -101 -132 140 -69 315 -107 59 -26 -50 -5 -29 -210 -100 110 95 -83
4498 -83 168 -164 -149 -196 -169 217 63 -62 -150 14 -149 110 114 19 -108 283 76 -76 -136 -56 144 78 -167 -72
4522 -72 55 169 125 179 -43 120 59 0 -143 220 60 -208 20 -181 -19 -235 -149 52 125 -131 121 -199
4544 -199 241 -68 -157 131 68 30 134 47 -3 312 -142 -172 -55 -167 -193 -47 -5 31 -70 87 60 -155 -54
4567 -54 82 4 135 -11 -110 76 1 -57 56 -157 -363 -75 -112 140 357 -8 159 56 5 -275 11 98 -74
4590 -74 29 -106 -219 -118 24 114 305 -104 99 216 -27 38 22 117 23 -171 80 146 -7 -149 13 -56 23
4613 23 -51 -47 -190 -95 46 242 -223 -302 -11 -99 -114 99 98 -349 18 -145 -245 46 -55 12 -1 -187 -50 -32
4637 -32 -147 -54 177 -10 135 -208 7 -173 -77 -120 -124 84 -141 -49 173 -31 -23 204 179 13 -61 14 -128 -75
4661 -75 -31 -30 -119 -123 15 48 123 -193 148 61 -28 219 199 200 -171 -16 -30 -117 111 7 274 82 58 -92 -251 82
4687 82 -218 -155 -31 -31 -88 27 251 120 -142 -78 50 64 -21 -158 -110 -117 -75 -237 237 93 -27 -156 229 -153
4711 -153 -69 -60 -162 31 249 134 163 205 -130 11 -136 -29 252 111 -88 -162 8 -351 12 69 201 97
4733 97 -131 -26 18 198 30 -18 57 29 -166 31 232 -32 -6 -117 -77 -65 112 41 22 65 6 -126 99 -64
4757 -64 -42 124 -33 128 25 -264 -232 -152 35 5 -99 51 35 28 -70 -92 -8 20 -116 3 51 153 126 -86 -161
4782 -161 -83 85 8 -32 41 -19 92 77 -207 -150 217 113 106 217 -68 -252 68 188 297 129 22 71 -264
4805 -264 -122 7 248 -55 104 98 -37 37 40 26 -133 -64 10 -88 43 19 83 218 246 24 31 -21 -244 48 -165
4830 -165 57 29 -159 -154 -146 -201 49 -57 -92 232 19 220 47 -182 41 78 -4 114 -3 40 -15 -5 -185 177
4854 177 122 133 -31 -50 -2 -266 11 -78 -28 -26 58 -159 120 -119 119 -83 153 147 45 7 175 251 -14 179
4878 179 57 62 -161 -161 -151 145 -220 -247 25 -10 -115 228 27 -61 75 -44 141 -169 54 26 212 95 -133
4901 -133 -34 -72 50 15 289 -118 29 -119 -115 46 166 -83 -3 29 68 102 -204 -242 2 12 -16 93 -159 -38
4925 -38 -75 -244 197 83 -192 16 -49 20 -124 -239 -57 -56 11 138 61 78 107 -33 105 82 47 -144 -14 325
4949 325 170 -19 -16 -88 44 -17 -40 -136 -93 25 4 -140 96 -343 99 -208 -98 132 108 281 -106 128 124 182
4973 182 80 -217 -53 -3 -30 -205 -49 77 -146 235 30 -2 -79 -64 8 -51 109 71 215 -38 -111 -61 70
4996 70 -45 -16 -46 211 55 229 167 60 131 13 94 -8 129 117 88 -254 -138 -86 152 126 59 -1 79 -99
5020 -99 239 263 0 45 -6 -277 1 -29 -64 55 -99 -197 23 -61 -256 74 -266 37 36 -100 -83 70 -177 80
5044 80 -64 -200 1 -81 18 -32 34 -80 -149 -194 9 -106 -77 53 -87 -65 37 236 6 125 297 -131 54
5067 54 119 -16 -279 -27 -72 -264 -173 -117 -32 -109 220 42 -226 94 -1 53 -170 15 -65 53 -213 146 252
5090 252 23 204 45 98 91 125 -78 2 144 86 -137 -80 -269 187 -106 115 -14 -162 46 -12 30 -55 -257
5113 -257 105 -34 100 128 -402 93 -252 -128 39 -102 39 88 -55 -7 -79 44 74 -18 116 164 107 -48 -151
5136 -151 281 68 128 2 7 101 -16 -25 40 40 -74 -44 -163 -167 79 -260 -238 59 -192 146 -112 -246 -195 92 164
5161 164 262 24 -61 35 109 -72 -114 100 -231 96 -115 -81 -61 -39 -167 250 171 100 -14 -103 -39 -51 -23 70 -138
5186 -138 -7 -47 -28 -12 -183 -14 17 50 183 55 -128 -113 -226 -42 68 204 5 -85 31 43 138 3 98
5209 98 167 64 -18 -126 7 53 170 207 -35 305 46 -34 102 248 236 -102 93 148 -89 -212 0 -122 170
5232 170 -157 158 39 9 -13 -230 -32 -28 39 -168 -50 -113 64 66 -93 -289 26 -70 -107 290 18 -1 157 3
5256 3 -8 299 -171 29 306 54 -21 -63 -14 -108 -246 128 126 52 214 57 20 15 1 387 8 42 -110 123 122 164
5282 164 -9 -52 -46 115 61 199 -69 -132 -105 90 44 -121 -87 104 -140 -92 52 -58 -141 -75 -162 2 41 -240
5306 -240 -95 -24 -79 -223 117 -54 -167 -7 -28 166 74 44 -110 158 88 -12 229 31 -30 -29 35 -15 84 134
5330 134 91 25 92 178 100 -290 67 -112 24 40 -76 70 -15 205 -65 193 -90 -85 -291 108 -47 -69 73
5353 73 -64 -24 54 -174 83 144 18 -239 110 -220 95 -70 -158 17 -72 -25 -64 1 -66 50 -19 -9 -371 -234
5377 -234 -150 -66 79 -178 140 -85 102 46 -153 226 261 -140 -20 189 25 168 -44 67 53 -231 36 22
5399 22 -143 139 -149 82 -165 81 127 64 326 -247 -10 -190 -90 -355 -20 19 38 -60 85 62 134 211 -148
5422 -148 186 144 -146 -159 294 182 -204 11 -202 -33 -127 -113 -18 130 54 171 -96 -48 -13 -49 -15 -95 42 74
5446 74 143 11 -231 -58 342 26 -62 -249 -58 29 -78 -171 -130 -97 34 -103 -124 86 244 30 -128 -307 104
5469 104 206 23 -152 -320 1 252 0 155 -31 -48 137 3 -75 -332 6 266 55 22 -27 -119 85 24
5491 24 -124 -138 -118 -155 -113 -59 -141 -6 150 -273 77 119 -53 234 -56 174 125 210 124 -99 -162 197 -68 153
5515 153 -15 148 -47 117 -156 -120 24 -90 -142 -109 -9 -9 70 -112 -42 -109 -20 26 -317 17 -128 -38 -71 -10
5539 -10 9 149 -120 -60 192 216 80 123 -171 -106 -14 -32 -120 31 31 -14 -222 24 22 -97 244 -112 28 77 99
5564 99 284 83 171 -93 66 337 225 220 3 52 29 307 -6 -8 -93 -5 -7 85 46 -141 -10 -46 97 85 -74
5589 -74 -32 -61 38 41 -129 43 28 103 295 -42 -188 35 -123 189 46 45 249 -237 -38 54 -67 59 -146 122
5613 122 -52 -21 88 137 57 6 -153 66 153 -86 169 -122 -141 -112 -193 8 -196 31 14 -78 139 -56 -25 84
5637 84 99 265 133 -125 -40 -45 232 -281 -41 -103 9 -66 61 -182 -129 45 242 41 0 158 -29 244 112
5660 112 64 -75 167 -245 -36 -4 95 -178 287 62 154 60 -170 -204 55 -78 -194 -76 115 -103 229 150
5682 150 30 -62 -334 -10 121 93 -123 -53 -77 33 -82 144 184 42 123 152 1 194 206 -153 -38 60 85
5705 85 -107 159 184 -151 47 230 -64 7 -61 -45 -25 -90 -11 88 107 -11 24 31 161 -49 92 230 -69 71
5729 71 -114 -86 -215 -217 297 14 -127 -139 -37 -88 -32 -11 -63 19 -305 10 101 -43 -59 36 357 81 183 -81
5753 -81 95 65 -39 161 54 75 76 -51 158 205 71 -19 -16 -62 13 -44 -243 69 -236 -25 -45 118 -63 -31 187
5778 187 -35 41 -23 -74 73 69 92 -70 -109 -15 91 117 -23 -162 31 -95 224 -89 160 2 157 -262 53
5801 53 -66 336 142 189 36 -88 50 -155 124 -84 128 97 -201 -56 108 -21 -186 132 64 90 23 22 -181
5824 -181 234 121 106 -29 117 31 -52 -110 -93 -155 -178 150 151 -146 108 -103 -70 -287 72 -154 9 234 53
5847 53 83 -3 -166 -121 -158 103 -139 88 71 -15 -363 -40 57 -27 77 -96 20 66 95 50 80 -52 -43 -128 164
5872 164 -105 -32 -284 177 92 30 -11 224 -18 21 114 -180 -42 141 -74 -48 -321 53 107 -10 -115 67 -138
5895 -138 50 51 -41 -87 74 21 -111 -188 99 -64 -26 153 -138 -19 20 -133 36 100 -63 -110 -139 175 87 123
5919 123 136 -216 -59 -78 -25 -97 125 -92 176 70 -124 -109 -95 87 0 9 -21 63 5 -243 2 -101 -53 94
5943 94 128 124 -138 38 98 62 -176 45 70 -111 -99 -153 203 246 137 36 3 -126 163 51 43 -72 75 -243
5967 -243 -132 -32 -201 25 82 -113 -288 56 46 -89 55 -157 -118 33 56 -108 -187 -163 -1 -236 130 196
5989 196 -24 155 24 9 -119 25 -67 17 9 -155 -355 -127 -100 26 -184 -35 17 -152 -240 -140 98 -64 261
6012 261 42 32 100 -84 153 -32 148 179 -80 -102 112 39 -8 -100 -71 106 -85 20 94 191 -37 0 -151 -189
6036 -189 -31 -264 30 44 -55 174 101 -8 5 133 -35 -196 13 69 -4 175 239 22 74 22 -30 -42 172 32
6060 32 7 -30 42 -129 34 -109 143 5 -102 12 38 29 -8 129 133 80 -111 -143 163 162 71 92 196 65 -13 179
6086 179 -8 -8 -203 -105 -192 15 -249 82 136 42 13 66 46 -19 118 55 -59 -90 6 -93 13 16 308 165 168 42
6112 42 16 -5 -10 2 158 27 78 117 -68 -158 104 -134 -30 -98 -90 -65 293 148 -27 108 69 67 -65 28 -50 -77
6138 -77 -15 -187 -98 77 -65 45 -197 -48 71 -94 -20 23 29 -22 -95 187 -15 -27 11 -56 156 -61 -180 119
6162 119 76 -195 -207 -120 71 112 -34 191 -197 84 68 56 77 279 -5 172 -74 -250 -73 -95 -215 -315 -25
6185 -25 123 239 164 -92 194 -87 -224 -96 19 -94 236 52 -252 -69 24 -120 24 -151 -27 92 -63
6206 -63 145 -8 253 103 -247 102 58 11 125 99 67 -15 -172 -153 70 -160 198 29 -57 -208 -2 -255 -35
6229 -35 44 -40 226 99 207 -279 -113 247 -85 -80 74 -103 -126 31 104 89 -141 -94 65 -37 -329 30 156
6252 156 26 -84 7 42 153 -31 -77 -179 50 -99 -100 -88 43 -68 17 -54 18 -206 9 -9 231 -85 85
6275 85 -90 297 -18 -136 43 -32 -35 -93 -112 -168 -74 -36 19 26 -100 -157 208 127 60 -33 187 31 -185 93 146 208
6301 208 -379 116 -5 -103 -72 -109 192 81 -155 32 -107 -22 30 107 -17 40 -189 -101 -323 202 149 -9 -38
6324 -38 27 78 171 -88 -236 27 167 -221 -75 -204 316 50 216 7 -134 230 -10 62 15 5 -160 -113 -121
6347 -121 -66 278 137 146 41 -245 16 -177 -152 139 -166 -193 -74 -204 -55 -256 91 -123 -315 -202 138 -63
6369 -63 165 -174 -118 -11 135 30 -4 -35 -188 69 -33 282 -80 -271 120 -123 -133 -245 -51 127 104 -38
6391 -38 95 90 -199 -141 -15 -73 77 -170 9 186 -85 27 48 -18 23 206 -25 -62 -66 22 162 -204 151 76
6415 76 95 8 -134 -122 -48 -49 -13 -22 77 277 123 -53 -235 87 -104 141 -43 103 -329 81 61 -99 -25 101
6439 101 -212 55 20 -100 3 -4 58 -101 55 68 -109 -119 -112 32 -97 -184 -100 19 -5 -77 68 -76 1 -57 10
6464 10 2 20 -31 -172 23 -2 -59 21 189 30 -34 -116 -189 32 -217 18 80 26 -118 195 -231 12 -47 103 106
6489 106 -89 -437 -219 -113 -68 -47 395 34 214 -300 110 237 -35 -5 6 43 119 -43 51 29 51 277 87
6512 87 -14 -160 -40 -96 16 -55 -27 26 -53 -40 -131 83 90 -73 -162 32 65 -244 100 -86 6 -281 -140 42
6536 42 -21 -5 -45 181 214 -99 78 -199 -172 -241 47 61 -47 -41 140 -216 -22 -27 -59 -195 -2 -8 -43 202 48
6561 48 -130 -179 182 -27 -71 170 -73 145 65 102 77 69 71 -182 -241 73 -66 -68 4 46 -44 56 40 38 112 175 -296
6588 -296 -38 -87 113 242 109 92 172 -162 -76 -188 9 -102 -302 15 39 54 -53 -228 91 -102 -68 94
6610 94 53 -230 -181 106 18 103 -49 -67 -1 55 -186 38 33 60 44 27 51 -111 -57 218 -344 -33 -88 59 -201
6635 -201 29 201 145 251 78 -41 -16 -82 -290 156 -75 -88 259 69 205 -52 -31 -96 -43 -46 -202 -105 7
6658 7 118 -198 -147 8 -109 58 -157 -186 -105 60 51 -3 40 59 -4 -133 27 -166 -23 -87 -54 95 -128 -319
6682 -319 76 192 -292 37 49 122 -249 47 15 94 268 170 132 107 -86 -174 -265 195 152 17 -31 -240 27 -190
6706 -190 141 -22 -113 -37 28 62 -73 -107 -50 197 -53 -40 2 16 -147 -40 -89 -149 69 59 106 -53 -141 64 3
6731 3 -3 -93 -63 -12 -63 -34 -184 -98 34 132 -110 -102 13 20 -247 -97 -119 372 -67 -209 154 -87 43 -174 20
6756 20 45 70 145 106 -18 -108 33 173 112 -30 -78 70 -141 382 -95 -179 82 108 55 104 -87 132 121 -20
6780 -20 79 43 46 77 -156 133 114 -26 39 -199 36 122 -81 -71 137 -24 -41 -174 88 -184 -10 -124 69 158
6804 158 -116 43 140 87 -85 252 134 41 -20 135 -216 46 -195 13 -72 189 90 -161 -11 -119 51 -204
6826 -204 -73 -123 227 -137 180 -47 32 -39 40 -149 -230 -107 -209 -146 159 170 -182 215 -5 -159 -213 135 -186
6849 -186 -54 -204 134 -145 38 -67 -105 87 -20 -43 11 68 177 25 29 70 -88 -39 -69 -162 -364 -43 29 237
6873 237 102 -81 79 106 95 64 -249 2 43 0 225 71 5 188 51 -296 -127 -108 -55 -122 -10 -117 202
6896 202 129 -34 -47 162 -156 193 22 -313 171 -86 261 166 -24 -130 23 -60 209 -41 -28 -244 -34 -45
6918 -45 -67 268 -23 41 -58 -16 -95 67 89 94 198 -81 101 57 -70 -82 170 -269 -115 -44 -10 146 90 -94 -31
6943 -31 -281 172 19 -93 57 -299 2 57 -159 -38 -16 151 -15 181 302 132 34 -215 -17 -281 35
6964 35 -35 -85 -60 307 -96 101 9 14 75 -40 -55 200 18 -11 -465 118 -167 -152 -10 -478 111 -50 122 2
6988 2 -268 -235 -141 29 261 -85 75 5 192 -148 -113 -133 -36 -82 78 45 -61 -76 49 -38 64 -82 35 -102
7012 -102 74 45 72 -55 221 -39 6 46 102 1 -17 -238 -55 16 -136 -220 124 -244 56 -263 25 197 138
7035 138 -145 63 -13 -167 92 -56 174 -1 63 180 18 84 21 30 -73 -60 72 -34 184 -116 43 -242
7057 -242 -3 94 -6 69 125 218 120 51 -199 124 -104 -29 -115 104 74 287 -188 -18 105 -36 35 -61 -12 -4 58
7082 58 20 -133 -61 -2 -83 -87 -142 -166 165 254 -171 107 78 -116 -70 70 180 50 166 54 -255 -68 83 36
7106 36 -85 -248 -94 41 -16 107 120 130 -98 27 -155 -33 93 147 -78 -332 155 -68 249 116 62 5
7128 5 88 2 -31 91 0 57 -13 -5 -54 -39 41 -67 -202 151 30 -29 -70 61 -159 0 -22 -168 76 147 -140 -6
7154 -6 -129 225 -6 -80 49 79 -92 2 -239 -206 176 82 -164 229 78 17 14 -18 24 -54 164 -51 64 -100
7178 -100 -315 -147 -69 -7 -21 99 92 -51 38 114 -168 -24 -14 -334 -161 -161 -145 -44 83 -125 15 -15 90 -209
7202 -209 -84 -22 -17 -69 -73 -56 39 135 -83 -32 -86 -70 -81 47 -49 -126 152 330 187 -2 108 96 -36 -54 -163 -161
7228 -161 71 139 -73 85 -75 -31 92 63 98 62 99 -211 135 22 169 -36 99 97 34 -57 32 -30 95 30
7252 30 -121 230 81 11 139 -149 -33 86 -158 160 -149 -16 17 181 -223 -17 -40 82 4 -172 -53 -31
7274 -31 202 48 -75 -3 -234 -38 -104 -291 -233 76 -206 115 7 95 -121 63 -107 77 21 -157 -64 -191
7296 -191 103 -189 -38 -114 55 185 72 -65 6 141 111 33 -81 -121 51 223 -78 166 -94 130 21 41
7318 41 120 200 -176 120 -176 -86 102 -84 77 -38 30 -42 -101 -178 126 -11 147 -142 -147 -31 53 -288 93 -70
7342 -70 204 -92 -94 -62 -11 -47 29 163 -43 -14 80 -115 14 68 -32 166 -199 -30 28 -101 -77 -5 -56 156 -127
7367 -127 -102 -52 16 -105 -126 -52 68 -112 208 -46 95 268 55 -25 112 159 -155 109 85 -6 -41 95 -152
7390 -152 47 117 98 -69 147 -15 126 233 130 -93 43 44 45 -29 191 -22 -13 -24 105 168 -88 57 -275 -44
7414 -44 -42 -71 54 155 -60 -35 185 82 -124 0 -10 49 -13 -61 -151 60 135 -35 222 153 -229 126 -75 -17
7438 -17 84 86 -240 46 -48 -26 -60 16 19 202 -200 -190 -151 -1 62 -68 -70 241 -205 -55 -45 -164 -60 -41 46 -79
7464 -79 -157 -204 208 -2 199 2 -139 -91 -92 -67 155 124 82 12 -101 -230 94 107 -1 6 -78 -137 -77 -161 -75 -45
7490 -45 29 -111 60 -231 54 226 2 -178 -59 -224 -165 -68 268 40 -230 47 -365 156 -7 -175 56
7511 56 -388 -66 18 -316 -98 172 150 60 -84 16 -126 81 58 141 -130 300 -100 -43 -96 -20 42 29 -106 -134
7535 -134 202 -43 232 7 -34 -6 12 117 77 -92 125 -55 -170 40 281 51 101 40 193 66 10 246
7557 246 -123 204 -101 47 -37 -255 -128 -86 -85 5 65 -51 137 -140 -49 -336 27 -31 -371 -24 -4 38 252
7580 252 -117 -46 91 -74 -83 -165 168 153 109 125 -115 106 -35 -35 -142 -205 -166 -135 -17 162 7 78 55 -200 22
7605 22 35 -198 98 -39 10 -84 283 -67 -77 -227 -213 -77 66 86 -219 70 67 -66 -128 14 221 -195 -70
7628 -70 -224 -79 10 -26 206 -135 -21 27 -117 -111 14 -38 -30 -29 -75 -265 2 33 -18 124 -24 -47 73 54 -46
7653 -46 -22 -26 -15 -76 -92 -58 -93 -74 -123 118 160 141 -148 57 188 -163 52 -322 -176 41 36 -170 63 97 -284
7678 -284 -315 -180 164 -148 -244 288 -135 88 -66 -78 -120 -85 15 98 351 -5 -100 46 100 -110 184 26 -86
7701 -86 -10 -2 143 -301 176 -101 -165 -151 -15 -16 -201 -144 -205 230 8 -38 62 23 102 -85 26 -103 141 103 153
7726 153 -127 154 -192 89 -253 -183 -142 -3 187 -139 -332 -78 53 38 48 92 -330 -14 -9 -66 -122 18 87
7749 87 100 -33 -260 353 80 -74 -49 103 -45 -215 -32 209 185 19 158 -46 90 -36 -18 199 -88 -33
7771 -33 246 -88 37 28 82 62 24 -112 -79 -55 -49 257 135 43 -350 -21 -68 22 137 -29 30 40 77 384 -97
7796 -97 -245 130 147 -149 -22 -19 206 -12 -24 -50 -61 42 -22 -71 271 207 -127 99 185 201 -88 -140 -211 150 89
7821 89 206 -232 250 81 -36 -132 -29 -127 -260 -104 -180 153 -119 37 -21 -62 -66 -82 92 100 -83 49 121 -317
7845 -317 73 16 -228 82 42 -183 -143 98 61 1 -116 -23 -58 -27 -21 -126 86 -159 87 -25 159 220 165 -38
7869 -38 -48 -16 93 107 -121 -190 -240 248 -28 179 -25 -280 43 52 181 128 211 80 -27 -58 73 175 -174 -113
7893 -113 -26 90 -14 -24 18 -65 2 106 15 -50 -15 29 183 -307 19 108 -74 0 68 -215 -106 -142 -110 -143 146
7918 146 -35 248 -200 105 1 98 119 21 141 -61 232 -123 -134 160 188 261 179 168 -4 -56 -43 7 -98 -232
7942 -232 105 299 334 55 245 257 -62 -208 69 -89 -82 -18 127 -94 -12 57 -177 99 -185 -213 150 -44 19
7965 19 1 -21 -23 258 -145 -117 323 -107 40 -70 -216 9 113 176 103 136 252 -176 17 -164 -59 162 119
7988 119 162 45 -345 -9 -15 10 17 10 -164 75 378 107 161 169 57 114 -74 -172 -63 30 82 -201 -73 84 -55
8013 -55 -144 6 -26 -119 -16 198 151 176 205 -242 84 100 200 -42 -19 10 57 6 8 -65 58 151 -94 -156 -8 0
8039 0 9 -60 89 1 108 -8 134 107 -33 78 -124 122 93 -97 -109 -32 16 54 51 53 -86 281 -110 -113 262 8
8065 8 30 5 173 -4 11 -52 134 132 -110 -17 81 -6 -182 -52 79 11 182 -93 -3 -8 -139 69 115 26 13 249
8091 249 -16 50 223 -416 40 -49 109 205 -57 -171 -188 136 -120 -238 -180 331 -171 -226 161 -94 -65 23 -97
8114 -97 55 -195 -75 67 -289 -15 -35 64 -5 -242 142 -84 26 -164 60 82 -6 -68 26 -41 51 -96 44
8137 44 48 -104 -124 163 -23 -189 166 -13 -220 -89 188 -32 -5 126 36 245 -68 58 175 -49 -78 -140 56
8160 56 -44 -32 -145 54 -138 -92 -17 -68 -345 28 100 117 239 -76 131 311 -26 -101 89 -85 274 15 37
8183 37 115 118 -85 -84 -38 -4 -88 38
8191C8
$$ Imaginary data points
##PAGE= N=2
##DATA TABLE= (X++(I..I)), XYDATA
0 0 0 0 0 0 0 0 8 0 0 -8 8 -8 8 -16 16 -16 24 -28 32 -40 48 -56 68 -80 94 -108 124 -145 164 -188 213 -244
32 -244 275 -309 348 -390 435 -487 542 -602 668 -739 818 -904 997 -1097 1208 -1331 1464
49 1464 -1610 1772 -1953 2154 -2379 2634 -2926 3260 -3648 4112 -4667 5350 -6211 7336 -8866
64 -8866 11064 -14465 20342 -32411 66826 -373780 -1120002 237804 1049209 -37785 -655882
75 -655882 122690 356300 92106 119427 3124 -229119 8271 391866 96949 -391759
85 -391759 -34810 332502 54639 -130252 -43109 60453 93702 51001 -21823 -130163 16216
96 16216 209143 -23521 -172057 -4371 93066 41496 -52331 -23150 -9625 -79523 78522
107 78522 139298 -112547 -206714 57308 278216 -21109 -330540 34674 280090 -53249
117 -53249 -194176 75610 119200 -161694 -56379 257819 -55929 -305894 107602 270384
127 270384 -117141 -230853 110371 162217 -130990 -41207 117115 -60946 -63849 96512 27481
138 27481 -82341 -7000 74312 -39165 -24416 102301 -49279 -110573 116601 101592 -114608
149 -114608 -98664 116766 98529 -112689 -68241 67508 30681 3527 -41087 -60452 32064
160 32064 79309 -2631 -105064 -28288 116476 32143 -76209 -46593 20371 74540 10422
171 10422 -74266 -18825 43057 32203 -23800 -14643 25994 -30692 -9106 76219 -5673 -73477
183 -73477 -3029 61399 18999 -49485 -16611 9240 -3742 35780 -11334 -62386 19086 50422
195 50422 -19982 -44870 24852 46149 -45094 -24152 53955 4704 -29268 -1357 10332 13268
207 13268 -1917 -3586 -7843 2652 24598 -18303 -14640 40079 -8841 -40147 14996 38498 -11789
220 -11789 -46774 9752 30600 -16230 -1136 -5439 -25997 21892 29925 -24634 -35564 23734
232 23734 42593 -32762 -25067 39015 4121 -21305 7261 9801 -1698 -3524 10435 -7056 -14522
245 -14522 27814 6837 -33491 -505 20692 7029 -15774 -17048 7446 6878 3611 -5100 -23927
258 -23927 4922 20182 -686 -11580 -16297 10360 26562 -8131 -22889 1333 30110 6663
270 6663 -34615 4889 32628 -9283 -16780 6507 11044 -2832 -4343 5818 -12444 -2584 26132
283 26132 -14131 -28902 18202 20890 -20490 -22794 22484 13985 -30881 627 24704 -10739 -12226
296 -12226 10253 8447 -6533 -1582 11557 -6977 -3495 19207 -5158 -14489 10618 12835 -5833
309 -5833 -15739 7076 15234 -10843 -10636 3498 6041 996 -13238 -2457 9477 -4030 -4205 -677
323 -677 -1704 966 1537 3852 -7739 -4300 18282 780 -16031 6834 14802 -2888 -10487 8076
337 8076 10554 -11689 1566 12634 -11243 -6043 12995 1058 -15398 -2034 16540 -6693 -17508
350 -17508 10456 5690 -11906 -964 4666 -2918 -4090 6348 1634 -11792 6409 12613 -8916
363 -8916 -4871 8426 5217 -1678 -2758 3022 1081 1042 4671 -5840 -2563 5860 -1477 -1750 -1055 -3277
379 -3277 119 1181 249 -6180 -3306 7279 -3160 -6273 4602 -399 -3014 2733 3141 -3523 -3276
394 -3276 9832 3608 -9951 4234 9222 -3114 -2311 4695 1396 -4807 2143 6381 -7974 -4233
408 -4233 7421 -2723 -5016 2686 -767 -6897 -77 8941 -4245 -11964 5235 6064 -3478 -571
422 -571 -1931 -3114 4403 9347 -2034 -12573 4473 15451 -900 -6843 -1783 3909 8176 1016
436 1016 -7217 -5690 5846 8646 -8421 -9652 3919 3596 -376 -3054 -7175 -1094 8069 5351 -12456
451 -12456 -11455 13692 12445 -9923 -11716 2340 11260 6289 -3679 -8573 -3505 13682 12770 -9730
465 -9730 -11551 3837 11023 5801 -6288 -10679 -3254 9795 9376 -10553 -13429 3164 6072 1273
479 1273 -1286 -6345 -6583 3016 12840 -372 -16116 -2031 13235 6083 -6193 -8319 2667 9877
493 9877 3399 -5682 -6310 6803 10807 -3379 -8788 -1162 7669 7857 -5607 -14058 -2309 14984
507 14984 9109 -17922 -17765 11355 18089 -2171 -17388 -9592 10723 17101 2082 -19470 -14366
520 -14366 18671 23436 -9497 -23466 -534 22209 11296 -12290 -14047 1874 16288 8809 -11946
533 -11946 -12139 4554 10234 2380 -8293 -8818 -297 8079 4317 -12019 -10226 10797 9235 -10122
547 -10122 -9954 8120 11104 -6553 -8735 4928 6892 1340 -1935 -3300 -1629 3665 9126 1064
561 1064 -11581 -4022 11028 9596 -6009 -11854 1177 8391 611 -3068 -2677 -4819 -4454 5974
575 5974 10941 -7168 -18785 2378 19366 4189 -16282 -8365 12607 9801 -4802 -5615 1122
588 1122 3437 653 1792 3423 -4162 -5964 6127 8316 -4587 -9485 5243 8628 -9175 -8728
602 -8728 9779 6866 -11755 -10982 8682 9846 -7416 -8656 791 4197 4186 1113 -4537 -6195 3133
617 3133 12839 2817 -10668 -5996 7463 11368 -253 -10723 -3524 8211 7452 -3597 -6487 557
631 557 1724 385 3502 -1219 -8925 -2982 8572 3962 -10066 -5549 7445 2388 -5800 -389 5431
646 5431 -266 -6161 2492 8680 -405 -6715 -419 6969 4482 -3551 -3095 960 1595 1472 199 -824
662 -824 -1823 -2400 887 3057 202 -4685 -5781 2162 7705 -93 -8712 -5145 5598 7345 -1370 -5443
678 -5443 -2708 2077 6792 3641 -4761 -4849 3599 7234 -127 -3250 411 -686 -76 4628 1815 -5674
694 -5674 -4092 3465 2855 -2768 -1318 -467 -3898 -578 4284 509 -4903 -3372 2163 2766 1766 -208
710 -208 -4620 -1437 6748 4905 -3548 -4372 2921 4340 -109 701 1108 -3101 -1628 3609 4268 -2510
726 -2510 -6232 -759 4343 2655 -2798 -5398 -1298 3276 1463 -1578 -3190 -1965 1197 2529 1721
741 1721 -1951 -3079 911 3597 3153 -822 -4088 249 5554 2539 -2553 -2615 1681 1802 -182 205
757 205 -1454 -1924 611 593 -1246 -674 -149 -1843 -2551 2432 2912 -3880 -3933 1985 3323 -36 -1655 -607
775 -607 -230 1519 3938 -143 -3438 -171 3332 2545 -366 -1886 -1321 825 3184 899 -4144 -1772
791 -1772 1773 435 -1207 -1102 -989 -1628 -160 1469 -349 -1885 -995 222 1714 1131 -1128 -954 610
808 610 1960 1125 -158 -152 139 529 2089 68 -750 -466 177 1150 920 -918 -2328 -1239 1852 236
826 236 -2420 -1440 52 115 -44 -370 -696 -1122 364 1296 -215 -133 1185 17 -167 1504 1436 -333 -755
845 -755 1581 1727 -281 110 -27 -17 191 496 -412 -1404 -383 77 -701 94 -370 -1894 -495 718 -112
864 -112 -915 -582 275 16 315 979 -24 -268 729 1142 856 189 -378 698 1253 785 -864 -603 1354
883 1354 665 -877 -678 -755 218 238 -922 -1417 -728 962 -145 -1735 -237 755 -229 40 -70 -35 201
902 201 773 1013 -642 405 1514 674 146 518 387 309 371 923 -594 -882 962 335 -1108 -754 -164
921 -164 -185 -518 -574 -804 -784 235 1 -807 26 228 -147 533 1242 -138 -609 1020 1897 -225 -1110 1188
941 1188 1568 425 -730 -506 637 639 -449 -1089 -816 708 -119 -1447 -1233 -526 -68 234 -515 -866 -675
960 -675 558 574 -960 -181 655 164 531 584 -152 114 748 1297 -79 -159 1115 277 -148 758 266 -477
980 -477 -683 163 252 -230 -1142 -1524 30 1523 -907 -2629 294 1971 -303 -2037 -230 1697 808
997 808 -244 -107 -237 1426 1656 -250 -1014 452 1718 386 -778 -196 236 614 718 -1041 -1254 141
1015 141 1326 32 -2162 -1527 440 891 193 -2062 -2242 1413 2505 -901 -2618 604 2857 96
1031 96 -952 387 644 492 1106 956 -104 -239 609 882 41 -431 -913 420 1307 -756 -2055 -160
1049 -160 1014 -359 -1997 -492 267 -71 442 -694 -1667 714 2405 701 -1877 -1409 2058 2254 185
1066 185 -1562 -1193 1610 2606 90 -1775 -1204 1337 2702 16 -2925 -2487 1794 3190 -1422 -4461
1082 -4461 -130 3074 166 -3216 -997 1775 238 -1176 -356 159 284 709 783 -502 -654 1141 1935
1099 1935 425 -1820 -1205 2791 3003 -1884 -3606 988 3462 449 -3234 -1542 920 814 55 -1290
1115 -1290 -2207 -751 1784 1580 -2006 -2891 583 2855 782 -1639 -1073 1230 1322 346 372 -134 -740 884
1133 884 2107 419 -2467 -595 3070 912 -2454 -1059 1934 422 -2151 -935 1655 120 -1467
1148 -1467 -990 430 349 -364 -197 -40 -577 -127 1538 1700 -1377 -2527 2025 4177 -486 -3744 -555
1165 -555 3564 1920 -1408 -1621 -383 402 1406 655 -1831 -2756 109 2856 41 -2846 -2057 1117
1181 1117 1723 -286 -1505 -671 326 695 1069 91 -553 -331 1020 1230 3 -188 771 672 -158 -79 1203
1200 1203 748 -1449 -1253 1135 1794 -538 -2205 -843 1158 660 -417 -726 -1101 -823 1144 1591 -809
1217 -809 -2585 172 2798 1305 -1632 -1342 1005 1892 862 -214 -681 -195 1249 675 383 -789 -997
1234 -997 476 963 -41 -1530 -984 690 304 -625 -587 -433 -221 -229 155 518 -270 -635 519 559 118 -177
1254 -177 -66 414 57 713 990 -227 -715 271 1517 884 -1281 -847 613 501 454 -615 -976 -526 316
1273 316 1034 -211 -1850 -536 585 905 -179 -1239 -687 747 1050 -127 -706 -271 625 444 987
1290 987 224 -873 -204 1171 1122 -472 -856 -207 26 326 61 -709 -932 -166 321 195 -400 -989 -383
1309 -383 297 525 123 -418 -591 248 1072 395 -238 -137 -110 644 894 277 -595 -259 324 953 165 -439
1329 -439 -523 -71 750 179 -576 -814 -469 126 228 -553 -883 -507 107 342 4 -226 -348 -98 590 339
1349 339 81 -257 241 507 567 477 232 -408 353 527 -85 -195 -333 31 -172 176 41 -652 -939 -216 189
1370 189 -467 -484 -251 -282 15 -275 -140 -222 310 266 310 148 81 181 350 408 181 -45 -31 679 169 -188 101
1393 101 -168 8 253 -90 -430 -441 32 48 -453 -357 -386 -214 22 -281 -373 24 249 222 190 220 149 326 336
1416 336 147 241 285 342 172 -158 121 368 47 -289 -190 -206 164 -352 -435 -168 -52 21 -107 -378 -394 35 -157
1439 -157 -116 -154 -101 -108 362 209 -1 184 306 391 221 210 37 284 384 -140 -633 -245 421 167 -601 -652 -161
1462 -161 412 -69 -414 -389 -416 232 322 -341 -635 -125 161 478 -312 -372 222 806 722 -271 -335 850 770 199
1484 199 -310 -86 592 207 -130 -302 -319 -17 -80 -437 -172 -271 183 42 -627 -451 -183 79 49 -500 -324
1505 -324 306 899 267 -481 -306 415 933 343 -663 -165 759 713 -277 -677 155 646 19 -268 -500 -167
1525 -167 183 346 -445 -610 -609 27 337 -320 -983 -365 501 874 -755 -795 432 1117 270 -580 -154 700
1545 700 683 71 -232 -177 495 827 144 -674 -437 280 222 -145 -616 -730 560 490 -486 -904 -551 133 616
1566 616 -219 -596 -19 735 343 -456 -474 631 728 -45 -470 -131 526 592 -102 -510 30 410 401 -47 -508
1587 -508 -478 427 603 -601 -1248 -474 625 840 -639 -1562 -57 1249 654 -1043 -587 615 1037 444
1605 444 -582 -459 541 938 877 -226 -429 -112 602 770 -142 -805 -399 487 44 -409 -546 156 124 -413
1625 -413 -257 -375 -180 -42 -647 -167 110 314 -154 -514 98 729 663 -219 -685 -82 1025 549 -208 -360
1645 -360 29 289 485 -102 -825 -906 191 1206 -54 -1438 -870 769 1038 -809 -1102 -342 540 391
1663 391 -189 -445 -444 49 740 254 -462 -740 277 1193 262 -648 -278 842 405 -161 -152 54 -201 -289 -11
1684 -11 316 -223 -326 -204 5 121 8 -288 -612 -485 91 1022 -36 -1130 -514 1054 971 -75 -607
1703 -607 85 818 712 314 -421 -1092 261 1512 763 -1080 -1461 202 1228 97 -787 -681 14 313
1721 313 111 8 -506 -607 -23 625 405 -864 -653 711 635 -62 -260 85 188 -62 380 586 -169 -550
1741 -550 -457 525 580 -616 -568 -31 280 350 -229 -448 -644 -85 443 443 -871 -792 63 742 335 -416 -445 62
1763 62 710 425 172 -321 134 610 689 45 -535 -79 547 236 166 -672 5 -103 42 -131 -322 -565 -299
1784 -299 273 362 -524 -415 -187 292 387 14 -471 -222 81 293 439 -191 -320 23 211 424 -41 -512 -14
1805 -14 465 488 205 -354 -377 149 686 86 -506 -561 -354 493 331 -428 -526 -280 393 644 114 -359 -470 291
1827 291 532 145 -422 -359 280 639 502 -305 -645 -2 381 468 97 -312 -345 99 242 -4 -421 -653 -331
1848 -331 437 160 -337 -450 -49 387 217 -17 -327 -87 149 419 262 -197 -132 66 471 124 98 -260 -25
1869 -25 254 130 -274 -277 -386 48 180 321 -109 -191 -80 196 -48 7 -400 -191 249 35 51 -289 -151 135
1891 135 243 316 -62 44 348 405 67 -126 -53 180 274 428 41 -505 -332 164 58 73 -128 -244 14 96
1913 96 -181 -372 -272 -61 -101 137 -78 -206 -74 393 164 -87 -190 -151 193 248 384 27 -7 -101 171 152
1935 152 -234 -124 -49 111 91 115 -153 -245 283 -66 -134 -287 -465 3 316 -64 59 -174 121 72 -76 -10
1957 -10 -156 1 257 64 97 -49 130 220 -313 123 -135 129 -101 -211 37 115 -70 -335 -362 -71 222 -120
1979 -120 -282 -96 12 319 33 25 126 -10 313 11 -10 37 155 557 -69 -85 -134 338 206 -82 -58 -246
2001 -246 191 -27 -75 -376 -48 0 -150 -134 -382 75 24 -117 63 -102 -101 -51 190 55 -57 -89 390 79 -397
2024 -397 -210 187 427 -15 69 -124 334 70 -65 -172 -110 220 76 -482 -353 -91 -51 118 -109 -184 119
2045 119 208 86 21 -248 250 174 356 115 0 45 313 49 -282 -160 166 544 163 -118 -92 327 140 -296
2067 -296 -409 -86 230 187 -276 -429 -52 184 212 -369 -206 79 484 82 -199 -397 291 424 547 -210 -179
2088 -179 178 344 -158 -251 -132 160 289 -18 -153 -255 285 109 42 -326 -334 -151 295 58 -131 96 281
2109 281 393 -129 -251 16 307 250 -26 13 69 244 371 -146 -134 118 118 79 -362 37 -101 98 228 -297
2131 -297 50 -163 -80 -3 -297 -93 136 332 -312 -393 -138 302 356 -58 -208 -47 211 77 -272 -162 107
2152 107 182 73 -225 -121 -54 241 203 -22 -232 -79 419 113 -434 -281 49 -58 -18 -21 -337 98 258 -4
2174 -4 -1 -335 184 123 -121 -68 52 23 63 -34 -23 118 162 324 -466 -175 332 623 153 -96 -117 242 293 -228
2198 -228 -487 -19 64 275 9 -370 -161 345 450 -177 -526 -333 633 289 -55 -447 -37 564 260 -17
2218 -17 -72 -167 243 160 39 -336 43 -33 342 -207 -252 -127 216 151 42 -78 -28 -181 -256 -12 399 -27 -348
2241 -348 55 192 64 179 -81 -269 -46 113 112 187 -559 -148 249 276 -57 -587 116 116 320 -208 -293 -277 329
2264 329 595 279 -386 -538 86 545 101 -317 -112 60 216 142 205 -394 134 306 360 26 -187 -347 184
2285 184 110 203 -277 -73 49 3 15 -51 -323 -250 154 292 75 -340 -374 -126 461 243 -42 -110 -65 428 293
2308 293 -16 -384 -324 327 541 129 -273 -119 114 146 -103 -417 -234 -28 186 225 -183 -547 -201 218 199
2329 199 67 -273 -268 54 266 124 -188 -630 95 221 239 100 -179 -5 224 436 96 -183 -287 -80 361
2350 361 349 -175 -358 -153 260 272 -23 -547 -266 -105 361 26 -294 -230 188 297 -27 -80 -267 133 51 310
2372 310 159 -125 -28 53 19 -54 -335 -177 174 -6 145 -119 -348 83 63 379 -69 -360 -30 28 234 -131
2394 -131 -355 -237 168 209 91 -63 -106 133 144 -132 11 0 -52 114 275 113 -69 -23 15 363 -65 -243
2416 -243 -21 -99 193 202 -76 -184 -76 42 226 -142 -156 -373 207 165 42 7 -168 -205 255 275 -37 -91 -286
2439 -286 219 256 -9 -431 -96 123 118 -79 -85 -208 207 60 -42 -81 70 -259 58 132 -210 -183 -147 167 290
2462 290 18 -47 -174 -137 142 94 -119 -28 -178 305 138 90 -176 -36 82 202 11 -11 -236 -72 108 324
2484 324 67 -504 -66 -189 317 -20 -46 -51 -71 332 136 -274 -137 140 190 -33 293 -238 -229 299 -97 -115 -116
2507 -116 -18 5 115 -159 35 32 31 -102 -68 81 -92 61 -94 -129 62 353 -201 -251 161 150 -124 4 -228
2530 -228 85 61 -79 -112 172 243 47 51 -224 -112 -184 63 231 -209 -128 97 4 11 -148 -66 -51 63 15 -141
2554 -141 100 -127 108 104 -184 147 -73 23 -10 61 352 237 301 -82 -182 215 63 -12 -269 -9 207 251 26
2577 26 -151 86 -74 50 -199 -238 -127 83 163 -38 73 40 -43 133 -150 73 6 132 282 -38 -100 -129 271
2600 271 -3 -1 -144 63 334 182 -259 -20 3 131 -411 -212 -148 257 -79 -148 -85 -185 -5 28 -10 -425 63
2623 63 71 99 77 -63 -24 219 320 31 -110 -167 158 -68 -21 18 -230 -10 -309 -241 -108 -120 -64 -56 -313 -150 55
2648 55 134 125 -74 -103 23 247 -88 -23 154 187 110 21 -6 -102 72 26 -264 -433 15 83 178 -42 64 310 165
2673 165 -23 -334 -164 -231 -83 -373 -286 -194 -23 140 -33 -216 55 46 -2 -174 -239 16 6 80 -37 7 -55 274
2697 274 82 -195 151 40 -106 161 -257 -218 -26 23 -153 -257 -234 -84 -58 -93 62 -10 99 154 -83 5 -143
2720 -143 225 184 36 -10 -54 48 44 -218 -150 25 -36 165 22 -138 -57 -105 -53 81 1 80 75 -127 -3 -220 -171
2745 -171 22 -24 -119 -32 181 30 -126 -175 12 131 -101 70 76 38 231 -40 -196 -22 -3 209 140 141 8 -201
2769 -201 22 279 -237 -175 1 66 73 -19 -138 -28 -43 179 113 -232 197 -158 104 -1 -96 28 -136 -69 -30
2792 -30 -100 -101 -173 -114 138 -89 -5 130 -127 -38 78 144 -313 -338 34 149 87 36 -66 80 302 6 11 -170 -6
2817 -6 27 192 164 88 85 70 39 8 142 -117 -201 108 60 -30 -200 -9 -98 -22 216 110 -72 -184 138 102 -215
2842 -215 -161 120 81 323 60 95 44 -82 45 75 -141 -105 81 140 89 -81 -50 -110 74 150 98 -198 -205 110 26
2867 26 49 -76 -82 139 206 114 -27 64 4 -138 -12 44 -127 -152 -19 -8 173 5 -95 78 -269 267 -191 -106
2891 -106 214 72 165 24 108 -215 -71 425 -187 52 -212 48 -295 -10 -217 -241 -211 139 77 -158 23 -38
2913 -38 -76 -78 89 -204 49 277 243 -49 -52 -209 -31 153 375 -157 261 48 -25 -118 -32 -234 -132 7 21 284
2937 284 -165 -53 -157 149 157 -82 -57 -171 225 335 205 -201 -67 -69 192 150 -129 -50 44 135 -17 309 -51
2960 -51 -60 118 -251 33 12 58 24 -134 -48 -46 -276 -59 251 172 200 -267 -189 120 179 163 -72 -553 -104 177 110
2985 110 65 -179 71 88 121 -123 -87 -127 104 -55 44 -160 6 90 149 98 -156 3 123 -115 -25 200 77
3008 77 -4 61 105 -111 -1 -52 -118 -121 -32 56 -59 72 43 263 244 -153 -173 72 23 -16 79 -90 -16 -8 305 137
3034 137 -137 -262 198 -24 87 -475 2 26 4 -22 92 -96 195 122 -160 -88 -16 -155 -80 -108 -50 -162 3
3057 3 99 -51 3 48 337 58 -203 142 8 149 -146 -38 53 -114 61 -161 121 -27 108 25 -64 105 176
3080 176 215 -53 -77 45 -85 18 -112 -18 150 162 308 -179 -57 -192 142 229 72 4 86 157 140 -63 56
3103 56 -122 82 159 -56 48 -7 255 -101 148 -207 58 -52 -4 0 -18 128 -167 71 -107 -160 10 -32 -63
3126 -63 -218 -82 113 37 -293 -87 -11 179 -34 247 -42 -28 43 52 -11 -105 -115 254 13 45 19 13 92 -3 109
3151 109 -338 327 242 -13 -309 -36 -68 86 -111 -48 -72 -109 -18 -149 -126 -64 291 181 153 94 62 6 35 -17 56
3176 56 23 48 -60 167 -27 -171 80 -175 -155 -19 -15 39 147 80 -35 -112 72 -56 -31 104 -130 155 -63
3199 -63 -50 15 -54 -45 -196 -61 -32 109 140 -97 -200 213 -42 52 -170 24 -21 1 220 -411 -101 76 -82 231
3223 231 -119 -70 66 89 49 -188 115 167 296 173 -12 -47 18 -180 -37 -107 -67 49 148 -72 -13 -37 -264 51
3247 51 -156 -234 72 -86 147 96 -84 -103 -133 -48 -142 161 40 -106 -115 -44 -22 117 18 -165 -78 62 6 24 -120
3272 -120 228 -110 216 187 -155 -6 327 -93 -182 136 -159 61 6 -92 -191 127 204 93 -65 3 83 -89 74
3295 74 101 3 73 -111 165 126 -167 -257 -226 28 64 77 100 -126 58 136 19 -127 125 171 72 -1 193 -20 -17
3320 -17 -2 12 -203 -3 -43 31 -12 -29 -4 -318 -50 165 -8 153 12 -216 7 -122 -37 22 3 83 -35 74
3344 74 -53 77 -254 -34 234 -100 21 157 -259 42 19 29 44 205 141 -57 170 122 -143 107 128 -60
3366 -60 157 -173 106 241 -83 15 -112 -109 172 235 41 115 20 -92 63 -18 35 89 72 -94 -236 8 147 124
3390 124 -267 22 131 -55 -21 152 -172 -67 102 40 -92 -126 55 36 68 268 -217 -64 -180 -218 175 160
3412 160 -12 -81 69 156 -40 2 -17 -18 21 4 -175 -151 -113 36 124 38 -205 -159 -78 -242 33 -170 8 171 -20
3437 -20 264 11 98 -23 -13 -44 53 109 283 163 -207 82 245 99 271 -121 -72 254 184 148 -72 -58 63
3460 63 100 154 -31 137 176 70 -142 -208 -108 -96 11 -23 95 -25 282 -196 78 106 30 -155 94 171 313
3483 313 -83 34 33 -17 -207 92 88 98 28 35 -58 -134 49 71 110 84 143 259 -113 -121 -46 -54 3 6 43 -169 -8 6
3511 6 -83 35 15 173 50 -19 86 -130 -74 -154 73 105 -80 -256 -213 50 107 -163 376 94 -62 160 -60
3534 -60 -40 -170 41 55 244 15 22 -107 -143 -55 230 150 72 135 82 -144 -220 -101 140 -134 -57 67 78 194 -225
3559 -225 34 -63 -100 101 93 -139 202 -72 -88 -65 -227 177 124 -142 -66 -21 184 -26 -35 -41 -169 164 91 34 -42
3584 -42 -218 -47 76 42 -167 -9 -31 69 -51 -117 57 -135 207 3 -49 36 104 57 37 103 129 141 -35 208
3608 208 -73 70 30 -314 -55 -228 60 -119 -140 -18 -137 -7 -51 223 268 -141 -107 84 18 -48 -53 -77 -218
3631 -218 176 182 -11 -29 104 -284 103 40 39 19 204 52 -20 261 -2 50 110 -69 225 -123 -142 -96 -172 200
3655 200 38 57 47 8 148 -115 -159 85 286 -114 -246 119 38 -4 -37 23 -91 -272 12 100 22 -108 -107 63
3679 63 -158 -63 135 289 91 152 -43 -125 9 -84 22 -97 183 171 22 -85 -95 10 84 164 -89 22 125
3702 125 181 -101 78 125 -18 94 56 -60 218 27 117 28 -171 -15 -97 57 70 -85 0 101 171 -343 -174
3725 -174 79 183 -15 95 -45 233 107 -96 172 22 102 -61 28 9 2 -34 -65 59 92 -23 183 -46 -13
3748 -13 111 -206 -37 162 160 136 14 -202 241 223 22 -99 123 -46 134 -39 163 -216 70 -35 -9 270
3770 270 117 -200 -153 -15 116 158 185 -216 129 151 -215 -102 22 -95 -74 -14 43 104 -78 -46 18 30 -185 -6
3794 -6 284 -91 71 1 -193 13 155 -299 -99 40 178 51 -322 347 30 59 102 96 -247 158 45 -346
3816 -346 -171 -31 45 25 153 60 225 -32 -122 -17 5 -204 242 -22 -81 -27 188 165 -93 -216 -66 26 73
3839 73 117 -127 -203 -102 -160 -12 189 6 136 128 42 73 16 186 -117 -122 -5 113 -164 -158 108 -208 -21 109
3863 109 -10 119 -16 56 -35 226 -192 -98 98 -63 83 -93 198 -105 45 -131 -143 69 -161 44 76 -196
3885 -196 116 81 -20 105 -129 88 -13 16 -71 -59 -72 13 119 96 -81 -20 -80 120 -91 56 19 93 -21 -200
3909 -200 -164 -8 -133 51 5 -9 40 133 -6 24 157 -139 43 184 -176 -104 6 -12 -76 124 -48 -114 57
3932 57 98 -58 248 101 -9 -245 -164 74 -58 42 -18 186 -38 137 -317 80 -63 -30 192 -40 -185 -148
3954 -148 -6 146 231 -10 185 80 72 21 113 -36 151 -60 26 -49 55 -105 54 71 -147 -279 -143 -50 -238
3977 -238 59 -103 111 435 8 182 37 -71 -184 -367 353 47 1 73 -8 -9 153 8 126 -47 60 -56
3999 -56 15 -36 -54 75 -54 -96 -32 -139 80 8 -170 -49 44 78 146 148 101 -23 -27 289 151 92 244 -113 -142 -70
4025 -70 -186 231 -221 -47 -171 68 10 25 -35 -14 -75 -35 -93 13 -39 62 161 -54 -86 163 -16 -48 -81 144
4049 144 -88 -47 246 287 -68 -170 -258 240 -135 -20 -67 108 81 -230 -41 10 -71 166 -90 -10 -48 -170 260
4072 260 -62 -90 -29 -12 -80 -52 281 -75 -40 69 126 71 212 17 95 -44 38 -45 -126 109 8 -51 -38 5 142
4097 142 -100 -67 -29 19 26 -91 -91 -59 134 65 -193 -146 -28 -135 37 146 -138 -152 -57 112 26 -138 -2 -12 -66
4122 -66 -114 215 -63 146 168 -79 -86 29 67 93 30 258 -3 -231 30 -253 75 117 49 -122 107 -23 178
4145 178 -27 277 -74 3 110 40 -67 -40 -30 56 -11 -10 -134 -5 -52 55 -79 -190 100 70 58 35 -71 -320
4169 -320 -34 175 114 123 245 188 -254 -7 -4 -73 32 380 -241 153 40 87 107 -139 25 22 212 199 73 110
4193 110 -15 160 51 -116 -4 -242 -23 -152 -292 -88 40 113 8 130 218 -121 -50 76 28 64 52 -89
4215 -89 213 -42 38 174 -22 49 -24 -45 165 -157 -10 -181 122 -162 61 181 -267 82 142 -62 -107 70
4237 70 1 -202 -62 74 53 -160 -48 42 93 147 -105 -29 -4 34 -24 -94 53 -151 160 -108 -158 -169 138 217 -87
4262 -87 76 -144 -167 -52 -167 -49 -201 -99 -226 -68 140 56 136 17 -9 -104 155 156 -99 123 -78 24 -243
4285 -243 -306 -83 -57 -105 -270 168 15 166 188 -47 -84 95 137 13 78 278 -21 76 -133 -21 14 -202 43
4308 43 -32 -28 142 8 5 33 9 225 44 -204 -94 86 -117 -166 -295 -167 116 111 -187 91 -12 37 -125 149
4332 149 48 -96 333 -25 -37 59 -232 48 -117 -74 40 -129 -177 271 165 -32 -253 18 200 -19 -244
4353 -244 -149 -254 109 -53 -179 231 43 -31 103 -230 127 -79 -163 -50 -134 2 -43 -59 -113 210 131 -128 -41
4376 -41 -101 -276 185 -85 -85 -199 -166 90 -57 -197 70 137 29 -202 236 67 46 77 -29 -94 95 125 -76
4399 -76 21 -3 30 76 173 0 -6 -12 180 95 68 -104 -234 -107 -20 -54 -20 139 7 -39 203 110 71 102 -179 157
4425 157 79 -86 -104 -67 -271 37 406 -28 278 -221 -69 116 83 106 55 27 125 -43 -39 -147 41 108 -204 125
4449 125 -38 -54 -172 -34 -163 369 -258 -67 0 -65 69 -232 0 -100 81 147 94 88 26 73 -15 74 -121 232
4473 232 -3 147 -68 86 161 222 54 81 70 -7 -64 -158 -80 -320 105 -94 100 -106 -5 96 -62 86 -243
4496 -243 -66 -132 44 -46 54 98 63 86 41 -65 148 130 -13 312 -75 -71 77 -90 20 -221 -54 3 128
4519 128 31 -129 116 -94 -59 -49 194 53 -112 308 -216 17 59 -37 -112 -55 127 120 60 214 55 -53 33 -259
4543 -259 93 -149 -130 -150 76 -118 35 51 39 60 170 324 33 72 -63 200 -4 -249 132 -11 -95 -55 68
4566 68 -112 37 -155 22 242 -140 157 -273 211 31 139 -86 -468 -204 105 56 78 -94 -79 -130 -51 -27
4588 -27 -239 152 17 206 -12 156 -157 106 -18 0 -134 -172 7 90 -23 48 -53 -100 233 -177 -273 71
4610 71 71 -125 -113 219 -3 -96 -33 -141 35 356 -1 -166 -73 61 -208 -21 -179 390 -138 -23 -6 -129 58
4633 58 34 -210 178 131 -59 -183 -222 385 144 147 54 49 132 183 -34 -130 -42 51 109 208 116 -76 -16 8 9 -375 -190
4660 -190 -28 17 199 -10 -42 -121 -295 -268 93 -55 6 164 59 5 91 -25 -23 45 80 -146 16 -16 31 -194
4684 -194 12 -54 106 -3 108 263 30 15 228 56 -19 129 22 -85 105 -191 -105 -39 -105 -3 -42 141
4706 141 156 -42 -111 -292 -29 5 -85 192 -33 186 77 32 34 14 75 205 -176 170 -81 -115 -23 -32 -157 120
4730 120 88 -28 18 14 -289 -274 59 -172 40 -156 19 130 7 -121 76 23 -82 -120 83 -122 -49 208 -163
4753 -163 23 137 33 -163 365 239 92 34 182 261 -71 -10 -48 -47 -122 -56 65 -243 -190 -40 -65 -8 -58 216
4777 216 154 84 186 10 -142 -1 -63 20 67 -226 -98 153 218 -24 -56 -41 24 68 -326 -2 106 280 207 19
4801 19 38 -53 -160 -69 243 -93 3 79 265 201 -20 88 -7 153 -23 -8 -32 -105 -61 -16 31 -33 -8 81 -165 54
4827 54 -88 -112 -104 -133 -301 127 -173 -214 66 61 -91 8 172 12 -69 -68 -31 22 -37 21 -5 9 -130 -130 35 278 295
4854 295 68 35 219 197 138 -1 159 -223 -36 -190 147 132 95 -152 -116 -23 -33 358 -76 -81 -278 0 -186
4877 -186 25 6 -63 -143 -163 149 194 -46 5 50 78 -137 -283 -6 29 -12 -25 -178 132 -127 142 -17 -249 -199
4901 -199 28 90 -65 -207 96 -236 86 108 -45 119 94 91 -90 214 72 90 67 44 8 128 -68 -77 15 27
4925 27 -125 -31 36 -96 -30 -54 -196 -127 -38 -352 -218 51 -317 62 -91 101 -139 -74 -45 -143 53 -41 21 -156
4949 -156 -28 59 -12 69 2 82 100 80 6 203 -196 -40 380 20 87 -113 80 126 64 -18 -138 -156 255 29
4973 29 47 -90 133 -158 26 -51 147 -67 -139 333 204 181 235 23 -142 -209 133 -88 -127 -162 -207 103 -178
4996 -178 162 -38 -44 130 163 -30 214 -45 -9 89 53 -45 43 -55 -33 -133 297 -12 -20 -147 -77 -72 -61 74 35 -187
5022 -187 189 92 -279 340 30 78 -59 -135 -167 181 -85 163 126 29 172 8 101 -18 23 -312 -73 27 248
5045 248 -11 51 54 -9 107 38 -136 49 -246 2 -22 -150 -16 -69 24 -4 78 -78 64 136 -143 24 -141 45
5069 45 95 5 -91 -17 -99 23 49 -9 60 -81 25 -124 126 -252 -66 -267 120 11 -169 -257 83 -36 -225
5092 -225 -82 132 81 -32 -46 -150 5 -165 41 75 9 56 -41 30 75 49 -78 1 93 -66 -30 -222 65 -106
5116 -106 27 -27 -134 20 85 110 151 -86 162 -5 -97 46 69 37 -99 -8 -68 -192 -13 123 103 -101 -11 -14
5140 -14 38 65 46 -310 -6 38 -169 90 86 20 -98 -17 -22 -116 -323 -144 -102 132 -33 108 -46 108 23 205 142
5165 142 198 106 57 116 43 204 -143 81 -57 -257 37 4 48 118 95 71 -150 147 -47 173 0 -191 -56
5188 -56 275 144 -176 125 -164 -82 185 -46 144 -221 108 -323 -123 134 -15 128 -167 25 70 -54 -239
5209 -239 -259 266 114 -112 173 4 15 27 140 -73 -218 -69 132 9 -85 -42 52 298 79 -49 -149 104
5231 104 106 203 105 326 73 -12 311 -19 -93 -153 12 35 -85 -293 -107 19 -41 -69 -145 -301 -159 7 -106 -26
5255 -26 -15 184 124 -5 -323 -121 -23 228 -53 97 -73 -16 -51 32 -224 -70 49 -98 145 -71 42 -75
5277 -75 -184 -92 68 9 144 -134 10 281 293 -103 -75 31 131 -55 63 -47 -141 -28 -212 -154 144 -25
5299 -25 -73 440 -1 -49 200 186 -16 111 33 10 174 -66 -59 -9 155 34 71 8 -139 -22 27 204 176 -77
5323 -77 26 -65 168 323 -1 -10 -108 128 78 -301 23 -261 144 -12 -80 44 75 -178 -40 85 -158 -210 233
5346 233 208 32 -82 -189 -158 219 148 71 204 -17 296 -12 71 50 -118 -6 -16 -209 -19 168 152 82 66
5369 66 -53 136 12 7 68 5 -123 56 -4 -118 18 -81 -430 -76 -15 83 97 -164 84 114 67 58 -132 26 142
5394 142 -17 24 94 94 118 -140 220 -62 91 -166 -131 40 112 41 -44 -32 29 99 -147 184 -20 -32 -15 50 -5
5419 -5 48 39 273 187 128 -70 47 185 30 1 -165 146 -203 4 -120 -34 -64 -269 -18 -12 49 -171 -14 173
5443 173 -84 -41 79 -215 -131 201 82 -28 -221 -11 -28 -6 88 -40 -108 -70 -238 216 -219 43 -214 -65
5465 -65 -83 -124 -10 -74 244 -7 -72 -113 140 -131 -64 56 121 -134 69 95 -83 1 23 221 8 268 49 160
5489 160 132 -237 -87 -108 -58 113 -3 84 -100 -23 154 -208 -135 92 -12 110 -141 43 -72 -74 133 65 102
5512 102 163 -41 61 184 53 -375 -153 40 48 -159 50 -328 -18 89 146 -21 -95 264 -207 41 106 -182
5534 -182 161 36 -40 282 13 -141 -106 89 99 -62 72 -247 64 110 110 288 190 19 157 53 -38 4 66
5557 66 103 -26 23 -56 -228 7 240 -208 9 22 91 -75 157 -298 -28 -103 -166 -119 -142 -135 63 -122 71 -183
5581 -183 81 -115 90 -222 59 -17 -80 -85 -25 23 203 169 -105 -36 -134 -101 -159 51 -82 -196 -152 127 -90 215
5605 215 45 -59 211 -59 25 -85 261 162 -57 -242 228 255 -12 -32 -133 -23 -133 -74 -145 -117 -176 -34 5
5628 5 19 120 139 19 164 253 -272 285 36 8 297 80 185 67 -71 -22 32 254 -115 24 -138 -275 278
5651 278 -90 71 157 328 -124 149 88 86 3 -120 -199 -197 -300 -91 29 -199 -129 71 -116 -316 -155 205 54
5674 54 150 133 -2 -102 102 -104 -91 -51 -227 8 -150 22 -112 198 218 -59 -112 -50 30 27 349 -205 -51 140
5698 140 -83 39 43 162 36 -22 -116 344 152 142 -107 -14 120 -28 116 270 22 -59 -191 -10 139 -63
5720 -63 82 7 -318 -259 83 -5 17 96 1 65 -22 63 238 -9 -42 -125 161 219 71 81 179 36 -19 -71 -136 -198
5746 -198 -45 58 141 -217 123 -2 175 -122 -341 -31 -23 -147 281 -385 -70 -41 -217 -284 145 -40 -92 24
5768 24 -39 -368 -103 -1 -43 71 -245 -119 27 69 42 38 65 259 224 79 -80 85 148 -230 112 -121 -35 118
5792 118 -3 -96 -106 -160 -117 6 237 172 31 -59 106 -169 -86 63 -17 -43 -17 -103 -6 38 289 -5 -200 -23
5816 -23 109 -47 84 -121 -232 -108 14 -55 -200 -196 -97 -39 -257 103 48 -74 296 94 -27 44 119 -180 -1
5839 -1 -56 154 53 244 -40 111 157 -7 -19 -111 -151 -118 -58 261 -254 -139 -20 41 -7 73 -21 -140 -184 -33 7
5864 7 -107 -184 177 105 18 -41 -96 -212 41 -7 35 115 -120 123 -33 167 -202 -47 -143 143 82 -112 134 -135
5888 -135 -157 -198 25 308 30 83 -79 86 9 58 42 -36 89 -240 -19 41 178 130 -42 -61 -33 65 -77 -77 -198
5913 -198 96 -149 -62 33 -24 -78 5 -75 -50 188 114 104 -44 -78 168 -363 116 102 24 24 46 50 24 54 88 189 -36
5940 -36 -32 -117 100 -186 86 -71 -186 -60 -185 1 -131 181 70 -151 -41 -43 38 -85 -22 -209 -139 78 -80
5963 -80 11 -15 327 -31 -21 -8 68 -50 -242 -30 -148 131 9 -232 -4 -176 66 80 -62 -147 259 77 -80
5986 -80 80 168 117 -107 -37 -149 -85 20 -58 263 -110 -196 -169 -174 154 -37 -59 -166 -107 138 -27 74 -208 -128
6010 -128 42 -179 -91 -321 -87 22 111 23 43 -15 -47 60 19 111 121 59 -162 -12 -296 167 -104 -437 -54
6033 -54 46 320 99 11 -95 57 -73 13 25 -138 14 -38 -73 -34 -332 -163 -95 36 -20 72 -12 -146 -69 -160
6057 -160 24 72 -41 -255 77 -17 3 58 -23 59 100 168 121 118 0 -34 37 24 -95 131 224 236 133 -113 -75 -131
6083 -131 275 -338 -54 204 -45 156 -206 111 15 -60 -190 298 -25 135 -23 190 -89 -114 71 76 -182 22
6105 22 -36 105 22 -46 108 166 229 154 12 -207 72 71 74 103 69 36 65 240 -216 -227 -143 -56 -15 -18 60 -66 -23 -116
6133 -116 -14 150 30 -31 87 12 -168 -5 84 211 10 -16 24 213 -113 294 54 102 -204 85 -19 -158
6155 -158 40 94 123 15 9 216 103 193 -96 133 -117 39 179 -22 -64 -138 -58 13 -72 -193 -113 239 -92 90
6179 90 -23 -159 -115 188 -105 -129 70 288 159 102 -15 -77 -68 -26 -117 -68 -24 -136 -49 98 57 -85 -123 221 -216
6204 -216 -167 -80 211 -147 89 128 -125 209 -12 -37 -103 9 13 82 95 71 -6 171 -108 205 -175 -98 30 247
6228 247 257 157 -69 -129 -26 34 39 -161 -67 -54 -120 199 -19 25 -275 128 -20 129 -7 -32 -103 135 123 36
6252 36 -116 60 223 58 -35 8 96 -53 -82 -14 220 -113 -99 38 58 -170 -239 -9 91 202 52 184 97
6275 97 -161 191 20 -144 44 25 34 -115 166 140 -8 -52 84 -19 -119 51 209 99 -122 -17 -49 -174
6297 -174 96 -34 -71 -65 -213 8 -179 6 -74 155 -45 134 89 -110 171 133 -87 -9 -314 -20 -162 -67 139
6320 139 -224 -97 31 45 11 -14 -154 -29 67 23 -66 51 120 200 -22 81 -59 85 -7 -23 -127 61 -7 -10
6344 -10 -62 -37 43 -271 -17 -13 -50 -106 6 -99 -62 0 -94 108 7 -34 -65 -104 146 -157 259 -3 -19 -142 -174
6369 -174 32 -203 207 -12 -237 -85 -34 74 75 -25 -55 30 59 -42 -106 -225 151 -17 -176 -43 68 88 -133
6392 -133 -36 4 -34 111 159 119 -31 93 68 29 183 66 248 -255 -90 133 -3 59 -99 -100 68 -1 -276 -125
6416 -125 24 -58 93 18 -40 -197 -136 -43 323 8 -114 -9 -178 21 -51 140 87 -4 108 -1 120 239 -79
6439 -79 -62 -40 83 -237 426 86 -34 92 98 73 -151 242 -220 161 -64 73 -18 3 105 -86 195 -186 -271
6462 -271 71 161 -159 -200 -220 -207 -134 -144 4 -29 12 40 59 235 46 -145 -352 -30 -105 -109 73 187 -143 -111 -132
6487 -132 -137 185 163 -15 -39 4 -261 77 -25 225 318 42 45 -128 149 -222 -94 110 47 -182 60 7 -130
6510 -130 117 -140 -83 27 -64 56 110 -263 -132 298 -147 -197 -42 -80 -57 -153 -110 -10 -4 -33 -60 -54 29 -95 77
6535 77 -200 -136 -65 117 -71 28 245 90 -148 -120 34 191 192 3 6 70 -40 -89 189 -20 125 -128 181 -92
6559 -92 102 14 74 126 -65 87 -29 135 -30 64 -78 206 -137 168 105 70 -149 -109 -19 34 139 -33 40 30
6583 30 9 -251 34 -207 -167 -104 65 -249 36 158 210 -189 -8 -157 -112 16 78 50 248 -16 113 -128 -23
6606 -23 -147 2 131 42 167 126 58 -29 -140 214 147 129 89 11 65 53 -11 88 168 -159 173 26 41 81 163 -235
6632 -235 16 -56 -68 261 60 -105 92 32 -222 -26 -168 -3 37 87 197 104 94 -75 91 11 77 292 -146
6655 -146 -41 114 133 36 -166 28 -66 175 30 -57 62 -195 172 19 357 105 242 113 1 7 39 -272
6677 -272 -109 -131 204 -224 -7 -2 11 -115 131 203 15 -101 -33 98 21 -118 51 -41 272 -171 -65 37 99
6700 99 31 -77 136 -120 85 27 37 51 61 64 16 125 157 175 -137 21 -4 4 56 -1 -154 -24 44 -35 -89 79
6726 79 -9 -116 -18 119 96 -174 -57 262 28 -96 -339 -207 -100 101 -214 -122 123 -112 -97 -84 -337 32
6748 32 176 128 -271 -80 201 -12 215 -184 -219 38 -25 -109 15 -134 -50 217 -38 -161 -77 214 -136 116
6770 116 13 -168 -155 -268 -101 -193 73 -40 -203 70 229 -109 -30 107 -111 114 -36 87 145 -111 39
6791 39 -94 126 19 143 -222 110 35 51 -167 89 -39 31 94 -247 -68 -62 114 -87 -8 18 104 22 -69 -44
6815 -44 -20 152 -80 -28 -67 187 -12 0 7 107 -139 -150 7 87 32 -28 -83 -60 -79 207 -264 127 -80 268 83
6840 83 42 210 70 22 43 26 69 25 49 -213 125 80 -63 56 200 -99 38 -60 -38 124 -159 -158 -238 170 -71
6865 -71 209 118 22 195 415 136 211 191 110 48 -93 83 211 -30 212 72 151 -142 147 144 -234 45 72 39
6889 39 -163 11 145 -243 -39 -28 -143 -71 -126 26 211 -335 53 -195 0 137 -44 -24 -234 130 -124 232
6911 232 -187 167 -214 80 -30 88 -158 44 -100 -151 24 142 -74 22 26 128 69 116 -27 82 75 43 165
6934 165 -209 156 208 -122 121 395 -178 183 -13 -295 -75 118 -306 67 182 21 73 -52 175 56 145
6955 145 128 -213 -281 33 198 38 131 -2 -225 -176 -35 -195 18 155 -98 -31 214 97 103 -44 -31 100 -180
6978 -180 -168 29 -237 136 -92 -97 -101 -73 -2 -93 -96 202 -7 -19 31 94 -60 -32 142 44 409 184 -48 59 142
7003 142 -141 117 -120 106 -71 51 19 -7 86 -209 100 -228 113 -60 -172 -83 -84 -233 -33 115 12 -125
7025 -125 185 19 -174 -42 -131 -77 -207 132 -217 232 44 58 -118 -76 -226 144 -69 7 -5 119 -101 217
7047 217 105 -41 -124 -43 118 -202 -65 -75 -116 18 209 -55 -7 215 -60 -80 115 4 7 -78 123 27 5 15
7071 15 -142 -54 -124 97 -75 211 54 -297 -259 -49 43 113 193 -204 -64 -57 60 272 -84 16 203 67 31
7094 31 111 -16 -82 -113 -319 -63 -235 -79 -154 36 -233 -198 -155 27 -21 26 -36 -31 1 -189 -100 68 114 -39 -39 -119
7120 -119 84 -104 -47 71 63 -53 -127 84 92 -4 49 90 105 301 -45 -23 -101 121 -56 13 146 -99 22 -27 -165
7145 -165 25 -178 254 177 14 52 -61 -158 96 -162 183 -57 -180 75 -39 25 -218 -48 -118 -111 -3 103
7167 103 237 -11 -42 41 -115 167 -22 6 -108 -122 71 -33 -125 240 -135 -142 -4 130 91 104 56 0 119 -8
7191 -8 -33 2 -11 -128 62 13 21 279 49 -174 75 -161 97 -127 88 -151 -29 138 78 88 -33 -106 20 103
7215 103 -148 -7 -173 18 -138 124 -70 1 -75 61 -70 -119 -91 74 11 -113 39 -154 247 9 2 -90 104
7238 104 -138 5 -163 59 145 -35 -21 -71 -51 -1 109 203 -61 84 6 88 -169 -33 -26 23 33 28 95 222 -177
7263 -177 -110 -156 5 -154 -276 29 -70 90 38 -132 27 -44 225 113 69 -124 -56 -92 183 168 -102 37 -62
7286 -62 -209 -139 -154 106 -26 52 -11 102 -40 -49 -135 -242 -124 10 75 135 -182 -35 -347 157 128 -84 104 -134
7310 -134 -93 -13 -10 -187 98 154 -42 -40 144 -63 -286 152 107 -26 120 -118 -125 -44 80 -29 190 -44 61 69
7334 69 -95 132 -142 -37 71 -186 -11 -216 -162 165 -181 77 74 -107 -58 -159 79 117 118 103 -87 -226 -26
7357 -26 -122 134 8 18 115 -72 122 96 -81 21 2 38 143 -56 122 -121 0 -30 -18 73 -221 38 -275
7380 -275 99 21 40 -60 260 157 69 223 59 92 -19 88 -31 20 -33 125 -70 11 13 -268 222 -56 99
7403 99 66 -41 40 -65 177 -113 70 57 167 178 144 -46 -195 39 -59 -284 -9 34 28 -170 -89 0 -61 -196
7427 -196 221 168 -404 -22 96 66 -87 8 -2 64 -26 -72 -20 -65 -170 -35 -228 -64 -66 -18 -8 -138 77 -128
7451 -128 70 160 -64 -143 -142 -110 223 75 123 121 101 5 -55 141 -72 -64 -85 178 168 -255 76 -45 -223 -157 150
7476 150 -147 -82 -52 94 -136 -48 28 -142 -5 35 56 69 -25 -73 -35 18 -63 -191 -28 -225 -32 -68 13 -34 5
7501 5 166 -99 48 26 39 -68 21 -392 -103 73 -48 123 -43 -53 -15 -177 -94 -2 167 -116 286 -7 162
7524 162 0 1 -180 -81 161 77 -94 -27 39 0 147 -96 2 -150 -90 -236 -57 211 -160 139 119 -166 -125 178
7548 178 167 136 101 195 164 13 57 187 -261 -18 -80 200 217 78 -218 71 17 -173 145 -58 177 179 62 -11
7572 -11 53 1 -45 82 116 -76 26 73 50 -27 -66 22 186 124 79 -126 -66 94 126 -173 52 -197 139 -180 131
7597 131 -241 110 131 34 52 134 11 58 -7 163 172 122 -27 -206 2 22 2 191 -98 -194 190 -50 -122 116
7621 116 -293 153 0 -184 161 -63 -72 -71 37 -207 -230 104 202 151 48 -22 127 -104 -10 81 230 13 -41 -259
7645 -259 278 151 -17 -105 183 -51 77 191 -262 2 -47 -148 153 57 116 -81 271 193 -24 5 27 87 -314
7668 -314 -98 101 -58 -23 27 -104 -92 -27 -112 -85 46 -43 83 44 -148 -89 -47 -131 120 52 2 -180 -184 -53 61
7693 61 234 -45 43 -205 269 -26 75 -34 63 98 -1 -69 -134 -206 -162 111 -66 33 -76 -73 54 104 -109 184
7717 184 199 16 154 0 156 15 347 -187 -149 -60 234 -118 -217 146 162 -68 96 -72 -196 43 -58 -183
7739 -183 -213 -21 -36 206 107 77 5 98 202 56 -61 25 91 5 163 117 124 173 206 -200 -134 -98 -148 70 132 73
7765 73 -26 195 33 155 -48 -148 236 -64 -34 16 -79 45 102 -63 133 -21 -142 185 -142 160 122 -13
7787 -13 37 46 -137 126 -126 -249 33 -214 -61 -142 216 -40 111 -27 -137 221 291 -200 121 6 27 212
7809 212 -32 -31 -74 242 22 6 -144 -78 -81 200 114 -107 -103 -8 -10 21 13 -125 17 200 -290 -123 16 -171 122
7834 122 1 -5 114 20 103 73 -257 90 210 -216 291 41 -59 199 -136 -261 -19 -27 39 69 -79 -202 43
7857 43 173 -9 144 80 -172 -59 135 -81 99 144 -94 -290 128 -41 42 53 178 4 -52 164 -125 15
7879 15 161 -78 347 -367 -49 -87 -237 -133 68 26 94 136 201 -35 89 -52 -282 -237 -78 336 -93 2 116
7902 116 -96 -302 62 -67 -139 242 172 -77 73 -21 75 11 101 116 -230 1 92 178 113 71 23 46 -1 -236 127
7927 127 92 97 202 -19 105 39 252 14 -111 -5 -75 -258 29 -6 -97 -178 -99 -43 95 -115 10 -106 -142 87
7951 87 -174 -37 -113 17 -105 145 -182 -210 163 -73 19 -225 146 117 220 -188 -30 161 -19 -125 17 125
7973 125 154 -173 7 141 71 32 -11 -55 -24 252 -17 -48 175 -18 -27 186 -211 164 28 -39 15 71 -50 -72
7997 -72 65 -116 -78 -28 58 -38 52 171 -101 -57 -68 -75 79 180 -179 64 85 205 -150 -323 -125 -137 102 21
8021 21 67 -36 -71 190 -92 -41 -312 75 72 83 148 46 4 69 36 165 -169 -224 46 97 -183 -56 99 -106
8045 -106 17 288 38 53 200 129 276 -48 38 -39 -57 -16 -45 -32 -29 -88 81 -33 -18 -144 -130 -168 93 -88 -30
8070 -30 -105 80 -64 -330 -225 -186 -204 -222 -103 -27 185 -107 22 202 207 9 121 -192 164 58 71 139 251
8093 251 -70 36 118 -163 -380 157 -137 -7 113 63 154 60 74 -261 176 29 12 212 -68 175 -13 -55
8115 -55 -14 107 -182 -213 80 -36 -77 -95 40 13 -43 54 -88 -271 -1 227 -7 140 1 51 123 -168 -143 -60
8139 -60 -16 20 -270 60 146 -150 -167 10 87 -15 -173 38 168 -280 -74 22 -108 -23 -52 48 109 -95 -106 -43
8163 -43 -158 55 105 64 48 -102 9 -23 -224 109 156 44 -118 -147 -178 37 -41 162 282 -176 -20 -9 158
8186 158 177 -205 -35 108 83
8191H3
##END NTUPLES=NMR FID
##END=
