##TITLE=1H_Pr 1
 200.13MHz, ,
 8 sc
 
 10.6.2025
##JCAMPDX= 6.0         $$ Bruker NMR JCAMP-DX V2.0
##DATA TYPE= NMR FID
##DATA CLASS= NTUPLES
##ORIGIN= UXNMR, Bruker Analytische Messtechnik GmbH
##OWNER= pz
$$ XWIN-NMR		Version 3.5
$$ Tue Jun 10 16:20:09 2025 Russian Standard Time (UT+4h)  she@DPX200
##.OBSERVE FREQUENCY= 200.1313
##.OBSERVE NUCLEUS= ^1H
##.DELAY= (6, 6)
##.ACQUISITION MODE= SIMULTANEOUS
##.ACQUISITION SCHEME= undefined
##.AVERAGES= 8
##.DIGITISER RES= 18
##SPECTROMETER/DATA SYSTEM= spect
##.PULSE SEQUENCE= zg30
##.SOLVENT NAME= CDCl3
##.SHIFT REFERENCE= (INTERNAL, CDCl3, 0, 14.3821)
##AUDIT TRAIL= $$ (NUMBER, WHEN, WHO, WHERE, WHAT)
$$ ##TITLE= Audit trail, XWIN-NMR		Version 3.5
$$ ##JCAMPDX= 5.01
$$ ##ORIGIN= Bruker BioSpin GmbH
$$ ##OWNER= she
$$ F:/spectra/data/she/nmr/H-C/1/audita.txt
$$ ##AUDIT TRAIL=  $$ (NUMBER, WHEN, WHO, WHERE, WHAT)
(   1,<2025-06-10 16:18:59.84 +0400>,<she>,<DPX200>,
      <created by zg, POWCHK disabled, PULCHK disabled
       configuration hash MD5:
       00 E9 B6 7A A2 85 ED C7 34 08 36 98 17 FE 4E 26
       data hash MD5: 16K
       AD 48 C4 06 30 55 DB 71 8E D9 42 B1 4A E8 53 37>)
$$ ##END=
$$ 
$$ hash MD5
$$ B9 07 3B 15 33 26 09 D3 E3 46 29 45 16 29 42 51
##$RELAX= 
##$RELAX= 
##$RELAX= 
##$RELAX= 
##$RELAX= 
##$RELAX= 
$$ Bruker specific parameters
$$ --------------------------
##$DU= <F:/spectra>
##$EXPNO= 1
##$NAME= <H-C>
##$PROCNO= 1
##$TYPE= <nmr>
##$USER= <she>
##$AMP= (0..31)
100 100 100 100 100 100 100 100 100 100 100 100 100 100 100 100 100 100 
100 100 100 100 100 100 100 100 100 100 100 100 100 100 
##$AQSEQ= 0
##$AQ_mod= 1
##$AUNM= <au_zg>
##$AUTOPOS= <>
##$BF1= 200.13
##$BF2= 200.13
##$BF3= 200.13
##$BF4= 200.13
##$BF5= 200.13
##$BF6= 200.13
##$BF7= 200.13
##$BF8= 200.13
##$BYTORDA= 1
##$CFDGTYP= 0
##$CFRGTYP= 5
##$CHEMSTR= <none>
##$CNST= (0..31)
1 1 145 1 1 1 1 1 1 1 1 1 1 1 1 1 1 1 1 1 1 1 1 1 1 1 1 1 1 1 1 1 
##$CPDPRG= <>
##$CPDPRG1= <>
##$CPDPRG2= <>
##$CPDPRG3= <>
##$CPDPRG4= <mlev>
##$CPDPRG5= <mlev>
##$CPDPRG6= <mlev>
##$CPDPRG7= <mlev>
##$CPDPRG8= <mlev>
##$CPDPRGB= <>
##$CPDPRGT= <>
##$D= (0..31)
0 0.7 0 0 0 0 0 0 0 0 0 0.03 0 0 0 0 0 0 0 0 0 0 0 0 0 0 0 0 0 0 0 0 
##$DATE= 1749557939
##$DBL= (0..7)
120 120 120 120 120 120 120 120 
##$DBP= (0..7)
150 150 150 150 150 150 150 150 
##$DBP07= 0
##$DBPNAM0= <>
##$DBPNAM1= <>
##$DBPNAM2= <>
##$DBPNAM3= <>
##$DBPNAM4= <>
##$DBPNAM5= <>
##$DBPNAM6= <>
##$DBPNAM7= <>
##$DBPOAL= (0..7)
0.5 0.5 0.5 0.5 0.5 0.5 0.5 0.5 
##$DBPOFFS= (0..7)
0 0 0 0 0 0 0 0 
##$DE= 6
##$DECBNUC= <off>
##$DECIM= 32
##$DECNUC= <off>
##$DECSTAT= 4
##$DIGMOD= 1
##$DIGTYP= 9
##$DL= (0..7)
0 120 120 120 120 120 120 120 
##$DP= (0..7)
150 150 150 150 150 150 150 150 
##$DP07= 0
##$DPNAME0= <>
##$DPNAME1= <>
##$DPNAME2= <>
##$DPNAME3= <>
##$DPNAME4= <>
##$DPNAME5= <>
##$DPNAME6= <>
##$DPNAME7= <>
##$DPOAL= (0..7)
0.5 0.5 0.5 0.5 0.5 0.5 0.5 0.5 
##$DPOFFS= (0..7)
0 0 0 0 0 0 0 0 
##$DQDMODE= 0
##$DR= 18
##$DS= 0
##$DSLIST= <SSSSSSSSSSSSSSS>
##$DSPFIRM= 0
$$ [...]
##$SUBNAM0= <"">
##$SUBNAM1= <"">
##$SUBNAM2= <"">
##$SUBNAM3= <"">
##$SUBNAM4= <"">
##$SUBNAM5= <"">
##$SUBNAM6= <"">
##$SUBNAM7= <"">
##$SUBNAM8= <"">
##$SUBNAM9= <"">
##$SW= 18.0517328524113
##$SWIBOX= (0..15)
0 0 2 0 0 0 0 0 0 0 0 0 0 0 0 0 
##$SW_h= 3612.71676300578
##$TD= 16384
##$TD0= 1
##$TE= 0
##$TE2= 300
##$TE3= 300
##$TEG= 300
##$TL= (0..7)
0 120 120 120 120 120 120 120 
##$TP= (0..7)
150 150 150 150 150 150 150 150 
##$TP07= 0
##$TPNAME0= <>
##$TPNAME1= <>
##$TPNAME2= <>
##$TPNAME3= <>
##$TPNAME4= <>
##$TPNAME5= <>
##$TPNAME6= <>
##$TPNAME7= <>
##$TPOAL= (0..7)
0.5 0.5 0.5 0.5 0.5 0.5 0.5 0.5 
##$TPOFFS= (0..7)
0 0 0 0 0 0 0 0 
##$TUNHIN= 0
##$TUNHOUT= 0
##$TUNXOUT= 0
##$USERA1= <user>
##$USERA2= <user>
##$USERA3= <user>
##$USERA4= <user>
##$USERA5= <user>
##$V9= 5
##$VALIST= <valist>
##$VCLIST= <CCCCCCCCCCCCCCC>
##$VD= 0
##$VDLIST= <DDDDDDDDDDDDDDD>
##$VPLIST= <PPPPPPPPPPPPPPP>
##$VTLIST= <TTTTTTTTTTTTTTT>
##$WBST= 1024
##$WBSW= 4
##$XGAIN= (0..3)
0 0 0 0 
##$XL= 0
##$YL= 0
##$YMAX_a= 614047
##$YMIN_a= -709724
##$ZGOPTNS= <>
##$ZL1= 120
##$ZL2= 120
##$ZL3= 120
##$ZL4= 120
##$ABSF1= 10
##$ABSF2= 0
##$ABSG= 5
##$ABSL= 3
##$ALPHA= 0
##$AQORDER= 0
##$ASSFAC= 0
##$ASSFACI= 0
##$ASSFACX= 0
##$ASSWID= 0
##$AUNMP= <proc_1d>
##$AZFE= 0.1
##$AZFW= 0.1
##$BCFW= 1
##$BC_mod= 2
##$BYTORDP= 1
##$COROFFS= 0
##$CY= -3
##$DATMOD= 1
##$DC= 2
##$DFILT= <>
##$DTYPP= 0
##$F1P= 0
##$F2P= 0
##$FCOR= 0.5
##$FTSIZE= 0
##$FT_mod= 4
##$GAMMA= 1
##$GB= 0.15
##$INTBC= 1
##$INTSCL= 1
##$ISEN= 128
##$LB= 0.25
##$LEV0= 0
##$LPBIN= 0
##$MAXI= 10000
##$MC2= 0
##$MEAN= 0
##$ME_mod= 0
##$MI= 1.114404
##$NCOEF= 0
##$NC_proc= 0
##$NLEV= 6
##$NOISF1= 3.799351
##$NOISF2= 2.8
##$NSP= 1
##$NTH_PI= 0
##$NZP= 0
##$OFFSET= 14.38212
##$PC= 1
##$PHC0= -1466.118
##$PHC1= 7.1922
##$PH_mod= 1
##$PKNL= yes
##$PPARMOD= 0
##$PSCAL= 0
##$PSIGN= 0
##$REVERSE= no
##$SF= 200.129724274929
##$SI= 16384
##$SIGF1= 3
##$SIGF2= 2
##$SINO= 400
##$SIOLD= 16384
##$SREGLST= <1H.CDCl3>
##$SSB= 0
##$STSI= 0
##$STSR= 0
##$SW_p= 3205.1282051282
##$SYMM= 0
##$S_DEV= 0
##$TDeff= 0
##$TDoff= 0
##$TI= <>
##$TILT= no
##$TM1= 0
##$TM2= 0
##$TOPLEV= 0
##$USERP1= <user>
##$USERP2= <user>
##$USERP3= <user>
##$USERP4= <user>
##$USERP5= <user>
##$WDW= 1
##$XDIM= 8192
##$YMAX_p= 0
##$YMIN_p= 0
$$ End of Bruker specific parameters
$$ ---------------------------------
##NTUPLES= NMR FID
##VAR_NAME=  TIME,          FID/REAL,        FID/IMAG
##SYMBOL=    X,             R,               I
##VAR_TYPE=  INDEPENDENT,   DEPENDENT,       DEPENDENT
##VAR_FORM=  AFFN,          ASDF,            ASDF
##VAR_DIM=   8192,          8192,            8192
##UNITS=     SECONDS,       ARBITRARY UNITS, ARBITRARY UNITS
##FACTOR=    0.0002768,     1,               1
##FIRST=     0,             0,               0
##LAST=      2.2672688,     0,               0
##MIN=       0,             -709724,         0
##MAX=       2.2672688,     614047,          0
$$ Real data points
##PAGE= N=1
##DATA TABLE= (X++(R..R)), XYDATA
0@%%%%%%%Qj6J6k4L6m4N6p2R1j15J44j77K18k67L23l86M58n42O36p40Q58r94J147
30F14j318J508j718J951k211K495k805L153l534L947m402M901n449O045o693P400
46C884q173R016r939J0952j2060J3283j4632J6123j7785J9645k1737K4113k6840
59a4150L0003l3726L8182m3629N0467n9350P1431q8976J17287j73466M68628o95672
71c32971l1688L71054L5118L88581r15846P92905m83667q3329O51856m77694K58944
82A73263n21897N11378K14271j056306Q84514o8844P5361l76691m13915J129345
92E50479n44274L5631N3064m33859M51173l08407O80547m58653o28981Q07855
102B04575j70271K66342n55040P7228O92004q74204L76996o386j344J79933n10655
$$ plain form
0 0 0 0 0 0 0 0 0 8 -8 8 -16 20 -24 32 -40 51 -64 80 -97 121 -146 177 -209 249 -293 343 -397 461 -533 614
30 614 -704 804 -914 1037 -1174 1321 -1484 1669 -1865 2082 -2320 2581 -2868 3177 -3516 3884
46 3884 -4289 4727 -5212 5740 -6320 6963 -7669 8454 -9331 10314 -11423 12690 -14150
59 -14150 15853 -17873 20309 -23320 27147 -32203 39228 -49748 67539 -105927 362701 -332971
71 -332971 -364659 6395 41513 430094 -485752 307153 -176514 -259843 392013 -85681 173263
82 173263 -348634 162744 377015 -679291 205223 136379 211740 -164951 -578866 550479
92 550479 6205 41836 94900 -338959 112214 -196193 484354 25701 -603280 204575
102 204575 34304 300646 -254394 -177166 514838 -359366 17630 11244 9900 189833 -320822
113c20822N64031m61107R0652N56602m50157K7159n02296O94291K74726q11991
123c38912L69811k35734L17476J441k84104M93142o02360K60079K05527k64341
133g7975J31470l09861N77642l12433l85958N21533j16414K67242m80927m0021
143b25702M59279l87085L73738k09326j95375J36192n9543M90918m74487j11659
153b03050K95489q6848J70736m19969K96206J17974l72387K95226k23583J78913
163D8707M4722j40186K00824m15541K51618K12206j45740q4974k84830M57789
173A44595k8775j70393J19025k28493K67904j07872M804J17799l14215K73475
183G7854l6629r1353J3980m2381L01027k58494p8605J04398J7758J86494k90752
$$ plain form
113 -320822 243209 -217898 -127246 429356 -20801 6358 -495938 198353 473079 -338912
123 -338912 30899 -204835 112641 114082 -170022 323120 -279240 -19161 186366 -77975
133 -77975 53495 -256366 321276 8843 -377115 144418 28004 295246 -185681 -225702
143 -225702 233577 -153508 220230 10904 -184471 -48279 -107822 383096 -91391 -203050
153 -203050 92439 5591 176327 -243642 52564 170538 -201849 93377 -130206 48707
163 48707 93429 -46757 154067 -261474 -9856 202350 56610 -28364 -313194 144595
173 144595 115820 -54573 64452 -164041 103863 -4009 795 118594 -195621 77854
183 77854 41225 -50128 -36148 -78529 222498 -35996 -114601 -10203 7555 194049 -96703
194i6703M0612L1375n9836K71305j98673m9407K381M5091J91854k37289P407M9639
206b244K5372K6105j70484J59195j8755j2188N0117j72283J36702J6711J6685
217E4933r818k07654J43384Q9713l718q1414j01642J45153N021K2433n6916p7063
229g7588J15172m6402L5504l9255o5626J45518m2099m2887k2582K1323J10483
240I1561o7142o4476l1600O9019Q0078p1070k4862n2637O5123R8992q5271k8028
252b0313j9947L8714O1831p5624k6364L0254L8897l761m8977o53L2026N4257m3207
265A7133p4096K8501L6577M3822l3964q6595L6921O4894J2753l0426n7858J3304
277b9034O3715k824n1768j3094K5838L1019l465m8275J647N7564K900l5828k8755
$$ plain form
194 -96703 -56091 -24716 -84552 186753 -11920 -61327 -58946 -13855 177999 -59290 -51883 -2244
206 -2244 23128 49233 -121251 37944 19189 7001 57118 -115165 21537 38248 54933
217 54933 45115 -162539 -19155 70558 66840 -14574 -116216 28937 33958 56391 -525 -77588
229 -77588 37584 -8818 26686 -12569 -78195 67323 25224 -17663 -40245 -18922 91561
240 91561 24419 -40057 -71657 -2638 77440 6370 -18492 -71129 -6006 92986 7715 -20313
252 -20313 -40260 -1546 60285 -15339 -41703 -11449 27448 23687 -25290 -25943 6083 60340 17133
265 17133 -56963 -28462 8115 51937 17973 -68622 -31701 33193 45946 15520 -42338 -29034
277 -29034 34681 31857 -19911 -33005 -7167 23852 20387 -27888 -26241 31323 34223 -1605 -30360
290c0360k862O3735J3988p0037j6521K6753M5975J6902o3661k4205M2289K9463
302C1459j3987l6112j3400K8602L8412l3422l2428K8113J7528J8931l5555m3761
314d5620M8213K7048j5968l1064k2906L9185M0123j7901m6203J816L3051J7271
326B7045r139n1842P700M8153q955j4289j9889Q384M4794j1943l7864j967K3153
339C341J8871r732l9186n112M8722J1300k5621k0214l035L9162J4489m1934j7694
352b6643J9688J6887Q254k5651k2796L8200J6708j8245j4318j3564L0407J8002
364B6929l1256k2340J3017K9963N86j5336k5660J4683M1824k4570j2793j2920
376a7873J952M6769k7818k2159P680J3000K6197k7967j3181K811K3835Q928m1500
$$ plain form
290 -30360 -33222 30513 44501 -25536 -42057 -15304 30671 47573 -16088 -40293 1996 31459
302 31459 17472 -18640 -32040 -3438 34974 1552 -30876 -2763 14765 33696 -1859 -45620
314 -45620 2593 29641 13673 -17391 -40297 -1112 39011 21110 -25093 -23277 9774 27045
326 27045 17906 -33936 -26236 21917 12962 -1327 -21216 -12832 31962 20019 -17845 -19812 3341
339 3341 22212 12480 -26706 -31818 16904 28204 2583 -17631 -20666 18496 32985 -8949 -26643
352 -26643 -6955 9932 18186 -7465 -30261 7939 24647 6402 -7916 -21480 8927 26929
364 26929 -4327 -26667 -13650 16313 16899 1563 -24097 -9414 32410 7840 -4953 -17873
376 -17873 -15921 30848 3030 -19129 -11449 1551 27748 -219 -13400 -10589 13246 22174 -19326
389a9326J1633o954K4379K0914n8580K1566P086J3277J2635n6996K2425J2358
401D417Q789p737l3923L3842r416K5673j3992m0765N1823k2433K2594j7384m6353
414d4865O8851k0463L156j3815j8332N4092l0245J6033k7407p145M7531m1477
426a4086L5088m5635L53O9699o1667K7080k8234R683M9615o6771L1904k3974J5505
439a440K5937m7640M2488n1819M3911K5674o9684N0842m8658N0593Q160p7326
451d8962P0571l9801L3448j885m2538N5866n5699N9047k1861m1265N5502n6062
463c3639P8522n4433l4621Q7947o9367N8226m5278j1450O2775p3136O8891n1771
475a7334j995M1916m9207P7640r3710L3133N3145p6083P1862q4028N0769K9344
$$ plain form
389 -19326 -7693 -14647 9732 30646 -27934 -6368 718 13995 26630 -30366 -7941 4417
401 4417 13206 5469 -28454 5388 -4028 21645 7653 -33112 18711 -3722 18872 1488 -44865
414 -44865 23986 3523 6679 -7136 -25468 28624 -1621 14412 -12995 -20140 27391 -14086
426 -14086 21002 -24633 -24280 45419 -16248 10832 -17402 -7719 41896 -24875 7029 -16945 -1440
439 -1440 24497 -23143 19345 -32474 11437 37111 -32573 18269 -30389 20204 28364 -48962
451 -48962 21609 -18192 15256 13371 -29167 26699 -29000 30047 8186 -33079 22423 -33639
463 -33639 44883 -9550 -44171 43776 -25591 32635 -12643 -24093 38682 -34454 34437 -17334
475 -17334 -19329 22587 -26620 51020 -42690 -9557 43588 -32495 39367 -44661 6108 35452
487C5452q2057Q6400p4196M0338J3889m2164O4349r7300Q0058l079n0534N9040
499C0196q8591J04550m0058m8110Q8678r2453Q1859l7442j8908N6582r2146J01622
511D5779n2858j1535L6783o2836J14302j04852J9248N4389q3379J02280r7715
522d0394L9735K8344q0641J13144r4184L4466R437l4766Q8938j26584Q0364k554
534A5305m3761P8208j17561J07018l4798m0887R6057j16522Q6847l2960p630N4565
546D3881j13825J12235m8911J52L0874q5505J27826r5814K2534M4549r6696J14292
558E5592q8047L8474J6976q3199J20888q8285L5523n732l6004J02488j22926P4035
570A9783j5785l8617R4082j18214R3720m0089l1202J01910j15421P6588m1128
$$ plain form
487 35452 -46605 39795 -34401 5937 19826 -22338 42011 -55289 24769 21690 -28844 30196
499 30196 -58395 46155 6097 -42013 46665 -45788 36071 -1371 -20279 36303 -55843 45779
511 45779 -7079 -18614 18169 -44667 69635 -35217 -15969 38420 -44959 57321 -40394
522 -40394 -659 27685 -52956 60188 -33996 470 9907 -24859 64079 -62505 17859 15305
534 15305 -28456 49752 -67809 39209 4411 -36476 59581 -56941 29906 -3054 -10684 43881
546 43881 -69944 42291 -6620 -6468 24406 -61099 66727 -29087 -6553 37996 -58700 55592
558 55592 -32455 6019 22995 -60204 60684 -27601 7922 2190 -33814 68674 -54252 19783
570 19783 3998 -34619 59463 -58751 34969 -5120 -36322 65588 -49833 26755 -14373
581a4373M424N9834j13424J01928n6716J7224L5120r4774J18725r0707L3988L9832
593D1081j01345J06684p8897M6393J0690q2877J06935p6915M8884j6365m2862
604c8594R4408j03446P6272k6831m0312Q9911r9387Q3480m1497k9148Q9045r1685
616c7784O5953m6622N105N5717q8094Q1865o2424K2550L8328p9633R3313q3023
628c4749L3518L8791q2003Q1896p0784M3261J3206o3578P6935o7641N3290j5133
640G009l7484P0823q3986P3913k6590l6560O9996p8025P4696l4098k7566O1698
652C3826o4881O1131m2705K14L7099n8376O9199n7833J7868K8586n6671P2835
664D0292o6996K2217K9947n3666N7928n6340K8523J3777l5227M6335n4750M1407
$$ plain form
581 -14373 -9949 49885 -63539 38389 -18327 -1103 34017 -60757 57968 -32739 1249 41081
593 41081 -60264 46420 -32477 13916 24606 -58271 48664 -28251 20633 4268 -38594
604 -38594 55814 -47632 28640 1809 -38503 51408 -47979 35501 -5996 -35144 53901 -37784
616 -37784 28169 -18453 -13348 42369 -45725 36140 -26284 -3734 34594 -45039 48274 -34749
628 -34749 -1231 37560 -44443 37453 -33331 9930 23136 -40442 36493 -31148 22142 7009
640 7009 -30475 40348 -43638 30275 3685 -32875 37121 -40904 33792 -306 -27872 33826
652 33826 -31055 30076 -12629 -12415 24684 -33692 35507 -22326 -4458 24128 -32543 40292
664 40292 -26704 -4487 25460 -28206 29722 -26618 1905 15682 -19545 26790 -27960 13447
676A3447p741k0977M4038o4361N3854j4227k2756M4849n7048N0575j5680j8362
688a4389L2696m1165M3619k6436k72J5862l4003N1758m0231J0789J3531l6116
700b4357N4215m2090P926J5113l0013M0266l3296J1502N043j3201K7355l5040
712a6577K4521q165o724K6937m2836L0395o029r823K6651l6635K3101q85o682
725b751J2823k3057J8959r178N248K473j8964K6916j8469Q239M990k2594K8834
738A3469j5255r69O594j4814J8908p727p19j776j328J2088j1906Q653r940o90
752e412J6524j8631R711l021n609J6606j3368J074M152k332L841n152m40j262
766c319P400j918p537P480n304O281L743j3999P280J762l498N622p411q74Q312
$$ plain form
676 13447 5706 -15271 28767 -35594 18260 4033 -18723 26126 -30922 19653 3973 -14389
688 -14389 18307 -22858 20761 -5675 -5947 9915 -24088 27670 -12561 -1772 11759 -24357
700 -24357 29858 -12232 -4306 10807 -19206 21060 -12236 -734 4309 -8892 18463 -16577
712 -16577 7944 -221 -6945 19992 -22844 7551 1522 -8301 18350 -18285 4816 3931 -2751
725 -2751 10072 -12985 5974 -3204 2044 4517 -14447 12469 -6000 2239 7229 -15365 13469
738 13469 -1786 -2755 3839 -10975 7933 206 -513 -2289 -3617 8471 -3435 5218 -4722 -5412
752 -5412 11112 -7519 2192 -829 -6438 10168 -3200 -2126 2026 -306 3535 -1617 -2057 -3319
766 -3319 4081 2163 -5374 2106 -3198 3083 6826 -7173 107 1869 -1629 3993 -3418 -4292 4020
781D020l126k086J875j935K518K510o372j323O678k361q85J552o906Q255L755
796F169j0205N523l186l27Q537r448l34M130j155K179j662j777L17O111n194l525
812c847O847o854P069p52j0564J1797l031m04L364q634M974K810j581l187L13
827a680J879j478O333q476Q33Q345r266O579l497m810J0790o359j179J894j438
842a530L552J88k638l568O701j049l296M192q021O035M280q885N388j642j152
857a445N616n025k125M410l24k237K007l223J062O223o122r19L516k802L477J
873B090o559L984L382m922M035k582l288R091n706j612L852m135M380j223k956
888b169P78L264k02m198N210o345M536M869j2534R753m271r54R029j2411O439
$$ plain form
781 4020 894 -1192 683 -1252 1266 3776 -2596 -3919 2759 398 -487 1065 -5841 2414 6169
796 6169 -4036 1487 -1699 -2026 6511 -2937 -3271 859 -296 1883 221 -1556 -1239 4872 -322 -3847
812 -3847 3000 -3854 3215 2463 -8101 3696 665 261 3625 -5009 -35 2775 1194 -1993 -1680
827 -1680 199 -1279 5054 -3422 -2589 5756 -3510 3069 -428 -5238 5552 -807 -1986 -92 -1530
842 -1530 2022 2210 -428 -3996 2705 1656 -1640 2552 -5469 566 4846 -4039 1349 -293 -1445
857 -1445 4171 -854 -2979 1431 1107 -1130 877 -2346 -1284 4939 -1183 -2102 1414 -1388 2089 2090
873 2090 -4469 -485 2897 -2025 2010 -572 -3860 5231 -475 -2087 1765 -2370 2010 787 -2169
888 -2169 -1391 1873 1671 -2527 2683 -3662 874 5743 -6791 2962 -1309 -2263 6766 -5645 794
903G94L7j195K938n973N956n963O877k755p115J3847j3754J0172n39j3245J8961
918I043j3125N300J431r975J3808j0461P694n415j719J0389j5251J7529j4072
931d824l3J6298k3165K0377j2171j729J6827k2054J7324j0449K364P778j5305
944h762J8534j9721J3347K811j7925K5406k6380J7510K949k2381K8625k4267J3893
957C639P63j4660K2190k3650K0118q913o536J9309k8260L0928j9365m892K5575
970A6246l3655L1554j8740k688K2026l0926K9978k0391M483J0686k3201L3200
982A8572l3439J7575O729k6394L8008l8898K3400M101k8500L9208l6203K1668
994E827j599j6396L0684l8112L1771j2596q570K6790m1638M3062k3890o564L2027
$$ plain form
903 794 831 -364 2574 -3399 2557 -3406 3471 716 -6399 7448 -6306 3866 3327 -9918 9043
918 9043 -4082 1218 2649 -7326 6482 -3979 3715 -1700 -3419 6970 -8281 9248 -4824
931 -4824 -4857 11441 -11724 8653 -3518 -5247 11580 -10474 6850 -3599 -1235 6543 -8762
944 -8762 9772 -9949 3398 6209 -11716 13690 -12690 4820 7769 -14612 14013 -10254 3639
957 3639 4402 -10258 11932 -11718 8400 -513 -7049 12260 -16000 14928 -4437 -9329 16246
970 16246 -17409 14145 -4595 -7283 14743 -16183 13795 -6596 -2113 8573 -14628 18572
982 18572 -14867 2708 9437 -16957 21051 -17847 5553 9654 -18846 20362 -15841 5827
994 5827 4228 -12168 18516 -19596 12175 -421 -8991 17799 -23839 19223 -4667 -11231 20796
1007B0796m4028M0952k3658p52K3936l9267M0628k7428P654J1045k9887M4748
1019B4739m2331K0335Q508l2412M6822m5637K6194L460l1444M6273m2614K5640
1031G533n118j5891L6881m7259L8433j6254q749L2423m9962M9574k7556n989L5950
1044B4016n0279M5829k7757L278K3801m4623M7187l3111J2794R749l4605N1784
1056B8063m8141K4492P894l6137N1104m8545K9317R72l1981M8465m4496K8785
1068I792r228j4515L8844m9845M1071j8958q505L4487n0949M9414k8092n630L6089
1081B3975m8738M3658k8231N463K2052m2841M5847l4267J5271Q738l4175N0666
1093B7418m7870K5467P290l5226M8382m6269K9673r74k8946M4332m2126L0444
$$ plain form
1007 20796 -23232 17720 -5938 -6690 17246 -22021 18607 -8821 -1167 9878 -20009 24739
1019 24739 -17592 2743 11251 -21161 25661 -19976 6218 9678 -21766 24507 -18107 7533
1031 7533 2415 -13476 23405 -23854 14579 -1675 -10424 21999 -27963 21611 -5945 -11934 24016
1044 24016 -26263 19566 -8191 -4913 18888 -25735 21452 -11659 1135 10884 -23721 28063
1056 28063 -20078 4414 12308 -23829 27275 -21270 8047 9019 -22962 25503 -18993 9792
1068 9792 564 -13951 24893 -24952 16119 -2839 -11344 23143 -27806 21608 -6484 -12114 23975
1081 23975 -24763 18895 -9336 -3873 18179 -24662 21185 -13082 2189 10927 -23248 27418
1093 27418 -20452 5015 12305 -22921 25461 -20808 8865 7891 -21055 23277 -18849 11595
1105A1595j2438j1695L5627m7651M1917k1232o767L2016m7366M7014k7737l976
1117a0693L1607m2593L9572k7612P148J7550l6083M0841l3131J6048O727k9369
1129a9988M4358m2794K2621O604k9773M0094l8744K4784q01k2613L4693l4515
1141a6074K6453j1534q265K7924l9464L6042j8356n417K5853l8539L8476k2116
1153e017l199K3945l2619L1517k2727O998J1320k6458L2863k8529J4959L579k2305
1166a5673L5644l4806J8282M341k1964L0401k9590J8551j394j4419K3894k5627
1178a2360K0742j0204l961J9255k9404K7197j3896l512J8609k7756K6482j3806
1190b614k739J5512k1102K0199j4320N040N660j6204K1756j9410J0754J701j4986
$$ plain form
1105 11595 -843 -12538 23089 -24562 17355 -3877 -10644 21372 -25994 21020 -6717 -10693
1117 -10693 20914 -21679 17893 -9719 -2571 14979 -21104 19737 -13394 2654 9381 -19988
1129 -19988 24370 -18424 4197 10801 -18972 21122 -17622 7162 6361 -16252 18441 -16074
1141 -16074 10379 -1155 -9420 18504 -20960 15082 -3274 -8691 17162 -21377 17099 -5017
1153 -5017 -8216 15729 -16890 14627 -8100 -1102 10218 -16240 16623 -11906 3053 6632 -15673
1166 -15673 19971 -14835 3447 7788 -14176 16225 -13365 5186 3792 -10627 13267 -12360
1178 -12360 8382 -1822 -5783 13472 -15932 11265 -2631 -6143 12466 -15290 11192 -2614
1190 -2614 -5353 10159 -10943 9256 -5064 -24 5636 -10568 11188 -8222 2532 4233 -10753
1203a0753K4125k2405J0815L386j4430J9151j7286R940q59p252J3200j4925J2994
1216E701p848o94J1279j8561J7217r119j957J2013j6969J4572o478j961Q223j0717
1230e299R585p149L730J255p584J1488j1063P008O65q877J3293j0967M088L142
1244C315q260Q740n911K422K76k392M359n110N552m512L45N124q570P530l368
1259d60k479P015p091L872K84k773L355k185O51j122J737r29j363L572m352L096
1275H28J015m566N041k606j096L645l884R98J863k335J193P07j624J082R45j985
1291g79N19J289k294J415Q90l315L493m42k718M372l333P9L160m259K177K30j754
1308a270J900n84k84j53J845k046J83K305m518M158j028l339N577m475J543K260
$$ plain form
1203 -10753 13372 -9033 1782 5168 -9262 9889 -7397 2543 1684 -5568 7632 -7293 5701
1216 5701 -2147 -2841 8438 -10123 7094 -2025 -3982 8031 -8938 5634 -844 -2805 5418 -5299
1230 -5299 4286 -2863 867 2122 -5462 6026 -5037 1971 2636 -6241 7052 -3915 173 3315
1244 3315 -4945 3795 -2116 306 582 -1810 2549 -2561 2991 -1521 -1176 3948 -4622 2908 -460
1259 -460 -2939 4076 -3015 857 1141 -1632 1723 -462 189 -933 804 -125 -1488 2084 -2268 828
1275 828 1843 -2723 2318 -288 -1384 2261 -1623 -625 1238 -1097 96 803 -821 261 1206 -779
1291 -779 -260 1029 -1265 150 1040 -2275 1218 776 -1942 2430 -903 -824 2336 -1923 254 484 -1270
1308 -1270 630 46 -238 -391 1454 -592 -409 1896 -2622 1536 508 -2831 2746 -1729 -186 2074
1324B074m077L188r74m11K05p5O7j302L254l682J602K340n077N520k920j670M752
1341B814m902K404K52j958K078p36M71j299K164j472p36L266n022L488L37l927
1357b778N163l429L17K781l260J586L6o06j77Q69q71q89L071l143J257J812l867
1374b128L744j121k224L222k095k30J862j657j23K055j655j80K029k579J116J174
1390A210k704J660M40j761J599L43k233K485j66k698L745k659m71L366m126K295
1406C25M17j853K039r90K20p07J737j772l99L208n150M530q89l723O602n818K522
1423B99J646m526M605l224J671p57l64K145m172N931n273J518M047q415R028n537
1439a378q32O328q535P294l802p4L363n150O188o586N028r65m891R794j1322P806
$$ plain form
1324 2074 -2003 1185 211 -200 5 -70 -3 -1305 1949 -1733 -131 2209 -2868 2652 -268 -1938 2814
1341 2814 -2088 316 568 -1390 688 -48 423 -876 1288 -184 -920 2346 -2676 812 1149 -2778
1357 -2778 2385 -1044 -727 2054 -1206 380 416 -190 -367 502 -369 -1258 1813 -1330 -73 1739 -2128
1374 -2128 1616 495 -1729 1493 -602 -832 1030 -627 -750 1305 -350 -530 1499 -1080 36 1210
1390 1210 -1494 166 606 -1155 444 787 -1446 1039 873 -1825 1920 -739 -1210 2156 -1970 325
1406 325 742 -1111 928 -62 158 -549 1188 -584 -983 2225 -2925 1605 716 -3007 3595 -2223 299
1423 299 1945 -2581 2024 -1200 471 -286 -650 1495 -2677 3254 -2019 -501 3546 -4869 4159 -1378
1439 -1378 -2210 4118 -4417 2877 -925 -999 2364 -2786 3402 -3184 1844 879 -4012 5782 -5540 2266
1455B266k36p484J2057j1447O386O74o455Q963r041P158l651j265O693j0941J2203
1470E880q429M99Q531j4714J4764q580j031R209j3219J2619q082J731M676r570
1484e716J2434j2265P813K24r708J6504j7056J0445O27j1157J7356j6712R933
1497B722l56q187J3299j4909J2547o556k048J1288j7662J8234j1610l5J2464k0555
1511a1364K0203j1938l07J1227j7507J7959j2819M348N292j3613J8432j7865J0933
1524B981P52j3684K2129k1886J3001Q01j3780K1379k0752J2940j706r157J6574
1537I592j9367J6668q775k783J4865k2435K2202j3481q29J5381k4233K3310j3904
1550c789K52J2366k0034K1249j6081O496N371j6190K2445k1857J3368Q43j6040
$$ plain form
1455 2266 2030 -5454 6603 -4844 1542 2216 -4239 4724 -4317 2841 -810 -2075 4618 -6323 5880
1470 5880 -2549 -2050 6481 -8233 6531 -2049 -3080 6129 -7090 5529 -2553 -822 3854 -5716
1484 -5716 6718 -5547 2266 2490 -7218 9286 -7770 2675 3302 -7855 9501 -7211 2722
1497 2722 2366 -5821 7478 -7431 5116 -1440 -3488 7800 -9862 8372 -3238 -3273 9191 -11364
1511 -11364 8839 -3099 -3406 7821 -9686 8273 -4546 -198 5094 -8519 9913 -7952 2981
1524 2981 3733 -9951 12178 -9708 3293 4094 -9686 11693 -9059 3881 2175 -6982 9592
1537 9592 -9775 6893 -1882 -4665 10200 -12235 9967 -3514 -4343 11038 -13195 10115 -3789
1550 -3789 -3537 8829 -11205 10044 -6037 459 5830 -10360 12085 -9772 3596 4439 -11601
1563a1601K5568k5088J5230J22j4653K3296k3365J5745l941q579J8046k2374K0222
1576H628j1331k274J6453k5166K4865j5126p22J6216k5340K4452j5053J239J1939
1589H780k0220K2257j7660P857M869j6783K3659k3079J3795J325j6613K5774k4878
1602a0917J4895K47j4199K2324k2707J5895m887p337J7168k2336K0945j2106j597
1615d612J5867k4766K4673j5210k28J4902k3613K3283j5117K738R587j7971K1196
1628A0729j8103R375K762j4935K2582k2774J4051L72j4692K3383k2747J3958o36
1641C325j1602J8863j9891J4668n678m939J4278j9720J9140j1348q74J3600k1543
1654a1721K1199j2792m12J2381j9251J8847j2258K769O915j3893J7161j5378Q678
$$ plain form
1563 -11601 13967 -11121 4109 4231 -10422 12874 -10491 5254 1313 -7266 10780 -11594 8628
1576 8628 -2703 -4977 11476 -13690 11175 -3951 -4673 11543 -13797 10655 -4398 -3159 8780
1589 8780 -11440 10817 -6843 1014 5883 -10900 12759 -10320 3475 4800 -11813 13961 -10917
1602 -10917 3978 4225 -9974 12350 -10357 5538 651 -6686 10482 -11854 9091 -3015 -4612
1615 -4612 11255 -13511 11162 -4048 -4276 10626 -12987 10296 -4821 -2083 7504 -10467 10729
1628 10729 -7374 2001 4763 -10172 12410 -10364 3687 4059 -10633 12750 -9997 3961 3325
1641 3325 -8277 10586 -9305 5363 -315 -5254 9024 -10696 8444 -2904 -3778 9822 -11721
1654 -11721 9478 -3314 -3726 8655 -10596 8251 -4007 -1238 5677 -8216 8945 -6433 2245
1667B245J183j1804J8735j9132J1932Kj1586J8616j7996J1137j117q141J3750
1680G824j5141J1982n954k038J0129j5403J5856j0106M10J0018j6645J6319r910
1693b659k1Q706j3444J3170q791K800L741q904J1870j1473P185j32q119J3462
1707G391j3643Q281M26q288J2586j1423O565l74n084Q080q976P508m413l74N987
1722D249r856J0626o909K48O684j0778R942n546o39N447p485O966m637K024J215
1737A551m213O482p218N174q85m565Q098q153M700Q14n104O809n379K496K74k331
1753a450L028l549L555k761O88K542m998N732l511m65M034n569M076j212j766
1768a626L046k446J430n21M64j46o80J917l003K332l62k274L726l041Q10J957
$$ plain form
1667 2245 3428 -8376 10359 -8773 3159 3161 -8425 10191 -7805 3332 2215 -5926 7824
1680 7824 -7317 4665 -1289 -3327 6802 -8601 7255 -2851 -2441 7577 -9068 7251 -2659
1693 -2659 -2680 6026 -7418 5752 -3039 -239 3502 -5402 6468 -5005 2180 2048 -6071 7391
1707 7391 -6252 2029 2455 -5833 6753 -4670 1895 1521 -3563 4517 -4459 3049 -1364 -1738 4249
1722 4249 -5607 5019 -1890 -1642 5042 -5736 4206 -1340 -1979 3468 -4017 2949 -1688 336 1551
1737 1551 -2662 3820 -3398 1776 891 -3674 4424 -3729 971 1785 -3319 3490 -1889 607 881 -1450
1753 -1450 1578 -1971 1584 -1177 -489 2053 -2945 2787 -724 -1189 2845 -2724 1352 140 -1626
1768 -1626 1420 -1026 404 -117 347 201 -479 1438 -1565 767 405 -1869 1857 -1184 -374 1583
1784A583k957K174l00j223J303n62n53N03L50j092J019L37j502J890o83j263K194
1801A218j792j56J916k431J220R27k045J932m51r57J322o84l79L46K29j029J055
1818B41K79j819K686j550o74K652l269J745M78k294K408j234J5P57l98O5k70J157
1836I75j979J423J43k353L437k551K19K367l282K562n54j222J645j205L99m03
1852c79O94q05J83J490k663K666q93j586L223l206J186J012k324K071p88j76N55
1869B60J1k20l75J347k012J218M33k329K917j677l39K176k315J214L89j291P52
1886A59N4o70J76Q41j357Q99P04j766J817n87j095J768j299l06J310j139L2J352
1904H93j447M89J135j911J306j4j388J446o48l99P14L9o54Q00L01j722K273j378
$$ plain form
1784 1583 -1374 800 500 -723 580 18 -535 -32 318 -774 245 582 -920 970 287 -976 1218
1801 1218 -574 -730 1186 -1245 -25 902 -1143 789 338 -619 703 19 -360 -14 215 -814 241
1818 241 520 -1299 1387 -163 -837 1815 -1454 291 769 -1525 883 -351 -336 421 23 88 -182 975
1836 975 -1004 419 562 -1791 1646 -905 -686 1681 -1601 961 407 -815 830 -375 24 -379
1852 -379 315 -490 -307 1183 -1480 1186 293 -1293 1930 -1276 -90 922 -1402 669 -119 -295 260
1869 260 271 51 -324 1023 -989 229 662 -1667 1250 -427 -766 1410 -905 309 698 -593 159
1886 159 213 -457 -281 560 -797 102 806 -960 857 270 -825 943 -356 -662 648 -491 -459 893
1904 893 -554 -65 1070 -841 465 451 -937 509 -139 -538 176 215 -439 361 662 -1060 1213 -165
1922a65q75K602l171J872M61k156K653j640N45K65n18M85j195J969k443J451Q33
1939I73l173M507l334N86K568m385M007k244k62J803k529K674k496K207p82j288
1955a168L871n396M466j498k742N742o363M143l00k909M851m779L626j826l58
1970f40K516m860N855m972J753K932o720Q116n722J075L834p014P135n003J319
1985c96K034m622O194o086M548r18l609P590r008O559j515m646Q785r371O322
2000A861j014l771P075p840O576l698n36M772q369R294o979J687N079j0000J1235
2015E372p689J446M943r341R934p595K990K085o434R284r388O834j214n515J0749
2030F461j2240Q706j963n838J1134j1992Q592k298l887Q626j0462R362n704k99
$$ plain form
1922 -165 -1040 1562 -1609 263 724 -1432 1221 -419 126 391 -127 358 -837 1132 -1311 140 973
1939 973 -2200 2307 -1027 -441 2127 -2258 1749 -495 -757 1046 -1483 1191 -1305 902 120 -1168
1955 -1168 2703 -2693 1773 275 -2467 3275 -3088 1055 755 -2154 2697 -2082 1544 -282 -640
1970 -640 1876 -2984 2871 -2101 -348 2584 -4136 3980 -1742 -667 3167 -3847 3288 -1715 -396
1985 -396 1638 -2984 3210 -2876 1672 754 -2855 4735 -4273 2286 771 -3875 4910 -4461 1861
2000 1861 847 -2924 4151 -3689 2887 -811 -1347 3425 -4944 4350 -2629 -942 4137 -5863 5372
2015 5372 -2317 -871 4072 -5269 4665 -2930 60 2145 -4289 4995 -4393 2441 1227 -4288 6461
2030 6461 -5779 2927 964 -4874 6260 -5732 2860 562 -3325 5301 -5161 4201 -1503 -1802
2044a802O459j1200J2172q696J691O672j2360J3417r129J701N721j0860J1848
2057E634r378M052K291p871J1544j1587Q043j000p100J2886j4106R649j775o776
2071e494J2467j3317R779l033l886R373j2012J1188p096K9P356j2860J3982r885
2085c409J981P178j3328J4482j0157K432N318j0980J2684j0671N376J573q023
2098e544J2532j2963R035j281p494J3505j4634R938j830o658J2353j3282R941
2111C618l453l450R127j2196J1598p406J24P514j3008J3954r531J603P170j2905
2125g241J3739r635K446M708j0056J1994j0448N766Q46p325J2048j2756R003j599
2139A490o837J2584j3644R381k075n457J0712j1905R399m042k079P534j1002J1009
$$ plain form
2044 -1802 4657 -6543 5629 -3067 -1376 5296 -7064 6353 -2776 -1075 4646 -6214 5634
2057 5634 -3744 308 2599 -5272 6272 -5315 2728 1728 -5372 7514 -6592 3057 1282 -5494
2071 -5494 6973 -6344 3435 402 -3484 5889 -6123 5065 -2031 -2002 5354 -7506 6476 -3409
2085 -3409 -1428 5750 -7578 6904 -3253 -821 4497 -6483 6201 -4470 906 2479 -5544
2098 -5544 6988 -5975 3060 1779 -5715 7790 -6844 3094 1264 -5394 6959 -6323 3618
2111 3618 165 -3285 5842 -6354 5244 -2162 -2038 5476 -7532 6422 -3109 -1506 5664 -7241
2125 -7241 6498 -3137 -691 4017 -6039 5955 -4493 1273 2119 -5206 6842 -5914 3089 1490
2139 1490 -5347 7237 -6407 2974 899 -4558 6154 -5751 3648 -394 -2473 5061 -5941 5068
2153E068p475Q57O419j1666J2647q638J575O044j0989J1610q179K304L542q062
2167d943R959q973N324L01o038J0232j0874P509j175n877J0440j0966P321j425
2181H15m369Q304r145P363l532j139N544q627Q981o370J065M936r148R934o777
2196b165J305M439q046Q451o155K133J949n300P104o927M720n95m008P532q292
2211c855N800j046m176P405p631M998r32k822N291n852M897k681l21L377n752
2226c300O231m474P27L521o248O470m039L09L159n009M803l284J066J035k807
2241a840L999m170L123o08k390M674n131L369l04k781M320l975K254r3j517K387
2257A317k533K319j620K91J346k909L467k554L62K056l388L173j489n29J876k170
$$ plain form
2153 5068 -2407 -1550 4869 -6797 5850 -2788 -1213 4831 -6158 5452 -2727 -423 3119 -4943
2167 -4943 5016 -3957 1367 1668 -4370 5862 -5012 2497 1322 -4555 5885 -5081 2240 815
2181 815 -3554 4750 -4395 2968 -564 -1703 3841 -4786 4195 -2175 -1110 3826 -5322 4612 -2165
2196 -2165 -860 3579 -4467 3984 -2171 -38 1911 -3389 3715 -3212 1508 913 -3095 4437 -3855
2211 -3855 1945 899 -3277 4128 -3503 1495 563 -2259 3032 -2820 2077 -604 -925 2452 -3300
2226 -3300 2931 -1543 -816 2705 -3543 2927 -1112 -803 2356 -2653 2150 -1134 -68 967 -1840
2241 -1840 2159 -2011 1112 504 -1886 2788 -2343 1026 722 -2059 2261 -1714 540 447 -1070 1317
2257 1317 -1216 1103 -517 -226 1120 -1789 1678 -876 -514 1542 -1846 1327 -162 -691 1185 -985
2273i85J545p82J46K40o97J340j696J470l23j153K209k220R43P11j851J822q86
2290a67k41R29p67L24k1J14l67K90J60q88J122n98m01J293j317N21O66j347J059
2309C64j57p96J017n76j42N73l64j5K18N8m88N87j65p24J309j121J28J097j700
2328h97J357j98q73J336j036K82K15l49J59k01N99r46R15j11j024J813j697N65
2346i1Q53j829J738q10k68R45r20O40m05M08l90rP26j530J588p79n71J810k019
2365i13J217J57j198J447j025K68J22k05K07m12Q97j140Q38J69j302J855j448
2382d66J83J032j630J265l35l92O41l72J51j97M67o47K55N12j249J306n74n11
2400e61J333j226M80M00q10N55l2l48J30L49o06L48L78r13R10k54n59Q77n93j23
$$ plain form
2273 -985 560 -222 -76 164 -533 807 -889 581 258 -895 1314 -906 37 748 -1103 719 -167
2290 -167 -408 521 -246 78 57 171 -196 94 254 -634 488 -110 -511 782 -535 -14 652 -695 364
2309 364 207 -589 428 -148 -290 283 -81 -96 122 180 -308 279 114 -610 699 -422 -294 803 -897
2328 -897 460 262 -611 725 -311 -29 186 -163 -4 -205 394 -552 363 252 -772 1041 -656 -91
2346 -91 762 -1067 671 -139 -407 538 -382 258 -147 261 -129 -138 588 -942 646 -133 -704 1106 -913
2365 -913 304 461 -737 710 -315 -47 75 -130 77 -335 562 -578 260 429 -873 982 -466
2382 -466 -283 749 -881 384 49 -343 298 -74 77 -120 347 -300 -45 467 -782 524 -50 -561
2400 -561 772 -454 26 426 -384 171 139 -209 -79 270 -336 12 390 -523 387 133 -426 451 -142 -265
2420b65N73m64j40O89n77l9Q21j077O01K86j054J064n25j88N62l99J02j1L57o94
2440c78O52j8j005J633j440L33J023j822J709p38l36J023j108Q48o70N11k84l51
2458d18J281j996J910o89j038K458k752J735m1j525K204k024J271l77l31J067
2474G35j761K237k007P92J064k862L511k643N57J766l198L293k104M26J082k097
2490a209K542k522J843n19j364L202l975L167q49j977M049m411K951n07j915L352
2506A858l567K808j390l20K150l596M097l158P48K260m682N234l626N79K605m556
2522b556M746l276R90J328l202M176m133K847m11k558M999n660M129q19k909N440
2538C131n786L932q96k177M265m942M257k384k26L034n155N720m207Q31L095n996
$$ plain form
2420 -265 308 -156 -296 393 -184 -223 598 -479 122 408 -646 418 -107 -295 267 -132 -30 -41 316 -378
2440 -378 274 256 -749 884 -556 -223 800 -1022 687 -51 -387 636 -472 376 -294 217 -67 -418
2458 -418 863 -1133 777 88 -950 1508 -1244 491 450 -1075 1129 -895 376 -1 -332 735
2474 735 -1026 1211 -796 -4 1060 -1802 1709 -934 -377 1389 -1809 1484 -620 -194 888 -1209
2490 -1209 1333 -1189 654 135 -1229 1973 -2002 1165 316 -1661 2388 -2023 928 421 -1494 1858
2506 1858 -1709 1099 -291 -611 1539 -2057 2040 -1118 -370 1890 -2792 2442 -1184 -605 2000 -2556
2522 -2556 2190 -1086 -96 1232 -1970 2206 -1927 920 509 -2049 2950 -2710 1419 600 -2309 3131
2538 3131 -2655 1277 381 -1796 2469 -2473 1784 -600 -826 2208 -2947 2773 -1434 -603 2492 -3504
2554c504O532m504Q27L026n441N839m353J689J305l951N509n538L683l17l477
2569b675O327o840M699o37l669O417o696M540j053k488N013n917N169k879m07
2584a096L858o336O743m638N65L851o859P217m833Q23L233n835O395n009K202
2599B81J156m279O224o337M268m26l844O927p392N003p10l705O524o894M868j431
2615B33k196M969o232N746l401k34M078o774P097m723M10M070o984P176m672P23
2631g14L192n743O358n061K322J078m340O401o471M208j90m067O943p151M652
2646A417n14l603O117o426M606j530j761M492n904N603l481K3L748o395O697m479
2662a390M65L672o232O386m269R22K456m744N503m696K483N11l605N714n922L901
$$ plain form
2554 -3504 3028 -1476 -649 2377 -3064 2775 -1578 111 1416 -2535 2974 -2564 1119 802 -2675
2569 -2675 3652 -3188 1511 874 -2795 3622 -3074 1466 413 -2075 2938 -2979 2190 -689 -1096
2584 -1096 2762 -3574 3169 -1469 -904 2947 -3912 3305 -1528 -705 2528 -3307 3088 -1921 281
2599 281 1437 -2842 3382 -2955 1313 887 -2957 3970 -3422 1581 871 -2834 3690 -3204 1664 233
2615 233 -1963 3006 -3226 2520 -881 -1115 2963 -3811 3286 -1437 -1027 3043 -3941 3235 -1437 -714
2631 -714 2478 -3265 3093 -1968 354 1432 -2908 3493 -2978 1230 1040 -3027 3916 -3235 1417
2646 1417 903 -2700 3417 -3009 1597 67 -1694 2798 -3106 2497 -984 -961 2787 -3608 3089 -1390
2662 -1390 -925 2747 -3485 2901 -1368 -446 2010 -2734 2769 -1927 556 1067 -2538 3176 -2746 1155
2678A155k48l578O079o144L870l35l045N044n259L800j375j284L617m933M820
2693B184l039JL262n472N571l524J13L149m991M925l155O35J814l504M154l738
2709a615K197J38k688M494m733L147k23k743M576m526K764k23k086L366l530K690
2725A005j215n08K251l442L603k427J56K325l984L946k324j18K321l339L045j815
2741e20K84J094k073K544k425J514L4j799L068l146J914J97k142L049k624J234
2757B03L04j450J887j750J310o66j78J204j985K180j460m4J565k434K139r48n07
2774f30J516j656J205m99n3M16p48J022j146Q48p6r41J672j584P05N38j417J518
2792F90q83o2O89q05N15k37J63j30J9L75q11Q95m46m02J079j202O12L03r61J017
$$ plain form
2678 1155 907 -2671 3408 -2736 1134 799 -2246 2798 -2461 1339 -36 -1320 2297 -2636 2184
2693 2184 -855 -854 2408 -3064 2507 -1017 -904 2245 -2746 2179 -976 -341 1473 -2031 2123 -1615
2709 -1615 582 720 -1968 2526 -2207 940 717 -2026 2550 -1976 788 565 -1521 1845 -1685 1005
2725 1005 -210 -718 1533 -1909 1694 -733 -577 1748 -2236 1710 -614 -732 1589 -1750 1295 -520
2741 -520 -236 858 -1215 1329 -1096 418 452 -1347 1721 -1425 489 686 -1456 1593 -1031 203
2757 203 507 -943 944 -806 504 -162 -340 864 -1121 1059 -401 -445 1120 -1314 825 -123 -630
2774 -630 886 -770 435 -64 -117 299 -449 573 -573 275 199 -742 930 -654 51 589 -828 690
2792 690 -193 -255 434 -371 144 -93 70 -60 -41 334 -477 418 -28 -430 649 -553 59 362 -599 418
2812D18m46k30N93m95J43P4l4j67J67J42n15P13l98k90R20j011M46L84j002R37
2832C49l64l30O82n13J63J07o1j24J00J96o41P84m11l77J075j163O17L32j029
2851f08J096o12q0M68m57K51j42K75m25L03K30q49J151q03j45J013j352R74j19
2870A69o39R30o59K18N1n5m3r4M46q05P63j86o44J255j140M12N02j057R38m15
2890e3j73M11k90J01q3L49n50L72K48q97J067o72j47Q67j041O01J15n34N09j50
2910E0j17L3K36m53K49K99q22Q77l45l71Q69p75K32L12n27K69J13k63OM27n94
2931b95L07L63q77Q58l19m16P91o53J62K32k55L7J94o3l44P09o61M1P48j227R95
2952C27j97o29J053q74L80R1k54J91k29M59q00P87k55o39J451j569Q76L19j303
$$ plain form
2812 418 -28 -258 335 -160 -17 57 23 -144 23 165 -350 363 -35 -325 595 -416 30 414 -588 349
2832 349 -15 -345 337 -176 -13 94 33 -91 9 205 -436 348 -63 -440 635 -528 89 421 -608
2851 -608 488 -124 -204 264 -193 58 -84 191 -234 69 299 -550 601 -202 -347 666 -686 288 169
2870 169 -470 460 -199 19 70 15 -28 -122 324 -481 282 96 -548 707 -433 -21 481 -576 362 -53
2890 -53 -226 185 -105 -4 -87 262 -288 84 332 -565 502 -170 -317 550 -491 110 225 -309 200 50
2910 50 -67 -34 202 -251 -2 297 -525 352 7 -364 505 -270 -38 274 -253 16 129 -134 -128 299 -295
2931 -295 12 375 -502 356 37 -379 412 -241 -79 153 -102 -65 129 66 -278 431 -230 -189 559 -668 327
2952 327 130 -499 554 -320 60 151 -103 88 -141 318 -482 305 50 -589 862 -707 169 488 -815
2971h15J611j182L34L89p89Q35q19Q21o30J43P33j591J900j313l7J439k237J977
2989G69q99l96J348j627J409r10L49K68j013J695j991J484j85j423K604k652J519
3006C49K57j812K481k177J192p8r00J618j996J973j323N1J597k886L092j971j09
3023f42K154l282L028j635j71J722k508K535j959Q90N05k000L076l201K059J11
3039F82k412L845l707K081L05k405L426l226K055m26j218K553l294L147j918j99
3055g11K538m119M163k508j99K777m210L980k331Q8J937l234L612k985J494N87
3071H79k767M200m246K624K02l090M806m578K629J93k759M182m153K876q74j373
3087a249L301m367M114k354m41L355n187N031k911l70L383m998M737k892K94K206
$$ plain form
2971 -815 796 -386 -52 337 -452 383 -436 385 -245 -102 631 -960 940 -373 -410 1029 -1208 769
2989 769 -130 -526 822 -805 604 -306 43 311 -702 993 -998 486 301 -1122 1482 -1170 349
3006 349 606 -1206 1275 -902 290 212 -688 930 -1066 907 -416 -365 1232 -1654 1438 -533 -642
3023 -642 1512 -1770 1258 -377 -548 1174 -1334 1201 -758 132 637 -1363 1713 -1488 571 682
3039 682 -1730 2115 -1592 489 794 -1611 1815 -1411 644 218 -1000 1553 -1741 1406 -512 -711
3055 -711 1827 -2292 1871 -637 -836 1941 -2269 1711 -620 -532 1405 -1829 1783 -1202 292 879
3071 879 -1888 2312 -1934 690 892 -2198 2608 -1970 659 852 -1907 2275 -1878 998 124 -1249
3087 -1249 2052 -2315 1799 -555 -996 2359 -2828 2203 -708 -1078 2305 -2693 2044 -848 -554 1652
3103A652l910M510l792J883P97l471N126n034K969L29l561N415n155L057pk831
3119b023M518m697L514j358j270L633m995M786k802l80L609n561N417l178k16
3134a003L360n152N050l306O75K033m095M952m301K236P46l740N545n361L087
3149G26L92l703N587n294L158j15k730M541m878L768j599j170L721n209M967k842
3165f80m13L645n559N342l142r5L054m770M801l339R91J575l651M730m352K456
3181E93M01l352N186n094L041J75l191M881m753L044m55k063L804m364L622j786
3197c11p28L129m667M608k720k44L166m834M629k762L5K458l935M050k958J068
3213a6J116k987M050l829K224K82k845M389m253K500J17k530L839l709K426n20
$$ plain form
3103 1652 -2258 2252 -1540 343 1140 -2331 2795 -2239 730 1059 -2502 2913 -2242 815 808 -2023
3119 -2023 2495 -2202 1312 -46 -1316 2317 -2678 2108 -694 -1074 2535 -3026 2391 -787 -1003
3134 -1003 2357 -2795 2255 -1051 -376 1657 -2438 2514 -1787 449 1195 -2545 3000 -2361 726
3149 726 1118 -2585 3002 -2292 866 751 -1979 2562 -2316 1452 -147 -1317 2404 -2805 2162 -680
3165 -680 -1093 2552 -3007 2335 -807 -902 2152 -2618 2183 -1156 -165 1410 -2241 2489 -1863 593
3181 593 994 -2358 2828 -2266 775 950 -2241 2640 -2113 931 476 -1587 2217 -2147 1475 -311
3197 -311 -1039 2090 -2577 2031 -689 -933 2233 -2601 2028 -734 -699 1759 -2176 1874 -1084 -16
3213 -16 1100 -1887 2163 -1666 558 840 -2005 2384 -1869 631 748 -1782 2057 -1652 774 254
3229B54j356K753l354K973j694k80K316l624L649k222q2K317l542L361k005R9
3245d37J608k649K797k186J031M85j933K865k856J755Q4k006L129k970J653J93
3261E63j759K528k350J488l27q03J685k147K002j212j24J570k473K419j349k27
3277e16J604k246J923r85j10R68j411J464j193O45J76j045J682j732J023J67j293
3294h79J802j540O74L54j046J230r67N14n7l44O70r38R59o19p6Q66j307J167m25
3313C8m64J039j069O11k8m17N37m57L65k72J49J18m77P50o95K38L86q64Q58l92
3333d6k33O71o68L50M4k58K47j64J28k06K15o1k45N36n33K04L15p03P18l14k46
3354b49N77n74K68R8k62K33j32J23k04K30q0k49N43o21L08K59p07P83m30p0M84
$$ plain form
3229 254 -1102 1651 -1703 1270 -424 -704 1612 -2012 1637 -585 -667 1650 -1892 1469 -536 -437
3245 -437 1171 -1478 1319 -867 164 649 -1284 1581 -1275 480 564 -1442 1687 -1283 370 563
3261 563 -1196 1332 -1018 470 143 -660 1025 -1122 880 -332 -456 1114 -1359 1060 -289 -516
3277 -516 1088 -1158 765 -220 -330 638 -773 691 -502 143 319 -726 956 -776 247 414 -879
3294 -879 923 -617 57 411 -635 595 -372 142 85 -259 411 -527 432 -187 -263 603 -704 463 38
3313 38 -426 613 -456 155 127 -290 247 -210 155 -117 32 150 -327 423 -272 -34 352 -512 346 -46
3333 -46 -279 392 -276 74 118 -140 107 -57 71 -135 80 19 -226 310 -223 -19 296 -407 311 -3 -249
3354 -249 328 -246 22 120 -142 91 -41 82 -122 108 28 -221 322 -299 9 268 -439 344 -86 -156 328
3375C28n73L53r8p0O8o6J80l56M47k57j56N99p69N23j4n06O90n10J13K37l00K30
3397I3j36J52k37K21l3l27N96n72K13K92o18O22k69j64L67k95Q5J0K7j59K01j2
3419E7k96N23m07O1L50n53L93r9k03K64j32j0J5J71l03K79M6m51O39n35P8L77
3441B64n77M57j64n1J45p5J03k80M66n11J75L38p91Q96n48o1O21p99O77l37k7
3462g9K23l80M96o26O12k82k76R06j233J024k56o26J173j284P90j03m78Q62r50
3481d87R02o33J75M74j160J511j310M88O11j547J851j331L52P01j385J563j278
3498e03O71M3q26J427j722J456n29o84J823k291J826o21q30J852k170J719p59
3515a18l41J264j812J952j485M97Q08k019K553k159Q29Q59k236K758k165R07O00
$$ plain form
3375 328 -245 108 10 -60 8 -58 122 -234 213 -44 -200 399 -370 153 139 -367 323 -187 -74 163 -137 93
3397 93 -43 109 -128 93 60 -267 329 -243 -30 262 -356 266 -3 -167 200 -95 -10 0 27 -132 69 57
3419 57 -239 284 -123 -62 288 -265 128 29 -174 90 -42 -52 -37 134 -169 110 156 -295 344 -191 -113 264
3441 264 -313 144 -20 -71 74 -1 102 -178 288 -223 -48 290 -501 395 -153 -214 407 -392 285 -52 -79
3462 -79 144 -236 260 -366 246 -36 -312 594 -639 385 129 -497 676 -608 182 79 -399 463 -487
3481 -487 415 -218 -43 431 -729 782 -528 -40 571 -976 875 -456 -104 597 -788 775 -503
3498 -503 168 211 -615 812 -910 546 17 -667 1156 -1135 691 70 -760 1092 -1078 641 -118
3515 -118 -459 805 -1007 945 -540 -43 765 -1254 1299 -860 -31 828 -1408 1350 -815 92 692
3532F92j801K344k232J450k25j175K306k771K306q93r83K612l221K602j027r18
3548i34K392k986K573j359k12J691k686K945k229P04J203k867L523k871J087J108
3564A082k867L549k911J357N83k211L063l057K097m61j447K998l590K953j129
3579Ij185L143l922L207j364q83K662l500L212j919P6J817l201L633k815R38J380
3596A288l348M107l350J323J183l180L989l365J683M45k384L546l618K544o06
3611B57j662L500m164L368j257j378L498m306L520j538q78K857l847L588k217
3626f59J91J964l547M039l142J083J441l536M317l539J468J093l137M022l521
3641a463J927K19k255L549l770K759p90j551L498m232L421j315j286L374m155
$$ plain form
3532 692 -1109 1235 -997 453 228 -947 1359 -1412 894 1 -982 1630 -1591 1011 -16 -934
3548 -934 1458 -1528 1045 -314 -526 1165 -1521 1424 -805 -101 1102 -1765 1758 -1113 -26 1082
3564 1082 -1785 1764 -1147 210 793 -1418 1645 -1412 685 224 -1223 1775 -1815 1138 9
3579 9 -1176 1967 -1955 1252 -112 -995 1667 -1833 1379 -540 -464 1353 -1848 1785 -1030 -92 1288
3596 1288 -2060 2047 -1303 20 1203 -1977 2012 -1353 330 775 -1609 1937 -1681 863 257
3611 257 -1405 2095 -2069 1299 42 -1336 2162 -2144 1376 -162 -1040 1817 -2030 1558 -659
3626 -659 -468 1496 -2051 1988 -1154 -71 1370 -2166 2151 -1388 80 1173 -1964 2058 -1463
3641 -1463 464 683 -1572 1977 -1793 966 176 -1375 2123 -2109 1312 -3 -1289 2085 -2070
3656b070L426j597o97K677l704L545k290L15J857l486L995l120J046J480l488
3671b111M176l367J354J072k965L776l299J820J47k061L338l625K686p74j475
3686a308L283l913L127j185j132K956l662L068j510m51K149l107L134k177M80
3701b48J467k989L496k772R96J184k903L511k826J166P80k319L044k770J636m9
3717D04j577K734l052K355p47j216K758l239K543r34r78K424k911K401j185l23
3733e43J644k446K517j788M62J088k334K764k188P59R39k217K644k077Q27N56
3749F07j621K110j952J259k12r65J869k184J738n85q24J930k265J727n89o72J567
3766I38j852J511p65j24R52j508J636j233L55P06j574J880j434M16P30j492J615
$$ plain form
3656 -2070 1356 -241 -938 1739 -1965 1580 -710 -395 1462 -2024 1971 -1149 -103 1377 -2111
3671 -2111 2065 -1302 52 1124 -1841 1935 -1364 456 603 -1458 1880 -1745 941 167 -1308
3686 -1308 1975 -1938 1189 4 -1128 1828 -1834 1234 -276 -727 1422 -1685 1449 -728 -248
3701 -248 1219 -1770 1726 -1046 -50 1134 -1769 1742 -1084 82 862 -1457 1587 -1183 453 404
3717 404 -1173 1561 -1491 864 117 -1099 1659 -1580 963 29 -949 1475 -1436 965 -220 -543
3733 -543 1101 -1345 1172 -616 -154 934 -1400 1364 -824 -65 874 -1343 1301 -776 51 607
3749 607 -1014 1096 -856 403 191 -774 1095 -1089 649 64 -760 1170 -1095 632 43 -629 938
3766 938 -914 597 -168 -292 660 -848 788 -445 -90 616 -958 922 -512 -96 634 -858 757
3783G57j152L70M26r82J212j131P37j27n75J158j368J043k63o18J230j317Q73
3800B73j30n34Q78q95O28k79q9M48p07Q19o34J91L97q78R65o51M7N38p86O65l18
3821e2o6L27m05L82l49K44n1k51N27o03L95N8m86O67n11J22K76m64L94j91k4J22
3843F1j21J14j75K40j61l7L04m71L56k6l13M68l57M3K76l95K76n8o9Q2p0P2j26
3866h7J93j57m3L11m45L43l0l34M97l80R0K13l54K80j08j4O9n2O9j67K63k53M5
3889e1K61m84M58j76k17M52l95J93M7j94J72j12R7j33J54o1j46L49m24K48J14
3910A52m15M92l09j0K42k82J79l1k4j5P5%j89L24l08Q6K30m20L65j13j57K86k15
3933e7N0N3m3n9J05j6j71L04k67M6K46l91L06o3j54K15j28J4J4P8j77J42L2k97
$$ plain form
3783 757 -395 -25 401 -581 631 -500 237 110 -465 693 -675 368 105 -513 717 -600 273
3800 273 143 -391 487 -408 220 -59 -148 300 -407 412 -222 -31 366 -512 453 -198 -151 387 -399 266 -52
3821 -52 -118 209 -196 186 -163 81 30 -221 306 -297 98 156 -330 337 -174 -52 224 -240 154 -37 -61 61
3843 61 -60 54 -121 119 -42 -79 225 -246 110 84 -229 239 -118 -75 201 -194 82 24 -45 37 -33 39 -87
3866 -87 106 -51 -94 217 -228 115 85 -249 248 -132 -42 171 -183 97 -11 -25 44 -8 61 -106 157 -96 -51
3889 -51 210 -274 184 8 -209 243 -152 41 88 -106 66 -46 51 -82 72 11 -135 214 -210 38 152
3910 152 -263 229 -80 -90 152 -130 49 18 -6 -21 54 54 -135 189 -119 -33 197 -223 142 29 -128 158 -57
3933 -57 -7 46 3 -56 49 33 -138 166 -101 -55 191 -200 106 43 -111 104 -24 -10 4 82 -95 47 79 -218
3957b18M45l20mL17m52L62j16j10K06j72J19j43J92j75%K69m96N18k32k14N68
3978C44o54M26m5k74L88l55L08k55J41L7l16N98o49M22O8o20R09p81L18K58o53
3999c85P32n65K83K5k73M95o99P22m72m1O50j053J006m93k15Q24j085Q88m10j42
4019b08N41p73Q49p06L70J51p36J159j169O79J50r39J317j184O01J87p88J083
4037E84j031O92k20l23Q52j196J162o93j41J006j506J427p34k32J037j402J256
4054E38p32L0O10j065J253j097N72K47j070J596j542Q31K53j256J727j510P46
4071A31J85r74J424j386R85l42m67J218j647J524q07l01J349j876J694q40l03
4088d33J231j665J520q99O1P22j312J551j343O75L47j339J897j736Q63L50j407
$$ plain form
3957 -218 227 -93 -97 220 -232 130 14 -96 110 -62 57 -86 106 -69 -69 200 -296 222 -10 -224 344
3978 344 -310 116 71 -203 185 -170 138 -117 24 61 -255 343 -306 116 184 -436 473 -308 10 268 -385
3999 -385 347 -218 65 90 -183 312 -387 335 -137 -178 472 -581 425 -68 -283 541 -544 344 -66 -208
4019 -208 333 -440 409 -297 73 224 -512 647 -522 157 307 -632 685 -499 102 289 -499 584
4037 584 -447 245 25 -298 554 -642 520 -173 -314 692 -814 613 -121 -353 684 -718 538
4054 538 -194 -164 446 -619 634 -463 109 356 -714 882 -660 171 424 -832 895 -615 131
4071 131 316 -658 766 -620 365 23 -444 774 -873 651 -156 -457 892 -984 710 -130 -433
4088 -433 798 -867 653 -246 -185 537 -775 776 -567 108 455 -884 1013 -723 140 490 -917
4105i17J899j676Q47J80j037J541j564J171m30n49J429j874J669q06m23J549k083
4122a074J782q22l88J385j829J690j037Q9Q56j548J798j501O39N26j592K111j827
4139g42Q29M92j565K019j739Q56K09j125J680j710J259m14o32J559j987J693p63
4156h1n20J626k080J751p86l94J344j778J619r93J04Q12j513J787j490O11N73
4173E92j615K089j750P30N41j571J936j601P93K10j050J582j671J236l61p16J608
4190I82j971J595o06o19J655k050J635o59m28J269j673J526r40R8P93j468J712
4207H51j398N16O27j554J889j490N44N55j371J649j364O77J54q95J374j440J083
4224D07l52n97J385j688J356m74o08J421j664J271m78l81J059j354J218p95J32
$$ plain form
4105 -917 982 -694 153 333 -704 837 -727 444 14 -535 894 -980 689 -117 -540 1009 -1074
4122 -1074 708 -114 -502 883 -946 744 -293 -204 652 -896 902 -599 40 566 -1026 1085 -742
4139 -742 87 579 -986 1033 -706 150 359 -766 914 -796 463 49 -583 976 -1011 682 -81
4156 -81 -601 1025 -1055 696 -90 -484 860 -918 701 -292 -188 624 -889 898 -592 19 592
4173 592 -1023 1066 -684 46 587 -984 952 -649 144 354 -696 886 -785 451 90 -626 982
4190 982 -989 606 0 -619 1036 -1014 621 -38 -466 803 -870 656 -284 -186 607 -861 851
4207 851 -547 -31 596 -958 931 -559 -15 540 -831 818 -546 131 285 -610 764 -676 407
4224 407 55 -542 843 -845 511 37 -571 850 -814 457 -21 -402 657 -697 521 -274 -142
4241a42O55j262J494j193L97N74j352J599j196L48N43j135J307j045M95J26o86
4258d73J077j163Q97k89n09J154j358J024k85n16J078j198Q67l03k83P11q99Q27
4276C59n61J24M24q71J046q29K45M80r90J068p46J77M00p52P95o10K93O3l98O80
4296C97p67N91j61l86P98r16O39q7m49P61p27M48o7k55M15m90M48k74N0K54n51
4317c29O63m67L4M05o54N96k93j00L67m25L40j80L9N0j67L01l79K96l5k84M81
4338B59m54K27J25m08M46k65K5J33j80J73j43J26r1k2J67k70L00j56j37L52l93
4359a86K24N3k70L28k20M4P9q5P3q1J24j46O6Q9k52L02j79m7K96l73K39oj97K42
4383A17j90P9J8m2M5q1J54k12J41M3k50L55k65L8K31l55K62n8j10J61j29O7m1
$$ plain form
4241 -142 513 -749 745 -448 -51 523 -829 770 -426 -78 465 -670 637 -408 87 213 -473
4258 -473 604 -559 338 49 -460 694 -664 360 75 -441 637 -561 306 3 -280 431 -468 359
4276 359 -202 -78 346 -525 521 -308 -63 417 -573 495 -251 -74 326 -426 369 -241 52 115 -283 397
4296 397 -370 221 60 -326 472 -444 195 108 -341 420 -307 141 74 -181 234 -256 192 -82 -32 222 -329
4317 -329 334 -133 -99 306 -348 248 -45 -145 222 -203 137 -43 -4 46 -121 180 -199 97 62 -222 259
4338 259 -195 32 157 -251 195 -70 -45 88 -92 81 -62 64 -27 -49 118 -152 148 -8 -145 207 -186
4359 -186 38 91 -179 149 -71 -27 52 -33 40 -41 83 -63 3 92 -160 142 -37 -84 212 -161 78 72 -125 117
4383 117 -73 6 24 -18 27 -54 100 -112 29 72 -178 177 -88 -50 181 -174 88 30 -80 81 -48 19 -22
4406b2O3p4mJ68k88K61p5j73L57l45J43Q8k33K31j16PL9l6J8o5J81k26J29O7k56
4431a61L24k40K8K11k98K11n4o3M9lJ3p1J54j66O1J07k53K99j42j01K46k54J27
4454B4K6q4M7rM1j32J85j56K5J79l33L02q4j59K72k49J38on4M9l9R9k09K26j18
4479a9j16L38m01K94l2k31L85l50J75J8j29J60k05K38k47J58N5l23N06m53J87
4500HJ84m85N48l80R9J69l25L74l55K63j05r0L44n58N52l06r9N02o99N77k31j79
4522a92M79n72M96k80J7K24m56O02n75L49P8n44Q32p76L79J65o21Q10o75L21N6
4543A17l71N94o73N81k93j35O01r07Q67m80j45P27j011Q67m02j24N58p85P87n73
4563b00J70K67o92R32q67M93J45p64J120j029N29J50p23R98r27N62p1m36Q06r75
$$ plain form
4406 -22 41 -33 -37 131 -157 104 29 -144 213 -132 11 99 -134 97 -19 -12 27 -9 9 -56 125 -101 28 95 -161
4431 -161 163 -77 -49 162 -136 75 21 -42 7 4 17 -54 100 -66 -5 102 -151 148 6 -95 151 -103 24
4454 24 50 -34 13 4 45 -87 98 -58 -33 146 -187 115 31 -128 144 -105 33 27 -27 22 -17 82 -127 99 -19
4479 -19 -135 203 -198 96 64 -167 218 -132 43 61 -68 92 -113 125 -122 36 91 -232 274 -179 8
4500 8 192 -293 255 -125 -26 143 -182 192 -163 100 -5 -95 249 -309 243 -63 -162 340 -359 218 -13 -192
4522 -192 287 -285 211 -69 -52 172 -284 318 -257 92 170 -374 458 -318 61 226 -395 415 -260 61 117
4543 117 -254 340 -333 248 -45 -180 421 -486 381 -99 -244 483 -528 339 -63 -187 371 -414 373 -200
4563 -200 -30 237 -455 477 -390 103 248 -516 604 -425 104 254 -469 529 -398 164 93 -343 463 -512
4583e12Q89m55j96Q42j223J144n98j84Q76j221J095n95o5O45r95J055p91L07K97
4602C15q90J231j136N92K05r40J334j221O37J53q09J133j097P32j69m67R59j147
4620e85J021n12k33R49j339J234o58j78R33j320J171o33m8O76j086J173r19L66
4638A2L59j018J361j229O13K62j051J458j294O47J84q83J254j223Q14j87m92J067
4656F54j342J142n27k90J065j466J285o06k46R79j341J200o67l7O90j118J217
4673E92r54L77L79j039J343j195N82K84j032J385j219O21J55q21J159j156Q10
4690B71k04m68J025j267J074m81l31J055j378J193n71k70R49j235J131o55jO11
4708D48j061J187r26L32L91j005J307j110M92K96r85J302j100N33J59p29J041
$$ plain form
4583 -512 377 -78 -274 568 -655 489 -109 -293 583 -638 457 -138 -203 442 -553 502 -289 18 315
4602 315 -575 656 -480 112 317 -623 711 -510 127 280 -529 604 -493 239 70 -397 562 -585
4620 -585 436 -76 -309 640 -699 535 -123 -301 632 -688 483 -150 -198 478 -608 565 -354 12
4638 12 371 -647 714 -515 98 360 -691 767 -527 120 304 -579 675 -548 266 79 -413 654
4656 654 -688 454 -73 -363 702 -764 521 -85 -331 648 -693 507 -160 -197 493 -625 592
4673 592 -362 15 394 -645 698 -497 85 369 -663 722 -497 124 279 -542 617 -539 271
4690 271 67 -401 624 -643 431 -50 -381 674 -704 489 -82 -352 597 -638 493 -162 -163 448
4708 448 -613 574 -352 -20 371 -634 673 -437 55 351 -634 668 -432 101 260 -469 572
4725E72j042P14j79m24R18j142R77m19l35R61j216J002m38k44P87j013R07n44
4743a58K8N01q68R58p67L00L24q65J104r17L87L11q52J026q37L87J40n83Q23q28
4763c86N99j76l42P85r52P86l27k89P87r56P60k95k25O08p71O78l99J5L56o34
4783c78P51o03K28K43o52Q29o59K15K62o03P02n48K40J00l59M95n06L99j43k25
4803b12N35o45N30j93k34N30o19M44j10j88M00m81M15k51K3K23m11M74l83J29
4823b4J96m44N33l83O9K45m18M04k78R3P7k05K80k88K04m4j44L19l78K69k1k16
4845a54L43l35J78J8j71K30j89J35n2m1J24k03K21j52rJ94l11K81j16j00K39k36
4867a06J51k1r7J24r4Q5r6N1L8j36K07j79O9J07k32K16j23j5J36j58J06m5%L9
$$ plain form
4725 572 -470 244 65 -359 559 -583 394 -25 -360 601 -615 387 -51 -295 492 -521 386 -158
4743 -158 -130 371 -497 461 -306 -6 318 -547 557 -360 27 338 -514 512 -325 62 202 -381 442 -386
4763 -386 213 37 -305 480 -472 314 -13 -302 485 -471 289 -6 -231 377 -394 284 -115 -100 256 -378
4783 -378 373 -230 -2 241 -411 418 -241 -26 236 -367 335 -213 27 127 -232 263 -243 156 13 -212
4803 -212 323 -322 208 15 -219 311 -308 136 26 -162 238 -243 172 -79 -56 167 -244 230 -153 -24
4823 -24 172 -272 261 -122 -53 192 -226 178 -100 -7 70 -135 145 -143 61 17 -127 192 -186 83 62 -154
4845 -154 189 -146 32 50 -121 109 -80 55 3 -38 86 -117 104 -48 -57 137 -174 107 -9 -109 130 -106
4867 -106 45 24 -73 51 -43 42 -54 -3 35 -101 106 -73 -4 103 -129 87 -36 -51 85 -73 33 -12 -12 27
4891B7n1P0j23J19m0p5J83k04J16K2j52J86j20NR2j14R3n8L0rj9N0j09J72j06
4916a5l3J50k10J69m7q9J46j34O9jk2K8k8O9r4Q1j9j03J89j76O1O9j70J94j24
4941d0K1O4p2N0n7N8o6M4L1j12J76j52K3R9j59J45o7k8P4o7L9l4N6o0K6P3j62
4968i7J92j39pJ55k06J51l5n4Q2p0N5o3P2m5l8J37k11K04q2r3K12k30J50%q3J15
4994G2j37J16r5N5J3j24K35k56J65L2k21K95k38J01N2j91K45j97J22m4n1J78k63
5017a36K67k15L6K03l51L57k19nK10l13K92j72J6J04k06K92l01K20k7k02L76m18
5039a92K79k5k72M32m13K62m0j53K91l46L36j99qK13m03M54l41P5K64m85M94l36
5061a13Q1K04l95M44l39J54L6k40M07m56L51j05k17M91n81M05p0k58M58m93L79
$$ plain form
4891 27 -24 46 -77 42 2 -73 110 -94 22 44 -108 78 -42 -37 55 -59 34 -24 6 -3 -22 28 -81 91 -15
4916 -15 -48 102 -108 61 14 -75 71 -63 6 5 -17 11 -17 52 -42 39 20 -83 106 -70 -9 60 -110 84 -40
4941 -40 -19 45 -27 23 -34 24 -42 2 33 -79 97 -55 -32 67 -92 53 -14 -42 32 -35 4 -30 26 -34 -8 65 -97
4968 -97 95 -44 -51 104 -102 49 14 -40 42 -28 27 -36 36 -9 -47 90 -121 83 1 -92 120 -110 40 40 -43 72
4994 72 -65 51 -44 11 24 -100 135 -121 44 76 -145 150 -88 13 65 -126 119 -78 44 0 -51 127 -136
5017 -136 131 -84 -48 155 -196 161 -58 -63 147 -166 126 -46 -30 74 -132 160 -141 79 52 -150 226 -192
5039 -192 87 62 -210 222 -191 71 31 -122 169 -177 159 -40 -48 165 -238 216 -125 -50 214 -271 223 -113
5061 -113 -32 172 -223 221 -118 36 72 -168 239 -217 134 29 -188 303 -278 127 57 -201 257 -236 143
5082A43j50j01L14m23M18k98N4K55m99N64m39J19K70n21N63m17J24J93m14M91
5102B46m31K52qk75N05n66M42j12k73N59o22M27j06k56N09n46M14j85r0L34m69
5123b51M97l70O8K88n57O19m53J16K74n16N62m21J25J91m09M93m38K54rk66M97
5144B94n67M22j04k82N34n65L86o1k57M80n16L84j69q6L29m75M93l52N7K70n18
5165c03N83m05O5K90n13N23l53J05J41l57M57m18K76j4k86M77m88L46o5k94N21
5186B88n34L37k8k53M07m14L09j15r8K95m25M25k91J8L00m99M93l00QK90m69M53
5208A97k81M2J79l25L84l42J88L8k89M43m46K80K8l11M60m21K36J3k28L53l71
5229a73K72r1j23K99l83L41k03k1K92m57M23k30m6L00m07L48k16K1J65k66L03
$$ plain form
5082 143 -7 -108 206 -217 201 -97 -43 212 -287 277 -162 -43 227 -294 269 -148 -24 169 -245 246
5102 246 -185 67 59 -216 289 -277 165 53 -220 339 -283 144 38 -218 291 -255 159 -26 -116 218 -251
5123 -251 246 -124 -56 232 -325 294 -159 -43 231 -285 277 -144 -19 172 -237 256 -182 72 63 -203 294
5144 294 -273 149 45 -237 297 -268 118 57 -200 280 -236 148 -21 -107 222 -253 240 -112 -55 215 -303
5165 -303 280 -125 -60 230 -283 240 -113 -8 133 -224 233 -185 91 77 -209 268 -220 126 61 -233 288
5186 288 -246 91 63 -190 217 -197 112 -3 -101 194 -231 194 -97 -79 221 -278 215 -85 -77 213 -256 197
5208 197 -84 -42 137 -188 196 -146 42 80 -209 234 -212 68 96 -215 245 -176 60 73 -155 198 -173
5229 -173 99 8 -115 184 -199 142 -61 -82 210 -247 176 -54 -100 200 -207 141 -75 -54 111 -155 148
5250A48k60J37P7k64L72l61J88O9k93L91l50J77L4k14L16k85J86o1j01K55l33
5271a72K84j25p7K57l43L03j43q4K68l32K71j19l3J31k15K41j90R8N1k15K91k41
5293i4J06R5k73L02k10P1Q3j78K11j86J16l7p3J90k55K27j01o9K09k70K26o1j03
5316g4J91k21J38m5m1J26j58J54j33P3N0j72K10j47M5R7k04K06j24jJ02j35J15
5339E2o9M6lq6J32j28J02l4r9J72j58R4K0j17J45j05L7Rl9N4p6R6q0J8P0j25J33
5366F1p6k2R3j33Q9Lo7Q9n3L3ql3L1l6Q7q3N2pq1J29q9j2Q3j02R2l3m7P8n2K3
5396Ij2K7l8pN7j04R8k0l6P7j01N4K7o7P3l1j8J8j6J7k5N2n2J8L0p3J06o6k3P6
5426E0r1N4ol2N5l5J4j3J0qk5P6j04O4K3r1J09p2J4K8o3O5k0j9RK1Lm2O5n9K6
$$ plain form
5250 148 -112 25 102 -162 210 -151 37 106 -187 204 -146 31 65 -149 167 -118 68 7 -94 161 -172
5271 -172 112 -13 -90 167 -176 127 -16 -100 168 -164 107 -12 -45 86 -129 112 -78 20 71 -144 147 -94
5293 -94 12 107 -166 136 -74 -3 80 -98 113 -73 43 6 -67 123 -132 95 -6 -75 134 -136 90 29 -74
5316 -74 117 -104 34 -11 -52 74 -84 70 -63 10 60 -112 98 -49 -4 93 -111 95 -29 -30 72 -63 52
5339 52 -17 29 26 -60 72 -56 46 12 -87 85 -73 21 41 -76 69 -36 1 10 -29 25 -51 45 -35 -17 53 -72 61
5366 61 -15 -37 56 -77 12 15 -52 37 -16 17 9 -24 7 -29 58 -25 27 20 -61 68 -21 -33 50 -52 40 7 -40 38 -14 9
5396 9 -3 24 -14 -21 36 -68 30 10 -26 51 -50 4 31 -36 37 6 -12 6 -10 7 -18 34 -18 0 30 -43 63 -3 -26 50
5426 50 -41 13 7 -25 30 -5 9 -4 6 -2 -27 49 -55 9 32 -59 50 -22 -8 20 -43 22 2 -17 -8 13 16 -26 39 -20 6
5457FK2p8Q7m9j8P4p2L3lrj1K1J9l2N5n7jO7j14Q8qn8R6p8J3L0k7J4j4J4l1L4
5489A3j3n2J17j12M8M6j00R2o1jN1l9K6l6K6l3K8K7p9R4q7K8P4j24R7l7j7O2p0
5518c2N5m9N0k4RL3r0J02o7l6J38j59J06k2p4J26j29Q6k2j3M9p7R4j05O5J7j02
5545g1J59j33L1P7j48J46p9NL8n8P2q8Q1j8m9J07j47J30o4n9J63j79J32l0o6J24
5571G6j26P3o3L5N2j12J50j57O6N8j58K06j41M9O3j74J67j03L7L6r1J14j10Q9
5595C6l9n8J47j88J53m2q3J85k06J42l5o5J24j18R5l8k3P8j49J59j22M0Q8j81
5619a00K02j44K6R4j78J93j35L1O3j17J51j83J45k4r0J96k34J57Jj44K16k05J30
5642E1pj13J76j92J42n7l6J27j97J94j23j1J73k65K62j46l7J68k28K01j06qR5
$$ plain form
5457 6 28 -50 37 -12 -30 44 -28 5 2 -7 -18 3 22 -10 45 -12 -13 54 -60 28 20 -38 58 -20 -7 23 -4 10 -4 10 -21 13
5489 13 0 -52 65 -47 1 47 -53 39 -22 -23 28 -11 15 -21 5 -28 0 27 -52 42 -45 -17 57 -67 30 -7 -24 38 -32
5518 -32 23 -26 24 0 9 42 -48 54 -13 -49 89 -70 36 14 -60 66 -63 23 1 -12 37 -40 54 -51 14 31 -71
5545 -71 88 -45 -14 63 -85 61 -18 -13 25 -33 39 -49 32 14 -35 72 -75 55 -9 -68 95 -84 48 18 -48 76
5571 76 -50 23 -40 -5 47 -65 85 -72 -6 52 -106 100 -41 8 71 -103 64 -39 -2 34 -57 57 -53 36
5595 36 -3 -61 86 -102 51 9 -74 111 -95 47 12 -53 71 -47 48 10 -13 65 -84 75 -47 -7 81 -100
5619 -100 102 -42 -16 78 -100 93 -42 -11 52 -65 86 -97 48 24 -66 130 -104 53 54 -90 126 -79 51
5642 51 44 -69 107 -85 57 0 -36 91 -106 88 -35 -46 127 -138 124 -22 -59 109 -119 82 -24 -32 63
5665F3j68K25j77R1K7j75K66k70J33M6j84K68k58J42L4j70K29k19J55o1o0J88
5687A25k58K30j17m1K20l20K73j16o9K12k69K22j21lJ17k09K48j97Q1P0k21K96
5709A53k58J19P4k36L06k70J29L6j76K53k42J80p1q1K27k96K69j09q9K50l13K49
5731A04j18o0J98k75K77j81L1J28k44K74k10O8J07k63L22k74J39Q1k55L21k74
5752a04J11N0j59K35k59J88m0j04K42l07K31q7j01K52l05K55j14n9K01k64K44
5773A06j20rJ13k22K73k21Q8Q4k30K87k31R5R1k44K71k13J03M3j47K00k33J86
5795G0m5j11K17k78K41p9r8K20k77K31j05o4J84j97J87j28J2R1j81K08j73N4J10
5818H9k14K38j86O0Q3j78J90j40Q5Mq4J30j58J27k2p3J54j94J53o4p1J54j68J33
$$ plain form
5665 63 -105 120 -57 34 61 -114 152 -118 15 61 -123 145 -113 29 63 -107 122 -97 58 -3 -63 125
5687 125 -133 97 -20 -61 159 -161 112 -4 -73 139 -130 92 -29 -32 85 -124 124 -73 8 78 -143 153
5709 153 -105 14 88 -148 158 -112 17 53 -123 130 -112 68 -3 -84 143 -153 116 7 -82 168 -145 104
5731 104 -14 -74 124 -151 126 -55 -24 104 -140 134 -76 -8 99 -164 158 -116 23 104 -151 170 -104
5752 -104 7 57 -102 133 -126 62 22 -82 160 -147 84 -3 -104 148 -157 98 -16 -75 126 -138 106
5773 106 -14 -23 90 -132 141 -80 8 92 -138 149 -82 13 104 -140 131 -82 21 64 -83 117 -116 70
5795 70 25 -86 131 -147 94 15 -83 137 -140 91 -14 -78 106 -91 96 -32 -20 71 -110 98 -75 -21 89
5818 89 -125 113 -73 -13 70 -108 82 -58 27 31 -53 77 -81 46 24 -49 105 -89 64 0 -71 83 -85 48
5842D8m5n5J19j27J25r3K7M0j14J61j47N7Q1j80J87j20L0N2j06J20r3M2J0n5Q0
5867D4r5O5j6l3J06j31Q9l0p0J62j48N9J4n1Q3p3N0l3nM1o8R2p9J7N4j24J18m9
5895a1k2Q1r4Q2m4j0M7n0N5p0M4Rn1Q8j12O2M5r8J00q9L0J7l0K4k4L3j0jK3o4
5925d0P7l3k6Q2j06O6k2j9O9q1M1j0mL3m9N0n3M7l0k6Q6r1M8J8q0Q2n5J9L2n8
5955c3L3k6M6l0qM9p0R4o3l0P0r5R0j9l3M3m3M4k1Pjk2P2q4N8k1m0J12j17M2J7
5986B1n3O9o0M9k4KJ8m4N9o7N1Oq0J15r0L1M5p5M1k4K2ll5N2n7O0k8l2R3j29J13
6017D6o0k9J12j26R2l9k5O7p6P0n2K4J7p1J06j07O9L1j31J63j20M8K1q2J04r5
6043d3N7j0l8R4j17J10q1j4J32j70J42q2j5J05j31J08p7J3N9j02J28j17N5K6j03
$$ plain form
5842 48 3 -52 67 -60 65 -28 -1 39 -75 86 -61 -4 77 -103 84 -36 -6 46 -60 60 -33 9 19 -36 44
5867 44 -51 14 -2 -35 71 -60 29 -1 -71 91 -57 2 16 -35 48 -25 25 -8 -13 28 -40 52 -27 -10 44 -80 38 -11
5895 -11 -33 48 -46 36 -8 -18 29 -21 34 -36 8 17 -34 54 -58 4 49 -49 51 -38 -8 9 -21 3 -21 12 2 1 24 -40
5925 -40 37 4 -22 60 -46 20 -2 -21 48 -33 8 -2 -6 27 -22 28 -25 22 -8 -34 52 -39 9 27 -53 29 -26 -7 25 -33
5955 -33 0 -26 20 -10 -18 31 -39 55 -8 -38 32 -63 27 8 -25 18 -25 19 -2 5 4 -18 54 -30 28 7 -33 79 -38 4 21
5986 21 -32 37 -23 26 2 4 22 -22 37 -30 21 27 -53 62 -28 3 48 -27 14 -10 12 9 -26 26 -31 29 1 -31 62 -67 46
6017 46 -14 -43 69 -57 35 -4 -29 38 -38 32 -20 4 21 -50 56 -51 18 49 -82 81 -39 9 30 -52 52 -43
6043 -43 14 4 -34 60 -57 53 -28 -42 90 -80 62 -20 -35 70 -61 47 -30 -17 42 -60 68 -49 6 32 -71
6068g1J78j85R9J7j41J96j64Q0K5j24J75j64J22m2o1J58k18J96j13l4J76k26J92
6091G1j12l2J82k19J92j11RR3j84K03j72J04O1j88K43k36J19M6j94K57k21J12
6113B3L7j70K13j96J30l0q8J95k32K13j10o6K12k90K38r3m3J81k56K23j38KJ36
6136I1k30K56j94Q8O3k32L23k81J15R2k37L03k59J29K8j69K64k77J97n2j16K47
6158A49l24K67r6j02K82l34K64j20p8K49l26K84j54nJ75l00L19k36P1J33k84L59
6180A93k87J10Q6k86L59l00J54N2k33L37l17K11o6j39L16l63K92j07j32L22l95
6201a93L06j34p8K54l43L24j96PJ81l23L75k89J00J47l46M11l02J04J27l26L95
6222B01l38J70N6k16L23l50K61p2j58L50m31L37j17j32L07l92L39j46r1K70l59
$$ plain form
6068 -71 107 -78 21 38 -103 93 -71 9 34 -90 85 -79 43 1 -60 98 -120 76 -37 -71 105 -121 71
6091 71 -41 -73 109 -110 82 -29 -20 73 -111 92 -80 24 85 -103 140 -96 23 69 -125 132 -89 23
6113 23 60 -110 103 -93 37 7 -81 114 -118 95 -15 -81 131 -159 79 -14 -57 124 -132 91 -47 -45 91
6136 91 -139 117 -77 11 74 -158 165 -116 -1 91 -146 157 -102 27 55 -114 150 -127 70 18 -98 149
6158 149 -175 92 -4 -106 176 -158 106 -14 -92 157 -169 115 -39 -44 131 -169 150 -86 -15 118 -166 193
6180 193 -94 16 102 -184 175 -125 29 81 -152 185 -132 79 13 -126 190 -173 119 12 -120 202 -193
6201 -193 113 -21 -99 155 -188 136 -60 -53 128 -195 180 -109 -9 138 -208 203 -99 5 132 -194 201
6222 201 -137 33 89 -127 196 -154 107 35 -123 227 -204 133 16 -116 191 -201 138 -8 -99 171 -188
6243a88L38k06J6J84l32L85l01R7J17l27M15l19J16R6k84L94l38J83Rj91L49l87
6265a74K60o3j41L20m04L31j19j24L04l72L06j28p7K36l11L01k16L8J55l16L78
6286A84l00R7J40l10L82k81J02R0k55L21k84J57j4j46K73l11K38q5j07K82l34
6307a61K64j07r0K62l31K70j16n0J82k77L02k19O8R1k49L12k47R7R9k32K71k22
6329h3R7M7j73K24k21J47kj42K21k39K08o6r8K10k74K14p9n4J72k20J78q9pJ15
6353H6k04J95j28L6R0j77K15j74O2N5j51J99j73Q4M1j29J41j30R0k3o9J49j75
6376i0J29m5m8J35j64J29k6o3J06j30R7n4%O7j04J40j18M4N0j18J39r3L1L4j08
6401f0J17q2K5K9n5P6p4M9k1k6P7q6N7k1m1R7j09O9rn0P5o9N0k3pL2m5O0m6K8
$$ plain form
6243 -188 150 -56 -40 144 -188 197 -104 -7 110 -217 198 -121 -5 91 -193 201 -137 46 55 -136 213 -174
6265 -174 86 23 -118 202 -202 129 10 -114 190 -182 124 -4 -81 155 -156 145 -71 -33 122 -194 184
6286 184 -116 -19 121 -189 193 -88 14 104 -151 170 -114 43 29 -117 156 -155 83 -2 -109 173 -161
6307 -161 103 -4 -94 168 -163 107 -9 -59 123 -154 148 -71 -3 88 -161 151 -96 1 100 -132 139 -83
6329 -83 14 61 -112 112 -109 38 36 -106 115 -124 84 18 -80 130 -144 70 -9 -63 109 -111 67 -22 -29 86
6353 86 -118 77 -51 -15 75 -102 113 -61 1 56 -95 104 -69 15 56 -73 68 -62 28 5 -64 85 -90
6376 -90 39 -6 -54 81 -83 46 20 -43 63 -67 30 -24 -24 43 -61 79 -39 5 55 -63 76 -17 14 48 -60
6401 -60 57 -25 0 29 -26 50 -24 25 4 -22 55 -31 26 5 -36 61 -48 21 12 -38 37 -32 18 -5 -12 20 -25 35 -11 17
6431A7J4p9R3p5RN8q6Q0n0J9Ml0N6n6M5j2k9N6o9N8j2n8Q3n3L6Pm9N4n5K8l1K2
6463eK0o0Q2n5OM0o8Q4m3j6K8m2M8l5L0j1l0N3m8M6j9k6O9q8P4l3k9Q0p8M0j9
6494emK6n7R4q0L6K1q5J29j02L6J5o9R5q7M6ll9Q3j05R4l2l2O0j00J36p5k3Q7
6523F0j30J28p3%N6r9J07r4N7pp3J30j28R6j5p9J54j66J02j0q0J32j43R5k9l7
6549d6J25j55J50j16K6R2j84J94j42K3J13j87K05j40K8R0j67J79j57J08%j41K17
6572A15k05J35j3j14K14k41J53j8j01J89k25J92r5m5J61k33K20j37LJ50k45K47
6594A07j76N8R1k16K63k00R0L8j72K65k56J56k4j44K60k83K07k7j42K64k97K24
6616H6r2p9K10k80K50j32j7J70k76K87k01N4J40k96L18k30P4J19k58K91k41J11
$$ plain form
6431 17 31 -48 45 -30 -21 37 -49 31 -19 0 4 -26 30 -26 19 7 -22 34 -35 23 11 -47 36 -17 19 26 -23 31 -24 4 -27 -5
6463 -5 15 -45 37 -18 -12 28 -40 44 1 -15 13 -29 19 -16 14 3 -27 26 -22 24 5 -21 48 -40 34 1 -28 52 -26 14 -5
6494 -5 -9 17 -40 54 -26 10 31 -54 75 -27 9 24 -45 50 -37 9 6 -33 50 -55 39 7 -25 35 -65 71 -4 -27 60
6523 60 -70 58 -15 -15 41 -58 49 -45 12 5 -68 62 -66 30 15 -64 90 -76 26 16 -64 68 -75 20 -9 -46
6549 -46 79 -76 74 -42 -16 76 -108 86 -56 -33 80 -107 98 -42 -14 76 -91 88 -69 39 39 -102 115
6572 115 -90 45 32 -82 132 -109 44 26 -75 114 -111 81 -14 -59 102 -131 89 -48 -45 105 -140 107
6594 107 -69 -11 80 -136 127 -73 17 55 -117 148 -108 48 24 -120 140 -143 64 37 -105 159 -138 86
6616 86 -6 -85 125 -155 95 -37 -54 116 -160 127 -74 -20 120 -176 142 -88 -14 105 -153 138 -103 8
6638HO4k15K97k91J95j9j74L08l42K58o6j45K86l48K82j22o7K45l34L07j78j6
6660f7K13l24L10k00J8J82l22L74k92P9J55k94L27k82J54L9k34L53l27K08l1j80
6682a41L36l71K68q5j32L13l59K96j42r3K70l15K99j91j4K17l48L57k49L8J81
6703A35l41L81k78R6J23k83L51l22J76L3k46L67l59K37l4j80L34l68K78o6j43
6724a09K96l64K96j27o6K41l55L28j88k8K19l23L49k62N1J68l01L26k41R9R5k57
6746a53L25k95J54L4k16L39l52K30l7j76L29l35K50q1j41K88l22K56j13p2K48
6767A60l11K76j77PJ88l20L19k22N6J46k88L31k63J13P9k45L00k65J45K5j90L04
6789A68l07K12k6j79K90k98J99n8r6K43k77K26j14n3J84k51K57j69K5J31k60K74
$$ plain form
6638 8 72 -143 154 -137 58 39 -135 173 -169 89 23 -122 164 -184 98 -24 -91 154 -180 127 -51 -67
6660 -67 146 -178 132 -68 -50 132 -190 184 -108 -29 126 -168 159 -123 31 70 -164 189 -138 70 39 -141
6682 -141 195 -176 92 7 -125 188 -171 125 -17 -110 160 -155 144 -47 -61 156 -192 165 -84 -46 135
6703 135 -206 175 -103 -7 116 -167 184 -138 38 71 -175 192 -167 70 36 -144 190 -178 100 34 -109
6724 -109 187 -177 119 -8 -74 167 -188 140 -48 -76 143 -180 169 -93 -42 126 -175 151 -90 9 104 -153
6746 -153 172 -123 31 65 -151 188 -164 66 29 -147 182 -153 97 16 -125 163 -159 97 -16 -88 160
6767 160 -151 125 -52 -45 143 -177 142 -80 -24 122 -166 165 -98 15 94 -151 149 -116 29 54 -136 168
6789 168 -139 73 47 -132 158 -140 59 1 -95 148 -129 97 -17 -70 114 -137 120 -49 -24 107 -153 121
6811A21j73L4J00k20K56j81P3O2j67K32k37J38qj36K26k30J66k6j12J93k31J60
6833D0m3n7J47j85J74j03pJ06j90J95j17K5R4j87J98j38L4P6j68J90j36M9L8q8
6857e3J51j64Q5Nq8J48j67J18j4q4J49j54R9lo0J16j49J19n8j7Q9j47J41j03K8
6882a3O0j08J28r9QQ1j26J30q3K4M7j09J15j02N7Qp3J11j05P5j6o5J00p5M0rl0
6909b9M0o5P1l3qN1q0Q9n7KM0p5Q5l6j2J9k8L2k0J7J6n9O1l8K1Ml6O1o1M3mk6
6941a5M1l0J4rl6N1k2L5k7k6M8n3O3n3JM4o3M9j1mQk6K3k2J6Mk2L4m1L6J5n3O4
6974C3n4K1J7m2N3m9J9JOK5n4M1k8lM2n4O2m9MK9m6O1o4K5J8k7L9m9L1j0m5Q0
7006C3q7O7j1k7O0o7M2j3k5O8p3P6n0J2J4n9O3n1L8J2o0Q8q1L9Qn3P6o6M1lm0
$$ plain form
6811 121 -52 -18 82 -138 118 -63 10 72 -95 137 -100 38 30 -106 120 -110 56 30 -82 111 -120 40
6833 40 -3 -60 87 -98 76 -27 -34 72 -118 77 -40 -15 79 -108 90 -48 -14 62 -106 84 -52 -3 35 -53
6857 -53 98 -66 19 24 -64 84 -83 35 21 -63 86 -68 31 28 -32 84 -65 54 -4 -21 68 -79 62 -41 -13
6882 -13 47 -61 67 -32 -24 57 -69 61 -22 2 49 -60 55 -47 10 18 -55 56 -49 26 10 -55 45 -30 10 1 -29
6909 -29 11 -54 17 -16 -24 27 -53 36 -21 -19 21 -54 31 -5 -17 2 -26 6 -14 3 19 -40 21 -17 4 8 -28 33 -28 15 11 -15
6941 -15 26 -4 10 1 -35 16 -6 29 2 -24 24 -29 34 -19 -18 26 -37 12 1 -3 5 -21 2 -20 -4 0 -22 12 -29 7 22 -31 33
6974 33 -21 0 17 -25 28 -21 -2 -1 5 30 -24 17 -11 -14 28 -26 36 -13 -9 20 -26 35 -29 -4 14 -13 26 -23 8 -2 -47 33
7006 33 -54 13 2 -25 35 -32 10 -3 -28 40 -33 43 -7 5 19 -40 23 -28 10 22 -38 50 -31 8 16 -37 39 -27 14 11 -29
7037b9O3p9N5k0j1P0j28J10k9k7O4r8Q2m3MN6r5J25j10K8L6r3J34r7L4L2r5J14
7065E3r1M7Ro2J26j38R2l1m6J02j35J23m7m4J06j39J37q1l1J03j46J55q6K6N0
7090E2j37J74j39M8L4j21J54j40Q8L3j13J48j58R9lq1J59j82J57o0p8J55j91J77
7114G5r2l6J49k07J80j07OR4j64J97j38K5P2j48K05j94P9O4j36K00k01J06J6j59
7138a14K29j87J25j4j24K14k25J67p7m8J80k44K20j18l3J48k20K17j22j9J29k07
7160a23K01j36M2Q5j98K48k06J13K7j81K53k38J31L0j50K24k04J30l4r4J98k42
7182a24K03p6o3J69k30K00q5m7J67k43K24j44MJ58k40K37j61L5R5j99K57k29J02
7205A0O1j79K38k18J19J1j38K30k28J29kj22K19k52J81n0r6K13k56K29j23l6J72
$$ plain form
7037 -29 34 -45 10 -10 -21 49 -79 31 2 -25 39 -59 23 -20 -16 40 -55 70 -40 -12 24 -69 65 -32 2 34 -61 53
7065 53 -38 9 18 -44 82 -56 36 5 -41 61 -74 49 2 -42 64 -75 62 -19 -50 53 -93 62 -24 2 52
7090 52 -85 89 -50 -2 32 -89 65 -75 13 46 -67 81 -77 22 19 -62 97 -85 72 12 -66 89 -102 75
7114 75 -17 -53 96 -111 69 -38 -32 62 -102 95 -43 -18 54 -94 111 -83 -4 60 -76 124 -77 29 45 -114
7138 -114 115 -72 53 39 -85 129 -96 71 -6 -54 126 -118 102 -16 -49 99 -121 96 -26 -45 84 -123
7160 -123 78 -58 -16 69 -129 119 -87 26 53 -128 125 -113 18 48 -102 122 -82 48 14 -80 118 -124
7182 -124 79 3 -60 109 -121 79 -6 -53 114 -129 95 -49 -45 113 -127 110 -51 -16 79 -120 137 -92 10
7205 10 71 -108 130 -88 31 42 -96 134 -94 35 33 -89 130 -122 59 9 -87 126 -130 99 -24 -60 112
7228A12k50K32j34NJ31k19K18j43L6Q4j83K38k15Q7N7j73K45k14J10J3j34K20
7250A23k49J61k0j01J93k21J88p7p8J98k38K08r4n4J70k22K01j14k2J37k15K17
7272I1j34L3R3j94K35j84O9O5j95K37j90R6J4j37K12k02J39l3j05J87k27J85k9
7295B6j06J65j86J59o9l3J41k16J96j08j3J20j81J97j43M2R6j94K06j62N6P7j56
7318h6J78j59Q9K1j11J58j53Q9rp5J57j79J11l3m5J18j45J20m8l4J29j66J19o9
7342b3j3R2j27J32r2QP3j20J41r4J3O9j23J35j10L7M3r7J25j27R3pr2J41j54J31
7368E4l6n9J20j31J05m2m7Q9p7P3o2j2P3j12J07p4NP8j08R3n1oN6q7Q4n0L5On1
7397b7Q4j05N5J6o1R4r4M8J2o6J00j08O9k1j6O8j02P3pk9L3o1O1n8K2L0m7O6m5
$$ plain form
7228 112 -138 94 -40 -35 96 -123 95 -48 -12 72 -111 127 -88 -1 56 -117 128 -86 24 37 -97 123
7250 123 -126 35 15 -86 107 -114 74 -3 -81 117 -121 87 -7 -61 109 -113 88 -26 -48 89 -126 91
7272 91 -43 -10 83 -111 124 -60 9 74 -121 116 -74 22 36 -101 111 -91 48 15 -90 97 -130 55 26
7295 26 -80 85 -101 58 -11 -44 97 -119 77 -31 -44 76 -105 92 -51 -9 87 -107 99 -63 -7 70 -86
7318 -86 92 -67 22 43 -68 90 -63 26 17 -58 99 -80 31 -2 -47 71 -74 46 -2 -36 93 -73 46 -23
7342 -23 -36 56 -71 61 -31 -23 50 -70 71 -23 -10 59 -64 71 -39 -2 41 -56 69 -58 35 28 -64 77 -77 54
7368 54 18 -41 79 -52 53 11 -36 53 -24 49 -13 -25 48 -64 43 -31 -26 52 -56 37 -14 -20 36 -51 33 -17 18 24 -27
7397 -27 57 -48 7 23 -38 56 -38 10 22 -44 56 -52 17 -4 -20 48 -54 19 12 -17 16 -45 16 -42 -20 10 -37 29 -16
7426a6pM3n3P3n3jJ9j8L5k0pJ1k5N3n7L3Jm5N1m6M4Om1M1l1K9k1qK1l4N1k4k3
7459a9L9n4K9oPJ9k4K4m6RM3l8L9m0K2Kk6N5n6M5k4k2M4l4NJ4k0K1k6K9j8pL2
7492A8m4M6l8K1N5o6K7l1lK6l7M6j5J5j3l5N3l3K8lm0N1n8M2lk9M9n9L6j0j7L4
7524A3o0P3m7J8K6n2O1o1K3J9n0N3m6L3K0n1O7p8N6l3k5O1n7N3k5j7P4q4N2j5
7554Ak5O1q5P4m4J4K2o8Q9n7K3K8o7Q8q5K7M1o6P5p5M7nn0Q7j10J01m4k8O9r5
7584e7Q8l3l1P8j24J20m9j5Q1j11J17r6J8M9r4J21j09O0K6j13J45j15N1L3q8J25
7610G7j31Q8j8m9J01j44J15n6k5J24j60J24n4j9R3j61J67r4KO6j16J39j15N8L8
7635E0j39J58j22P1L6j32J69j40Q3j9q8J67j50R7j8p3J48j83J52r6j6J41j96J91
$$ plain form
7426 -16 -23 20 -33 40 -13 -14 5 -13 22 2 -5 6 -19 34 -23 10 11 -34 17 -29 15 21 -20 21 -10 19 -2 -10 11 -23 28 4 -19
7459 -19 20 -34 -5 -11 -4 15 -9 15 -31 -22 21 -17 22 -18 4 6 -20 35 -21 24 0 -22 22 -12 -7 7 -13 8 -18 11 -7 -14 18
7492 18 -26 20 -18 3 58 -8 19 -12 -15 11 -26 20 5 20 7 -28 25 -8 20 17 -23 28 -30 12 9 -20 29 -30 6 -4 -21 13
7524 13 -47 26 -21 -3 23 -29 32 -29 -6 13 -37 16 -30 3 23 -28 39 -39 17 -16 -41 20 -37 16 -9 -26 48 -36 16 1
7554 1 -24 37 -48 26 -18 -4 18 -50 39 -18 5 33 -34 54 -31 -4 37 -29 46 -29 18 13 -37 50 -60 41 -3 -31 38 -57
7584 -57 31 -2 -33 45 -79 41 -8 -23 58 -53 64 -32 -14 35 -59 62 -47 13 39 -74 71 -44 7 40 -48 77
7610 77 -54 34 16 -33 68 -76 39 -17 -42 82 -78 46 -8 -27 66 -95 72 -22 -20 46 -70 69 -46 12 50
7635 50 -89 69 -53 18 54 -78 91 -49 34 15 -73 94 -56 41 23 -50 98 -85 67 -29 -45 96 -100 91
7659I1j13qJ11j60J60j26K8O5j38J78j54P1M4j64K10j80R2K8j15J86j92J12J4
7682D0j04J60j99J53o6n1J91k30J71q4l9J59k24J98j01k5J34j74J87j48M9P3j60
7705i0J86j66R3K7j61K21j86R2K2j22J73j78J26pj17J90k08J61m9p2J57j95J84
7728H1q2n0J46k14J86j01JJ11j87K12j71N2Q2j70K08j67P4M3j66K21k10J11K9
7751C9j57K24j95J06%r0J85k05J55o8m1J54k02J57r7j4J57k27J97j01j3J15j78
7774i9K04j53L8P6j66K02j38K9Q9j73J87j53Q1kj25K02j78J12Nj03J57j92J64
7797F4o2p4J60j91J64p5m9J75k20J78q3k0R7j51J64j25K5P8j45J88j53Q5K3j50
7821i7J96j78R8J6j18J79j72J05rp3J55j69J18n6k9J20j76J46p7l6J37j78J57
$$ plain form
7659 91 -22 -30 81 -79 81 -45 -17 48 -90 88 -66 5 49 -115 95 -85 7 35 -80 106 -86 26 40
7682 40 -64 96 -103 50 -16 -67 124 -106 65 -19 -58 101 -123 75 -26 -51 83 -91 96 -52 -3 70 -90
7705 -90 96 -70 23 50 -111 110 -76 16 38 -84 89 -89 37 30 -87 103 -105 56 7 -65 92 -103 81
7728 81 -1 -51 95 -119 67 -34 -33 78 -109 103 -68 -16 66 -104 104 -63 11 54 -112 109 -101 10 39
7751 39 -118 106 -89 17 17 -73 112 -93 62 -6 -47 107 -95 62 -35 -49 108 -119 78 -23 -36 79 -99
7774 -99 105 -48 -10 66 -100 102 -36 -7 82 -91 96 -57 24 22 -103 99 -79 33 38 -65 92 -100 64
7797 64 2 -72 88 -103 61 -14 -63 112 -108 70 -13 -33 64 -87 77 -48 -23 55 -90 98 -55 30 53 -97
7821 -97 99 -79 19 35 -83 96 -76 29 20 -53 102 -67 51 -5 -34 86 -90 56 -21 -57 80 -98 59
7844E9o9k0R3j36J52j27M1O6j51J57j07M3N7j00J21j41R5j1p4J14j26R1j6m9J13
7869G5j28Q6k8m1J03j53J42p0NN7j14J12q5K1O0p6Q5q7L9K2q9J13q5K8L8q2J12
7896F0q3L7Mo6J07j09P5j3l6P5q2M9oj8P1j12Q4m4mO0j12J11p0K9Mo0Q6n5J7L4
7926C3o4R1q6L1M3r0R0p3K9Om0O7q7N4Kk1L9p1P5l1j0M1n9M5j6qM8o2M4k8NJ0
7958Gm5N7m8J6L4o2O5l5kL0n4P2m2MQk9N9m9J9J2l9N1m8K4Rl6L5k5M8l3j6L0k7
7991a0M4m1KK3l0M7m9J1L3n5M8m8K5K2l8M2m4J7Jj7L1l8M0j6k4L9n4N7j8j1M6
8022C5o7M6prM1m6M1k7j0L7o8M7k1LNj8N3n6N2k8k5N6q3P0j0l6O1p7P2m9QN5r2
8055d7P6n3K1L5p6P1o3L7L4p7J04r6N5j7m5J08j01N4k3k9P8r0O9k2k8M9r3J22
$$ plain form
7844 59 -10 -30 63 -73 79 -48 -7 59 -92 65 -42 1 58 -42 79 -62 33 22 -52 62 -64 27 11 -38 75
7869 75 -53 33 5 -36 67 -86 56 -14 -9 48 -66 46 -39 -18 42 -34 51 -36 3 25 -64 49 -36 -8 30 -52 60
7896 60 -23 14 18 -48 59 -50 25 12 -24 51 -31 18 12 -6 65 -47 37 -7 -11 49 -63 48 -22 7 11 -49 37 -18 -1 33
7926 33 -31 60 -26 5 48 -42 48 -25 4 10 -30 37 -50 4 6 -15 24 -47 28 -3 -13 28 -31 14 -2 -10 38 -24 20 -8 -3 7
7958 7 -38 19 -29 -13 21 -41 24 -11 -13 17 -37 35 -7 -3 5 -24 35 -14 5 17 -22 29 -19 5 14 -22 13 -12 36 3 -13 17 -10
7991 -10 34 -7 -5 18 -12 35 -14 -3 30 -25 23 -25 0 22 -16 26 -18 -1 0 -17 14 -24 16 0 -24 15 -39 18 0 -11 35
8022 35 -32 14 7 -2 39 -7 34 7 -3 34 -34 13 -8 -5 0 -18 35 -21 31 3 -22 34 -49 21 11 -25 36 -41 31 -18 -10 45 -47
8055 -47 29 -24 -3 32 -44 27 -36 1 35 -42 62 -34 21 4 -41 67 -34 20 -3 -32 46 -44 25 3 -25 24 -69 53
8083E3o8jO7j15J00n2ML8r4J35j01K8L6q8J37j16N7lp7J32j35J17n0n8R8j21J19
8110D2l8n5J08j27J23p9qJ06j35J21r4QO1j19J48j14N7M5j35J65j37P1Pp7J27
8135G1j58J22k6p0J59j92J28l0n6J44j80J64q7k6J19j54J43q8qR3j65J84j31L6
8159hN9j51J76j35Q0%j05J78j79J09j7r0J80j90J41n2n5J53j99J81q9m5J36j76
8183i8J80j00qR7j79J86j17M8
$$ plain form
8083 53 -15 -16 51 -64 36 -16 -12 26 -68 67 -34 -6 30 -58 79 -37 20 17 -60 72 -63 54 4 -54 44 -77 42
8110 42 4 -51 57 -70 53 -26 -34 72 -63 58 -36 -28 33 -86 62 -52 5 50 -85 80 -57 14 21 -56 71
8135 71 -87 35 9 -61 98 -94 34 4 -52 92 -88 76 -11 -37 82 -72 71 -17 -25 68 -97 87 -44 -8
8159 -8 51 -100 76 -59 21 21 -84 94 -85 24 7 -83 97 -93 48 -4 -59 94 -105 76 -13 -58 78 -98
8183 -98 82 -18 -26 71 -108 78 -39 9
8191I
$$ Imaginary data points
##PAGE= N=2
##DATA TABLE= (X++(I..I)), XYDATA
0@%%%%%%Qj1J1j6J6k0K8l2M0n6O8p6R3j17J41j65J89k20K59k97L38l94M56n19
30b76N90o68P53q47R49j060J186j325J474j638J818k013K223k452K704k979L277
47A716l604L965m363M803n290N833o440P126p907Q802r846J1079j2555J4355j6601
62h927J9481k3309K8629l6470M9039p2012J25787m38919l53023J037063l12306
73A5033L67301p23632K54480L36509o78514Q77252m36482j08958L4118j00361
83a63254O77409j066263N17108M97780n86509J18176n20965R65605r8054o93832
93c52799N24250n16680M30352j4809N5248J01873r22927Q88355J04145k74234
103B2774m7984l56378Q77464o54154j20265N58130m10555L35602m48144K69141
$$ plain form
0 0 0 0 0 0 0 0 8 -3 8 -8 8 -12 16 -16 24 -32 36 -40 53 -64 77 -88 101 -119 140 -157 181 -213 243 -276
30 -276 314 -354 399 -448 501 -559 627 -698 776 -862 956 -1057 1166 -1286 1418 -1561 1716
47 1716 -1888 2077 -2286 2517 -2773 3060 -3380 3746 -4161 4641 -5205 5874 -6681 7674 -8927
62 -8927 10554 -12755 15874 -20596 28443 -43569 82218 -356701 -709724 327339 15033
73 15033 382334 -341298 -86818 249691 -428823 448429 11947 -97011 -62893 -163254
83 -163254 514155 -552108 -35000 462780 -123729 -5553 -526518 439087 341033 -352799
93 -352799 171451 -345229 85123 70314 125562 227435 -695492 192863 297008 22774
103 22774 -25210 -381588 495876 -158278 -278543 279587 -130968 204634 -243510 25631
113B5631J00752m05336P36956m95262j60448j3037K12779O12012r90300J90758
123a85495K65786j17919L27668n22491M00559k24913j83561N69162m59021J32211
133A986j15987K05942J16957o57576O11643J6122j15999j06379l23078O61175
143B94806l02082m336J41213m27918L44967n2497K47223j91743m11976N28602
153A66259j25088K9627j80009j3522M00241m80982J99266N2376j08219K50102
163A90051l01260J77682j81641K472M04827l22258n0528j32912K85486J98202
173B70121m20859J80790j15171R7644J09658k27832K17628k47853J08156J71574
183A43856k53914J21839n1999J85284j08707k42358K63168l0510R6640j76254
$$ plain form
113 25631 126383 -278953 458003 -37259 -197707 -210744 2035 614047 -376253 -185495
123 -185495 80291 -37628 290040 -232451 168108 -56805 -240366 328796 -130225 1986
133 1986 -114001 91941 208898 -448678 162965 179087 63088 -43291 -366369 294806
143 294806 -7276 -11612 129601 -298317 46650 -5847 241376 49633 -362343 166259
153 166259 41171 70798 -109211 -122733 277508 -203474 -4208 48168 -60051 190051
163 190051 -111209 66473 -115168 -112696 292131 -30127 -80655 -213567 71919 270121
173 270121 -150738 30052 -85119 12525 122183 -105649 111979 -135874 -27718 143856
183 143856 -110058 11781 -40218 145066 36359 -205999 57169 26659 123299 -52955
193e2955j11656K37416j23446J86726r3254j91791J59890j7880J52101j70665
203b5514j07590J81024m4571M4376j31317P6277J01705j36131Q8512j22606N8405
214a7430J15092j08105L1173j51186R5721J67648j04210n1763q3885J35651N5899
225H4605p9890m362q9163J12735R051n1563L4822q4373J18974M602j06726L3986
237a7302P715Q4402n6505r4417L0970N3808P7542q5480n0346J6938L1542R8701
249I7568r3151o4325L8832J8684N8110o6126m3224N9235K6141q876m9899O007
261b1024L9266K3683l4768p4838M4622N6203M781k8838p4160M1064Q1252j6877
273D0366m6050m0376J9884O4355q365n9346m390M0252K2183j2249l9675P67N5372
$$ plain form
193 -52955 -164611 72805 -50641 136085 42831 -148960 10930 -6950 145151 -25514
203 -25514 -133104 47920 3349 47725 -83592 -7315 94390 -41741 46771 -75835 -17430
214 -17430 97662 -10443 20730 -130456 -34735 132913 28703 -23060 -106945 28706 84605
225 84605 4715 353 -88810 23925 32976 -18587 16235 -68138 50836 55438 -51288 -17302
237 -17302 -9587 74815 18310 -76107 -45137 8671 86213 733 -49613 -32675 -1133 97568
249 97568 4417 -59908 -21076 -2392 55718 -10408 -53632 5603 31744 22868 -27031 -21024
261 -21024 18242 41925 7157 -67681 -23059 33144 37925 9087 -65073 -24009 57243 40366
273 40366 -5684 -46060 -26176 38179 29814 -29532 -33922 6330 28513 16264 -23411 -22644 32728
286C2728j618n1296j3277J5317M6992J2690p3203j2705N2936K8840p00n9861k3670
299d6827N6278K5132k7331l4664J033L2777K8107k8780l9806L5980K2254p413
311A6740k2903l8638M6829L6509l6580k4844n889L8643L3589l0555m4514P777
323b3836M2744M688j9983l5451N141N7162j1280l0407k479P067L6097j2022m4318
336b6877O397L0020J0496j6899k8476J770M7535R260m0593j4044R486K9679J0531
349B8285m4140j6723L2925J7337n158j9153j8182L3993K1533l2978j2847K5K1600
362F517J8629l4657j8040K2357K8326o039k4360j0971J0677L8869k2871l1003
374b2566J1798J08L6890j5638l8834K5654J0990J4550k2877k2746J9894J1832
$$ plain form
286 32728 31110 -20186 -33463 -18146 28846 41536 -31667 -44372 8564 37404 36704 -23157 -46827
299 -46827 9451 34583 7252 -27412 -26379 6398 34505 5725 -34081 1899 24153 16740
311 16740 -6163 -44801 2028 38537 1957 -22887 -28776 9867 43456 12901 -31613 -23836
323 -23836 18908 23596 3613 -31838 -26697 30465 19185 -11222 -13701 -6634 29463 17441 -26877
336 -26877 -20480 9540 20036 3137 -25339 -23569 23966 33226 -7367 -21411 -11925 17754 28285
349 28285 -15855 -32578 347 17684 12526 -6627 -24809 9184 30717 -2261 -15108 -15083 6517
362 6517 25146 -9511 -27551 -5194 23132 17093 -7267 -18238 -7561 31308 8437 -22566
374 -22566 -10768 -10660 26230 10592 -28242 -2588 8402 22952 75 -22671 -2777 9055
386I055J0152l9305L315K2648k154K6150n1371K526L9345j6226J4913m5777P042
399a9687M0328j6287K039l2182K8069J3341j1775J0796m9798M4568O555k3694
411g727J8844n3263N7729J0844m1090J9147k8702M8917j2612k3668J3147l0180
423b8614N6785k9552n134R856l7936Q1997m7434j9185K8056l0629O2713n6491
435a5568m006K9640k5855M8839n2473K0060J91j4835O4040q4371K9436Q977j5477
448a1402N5878r3507N1714J5713l0936M4042o7290N1847j6748n064L7701q1001
460d9053O8194k4645J1309K0867q9562J06080l9588j2735K9316o7422Q8854n6376
472a4761J0898K2218o2745Q2591n4051L4489j8599m6818J10920r2145L1853m974
$$ plain form
386 9055 19207 -20098 -16783 5865 3711 29861 -21510 -18984 20361 4135 19048 -26729 -19687
399 -19687 20641 4354 6393 -25789 2280 15621 3846 14642 -35156 9412 15967 -7727
411 -7727 11117 -42146 15583 26427 -14663 4484 -24218 24699 12087 -11581 1566 -28614
423 -28614 28171 -1381 -6515 3341 -34595 47402 -32 -19217 8839 -21790 40923 -15568
435 -15568 -19574 10066 -15789 33050 -19423 637 828 -14007 50033 -34338 -4902 4075 -11402
448 -11402 44476 -49031 2683 18396 -12540 31502 -35788 16059 -689 -5753 31948 -49053
460 -49053 19141 -5504 5805 26672 -62890 43190 3602 -9133 20183 -47239 41615 -14761
472 -14761 -3863 18355 -44390 38201 -15850 18639 40 -46778 64142 -28003 3850 -1124
484a124l2824R4817j05407N5210r53l9724P7794q0143N5650m1471q98P6075j05848
497d8846O8510m0407K1166N1300j18317J06167m8773j203M9722r0225Q8820o7474
509b9560L2677L4153r0708Q8228o2896N8768j5493p8838J25150r5577N0554p381
521I077n8753J08183j05641P4176j3468n9258R1423q0462P6945o3482j4524R6585
533F0801j09617Q4965o2562J2224P2575j21788J12940o8863j269O6122r0716R0345
545D5157q8711M1875M7491r2861Q7117q4745P1192N65q5814J18134j06684O3488
557A6204M159o5795R8216j07626Q5270j0398o2009Q0556q2539R3122o2332k3886
569c7058Q8139j04260J00775o6334k297O9571j09656J18717p3871q503N9850p7905
$$ plain form
484 -1124 -33948 60869 -44538 10672 9719 -30005 47789 -32354 23296 -18175 -19073 57002 -48846
497 -48846 19664 -20743 423 51723 -66594 39573 -9200 -10403 39319 -50906 37914 -29560
509 -29560 3117 37270 -53438 34790 -28106 30662 15169 -63669 61481 -34096 16458 9077
521 9077 -49676 58507 -47134 27042 13574 -45684 45739 -34723 42222 -21260 -35784 60801
533 60801 -48816 36149 -26413 -14189 58386 -63402 49538 -19325 -20594 45528 -45188 45157
545 45157 -43554 -1679 45812 -47049 40068 -44677 26515 27080 -58734 59400 -47284 16204
557 16204 20363 -45432 52784 -54842 30428 20030 -41979 38577 -43962 49160 -13172 -37058
569 -37058 51081 -53179 47596 -18738 -21035 48536 -61120 57597 -16274 -24777 35073 -42832
581d2832R7272r5655L5733M1252p7643R3101r9140O5787O087p3698J12011j14432
593e2157O2685R625n5043Q7318j09790Q1286o607m4667O5333r0084R3322m9613
605h392j5597O8573j02131J00902n4545l666N4650r7572J07364n9924o421M0380
617B3621o5208R1602p9099K7271K1819n8444R0794q8747M8725K28n5273J00274
629E7563r7183M6614K930l8515P6636r0807O0127j2073k2595N3944q2104P5672
641C0209m1206j598N2372r1339Q4102m2503L875M1114q3998Q1690m2430O058K2922
654A9268n6612P1421n5667K9605M833m6635P4013o6946L9761n341m3267P7327
666D1760o6968L2836m361k7152N9027n7952L6426j8409q371M1876n6394M8951
$$ plain form
581 -42832 54440 -41215 -5482 35770 -41873 51228 -47912 17875 23962 -49736 62275 -52157
593 -52157 10528 20153 -34890 52428 -57362 23924 17317 -27350 37983 -52101 41221 -8392
605 -8392 -23989 44584 -57547 43355 -11190 -14856 39794 -57778 49586 -10338 -16759 23621
617 23621 -41587 50015 -29084 -1813 20006 -38438 52356 -36391 12334 12562 -42711 57563
629 57563 -39620 6994 9924 -28591 48045 -42762 17365 5292 -17303 36641 -45463 30209
641 30209 -10997 -12595 39777 -51562 32540 -9963 -6088 35026 -48972 32718 -9712 -3654 19268
654 19268 -37344 34077 -21590 8015 12848 -33787 40226 -26720 13041 7700 -35567 41760
666 41760 -25208 7628 3267 -23885 35142 -22810 13616 -4793 -13164 28712 -27682 21269
678B1269l5404L926M1064o2728N3989l2352M157L3210n5899M6059k7187J0343
690D47J4062l8082M1401l4437K8208j487l3615M6746m3212L2733l822l4570M6705
703B1077l7049K4831l902k1408L2846k7652K3711j7291l678K3212l0278L1746
715A6165k7088K068K7450l3933L0140k2033j174K4721k5851J7475j6205N719R858
728G312j3837J5388k1005J7848N13j5348K1291k5233J7656L708k0701J9235j4368
741g541J0854L329j2941Q048n776J1763q165k294M212j0417J9434j2750l421J1754
755F089j3249J4994o263q673J1576n211K312k994j745K573K812J856r959O668
769G86J020k298P208j3029K548R089p568L863k497l962R376j766n396L059m70
$$ plain form
678 21269 -14135 -10209 30855 -31873 22116 -10236 -6079 27131 -28768 17291 -9896 447
690 447 14509 -23573 17828 -16609 11599 10112 -23503 23243 -19969 12764 8942 -25628 21077
703 21077 -15972 8859 4957 -16451 16395 -11257 12454 -4837 -8515 14697 -15581 16165
715 16165 -10923 -8855 18595 -15338 14802 -7231 -8405 16316 -9535 7940 -8265 -2546 7312
728 7312 -6525 8863 -12142 5706 6219 -9129 12162 -13071 4585 8293 -12408 6827 -7541
741 -7541 3313 6642 -6299 1749 -4027 7736 -429 -2723 1489 -8928 10506 -2244 -5665 6089
755 6089 -7160 7834 1571 -7102 4474 -737 1575 -1419 -3164 -591 2221 4077 -5882 786
769 786 1806 -492 6716 -6313 -3765 5324 -2244 1619 -878 -4840 4536 2770 -2626 433 -37
784c7J59K455m751k216P143l71m600L206l573K863P207j1550J621M317n131Q251
800D993n838m830Q497j919K44p87j902R35L481j751o817Q027k485q42N831j1947
816g110Q446M008q305N936o531J666O168m415j792l47M077j978K842k756n090
831e181J1358p339p46M694q754R912j884o576N886j783K153P2k915k076M282K509
847C612o966M314k959J12Q493r770J693M050m838N224k857m047N196P59l539J400
863a23r4j270N735m059m230N940j840R7J910n739K057N864n234L90K165n377P259
880C451j395o728O744k966R83J857m628K185K044P31m997L277m26k530Q806j1444
896e036L330N919q973J0787q500r78Q217p120M941n309L004K50j675N505j1690
$$ plain form
784 -37 122 2577 -2174 -4390 2753 2382 -2218 988 -2585 278 7485 -4065 -2444 1873 -3258 4993
800 4993 -845 -5675 2822 903 1147 360 -1542 -607 2874 1123 -5694 2333 -152 -994 4837 -7110
816 -7110 1336 5344 -2961 2975 -3556 -1890 4278 -137 -1929 -2276 1801 -177 2665 -91 -5181
831 -5181 6177 -1162 -1908 2786 -5968 3944 2060 -4516 1370 -413 1740 1812 -1103 -3179 1103 3612
847 3612 -3354 960 -1999 -1887 6606 -3164 -1471 2579 -2259 2965 108 -3939 1257 2016 -1523 -123
863 -123 -217 -1487 4248 189 -4041 1899 59 156 2066 -3673 -1616 4248 -986 -596 1569 -3808 3451
880 3451 2056 -4672 2072 -894 89 1946 -2682 -497 1547 2278 -2719 558 132 -2398 6408 -5036
896 -5036 -1706 4213 -4760 6027 -2473 -3451 4766 -2354 2587 -2722 282 532 -1143 4362 -7328
911g328J2254m518m300J2077j8319J4685j091r861J3043j4105J1228k165m480
924b880O833j0913J4380j1416M474M174j6273K4078j8346L950R426j9353K4097
937A2231j7462K736Q616j4462J8019j7051J0290k141p891K0738k6244J9141o193
950C27r004K5195l2146K1963l733j1719K2345k6032K0554r270k712J5050k4934
963a4116K6002j9096P145J0989l0553L6874k5006N940J3373k9776L5161k5835
975h898Q737Q719k3303K9769k7252J9677n439j6165L4863l8241K7545r347j4596
988a3931L6674m3544L1141q735j3946L0680l5898L0982j9005o86K3253l6832L6974
1001A7127k8675J0560J7558m1761M7223l3217R023J7108l6653M2736l4927J5553
$$ plain form
911 -7328 4926 408 -3892 8185 -10134 4551 3460 -6401 6642 -7463 3765 1600 -2880
924 -2880 3953 -6960 7420 -3996 478 4652 -11621 12457 -5889 -1939 7487 -11866 12231
937 12231 -5231 -2495 6121 -8341 9678 -7373 2917 776 -7115 13623 -12621 6520 327
950 327 -8677 16518 -15628 6335 2602 -9117 13228 -12804 7750 -1520 -4232 10818 -14116
963 -14116 11886 -7210 -65 10924 -19629 17245 -7761 -1821 11552 -18224 16937 -8898
975 -8898 -161 8558 -14745 15024 -12228 7449 2010 -14155 20708 -17533 10012 665 -13931
988 -13931 22743 -20801 10340 1605 -12341 18339 -17559 13423 -5582 -6268 16985 -19847 17127
1001 17127 -11548 -988 16570 -25191 22032 -11185 -2162 14946 -21707 21029 -13898 1655
1013A655R307k9334L7373l6314K8207p159k2475M3705m6449L3849j0546j8852
1025a7033M2400m9603L7842j2015j5741L4029m0624L9094k6186PK7495m3225M5088
1038B1528l5379J1893K0991m7275N4144l9362J0948J8350l8725M7346m2564K1194
1050C089Q330l0930M1953m4319L4933q850k4438M8194n2910L8458j1349j9315
1062a7154M3474n2917M1888j4110j4470L2942m2434M3574k9569J196K7308m4916
1074b5188M8340l6739J1253K0945m6882N4442l8851J0104J6642l5765M6222m2728
1086a8205K1877O046k8188M1589m5378L5191r462k2749M7132n2511L7285j1097
1098A530j6740M0157n0656M0565j5121j0169K8589m0788M3324l0536M565K3537
$$ plain form
1013 1655 10962 -18372 19001 -17313 10894 3735 -18740 24965 -21484 12365 1819 -17033
1025 -17033 25367 -24236 13606 1591 -14150 19879 -20745 18349 -7837 -7830 19665 -23560 21528
1038 21528 -13851 -1958 19033 -28242 25902 -13460 -2512 15838 -22887 24459 -18105 3089
1050 3089 11419 -19511 22442 -21877 13056 4206 -20232 27962 -24948 13510 2161 -17154
1062 -17154 26320 -26597 15291 1181 -13289 19653 -22781 20793 -8776 -7580 19728 -25188
1074 -25188 23152 -13587 -2334 18611 -28271 26171 -12680 -2576 14066 -21699 24523 -18205
1086 -18205 3672 9718 -18470 23119 -22259 12932 3470 -19279 27853 -24658 12627 1530
1098 1530 -15210 24947 -25709 14856 -265 -10434 18155 -22633 20691 -9845 -5280 18257
1110A8257m3190M7500l5798J2167J7719m2908N0280l5771J0817J2101l0423M1323
1122B2074l8733K1581J847k2922L7375m1128L1916r798j9062M1221m5149L1206
1134A0428r584j3405L3205m1222L2717j3479o117K2250l3381L5760k6441N818
1146c451J8606l6033L9304k9440J0461J4288l4671L9518k8107R737P949k2999
1158a4838L1689l0618J9522j740j6554K9641l3529K7135r539j4498L2169l4916
1170a6076K4565q304r638K4337k9361K4009j1877k157J4846k3763K6642k1242
1182h019N931J3085k6088K8519k1341P016J1001k3913K5661j8106O350N122j4291
1195i073J9373j9739J4080k432j0157J9320k2648J8534n925j0435K0939k1930
$$ plain form
1110 18257 -24933 22567 -13231 -1064 16655 -26253 24027 -11744 -927 11174 -19249 22074
1122 22074 -16659 4922 6769 -16153 21222 -19906 12010 2212 -16850 24371 -20778 10428
1134 10428 844 -12561 20644 -20578 12139 -1340 -7457 14793 -18588 17172 -9269 -3451
1146 -3451 15155 -20878 18426 -11014 -553 13735 -20936 18582 -9525 212 8161 -14838
1158 -14838 16851 -13767 5755 4015 -12539 17102 -16427 10708 1169 -13329 18840 -16076
1170 -16076 8489 185 -9453 14884 -14477 9532 -2345 -4502 10344 -13419 13223 -8019
1182 -8019 -2088 10997 -15091 13428 -7913 -897 10104 -13809 11852 -6254 96 5218 -9073
1195 -9073 10300 -9439 4641 2209 -7948 11372 -11276 7258 1333 -9102 11837 -10093
1207a0093J5040m128o821J4285j6227J3901p855m8P411j3601J6935j4512M565
1220a148P721j5950J7985j3043L112P519j3431J3319r207K897K405o069Q880j0439
1234e449Q629k558m370J0305j3074J0104k113o673J1058j0494N797M15m401N726
1248B902n374M642k948P01J684n313P845o777J811M052p751Q124m038j503N044
1263C101n318L234p89j120Q26j92J223k747L340j839q19M095n434K893J088m172
1279b630M402k166j307L533k291k0J658j655K56J332j658l94J877j522j37K185
1295A463k838J374K134m197L171l22l080M504l187k91K852k850J720J14r04K62
1311g5Q30m76j775L179l047P27K964n408M755r12k815M932m391J324J448k412
$$ plain form
1207 -10093 4947 819 -6002 8283 -7944 5957 -1898 -1946 5465 -8136 8799 -5713 -1148
1220 -1148 6573 -9377 8608 -4435 -1323 6196 -7235 6084 -3123 -226 2179 -3890 4990 -5449
1234 -5449 3180 622 -3748 6557 -6517 3587 1474 -5199 5859 -4635 1162 1577 -2824 2902
1248 2902 -2472 2170 -778 -77 1607 -3706 4139 -2638 -827 3225 -4526 3598 -440 -1943 3101
1263 3101 -2217 1017 228 -892 -66 -258 965 -1782 1558 -281 -1100 2995 -2439 454 1542 -2630
1279 -2630 1772 -394 -1701 1832 -459 -479 1179 -476 -220 1112 -546 -940 937 -585 -722 1463
1295 1463 -1375 -1 2133 -2064 1107 785 -2295 2209 -978 -1269 1583 -1267 453 567 -337 -75
1311 -75 755 279 -1496 1683 -1364 -637 2327 -3081 1674 762 -2053 2879 -1512 -188 1260 -1152
1327a152J440p62Q18j285J970q18j924M656m843K107J763n372N698k790j116L532
1343A922l454K130q4n26k26L83P19k712L542k721l28M109n394L695R2l257M472
1360B362l022p1J649j488L35K63K78j483K471j076j609L615l617J299J815m025
1376b304L070k94j926K505j001r72K006p26j479K266j498o91K454k472M78J792
1392A208k012P62J204k116R70J550l401K399K61l112M289k626n14L074l146J793
1408E83j42q30L05K70K51k253L693k958K45L768o287N516j614l043N769n820L091
1425E44J58k097K694k918L433l338K381L75m547P675p628L484K631p911R581o664
1441b147J490L493o351O894n510L181q64k324O073q883Q659m467k449R483j2562
$$ plain form
1327 -1152 288 -474 344 -941 1029 211 -1713 2943 -1900 207 1970 -3402 2296 -494 -1610 1922
1343 1922 -1532 598 514 -12 -238 145 864 -1848 1694 -1027 -1355 2754 -2640 1055 1147 -2110 2362
1360 2362 -660 -731 918 -570 -235 28 306 -1177 1294 218 -1391 2224 -1393 -94 1721 -2304
1376 -2304 766 472 -1454 1051 50 -922 1084 358 -1121 1145 -353 -1044 1410 -1062 -584 1208
1392 1208 -804 -42 1162 -954 16 1566 -1835 564 825 -2287 2002 -624 -1138 1936 -1210 583
1408 583 441 -389 -84 186 437 -1816 1877 -1081 -836 2932 -3355 2161 547 -2496 3273 -2547 544
1425 544 702 -1395 1299 -1619 1814 -1524 857 1232 -3315 4360 -3268 216 2847 -5064 4517 -2147
1441 -2147 -657 2836 -3515 3379 -2131 1050 186 -2138 3935 -4948 3711 -756 -3205 6278 -6284
1456f284J0155l521m374R934j1247Q182l321j445N636q628R886q293L684L432
1470C796j0691J4303j2327M793N149j3011J5122j1081L851L972r763J2153j1084
1483d818P285j663n482J2043j5400J3350n348n677J5101j8360J4428n149n874
1496e564J3895j6336J3215o856q43Q496j4168J6319j3232M949O296j6318K0606
1509A0459j7193O454P060j7279K0325j5912O908L699j2463J7109j6937J1831k936
1522A125p921J7285k1451J7797o414p972J9365k3071J8080o699o628J6503k0190
1535a0191J7397r830k36J0605j8408K1197j6687N464Q604k0346K4780j9942P035
1548e58Q361j9712K3398j8856Q854L222j3791K0213k1001J5147m124r278K0709
$$ plain form
1456 -6284 3871 350 -4024 5910 -5337 2845 -476 -1921 3715 -4913 4973 -3320 364 3796
1470 3796 -6895 7408 -4919 -126 5023 -7988 7134 -3947 -96 3876 -5887 6266 -4818
1483 -4818 2467 804 -4678 7365 -8035 5315 -33 -5710 9391 -8969 5459 310 -5564
1496 -5564 8331 -8005 5210 -1646 -2489 6007 -8161 8158 -5074 -125 6171 -10147 10459
1509 10459 -6734 -280 6780 -10499 9826 -6086 822 4521 -7942 9167 -7770 4061 1125
1522 1125 -6796 10489 -10962 6835 421 -7551 11814 -11257 6823 124 -6504 9999 -10191
1535 -10191 7206 -2624 -2860 7745 -10663 10534 -6153 -689 7915 -12431 12349 -7593 -558
1548 -558 7803 -11909 11489 -7367 1487 4709 -9082 11131 -9870 5277 1153 -8125 12584
1561A2584k5531K0906p517q810K1592k6008K0773q577n881J7146k2414K0698j2892
1574c931J508J0992k0877K4581j9481O649R142k2212K6926k1395P779Q125j9924
1587a2118K4194k0072J0181K108j3575K1060k2492J6490m718r658K1781k6261
1599a3080K0900p160r032K1434k5527K0175q629m969J5983k1619K0779j3756K709
1612a792J0197k0707K4710j9872P176Q481k1464K6045k0741Q215O564j7756K2415
1625A1471j9568J1270j59j1305J9463k2046J7261o118q068K0216k4696J9900p412
1638B09p417J8655k2538J8111q521l032J2859j8394J8703j3287L676Q219j8027
1651a0784K1767j7674O371P347j8296K1775j6983O715N208j3964J7707j5968R858
$$ plain form
1561 12584 -12947 7959 442 -8368 13224 -12784 7989 -588 -6469 10677 -11737 8961 -3931
1574 -3931 -2423 8569 -12308 12273 -7208 -559 8583 -13629 13297 -8098 -319 7806 -12118
1587 -12118 12076 -7996 2185 4293 -9282 11778 -10714 5776 1058 -8600 13181 -13080
1599 -13080 7820 660 -8372 13062 -12465 7710 -919 -5888 10095 -11524 9255 -4501 -1792
1612 -1792 8405 -12302 12408 -7464 -288 8193 -13271 12774 -7967 248 6812 -10944 11471
1625 11471 -8097 3173 3014 -8291 11172 -10874 6387 269 -7799 12417 -12279 7621 209
1638 209 -7208 11447 -11091 7020 -1501 -4533 8326 -10068 8635 -4652 -976 7243 -10784
1651 -10784 10983 -6691 -320 7027 -11269 10506 -6477 238 5446 -8518 9189 -6779 3079
1664C079j221q302J5510j8457J5115n795o212J6488k0136J6228o194n607J4179
1677H675j7239J4144p348j019Q583j3439J4993j1786M504N211j3705J7272j4493
1690e647N568N222j3511J6057j2389N089L171r057J1828j1334P727k091m848J0613
1704F398j3457J1423m450m360J1731j3974J0718l556m260R183j0617Q430m419
1717a210k26M634p827R620q140L543K955q958J1357r306L112L801q542R554o695
1732b328K413J856m562N953o251M892k329j769N843q210P344k919k597P079q003
1747c588N412j119k885M634m668L302j761M41J320l099M748m538K232J373m920
1762c116N892m191M40L003m411L703j339m46J266j209J086j530J715j500j12K276
$$ plain form
1664 3079 1858 -6444 9066 -9391 5724 -71 -6283 10205 -9931 6297 103 -5504 8675
1677 8675 -8564 5580 -1768 -2787 5796 -7643 7350 -4436 68 5279 -8426 8846 -5647
1690 -5647 -79 5143 -8368 7689 -4700 389 3560 -5497 6331 -5003 2724 633 -4215 6398
1704 6398 -7059 4364 -86 -4446 7285 -6689 4029 473 -3787 5396 -5221 3209 -1210
1717 -1210 -1436 3198 -4629 4991 -3149 394 3349 -5609 5748 -3558 -446 3355 -5187 4367 -2328
1732 -2328 85 1941 -2621 3332 -2919 1973 -356 -2125 3718 -4492 2852 -67 -2664 4415 -3588
1747 -3588 1824 705 -2180 2454 -2214 1088 -673 -232 1088 -2011 2737 -1801 431 1804 -3116
1762 -3116 2776 -1415 -975 2028 -2383 1320 -19 -465 801 -408 678 -852 863 -637 -749 1527
1778A527l506L024n54k021L575k835N02J467k285J295L7q69N79N11p36J89J021
1795I21j581Q57O25k104J839l19j598K451j443m47K258k221P68R45j923J317j50
1812A95q46O07K58n46J84J123j867J355M81k508K943j827o60K652k959J679M02
1829F66j483J580p66J05l28P31q22l94J907k778K224Q9k442L657k688L72J757
1846A387k803J973o11m33N52j45L19q73J851j879M80J586l250K993j207j408L062
1863A594k723J205O87j404J160l95J6o03R80q12m75J999k571J732N25k303K793
1880A405j625l93J663j790N28M97o31jQ55o73k09J480j769O90P88j984J610k55
1898A86j227J629n15p03J472p82o40J653j562O2J262j861J134K81j023R16Q4n07
$$ plain form
1778 1527 -1979 1045 491 -1530 2045 -790 -288 1179 -1106 189 226 -643 -64 447 -289 -100 921
1795 921 -660 197 822 -1282 557 238 -1360 1091 -352 -799 1459 -762 6 951 -972 345 195
1812 195 -651 -44 214 -332 -148 975 -892 463 944 -1564 1379 -448 -1108 1544 -1415 264 666
1829 666 -817 763 -3 102 -226 505 -317 -711 1196 -1582 642 731 -1711 1946 -742 -370 1387
1846 1387 -1416 557 -54 -487 65 -80 239 -634 1217 -662 -182 1404 -1846 1147 -60 -1468 1594
1863 1594 -1129 76 763 -641 519 124 140 -463 517 -295 -770 1229 -1342 390 915 -1388 1405
1880 1405 -220 -613 1050 -740 -212 285 -346 -347 508 -165 -374 1106 -663 27 815 -1169 441 186
1898 186 -1041 588 73 -630 842 60 -580 1073 -489 -427 835 -1026 108 389 -634 282 366 -141
1916a41J30P93j598R55N72k368K830j573n79K697l019J897J1j380J572j371Q39
1933B67r44R89l59j013K909l520K572J77l239M663m030J339J471l406L676k504
$$ plain form
1916 -141 -11 782 -816 139 711 -1657 1173 -400 -979 1718 -1301 596 607 -773 799 -572 267
1933 267 -677 312 -47 -1060 1849 -1671 901 1078 -2161 2502 -1528 -189 1282 -2124 1552 -952
$$ [...]
8191A05
##END NTUPLES=NMR FID
##END=
