##TITLE=1H_Pr 088
 CDCl3
 8 sc, 
 17.11.2022
##JCAMPDX= 6.0         $$ Bruker NMR JCAMP-DX V2.0
##DATA TYPE= NMR FID
##DATA CLASS= NTUPLES
##ORIGIN= UXNMR, Bruker Analytische Messtechnik GmbH
##OWNER= root
$$ XWIN-NMR		Version 3.5
$$ Thu Nov 17 16:53:44 2022 Russian Standard Time (UT+4h)  she@DPX200
##.OBSERVE FREQUENCY= 200.1313499994
##.OBSERVE NUCLEUS= ^1H
##.DELAY= (6, 6)
##.ACQUISITION MODE= SIMULTANEOUS
##.ACQUISITION SCHEME= undefined
##.AVERAGES= 8
##.DIGITISER RES= 18
##SPECTROMETER/DATA SYSTEM= spect
##.PULSE SEQUENCE= zg30
##.SOLVENT NAME= CDCl3
##.SHIFT REFERENCE= (INTERNAL, CDCl3, 0, 15.7039)
##AUDIT TRAIL= $$ (NUMBER, WHEN, WHO, WHERE, WHAT)
$$ ##TITLE= Audit trail, XWIN-NMR		Version 3.5
$$ ##JCAMPDX= 5.01
$$ ##ORIGIN= Bruker BioSpin GmbH
$$ ##OWNER= she
$$ F:/spectra/data/she/nmr/H-F/1/audita.txt
$$ ##AUDIT TRAIL=  $$ (NUMBER, WHEN, WHO, WHERE, WHAT)
(   1,<2022-11-17 16:52:47.25 +0400>,<she>,<DPX200>,
      <created by zg, POWCHK disabled, PULCHK disabled
       configuration hash MD5:
       00 E9 B6 7A A2 85 ED C7 34 08 36 98 17 FE 4E 26
       data hash MD5: 16K
       D2 88 7F 3F 3F EC D7 2E FD 2F 8C 01 2B 9E F4 6D>)
$$ ##END=
$$ 
$$ hash MD5
$$ 75 90 B7 95 03 25 0E B8 97 69 E8 25 86 02 A9 41
##$RELAX= 
##$RELAX= 
##$RELAX= 
##$RELAX= 
##$RELAX= 
##$RELAX= 
$$ Bruker specific parameters
$$ --------------------------
##$DU= <F:/spectra>
##$EXPNO= 1
##$NAME= <H-F>
##$PROCNO= 1
##$TYPE= <nmr>
##$USER= <she>
##$AMP= (0..31)
100 100 100 100 100 100 100 100 100 100 100 100 100 100 100 100 100 100 
100 100 100 100 100 100 100 100 100 100 100 100 100 100 
##$AQSEQ= 0
##$AQ_mod= 1
##$AUNM= <au_zg>
##$AUTOPOS= <>
##$BF1= 200.13
##$BF2= 200.13
##$BF3= 200.13
##$BF4= 200.13
##$BF5= 200.13
##$BF6= 200.13
##$BF7= 200.13
##$BF8= 200.13
##$BYTORDA= 1
##$CFDGTYP= 0
##$CFRGTYP= 5
##$CHEMSTR= <none>
##$CNST= (0..31)
1 1 145 1 1 1 1 1 1 1 1 1 1 1 1 1 1 1 1 1 1 1 1 1 1 1 1 1 1 1 1 1 
##$CPDPRG= <>
##$CPDPRG1= <>
##$CPDPRG2= <>
##$CPDPRG3= <>
##$CPDPRG4= <mlev>
##$CPDPRG5= <mlev>
##$CPDPRG6= <mlev>
##$CPDPRG7= <mlev>
##$CPDPRG8= <mlev>
##$CPDPRGB= <>
##$CPDPRGT= <>
##$D= (0..31)
0 1.2 0 0 0 0 0 0 0 0.06 0 0.03 0 0 0 0 0.0002 0 0 0 0 0 0 0 0 0 0 0 0 
0 0 0 
##$DATE= 1668689566
##$DBL= (0..7)
120 120 120 120 120 120 120 120 
##$DBP= (0..7)
150 150 150 150 150 150 150 150 
##$DBP07= 0
##$DBPNAM0= <>
##$DBPNAM1= <>
##$DBPNAM2= <>
##$DBPNAM3= <>
##$DBPNAM4= <>
##$DBPNAM5= <>
##$DBPNAM6= <>
##$DBPNAM7= <>
##$DBPOAL= (0..7)
0.5 0.5 0.5 0.5 0.5 0.5 0.5 0.5 
##$DBPOFFS= (0..7)
0 0 0 0 0 0 0 0 
##$DE= 6
##$DECBNUC= <off>
##$DECIM= 32
##$DECNUC= <off>
##$DECSTAT= 4
##$DIGMOD= 1
##$DIGTYP= 9
##$DL= (0..7)
0 120 120 120 120 120 120 120 
##$DP= (0..7)
150 150 150 150 150 150 150 150 
##$DP07= 0
##$DPNAME0= <>
##$DPNAME1= <>
##$DPNAME2= <>
##$DPNAME3= <>
##$DPNAME4= <>
##$DPNAME5= <>
##$DPNAME6= <>
##$DPNAME7= <>
##$DPOAL= (0..7)
0.5 0.5 0.5 0.5 0.5 0.5 0.5 0.5 
##$DPOFFS= (0..7)
0 0 0 0 0 0 0 0 
##$DQDMODE= 0
##$DR= 18
##$DS= 0
##$DSLIST= <SSSSSSSSSSSSSSS>
$$ [...]
##$SUBNAM2= <"">
##$SUBNAM3= <"">
##$SUBNAM4= <"">
##$SUBNAM5= <"">
##$SUBNAM6= <"">
##$SUBNAM7= <"">
##$SUBNAM8= <"">
##$SUBNAM9= <"">
##$SW= 18.0517283424941
##$SWIBOX= (0..15)
0 0 2 0 0 0 0 0 0 0 0 0 0 0 0 0 
##$SW_h= 3612.71676300578
##$TD= 16384
##$TD0= 1
##$TE= 0
##$TE2= 300
##$TE3= 300
##$TEG= 300
##$TL= (0..7)
0 120 120 120 120 120 120 120 
##$TP= (0..7)
150 150 150 150 150 150 150 150 
##$TP07= 0
##$TPNAME0= <>
##$TPNAME1= <>
##$TPNAME2= <>
##$TPNAME3= <>
##$TPNAME4= <>
##$TPNAME5= <>
##$TPNAME6= <>
##$TPNAME7= <>
##$TPOAL= (0..7)
0.5 0.5 0.5 0.5 0.5 0.5 0.5 0.5 
##$TPOFFS= (0..7)
0 0 0 0 0 0 0 0 
##$TUNHIN= 0
##$TUNHOUT= 0
##$TUNXOUT= 0
##$USERA1= <user>
##$USERA2= <user>
##$USERA3= <user>
##$USERA4= <user>
##$USERA5= <user>
##$V9= 5
##$VALIST= <valist>
##$VCLIST= <CCCCCCCCCCCCCCC>
##$VD= 0
##$VDLIST= <DDDDDDDDDDDDDDD>
##$VPLIST= <PPPPPPPPPPPPPPP>
##$VTLIST= <TTTTTTTTTTTTTTT>
##$WBST= 1024
##$WBSW= 4
##$XGAIN= (0..3)
0 0 0 0 
##$XL= 0
##$YL= 0
##$YMAX_a= 129532
##$YMIN_a= -72446
##$ZGOPTNS= <>
##$ZL1= 120
##$ZL2= 120
##$ZL3= 120
##$ZL4= 120
##$ABSF1= 10
##$ABSF2= 0
##$ABSG= 5
##$ABSL= 3
##$ALPHA= 0
##$AQORDER= 0
##$ASSFAC= 0
##$ASSFACI= 0
##$ASSFACX= 0
##$ASSWID= 0
##$AUNMP= <proc_1d>
##$AZFE= 0.1
##$AZFW= 0.1
##$BCFW= 1
##$BC_mod= 2
##$BYTORDP= 1
##$COROFFS= 0
##$CY= 11.3945322036743
##$DATMOD= 1
##$DC= 2
##$DFILT= <>
##$DTYPP= 0
##$F1P= 2.36226072786647
##$F2P= -0.459571619588291
##$FCOR= 0.5
##$FTSIZE= 0
##$FT_mod= 4
##$GAMMA= 1
##$GB= 0.15
##$INTBC= 1
##$INTSCL= 1
##$ISEN= 128
##$LB= 0.24
##$LEV0= 0
##$LPBIN= 0
##$MAXI= 10000
##$MC2= 0
##$MEAN= 0
##$ME_mod= 0
##$MI= 1.114404
##$NCOEF= 0
##$NC_proc= 0
##$NLEV= 6
##$NOISF1= 3.799351
##$NOISF2= 2.8
##$NSP= 1
##$NTH_PI= 0
##$NZP= 0
##$OFFSET= 15.70392
##$PC= 1
##$PHC0= -18017.79
##$PHC1= -15.9993
##$PH_mod= 1
##$PKNL= yes
##$PPARMOD= 0
##$PSCAL= 0
##$PSIGN= 0
##$REVERSE= no
##$SF= 200.130013532006
##$SI= 16384
##$SIGF1= 3
##$SIGF2= 2
##$SINO= 400
##$SIOLD= 16384
##$SREGLST= <1H.CDCl3>
##$SSB= 0
##$STSI= 0
##$STSR= 0
##$SW_p= 3612.71676300578
##$SYMM= 0
##$S_DEV= 0
##$TDeff= 0
##$TDoff= 0
##$TI= <>
##$TILT= no
##$TM1= 0
##$TM2= 0
##$TOPLEV= 0
##$USERP1= <user>
##$USERP2= <user>
##$USERP3= <user>
##$USERP4= <user>
##$USERP5= <user>
##$WDW= 1
##$XDIM= 8192
##$YMAX_p= 0
##$YMIN_p= 0
$$ End of Bruker specific parameters
$$ ---------------------------------
##NTUPLES= NMR FID
##VAR_NAME=  TIME,          FID/REAL,        FID/IMAG
##SYMBOL=    X,             R,               I
##VAR_TYPE=  INDEPENDENT,   DEPENDENT,       DEPENDENT
##VAR_FORM=  AFFN,          ASDF,            ASDF
##VAR_DIM=   8192,          8192,            8192
##UNITS=     SECONDS,       ARBITRARY UNITS, ARBITRARY UNITS
##FACTOR=    0.0002768,     1,               1
##FIRST=     0,             0,               0
##LAST=      2.2672688,     0,               0
##MIN=       0,             -72446,          0
##MAX=       2.2672688,     129532,          0
$$ Real data points
##PAGE= N=1
##DATA TABLE= (X++(R..R)), XYDATA
0 0 0 0 0 0 0 0 0 0 0 0 0 0 0 0 0 8 -8 8 -8 8 -8 16 -16 16 -24 24 -32 32 -40 46 -50 56 -64 75 -85 96 -107
37 -107 120 -135 149 -167 183 -205 227 -251 277 -306 338 -371 410 -451 496 -549 606 -669 741
56 741 -821 915 -1025 1156 -1309 1502 -1743 2061 -2496 3138 -4180 6165 -11371 59506 129532
71 129532 95318 76130 26238 -12275 -50024 -64852 -72446 -58122 -38235 -13579 1648 13610
83 13610 12789 6398 -4554 -10228 -11989 -3952 10205 29680 44529 53204 50562 36322 10754 -17391
97 -17391 -43982 -62162 -68352 -58671 -37200 -9204 19365 43184 54872 53526 40944 21826 -275
110 -275 -18210 -27099 -26872 -19181 -5969 8143 16267 17032 12209 450 -14123 -25251 -30080 -28220
124 -28220 -18464 -2571 14302 26843 33665 32722 22520 7685 -7907 -20967 -28047 -26798 -18166
137 -18166 -4869 8898 20689 26229 24430 16041 3909 -9489 -19959 -25042 -23572 -16294 -5603
150 -5603 6184 15573 19909 19088 13953 5308 -3604 -10310 -13384 -12818 -8931 -2803 2222 5021 5939 3784
166 3784 -1148 -5686 -8325 -8452 -5334 1079 9155 15933 20508 21659 18009 10272 736 -9223 -17943
181 -17943 -23163 -24348 -21104 -14980 -7077 910 7200 11155 12673 11674 9592 7303 5091 3927 3037
196 3037 2658 2056 845 -1468 -3808 -6756 -9135 -10300 -9551 -7140 -3629 775 5633 8921 10904 11416
212 11416 9727 6587 2985 -843 -4170 -6551 -7759 -7810 -7355 -6042 -4602 -2968 -1506 232 1546 3153
228 3153 4164 5008 5319 5312 4810 3528 2163 746 -820 -1701 -2437 -2933 -2785 -2232 -1871 -1300 -910 -557 -116
247 -116 123 357 625 533 503 3 -664 -1026 -1445 -2157 -2078 -1578 -970 -100 1180 2288 2855 3026 2989 2444 1698
268 1698 928 28 -511 -748 -970 -869 -740 -665 -451 -830 -1031 -1282 -1621 -1519 -1436 -1107 -773 -495 115 490 744
289 744 1034 1456 1376 1361 1030 648 181 -295 -403 -650 -394 -27 671 1238 1971 1988 1563 966 -152 -1270 -2061
310 -2061 -2800 -2782 -2088 -1327 -145 846 1425 1137 391 -797 -1604 -2512 -2630 -1871 -523 1494 3257 4491
328 4491 4906 4073 2500 156 -2222 -3639 -4255 -3559 -1777 597 2789 4314 4465 3497 979 -1852 -4336
345 -4336 -5890 -6214 -4880 -2355 885 3565 5242 5479 4041 1344 -1817 -4431 -5658 -5180 -3132 387
361 387 4089 6913 8397 7804 5209 1217 -3189 -6591 -8412 -7971 -5427 -1703 2513 5826 7099 6294
377 6294 3760 -120 -4105 -6881 -7755 -6292 -3253 969 5211 7921 8231 6164 2387 -2124 -6423 -9178
393 -9178 -9021 -6657 -1953 3566 8361 11396 11916 9505 4699 -911 -5952 -9691 -10821 -9412 -5819 -1452
409 -1452 2618 5320 5488 3578 453 -3144 -5530 -6219 -4503 -710 4058 8584 11394 11565 9042 3815
425 3815 -2769 -8864 -13358 -14679 -12914 -8359 -1852 5015 10149 12830 12633 9809 4974 -282 -4391
440 -4391 -6642 -7045 -5312 -2471 121 1683 1741 -155 -3307 -6269 -8283 -8324 -5738 -1237 4551 10192
456 10192 14341 15838 14033 9463 2914 -3838 -9859 -13820 -14367 -12394 -7982 -2688 2347 5908 7342
471 7342 6707 4599 1869 -495 -1625 -1495 -16 2014 3805 4340 3308 1142 -2227 -5745 -8497 -9560
487 -9560 -8316 -5413 -984 4031 7976 10640 10901 9226 5663 1319 -2524 -5843 -6917 -6404 -4603 -2091
503 -2091 384 2291 2764 1952 534 -1450 -3070 -3939 -3147 -1963 -60 1882 3556 3982 3901 2835 1179
520 1179 -496 -1659 -1773 -1450 -294 1069 2140 2243 2003 662 -1185 -3151 -4311 -4854 -4443 -2889 -933
537 -933 1206 3242 4748 5385 4866 3585 2097 307 -1659 -2945 -3927 -4692 -4624 -4128 -3392 -2650 -1385 235
555 235 1739 3347 4876 5802 6226 6036 5263 3594 1257 -1107 -3034 -5076 -6332 -6678 -6601 -5927 -4406
572 -4406 -2791 -937 802 2988 4597 5563 6520 6615 5968 4457 2740 -14 -2620 -4752 -6274 -7079 -6864
589 -6864 -5287 -3067 -787 1611 4010 5094 5598 5390 4287 3010 1692 515 -593 -1537 -2066 -2370
605 -2370 -3112 -3562 -3809 -4150 -3945 -3056 -1502 239 2263 4423 5587 6187 5868 4327 2109 -201 -2195
622 -2195 -3692 -4531 -4128 -2907 -1457 -59 1016 1660 1375 733 14 -789 -1153 -910 -154 622 1367 2054
640 2054 1940 1282 327 -990 -1942 -2683 -2561 -1866 -936 687 1951 2648 2641 2249 1261 25 -944 -1669 -1985
659 -1985 -1423 -398 690 1494 1905 1970 1187 57 -980 -1962 -2761 -2851 -2296 -1216 -162 1038 1750 1820 1590
678 1590 1200 602 -120 -275 -98 -48 492 1077 1317 1237 742 188 -585 -1365 -1675 -1641 -1509 -766 47 534 904
699 904 1189 1265 661 55 -459 -1109 -1205 -1064 -673 -597 -69 378 724 841 834 867 367 298 376 206 44 1 125
722 125 187 -37 80 -26 -102 -103 -91 -178 -378 -356 -502 -353 -469 -93 -234 32 137 161 -137 -79 -250 -163 -250 25
746 25 187 622 891 1231 1438 1280 931 389 -242 -816 -1275 -1399 -1226 -1086 -413 82 703 860 895 372 64
767 64 -636 -885 -937 -877 -453 114 559 930 1018 766 283 -220 -644 -1015 -902 -479 253 942 1627 1672 1526 890
789 890 161 -586 -1345 -1817 -1804 -1378 -730 119 641 991 875 579 297 -655 -1031 -1161 -1102 -591 92 1038 1464
810 1464 1826 1429 804 49 -447 -1037 -1123 -993 -603 296 811 1112 1246 980 371 -402 -1070 -1562 -1660 -1362 -776
831 -776 22 522 778 896 482 387 -347 -607 -755 -866 -327 1 830 993 1190 1311 775 324 -413 -825 -843
852 -843 -874 -693 -361 -3 337 668 423 103 -211 -513 -778 -985 -746 -419 -86 380 643 551 412 197 37
873 37 -235 -262 81 73 58 344 407 619 365 303 57 -139 -225 -125 -154 44 -115 131 131 -253 -258 -412 -651 -561 -532
898 -532 -155 -320 -75 -130 144 174 193 179 348 622 681 885 1096 816 561 256 -370 -774 -1180 -1362 -1409 -1029
920 -1029 -514 81 403 775 812 852 621 197 -53 -384 -388 -117 -9 -119 -29 -292 -486 -1020 -1087 -1274 -847 -282
942 -282 421 1269 1935 2576 2570 2039 1166 443 -754 -1694 -2337 -2446 -1851 -1726 -1056 -434 159 584 562 501 224
963 224 252 202 679 964 1324 1402 1193 632 -164 -995 -1722 -2380 -2385 -2046 -1143 -13 1170 2029 2738 2566 2131
984 2131 1260 326 -748 -1184 -1503 -1457 -1241 -744 -202 -54 -129 -464 -627 -858 -868 -625 -173 450 1348 2043 2299
1005 2299 2056 1427 592 -515 -1442 -1818 -2003 -1452 -846 -230 746 1207 1282 902 350 -268 -804 -1147 -1277 -841
1025 -841 -393 430 919 1187 956 654 126 -374 -936 -1145 -937 -390 -39 498 1014 1202 1039 810 -52 -536
1045 -536 -752 -802 -691 -208 377 950 1177 1066 725 52 -650 -1425 -1714 -1655 -1690 -733 -182 352 1074 1296 1416
1066 1416 1051 786 211 -124 -222 -171 -198 37 350 72 78 -146 -577 -833 -930 -919 -723 -222 230 863 1135 1223
1088 1223 1116 576 215 -346 -755 -1252 -1320 -1000 -531 -458 154 277 320 497 420 561 237 461 436 485 323 528
1110 528 296 266 9 -57 -560 -671 -681 -776 -550 -381 -23 234 307 432 349 322 278 -132 -194 -233 -280 -32 -5 -53
1134 -53 130 292 266 69 88 129 -12 0 -256 192 -72 227 47 -72 -10 -79 -124 -234 -282 -263 -351 -190 -148 -66
1158 -66 -18 71 89 208 -81 73 108 78 133 90 371 311 211 228 237 218 137 20 -19 -111 -179 -308 -286 -219 -172 -160 -41
1185 -41 118 108 26 -117 -26 -135 -131 -269 -186 -131 207 22 242 127 282 134 153 103 118 158 174 213 16 -64 -89
1210 -89 -243 -216 -361 -339 -220 -112 -115 2 16 246 238 335 15 -61 -190 8 -292 -124 -173 6 34 118 222 125 88
1235 88 294 193 301 334 334 317 207 16 -98 -334 -311 -664 -734 -750 -375 -344 -238 75 192 249 86 225 325
1258 325 103 38 179 14 129 304 123 -22 -62 -258 -221 -213 -47 -149 -17 56 392 381 259 301 3 -121 -387
1281 -387 -499 -507 -404 -181 -241 -91 166 151 308 237 12 68 -6 -124 91 371 301 300 310 500 112 -7 -344 -401
1305 -401 -364 -417 -273 -217 34 368 474 120 167 -174 -336 -302 -440 -353 -277 32 148 519 460 345 104 -56 -141
1328 -141 -247 -178 -290 139 393 435 378 404 208 104 -277 -576 -634 -620 -286 -256 -24 284 212 203 181 -124 -196 -282
1352 -282 -583 -242 -141 74 236 476 581 441 306 114 -85 -408 -361 -234 -194 201 191 402 347 174 -54
1373 -54 -309 -335 -447 -541 -463 -192 -59 337 240 274 150 77 -305 -310 -423 -162 -94 87 245 405 550 433 359 204
1397 204 -168 -308 -236 -350 -315 71 202 63 155 58 5 -222 -495 -397 -283 -367 -117 -8 233 273 366 262 152
1420 152 -84 -197 -211 -298 -245 71 124 231 324 323 305 247 -3 -167 -107 -199 -26 14 173 330 285 -77 -157 -230 -440
1445 -440 -498 -443 -276 -188 -47 233 338 511 542 289 229 321 -161 -37 24 146 -95 76 218 0 -59 -65 -123 -233
1469 -233 -61 -63 -192 56 255 148 189 82 16 -140 -175 -264 -367 -397 -209 -52 64 199 212 280 255 171 242 323
1493 323 49 -42 157 114 38 40 -128 -213 -90 -330 -211 18 -169 -166 -201 -280 69 77 -85 139 -56 -206 -161 -7
1517 -7 25 73 44 18 109 151 121 73 230 40 49 -182 39 175 -42 -2 73 68 -78 -122 -32 -46 -46 27 -84 -27 -130 -200
1545 -200 112 -229 -21 -22 19 67 107 -76 144 196 403 347 375 99 48 181 -67 40 -193 -127 -58 -122 -218 -78
1569 -78 -277 -209 -242 68 -96 130 89 89 8 29 55 38 27 -165 3 25 -28 165 189 272 -37 151 167 17 55 -131
1595 -131 -35 -101 -28 1 -242 -155 -218 -49 -278 -191 -67 -114 22 165 -74 -103 -108 21 29 142 93 127 325 205 63
1620 63 259 114 -157 101 145 -9 169 8 -24 101 65 -20 -164 -229 -264 -189 -109 -149 87 -92 -45 -159 -66 129
1644 129 39 -10 114 -20 58 79 -12 11 8 137 -9 -45 -173 40 86 -146 54 -88 62 -153 -46 -3 -89 8
1668 8 -317 -11 23 -56 67 -77 103 13 -33 36 47 322 142 232 47 77 58 116 199 146 19 17 42 -12 -45 33 -130
1695 -130 -172 -88 10 -27 -22 -156 -128 -107 -102 48 -98 88 69 -19 9 13 15 -49 -42 193 -76 79 -68 -6 64 250 -39
1722 -39 139 141 -119 -71 -100 -156 -120 -78 -131 -75 49 -18 -4 60 -59 -4 72 -18 -89 -97 21 -2 194 125 22 67 99 10
1750 10 101 103 -110 -9 205 -75 117 -167 -28 -54 -172 61 -82 -27 -73 -95 -147 -207 -243 130 34 -61 -44 202 90
1775 90 52 90 71 180 14 112 28 165 57 98 -43 28 -138 -92 -39 -152 -67 -65 -35 -39 -254 -39 -56 56 69 -237
1801 -237 -54 -176 -58 -56 -35 -79 -50 -24 142 124 63 136 -90 69 97 47 -22 -151 124 127 48 -70 -144 98 -31
1826 -31 -122 -2 69 49 -190 -104 -105 -333 66 -20 -68 79 -47 -42 25 28 35 17 -39 71 79 326 130 197 120 81 351 -15
1854 -15 -48 -127 -139 -15 -70 -76 -249 -130 -139 -82 51 -10 116 7 88 32 46 192 86 192 102 192 70 -233 78
1879 78 163 -9 -147 122 104 -22 10 83 120 70 77 43 -63 -198 -111 -284 -234 -87 -29 -15 -159 115 9 117 221
1904 221 -38 171 -50 147 188 10 100 94 53 52 90 -115 -61 -81 78 178 53 -100 -90 117 65 -44 -17 -189
1928 -189 -56 -76 18 -126 -67 38 36 46 -4 23 -46 4 -1 32 63 254 145 20 7 -45 -61 -18 -66 -206 82 -42
1954 -42 -106 -135 18 -112 -116 -75 15 -210 -111 -170 -170 136 -117 72 116 -4 -16 202 108 20 82 233 256 -20 -62 -31
1980 -31 -37 -16 90 75 -170 -208 -15 -58 -85 -106 72 -94 -78 28 -41 -8 -72 -95 -25 10 27 -61 257 17 14 143 190
2007 190 108 185 106 163 246 105 72 -117 -52 -76 26 6 -26 -247 -210 -171 46 -8 28 158 -76 -92 -50 -132 -4 49
2033 49 -8 55 -50 -52 87 2 84 58 32 126 59 90 -44 -1 98 14 -49 62 84 19 -102 -94 71 99 -69 25 -108
2060 -108 35 53 -99 -65 9 -46 286 -1 141 -6 160 72 101 -13 12 9 33 -97 22 87 -115 -46 -43 -5 -37
2085 -37 55 -42 8 72 -156 -112 -70 -97 -139 -62 -43 -78 95 -68 17 56 15 146 285 199 145 145 54 16 -61 -13 -211 -114
2113 -114 -269 -104 -127 -261 -163 0 -92 79 -88 -30 67 47 189 54 107 98 185 29 -15 -196 -123 -117 27 101 199
2138 199 135 3 220 79 76 89 265 -112 -152 -97 -32 -158 -34 -188 -174 -98 -45 -98 43 6 128 106 -40 150
2162 150 166 70 84 77 5 -19 -93 -48 -46 -25 40 9 14 -6 170 109 77 210 -35 83 -153 75 -115 -10 7 -67 4
2189 4 -102 -4 -94 81 16 28 168 57 -53 67 122 -6 78 -116 -26 -49 41 -109 137 54 50 111 107 -34 -64 -189
2215 -189 -38 -53 -253 -95 -45 -107 44 -48 91 61 141 173 119 31 21 87 193 200 153 18 -4 -62 55 -163 184
2240 184 -77 14 94 7 32 3 39 38 21 -154 -174 -47 44 -41 -204 -16 -93 -42 14 195 201 32 245 211 178 281
2266 281 79 21 96 -63 -228 -23 -87 -3 -185 -205 54 -45 -245 -48 -4 139 203 16 99 -38 -53 -86 50 -129
2290 -129 73 -66 13 -80 103 77 135 -80 213 192 -38 65 118 -44 -123 -11 145 69 -127 -64 -206 -301 -189
2313 -189 -100 -122 10 -21 -7 -101 -30 -45 6 -34 37 63 32 93 38 20 -174 -53 -196 0 242 60 50 61 -4 97
2339 97 52 18 -44 115 -54 -135 -63 0 -4 -27 -162 -257 15 -81 -83 148 101 63 -14 165 76 109 70 -24 75 2 35 -52
2367 -52 -97 -107 -23 -96 -79 -54 -70 -75 23 -129 31 -74 -64 74 -79 13 -95 -95 -39 -45 -3 13 68 159 129 39 -12 233
2395 233 150 107 -18 216 111 -29 -18 -56 -120 -253 -143 6 -147 -157 19 72 48 157 99 -101 38 166 -44
2418 -44 -21 -56 -110 -83 -23 51 114 2 76 23 -62 37 -22 109 -63 231 77 59 128 53 -33 -61 -13 -71 -117 -69 -163 -13
2446 -13 35 86 -47 -11 98 -147 15 -149 91 17 155 68 18 177 85 -47 -52 13 -94 65 -12 -201 116 -12
2470 -12 -139 -45 154 -88 -98 -186 -32 2 -2 -20 -78 107 -125 130 0 -61 -31 83 105 29 -17 118 47 173 68
2495 68 138 -75 -45 -37 -118 -43 -49 -212 1 -85 -147 -146 -83 31 169 -3 -3 8 -7 -13 119 173 80 -20 74 -11 -12 131 35
2524 35 131 87 -28 230 174 -93 29 78 5 -94 -26 -57 -312 -223 -256 -9 16 -114 40 -17 -44 21 81 -8 40 -51
2550 -51 47 62 19 141 -44 -9 -184 -116 -28 6 151 103 82 117 79 -89 82 -52 -23 28 -146 -103 -98 2 88 16
2576 16 122 -38 4 -169 29 201 -6 94 8 -54 136 40 100 -4 23 -34 18 123 -52 171 -59 -39 -18 17
2600 17 -135 7 -162 -133 -223 79 -65 -101 -23 -120 22 164 53 93 132 108 -81 63 36 -120 -115 -155 -161 -143 -125 -78
2626 -78 71 -115 192 40 93 243 74 239 167 193 73 -175 -355 -311 -338 -322 -197 -117 23 111 149 255 224 204
2650 204 238 57 178 102 -27 -109 -93 -46 -107 -243 -272 -88 -125 -62 -94 107 132 120 147 307 33 115 -13 -104 -222
2675 -222 -242 -186 -297 -53 -102 -117 -32 291 48 291 143 184 232 21 158 49 -32 -21 -64 -40 -88 -42 -179 -123 -208
2700 -208 -286 3 109 41 220 115 47 144 20 -123 -86 -138 55 -61 -38 -29 169 165 40 -18 -88 -91 -58 -19 17 177
2726 177 -136 -36 -4 -114 -50 -49 -89 -47 64 -5 -27 104 50 -79 -40 107 43 -13 -191 46 -7 -24 4 -83 116
2751 116 146 -69 106 127 -27 99 -77 -167 -77 -132 -28 -151 -78 -110 -80 -19 19 22 -43 101 160 66 157 32 69 58
2777 58 74 -124 -325 -210 -79 -69 -135 -31 -3 17 54 233 111 8 -114 94 -43 -183 -114 -176 -49 -160 -92
2800 -92 -92 40 -124 118 125 -33 -21 96 123 165 107 240 126 128 49 -247 -50 -69 -179 70 64 3 -164 52 74 9
2826 9 -97 -202 -230 -170 -32 -121 9 -7 -35 -32 -121 84 -54 132 -186 -141 102 90 187 -73 80 -37 80 107 -130
2851 -130 -3 -131 -1 -17 77 -98 -1 -30 105 -189 114 13 82 -119 73 7 34 35 1 54 6 37 -34 113 14
2876 14 53 -55 -48 -100 -37 23 27 -27 -44 145 -23 -71 12 -101 -75 -68 -185 -133 -94 -95 -40 129 125 49 71 41 -87 103 2
2905 2 77 50 -3 165 -76 209 16 -149 25 135 -95 140 -110 -181 61 -115 67 -35 -140 -128 34 -69
2927 -69 -44 3 -209 -100 -22 -26 49 -12 109 -1 54 -55 -19 12 -95 27 74 -43 40 149 13 -27 -42 -23 132
2952 132 58 47 -182 -78 -98 -112 -116 87 -69 82 69 133 103 -12 20 -10 -64 104 66 -20 64 68 215 -101 86 81
2978 81 -23 -28 98 -112 -125 63 83 -126 0 -103 -270 21 -50 -307 -221 -130 -53 -127 101 229 88 266 43
3001 43 -11 -69 50 -176 -194 -122 -35 -1 47 -93 -121 -120 42 -48 108 36 -75 129 50 228 -12 -12 -16 -58 -122 -73 -146
3028 -146 -145 -34 -3 -41 248 208 200 39 202 81 24 -77 10 32 -113 -174 68 -111 -194 -153 -150 -142 17 97 112 48 13
3055 13 154 160 142 -18 -10 -121 -86 -195 -88 -74 55 31 -42 -43 187 86 241 102 96 34 -60 122 175 -36 -69 -39
3081 -39 -76 -145 -65 -1 -60 22 -21 75 37 181 70 64 70 -41 11 9 -80 -126 95 26 148 46 7 186 41 -103 81
3108 81 -127 -126 20 -36 16 37 143 60 98 46 -66 12 -24 19 -90 -49 213 -46 35 -13 -35 -57 12 17 -165 -5 67
3135 67 94 -25 248 192 132 136 78 1 -31 -235 -186 -197 -121 -353 54 -238 -31 -145 155 25 119 233 134 168 283
3160 283 214 5 -29 -112 48 -100 -165 -154 -38 -154 -51 -120 148 176 100 35 44 29 -41 -23 -141 -197 -85 -150 -127 -137
3186 -137 -64 -46 -106 47 123 -24 137 153 142 94 -64 112 63 -117 -30 -28 -26 -78 -10 -105 28 -95 -86 -28 -48 28 114
3213 114 50 100 19 83 48 38 -71 54 -70 -127 -98 -104 -13 75 102 84 105 -22 48 -49 140 -246 -16 -44 144 -51
3239 -51 93 69 54 -192 -27 63 -62 7 -108 96 148 144 60 71 82 16 -122 107 -114 113 5 30 138 -13
3263 -13 -23 63 92 48 -52 -130 -86 -126 18 -57 -109 -44 -75 -123 24 88 55 -13 146 -18 46 98 -49 -21 166 -85
3289 -85 -46 -118 -52 167 -70 176 82 148 93 244 -49 140 -104 11 40 -73 -94 -156 -31 -111 1 201 2 -40
3313 -40 -191 -79 -95 -51 83 -158 146 27 34 110 136 15 -45 -135 -18 -29 198 71 16 44 -26 82 14 -114 -31
3338 -31 -118 -71 -67 21 -105 -93 -32 -87 -6 -109 36 -37 -41 -238 -32 -121 -69 -45 219 4 -27 91 21 35 -10 77 13
3365 13 -50 -63 -77 -21 -27 5 26 -161 -50 -28 42 -144 -12 11 48 -86 -114 59 151 11 -57 -31 -49 112 52 -91
3391 -91 28 -12 75 -107 -69 52 46 -61 -52 -87 -35 -36 -34 -65 -24 6 -96 68 -14 109 -15 60 95 -8 -111 53 43
3418 43 -86 35 -83 18 -78 81 28 33 -12 60 64 -54 -53 85 -118 -81 -126 -196 2 104 43 45 92 95 16 -121 -50
3445 -50 -2 -64 -25 110 -94 137 129 36 -46 60 0 147 176 12 43 113 -21 -43 -93 -14 -173 121 -204 -103 -64
3470 -64 18 -72 86 53 -33 -76 98 22 154 -37 27 57 -48 72 -10 -51 -75 60 -193 121 161 -64 -86 -54 141
3495 141 18 16 -69 -10 21 -54 27 103 30 -43 56 -80 14 9 -18 -29 -75 -191 -42 92 -45 -81 78 20 -9 194 117
3522 117 16 -9 129 227 -52 92 71 -90 -131 -42 21 9 -54 87 -76 -79 -105 133 77 122 111 136 103 158 61 148
3548 148 53 -143 -188 -94 -266 39 -52 214 109 82 77 -24 83 -70 177 134 -73 -80 63 4 -117 -100 -123 -315
3572 -315 89 -215 -76 129 -154 -82 267 138 -19 96 -6 -11 17 -102 -20 -7 -74 -19 -32 -42 -93 -96 -68 86 128
3597 128 -18 -100 -214 -10 53 39 169 -5 118 36 -82 -95 -170 29 -47 -58 -75 2 64 102 14 -30 -71 -3 -27 -138
3623 -138 44 80 130 -10 217 143 -13 0 77 -176 42 -126 -199 -114 -30 48 23 5 -62 29 58 24 -73 89 -26
3648 -26 103 51 111 86 49 -141 -165 -27 -137 -130 -34 -8 161 35 114 40 121 -61 148 -43 -1 -70 -29 -68 -54 -26
3674 -26 181 -12 -7 96 -243 2 -79 -193 2 138 18 151 132 36 -54 39 0 29 -164 -43 -1 -202 -107 -41
3698 -41 -35 38 -47 25 -4 79 -88 66 106 100 66 53 145 -72 176 -63 119 15 22 -143 53 40 0 56 22 20 60 2
3726 2 13 -57 -166 -10 -7 -58 125 56 -151 53 -4 135 -8 -28 231 -62 -6 -72 11 194 -47 -25 5 -33 -41 -159
3752 -159 -143 18 -79 -35 -175 -39 20 21 -24 -121 -19 31 -194 31 -78 123 -74 -33 67 -9 -26 59 121 -85 -34
3777 -34 -23 -47 4 -59 -45 -55 19 105 -120 -52 -127 42 -32 -82 -169 -31 -121 47 -42 22 20 160 -102 33 68 90 -37
3804 -37 20 164 34 119 20 83 68 -41 -34 130 103 126 67 32 -142 187 155 -94 -87 4 -122 26 -21 80 -10 106
3830 106 74 -10 -176 11 34 40 21 -70 -29 -19 -52 -53 101 70 -25 -153 -89 -106 -83 -75 -33 -14 5 -148 76 -43 14 99
3858 99 -69 75 166 24 145 -30 83 18 14 138 -8 106 26 45 49 100 -3 -28 58 61 13 9 31 48 84 -79 40
3885 40 33 122 -101 -163 194 24 -147 -74 -44 -31 -31 42 -64 87 61 -50 31 -60 125 146 -35 67 103 33 -48 88
3911 88 43 -123 -260 59 -19 -125 102 112 -46 -136 82 -44 -24 -5 -35 -23 -65 84 1 -44 141 -144 -23 5
3935 5 117 13 44 57 -39 -27 -17 -20 193 175 -23 46 6 -8 18 90 -43 -36 -12 127 -77 -59 -136 -30 -146 -53 142
3962 142 -3 -32 -77 -92 -41 -52 25 79 -53 55 73 32 31 -169 -87 -84 82 191 215 23 2 -26 -66 12 55 85 -125
3989 -125 -109 -33 -98 162 122 -8 -4 24 39 -123 -8 122 3 -20 215 -24 -2 12 101 70 87 -31 -66 -91 61
4014 61 133 33 121 123 8 8 -136 -226 -42 20 104 41 67 158 135 -21 -9 37 56 -13 -2 -10 57 145 -5 -171 -91 -6
4042 -6 -126 -75 20 71 -61 229 -86 -43 2 111 -21 -66 112 -174 32 2 -77 -18 13 -92 13 -70 42 11 -158
4067 -158 -37 87 41 93 19 -16 161 5 -71 -52 -70 -157 7 -23 32 -230 82 -17 -110 27 126 -91 -129 -162 37
4092 37 60 6 20 49 48 -27 -43 56 95 -7 -117 -111 23 -50 -36 0 105 -120 12 -13 -35 110 -54 -23 -93 107 74
4119 74 98 -97 -54 -192 -1 131 -103 34 -33 -69 94 93 9 -48 -67 57 23 -30 -28 -31 79 -42 -181 -65 23 109
4145 109 -69 5 44 -65 10 29 -160 44 -111 86 18 -38 -27 -45 48 -218 -99 -29 -35 -47 82 26 97 24 86 63
4171 63 54 64 -44 82 -31 -65 140 -68 69 -144 -82 -145 -9 -84 -13 83 -90 32 -82 -66 52 19 93 -17
4195 -17 -16 52 -7 -70 -51 -110 -4 27 77 116 -28 28 -66 -23 95 57 83 -142 -147 135 -35 -196 -40 143 -85 2
4221 2 -112 -162 83 -94 -70 -14 -130 -35 139 -20 -28 29 -94 -65 -3 -4 -71 76 11 41 -34 -152 -55 -20 -95 -68 -58
4248 -58 -22 46 -55 77 103 21 145 -119 -140 45 -79 196 -15 56 -9 -78 24 -86 42 -28 32 27 -71 -9 6
4273 6 -52 -49 -127 -53 -123 32 -77 -68 -16 -27 -34 -48 66 -56 -54 30 -102 78 46 133 85 28 88 237 52 139 61 -119
4301 -119 74 -30 124 -13 -32 6 -65 120 53 -94 39 -112 183 -74 118 31 -28 102 -89 -61 32 23 -105
4324 -105 60 -52 155 -96 -88 11 7 93 9 -4 32 -45 119 -128 50 -134 24 -86 -50 -78 -125 -65 15 25 103 -112
4350 -112 109 135 65 -52 -11 138 29 32 19 -190 -34 -15 122 -13 1 66 56 78 -45 -147 -24 -46 -157 -4
4374 -4 60 136 -24 40 -113 93 -54 104 207 -118 66 -23 -65 93 -94 96 107 -91 187 109 22 -101 -14 39
4398 39 4 -100 -87 -10 175 81 -32 170 -160 37 -61 28 48 35 15 9 221 23 -9 34 82 75 -45 178 -50 -22
4424 -22 102 -93 -54 -3 -26 28 -140 19 141 -4 131 41 -96 -21 -42 -90 36 -27 55 -28 41 100 -65 51 21
4449 21 -96 -17 27 -127 -48 64 -148 -24 -83 -37 31 76 124 -30 6 77 24 117 56 -254 46 -129 59 -115 35
4474 35 22 -13 -78 -48 76 -26 -70 -13 -1 -64 22 -20 23 89 -27 133 -68 10 -23 -96 20 17 -79 -9 -45 -85 16
4501 16 -131 177 17 -65 -51 88 114 -104 36 62 62 -75 -1 -85 11 117 161 115 68 115 33 166 -104 49 -45
4526 -45 -46 -103 46 -2 42 96 21 79 -133 15 -28 -138 15 84 -1 -88 9 55 -84 -19 -166 -107 -16 68 143 82 0
4553 0 160 -148 42 83 160 -21 135 -20 75 -10 37 111 55 104 25 -12 -97 -120 17 193 -159 -59 -83 22 -77
4578 -77 77 26 -121 35 9 60 -5 -172 16 -10 76 -42 43 -113 113 -100 -40 66 -3 -75 -83 117 28 17 81
4603 81 -113 56 -83 86 -109 -48 124 -47 -71 -28 39 23 198 61 -15 -227 121 43 100 -48 -38 -102 5 -78
4627 -78 11 -7 11 -107 10 -68 -9 -46 -57 -24 21 -91 -1 41 72 17 -226 331 -76 -23 -61 -105 -83 13 85 11 116
4654 116 67 -32 136 -66 -95 83 -7 48 -24 -113 -113 23 -163 -112 120 -22 -28 -28 -69 -27 -27 86 -34 158 38 65
4680 65 -46 18 -1 -17 -31 41 -1 -54 74 -47 -35 232 98 -133 -71 -71 -136 -57 -38 -188 104 -128 -39 -69 60 232
4706 232 31 90 172 11 -44 -45 -67 53 -59 126 123 67 178 1 -34 45 -28 182 84 -36 -51 -51 20 -138 121 -16
4732 -16 -68 4 59 131 11 55 166 -174 -55 -10 -180 15 90 25 153 79 114 -31 -115 -34 -56 -131 50 76 84 -54
4758 -54 -204 84 108 -42 -95 39 77 -22 -19 79 -77 15 9 73 -9 -109 -37 29 -34 -103 45 160 237 -1 25 142
4784 142 -7 154 17 -152 81 -93 48 10 63 0 97 46 191 125 189 1 -67 35 169 -121 70 56 12
4807 12 -6 -78 -53 77 166 140 78 -73 -64 17 35 -17 48 46 26 -47 -125 -32 195 -35 -55 -77 35 148 13 109 105 81
4835 81 -33 84 25 -29 -47 146 -119 71 18 -116 -34 -66 45 75 -12 37 -246 -89 154 73 74 -12 35 -18 -1 -15
4861 -15 22 35 -9 16 -89 -96 6 -51 -57 7 101 76 41 95 -5 6 -84 14 -4 21 -1 2 74 -63 -45 -51 -19 41 8 64
4891 64 154 51 134 -19 -59 -40 16 28 -33 -65 -63 39 -164 171 34 -183 77 82 -203 -55 34 62 -1 18 11 58 -21
4918 -21 -47 67 52 143 32 143 -170 20 -11 -136 55 -173 -46 -136 -77 -32 128 -11 -23 -103 -59 -13 -52 89
4942 89 90 -52 -154 37 38 -68 -94 -90 -31 -32 -86 161 80 21 -15 -63 -9 43 -77 -17 68 156 32 -62 -6 -51 -93 107
4970 107 -1 -28 47 205 105 56 21 -126 -42 18 -54 70 0 124 163 -67 -27 -34 178 -66 -155 -8 76 -64 -162
4995 -162 -91 13 33 155 105 19 -26 99 64 173 -91 -54 192 122 74 -33 67 69 -36 -54 58 137 -64 -36 93
5020 93 13 47 43 -92 51 133 -60 -23 -58 -3 -132 56 59 69 194 -106 -70 -175 169 110 69 -3 121 -50 -81 20
5046 20 -98 92 -143 19 -59 -45 -4 59 77 -76 25 -6 -67 65 24 -131 -23 16 36 -32 19 23 -2 -154 128
5071 128 41 -78 80 163 14 -15 -61 -62 -38 -9 -151 -131 -52 -74 69 -139 -32 189 86 -59 -106 60 90 -30
5095 -30 -8 -60 7 -19 -159 24 -29 125 -73 29 38 -14 56 106 19 -69 61 -88 50 -6 179 128 -2 -130 -8
5120 -8 7 70 -34 57 26 189 -93 21 95 48 153 0 73 -17 172 -138 146 -21 -160 -146 11 -21 -29 57 -70
5145 -70 60 -48 70 -6 -86 96 -74 1 -10 -62 32 122 72 -176 14 172 -89 10 58 74 57 -35 4 131 93
5170 93 -64 -65 -111 85 17 -99 -92 -43 48 152 -118 -36 14 63 -67 -45 52 -84 -48 127 15 40 9 -4 -77 8 67
5197 67 27 -3 -49 -21 36 -1 11 -7 76 -124 -90 12 92 -174 -130 -106 36 63 65 40 127 54 18 71 -139 -9 -5 -43
5225 -43 -34 17 69 137 -90 -131 -106 60 -83 133 61 -38 -46 126 12 8 4 18 -135 -105 -228 40 -37 -102 44 -93 47
5252 47 47 69 145 154 31 -33 -76 165 76 -43 -43 -33 -45 -4 110 -50 24 17 -1 -16 58 -262 -34 140 -2 99 -62
5279 -62 62 -142 12 -54 -31 -103 49 -72 -23 -47 -147 -20 68 -20 27 30 -21 -92 35 -96 -27 33 31 0 19 -143
5305 -143 -50 126 -2 -68 -79 -12 72 37 -9 17 23 16 10 7 171 -70 108 117 -6 -53 70 0 -121 131 109 -48 79
5332 79 -34 -69 -48 68 -37 -61 29 44 -18 -48 44 -8 -95 -111 -181 36 98 -60 58 2 30 24 16 107 114 -35 16 -92
5360 -92 -13 -18 139 130 102 -12 -21 70 56 -34 61 56 -12 125 -37 -165 15 41 -47 -4 -81 -5 102 95 -54 45 112 55 -15
5389 -15 -42 -50 -37 -35 -23 21 -54 96 -47 23 -4 -5 -1 -38 -131 -47 -62 28 7 71 -26 -16 146 -68 85 63 102 145 11
5418 11 40 -37 -84 -83 18 39 217 80 107 15 165 61 -67 -29 -111 61 -21 25 -84 57 -129 -57 -4 -17 170
5443 170 -151 -37 36 -29 21 50 -60 192 -206 11 78 -23 61 41 6 -49 -124 29 -157 -47 20 51 96 -32
5467 -32 -54 39 -18 -144 172 -34 -15 38 63 35 4 24 138 5 60 42 -16 62 -56 -33 -27 27 0 86 45 31 -14 -49
5495 -49 86 191 2 57 -146 -66 -84 40 -65 141 3 -110 -45 67 16 -9 -68 -88 -35 -98 -14 -8 -43 2 114
5520 114 28 -87 -136 77 60 38 80 -15 36 66 226 60 -63 -1 63 53 167 13 119 101 -12 6 -89 -105 -179
5545 -179 107 25 -105 -49 -27 111 11 -64 -45 21 35 -14 -55 116 -53 18 28 -52 19 1 130 -6 -24 -62 -102 -96
5571 -96 -15 82 -108 -23 75 -49 -12 37 9 5 53 -140 167 -162 -93 60 -34 -75 -9 -16 -7 34 38 11 110 183 101 58 -165
5600 -165 -52 -89 -196 37 80 89 119 -39 -104 9 3 -37 -8 35 -28 -244 9 22 -6 -86 0 25 -103 85 55 118
5626 118 -8 121 9 119 199 -19 -5 4 -227 -159 27 14 91 87 15 -195 28 122 -71 -37 138 -117 -190 42
5650 42 -1 46 45 -67 -81 -3 74 76 61 -35 65 -101 80 -47 -21 122 -27 -9 -40 29 60 1 88 4 68 146 -156
5677 -156 200 32 -64 -54 190 -19 141 -42 -85 -46 120 -22 91 -11 55 -50 -96 62 144 -92 59 -226
5699 -226 -87 -224 -68 -93 -16 6 -157 56 -13 33 -103 71 -17 -66 -11 -26 -114 -200 48 44 133 12 21 25 -125 -64
5725 -64 193 58 28 -57 -62 59 -110 38 -3 121 -68 -146 -27 37 13 7 40 86 -38 -64 -26 84 15 49 140 70
5751 70 73 -129 48 -70 -237 -10 132 -31 31 -51 38 -8 -71 -7 75 34 -15 -44 166 -34 78 -28 -141 -2
5775 -2 -187 -40 3 -21 -107 -177 -71 134 -141 -57 99 40 3 -124 19 -6 -47 -113 -81 105 62 127 -14 260 28
5800 28 43 221 67 -163 -108 -40 -3 15 30 17 60 -48 56 -141 -140 -45 -213 -22 -11 85 42 -35 29 112 16 -2 122
5827 122 135 -139 5 92 -17 -110 -4 -11 168 -54 85 -6 -109 -142 -157 9 29 179 -205 -67 -45 -33 74 -29
5851 -29 -65 36 59 -50 38 -17 74 12 -150 -113 12 59 -22 164 -21 -39 95 -31 117 62 -176 48 14 -157
5875 -157 -15 52 81 -17 50 -31 -114 44 22 -157 8 -29 -156 -103 75 -19 -44 50 -93 -190 37 -6 -125 54 20
5900 20 89 13 -110 -82 15 -16 146 -5 -20 76 -99 -12 -32 -7 118 -214 151 134 -64 -35 91 -66 11 -100 88
5925 88 1 17 -81 0 -53 25 -2 7 -86 2 -61 37 18 -18 -91 116 37 17 164 -153 -115 122 84 -69 3 39 4 206
5953 206 -141 120 81 -73 -60 -61 -57 -150 59 13 27 64 -50 -98 -12 -11 96 81 -45 20 129 -15 17 -58 -34 -33 17
5980 17 -153 -91 -54 -9 -14 -49 -93 28 -9 -60 -59 89 152 26 161 107 17 -62 -5 -21 47 -110 16 -16 179 71 -142
6007 -142 -10 149 89 -61 -242 -30 50 150 90 -59 154 52 -137 -16 67 -48 -96 -60 85 -18 -237 25
6029 25 7 -79 113 -50 39 178 -10 -44 74 -81 -108 -47 -68 -59 -171 -39 -45 -206 -75 -17 -7 -92 -82 3 18 118
6055 118 -79 -8 -150 -216 89 -274 10 -37 -116 23 -21 -57 91 -68 -13 34 20 27 -66 -7 -35 -35 50 -55 21 -198
6081 -198 82 28 37 29 81 72 -33 22 -124 -57 -24 -39 19 2 -63 20 -45 -65 18 -4 94 210 -19 20 -27 32 -114 52
6109 52 68 -85 93 -78 18 84 3 -127 22 0 -58 -41 -71 36 72 121 -222 71 -35 54 37 -104 100 -45
6133 -45 85 -144 0 -13 -24 10 -44 15 4 33 133 30 9 -61 9 20 -43 -9 69 55 -130 151 64 82 -65 102
6159 102 140 113 35 -58 126 62 -138 83 221 -56 -4 -61 -12 33 -19 -57 82 -82 32 20 -27 106 16 3 -4 100
6185 100 160 98 -19 85 85 72 -82 -81 47 -62 -66 -17 12 157 0 -16 4 -22 16 36 84 22 31 -106 112 -80 -97
6212 -97 -38 -41 -6 193 -10 18 1 133 -2 -2 118 -11 -173 20 -196 87 -55 -133 -39 -197 -63 117 13 62
6236 62 5 -83 85 -106 155 192 52 63 69 -20 104 33 -23 -72 -108 -108 74 -143 37 101 -1 83 71 -59 66 152
6262 152 81 60 170 45 106 -106 125 -40 14 -40 112 -58 -52 39 -86 -287 169 57 -21 113 -33 111 -132
6285 -132 147 -25 -15 97 -16 -105 121 -40 6 -25 132 -151 39 106 -30 27 53 149 -82 109 81 38 -144
6308 -144 58 12 101 69 96 -26 83 -26 -31 1 -101 28 185 -92 -71 7 -15 -83 33 1 -16 -93 -71 158 231
6333 231 -37 -60 -159 6 76 24 94 -14 29 20 14 62 -70 -25 -98 -19 -69 86 109 28 -165 3 167 -27 1 46
6359 46 29 153 33 28 -36 -36 -44 -97 -50 0 79 16 18 125 -77 12 26 95 149 -19 73 -67 -80 65 61 -18 145 -115
6387 -115 153 7 -26 -78 -97 -100 -30 36 -89 -79 37 0 118 -78 -6 -155 29 -52 93 125 97 -19 -31 -166 -147
6412 -147 22 -52 -61 -103 -12 65 -66 -59 64 -74 -1 45 -148 81 -184 -109 130 59 -32 84 15 41 -85 -68 0 26
6438 26 -34 -225 16 107 -34 -154 -43 -4 19 175 45 47 -156 7 -32 -184 -102 -54 -112 184 93 -91 -80 -58 104
6463 104 -28 -60 -41 -66 -29 -79 15 -24 -32 113 31 29 -44 136 -43 106 144 110 -223 -2 -79 -40 100 -87 -53 72
6489 72 -101 -42 67 40 82 -1 33 29 -79 -62 -79 5 113 -13 -17 39 44 -5 -37 -47 34 83 -63 2 36 110 15 -3 76
6518 76 -99 -84 -61 -16 138 68 148 56 -83 -277 95 -49 -124 147 53 81 98 52 -156 -65 -115 158 -76 82 49
6543 49 78 11 -32 -17 28 206 -111 8 -10 -79 66 24 32 48 -63 64 -103 7 -24 105 -121 105 -53 -13 66
6568 66 -36 186 124 -146 13 -10 143 200 88 184 -190 -55 64 41 109 -137 74 -51 -26 121 -260 72 48
6591 48 109 -87 -65 124 -114 23 119 -56 -103 37 201 50 -142 24 -6 -54 -1 -14 -12 -64 12 57 74 -73 106
6616 106 21 -5 -34 -167 23 -66 36 94 -31 11 -43 53 -33 109 -1 47 267 -79 85 -212 -37 24 -225 11
6640 11 86 18 -81 40 -104 214 -64 86 188 -33 -107 121 -76 -1 66 -164 140 -164 14 -53 32 55 50 43 51
6665 51 -38 160 -1 -106 33 60 -154 -29 61 -17 94 91 -183 148 83 -1 -87 73 -62 20 12 40 -99 -74 -19
6690 -19 48 27 -53 137 -154 -133 -169 -163 39 148 -93 -28 49 46 -77 -15 -33 90 2 63 53 -187 -14 50 -59 -23
6716 -23 76 28 73 -33 -98 -200 54 -52 -15 48 7 -103 -59 -58 37 -61 -25 31 -107 -47 -9 197 -48 66 -8 41
6742 41 -4 187 75 -42 92 85 -3 9 -79 -118 35 27 96 44 -54 -65 64 -43 30 -141 -137 -93 -34 17 -38 48 29 -29
6770 -29 -26 -3 17 -158 -113 54 -188 106 -81 1 160 183 90 -19 62 45 115 -98 109 20 -87 72 193 -86
6794 -86 8 -25 112 -23 70 -54 29 69 103 96 -30 96 60 199 6 47 24 -16 33 122 -41 129 54 -30 -36 -75 -159
6821 -159 -70 49 -96 53 -94 66 65 38 47 -68 19 -190 -47 -79 -1 -95 111 73 144 18 72 -104 9 -68 -26
6846 -26 -47 -91 -148 33 44 156 -154 -18 -176 71 -28 56 62 144 63 -34 -63 6 -34 -177 64 -251 5 -46 36 -89
6872 -89 95 78 -166 -256 12 62 -156 -22 -38 92 172 133 31 -30 -30 -47 -54 -8 79 42 -61 16 67 97 -61 91
6898 91 -34 -34 5 57 -40 7 32 109 69 71 -218 -12 -153 -121 -14 154 84 -27 -35 12 -178 -133 31 -74 200 -102
6924 -102 72 49 -122 116 -16 42 309 84 23 108 4 -48 23 -128 12 71 -79 46 11 -105 13 -126 -12
6947 -12 92 -95 -59 -20 -30 -38 216 -68 -28 86 157 6 -27 149 23 12 -63 105 9 166 97 -221 -139 120 84
6972 84 210 11 57 -48 108 40 -45 -1 120 78 -53 40 -90 150 -24 143 -52 -24 70 -76 -39 -37 -22 78
6996 78 53 -89 63 -72 130 88 187 -9 -150 53 -142 -103 -69 115 23 87 -149 49 32 53 65 58 26 68 27
7021 27 5 -111 -139 51 -73 13 -246 45 78 135 44 126 -63 -135 2 80 48 -10 -191 -138 -30 -68 30 -33 -150
7046 -150 48 -134 -129 -12 -147 -37 10 77 59 116 77 -65 -43 95 60 -35 117 83 -24 -76 -37 95 -56 -72 58
7071 58 -160 -116 28 -191 -26 11 -55 35 -76 -164 -109 74 -32 13 -48 -22 -32 -31 135 33 22 79 135 6 -107
7096 -107 -90 107 -9 167 -80 113 -16 14 -78 -138 -140 54 24 -72 -40 -35 115 -53 46 34 79 -15 50 -197 39
7121 39 43 144 6 11 1 -29 -153 -136 -97 -45 67 -35 -15 71 71 116 -20 -58 -226 17 -3 -41 26 -186 -52 58
7147 58 -40 -35 95 32 14 -29 20 25 15 -33 -75 164 -5 -78 57 -60 16 51 -62 -11 -117 -68 11 -90 -29 116 30
7174 30 166 -171 184 -86 110 -43 -224 5 -8 -15 57 68 178 81 -171 43 51 115 53 16 -15 -72 -12 -43 32 -44
7200 -44 120 24 95 -8 -29 -29 -78 106 -1 -52 -81 -14 49 163 157 15 -36 51 -19 55 8 -27 130 -50 65 -21 69
7227 69 118 126 104 -73 -73 -20 -58 44 -86 146 73 81 -94 -29 -77 72 -19 -187 -162 -17 24 294 -104 77 -28 4
7253 4 -41 -107 69 -33 -86 25 114 77 29 52 6 63 134 -106 85 -28 170 31 21 25 -171 -28 -80 49 120 155
7279 155 31 -67 -69 -56 -136 1 238 40 -44 -64 -182 -150 -157 15 -220 235 46 -50 -72 12 3 120 -1 116 -32
7304 -32 -45 162 -52 -44 55 159 56 47 -83 193 41 -157 -37 -1 -40 109 -36 77 -208 15 -107 -32 213
7327 213 22 83 22 114 149 -181 -54 45 -118 -105 43 -48 26 -108 80 -61 54 39 8 -44 -64 -104 26 -10 -174
7352 -174 -209 87 35 63 116 105 -8 -62 -29 -68 23 15 -51 -37 -41 -100 -150 -12 57 -10 67 -61 43 119 64 -30 -45 16
7380 16 -30 -91 -9 -164 33 148 -49 47 64 108 23 -7 -47 -86 5 88 76 -34 -166 90 108 163 50 13 8 -127
7406 -127 29 -18 137 -74 124 71 13 -14 -70 -12 0 -66 8 -163 56 45 0 38 141 -77 -54 -28 -27 14 -122 -37
7432 -37 -32 -63 -88 89 102 -87 -18 16 84 -118 161 -75 28 -87 204 -20 -9 42 27 -31 -86 37 -29 44 -186
7457 -186 -20 -187 5 27 -70 79 -96 80 -73 -28 -66 -80 -245 -17 -48 95 162 -16 -38 -123 80 54 37 57
7481 57 219 -42 173 29 -52 7 78 28 46 -59 79 14 66 23 11 2 93 -69 55 52 -34 -25 2 39 31 65 16 0
7509 0 102 -6 0 40 136 -59 -22 55 43 3 73 -118 13 50 55 -84 49 63 -59 -211 8 48 -65 -55 19 -46
7535 -46 -84 -47 -198 23 5 -82 -104 136 -150 41 -2 -74 -39 111 7 -95 -94 128 -96 -29 82 -140 104 -23
7559 -23 -82 -18 -61 48 87 50 -14 86 53 92 -78 -16 112 42 -114 -39 153 252 -97 81 0 37 -56 91 139 -156
7585 -156 101 90 89 -157 -59 -116 145 43 71 44 -176 30 -16 54 8 40 242 119 8 77 -63 162 -1 13
7609 13 174 33 161 45 45 -34 195 -27 -110 82 -126 47 -70 75 -1 43 67 -19 73 49 94 67 -92 44
7633 44 36 -28 138 53 -48 -167 51 -9 105 162 5 -10 68 57 50 -133 -49 144 63 18 137 -112 30 -96 -237
7658 -237 137 11 63 87 -122 138 -74 125 -155 84 -9 57 37 -213 -107 -31 192 -28 -75 60 -6 133 3
7681 3 -31 99 34 131 9 158 -136 102 3 -9 -132 -116 -37 -192 38 0 16 41 99 -11 30 -81 -97 -63 -72 47
7707 47 -81 -7 -81 22 30 -6 -20 49 21 -148 -20 -184 63 61 95 88 113 -76 19 -103 61 -128 48 140 -44 -245
7733 -245 -82 99 -5 51 -40 -32 105 -13 14 -93 -73 29 -61 -116 -44 -19 -13 40 -95 173 16 35 -61 -48 -50 28
7759 28 -68 64 -48 -27 34 7 -5 -101 -72 -116 -17 86 -41 5 10 122 -65 -105 47 77 -122 44 -2 17 79 -75
7785 -75 103 6 -124 -22 34 -97 60 0 88 136 -48 -139 -8 -27 -74 -29 9 4 117 80 -18 28 27 60 8 -34 94
7812 94 49 20 -64 -73 -47 -18 94 31 11 59 97 -43 -5 -50 -101 -23 100 -118 30 70 -99 -113 64 162 27 -169
7838 -169 -99 0 167 -16 68 53 -26 118 74 32 146 107 -56 4 121 96 73 -171 40 47 15 -36 102 -73 66
7863 66 64 116 -30 -77 -7 -3 3 44 28 -172 -45 -13 27 -158 -63 102 -106 85 -74 48 -85 129 2 -60 106
7888 106 -82 148 8 -86 29 39 7 -7 -46 -163 -217 35 133 19 -41 -49 -58 26 25 -8 115 67 91 4 -51 -114 86
7915 86 39 90 -124 -67 101 -167 1 4 22 -56 -37 21 76 -67 -10 -55 -27 -99 -95 9 14 40 19 29 33 18 -20 23 83
7944 83 -75 -29 28 -18 41 -42 -74 -45 -8 -22 -49 -63 -114 111 -57 68 89 -74 -42 -57 72 104 102 -140 -57 2 46
7971 46 20 -3 19 -67 38 -46 -35 -30 41 146 5 -25 -158 99 -77 73 -102 38 159 56 -80 -50 -28 -3 137
7996 137 9 33 126 -44 94 -107 2 136 34 -37 118 -81 -67 -43 -61 200 -60 -107 -47 8 -85 -4 -124 48
8020 48 101 105 33 109 -19 82 113 -22 -122 154 7 45 -94 10 1 136 151 17 -8 67 -61 -68 17 215 -37
8045 -37 -74 -25 39 46 70 38 3 -20 -41 0 28 81 182 -13 71 217 191 -274 -133 -61 50 26 207 6 -75 -46 -19
8072 -19 64 -75 -13 -120 80 -77 -4 93 86 -28 97 152 -100 22 61 -6 -21 -66 -105 -29 112 55 107 -16 104
8097 104 -20 75 29 -40 -118 73 43 -124 132 19 99 -52 -114 46 19 49 69 133 76 -37 22 -97 13 6 55
8122 55 39 76 64 2 -53 14 247 -29 65 14 43 -18 75 -21 1 -116 -63 120 167 -36 60 237 27 17 -101 30
8148 30 -105 -19 16 84 56 108 53 32 48 67 96 25 76 -68 -58 -70 -32 103 -57 74 74 -56 1 19 -77 58 -53
8175 -53 76 -70 -29 -39 100 -84 -69 -78 -89 34 -26 -41 41 -173 117 -5
8191e
$$ Imaginary data points
##PAGE= N=2
##DATA TABLE= (X++(I..I)), XYDATA
0 0 0 0 0 0 0 0 0 0 0 0 0 0 0 0 0 0 0 0 0 0 8 -8 8 -8 8 -8 8 -16 16 -16 16 -24 24 -30 32 -36 40 -48 50 -56 64 -72
42 -72 78 -87 96 -106 115 -129 140 -155 171 -187 207 -229 254 -280 312 -347 387 -435 495 -566 656
63 656 -772 931 -1162 1531 -2209 3881 -16597 -5485 51563 81927 98925 93676 75821 41196
77 41196 8166 -19981 -36448 -43450 -35447 -22187 -9049 -1119 1159 -6077 -18190 -29690 -34950
90 -34950 -32524 -19721 1860 27025 48358 61845 62872 49929 24788 -5163 -34074 -55884 -65829
103 -65829 -60222 -42924 -19096 7199 29010 40456 40339 31305 16129 -1344 -14202 -18738 -16223
116 -16223 -7335 6006 17893 22974 21751 13447 -1335 -16962 -28781 -34003 -32103 -21734 -5424
129 -5424 10713 23560 30838 29538 20378 6678 -7832 -19948 -26159 -24533 -16027 -3716 9644
142 9644 20848 26194 24293 16648 5152 -7322 -17768 -22949 -21697 -15501 -5919 4898 13232 17411
156 17411 17010 12439 4892 -2527 -7706 -9748 -8929 -4911 674 4204 5661 4355 -171 -6375 -11826
171 -11826 -15058 -14930 -10939 -3155 6346 15347 22342 25360 23503 17647 9081 -787 -9998 -16584 -19637
186 -19637 -19244 -15967 -11150 -5626 -1149 2364 3956 4766 4598 4448 4956 5740 6684 7331 7346 5641 2987
203 2987 -560 -4585 -8290 -10630 -11199 -10049 -7404 -3197 1370 4944 8163 9794 9757 8344 6364 3774
219 3774 936 -1415 -3455 -4831 -5383 -5991 -6037 -5614 -4908 -3754 -2505 -840 759 2343 3577 4332 4349
236 4349 4232 3508 2409 1347 456 -295 -819 -1100 -1129 -1196 -952 -692 -686 -141 187 567 749 1029 955 427 -286
257 -286 -922 -1685 -2686 -2952 -2880 -2281 -1613 -445 518 1493 2425 2485 2331 2207 1537 1071 787 455 600 571 566
278 566 471 243 86 -394 -805 -1108 -1519 -1624 -1554 -1558 -1523 -1173 -642 -283 249 598 1013 1112 786 597 44 -553
300 -553 -886 -1098 -699 -89 798 1406 2405 2652 2379 1878 806 -380 -1344 -1919 -2084 -1545 -678 469 1220
319 1220 1542 1097 -9 -1603 -3042 -3981 -4148 -3357 -1322 772 2898 4494 4815 4207 2558 289 -1916
336 -1916 -3661 -4062 -3237 -1346 1333 3741 5462 5610 4122 1794 -1091 -4086 -5811 -5990 -4895 -2299
352 -2299 699 3457 5034 4789 3258 304 -3232 -5709 -6923 -6382 -3880 -266 3750 7157 8924 8264
368 8264 5735 1983 -2474 -5916 -7613 -6988 -4530 -849 3475 6191 7178 6229 3033 -895 -4855 -7437
384 -7437 -8110 -6529 -3023 1697 5461 8076 8288 5949 1912 -3228 -7832 -10679 -10649 -7916 -3112 2641
400 2641 7779 11363 12088 10235 6045 816 -4080 -7294 -8361 -6727 -3635 184 3416 4788 4143 1356
416 1356 -2444 -6391 -8620 -9109 -6260 -1688 4100 9434 13171 13679 11249 6131 -693 -7232 -12424 -14477
432 -14477 -13509 -9597 -3840 2358 7504 10491 10592 8583 4476 877 -1987 -3735 -2979 -756 1852 3645
448 3645 4101 2627 -677 -5458 -9397 -12270 -13038 -10313 -5254 1294 7872 13399 16015 15704 12402 6648
464 6648 304 -5598 -9685 -11194 -10120 -7212 -3352 505 2841 3702 3116 1541 -529 -1898 -1783 -641
480 -641 1604 4269 6342 6992 5769 3044 -1227 -5669 -8991 -11068 -10577 -7855 -3603 1195 5553 8603
496 8603 9600 8571 5842 2485 -777 -3159 -4267 -3670 -2458 -240 1314 2568 2528 1151 -475 -2510
512 -2510 -3999 -4582 -4008 -2823 -949 1170 2390 3025 2471 1743 262 -977 -1368 -1284 -591 805 2209
529 2209 3395 3529 2952 1584 -437 -2510 -4209 -5104 -4962 -4115 -2363 -240 1793 3605 4543 4895 4556
546 4556 3782 2438 1069 -430 -1761 -3076 -4024 -4514 -4892 -5008 -4296 -3262 -1817 10 2243 4279 5606
563 5606 6673 7060 6416 4952 3331 824 -1434 -3451 -4928 -5949 -6491 -6249 -5466 -4420 -2933 -861
579 -861 1230 3238 5138 6390 6882 6614 5382 3265 523 -1851 -4342 -6129 -6596 -5956 -4737 -3138
595 -3138 -948 1068 2401 3304 3970 3951 3572 3278 2849 2273 1831 1282 51 -1349 -2773 -4145 -5339 -5725
613 -5725 -5389 -4227 -2293 131 2415 4511 5335 5544 4822 2994 1105 -549 -1930 -2710 -2572 -1776 -1001
630 -1001 110 921 1022 591 -104 -767 -1579 -1489 -834 -220 765 1686 2413 2245 1516 494 -774 -2269 -2983
649 -2983 -2746 -2350 -1397 224 1428 2224 2558 2023 1063 -313 -1098 -1655 -1659 -1100 -22 1198 1915 2824 2648
668 2648 1826 654 -560 -1680 -2427 -2569 -2118 -1679 -827 198 838 676 794 353 -388 -425 -551 -213 160
687 160 833 1474 1671 1626 1202 637 -94 -993 -1257 -1444 -1354 -768 -29 617 1075 1062 1017 752 277 -310 -721 -1189
709 -1189 -1022 -1051 -741 -403 -106 154 182 388 316 357 158 237 169 303 193 202 424 331 195 310 186 37 164
732 164 141 -62 -265 -182 -309 -440 -272 -153 -150 -25 -99 -248 -383 -584 -791 -825 -554 -306 -41 562 1101 1409
754 1409 1540 1364 900 248 -394 -951 -1087 -1022 -745 -325 269 701 712 644 354 -212 -709 -1110 -1081 -853 -547
775 -547 36 536 826 893 545 -26 -551 -1409 -1167 -1034 -590 232 887 1550 1820 2055 1310 551 -285 -987 -1290
796 -1290 -1471 -1123 -611 94 636 1059 845 550 -46 -909 -1245 -1373 -1325 -653 -67 763 1139 1245 1243 858 113
817 113 -481 -1145 -1167 -695 -260 420 974 1360 1578 1226 602 -163 -895 -1303 -1369 -1084 -609 11 340 834 755
838 755 524 0 -665 -1066 -1101 -1003 -689 -85 528 1089 1166 1165 790 229 -198 -414 -706 -646 -350 226 512 668
860 668 556 601 196 -158 -339 -769 -894 -730 -472 -233 122 226 282 67 -14 -281 -211 -320 -203 -229 238 446
882 446 275 513 385 295 123 33 -117 -30 210 285 452 222 142 107 -145 -298 -377 -698 -589 -590 -454 -407 -242 -414
906 -414 -379 -538 -386 -72 318 580 1088 1153 1205 1013 619 99 -501 -997 -1310 -1113 -933 -614 -139 425 715
927 715 572 412 495 406 39 192 177 283 390 269 41 -208 -883 -1342 -1679 -1939 -1735 -1308 -441 722 1637
948 1637 2438 2728 2573 1960 1110 274 -667 -1292 -1539 -1628 -1254 -816 -540 -313 -169 -343 -487 -482 -383 -35 504
969 504 1318 1718 1902 1891 1423 330 -453 -1498 -2234 -2708 -2428 -1664 -716 440 1359 2187 2287 2009 1427 772
989 772 -70 -511 -752 -571 -376 10 258 7 -150 -768 -1292 -1832 -1666 -1517 -757 18 785 1874 2257 2290
1009 2290 1660 756 -50 -908 -1383 -1510 -1300 -734 103 823 1083 1053 997 322 -174 -735 -1167 -997 -813 -142
1029 -142 322 803 1191 936 583 -91 -659 -1123 -1026 -986 -751 44 504 1039 1147 945 469 -164 -562 -704 -829
1050 -829 -501 216 744 1250 1436 1456 1212 466 -327 -1113 -1574 -1730 -1527 -1036 -668 -33 408 630 770 513
1070 513 396 26 8 147 325 249 681 851 536 374 -84 -487 -938 -1048 -923 -897 -511 217 541 1115 1253
1091 1253 1215 1085 532 -65 -338 -897 -985 -799 -838 -458 -461 36 9 45 -7 144 41 -46 255 454 696 569 739
1114 739 622 308 215 -211 -656 -683 -739 -668 -485 -352 67 124 291 197 316 69 150 -159 -220 -76 -92 -152 -52
1137 -52 84 265 199 241 45 192 -6 -83 97 68 141 379 351 121 187 -24 -94 -36 -294 -201 -379 -299 -185 -80
1161 -80 -327 -299 -120 -158 -106 7 -210 -20 20 87 30 109 278 249 251 285 295 33 211 61 -31 -83 -60 -143 -284 -211
1187 -211 -40 -92 -163 -70 16 -97 -141 -156 -292 -191 -265 -107 4 -10 108 102 168 199 187 257 347 402 328 248 192 41
1213 41 -16 -83 -343 -279 -350 -219 -158 1 75 -131 196 101 158 34 -66 -92 -75 -244 -157 -125 -120 50 -30 -19 354 64
1239 64 192 223 291 530 431 449 387 179 104 -52 -251 -318 -430 -519 -546 -253 -184 -102 55 -34 177 -55 -11 63 87
1264 87 103 136 116 98 209 35 -49 -198 -280 -19 -99 34 286 271 406 591 444 252 43 -173 -246 -394 -392 -290
1288 -290 -270 -145 -163 -77 -62 12 -24 -197 -312 -20 82 157 277 482 484 319 237 154 -165 -284 -315 -211 -301 85
1312 85 239 266 294 205 282 -115 -265 -495 -452 -377 -213 -188 41 130 238 184 67 -196 -345 -237 -245 -316 89 233
1336 233 377 545 462 335 263 -226 -353 -260 -590 -271 -109 121 42 97 229 35 -61 -290 -576 -360 -322 -113
1358 -113 -53 335 426 322 425 292 -27 -276 -330 -491 -251 34 367 419 542 399 272 165 -78 -395 -405 -357
1380 -357 -180 -126 111 137 247 232 162 -79 -465 -264 -468 -293 -328 71 190 432 409 242 469 250 -3 -161
1402 -161 -353 -92 -51 57 346 302 278 275 -88 -97 -313 -518 -465 -374 -89 -25 166 205 198 270 52 -21 -172 -189 -165 -415
1428 -415 -115 97 337 344 59 241 -27 -36 -16 -252 15 92 290 397 197 252 327 124 -130 -494 -383 -494 -612
1451 -612 -199 -200 33 234 221 148 199 21 23 167 45 -131 189 73 200 299 -32 91 -90 -249 -233 -90 -102
1474 -102 2 35 304 102 147 188 76 -104 -298 -273 -309 -330 -287 -56 17 -185 125 132 132 81 291 133 20 160
1498 160 213 372 129 248 274 50 -170 -213 -123 -254 -270 -204 -88 -51 152 100 -109 -36 -139 -249 -90 -37 -137
1521 -137 -129 -178 143 0 53 288 22 145 -26 21 103 -6 -60 78 134 84 7 45 47 107 -87 -72 -2 -38 -107 -60
1547 -60 -171 -80 -84 -67 -67 -163 94 78 -141 -59 76 34 220 201 199 98 -108 -83 282 109 142 68 105 -87 -182 -102 -79
1574 -79 -135 -267 -56 -109 -332 -85 -107 -97 148 76 -19 -53 -95 -234 -131 55 -98 -71 68 77 255 220 68 260
1598 260 99 100 62 104 113 91 -45 -102 -96 51 -103 -161 -271 -169 -108 -165 -11 -2 -1 23 -97 28 -72 -48 -18 152 279
1625 279 135 -5 101 67 -42 112 278 20 181 166 -36 -254 -22 -40 -183 -144 -169 -149 -108 74 -10 -18 44 -82
1649 -82 -137 34 -128 17 150 180 68 -1 126 174 -55 46 44 207 11 145 25 17 130 -88 -66 -14 -27 -46
1673 -46 -98 -164 -119 -76 -76 -111 -267 -12 111 33 -24 75 8 80 161 264 47 178 59 43 293 91 -35 45 9 -139
1699 -139 -199 -13 26 237 85 81 79 -56 -198 -49 103 -79 -21 -72 -128 -84 -46 -137 -124 -51 44 21 -58 -7 175 36
1725 36 -23 159 37 87 53 8 44 45 -157 -69 -142 -220 -83 -121 -204 53 -199 -218 180 -133 73 -40 2 -87 22
1750 22 9 115 4 185 216 189 6 -54 -23 108 115 -6 -18 73 -22 -54 31 75 72 -101 -154 -65 -117 -183 -34 -120 24
1777 24 -175 -35 -55 122 -72 166 218 152 28 98 -9 90 121 102 81 103 14 164 204 85 -47 39 -15 -146 156
1802 156 -87 124 -62 -220 -69 -184 167 60 -74 6 -53 -43 25 -127 105 132 136 228 4 208 203 21 98 213
1826 213 -21 12 34 85 -46 44 79 -165 -53 -256 -109 -84 -6 9 -10 -29 -128 82 57 1 43 27 4 158 -59
1851 -59 176 213 49 204 96 197 57 28 183 -21 -256 -179 -27 -56 -176 55 -185 -49 7 -81 -50 -106 61
1874 61 -76 20 6 -90 -46 41 -130 -1 -113 -144 65 -104 37 120 132 20 56 196 152 -7 -129 -95 -115 -96 -27
1899 -27 -32 -243 -85 -125 -90 -66 -83 -8 -44 -15 -189 61 79 17 126 123 -21 -102 20 63 -66 -76 197 127 223 -14
1925 -14 86 16 53 -16 -56 131 -60 28 -3 -162 -90 -52 -53 8 -10 -108 -130 140 -59 39 80 -13 77 -21 -49 87 55
1952 55 -8 52 -24 180 86 56 43 -7 351 91 176 -111 112 -189 -205 -88 102 -216 -54 -18 -61 -14 5 7 -95
1977 -95 107 73 24 -40 57 105 -26 198 127 44 223 63 11 0 -24 -80 56 111 106 45 21 -69 -51 76 -86 -153 -82
2004 -82 56 108 -28 -11 14 43 28 152 188 61 187 29 199 82 -16 54 -13 64 59 138 -55 -17 -61 -155 -50 -54
2030 -54 -147 -30 -64 -78 52 -42 -93 -176 -77 21 -37 -75 0 -122 76 14 83 11 -49 226 223 55 -61 -21 -15 -27 -2 -42
2058 -42 85 46 115 23 -50 -132 -91 -131 -146 -11 -131 45 80 -30 239 273 15 99 29 20 75 50 132 35 59 114 2
2085 2 -60 27 -126 -49 79 -34 91 93 -37 -180 -80 -197 -207 -131 -28 -61 -39 11 -43 32 -37 89 167 126 138 -87
2111 -87 90 27 32 -167 36 -61 -29 18 -116 -190 -137 -28 -159 -22 -31 182 115 143 89 -60 -7 -30 60 -51 -123 -265
2137 -265 -89 -153 -139 -33 19 19 77 201 164 120 181 94 -54 -58 72 -170 -152 -205 -262 -1 -261 -208 63 -164 -97 -92
2163 -92 164 -38 74 74 14 64 76 -64 -27 -61 -26 -63 -74 10 49 120 40 -96 133 -119 63 211 36 42 16 -67
2189 -67 -73 -57 -167 -155 -21 -62 70 -17 -83 24 -39 35 99 -13 114 -28 -44 165 7 -28 -123 -121 184 219 -82 328
2215 328 88 -30 -67 -63 -10 -61 -44 -101 -71 -2 -37 -178 -118 -87 -105 -117 -77 269 129 -131 -16 6 -41 -40 9 -149 -56
2242 -56 11 182 -20 58 49 127 42 91 -10 -11 -95 26 -89 -82 -32 51 -147 -18 -225 -57 -8 -148 52 154 148 114
2268 114 129 2 149 -34 -10 17 102 46 -152 -2 8 -93 110 -82 -68 -53 88 6 15 -70 21 -117 -3 67 53
2293 53 -111 -217 -17 19 3 -56 -118 -63 130 65 108 220 180 171 170 13 50 -9 -45 -106 36 0 -247 -144 -107 -153 -9
2320 -9 56 -161 -131 38 61 26 3 -80 -56 -111 51 -6 -91 2 7 -47 3 29 -62 235 254 -12 6 -86 144 -74 45
2347 45 149 -89 -63 42 38 -19 -160 -201 -132 -18 4 85 -105 94 -14 113 90 128 73 36 43 -103 84 -150 29
2372 29 82 -46 11 -53 148 -46 168 -40 -21 -7 -47 25 52 -77 9 -143 39 -130 38 -40 -8 54 127 126 -1
2397 -1 8 -101 77 172 166 74 205 60 39 -154 -184 80 -47 10 -21 -38 -230 51 -10 0 96 48 -21 -112 -47 104 42
2424 42 98 -200 -108 95 157 139 -127 77 72 15 -45 149 112 24 35 -52 108 -13 81 -69 -63 -121 -15 -216 -126 -15
2450 -15 -125 62 -212 18 -112 -64 59 -138 -75 24 102 -171 -30 -36 -35 129 -71 23 -63 -124 44 57 -133 -2
2474 -2 0 55 7 -393 -44 9 -94 -90 26 74 -56 -45 -144 -149 34 -88 -89 54 -50 200 -139 39 -137 107 1
2499 1 -26 5 160 -55 -43 -52 -117 -36 -63 -60 102 126 142 -51 -166 18 -99 -48 107 -168 39 4 -105 -9 99 119
2525 119 -100 -12 100 152 173 25 86 47 74 52 112 18 -18 -124 39 -2 -37 32 -15 -71 31 -34 -35 -134 -106 2 71
2552 71 95 52 37 71 102 113 -88 54 -18 126 32 58 97 154 67 -85 92 152 -50 113 141 -133 28 -172 38
2577 38 35 -48 -96 -89 -31 -66 115 9 82 123 11 81 -44 -54 -5 73 59 -42 54 116 99 28 0 120 -75 108 -28
2604 -28 99 -182 -199 -58 -252 -229 -94 -127 168 -107 48 188 20 251 77 210 49 -42 -54 -253 66 -6
2626 -6 -156 -26 -226 -38 -91 138 -24 129 143 228 248 226 95 -169 -23 -8 -270 -315 -248 -165 -276 28 28 91 84
2651 84 155 258 269 298 210 163 119 139 169 -13 -109 -334 -325 -281 -186 -134 -64 -18 61 68 108 165 226 183 -31 -47 -7 -289 -112
2680 -112 -269 -195 -127 26 35 -33 17 -83 24 61 115 227 157 179 -14 59 3 -79 -266 -91 -313 -163 12 -170
2704 -170 -13 -16 38 243 92 33 75 82 -62 -12 -29 -16 155 -9 -115 100 205 -24 25 17 45 51 158 -16 125
2729 125 9 -110 49 37 -29 -84 -93 -9 -110 -4 58 -155 -51 142 -212 109 20 -55 -155 -131 -35 -5 3 98 107 54
2755 54 101 125 101 -127 -59 238 -103 -2 -72 5 78 27 -179 -107 -222 -26 -37 155 -5 17 172 1 169 101
2779 101 52 18 146 -60 -159 -137 -182 -8 -90 -11 56 133 -28 79 32 -19 -27 -6 -94 92 -52 19 -17 -94 -77 -54 -63
2806 -63 -28 -7 -49 32 115 161 73 134 110 135 29 104 -38 -137 77 6 -38 -74 61 -8 -66 42 153 15 -155 -63
2832 -63 112 17 47 -97 20 21 -127 -34 65 -24 -149 -91 -124 -98 35 264 112 36 243 255 137 153 -67 -50 -63
2857 -63 80 -108 -23 -76 -173 -72 -63 -142 18 220 -8 -104 93 -155 109 33 -85 6 3 -5 25 12 47 50 -91 -199
2883 -199 75 -120 -22 -22 81 -30 176 150 11 109 -9 24 61 -111 -27 -21 -91 -160 50 -54 -55 12 40 -90 -31 62
2909 62 130 129 -135 -82 -15 196 0 -26 -97 -71 -32 -77 4 -77 -164 -54 44 -67 89 40 -4 38 -173 141 20 -122
2935 -122 25 -101 -22 170 115 96 37 -55 43 110 -109 59 -40 174 -35 -85 -122 -30 116 -35 139 132 -59 -48 17
2960 17 -65 -201 103 -13 3 70 40 134 81 22 1 -50 -31 -194 19 -10 43 74 137 76 -30 -6 59 -25 50 30 47
2987 47 125 -102 -84 -70 -23 -103 -144 -178 -219 -250 56 -51 -5 5 85 34 21 7 78 33 -153 -251 101 -38 -29 -2 -134
3014 -134 13 -71 104 46 84 25 176 69 -88 50 218 64 36 -86 -8 -217 -273 -179 -203 -70 -106 144 103 102
3038 102 219 145 76 259 113 8 24 56 18 28 -31 -173 -99 -66 -88 67 18 43 -7 -49 220 101 228 77 87
3063 87 61 -273 -163 -77 -49 -155 -194 19 -51 4 65 170 70 137 22 -91 73 -105 -73 55 -190 -20 -215
3086 -215 -137 -217 -118 -120 -101 -242 -168 102 187 57 -139 -100 -30 -46 -119 -139 49 -5 -99 62 215 116 272 102 61 37
3112 37 28 -46 130 140 83 98 18 -150 23 9 20 -36 -29 -91 10 13 43 -58 95 -41 -177 -118 -122 -72 -127 -30 277 38
3140 38 128 199 227 229 160 144 -67 109 -39 -78 -165 -12 -138 -294 32 -128 -117 66 11 124 86 93 209 170 -50
3165 -50 201 66 39 65 -122 -211 -258 -121 72 -98 -25 116 122 30 188 153 35 162 197 -18 -199 -201 -34 -353
3189 -353 -47 -64 -210 11 -84 8 -19 118 270 63 2 140 58 72 5 30 65 10 -132 -73 -189 -120 -163 24 -24
3214 -24 -72 -38 44 187 49 -16 42 24 19 22 -117 -100 88 73 -119 81 -9 148 -78 143 -59 -82 -46 -53 42 -82
3240 -82 63 -4 100 135 133 -104 41 30 3 -13 60 13 17 -45 30 -43 -123 -61 -13 84 -37 -84 -49 15 72 165 51 102
3268 102 202 56 -93 -101 136 25 45 -98 -137 31 2 -34 4 -98 -21 212 -7 7 37 40 -7 19 72 4 -36 -75
3294 -75 80 -66 34 -58 109 -36 209 10 -21 -110 45 -14 -180 24 -52 81 37 23 -1 10 63 -66 -109 -25
3318 -25 -54 -129 -160 5 55 125 -15 -43 -97 58 -22 90 -46 -55 151 33 54 -23 -77 169 123 -36 -76 -2 -140 100
3344 100 6 85 -171 77 55 -83 -117 -12 -156 69 -97 -31 -176 -102 11 -118 1 -41 -267 75 -42 -137 -96
3367 -96 -154 139 58 131 57 124 207 170 -128 -149 52 -246 -41 -102 -64 65 -122 27 -129 -102 -120 -5 -73 -52 -44 30
3393 30 -68 27 27 4 186 110 94 -38 164 -166 -50 50 -28 -66 93 52 -14 16 -151 59 -6 -205 -252 21 66
3418 66 110 -211 66 -48 131 198 -30 -99 41 129 34 142 -128 1 -38 -54 39 -16 -15 44 -41 -88 -143 -106 -15 -6 97
3445 97 -10 -100 126 -135 9 -59 -83 134 75 -154 -114 235 22 76 92 212 120 -83 52 58 191 64 35 99
3469 99 -70 -64 -23 -106 -101 -15 -19 64 -92 151 -14 14 87 -22 8 -86 51 56 -14 -41 -35 55 40 178 71 -31 -37 -44 -84
3498 -84 43 17 -49 -71 81 37 67 -56 136 51 141 71 46 154 59 -64 75 -65 160 -85 -74 -99 -118 -130 -19
3523 -19 -2 63 -47 37 75 32 2 58 200 50 1 45 -72 -116 -16 -60 -142 -146 -31 16 37 61 72 174 89 93 120 21
3551 21 -102 -102 -10 -90 -147 -210 15 -104 -26 -94 -10 57 15 -114 83 39 93 -86 25 -3 -59 -38 68 -48 -123 -178
3577 -178 -159 -192 -49 -223 31 198 -29 132 -61 107 59 14 125 26 -36 -71 -18 15 4 -111 -36 52 -17 -38 22
3602 22 96 -227 158 104 108 77 182 -47 -83 -73 -125 89 -21 -2 -181 39 107 92 -50 108 -14 -10 -7 -84 -9 -47
3628 -47 97 146 121 12 -18 -69 -118 -63 -201 -191 -19 -165 -6 -91 -79 -85 54 36 -142 24 -105 -68 66 76 -22
3653 -22 82 -23 99 13 -110 -111 -140 -140 -49 -180 38 40 -21 113 103 100 -1 -38 -73 17 -41 46 -47 -48 -7 -48 -158 -140
3681 -140 -289 -117 -159 24 178 -38 32 -38 37 56 185 -156 60 -137 -136 -77 24 5 6 -10 144 -1 -108 35
3705 35 62 23 29 28 84 16 49 -180 173 9 -76 10 -69 -61 -36 -191 236 50 34 62 -66 -5 4 54 -91 119 -148
3732 -148 3 -59 -184 -50 23 89 -56 -94 -96 -42 -28 -121 10 40 -7 52 19 -109 1 29 44 -8 51 81 -138 -196
3758 -196 1 -257 36 120 -99 -1 -58 -9 -181 -31 25 103 -37 -68 -6 22 33 5 14 -105 -8 -218 56 96 47
3783 47 86 -47 93 136 -13 -19 -162 71 73 -14 -79 -162 -13 86 -67 -30 -166 153 36 -176 -41 -122 0 -181
3807 -181 -119 -91 67 -75 60 19 62 -95 46 31 68 -191 69 5 23 104 -34 102 50 -102 -82 -133 4 70
3831 70 98 188 46 -111 -213 56 -32 -31 71 -178 19 94 -8 70 9 -82 97 -1 61 -70 38 -55 -86 -128 107
3856 107 20 62 -17 -114 64 42 71 -57 -52 -110 125 54 -29 -60 49 27 127 -126 99 -186 -137 18 39 83 96 52
3882 52 -81 -79 40 -102 62 55 -12 3 -6 -192 -23 -31 -59 -131 53 34 -9 -39 36 -106 -35 12 59 -64 -44 75 -83
3909 -83 72 129 -27 5 98 -23 79 -50 -22 -88 -116 -197 -62 120 -178 23 105 -2 -5 -66 -4 61 84 -143 39
3934 39 -11 122 101 21 154 -7 -58 -2 -105 0 -25 3 86 171 -68 67 -58 3 -37 -2 -37 -132 -43 128 43 74
3960 74 28 -16 -18 -107 -145 -30 53 -24 8 -54 63 34 169 139 -12 -52 -63 48 -47 -3 -74 108 16 -78 -9 7 -1 8 10
3989 10 -91 61 -142 195 207 98 59 17 -76 -109 -61 -97 -75 -312 49 -22 104 70 108 36 116 -46 37 21 -56 38
4015 38 160 28 49 42 97 77 17 4 -59 -75 139 -110 17 193 59 -9 -78 111 37 46 -70 53 85 115 -37 112
4041 112 141 41 116 -57 -10 -104 71 26 -33 131 196 52 -8 17 -45 95 152 41 -20 32 32 15 -25 -69 -92 -87 29
4068 29 -96 69 -29 51 -50 33 -67 158 20 47 191 -102 -61 86 -102 -47 22 50 42 56 151 7 133 79 -101
4093 -101 -120 -201 -9 0 73 -105 30 -145 -35 -164 62 -41 -93 -154 -81 91 -50 -12 96 87 -23 201 -98 -16
4117 -16 26 -18 40 -81 -29 -126 -136 -41 166 -182 9 -72 -24 94 -69 -41 -33 -13 -20 -58 2 -1 -62 180 -131 -70 -82 86
4145 86 -28 96 -157 -26 -37 32 -12 50 -56 17 -194 119 68 38 -117 38 36 -74 81 82 -25 -172 -48 163
4169 163 -164 43 -18 -36 24 -2 -2 51 174 175 59 7 -20 -47 -11 -112 -7 -170 -116 -124 25 49 37 60 -97 74
4195 74 117 127 24 -195 78 49 -110 -74 39 136 -65 -127 -107 -19 57 150 -63 46 105 5 -30 -325 -80 -42 -20
4220 -20 -101 -107 92 -26 112 215 1 184 -12 -49 -148 99 12 41 -229 87 -110 17 21 -25 30 -112 168 -12
4244 -12 -52 100 43 -160 37 -26 39 78 38 -169 92 56 -86 -77 7 14 -15 96 7 97 65 -18 116 -82 16 -39 -137
4271 -137 74 -53 -101 54 36 22 -114 4 -163 1 -60 -89 83 34 118 106 -73 3 56 84 -4 -35 51 116 -2
4296 -2 55 142 2 134 -17 -14 -156 92 -86 -15 -139 20 74 181 -95 47 156 -37 49 68 77 7 114 -23
4320 -23 -190 -86 -60 5 -41 -125 0 98 82 103 11 -57 116 -19 34 151 -182 3 -36 5 -21 20 -56 -90 -47 -194
4346 -194 -61 -77 -49 -271 -65 -280 121 -26 -27 70 -65 -104 105 19 -39 -62 9 30 -135 76 26 48 74 15 -62
4371 -62 -17 -136 45 -66 -161 -129 -29 -196 99 -1 -46 -122 -11 -150 -60 -94 -152 -124 17 -36 -36 88 -109 38
4395 38 27 122 -119 -40 91 6 -1 -39 -54 -168 -103 -6 70 1 -21 -66 -26 -95 -123 61 -101 144 -20 -8 99 52 -20
4422 -20 26 59 65 1 -16 -3 42 100 -113 -122 5 -22 -16 -67 -63 -84 -5 138 5 -35 -5 -116 -209 -62 -30 -269 -92 -3
4450 -3 128 25 98 62 -72 -58 -151 29 -58 69 4 2 227 -3 -7 -78 47 -88 102 40 128 -124 -116 -171 70 165
4476 165 67 -7 0 -27 -34 -73 77 19 -56 31 -110 23 -38 -130 28 15 -48 30 -65 48 -18 69 -103 100 104 -100 -101 127
4504 127 55 43 106 -40 -133 -87 52 -60 -137 15 31 -50 131 -157 58 -50 196 -112 65 -72 -56 54 -98
4527 -98 21 56 53 -183 33 119 140 1 -168 -56 88 -117 -26 -58 79 -55 -42 -28 61 -127 109 -69 -29 -130
4551 -130 137 -96 -87 31 98 141 -22 35 -183 -157 184 168 -157 -37 142 14 7 122 -80 -75 1 1 76 -31 48
4576 48 -36 -21 54 66 -15 116 -162 36 38 -27 16 -102 -79 135 32 -28 -27 90 -166 -63 109 -11 10 -67 240
4601 240 -9 4 35 28 -30 27 111 -27 -38 -16 119 4 105 -10 45 127 20 9 68 -3 139 146 -23 -30 103 94 94
4628 94 -123 12 -46 -13 64 -94 -74 -35 29 -196 -178 62 42 -79 -42 71 26 42 -28 -113 -73 73 -14 51 266 42
4654 42 -81 137 -39 56 75 3 -218 -155 44 -23 3 92 -87 -20 -64 -9 30 17 -47 63 -132 -27 -74 -68 -91 -58
4680 -58 51 35 58 -127 47 145 175 -175 -8 26 -73 50 -6 39 49 130 -63 107 39 142 -35 -56 16 24 -65 -30
4706 -30 -195 16 47 -178 191 77 -54 10 -43 -43 -60 10 -199 -102 -146 30 32 26 122 -99 1 -49 20 188 -125 37
4732 37 94 -75 -129 -75 1 1 76 96 94 -55 -47 -55 -132 31 -187 12 -9 -16 44 217 -176 1 -30 -26 210 -14 61 -54
4760 -54 29 -11 94 -38 41 -9 26 32 -15 -55 5 -26 125 72 -89 -43 -21 153 -121 -80 -6 211 41 -18 18 163
4786 163 -76 173 -45 53 -132 32 18 34 -46 -39 9 -134 90 26 15 -28 76 69 -171 158 5 -78 43 -53 -86
4811 -86 -3 50 76 167 -1 -64 83 -83 -12 61 30 -30 -28 -120 -32 67 21 132 153 -59 18 -40 -49 -15 -75 87 -117 7
4839 7 -27 21 -35 53 152 18 -18 100 75 -74 22 -180 0 48 -35 25 2 -63 -136 84 150 -22 -4 -68 -129 21 -58
4866 -58 50 -18 -28 -35 -22 118 57 -53 59 -43 -50 60 -153 -90 57 -22 -12 59 -65 103 227 47 -52 29 -26
4891 -26 -90 -124 -28 44 -68 -56 -180 -37 12 8 -84 -13 13 -126 -5 -89 69 23 -16 -79 111 112 140 -2 55 -108 -1
4918 -1 -96 -19 34 -56 54 162 62 -48 28 -43 8 -33 75 -86 -71 49 -166 -79 -93 225 -61 -2 71 67 55 102
4944 102 -102 -33 98 -46 -20 38 -197 56 -159 -164 -40 -24 136 -185 115 56 -9 113 113 35 66 -57 -124 -79 -158
4969 -158 59 -124 -52 35 86 -53 -18 62 164 136 -9 -139 -95 8 34 24 -149 120 -91 66 177 10 -62
4992 -62 11 -74 -164 -27 57 7 54 52 45 9 66 69 -15 -111 88 -171 16 -137 -48 171 -81 -33 -48 -163 -34 5 -8
5019 -8 -127 16 -78 7 -56 100 -82 -55 -56 -149 41 -34 92 88 -84 79 -14 -13 95 -31 130 -48 17 -69 15 61
5045 61 -89 -54 12 -42 22 -6 31 76 -1 147 -3 153 -236 -55 -116 2 142 112 17 -135 109 109 -39 164 167
5070 167 -24 -44 83 9 239 131 -66 -7 -94 -25 73 129 -158 116 -109 21 117 87 63 36 38 17 151 116 -96
5095 -96 -106 -5 52 43 36 -29 -78 153 -52 -70 104 -67 -9 92 115 64 -35 89 -73 -114 66 44 -128 24 -44 -75
5121 -75 163 75 -47 -1 -46 -24 -61 67 -121 30 29 72 27 45 -5 191 -167 -40 -27 -36 -2 -97 41 -218 97 37
5147 37 -21 -119 -110 8 63 65 66 -129 -69 -89 137 29 94 -76 -8 84 30 92 -8 15 42 28 -113 -44 58 -47 112
5174 112 13 -41 -70 -8 -126 63 144 85 -12 -84 -94 -2 -8 -121 -58 -159 82 41 134 116 81 -80 60 168 -83 -1
5200 -1 -64 -11 -43 -51 -31 128 -37 -56 -80 9 -155 -99 -94 98 -66 -74 -58 -206 -226 82 -41 -140 22 -32 82 39 -1
5227 -1 54 111 34 0 -78 97 -42 115 -16 83 10 -14 -63 -20 -3 -76 -2 -99 -41 10 33 45 -60 -17 -55 219 -36
5254 -36 101 -14 75 113 -17 -30 99 -124 -8 270 -109 -51 -45 -32 3 88 26 -72 -69 36 -112 -134 -24 35 44 -81
5280 -81 -36 -85 -127 76 73 -17 -65 -39 34 35 -69 -2 -144 -26 -57 -57 101 115 244 -91 -64 -94 -8 -52 53 104 -45
5307 -45 -44 2 -130 3 46 25 129 54 19 -81 -103 19 155 -25 -154 -43 6 40 103 130 -127 -7 -115 -79 -12
5332 -12 -97 13 172 -25 -131 -13 6 67 95 -70 -47 162 -14 0 -174 61 29 13 44 -72 149 -58 -79 -114
5356 -114 35 55 -209 -2 232 86 70 -73 -16 -144 -20 -74 -87 79 -82 55 -11 -118 -66 82 49 -36 -7
5379 -7 138 22 48 -65 -12 59 32 -62 79 -71 105 -33 147 -127 94 -57 -53 144 -14 82 46 -120 -103 -150
5403 -150 96 9 22 78 -81 -122 41 -110 -146 -18 -263 -170 57 -56 54 15 -11 78 33 26 -77 -89 -144 14 -27
5428 -27 174 47 4 11 -23 5 87 -103 -14 -216 -19 12 -80 -94 -17 95 -16 -101 -11 7 176 -158 -16 -39 -18 -70
5454 -70 93 112 -41 -31 -130 -9 -19 54 -70 143 -93 44 9 -123 49 32 -106 -49 -15 -95 -77 -91 -27 -13 27
5479 27 9 18 102 -54 118 -10 62 -105 93 -206 77 92 50 -88 3 -57 76 -13 133 -53 139 39 -3 -49
5503 -49 -4 -60 -113 57 -117 43 -42 -29 118 116 -89 -65 -43 49 44 -43 96 -16 -144 22 -68 -15 129 -8 89 93
5529 93 -49 -48 -71 241 43 92 35 -1 0 -62 -103 -75 118 -77 28 18 -4 28 61 143 27 2 113 36 135 -34 -7
5556 -7 -181 -83 106 66 130 -139 -93 -168 -9 62 -45 101 0 98 -9 5 17 43 71 -13 -63 -71 6 62 -26 104 -91
5583 -91 26 -17 8 -87 36 114 -21 -65 -3 17 -18 101 -91 -4 26 108 -85 54 -81 133 -145 -134 133 -71
5607 -71 -134 -2 -38 100 -57 -111 -53 16 -16 89 -69 28 139 87 -9 3 -6 84 -13 165 -93 -92 -71 83 -64 -86
5633 -86 -204 35 -20 -92 -115 -23 75 -142 11 -13 36 66 -82 204 54 137 92 -20 39 -258 -35 52 -74 5 -39
5658 -39 -61 -12 128 66 -111 -81 -169 -96 58 -25 -31 -39 -154 -41 -56 135 -118 27 25 -52 161 61 -87 -80 -124 4
5684 4 131 119 37 105 -28 40 2 52 61 -48 -105 -15 104 -28 151 7 -174 27 -84 -10 -64 -79 56 30 0 -13
5710 -13 93 15 52 5 -22 6 126 -1 -12 65 53 -79 -37 177 60 -93 -11 -93 -81 63 29 148 -119 37 117
5735 117 -51 -7 -49 50 -82 -48 187 -30 34 72 38 -119 -38 8 -47 -108 -73 -27 -32 -3 114 55 83 -246 -24 -46
5761 -46 199 127 -60 -54 -124 -9 -147 -69 0 -10 96 38 -15 -101 58 -87 -79 15 68 148 65 38 -63 56 30 -55 61
5788 61 68 -164 -31 -85 51 -49 -40 13 -109 32 -20 -45 -77 -58 120 -47 -25 -59 -104 -90 -87 55 -98 27 -2 -8 131
5815 131 6 -67 -152 -123 31 -39 93 -31 39 40 -87 -37 39 52 5 -175 80 76 -9 -174 146 175 56 -67 -105
5840 -105 -44 -63 6 -24 -28 36 45 -91 95 141 -8 -75 -62 -42 -98 -20 -39 4 93 178 -7 75 3 -62 66 23 -4 108
5868 108 130 -120 -209 -18 24 -114 -11 -33 -96 71 -24 43 -75 -152 40 35 155 -56 56 -92 -45 64 -211 -118
5892 -118 -125 25 37 -218 100 142 35 254 43 36 -2 146 -60 -51 159 -110 112 -34 45 52 32 53 114 130 -143
5917 -143 78 94 -96 30 2 -15 19 57 -56 64 38 6 -81 141 -126 10 136 71 76 74 64 50 85 81 -40 128
5943 128 98 1 54 -51 -69 -16 -45 37 -168 33 214 88 -1 -37 53 56 109 -22 84 71 70 126 107 -11 155 -29
5969 -29 80 -133 -8 -140 147 34 -31 5 123 -3 78 23 -140 -113 135 -58 84 -82 144 153 58 11 11 -137
5993 -137 70 28 91 42 -67 -67 -53 77 23 71 81 37 163 4 -1 43 52 -62 95 54 -127 -50 7 -198 -10 -71
6019 -71 -143 -92 24 217 -11 68 21 31 -15 47 73 8 103 173 2 -154 222 -119 -55 -25 -17 -202 -135 -23 -48 -63
6045 -63 -122 -58 -113 5 57 141 -38 58 175 -70 3 -55 -29 20 -3 -74 205 -138 -13 162 12 34 8 -69 -97 23
6071 23 75 160 22 -96 129 20 -3 18 -73 119 -56 102 35 -106 40 88 -79 -44 179 -172 67 -74 -50
6094 -50 -106 -13 62 -49 40 76 -144 66 -30 -117 33 -92 -71 -51 129 -56 -9 -1 120 -14 -18 -19 12 -2 -69 20 -100
6121 -100 -48 97 23 70 -51 -65 -266 -157 -33 22 74 -112 14 -28 -27 -36 107 -82 46 -77 94 59 90 -20
6145 -20 114 -172 -51 7 50 -82 122 71 19 -11 -157 163 -198 70 54 7 56 72 -131 -158 -117 -58 -45 60 -243
6170 -243 -61 112 -170 -126 -69 -72 -21 44 153 167 13 132 -63 34 -60 -24 -28 47 47 100 201 101 1 -72 -116 -21
6196 -21 -73 70 -30 6 -86 -4 200 32 31 -119 91 -25 2 -117 18 -7 -75 34 -25 -56 -145 -151 53 80 -27
6221 -27 -36 -54 -26 77 88 -61 -68 154 -22 -31 9 32 -53 -43 85 -11 21 -3 -17 -49 35 -95 -135 3 91 -99 -48 -52
6249 -52 -19 121 -42 -24 -27 44 -73 10 33 -112 -14 58 17 -44 -38 -37 -126 -12 91 -32 115 -12 -136 27 -48 -20
6275 -20 -30 86 -79 53 -47 54 -84 31 13 -72 -57 -28 13 -155 -8 -107 -83 89 -33 9 -25 176 141 -120
6299 -120 112 -4 68 125 37 -14 18 -21 27 -91 -34 -194 -4 58 67 -137 62 39 10 -35 -137 106 8 57 -24 58
6325 58 148 128 46 -221 -112 83 45 85 37 82 47 33 39 40 -9 -152 -5 -2 -8 6 -59 9 13 14 -89 -25 58 6 -24 58
6355 58 159 184 -90 -77 45 37 -152 94 113 -69 22 24 -96 -48 -227 -65 -9 72 -182 -139 76 32 -116 -25 302
6380 302 -198 188 -224 -196 57 63 -52 -8 -9 3 42 173 -112 -83 -81 -32 26 140 -59 4 112 27 -76 -56 -33 -83
6406 -83 -83 19 -3 -7 -74 -23 77 -2 -199 17 -19 -68 134 5 -45 113 -67 69 37 9 -90 -13 91 61 128 -55
6432 -55 39 4 26 85 -33 -84 28 16 -58 92 -5 135 8 38 -58 -54 122 116 57 -18 119 -137 -14 139 7 -53
6458 -53 110 -107 -238 17 35 -25 77 -47 59 70 179 36 -173 90 -50 -10 -98 96 41 -129 52 -71
6480 -71 124 56 -35 73 122 7 -42 64 -64 -9 -3 82 -4 -13 -28 91 129 -73 -76 -99 0 16 134 -67 14 -73 35
6507 35 -20 15 220 -41 67 -27 -148 104 -90 -12 78 -7 76 -36 178 96 -49 93 44 12 82 -44 8 81 16
6532 16 -46 -12 -79 118 119 -11 127 -35 95 -33 -67 -95 -39 -184 -48 -125 106 65 122 38 76 45 -35 -187 -26
6557 -26 -42 -33 -132 85 -179 97 -5 53 -95 -10 38 -106 20 153 -167 -37 145 -54 -55 -25 31 187 -76 -102
6581 -102 -18 10 -163 93 70 128 -63 -46 56 -144 -17 -75 -94 8 -11 117 25 -45 104 -65 -138 11 69 58
6605 58 50 -114 -172 140 -46 -53 -1 -49 109 75 -29 -73 42 127 -83 14 79 -78 115 -73 51 245 171 53 33
6630 33 55 -41 -52 11 -54 -4 17 28 -15 13 6 -58 -148 4 -33 -50 58 79 -57 198 96 92 139 76 85 13 13 131 2
6659 2 44 -42 23 12 -121 6 -64 104 195 -136 -43 14 23 -7 -57 -174 54 -59 48 140 -22 -114 -107 23 29 59 47
6686 47 100 -113 -166 1 -28 92 9 183 95 57 -14 -157 -63 71 44 -111 -68 199 110 -140 96 -127 -55 67
6710 67 -72 -43 11 64 -117 7 -94 16 30 96 9 -81 60 -91 138 -41 -42 -10 -40 13 -82 78 72 160 -121 134
6736 134 -188 24 -71 -153 -59 -20 -95 144 -19 19 51 -46 -17 140 -113 -57 183 -23 73 44 7 -70 -46 29 -17 35
6762 35 -3 22 -21 -113 -137 49 -21 85 118 -6 21 -8 -52 -54 45 -15 6 -114 30 -8 -20 -196 38 -14 1 55 70
6789 70 103 125 191 -186 -81 -108 2 56 -164 2 102 -18 -56 -91 -113 1 -145 -53 -49 -105 11 65 -97 -18 -8
6814 -8 63 31 -66 -24 39 -27 51 106 52 112 24 -42 59 -34 -99 -1 123 -107 205 39 -86 219 -17 -40 198 173
6840 173 -52 -131 -75 -89 -1 -141 -6 82 -53 99 -93 144 -38 -65 82 -98 -50 80 -61 7 112 0 84
6863 84 17 -164 -40 -29 -52 115 -16 52 -1 134 37 66 -68 177 156 -27 -50 -135 -57 49 -41 -100 112 94 91 -48
6889 -48 -261 -6 2 27 -41 -150 -124 -32 116 -148 -9 -33 29 1 -82 -151 122 184 23 35 -113 9 -23 2 -75 20
6915 20 82 -13 -152 -68 52 -12 5 -28 62 -174 -27 67 -47 -36 -115 72 -209 -130 -72 150 -47 60 -80 31
6939 31 -11 -61 70 -5 -75 -60 56 35 47 -58 -195 54 -208 -172 -144 -55 -117 91 -26 -73 140 -85 -43 -11 -108
6964 -108 33 35 -124 -67 -57 -50 -35 -11 -94 -22 -43 94 -59 9 86 60 -11 1 -20 161 -79 -31 119 -63 -74 160
6990 160 -110 -141 29 8 45 35 189 -17 76 -173 39 -26 -136 55 -48 56 35 47 91 -77 -28 -82 -97 -102 -53
7015 -53 90 129 -50 -44 -102 -80 -224 57 -36 97 -62 -43 140 -6 -58 -85 -12 -93 -15 -143 -68 -55 119 -109 -59
7040 -59 123 -24 -13 -36 -186 200 -231 23 46 -4 67 -33 -175 -116 -229 46 15 70 -12 -82 -5 143 77 -100
7064 -100 -17 191 -9 14 -76 45 -13 79 -132 -59 -180 116 -72 35 -58 51 162 112 -100 -15 63 118 -107 12
7088 12 58 98 -133 -41 -10 22 134 -80 -72 -75 63 101 -44 -12 -11 -25 -54 -2 -178 -65 -96 3 117 59 25 -52 57
7115 57 -9 -37 56 -141 -9 75 127 12 72 -15 -32 -146 -150 -66 -71 -40 -38 -93 69 -91 83 1 37 -100 -28 142 -25
7142 -25 -168 -16 3 -10 -38 -31 -29 60 38 -247 -102 -227 -83 -82 81 52 -81 -46 131 68 -63 -99 12 -15 -30 -28 72
7169 72 12 116 19 -31 125 -41 31 67 51 -197 34 145 4 -66 -50 45 129 63 55 33 -76 -123 -29 23 29 -125 17
7196 17 -16 19 104 35 13 -36 -4 70 -215 14 27 -54 -66 -152 59 -100 154 38 67 -7 -17 -108 14 33 -7 -34 -103
7223 -103 -69 -6 -29 -28 -77 -95 36 -13 54 -46 -12 -66 -96 -98 76 71 -13 30 -7 -78 38 -123 47 -90 110 194 -12
7250 -12 63 0 -71 -125 -27 -36 -33 24 250 -121 52 142 122 51 -12 71 -224 87 -80 -2 83 20 14 -133 85 93 -8 6
7278 6 60 70 -210 39 189 110 21 141 1 -136 107 -79 -106 -153 -58 -91 110 41 -59 -79 137 -22 -57 34 41
7303 41 -29 75 -4 -131 50 22 5 94 78 42 -2 7 -17 17 5 -208 81 -20 67 20 -20 -73 101 -64 -29 -92 98
7330 98 15 -34 -66 -139 -69 29 -62 -10 -106 39 -46 -47 -39 6 28 -84 -165 -32 20 -32 -56 101 -151 -81 -36 -85 155 -168
7358 -168 133 7 24 -11 55 -17 -60 -79 26 -192 99 -85 95 -117 54 152 50 -95 22 -3 10 -68 96
7381 96 3 88 -61 -70 -49 87 53 -166 19 117 -219 56 26 44 -45 104 46 -54 -1 -62 -98 29 5 -46 -84 -12
7407 -12 167 11 134 94 -129 28 161 -99 59 88 -70 199 -40 -106 3 16 87 33 -91 -148 67 -169 24
7430 24 163 -100 117 5 71 -38 92 190 7 37 -141 -137 -34 -83 163 102 -131 19 -38 22 -158 -181 -21 -107
7454 -107 -95 15 7 23 -21 -90 -97 -103 42 13 25 81 -93 8 -91 32 20 -48 27 108 -47 67 -149 68 -19 -38 93
7481 93 91 112 63 58 98 -49 -34 -21 -149 159 -14 16 36 19 11 24 174 47 -36 -12 12 132 -7 13 -124 -44 67
7508 67 -20 81 185 126 -49 130 108 -11 -107 4 -48 -84 195 -132 66 28 10 -1 -272 -37 49 17 -66 26 -189
7533 -189 158 34 -91 34 101 -54 -49 28 65 -173 11 -36 39 130 190 88 100 25 -29 46 31 -41 139 -21 66
7558 66 58 -91 58 -23 59 29 -9 -99 229 -37 -12 -86 -11 -7 -92 27 -75 -25 88 159 -4 39 -72 67 22 -197
7584 -197 -7 21 71 -67 30 -8 92 56 -51 -55 -56 -20 -29 -8 51 -125 -24 -28 -42 18 88 128 -63 -63 11 23 32 -85 99
7613 99 -47 -30 -153 -1 103 27 33 56 33 8 -131 55 -39 38 -66 125 -36 -63 -111 19 -152 5 23 133
7637 133 176 -82 -59 -65 91 -20 -47 43 -48 -51 -179 135 -30 82 56 47 180 59 160 -53 -33 -65 -17 -74 44
7662 44 54 87 21 16 -52 98 71 -146 -2 -93 3 90 -56 -138 7 117 3 -51 -55 4 13 10 6 -55 13 130 158 43
7690 43 -66 -82 -75 354 144 -53 -12 -80 20 96 -118 33 -36 -41 -5 -97 22 120 -14 -14 -125 -47 -60 115 -1 61
7716 61 30 29 -14 107 103 -112 77 21 -53 7 165 -37 -2 -229 -64 139 -114 -92 -127 -101 -8 -88 143 70 69 -67
7742 -67 -145 51 113 41 51 -6 -22 -12 -69 -189 -125 11 -103 112 -65 137 42 5 14 68 -125 -21 -124 -67 -33 -53
7768 -53 109 -33 57 63 65 35 31 11 46 -156 -59 153 -109 63 48 117 -70 40 -23 -137 33 34 -48 -132 -17 94
7794 94 105 82 -43 -50 -16 -1 32 33 -51 107 132 -19 -121 24 -7 42 75 -41 -81 162 -86 -123 -26 -34 -13 19 133
7821 133 38 -4 42 -129 60 43 -67 -5 25 -26 26 43 10 194 -180 5 -23 39 113 182 3 -69 81 -77 91
7846 91 -22 120 135 1 -55 30 119 31 15 -11 -31 -148 -114 63 -48 -36 -43 -46 -232 116 2 -111 -149 -27 -14 -197
7872 -197 126 -3 106 -6 122 5 -125 35 -92 81 -95 95 54 96 -162 37 80 -31 83 82 31 49
7894 49 -14 -42 -129 52 104 22 3 99 -45 17 -87 15 8 50 4 -170 54 -136 16 28 -2 -58 -7 -118 75 -79
7920 -79 78 80 36 37 214 114 -63 6 3 135 -42 -141 -84 189 49 88 87 -75 72 14 93 62 65 -101 23 39 -141
7947 -141 203 -3 -142 -39 54 -147 -168 -7 -198 49 -15 101 85 -106 -160 31 62 -49 0 -80 82 98 16
7970 16 -43 103 4 -53 -4 151 -20 -61 -71 -25 59 -41 33 -111 -139 43 48 -20 -49 30 135 90 15 -36 -86 179 129
7997 129 4 122 49 -2 -46 109 -105 -245 -213 -14 -106 -4 48 -35 96 63 -3 -128 119 101 43 39 23 117 26
8022 26 -17 -39 120 -11 36 95 -35 70 47 103 169 105 -22 13 -5 -82 38 104 34 -96 42 -121 45 -9 -41
8047 -41 -60 -11 -69 -107 269 -5 -97 -75 -92 -21 -89 -3 -137 -82 71 5 -167 -105 28 163 -41 16 50 7 -34 -63
8073 -63 1 -111 78 -52 159 -103 86 -25 5 82 -70 -19 -118 19 59 -114 59 1 230 80 -163 -31 -3
8096 -3 -78 27 87 5 -3 -49 -170 52 32 36 -27 -78 111 25 -57 -5 77 -39 59 39 137 127 -163 44 70 -93 54
8123 54 11 56 -145 -39 -4 -55 -8 122 -88 31 -207 -61 -56 -11 -37 82 24 -43 -42 -27 -124 -74 22 -64 -113 -41 -41 -28
8151 -28 -2 -19 3 -49 124 -32 137 185 -76 36 54 -19 -41 -18 52 84 -56 132 29 -1 134 92 -4 194 86
8176 86 8 -129 296 -34 129 -123 -66 57 -128 -12 -52 -98 -83 -66 -3
8191c
##END NTUPLES=NMR FID
##END=
