##TITLE=1H_Pr 037
 CDCl3, 8 sc, 
 9.07.2021
##JCAMPDX= 6.0         $$ Bruker NMR JCAMP-DX V2.0
##DATA TYPE= NMR FID
##DATA CLASS= NTUPLES
##ORIGIN= UXNMR, Bruker Analytische Messtechnik GmbH
##OWNER= root
$$ XWIN-NMR		Version 3.5
$$ Fri Jul  9 12:36:34 2021 Russian Standard Time (UT+4h)  she@DPX200
##.OBSERVE FREQUENCY= 200.131506
##.OBSERVE NUCLEUS= ^1H
##.DELAY= (6, 6)
##.ACQUISITION MODE= SIMULTANEOUS
##.ACQUISITION SCHEME= undefined
##.AVERAGES= 8
##.DIGITISER RES= 18
##SPECTROMETER/DATA SYSTEM= spect
##.PULSE SEQUENCE= zg30
##.SOLVENT NAME= CDCl3
##.SHIFT REFERENCE= (INTERNAL, CDCl3, 0, 15.7039)
##AUDIT TRAIL= $$ (NUMBER, WHEN, WHO, WHERE, WHAT)
$$ ##TITLE= Audit trail, XWIN-NMR		Version 3.5
$$ ##JCAMPDX= 5.01
$$ ##ORIGIN= Bruker BioSpin GmbH
$$ ##OWNER= she
$$ F:/spectra/data/she/nmr/H-F/1/audita.txt
$$ ##AUDIT TRAIL=  $$ (NUMBER, WHEN, WHO, WHERE, WHAT)
(   1,<2021-07-09 12:35:26.60 +0400>,<she>,<DPX200>,
      <created by zg, POWCHK disabled, PULCHK disabled
       configuration hash MD5:
       00 E9 B6 7A A2 85 ED C7 34 08 36 98 17 FE 4E 26
       data hash MD5: 16K
       83 9A B7 72 93 60 CE E9 90 3B FF 5A 53 F9 FE 4B>)
$$ ##END=
$$ 
$$ hash MD5
$$ 93 17 F9 ED C1 E0 C5 C5 D6 7A 70 B4 14 BE 1A 1C
##$RELAX= 
##$RELAX= 
##$RELAX= 
##$RELAX= 
##$RELAX= 
##$RELAX= 
$$ Bruker specific parameters
$$ --------------------------
##$DU= <F:/spectra>
##$EXPNO= 1
##$NAME= <H-F>
##$PROCNO= 1
##$TYPE= <nmr>
##$USER= <she>
##$AMP= (0..31)
100 100 100 100 100 100 100 100 100 100 100 100 100 100 100 100 100 100 
100 100 100 100 100 100 100 100 100 100 100 100 100 100 
##$AQSEQ= 0
##$AQ_mod= 1
##$AUNM= <au_zg>
##$AUTOPOS= <>
##$BF1= 200.13
##$BF2= 200.13
##$BF3= 200.13
##$BF4= 200.13
##$BF5= 200.13
##$BF6= 200.13
##$BF7= 200.13
##$BF8= 200.13
##$BYTORDA= 1
##$CFDGTYP= 0
##$CFRGTYP= 5
##$CHEMSTR= <none>
##$CNST= (0..31)
1 1 145 1 1 1 1 1 1 1 1 1 1 1 1 1 1 1 1 1 1 1 1 1 1 1 1 1 1 1 1 1 
##$CPDPRG= <>
##$CPDPRG1= <>
##$CPDPRG2= <>
##$CPDPRG3= <>
##$CPDPRG4= <mlev>
##$CPDPRG5= <mlev>
##$CPDPRG6= <mlev>
##$CPDPRG7= <mlev>
##$CPDPRG8= <mlev>
##$CPDPRGB= <>
##$CPDPRGT= <>
##$D= (0..31)
0 1.2 0 0 0 0 0 0 0 0.06 0 0.03 0 0 0 0 0.0002 0 0 0 0 0 0 0 0 0 0 0 0 
0 0 0 
##$DATE= 1625819725
##$DBL= (0..7)
120 120 120 120 120 120 120 120 
##$DBP= (0..7)
150 150 150 150 150 150 150 150 
##$DBP07= 0
##$DBPNAM0= <>
##$DBPNAM1= <>
##$DBPNAM2= <>
##$DBPNAM3= <>
##$DBPNAM4= <>
##$DBPNAM5= <>
##$DBPNAM6= <>
##$DBPNAM7= <>
##$DBPOAL= (0..7)
0.5 0.5 0.5 0.5 0.5 0.5 0.5 0.5 
##$DBPOFFS= (0..7)
0 0 0 0 0 0 0 0 
##$DE= 6
##$DECBNUC= <off>
##$DECIM= 32
##$DECNUC= <off>
##$DECSTAT= 4
##$DIGMOD= 1
##$DIGTYP= 9
##$DL= (0..7)
0 120 120 120 120 120 120 120 
##$DP= (0..7)
150 150 150 150 150 150 150 150 
##$DP07= 0
##$DPNAME0= <>
##$DPNAME1= <>
##$DPNAME2= <>
##$DPNAME3= <>
##$DPNAME4= <>
##$DPNAME5= <>
##$DPNAME6= <>
##$DPNAME7= <>
##$DPOAL= (0..7)
0.5 0.5 0.5 0.5 0.5 0.5 0.5 0.5 
##$DPOFFS= (0..7)
0 0 0 0 0 0 0 0 
##$DQDMODE= 0
##$DR= 18
##$DS= 0
##$DSLIST= <SSSSSSSSSSSSSSS>
$$ [...]
##$SUBNAM2= <"">
##$SUBNAM3= <"">
##$SUBNAM4= <"">
##$SUBNAM5= <"">
##$SUBNAM6= <"">
##$SUBNAM7= <"">
##$SUBNAM8= <"">
##$SUBNAM9= <"">
##$SW= 20.0188882624521
##$SWIBOX= (0..15)
0 0 2 0 0 0 0 0 0 0 0 0 0 0 0 0 
##$SW_h= 4006.41025641026
##$TD= 16384
##$TD0= 1
##$TE= 0
##$TE2= 300
##$TE3= 300
##$TEG= 300
##$TL= (0..7)
0 120 120 120 120 120 120 120 
##$TP= (0..7)
150 150 150 150 150 150 150 150 
##$TP07= 0
##$TPNAME0= <>
##$TPNAME1= <>
##$TPNAME2= <>
##$TPNAME3= <>
##$TPNAME4= <>
##$TPNAME5= <>
##$TPNAME6= <>
##$TPNAME7= <>
##$TPOAL= (0..7)
0.5 0.5 0.5 0.5 0.5 0.5 0.5 0.5 
##$TPOFFS= (0..7)
0 0 0 0 0 0 0 0 
##$TUNHIN= 0
##$TUNHOUT= 0
##$TUNXOUT= 0
##$USERA1= <user>
##$USERA2= <user>
##$USERA3= <user>
##$USERA4= <user>
##$USERA5= <user>
##$V9= 5
##$VALIST= <valist>
##$VCLIST= <CCCCCCCCCCCCCCC>
##$VD= 0
##$VDLIST= <DDDDDDDDDDDDDDD>
##$VPLIST= <PPPPPPPPPPPPPPP>
##$VTLIST= <TTTTTTTTTTTTTTT>
##$WBST= 1024
##$WBSW= 4
##$XGAIN= (0..3)
0 0 0 0 
##$XL= 0
##$YL= 0
##$YMAX_a= 138187
##$YMIN_a= -175778
##$ZGOPTNS= <>
##$ZL1= 120
##$ZL2= 120
##$ZL3= 120
##$ZL4= 120
##$ABSF1= 10
##$ABSF2= 0
##$ABSG= 5
##$ABSL= 3
##$ALPHA= 0
##$AQORDER= 0
##$ASSFAC= 0
##$ASSFACI= 0
##$ASSFACX= 0
##$ASSWID= 0
##$AUNMP= <proc_1d>
##$AZFE= 0.1
##$AZFW= 0.1
##$BCFW= 1
##$BC_mod= 2
##$BYTORDP= 1
##$COROFFS= 0
##$CY= 11.3945322036743
##$DATMOD= 1
##$DC= 2
##$DFILT= <>
##$DTYPP= 0
##$F1P= 17.5019972093344
##$F2P= -2.517084195857
##$FCOR= 0.5
##$FTSIZE= 0
##$FT_mod= 4
##$GAMMA= 1
##$GB= 0.15
##$INTBC= 1
##$INTSCL= 1
##$ISEN= 128
##$LB= 0.24
##$LEV0= 0
##$LPBIN= 0
##$MAXI= 10000
##$MC2= 0
##$MEAN= 0
##$ME_mod= 0
##$MI= 1.114404
##$NCOEF= 0
##$NC_proc= 0
##$NLEV= 6
##$NOISF1= 3.799351
##$NOISF2= 2.8
##$NSP= 1
##$NTH_PI= 0
##$NZP= 0
##$OFFSET= 15.70392
##$PC= 1
##$PHC0= -12277.46
##$PHC1= 13.20101
##$PH_mod= 1
##$PKNL= yes
##$PPARMOD= 0
##$PSCAL= 0
##$PSIGN= 0
##$REVERSE= no
##$SF= 200.130013532006
##$SI= 16384
##$SIGF1= 3
##$SIGF2= 2
##$SINO= 400
##$SIOLD= 16384
##$SREGLST= <1H.CDCl3>
##$SSB= 0
##$STSI= 0
##$STSR= 0
##$SW_p= 3612.71676300578
##$SYMM= 0
##$S_DEV= 0
##$TDeff= 0
##$TDoff= 0
##$TI= <>
##$TILT= no
##$TM1= 0
##$TM2= 0
##$TOPLEV= 0
##$USERP1= <user>
##$USERP2= <user>
##$USERP3= <user>
##$USERP4= <user>
##$USERP5= <user>
##$WDW= 1
##$XDIM= 8192
##$YMAX_p= 0
##$YMIN_p= 0
$$ End of Bruker specific parameters
$$ ---------------------------------
##NTUPLES= NMR FID
##VAR_NAME=  TIME,          FID/REAL,        FID/IMAG
##SYMBOL=    X,             R,               I
##VAR_TYPE=  INDEPENDENT,   DEPENDENT,       DEPENDENT
##VAR_FORM=  AFFN,          ASDF,            ASDF
##VAR_DIM=   8192,          8192,            8192
##UNITS=     SECONDS,       ARBITRARY UNITS, ARBITRARY UNITS
##FACTOR=    0.0002496,     1,               1
##FIRST=     0,             0,               0
##LAST=      2.0444736,     0,               0
##MIN=       0,             -175778,         0
##MAX=       2.0444736,     138187,          0
$$ Real data points
##PAGE= N=1
##DATA TABLE= (X++(R..R)), XYDATA
$$ [...]
1261G10k785K303J014j953q0J165m7j231P34Q41j682M59J450j582n10J557J60
$$ 710 -2075 228 1242 -711 -791 374 327 -904 -170 671 -1011 -552 898 -684 -1194 363 523
1278E23j364k78J900n52k044J597J457k237j09J778j75j567K83J684j098j006
$$ 523 -841 -1119 781 229 -1815 -218 1239 -998 -1107 671 496 -1071 -788 896 -202 -1208
1294a208J830l72j181R23M53r62j21J011O9j507R21J314j985K84J588p81j049
$$ -1208 622 250 -931 -8 445 -517 -638 373 442 -1065 -144 1170 -815 -531 1057 276 -773
1311g73O81J357j337j159K238J66k498J233J480j163j114J057J095j553k27J587
$$ -773 -92 1265 -72 -1231 1007 1173 -1325 -92 1388 225 -889 168 1263 -290 -517 1070
1327A070p76r09J377k55r62O43O14o26j072J569N75k352N90K145j501j320J255
$$ 1070 294 -615 762 507 -455 188 802 176 -896 673 1248 -1104 -514 1631 130 -1190 65
1344F5J155j413j147K276o7k260J036J303j181m95Q75M53j286K54J128j111l81
$$ 65 1220 -193 -1340 936 869 -1391 -355 948 -233 -728 147 600 -686 -432 696 -415 -796
1361g96J358o55o47Q23L25q46k76J392j88j813J098J459j843m24J361N01j531
$$ -796 562 -93 -740 83 408 -438 -714 678 490 -1323 -225 1234 -609 -1033 328 829 -702
1378g02k60J673k81j670J231O86j087O7M34K1m13J96M65p91K21J168j385j38J268
$$ -702 -962 711 430 -1240 -9 677 -410 -343 91 112 -301 -105 360 -431 -210 958 -427 -565 703
1397G03k28r81K21J282n64j651J467J090j906J13J414k07j392L75J339o41j249
$$ 703 475 -506 -285 997 433 -1218 249 1339 -567 -454 960 753 -639 -264 1075 434 -815
1414h15J409K56j006K87J45j36k4P4J26p97O76P23j492R7J482p25j172P77J096
$$ -815 594 850 -156 131 276 140 116 190 316 -481 195 918 -574 -477 1005 280 -892 -115 981
1433I81p22j378J401O05j627K68R56k35q30Q9P95m47n66J030k15q11P00p8m98
$$ 981 259 -1119 282 887 -740 -472 484 249 -581 -492 303 -144 -710 320 105 -706 -6 -84 -582
1452e82K05N53j97p70N91P23j455K89J071p07l87M49O14n21r87J218L64j274M67
$$ -582 -377 176 -21 -791 -200 523 -932 -643 428 -279 -666 -217 397 -124 -1111 107 471 -803 -336
1471c36O24l63l24J37L60j23m33P34l37l69Q28o54j84O83L6m37j27O85J35j112
$$ -336 288 -75 -399 -262 98 -25 -458 276 -61 -430 398 -256 -440 243 279 -158 -285 400 535 -577
1491e77M94J196j148k26O78K20o50m55J118q9q65N04M17n23O5N6P7k76O0M37m84
$$ -577 -83 1113 -35 -261 417 637 -13 -468 650 561 -304 200 617 94 159 215 292 16 76 513 29
1512B9K8O13l82m86O27j31j97j72L19K07p94L07O26o71l49M46J40o0m76M62J72
$$ 29 57 670 288 -198 429 298 101 -71 248 455 -339 -32 594 -77 -426 20 160 100 -376 86 258
1533B58o04J92L19l85L63n08J39M76m55M3k16L52K64q24J54R76o59m89L94M81
$$ 258 -346 -154 165 -220 143 -365 -226 250 -205 -162 -378 -26 238 -586 -432 544 -115 -604 -210 271
1553B71l05o91L79Q25r09k4N47k55R4k86K79K38o00N96j5m23K08M1J04j41j0K86
$$ 271 -34 -725 -346 479 -430 -454 93 -162 -68 -354 -75 163 -437 159 144 -279 -71 -30 74 -67 -77 209
1575B09k75r9M23l26j50N62k45j06J4J73L60o46j33P61l07l58Q7M60R3r07J89
$$ 209 -66 -165 258 -68 -218 344 99 -7 7 180 540 -106 -239 522 215 -143 -56 404 497 -410 -221
1596b21J006o38n29M54L15J57r39L67O11n78j09K08J25n2l29J83J93m16J71M23
$$ -221 785 147 -382 72 387 544 -395 -28 583 5 -104 104 229 177 -152 31 224 -192 -21 402
1616D02n45O0O5J77m9n38N16J58m81Q9J74j30j20OK00M6m80N75k59l63M85j84
$$ 402 -143 -83 -18 159 110 -428 88 246 -235 -146 28 -102 -222 -216 -16 30 -450 125 -134 -497 -12 -196
1638a96J49l37J61M93n14l59Q75j67l56k02N50N20j242J37J259o37p49N26L85
$$ -196 -47 -384 -223 270 -244 -603 272 105 -251 -453 97 617 -625 -488 771 134 -615 -89 296
1657B96j00p68N67O97r61j01Q34k12l72r2O70j43o76O62J03m83J75K12j31k2k11
$$ 296 196 -572 -5 692 -269 -370 464 252 -120 -212 458 315 -361 301 404 -79 96 308 177 155 -56
1678e6M48j2o31N57j59l68L93J38j17k21M6N91n39m10O91jk98l09L71O03q88k17
$$ -56 392 380 -251 306 147 -221 172 310 193 -28 18 609 70 -340 351 350 52 -257 114 717 -171 -388
1700c88P67p0l25P8J01K13o18r6P98m49m36L99J71k16l59M07K56o85J42M60k83
$$ -388 379 309 -16 62 163 376 -242 -338 460 11 -425 -26 145 -71 -430 -23 233 -452 -310 150 -133
1721a33k32J58K20o1n25N18K00o84L04K83j87k00J41J88n13N7Q01m93m51N76J69
$$ -133 -365 -207 13 -48 -573 -55 145 -539 -235 48 -139 -339 -198 -10 -523 -466 335 -158 -609 -33 136
1742A36n14j2L61L05o77m3P91j21n42J04L50j6m06J02N66l96j60K62M5k4j80J45
$$ 136 -378 -390 -29 276 -401 -444 347 226 -316 -212 138 122 -284 -182 384 -12 -172 90 135 111 -69 76
1764G6L92n39J76J00k53K76j93j5L18l80M2M17m01J85j62m1K48k03K05Ql19K83
$$ 76 468 -71 105 205 -48 228 35 20 338 -42 0 417 16 201 39 -2 246 43 248 256 -63 220
1786B20p2j38J91k00K75k63r3M83k24n87M48P3j02k16%N68m31k29N60k37k82J38
$$ 220 148 10 201 1 276 13 -80 403 179 -408 40 113 11 -205 -205 363 -68 -297 263 26 -256 -118
1808a18K69j6n54J53N95n01j73M03j94j37J27O1Q1l8n4J38k65J87k4n6K3k8J94
$$ -118 151 135 -419 -266 329 -172 -345 58 -136 -273 -146 -85 -4 -42 -96 42 -223 -36 -60 -116 -93 -121 73
1831G3l12L5L31k17k10K70N9r4Q6j37N1M7n3K70j97K8J14l11K19P5j91M8R1M3
$$ 73 -239 -204 127 -90 -300 -30 29 -65 21 -116 -65 -18 -71 199 2 30 144 -167 52 127 -64 -16 75 118
1855A18J9k04M03j42m18M84q8j39q0j1L57l96r1N57l07l31M10%r3j31J66J47l03
$$ 118 137 -67 336 194 -224 260 172 33 -47 -58 299 -97 -188 369 62 -269 141 141 48 -83 83 230 -73
1878g3J45J98k91L3L5l2r5l1L09k01l20M66Q0m79K19R4j96k0r2N29m50k27N13
$$ -73 72 270 -21 12 47 15 -80 -111 198 -3 -323 143 223 -256 -37 57 -139 -159 -251 278 -172 -399 114
1901A14j26k03R3K2N8j17j26K82l6j30O8j35J97j23j31L24o4L2r6j07L71l51k03
$$ 114 -12 -215 -122 -100 -42 -159 -285 -3 -39 -169 -101 -236 -39 -162 -293 31 -33 -1 -97 -204 167 -184 -387
1924c87N06n1n7Lj02L25l24j2J90j35N0J23l2j06K50j63R1j33J59rl59L77R4l71
$$ -387 119 68 11 14 -88 237 -87 -99 91 -44 6 129 97 -9 241 78 169 36 195 186 -173 204 298 -73
1948g3K18J10L2k40p7L59j33l52L97m9j62LK9J90J8m03M02j83j06J01j71K98j6
$$ -73 145 255 287 47 -30 329 196 -156 241 192 30 33 62 252 270 -133 269 86 -20 81 -90 208 192
1971A92l92L86q6K9o8j05K74j04l61J92L8n9p7l3L23k12j71K85m2r7L6k15K34
$$ 192 -200 186 100 129 61 -44 230 126 -235 -43 -5 -64 -141 -174 149 -63 -234 51 9 -88 -52 -267 -33
1994c3n1k03M63l61p5K90k39J26j5j33K09j78N2J94l87K55J42k27K8J51J5n6k05
$$ -33 -84 -287 176 -185 -260 30 -209 -83 -98 -231 -22 -200 -148 46 -341 -86 56 -171 -143 8 23 -33 -238
2017b38J41K51m43J73J50q4Rj32M02j28m41M68K4p9q1k08M69j98j34J60J05j12
$$ -238 -97 154 -289 -116 34 -50 -41 -173 229 101 -340 128 152 73 -8 -216 253 55 -79 81 186 74
2039G4MKO8K0l89M25j30n0R8m0J34r0k77M63k31j26L61k90J1M4P7j28m3j4K12
$$ 74 78 80 148 168 -221 204 74 24 122 82 216 126 -151 312 81 -45 316 26 37 81 158 30 -13 -27 185
2064A85l93L20J07k06j3J2J78Om01K20K15l79N5J65J10k22k63L77%m01J86L12
$$ 185 -208 112 219 13 0 12 190 196 -205 15 230 -149 -94 71 181 -41 -304 73 73 -328 -142 170
2086A70k59j11MJ61J27m50L94Mj02p0N3N6kj31L02k63KJ47p0j1J00j05L2rl7K09
$$ 170 -89 -200 -196 -35 92 -358 36 40 -62 -132 -79 -23 -25 -156 146 -117 -115 32 -38 -49 51 -54 -22 -31 -68 141
2112A41j21p1J94j28J8O3n3K09l52J59L85l19p9j0K13l2l54L19J77l40K4J19m4
$$ 141 20 -51 143 15 33 96 43 252 -100 59 444 125 46 36 249 217 -137 182 359 19 43 162 118
2135A18m2k63K49K97o59L09L11j80j25r1L80j01k96J41Lj70J47qJ74k43l3J45
$$ 118 76 -187 62 359 -300 9 320 140 15 -76 304 203 -93 48 51 -119 28 20 194 -49 -82 63
2157F3m6q9P4O0j09j10J10P9j15q3L31l15O9J83k07K6p9J07O9q4R1lj39k2J04
$$ 63 17 -72 2 62 -47 -157 -47 32 -83 -166 165 -150 -81 102 -105 -79 -158 -51 18 -66 25 22 -117 -139 -35
2182c5L5o6k42L47J19m25P7J65k0K0j80K35R3m86K31J96p2l5k49M28n8k65J54
$$ -35 0 -66 -308 39 158 -267 -190 -25 -45 -25 -205 30 123 -363 -132 64 -8 -43 -292 136 78 -187 -33
2205c3J45j56M7Q1k7j03N0K72k54jJ88j88o2K06p4O9o9j31L36k19j34K19j7j53
$$ -33 112 -44 3 84 57 -46 4 276 22 21 209 21 -41 165 91 160 91 -40 296 77 -57 162 145 -8
2229hpJ31J11l50K62J76l82o2K67K6k04j92K56L4k57K00J48j56J8p4J44J93m64
$$ -8 -15 116 227 -123 139 315 -67 -129 138 164 -40 -232 24 58 -199 1 149 -7 11 -63 81 274 -190
2252a90J41J77j43J58k34lJ80j63q9K16p7mj77R7Q6p5L5l0j5J8n6K22m2j29J43
$$ -190 -49 128 -15 143 -91 -94 86 -77 -166 50 -27 -31 -208 -111 -25 -100 -65 -95 -110 -92 -148 74 32 -97 46
2277D6k36O1J62j31q1N6J44j70J0J67J58l66J5M75l26j58L12j58l6j18K42J35
$$ 46 -190 -129 33 -98 -179 -123 21 -149 -139 28 186 -180 -165 310 -16 -174 138 -20 -56 -174 68 203
2299B03l66J79J38k20J4j4J41J1j11N3J73k35K87j54j04J43m0j31J90j15K5k43
$$ 203 -163 16 154 -66 -52 -66 75 86 -25 28 201 -34 253 99 -5 138 98 -33 157 42 67 -176
2321a76J55K37l18J7K17q3j31l6M7K72p9j4Pk69J96j03qN9M1k9k74Q1L55l55j33
$$ -176 -21 216 -102 -85 132 49 -82 -118 -71 201 122 108 115 -154 42 -61 -69 -10 31 2 -272 -191 164 -191 -324
2346c24N03j85k14N5K51p0l29K53K82l45j53L09l4j14o4Q1Q9j73L8L64m21J14
$$ -324 179 -6 -220 -165 86 16 -313 -60 222 -123 -276 33 -1 -115 -179 -98 -9 -182 -144 220 -201 -87
2368h7J3K8o6oJ66j26j05L48l32k9O5K56l36J62l5J08k15K82lj82J06J92k01L1
$$ -87 -74 -46 -112 -118 48 -78 -183 165 -167 -196 -131 125 -211 -49 -84 24 -191 91 88 -94 12 204 3 34
2392C4N9l9N1r0J35p1j36K77j52o3K02j11O1k17K81m3j92m8M61j58m15L26J50
$$ 34 93 54 105 15 150 79 -57 220 68 5 207 96 157 -60 221 178 -14 -62 399 241 -174 152 302
2415C02m59N7K64J78n10R5J87j56J2J63l4k14pJ56j87jK05j52j27L90j66j79o1
$$ 302 -157 -100 164 342 -168 -73 114 -42 -30 133 99 -115 -122 34 -153 -154 51 -101 -228 162 -4 -183 -244
2438b44K17J58m42O7K72j11j03J84J17j40k36K64J30l44J04J59j75P6L0q4K7J11
$$ -244 -27 131 -311 -244 28 -83 -186 -2 115 -25 -261 3 133 -211 -107 52 -123 -47 -17 -101 -74 37
2460C7j7j85mK43j87l0K24q6r7K8J03O0k41J40L11m20Q5K02j71O7k7O6J8k83L75
$$ 37 20 -165 -169 74 -113 -143 81 -5 -102 -74 29 89 -152 -12 299 -121 -36 166 -5 62 35 101 119 -164 211
2485B11P5m91K74K61l85J88Q1l7k06M9L20l76r3N00l34j95J47L48j67k24J54R2
$$ 211 286 -205 69 330 -55 133 214 177 -29 20 340 -36 -129 371 37 -158 -11 337 170 -54 100 192
2507A92j50o6K41k09n0J72k13J13l3Q4j22n4K98k65j53K99j96n5N1J12P3k05k5
$$ 192 42 -24 217 8 -42 130 -83 30 -3 81 -41 -95 203 -62 -215 84 -112 -167 -116 -4 69 -136 -161
2530a61L59k44q3K29J8r4j29J31Kk21N6L37l91J34P7j50K1J15J3j91MK59j12j71
$$ -161 198 -46 -129 100 118 24 -105 26 28 -193 -137 200 -191 -57 20 -130 -109 6 19 -172 -168 91 -21 -192
2554a92K31K6j69j07K54K74k74j11K95j98j61J99p2k4q5J83P9j99L4J31j02jJ46
$$ -192 39 65 -104 -211 43 317 43 -68 227 29 -132 67 -5 -29 -114 69 148 -51 -17 114 12 11 157
2577A57j19N2O0j24L0p3J89q3k60K95n5p1m6K12j72q5O4L46l79m6L24j30j72M9
$$ 157 38 90 150 26 56 -17 172 89 -171 124 69 -2 -48 164 -8 -93 -29 317 -62 -108 216 86 -86 -37
2601c7K0m4j21L35J1l36K25P9k77J23J10k83J19P5J76l73j6L40n6k26m3K41r1
$$ -37 -17 -61 -182 153 164 -172 53 132 -145 -22 88 -195 -76 -1 175 -198 -214 126 70 -156 -199 42 -49
2624d9j78J23K51k71m5L33k68O4j34m9K93p1j07J27k1J6l1q5K10m3n6j3j0O6l0
$$ -49 -227 -104 147 -124 -169 164 -104 -40 -174 -223 70 -1 -108 19 -2 14 -17 -102 108 65 9 -4 -14 52 22
2649B2j63L07j58j60L15l4j89J26O3p9J8p6J74k86J00J53j97P1J44j19J9j98L57
$$ 22 -141 166 8 -152 163 129 -60 66 129 50 68 -8 166 -120 -20 133 -64 7 151 32 51 -147 210
2672B10j87j35K94m7l8j15J94k4j58Q4L21k71k38K80j22n9j46K30p2K5NJ55k96
$$ 210 23 -112 182 135 97 -18 176 152 -6 78 399 128 -110 170 48 -11 -157 73 1 26 31 186 -110
2695a10K25o4j27Q1mRr4M5J35r9k10K94j24n8K5PQ5j6r4R2j20J90r3j65K01q1
$$ -110 115 51 -76 5 1 10 -84 -39 96 -3 -213 81 -43 -101 -76 -69 16 0 -94 -2 -122 68 -25 -190 11 -70
2721g0j29J99n7r4J3J5J28M7k86L69l1j62N5Q7M2j15p9K62j45j81J16L9q0oK9
$$ -70 -199 0 -57 -151 -138 -123 5 52 -234 135 104 -58 -3 84 126 11 -68 194 49 -132 -16 23 -57 -63 -34
2746c4J54j25kK24j52m6R0j71N5J0J72m8k89K86Q1j58l5qN6M0j58K11j09j45R7
$$ -34 120 -5 -7 217 65 19 109 -62 -7 3 175 127 -162 124 205 47 12 4 60 100 -58 153 44 -101 -4
2771dJ24p7M9j05J62q1q1J09j33j7L8J64q6n1j17J95j30m4J92L0M0j51j85J27
$$ -4 120 43 92 -13 149 68 -13 96 -37 -54 -16 148 62 11 -106 89 -41 -85 107 137 177 26 -159 -32
2795c2j3N5qp2R4q5l7J83j78P2Q0k4k9J22k26R9l2j62R6n0J77L1k43Q2M3l8Q6
$$ -32 -45 10 2 -70 24 -61 -98 85 -93 -21 59 35 6 128 -98 1 -31 -193 -97 -147 30 61 -182 -100 -57 -95 -9
2822iK5O4m4j36K28np3n5k0RJ65k76J15L7nn5PO6N9q0O6o9J36o5p9J34j26K4O9
$$ -9 16 80 36 -100 128 123 50 -5 -25 -16 149 -127 -12 25 20 -35 -28 38 97 17 83 14 150 85 6 140 14 38 107
2851A07p1k0OQ0n7J16k27P8O3j01Q2JrN9j52J37m5jn1m4J11j26PJ39RJj4l0P4
$$ 107 36 16 22 102 45 161 -66 12 75 -26 56 57 48 107 -45 92 47 46 -5 -49 62 -64 -57 82 91 92 78 48 122
2880A22j5o9M9j67n5K36j51J05l7n6j03N7oJ12k33J5J75j19k1J08j3J1r5K30k52
$$ 122 107 38 87 -80 -135 101 -50 55 18 -38 -141 -84 -90 22 -211 -196 -21 -140 -161 -53 -66 -55 -150 80 -172
2905a72l9J84j75J4J08J83j42J42k58K35j74N5k3J45n8o8NJ24j4Pm9j66J93k8
$$ -172 -211 -27 -202 -188 -80 103 -39 103 -155 80 -94 -39 -62 83 25 -43 -38 86 72 79 30 -136 57 29
2929B9M4O9k60jJ57N3m1p7J16n3L5J0M3r6o2P0k8O8K1j39J52q1J08K7j22L7o8
$$ 29 73 142 -118 -119 38 91 50 -27 89 36 71 81 124 28 -34 36 8 76 97 -42 110 29 137 164 42 79 11
2956A1K04l01J12O5q4j93K48J86k03J9J41k39J9j5J11k1j24J21K3p4r0j8L04l04
$$ 11 215 -86 26 91 7 -186 62 248 45 64 205 -34 -15 -30 81 60 -64 57 80 6 -84 -102 202 -102
2980a02O5J78k59J52Lj46jL8j30J42l3m7J58j23P0Q1k04K89k48k7L10j72k16K95
$$ -102 -37 141 -118 34 37 -109 -110 -72 -202 -60 -93 -140 18 -105 -35 46 -158 131 -117 -144 166 -6 -222 73
3004G3m9J15k22M7k6P1m0J21M0r2m2P8o2k60L24J8j70K6K02l1p9j47K27j1k88
$$ 73 24 139 -83 -36 -62 9 -31 90 130 38 -4 74 12 -248 76 94 -76 -50 152 121 42 -105 122 111 -177
3029a77K44O5r5lM4Kj33Q8J99k77k9J99j12ql7N6k6j65K75J14k10K8j6M9j02N7
$$ -177 67 132 37 34 78 80 -53 35 234 -43 -72 127 15 7 -30 26 0 -165 110 224 14 42 26 75 -27 30
3055C0o5M6o0p5K40J8j11m9O6Q9j50j23J48k5q9m8J14l3O2m3P8j77N4M6Rk2k2
$$ 30 -35 11 -49 -124 116 134 23 -26 40 129 -21 -144 4 -21 -110 -158 -44 -77 -15 -58 20 -157 -103 -57 -48 -70 -92
3082i2l0K03k46J30Rj05O6LJ23j11L8J05p9n9N7P0l4k19J84J22k01J5J75l8p2
$$ -92 -122 81 -165 -35 -26 -131 -65 -62 61 -50 -12 93 14 -45 12 82 48 -171 13 135 -66 -51 124 86 14
3107A4J36L8j47J8j13O3p9K8J96k18k0J53J71j76q6K17j60j9k5J76j64K7j44J11
$$ 14 150 188 41 59 -54 9 -70 -42 154 -64 -84 69 240 64 -22 195 35 16 -9 167 3 30 -114 -3
3131cN5oJjj39J30j82J08J16k66K03k8j6N6P6n2Mj85J71l0m7K0M5r4j10J45J13
$$ -3 52 46 47 46 -93 37 -145 -37 79 -187 16 -12 -28 28 104 52 56 -129 42 12 -35 -15 30 -64 -174 -29 84
3158H4r8o7K58j72k57K68Q7j25m4n1K35k51p4K59o2q6J2L3J36j72l6K28j98pJ13
$$ 84 -14 -81 177 5 -252 16 103 -22 -66 -117 118 -133 -207 52 -10 -96 -84 -51 85 -87 -123 105 -93 -100 13
3183A3M9j2n2J07j91L8O6Q2j58K74k78O6Q9k70K29j1n1N4mr0J34m4J79r7j44k
$$ 13 62 50 -2 105 -86 -48 18 100 -58 216 -62 4 93 -177 52 41 -10 44 40 -50 84 40 219 122 -22 -24
3209b4o7N0J03j53J15nON0m7m9J56m9r4k2L8N0m4q1K01j83KO6J28j16L1r5J51
$$ -24 -91 -41 62 -91 24 19 25 75 28 -21 135 86 -8 -30 8 58 14 -67 134 -49 -47 19 147 31 62 -33 118
3236A18m7j27Q0J03j45K9J09j43n9J10P5j79R8k8J00p9j1K2j84q6K84J2j77R8
$$ 118 71 -56 24 127 -18 11 120 -23 -82 28 103 -76 22 -6 94 15 4 26 -158 -244 40 52 -125 -27
3260b7P0k2M3j78J82j23o3J55mj46J23j5k5P1J09j85OJ25Qj03j0mj24J70K8l3
$$ -27 43 21 64 -114 68 -55 -118 37 33 -113 10 -5 -30 41 150 -35 -29 96 104 1 -9 -13 -137 33 61 28
3286B8n7J26m0m3l7L0j18J56Pj07J15m9J40r5k2q3Q5mj45J35O7q5j00K34r6J4
$$ 28 -29 97 57 14 -23 7 -111 45 52 -55 60 11 151 56 34 -49 36 32 -113 22 89 4 -96 138 42 56
3312E6j62J47p1n2N7J13m2j08M6L2n2K19j35n8K5m4R2j48%j3J00l1J01o1k5q7
$$ 56 -106 41 -30 -82 -25 88 46 -62 -16 16 -36 183 48 -10 15 -29 63 -85 -85 -98 2 -29 72 11 -14 -101
3338a01J15j6k01K18k7q4J52j17J03j10O7m3p5K9O5p9qJ79k25P7Q2o2J4P7j93
$$ -101 14 -2 -203 15 -12 -96 56 -61 42 -68 -1 -44 -119 -90 -25 -104 -112 67 -158 -81 1 -61 -47 30 -163
3363a63J96p5R9o1P6r0k6Q4j61J15O4j3j19J39K8l6O5j31Q6o0k2J10j3m7O0L6
$$ -163 33 -42 57 -4 72 -18 -44 40 -121 -6 58 45 -74 65 93 57 122 -9 77 17 -5 105 92 45 105 141
3389A41j36O8p3J60o2j04J74r3j0j08J43M6j12k4N1k03K21o7jJ25p9o3M4o0N5
$$ 141 5 73 0 160 98 -6 168 75 65 -43 100 146 34 10 61 -142 79 12 11 136 57 -6 38 -22 33
3414C3j27O1J02P2l4Q9k46J13n7L0l8m0n3J18j08j6J00l9L0mj5l0J45j03J02j62
$$ 33 -94 -33 69 141 107 196 -50 63 6 36 -2 -42 -95 23 -85 -101 -1 -40 -10 -14 -29 -59 86 -17 85 -77
3440g7j12K26n4p1N9M8j12j8K60k05j1j3n0J67j55P9N7N3j19J30J4j43n0J41m6
$$ -77 -189 37 -17 -88 -29 19 -93 -111 149 -56 -67 -80 -130 37 -118 -39 18 71 -48 82 96 -47 -97 44 -2
3465bL4j01L7N7M7Qj11P1j22J13n0Q9k50K36k9J4Prl2M2Jo0j9J15j78O7J33n9
$$ -2 32 -69 -32 25 72 80 -31 40 -82 31 -19 70 -180 56 27 41 48 39 7 49 50 -10 -29 86 -92 -25 108 49
3493D9P1J3j34K2J03j92J13lK7J20l52K76j21j5J16k06K43j86%K03j78j26K49
$$ 49 120 133 -1 21 124 -68 45 42 69 189 -163 113 -8 -23 93 -113 130 -56 -56 147 -31 -157 92
3516I2l7j13J01K1j2J8j04O8K3l5R7q0k2q0j3K3j0J39N2k63J00O8l2J11j17O1
$$ 92 55 -58 43 64 52 70 -34 34 57 22 119 39 17 -63 -76 -53 -63 76 128 -135 -35 33 1 112 -5 56
3542E6l0n6J52q8r7J80j25o2J72j82Q5N7N4j28j22K15j2r4M2n0j2J00j63O3J30
$$ 56 26 -30 122 34 -63 117 -8 -70 102 -80 5 62 116 -12 -134 81 69 -25 17 -33 -45 55 -108 -45 85
3567H5n2J9Q5k30R4J19p3o4J5K31l34J56Q8p8r8J17j32O9j19O2q1K0J22k9q0M9
$$ 85 33 52 137 -93 1 120 47 -17 -2 229 -105 51 139 61 -37 80 -52 17 -102 -40 -121 -101 21 -8 -88 -39
3593c9j0J45j97kK52r7j69o6L20k31J38J15k00j03J48j7J16K9j92P9ko4j2R3n2
$$ -39 -49 96 -101 -103 149 52 -117 -183 137 -94 44 159 -41 -144 4 -13 103 132 -60 19 17 -47 -59 34 -18
3618a8N0o3nK2O3j35O8o5n2J95j09M4Pr8O6Q5k03J23n0j2K8r8J34K3r1K05j08
$$ -18 32 -31 -36 -14 49 -86 -18 -83 -135 60 -49 -5 2 -96 -30 55 -148 -25 -75 -87 -59 -157 -23 0 -91 114 6
3645Fj03K75j38q4L7L0Jo8l3J81k60K21Q0k04j3J73j6j30J21O2l7j15J40m3j49
$$ 6 -97 178 40 -44 -7 23 24 -44 -77 104 -156 65 145 -59 -72 101 85 -45 76 138 101 -14 126 83 -66
3670f6J46o7M1%k6K16k96R0N0j84P9P9M6j11o8J60Kj76J20QJ3p2M7k5J01j87R8
$$ -66 80 13 54 54 28 244 -52 38 88 -96 -17 62 108 -3 -71 89 91 -85 35 43 56 -16 31 6 107 -80 18
3697A8o7r0N8J47j69J68L6j48M3m2M2L4K02j14k50P2J22j83K8J9J83k3k90O3K39
$$ 18 -49 -139 -81 66 -103 65 101 -47 -4 -46 -4 30 232 118 -132 -60 62 -121 -93 -74 109 86 -204 -141 98
3722I8k41N0Q0q0j7L5J04q2k4K05j72j32K12R0j58q4J69q2p6P0N8L9j8j51K44
$$ 98 -143 -93 -13 -93 -110 -75 29 -53 -77 128 -44 -176 36 126 -32 -116 53 -29 -105 -35 23 62 44 -107 137
3747A37k45L8M3J81j89J0P0N2N8j29o9J68n1j09P8j37J89k41J30P2j15K48j80
$$ 137 -108 -70 -27 154 -35 -25 45 97 155 26 -43 125 74 -35 43 -94 95 -146 -16 56 -59 189 9
3770Ij60J20L6l3q3o8J29m6k7N8J1N4m3n2R6QJ0k7K0j1lk1j50Q0K9K46l05J68
$$ 9 -151 -31 5 -28 -111 -179 -50 -96 -123 -65 -54 0 -43 -95 1 9 19 -8 12 1 -2 -23 -173 -93 -64 182 -123 45
3798D5n6q3K5N9P0j5k3j6M0j02%MN5o8L1O2L1j38O2Mp8J36j69N0P0J0l6O7j9j09
$$ 45 -11 -94 -69 -10 60 45 22 6 46 -56 -56 -52 3 -65 -34 28 59 -79 -17 -13 -91 45 -124 -74 -4 6 -30 37 18 -91
3828i1N2N2M5k0M3k6o0n7J65j17R4n4m6k6JK14k3j02P4q3J01j56J3N7r0Q1M6j08
$$ -91 -39 13 58 38 81 55 -5 -62 103 -14 80 26 -20 -46 -45 169 146 44 118 35 136 -20 -7 50 -40 41 87 -21
3856b1JJ19K0q5o3J71j37p1N6P3o5o0o8J92j28RP0O3k27J33J1nol9M8J49k89J26
$$ -21 -20 99 119 34 -29 142 5 -66 -10 63 -2 -62 -130 62 -66 -57 13 76 -151 -18 -7 -12 -18 -57 -9 140 -149 -23
3884b3J01j94M5J01j9J16k90L20j24K8m2L7m4j9O4p1Ln8J44M6j10m7J08k5l7j08
$$ -23 78 -116 -71 30 11 127 -163 157 33 61 19 56 12 -7 57 -14 -11 -69 75 121 11 -36 72 47 10 -98
3910i8J7J43j10J38j01j7N3m7Jk3o7J42p8l0J02l2mP7J03m3j59P0N1k7N6j85O4
$$ -98 -81 62 -48 90 -11 -28 25 -22 -21 -44 -111 31 -47 -77 25 -7 -11 66 169 126 -33 37 88 61 117 -68 -4
3937dJ05l1l4%J47j31L0o2M3Kj4j25J75O2j01q3pOJ26j56j0J60j18L0K2m9n1J2
$$ -4 101 70 36 36 183 52 82 20 63 65 51 -74 101 163 62 -21 -28 -22 104 -52 -62 98 -20 10 32 -17 -68 -56
3965e6p0K84j91j32M4R0P2p0J03j30r3J27R7j54P8L7p4J00j92K30m7j99P9J51
$$ -56 -126 158 -33 -165 -121 -31 41 -29 74 -56 -149 -22 75 -79 -1 36 -38 62 -130 100 53 -146 -67 84
3989H4j66J65m5L8o3k5q4Q3K4Q8q4Q1jq4q6M4n3R6j42K1J46p8M6o8j1l9J39k1
$$ 84 -82 83 38 76 13 -12 -96 -13 11 99 15 96 95 11 -75 -31 -84 12 -130 -109 37 -41 5 -63 -74 -113 26 5
4017EN2j84J36P9k01J19m0j9J46n4N4J6o8l5l2K0P8RN5o0%no0L0k9Q8j00j9mj4
$$ 5 57 -127 9 88 -113 6 -34 -53 93 39 93 109 41 6 -26 -6 72 81 136 76 76 71 11 41 12 100 0 -19 -23 -37
4047c7L7l1M9m6L3Q3j93Q3k3N2N3J1j10K8n1jJ13j86J68p2n7L7jJ71j63MjK4p4
$$ -37 0 -31 18 -28 5 88 -105 -22 -45 7 60 71 -39 -11 -62 -63 50 -136 32 -40 -97 -60 -61 110 -53 -49 -50 -26 -100
4076a00J13j27P9M7o4J74j86k3q0K52K6j28m1J66j76P4j18J60m3J3L4m9P0o9K4
$$ -100 13 -114 -35 12 -52 122 -64 -87 -167 85 111 -17 -58 108 -68 6 -112 48 5 18 52 3 73 4 28
4101B8m3J00J11k92R8j70K55j66Q4R2l9o8O9n2r4J40kk8J4n7j9J25r2N3K8K1j38
$$ 28 -15 85 196 -96 2 -168 87 -79 5 97 58 -10 59 7 -87 53 51 23 37 -20 -39 86 -6 47 75 96 -42
4128d2J12K9j1p4j1M7j4K0K3j04m5J80j09j32J59L6j82J10j5J37j82Q9R9k67Q8
$$ -42 70 99 88 14 3 50 36 56 79 -25 -70 110 1 -131 28 64 -118 -8 -23 114 -68 21 120 -147 -59
4153e9J13m6q6J04j82J15J04p0r8M5J36K2j87oJ8J30L8j33J42n4l2k5N9J1k6j22
$$ -59 54 8 -78 26 -156 -41 63 -7 -105 -60 76 98 -89 -95 -77 53 91 -42 100 46 14 -11 48 59 33 -89
4179h9J37o0j2p5L1K0O0Nm9L5O8q9P7J8J8m1L4n6l4M2o6J9j10K9%J36k6K9P7j19
$$ -89 48 -12 -24 -99 -68 -48 12 17 -32 3 71 -18 59 77 95 54 88 32 -2 40 -26 -7 -117 -88 -88 48 22 51 128 9
4209IP3r1OK5J3Q7l6j25K7j7j5K05j91J51p8j48Q0r7P6P1k43K54K9j91K29N6k39
$$ 9 82 -9 -3 22 35 122 86 -39 -12 -29 -44 161 -30 121 43 -105 -25 -122 -46 25 -218 36 65 -126 103 159 -80
4236h0L7J28l5J9j18J03k0r8o5J74j71J15j30J93r0JM8m0j56J16j07J76l5J34
$$ -80 -43 85 50 69 -49 54 34 -64 -129 45 -126 -11 -141 52 -38 -37 11 -29 -185 -69 -176 0 -35 99
4260I9j72rK7J03p8n1O3L2k0L3P8j28M8l4K5j10R5j23MR0O8j7j6L7k5j02O1J51
$$ 99 -73 -82 -55 48 -30 -81 -18 14 -6 27 105 -23 25 -9 16 -94 1 -122 -118 -28 40 23 7 44 19 -83 -22 129
4288A29j68J26l9q4j2J38J02j28l7j36J80n2n6M4MM7k2J08j65M0ON2n0q7J3R1
$$ 129 -39 87 48 -36 -48 90 192 64 27 -109 71 19 -37 7 11 58 36 144 -21 19 25 77 27 -60 -47 44
4314D4Q0n1pl3j26M4O2l7m4kM6m6O8j4M8M7j26l0R4j1n2rJ40j97Q6P4K5j01q2
$$ 44 124 73 66 33 -93 -49 13 -24 -68 -70 -24 -70 -2 -16 32 79 -47 -77 17 6 -46 -55 85 -112 -26 48 73 -28 -110
4343a10P7N8j66M3o5K53m7o2o3L9q9P3j3L2P3MK5n9m4q4J21p3K6J86o5r2P9l3
$$ -110 -33 25 -141 -98 -163 90 43 -19 -82 -43 -132 -59 -72 -40 33 37 62 3 -41 -125 -4 -77 -51 135 70 -22 57 24
4371B4LR1J18k67Q8j02QJ12j17L1M4M8L6j71K19j39l4Q2n3M3j56%R6n5N3o2j0
$$ 24 27 118 236 -31 57 -45 -37 75 -42 -11 33 81 117 -54 165 26 -8 74 21 64 -92 -92 4 -51 2 -60 -70
4398g0J32nk0O3J12k94J29r0nJ69kk03Nk3J28l7k4L3Kp8Q1m5M1n4L2l8L6J7o0
$$ -70 62 57 37 100 212 -82 47 -43 -48 121 119 -84 -79 -102 26 -11 -35 -2 0 -78 3 -42 -1 -55 -23 -61 -25 -8 -68
4427f8J25J8p0L2N5k30J74j20j0qJ7L7Q2j08k3M4j05J98l2l7R8q1J3J6n3R3n7
$$ -68 57 75 5 37 92 -138 36 -84 -94 -102 -85 -48 34 -74 -97 -53 -158 40 8 -29 69 -12 1 17 -36 57 0
4454@L7P7k9r4M1j02J17l2J06%j32N1j47J40n9j8J85k67K3J41q0J50n1r9N2M3
$$ 0 37 114 85 -9 32 -70 47 15 121 121 -11 40 -107 33 -26 -44 141 -126 -103 38 -42 108 57 -42 10 53
4480E3n0k3J21n1k7n4Q8q0L6M6j13J52O8j76o5J70j77J77j68J13l6P7j37Mj4n8
$$ 53 3 -20 101 50 23 -31 57 -23 13 59 -54 98 166 -10 -75 95 -82 95 -73 40 4 81 -56 -52 -66 -124
4506a24J48n6n8N9O0Q3k05J75j49O2k6k3mm9p0J37M0j64J73r5J39q9Q6m9n1p3
$$ -124 24 -32 -90 -31 29 112 -93 82 -67 -5 -31 -54 -58 -107 -177 -40 0 -164 9 -86 53 -36 50 1 -50 -123
4532a23J99j87j3J43J9k31J01O7m0K4N3Oj9q9k7J9J19k4mN6j15J88j06m8RJ9O1
$$ -123 76 -111 -124 19 38 -193 -92 -25 -65 -41 12 18 -1 -90 -117 -98 21 -3 -7 49 -66 122 16 -32 -23 -4 57
4559E7R5k15k6J27q9N1o8J28O9k00R5QR4n1o2k1J09j8m0M6p8J10j18j01J23j42
$$ 57 152 -63 -89 38 -51 0 -68 60 129 -71 24 32 126 75 13 -8 101 83 43 89 11 121 3 -98 25 -117
4585a17J58o8n9K27l6n5p3J12j9M6o2o9P5k15J50PLmQ3Pj91N6N5j63R1J04k52
$$ -117 41 -27 -86 141 105 50 -23 89 70 116 54 -15 60 -155 -5 2 5 1 84 91 -100 -44 11 -152 -61 43 -209
4612b09J62K8Ql5LJ06j24j86K37L0r1L6r3J50m8l5m0J01j00J74q3J26J8j27J19
$$ -209 -47 -19 -11 -46 -43 63 -61 -247 -10 20 -71 -35 -128 22 -26 -61 -101 0 -100 74 -9 117 135 8 127
4637A27j08J58k20K07k17Nn6K25j58k5N8m1J06Nj5P5j17p0K01j70Q5L7j38Q5P
$$ 127 19 177 -43 164 -53 -48 -104 121 -37 -62 -4 -45 61 66 51 126 9 -61 140 -30 55 92 -46 39 46
4662D6nJ9K2o8nq9MJ42j3Or0k%n7P0o2K7J27j13P7M0r8nJ69j24k4P9j93J18n7
$$ 46 41 60 82 14 9 -80 -76 66 53 59 -31 -33 -33 -90 -20 -82 -55 72 -41 36 76 -22 -27 142 18 -6 73 -120 -2 -59
4692e9J20L6Kj79K6K4l6p1J80j44J71j75J3N9J29m3lK7q6QK5p9M2n1K43j75m8
$$ -59 61 97 99 -80 -54 -30 -66 -137 43 -101 70 -105 -92 -33 96 53 50 77 -9 -1 24 -55 -13 -64 179 4 -44
4719d4N4l9M0J1M7j76K09j98J40j4n8K62j33j73O4k0O8k7J31j12r3J54p6M4M7
$$ -44 10 -29 11 22 69 -107 102 -96 44 30 -28 234 101 -72 -8 -28 40 13 144 32 -61 93 17 61 108
4744A08j54J35j73J32p4J87k50J23j22J94r9l0J28j57l9kJ7M3n7rQ2j3q5J01J8
$$ 108 -46 89 -84 48 -26 161 -89 34 -88 106 7 -23 105 -52 -91 -93 -76 -33 -90 -99 -17 -30 -115 -14 4
4769Dl7J41p0M7j79J01n2L7k8R8n5l7R2O2j35N8m6O6j78J12l7O1l5rJ13j58n6
$$ 4 -33 108 38 85 -94 7 -45 -8 -36 62 7 -30 62 124 -11 47 1 67 -111 1 -36 25 -10 -19 94 -64 -120
4796a20J65j20p8J34J15j81J42o6%l4oO3JQn6K0m7J73j85J51l7r4K18q1j03l0
$$ -120 45 -75 -153 -19 96 -85 57 -9 -9 -43 -49 14 15 23 -33 -13 -60 113 -72 79 42 -52 166 85 -18 -48
4822d8p4K09j20k5J64nn3k0p0O1j06P7J12m3J8P4j92K06k01l1K3M8o9J00o0J36
$$ -48 -122 87 -33 -58 106 101 48 28 -42 19 -87 -10 102 59 77 151 -41 165 -36 -67 -44 4 -65 35 -25 111
4848A11j9j17L3Lr6o3K48j27j0M1q9J19J1p8L6l3j6l2J79j36l4J73l9j70Q2Pl4
$$ 111 92 -25 8 11 -85 -148 100 -27 -37 4 -85 34 45 -33 3 -30 -46 -78 101 -35 -69 104 65 -105 -23 -16 -50
4875e0lK05r1q3q4J02o3J67l11j28M43p6pl5L6O6k30l6K85j36r0J0n1J86J3L4
$$ -50 -53 152 61 -22 -106 -4 -67 100 -211 -339 104 28 21 -14 22 88 -142 -178 107 -29 -119 -109 -160 26 39 73
4901G3m5j42J98n8o2O0Q5r3n1k3N5q1R0rJ43m8Kj16J72k66J42l9N4l7K0J2J03
$$ 73 28 -114 84 26 -36 24 109 16 -35 -58 -3 -84 6 -3 140 92 94 -22 150 -116 26 -13 41 4 24 36 139
4928A39j53N1j27M1K7lj9J13r4qJ61j48m2Q8Q5oj56M3q5P2LN5r7l1J00K4j5q8
$$ 139 -14 37 -90 -49 -22 -25 -44 69 -25 -33 128 -20 -62 26 111 105 -51 -8 -93 -21 -18 37 -60 -91 9 33 18 -70
4956g0l4R6j00L0M1mR2j39M5J64o7j8n2p3Q0p4l1P6L9j2J56j75J84r2p8J04r7
$$ -70 -104 -8 -108 -78 -37 -41 51 -88 -43 121 54 36 -16 -89 -9 -83 -114 -38 1 -11 145 -30 154 62 -16 88 -9
4983ij0L0r1N6j5J0K7L8j57J11R4j11p2J25o2l3J94j72j0N2R9J0p8Q6l8p7O8J41
$$ -9 -19 11 -80 -24 -39 -29 -2 36 -121 -10 84 -27 -99 26 -36 -69 125 -47 -57 -5 94 104 26 112 74 -3 65 206
5011B06j3p9o6Kk4n4J13j31K32j26j30N3J27r1L9mOj61J09k4J72j83j13Q5J9J8
$$ 206 193 114 48 50 26 -28 85 -46 186 60 -70 -17 110 19 58 54 60 -101 8 -16 156 -27 -140 -55 -36 -18
5037a8q6O3M6j09J99k29J44k3Mn7M5q1j76J99j8N2J18j21oJ65j90J04l3r5J06
$$ -18 -104 -41 5 -104 95 -134 10 -13 -9 -66 -21 -102 -278 -79 -97 -45 73 -48 -54 111 -79 25 -8 -103 3
5062Cn7J08j36J56R3k21J08Mo6n5o6J96j02k2M1P8p6N8j61O7n1J40m9j4J8L1J8
$$ 3 -54 54 -82 74 167 -54 54 58 -8 -63 -129 67 -35 -57 -16 62 -14 44 -117 -50 -101 39 -10 -24 -6 25 43
5089D3M4l4N2p2p7j22J67l6m3k0J30K8J2j21R5R8j19R7k57K49j22K9l4l1O3J8
$$ 43 87 53 105 33 -44 -166 1 -35 -78 -98 32 60 72 -49 46 144 25 122 -135 114 -8 21 -13 -44 19 37
5115C7l3l7k1N9L0j83J72M9o4j47Q5M3l6K8j3J66j10ML3K8k48J15N3p9P5%l5l6
$$ 37 4 -33 -54 5 35 -148 24 73 9 -138 -53 -10 -46 -18 -31 135 25 29 62 90 -158 -43 10 -69 6 6 -29 -65
5143f5P4j62J67j11J30o4J96k14Q3L2j91J36j65K72j01J9P5j37P4j68J21K3%n3
$$ -65 9 -153 14 -97 33 -31 165 -49 34 66 -125 11 -154 118 17 36 111 -26 48 -120 1 24 24 -29
5167b9J01Qj02J04r1O7N5j76P6k0O7J3l1j22J61q3j9l1J16pj79J37J12j80Q0l1
$$ -29 72 80 -22 82 -9 58 113 -63 13 -7 60 73 42 -80 81 -2 -21 -52 64 57 -122 15 127 -53 27 -4
5193dL5M2k57J80lk8J58j66j9J79j98J10R6r7J4J20j40r8N9R8j85J4J66j66J04
$$ -4 31 73 -184 -4 -7 -35 123 -43 -62 117 -81 29 125 28 42 162 22 -76 -17 81 -104 -90 76 -90 14
5218A4n8R2l5l7j36J86N2n7j6j09k9J09lm4M8j0J0q4j1N2J7k2O5K8Qo0Q3r7n2
$$ 14 -44 48 13 -24 -160 26 78 21 5 -104 -133 -24 -27 -71 -23 -33 -23 -107 -118 -66 -49 -71 -6 22 30 -30 53 -44 -96
5247i6K00j28P5j09mn2K35o2n3j1N8j6j8j9N8J7j06k5l1L3p2L1R2p6j24R4J13
$$ -96 104 -24 51 -58 -62 -114 121 59 6 -5 53 37 19 0 58 75 -31 -56 -87 -54 -126 -95 -3 -79 -203 -109 4
5274DK9pp1N6r4R9J35j00J4Q5j28N3n7J5J0Ol4J71p8k8J30j17p1P9j12N2o8M6
$$ 4 33 26 -45 11 -83 16 151 51 65 150 22 75 18 33 43 49 15 186 108 80 210 93 22 101 -11 41 -27 19
5302A9J18r7k2J1N1j51N8K3r4l8J32nm7l7N0M4J29k77J66K4r4R3QK7j24N8M4j42
$$ 19 137 40 18 29 80 -71 -13 10 -84 -122 10 5 -42 -79 -29 15 144 -133 33 57 -37 56 64 91 -33 25 69 -73
5330g3L2J63j36q5l9Q2K0L3J2J16j05m4LJ9N1j87R8J71j19J52j76N9J4p7p1P7
$$ -73 -41 122 -14 -99 -138 -56 -36 -3 9 125 20 -24 -21 -2 49 -138 -40 131 12 164 -12 47 61 -16 -87 -10
5356a0J5J12k6j12j6Q9j78J32O0n8m3oJ33p1J41j78J08j88J35l3R7j29J22j30
$$ -10 5 117 91 -21 -37 52 -126 6 66 8 -35 -41 92 21 162 -16 92 -96 39 6 103 -26 96 -34
5380c4N9J42j09%p3M1l9oP8P4r5j14P6K1l5N6j16J1J64n5j04J1N8J22j72J00r2
$$ -34 25 167 58 58 -15 26 -13 -19 59 133 38 -76 0 21 -14 42 -74 -63 101 46 -58 -47 11 133 -39 61 -31
5407c1k1q5J15l4L8J27j67L7o2J08l1m1roJ3p6PJ07n8N2r7J23Qj4L1q6M1j9J36
$$ -31 -52 -137 -22 -56 -18 109 -58 -21 -83 25 -6 -47 -56 -62 -49 -125 -118 -11 -69 -17 -114 9 17 3 34 -52 -11 -30 106
5436A06o8j06J30p2M0Ojq7J28o3m3N6j9k5J67j40J6M7k0R0j73j5M3jN3j9n6n8
$$ 106 38 -68 62 -10 30 36 35 -52 76 13 -30 26 7 -18 149 9 25 72 52 142 -31 -46 -3 -4 49 30 -26 -84
5464h4Q6n8M5J9l6N0J56k20LL9N7r0Q4N6o7l7K8m8J7lN3j25J03j5Q9j46J1P2j47
$$ -84 2 -56 -11 8 -28 22 178 -42 -39 0 57 -33 51 107 40 3 31 -17 0 -3 50 -75 28 13 102 -44 -33 39 -108
5493a08Q1o5J08L8j79P0k0M9p3J2P7j81K59%q5pK4%j8Q8j30O5p5J15q8P8J5o5
$$ -108 -27 -92 16 54 -125 -55 -75 -26 -99 -87 -10 -191 68 68 -17 -24 0 0 -18 70 -60 5 -70 45 -43 35 50 -15
5521a5M7k4J59k09NJ02r6l8PM0P1l2J05o5j32Q0n9M9J70k48N0K02j51j9m2J09
$$ -15 32 8 167 -42 -37 65 -31 -69 -62 -22 49 17 122 57 -75 5 -54 -5 165 -83 -33 169 18 -1 -43 66
5547F6q6o4K8N9j56J64NJ8N8j61k2J55K3k38K05P7r5O3p4J5k4J3on4k4K81j31
$$ 66 -20 -84 -56 3 -153 11 16 34 92 -69 -91 64 87 -151 54 131 36 99 25 40 16 29 23 -31 -55 226 95
5574I5m2o9O1o0O5j72K11j33O1J6o2J02L5r6j38Q7J00j10J27j79N5OJ5J58j39
$$ 95 53 -16 45 -15 50 -122 89 -44 17 33 -29 73 108 12 -126 -39 61 -49 78 -101 -46 -40 -25 133 -6
5599fJ01j36N7l3k9N0M3j97k2J16j9J03j0K1J5j09k3J23r1O6N2j16J87j53J43
$$ -6 95 -41 16 -17 -46 4 47 -150 -172 -56 -75 28 18 39 54 -55 -78 45 -46 20 72 -44 143 -10 133
5624A33p3j12J64J07k06M7m3k6L5J8k0l9n9Q0J0j50J66%N3j55k5Q5N8j45J05J51
$$ 133 60 -52 112 219 13 60 17 -9 26 44 24 -15 -74 6 16 -134 32 32 85 -70 -95 -10 48 -97 8 159
5650A59k12K8j7Q6p7J4L9j00j7J7J85r4J52k29J54r0m5L5%J8m4L0J23j59m5K00
$$ 159 -53 -25 -42 44 -33 -19 20 -80 -97 -80 105 11 163 -66 88 -2 -47 -12 -12 6 -38 -8 115 -44 -89 111
5676A11r9R4j01p8K13j02P1j68R4p2q9J74O3j59n8J06j40J64Q0j30M1j22P0Q1
$$ 111 12 106 5 -73 140 38 109 -59 35 -37 -126 48 111 -48 -106 0 -140 24 104 -26 15 -107 -37 44
5700D4p1J60j07o4J42j15Q6j39J12J1p6J3J04q1p1PK4P2r3M4R5m8mQ9k14J30n1
$$ 44 -27 133 26 -38 104 -11 75 -64 48 59 -17 -4 100 19 -52 -45 -21 51 -42 2 97 49 45 134 -80 50 -1
5727aq3K52j06j13K43j23mnj9r5K17o3j11j03J94j09L6j9j47Q5J92j94N7n6R0
$$ -1 -84 168 62 -51 192 69 65 60 41 -54 163 100 -11 -114 80 -29 7 -12 -159 -74 118 -76 -19 -75 15
5752A5k8K4J18j16M8J8m8k7J3n1J23n8Q0r7l2K0K7M1r6R9k00l6N6J05RJ41l65
$$ 15 -13 11 129 13 61 79 31 4 17 -34 89 31 111 14 -18 2 29 70 -26 73 -127 -163 -107 -2 7 148 -217
5779b17j04L95n7o8M2j01L6J42j19J10o0m9r0K15m4L4j46J40j06lR8j20K07m6
$$ -217 -321 74 17 -51 -9 -110 -74 68 -51 59 -1 -50 -140 75 31 65 -81 59 -47 -50 48 -72 135 89
5803H9j45N1J52o3p9j0P7k3lj12K02j02Klo6K2J9n5PJ13r8K2J5P0n2j06oJ13R3
$$ 89 -56 -5 147 84 5 -5 72 49 46 -66 136 34 36 33 -33 -11 8 -47 -40 73 -25 -3 12 82 30 -76 -82 31 124
5832A24k5q3J9J3q4N0l0K4Q3l8Jj04P2n4J19nq7R2o5jk5M6j6o6o4K8J42o3l8P0
$$ 124 99 16 35 48 -36 14 -16 8 91 53 54 -50 22 -32 87 82 -5 87 22 21 -4 42 26 -40 -104 -76 66 3 -35 35
5862C5j37N6J2N1K8P1k07O5L2o4M9nPk9O5p3J33j39J66p9j60J09J02j04o8J14
$$ 35 -102 -46 -34 17 45 116 -91 -26 6 -58 -9 -14 -7 -36 29 -44 89 -50 116 37 -123 -14 88 -16 -84 30
5888C0J1j50K91k05n7J10J3j63K12l1m2o3J49j12M9l4P2L1j01j3J14o0K9k41J97
$$ 30 41 -109 182 -23 -80 30 43 -120 92 61 19 -44 105 -7 42 8 80 111 10 -3 111 51 80 -161 36
5913C6N0O2j25q9J55j76N9j10K18p8R1j5j34M4oQ9q3l5O7p8J32R5k51P5k7j59
$$ 36 86 148 23 -66 89 -87 -28 -138 80 2 93 78 -56 -12 -18 71 -12 -47 20 -58 74 169 -82 -7 -34 -193
5939a93J76J52j70M8m1L3m0M2R7l37K77j27R5J0p0M4J0oP6p0no2k0L5j8J4m9M1
$$ -193 -17 135 -35 13 -28 5 -35 7 104 -233 44 -83 12 22 -48 -4 6 0 76 6 1 -61 -81 -46 -64 -50 -99 -58
5967e8k2R9pj24J67nj02n2P1L6J9l9R3O6k13M0J76n8k17l8J48j3L9J06j42P3m4
$$ -58 -80 19 12 -112 55 50 -52 -104 -33 3 22 -17 76 142 -71 -31 145 87 -130 -168 -20 -33 6 112 -30 43 -1
5994am2J2j5J14j37n4M0J89p1n7Q3Rj40J25J0j19J27m7J8n7N3j62Q9J3j4j15R6
$$ -1 -43 -31 -46 68 -69 -123 -83 106 35 -22 61 70 -70 55 65 -54 73 26 44 -13 40 -122 -33 -20 -34 -149 -53
6021e3K41k69OM8J54k15P5o1M8P4O8n1j5J0r2J18p7J05j62j01J90J2r7L7J6K2
$$ -53 188 -81 -75 -27 127 -88 -13 -74 -26 48 116 65 50 60 -32 86 9 114 -48 -149 41 53 -44 -7 9 31
6047C1o2j6J18n9K5M1j26O0k4or6J75q9M1P4m5j6p8O9r5K04l02J82k8r5P3J22
$$ 31 -31 -47 71 12 37 78 -48 12 -12 -18 -114 61 -28 13 87 42 26 -52 17 -78 126 -176 6 -22 -117 -44 78
6074G8j5l1k1R5O2k81J30K10j88N5p7K6P4o8j0N8j39k2L9KP9r8R5J9l6K8k0K7
$$ 78 63 32 11 106 168 -113 17 227 39 94 17 43 117 49 39 97 -42 -64 -25 -23 56 -42 53 72 36 64 44 71
6102G1q1L5R6k71K9J15j2m2K5J8n2Q0r2K3N8o4%R4mk04J5J04R0J9nj33rQ7m8J45
$$ 71 -10 25 121 -150 -121 -6 -18 -60 -35 -17 -69 11 -81 -58 0 -64 -64 30 26 -178 -163 -59 31 50 45 -88 -97 -10 -58 87
6132H7j58%J10Q6q1L3q5Q5l5q0O3j81R8Qk1N5j04j7K08j87J51L1o8P5l5m1K5n5
$$ 87 -71 -71 39 125 44 77 -8 77 42 -38 25 -156 -58 -50 -71 -16 -120 -137 71 -116 35 66 -2 73 38 -3 22 -33
6160c3L6J55q9j13J26j27m2JJ47m6j18J65o6J45j38rJ40j7j49J90j15j14J13O
$$ -33 3 158 69 -44 82 -45 -87 -86 61 15 -103 62 -4 141 3 -6 134 117 -32 158 43 -71 42 48
6184D8K2m4r3J9J58j53M7J67j82q4N2K8J08p9J8qo2L3o5J06p8l0J84k12J34j8
$$ 48 70 26 -67 -48 110 -43 4 171 -11 -95 -43 -15 93 14 32 24 -38 -5 -70 36 -42 -72 112 -100 34 16
6210A6p0P9k7K6pm7j24J30J79j21l9k3J9N2rj83J71j2m9N1o5R9K9q5m2J27k3j9
$$ 16 -54 25 -2 24 17 -30 -154 -24 155 34 -5 -28 -9 43 34 -149 22 10 -39 12 -53 46 75 -10 -52 75 52 33
6238C3j6P9j01L3j4l9M4m2j58P5P1j10J92j0OMj32K9RL2m6J66j46P0O3o5r7JJ03
$$ 33 17 96 -5 28 14 -25 19 -23 -181 -106 -35 -145 47 37 43 47 -85 -56 -47 -15 -61 105 -41 29 92 27 -70 -69 34
6267C4l3m3J47j71J45p5R0J2j36jK0o6K9J04j46P4n2M1k6Q1j13R3Pp0J62j63l3
$$ 34 1 -42 105 -66 79 4 94 106 -30 -31 -11 -77 -48 56 -90 -16 -68 -27 -53 28 -85 8 15 -55 107 -56 -89
6294h9K45j54m9n7J04N1j64K92q7N2n5j76L8J14r0n7N4r5P3J5L8l7O1R5N5k07
$$ -89 156 2 -47 -104 0 51 -113 179 92 144 89 -87 -49 65 -25 -82 -28 -123 -50 -35 3 -34 27 122 177 -30
6320c0o4J44j02J02j2j7p9j4N5K6m6q6P9l7J09N4J5j38J07r1l2n6M1K8j0k7J33
$$ -30 -94 50 -52 50 38 21 -58 -72 -17 9 -37 -123 -44 -81 28 82 97 -41 66 -25 -57 -113 -72 -44 -54 -81 52
6347E2j41J52j42O9RJ00j39k42K91K9nj2n1O0j7j12J09q4J07l7pN1p9J45p5n8
$$ 52 -89 63 -79 -10 -1 99 -40 -282 9 38 33 21 -30 30 13 -99 10 -74 33 -4 -11 40 -39 106 31 -27
6373b7J37j49M0J59p4j3Qm6o8J22k05L4P6m1N8p2R4L6r1l2n1j0Q2J43r0J0j43
$$ -27 110 -39 1 160 86 73 81 35 -33 89 -116 -82 -6 -47 11 -61 33 69 -22 -54 -105 -115 -33 110 20 30 -113
6400a13J35n3J4J79j23j51J82j43r0K03pj32K46j44N2nO3k7o7n3p6K18j53P1k4
$$ -113 22 -31 -17 162 39 -112 70 -73 -163 40 33 -99 147 3 55 50 113 86 19 -34 -110 108 -45 26 2
6425Bl1J01n5l9j30J97j60K07j44J2j0m0L7J8Q7j35PQ3J46k12k6N0o9J06j60J80
$$ 2 -29 72 17 -22 -152 45 -115 92 -52 -40 -50 -90 -53 -35 52 -83 -76 7 153 -59 -85 -35 -104 2 -158 22
6451B2m9J78j55M0m1k6J67l5j28Q1ml7J7j96J93m2K6K2Jo2Q9j48J47j35j3K05
$$ 22 -27 151 -4 36 -5 -31 136 101 -27 54 50 13 30 -166 27 -15 11 33 34 -28 61 -87 60 -75 -88 117
6477A17j65Q9j02R7Mr4J43j00k6J05j47Q0M6j61R8j5M8l3NM0J2j63Q7o4J19j2
$$ 117 -48 41 -61 36 40 -54 89 -11 -37 68 -79 1 47 -114 -16 -31 17 -16 -11 29 41 -122 -35 -99 20 8
6503HL7j35R9J39n8k6O0o1j7j9LM0j7j03J42j03P6l3jl6l6k1n4J68j7Qoq1R4Q6
$$ 8 45 -90 9 148 90 64 124 63 46 27 30 70 53 -50 92 -11 65 32 31 -5 -41 -62 -116 52 35 43 37 -44 50 136
6533A36j36L3k8%J24K0j19n3m4J80j46mJ70j45P2l7rP6j00R9j54J06K2j71J31
$$ 136 0 33 5 5 129 149 30 -23 -67 113 -33 -37 133 -12 60 23 14 90 -10 89 -65 41 63 -108 23
6558B3m9m8J37M2j55n4K63k11J30j65P4r8L5J10p9N4R1k15n5L23k05M2m4M0P9
$$ 23 -26 -74 63 105 -50 -104 159 -52 78 -87 -13 -111 -76 34 -45 9 100 -115 -170 153 -52 -10 -54 -14 65
6583F5j8k9K9j79J05O1n7k3J4J1l7o1J84j7j07N8J05k6l5j78J32o9J64j25O0j9
$$ 65 47 18 47 -132 -27 34 -23 -46 -32 -21 -58 -119 65 48 -59 -1 104 78 43 -135 -3 -72 92 -33 27 8
6609HJ13k20Q1P8K2o4p5N7n1J73k59J65j05P5Lr1J11K7p3q8K29p4j51R2J3M0k2
$$ 8 121 -99 -18 60 82 18 -57 0 -51 122 -137 28 -77 -2 1 -90 21 48 -25 -113 116 42 -109 -17 -4 36 14
6636A4L0L8M7j76m1J55o9O1j59P1M1pl9rM3p8R3L0kn3O5o1L6j03N9L0qj0j12K8
$$ 14 44 82 129 -47 -88 67 -2 59 -100 -29 12 5 -34 -43 0 -78 15 45 43 -10 55 -6 30 -73 -14 16 8 -2 -114 -86
6666h6Q0o2P7o3J14p4O2p1J11j75j9Q7R9j93J14R5j42j77K94j16J50k04R5k8L1
$$ -86 -6 -68 9 -54 60 -14 48 -23 88 -87 -106 -19 80 -113 1 96 -46 -223 71 -45 105 -99 -4 -32 -1
6691aK2R7j44J19j6J3p6N4l4m1k0Q5Jp5nJ69L0j80N9j25J71r3j2K1J58j32L9l1
$$ -1 21 118 -26 93 77 90 14 68 34 -7 -27 58 59 -16 -21 148 178 -2 57 -68 103 10 -2 19 177 45 84 53
6719E3ojo3qJ25n6m5R6j03N8m1N1n5P8m4kN5j60K21j88R3J4Q6j40j9J6l8m2O8
$$ 53 47 46 -17 -25 100 44 -1 95 -8 50 9 60 5 83 39 37 92 -68 153 -35 58 72 158 18 -1 15 -23 -65 3
6748CJ13r9n1R4r3qL7Mn1j4K4P7j50q2J46K4O2k5j18P1M5j67J13p2O1J2J03n1
$$ 3 116 17 -34 60 -33 -41 -4 0 -51 -65 -41 36 -114 -196 -50 -26 36 11 -107 -36 9 -158 -45 -117 -56 -44 59 8
6776HN9p2l5J06J11j14q2Q7n6Q2k7Q1K0k73L2R5p2N7j3q7J47J3J58j58o5J10L
$$ 8 67 -5 -40 66 177 63 -19 68 12 94 67 148 168 -105 -73 22 -50 7 -6 -93 54 67 225 67 2 112 115
6803A15j61l4R9J6n9Q4N0j15j8o8R5n1N0j02K31r6n4j5M4P0l7j8p7L0N6j5m2L6
$$ 115 -46 -80 19 35 -24 60 110 -5 -23 -91 4 -47 3 -99 132 36 -18 -33 11 81 44 26 -51 -21 35 20 -22 14
6831A4M8k34K85j2j77J14j58J97N9j14qm5l3P8R6k2r6l0nJ95n2j79L9J10r3O1
$$ 14 62 -172 113 101 -76 38 -120 77 136 22 14 -31 -64 14 110 88 -8 -38 -43 152 100 -79 -40 70 -23 38
6857C8r6M2J50k4k39J35r9P6J3l8J0R0l5n8Ro6%J71j97J06L4lK6L7J9j03J14k23
$$ 38 -58 -16 134 110 -129 6 -93 -17 -4 -42 -32 58 23 -35 -26 -92 -92 79 -118 -12 22 19 45 82 101 -2 112 -111
6885a11N9j2J05LKJ37j40o4M4l7K7p2JK4j3mj6J71j11p2J8K5J74k15J59n1j61
$$ -111 -52 -64 41 44 46 183 43 -21 23 -14 13 -59 -58 -34 -47 -51 -67 104 -7 -79 -61 -36 138 -77 82 31 -130
6912a30Q0P1M5j88K04j44NK4L3n5l3K59j34p2L0J30o5K7q9o7J66j70J75p1n5j08
$$ -130 -50 21 66 -122 82 -62 -57 -33 0 -55 -88 171 37 -35 -5 125 60 87 -2 -69 97 -73 102 31 -24 -132
6938a32J83o9L0J7j79N2L9l9N7m0J77j03J06p9P1k0q9N9n9n7p9K06q4o8m3J51
$$ -132 51 -18 12 29 -150 -98 -59 -98 -41 -81 96 -7 99 20 91 71 -18 41 -18 -75 -154 52 -32 -100 -143 8
6964HQl1n0Q1nJ5k1qp7J99J05k76M6M3p4P4K2p5k0R9j53J32O7p2pm6j2J01r7N6
$$ 8 16 -15 -65 16 11 26 5 -3 -80 119 224 -52 -6 37 -37 37 59 -16 -36 63 -90 42 109 37 30 -16 -28 73 -24 32
6994C2nm0P9j02K28k71j1J58k2o2K7R8Q5k08K0J2L3j21J52j38K0R0Km7j8jK7L3
$$ 32 27 -13 66 -36 192 -79 -90 68 46 -16 11 109 194 -14 6 18 51 -70 82 -56 -36 54 56 9 -9 -10 17 50
7022E0L5j00Q6j73R9L3p1N3R0j81J0L3m7J27j18J31r7J71o0l9j0k26K63j16Q1
$$ 50 85 -15 71 -102 -3 30 -41 12 102 -79 -69 -36 -83 44 -74 57 -40 131 71 32 22 -204 59 -57 24
7047B4K2o0J58R2j95o4p8Q4K2m7J11j17L9m3J53r1j21R5M1m8m6nL2J30o3lk3m
$$ 24 46 -14 144 236 41 -23 -101 -17 5 -42 69 -48 -9 -52 101 10 -111 -16 25 -23 -69 -74 -42 88 25 22 -1 -5
7075eJ10j76R9oJ5jl5k8Q7M4j39m2J24k2M1j24MrK8L4Q5j11Q1Kr0r8K70j63n8
$$ -5 105 -71 28 22 37 36 1 -27 60 104 -35 -77 47 25 66 -58 -54 -63 -35 -1 84 -27 54 56 -34 -132 138 -25 -83
7104h3O9k7O9j55M8j12J02J47j4K6k4N5j15O0j69RJ51m6L5K9j01qQ6j13m7J95
$$ -83 -14 -41 28 -127 -79 -191 -89 58 44 70 46 101 -14 46 -123 -114 37 -9 26 55 -46 -54 32 -81 -128 67
7130F7p9j59K48j01r0J06l7op0O4J84j65L0M4p3J01P8j58oL9K2j48J89o2R6j17
$$ 67 -12 -171 77 -24 -114 -8 -45 -51 -121 -57 127 -38 -8 36 -37 64 142 -16 -22 17 39 -109 80 18 114 -3
7156cQ1o7n8J14p2K1r7K10l0m1J5J0j99K28k15J92l1Nj8N5j06J10j43O9k2j9K3
$$ -3 78 11 -47 67 -5 16 -81 129 99 58 73 83 -116 112 -103 89 58 63 45 100 -6 104 -39 30 8 -11 12
7183A2j55J12L3q2QJ87k28M8O8q5N5J0K4m5%R5L2l1q8M0%m0P6J32K9j40pn9J14
$$ 12 -143 -31 2 -80 -72 115 -113 -65 3 -82 -27 -17 7 -38 -38 57 89 58 -30 10 10 -30 46 178 207 67 60 1 115
7212A15k58J20k4L5pO8r1j40K32O8j08m6m6M7J10j85J01r5NL9Q6q5j16J24MP7
$$ 115 -143 -23 -47 -12 -19 49 -42 -182 50 118 10 -36 -82 -35 75 -110 -9 -104 -99 -60 26 -59 -175 -51 -47 30
7238C0n6p5o7K72M4n2j34O8%l4n5O4j61J05l3l0J58j13L7PO5n5j2L0n5P2ppm6
$$ 30 -26 -101 -168 104 148 96 -38 30 30 -4 -59 5 -156 -51 -84 -114 44 -69 -32 -25 40 -15 -27 3 -52 20 13 6 -40
7267d0J69o3r2K1N8j23J11m8j7kJ9pQJ4o9J5M0L1p0J34n2j47J98K3q8p7q3K43
$$ -40 129 66 -26 -5 53 -70 41 -7 -24 -26 -7 -14 -6 8 -61 -46 -6 25 -45 89 37 -110 88 111 23 -54 -137 106
7295A06n2Jk0j37LJ90l6l3n8l7J54l7L0j85J51j12J09o9P0j60J72j95Q0k7O0Q9
$$ 106 54 55 35 -102 -99 91 55 22 -36 -73 81 44 74 -111 40 -72 37 -32 38 -122 50 -145 -65 -92 -32 57
7321E7o4L9jk7N3q4l6O5N5k05J30n0O8l2r7P6J07L3lj79J2J92J5n3L2q0n9M8K8
$$ 57 -7 32 31 4 57 -27 -63 2 57 -148 -18 -68 0 -32 -129 -53 54 87 84 -95 -83 109 124 71 103 23 -36 12 40
7350D0m2Q3O4k16J31q0k2P1m4Qr2J37R2k51L8Q4M1L9j35J2K7M2Pj18M3K3o1j1
$$ 40 -2 81 145 -71 60 -20 -42 29 -15 -7 -99 38 130 -121 -83 1 42 81 -54 -42 -15 27 34 -84 -41 -18 -79 -90
7378i0m3P0J6j01J12l1J48j21N9J4p6O6k26L11j00m6J23L8j03M2o4m7N1j21J41
$$ -90 -133 -63 -47 -148 -36 -67 81 -40 19 33 -43 23 -203 108 8 -38 85 123 20 62 -2 -49 2 -119 22
7403B2M2j49R9k6J86j46m4j23J20K6j31M4J27j73J93j4j21J17j1o8J55j00k7o0
$$ 22 64 -85 14 -12 174 28 -16 -139 -19 7 -124 -80 47 -126 67 53 -68 49 38 -30 125 25 -2 -62
7427f2J88J1j92j30jJ85N6m2l0L3J8jK9q9n7J54p5RRL0l3mk5Q5n2J01j54j46J50
$$ -62 126 137 -55 -185 -186 -1 55 13 -17 16 34 33 62 -27 -84 70 -5 4 13 43 10 6 -19 66 14 115 -39 -185 -35
7456c5j7N9j1q1P1m1J7j30O7J10K2J21j97m0jJ23r7m3J16Q0j42L2L3Qj80J58N
$$ -35 -52 7 -4 -85 -14 -55 -38 -168 -101 9 31 152 -45 -85 -86 37 -60 -103 13 93 -49 -17 16 24 -156 2 7
7483Gm9J53q0Q7j88J70n1n5J8o1Mk6L8l1J64r4mj6M1l7n2N6j23K2o9J38O5j80
$$ 7 -42 111 31 118 -70 100 49 -6 12 -49 -45 -71 -33 -64 100 6 2 -14 27 -10 -62 -6 -129 -107 -176 -38 27 -153
7511a53J05l6P1JQj02J61o6r1Q9O5j95J54M1q8m0J69n4l8J04k56O0Q7L3K9j0k5
$$ -153 -48 -84 -13 -12 -4 -106 55 -11 -102 -13 52 -143 11 52 -36 -76 93 39 1 105 -151 -91 -4 29 58 48 23
7538B3q9J18l6L4rj28K15J5j69M5k4j2J5o5R6j10p1J41l8J0n7Q9n8J28o0L8L9
$$ 23 -66 52 16 50 41 -87 128 143 -26 19 -5 -17 -2 -67 29 -81 -152 -11 -49 -39 -96 -7 -65 63 3 41 80
7565H0r5J33j17q7J01m6J03j52N7l7l8J15q3J63j83O4r0Q5P6m2J00m2P9j39J4
$$ 80 -15 118 1 -86 15 -31 72 -80 -23 -60 -98 17 -66 97 -86 -22 -112 -27 49 7 107 65 144 5 19
7590A9j70J73J08j11j0m4P6q7mM4J1nJ42j87K2p9P3P9j57j7K50r8j38N4k6J80
$$ 19 -151 22 130 19 9 -35 41 -46 -50 -6 5 0 142 -45 -23 -102 -29 50 -107 -124 126 28 -110 -56 -82 98
7616I8j38P4q8m3J85N2r3j26P5L2kr0J94j60q5J24P6jo4O6p3j04R3K2j5Q6j42
$$ 98 -40 34 -54 -97 88 140 47 -79 -4 28 26 -64 130 -30 -115 9 85 84 20 86 13 -91 2 24 9 95 -47
7643d7M1n1J38j04mM3Qj32RJ16j1n2P6j4J7q7n7J09o0j0M3J15j01O7j1k7m4J64
$$ -47 -6 -57 81 -23 -27 16 24 -108 -99 17 6 -46 30 16 33 -54 -111 -2 -62 -72 -29 86 -15 52 41 14 -30 134
7671A34j21OK11m12J17K2M0j4rK6L6Q3m7o5j1j07K10j21r6J86j38OR0p1O7p2L
$$ 134 13 19 230 -182 -65 -43 -3 -17 -26 0 36 119 72 7 -4 -111 99 -22 -118 68 -70 -64 26 -45 22 -50 -47
7698d7J68j66R1%L4o5j3k0Pm5M1J08j05J04l0j6K6n5o2P8j9m5j0PP1n2J1L8j62
$$ -47 121 -45 46 46 80 15 2 -18 -11 -56 -15 93 -12 92 62 46 72 17 -45 33 14 -31 -41 -34 37 -15 -4 34 -128
7727a28J42k3R0l2K3q3J5M9n5j14J08j9L4j08P6%J03M4k97J57K2o2j1j2R6j05
$$ -128 14 -9 81 49 72 -11 4 53 -2 -116 -8 -27 7 -101 -25 -25 78 122 -175 -18 4 -58 -69 -81 15 -90
7753i0R9mR4n9K8k2K6m7l6j10J86k8o0rJ94j62oL4j59J10J4M0j1j81K16m8o6J74
$$ -90 9 5 99 40 68 46 72 25 -11 -121 65 37 -23 -32 162 0 -6 28 -131 -21 -7 33 22 -159 57 9 -57 117
7781A17kj37jM2JP3j72M8P5O2j78P7p5l8J39j7M5J0o8J47j20k4Q2j30l7L5N4j45
$$ 117 115 -22 -23 19 20 93 -79 -31 44 106 -72 5 -70 -108 31 14 59 69 1 148 28 4 86 -44 -81 -46 8 -137
7809a37J90lj38O1l5J38Kj05K79k33l6j0J0R4o5J5L4q0M6m5N8L7m6M7j23M5m0
$$ -137 53 50 -88 -27 -62 76 78 -27 252 19 -17 -27 -17 77 12 27 61 -19 27 -18 40 77 31 78 -45 0 -40
7836d0L8j36J79j22L0R8j05M2L3K0m8k4N0j11J42n0Q1j44k8J3K35k40m0R8n4J73
$$ -40 -2 -138 41 -81 -51 47 -58 -16 17 37 -11 -35 15 -96 46 -4 77 -67 -95 -82 153 -87 -127 -29 -83 90
7862I0k75J61n8K5l0M9M8m4L4J47p2r2N2n6Q1L0p8p6l9J21O3n2M0j72L4N8J0k1
$$ 90 -185 -24 -82 -57 -87 -38 10 -34 0 147 75 -17 35 -21 60 90 12 -64 -103 18 81 29 69 -103 -69 -11 -1 -22
7890b2Ok6k8J50k8l3p1rL4P4n0J21N5N2k87J87k9j60K5J67k22Q1R0o9J22q6qk23
$$ -22 -16 -42 -70 80 52 19 -52 -61 -27 47 -3 118 173 225 -62 125 96 -64 -39 128 -94 -13 77 8 130 44 36 -187
7918a87K22j03J11k3o3O9Ljn2n2Q8L8J2l2NP1j76M5N9J9LLl9j58J48r4J01n3J2
$$ -187 35 -68 43 20 -43 26 29 28 -24 -76 12 50 62 30 35 106 -70 -25 34 53 56 59 20 -138 10 -84 17 -36 -24
7947b4KJ62q9op9P9Rj70R1J19k3p2N6j65J42kN9j96M5N6l4L6jJ3kJ1MK3j18Q5
$$ -24 -22 140 51 45 -34 45 54 -116 -25 94 71 -1 55 -110 32 30 89 -107 -62 -6 -40 -4 -5 8 6 17 21 44 -74 11
7977A1j3K6J0o1j5J46j49O4j33J03L4p6O0J5k8o6Q2N3j35l8J10n0n1J52M2r2p8
$$ 11 -2 24 34 -27 -42 104 -45 19 -114 -11 23 -53 7 22 -6 -72 10 63 -72 -110 0 -50 -101 51 93 1 -77
8004g7P2r7Q9L9n1o1M9P9n2r2P5j3n9o5R2N6J48j70J13n9q4J02j77J38l9L2J0
$$ -77 -5 -102 -13 26 -25 -86 -37 42 -10 -102 -27 -40 -99 -164 -72 -16 132 -38 75 16 -68 34 -143 -5 -44 -12 -2
8031br1R3o6L8J04k00J04j1M7r5O2O5jm3KR1j15l3m2l4J23N2n3p1K7Q8q8K3jK3
$$ -2 -93 0 -66 -28 76 -124 -20 -31 16 -79 -17 48 47 4 6 97 -18 -51 -93 -127 -4 48 -5 -76 -49 39 -49 -26 -27 -4
8061dk1j5o7K05j80J09oK8j75J71j70J91k1k46L21m9j40K0Q4L1j12k5J87p5k8
$$ -4 -25 -40 -107 98 -82 27 21 49 -126 45 -125 66 45 -201 120 71 -69 -49 35 66 -46 -71 116 41 13
8086A3q6J79q8r8J00j27J23jL5k2k9KR2p9m1J00k13J54Kr9J07j71J19L6R9j75
$$ 13 -73 106 18 -80 20 -107 16 15 50 28 -1 1 93 14 -27 73 -140 14 16 -83 24 -147 -28 8 107 -68
8112f8J21k73J81%J8J64j82q7J04O7J3k8L4PJ42k87R4J7o9L9j7Q6j33J2J84r9
$$ -68 53 -220 -39 -39 -21 143 -39 -126 -22 45 58 30 64 71 213 -74 20 37 -32 7 -10 76 -57 -45 139 40
8138D0l9Nj03J47m5Q8K6j17j21J78J5J2j42N7j8p5P1j10J48m5N0o8J42q4o7KK3
$$ 40 1 6 -97 50 5 93 119 2 -119 59 74 86 -56 1 -17 -92 -21 -131 17 -28 22 -46 96 12 -55 -53 -30
8165c0K9MlN0Q7j88N0m0k1L1J27o1K5j19O4k3OQ6K0j44J46j41k4P8j17O5
$$ -30 -1 3 0 50 137 -51 -1 -41 -62 -31 96 35 60 -59 5 -18 -12 74 94 -50 96 -45 -69 9 -108 -43
8191d3
$$ Imaginary data points
##PAGE= N=2
##DATA TABLE= (X++(I..I)), XYDATA
0@%%%%%%%%%%%%%%%qJ6j6J6j6J6k4L2l2L8m6M8n6O8p6Q8j03J15j28J45j65J84
$$ 0 0 0 0 0 0 0 0 0 0 0 0 0 0 0 0 -8 8 -8 8 -8 8 -16 16 -16 22 -24 24 -32 36 -40 48 -55 60 -68 77 -88 96
37I6k04K30k56K83l14L49l88M28m71N19n74O35o98P68q46R33j030J137j261J403
$$ 96 -108 122 -134 149 -165 184 -204 224 -247 272 -302 333 -365 403 -443 490 -540 597 -664 739
57G39j564J754j980K250k581L003l565M340n477P322j0784J9366p7005j11596
$$ 739 -825 929 -1051 1199 -1382 1621 -1944 2396 -3081 4241 -6543 12823 -64182 -175778
71a75778K41345P2620j89550n3923J54069J3531j17234J2306R0990k2502n2297
$$ -175778 65567 138187 -51363 -105286 48783 62314 -54920 -42614 48376 25874 -26423
82b6423m263J6362L5569K4428n6451o0725N8449Q5625n9065p6054N5524M3941
$$ -26423 -30686 -14324 21245 45673 -10778 -71503 -13054 72571 13506 -62548 -7024 36917
94C6917n1707r898M8559o893m6812J5553K9740j9274Q364J9990n0529j9613P4831
$$ 36917 -14790 -24688 23871 16978 -29834 -14281 15459 -3815 4549 24539 -25990 -45603 29228
107B9228K6024p7665l0741O7751K1686m9305L43K6464j4323r298J0144L021P366
$$ 29228 55252 -22413 -53154 14597 36283 -13022 -12679 13785 -538 -9836 308 3329 10695
120A0695L834k8886k0999N3172L8881p2601m0374P6769K4711o8821n21O3998k8090
$$ 10695 14529 -14357 -35356 17816 56697 -15904 -56278 20491 45202 -23619 -24140 39858 11768
133A1768o5123N7406N8818p4744l8522P3793J0793o5074J6450O1817m3038n9806
$$ 11768 -53355 4051 62869 -11875 -50397 23396 34189 -30885 -14435 47382 4344 -55462
145e5462O0091M8965n8382l0271L9668J1025k0903O537R528k2133J138K5955j6922
$$ -55462 4629 53594 -4788 -35059 4609 15634 -5269 1268 10796 -11337 -10199 15756 -1166
158a166j3202L2186o173m4280J7645N3974k1356n8518K5204M8353k9882k5325
$$ -1166 -14368 17818 11645 -32635 -14990 38984 17628 -40890 -15686 32667 2785 -22540
170b2540K9798M921k8267M550K6691p800j9245J0099O01q616K0473L372l0352
$$ -22540 7258 12179 -16088 -11538 15153 7353 -11892 -1793 -1192 -9808 10665 14037 -16315
183a6315l40K8913r34k3465Q653J6702k2838o550L1898j396k8680L529J8919m197
$$ -16315 -16655 12258 11324 -12141 -3488 13214 -9624 -16174 15724 14328 -14352 -10823 8096 3899
197C899q218J1195m621j8272J7991J6287k4827m395K4523q743k5765K1515L1583
$$ 3899 -4319 6876 2255 -16017 1974 18261 -6566 -10961 13562 4819 -20946 569 32152
210C2152l4433l2824M1992K5453l9134j4638L1381N746k6995K104K5252r102j7325
$$ 32152 -2281 -35105 6887 32340 -6794 -21432 9949 15695 -11300 -9196 16056 6954 -10371
223a0371P582N055J404N545r435j3348J0666K0703j1525k3720J6209J6884k0620
$$ -10371 -2789 2266 3670 9215 -220 -13568 -2902 17801 6276 -17444 -1235 15649 -4971
236d971n804K0501n69j9541J983J7498n596r075J0369n922j2457J8250J1640k2344
$$ -4971 -10775 9726 9157 -10384 -8401 9097 3501 -5574 4795 -1127 -13584 4666 16306 -6038
250f038j2764K2571J2134k3869n362K2778l226j8121M947J4262o07j2282l882
$$ -6038 -18802 3769 15903 -7966 -13328 9450 6224 -11897 -6950 7312 6705 -5577 -9459
263i459P007P297K855j2829r999J8665R258k0124n070J9936K302k3413J687K8160
$$ -9459 -2452 4845 7700 -5129 -15128 3537 12795 -7329 -12399 7537 9839 -13574 -11887 16273
277A6273p373k6357J0275J8988q397j1600P490O628j0533j57J2044m704p608M255
$$ 16273 8900 -17457 -7182 11806 3409 -8191 -701 5927 -4606 -4763 7281 2577 -5031 -776
291g76J892p3Q06k21k692j518N695m58m721O276j379r938O841J1384p708j3404
$$ -776 1116 1043 1849 1628 -1064 -2582 3113 2655 -2066 4210 2831 -7107 -266 11118 3410 -9994
307i994Q411J4770j2512j0837J6349M228j6688j464J5978K751j6457k513J4079
$$ -9994 -1583 13187 675 -10162 6187 10415 -6273 -7737 8241 10992 -5465 -7978 6101
320F101n2p157k64J358K794j138l824K233M161j540q055K12J3898k348j5525M221
$$ 6101 6049 -1108 -1372 -14 2780 1642 -2182 51 4212 2672 -5383 -5171 8727 6379 -9146 -4925
336d925J2163l513r934L706R558q244p299J1308L221r288j742M889K382l527l28
$$ -4925 7238 3725 -6209 -2503 7055 -1189 -8488 2820 6041 -3247 -4989 -100 2282 -1245 -1573
351a573K570l983O70L973k492k05R20k761R47L100N85m129k282O701n96o082M685
$$ -1573 997 -2986 -2316 1657 -835 -1040 -120 -2881 -1934 1166 1751 -2378 -4660 2041 1445 -4637 48
368D8K873n452k315N614M657p501m116Q336Q18n263J270K264n45k801Q98L944
$$ 48 2921 -2531 -4846 768 5425 -2076 -6192 2144 2962 -2301 -1031 1233 688 -2113 -1215 2729
384B729j777k096L75m73L709L02n219J254L263l50k680q3N112k905n549N539M056
$$ 2729 952 -1144 -769 -1242 2467 2769 -2450 -1196 2067 1717 -963 -1046 4066 1161 -4388 1151 5207
401E207m549l617J869N186k194m414L540P83j734j34l41K260J06l408K54J814
$$ 5207 658 -2959 -1090 4096 1902 -2512 1028 1811 77 -57 -398 1862 1968 -1440 -1186 628
417F28K437j578n054K824L744k759j125J79R54L78j702J128K86r44J383k158j090
$$ 628 3065 1487 -3567 -743 3001 242 -883 -704 250 628 -1074 54 340 -604 779 -1379 -2469
434b469M223m6l346k335L249N088m802m569M443K732j553l363K26M758j382l637
$$ -2469 1754 1708 -1638 -3973 -724 4364 -438 -5007 -564 2168 615 -2748 -2522 2236 854 -2783
450b783O93K530K550l551m931M912N121l501n474Q83P729p33p991J858O020p06
$$ -2783 -2090 440 2990 -561 -5492 -580 4541 1040 -4434 -3551 4178 3445 -4546 -2688 3332 2626
466B626n158j038O971P04p224M89M664P24k496k343K755R48j716J533p35j609
$$ 2626 -2532 -3570 3401 4105 -3119 -2630 2034 2758 262 -2081 674 1622 -94 1439 704 -905
482i05J795O19p1j826l08L811j477l679K172K390n9l173j458M184J237k339k395
$$ -905 890 1509 1438 -388 -696 3115 1638 -2041 131 2521 2462 -711 -2169 2015 3252 913 -1482
499a482j008N673J987p720k346P414M240p808p410J0334Q143j1701q242J0544
$$ -1482 -2490 3183 5170 -2550 -4896 2518 6758 -1050 -8460 1874 10017 -1684 -9926 618
513F18R730r430j2286R958J1479r200r080N686Q161k767q239J639O360l68k993
$$ 618 10348 918 -11368 -1410 10069 869 -8211 -2525 5636 2869 -5370 -3731 2629 2261 -732
528g32l926J887P127j792p699o90Q282M233j0552n321J1503M360r406n213P964
$$ -732 -4658 -2771 4356 2564 -5135 -5825 2457 6690 -3862 -9183 2320 6680 -2726 -7939 25
543B5O956q443o175P692M346m489l898J291M818k98k929o87j97L782J270n879
$$ 25 6981 -1462 -7637 55 4401 -88 -3986 -2695 2123 1825 -1104 -1791 -1988 1794 3064 -2815
559b815q17N600K428n842m299Q204M295r804k388Q962J806p651j873Q144j32q178
$$ -2815 -3632 1968 4396 -1446 -5745 2459 6754 -3050 -5438 3524 5330 -2321 -4194 3950 3818 -4360
575d360M112O079o338l876O749M056q745l681J1450J274j2142J220J0470p19j0179
$$ -4360 -248 5831 -507 -4383 2366 6422 -2323 -6004 5446 6720 -5422 -4202 6268 5549 -4630
590d630L9J0256j225p873J682L290Q45n67l125j015L293L422l608p346O060R139
$$ -4630 -4591 5665 4440 -3433 -1751 1539 2384 1817 -1308 -2323 970 4392 784 -6562 -502 8637
606H637q074r438P508J0591o572j2851P171J2842p450j0633M726R904k656r920
$$ 8637 563 -8875 -1367 9224 2652 -10199 -3028 9814 2364 -8269 -3543 6361 3705 -6215
620f215K142Q451j605n586j000L863L468l698l235J441K711K407m337m147N503
$$ -6215 -4073 4378 2773 -2813 -3813 50 3518 -180 -3415 -1974 737 3144 -1193 -5340 163
635A63M491m770n725M298P833n729p886P159O081o346n068N528N079o512l044
$$ 163 4654 -116 -5841 -1543 6290 561 -7325 -166 5915 -431 -5499 29 5108 -1404 -4448
650d448P084j97n770K640M390l364m327M765M438p206k074P677k05n872M50M625
$$ -4448 2636 2439 -3331 -691 3699 335 -3992 773 5211 -1995 -4069 3608 3403 -2469 -2019 2606
666B606R6m617J094K825j919N15R06k704M32K980Mm084p58O078j47o622R95N371
$$ 2606 2702 -1915 -821 2004 85 600 1506 -1198 -766 2214 2218 -1866 -2624 3454 3307 -3315 -2320 3051
684C051j65m816j521N538J272m574j240J999L048p76m830O81M554Ql497k489M201
$$ 3051 2886 -1930 -3451 2087 3359 -1215 -2455 -456 2592 1816 -3014 -2333 2221 2229 -1268 -3757 444
701D44L289m672l182L151M155j225o445P69P940j109p545j67P636J651r119j353
$$ 444 3733 -939 -4121 -970 3185 1960 -4485 -3716 4224 3115 -4430 -4597 3039 4690 -4429 -5782
717e782R533K19p631j060O870J579o848n76N569l15k963j43J220J188q76q13K68
$$ -5782 3751 3970 -3661 -4721 2149 3728 -3120 -3696 1873 1558 -1405 -1548 -328 860 -16 -829 -561
734e61J77J542q81k199K492R37j938r3P26Q80j148m54J812j292p28K401r34j516
$$ -561 -384 1158 277 -1922 570 1507 -431 -524 202 1082 -66 -520 1292 0 -728 1673 739 -777
752g77P19J529m7k716J181K741k148j530J707Q19l91j661N94J904j298o26K45
$$ -777 -58 1471 1424 -1292 -111 2630 482 -1048 659 1478 1087 -574 20 1924 626 0 245
769B45J78J239j616r87K291m01j185j44Q84Q43j740k56K039j271p79R33J19l40
$$ 245 423 1662 46 -941 1350 949 -236 -380 504 1347 -393 -649 1390 119 -660 273 392 52
787E2p20O58N72j471N16J025j444N05L17j71j20m18P09k13r41J254m46p54J084
$$ 52 -668 -10 562 -909 -393 632 -812 -307 10 -161 -281 -699 10 -203 -1144 110 -336 -1090 -6
806fl58l22L03j95N23r15J23J539j715k35J404l08l21o09Q08Q29j345L6J129q10
$$ -6 -364 -686 -383 -578 -55 -970 -847 692 -1023 -1258 146 -162 -483 -1092 -284 545 -800 -764 365 -445
826d45L96m35p5R45m04l11m7L2J476j096j205J691K33p73j79R2J429j153r55J319
$$ -445 -49 -484 -559 386 -18 -329 -376 -344 1132 36 -1169 522 755 -18 -197 -105 1324 171 -784 535
846E35Q6j88l77m72J447j22j356R68j28K28l33p36J445k10j187P58M49m08l92
$$ 535 621 433 56 -416 1031 909 -447 521 393 621 288 -448 997 787 -400 358 807 399 7
865Gq1J267j094j076J955l97j064K11M52Q52j437o53J771l12r30M0K09J150j004
$$ 7 -74 1193 99 -977 978 581 -483 -272 180 1032 -405 -1058 713 401 -529 -489 -280 870 -134
884a34j284J723L08q16q49K76J919r86k055J756J239j193j381N93K385j478k107
$$ -134 -1418 305 613 -203 -1052 -776 1143 157 -1898 -142 1097 -96 -1477 -884 1501 23 -2084
901b084K129J086j276j099M54J846q83j595J190P04k15o47o60J743L6j807M86
$$ -2084 45 1131 -145 -1244 -790 1056 173 -1422 -232 472 257 -390 -1050 693 729 -1078 -592
918e92J108K72r88j070K167J57j962O94J054k30q11k23J391n11j145J400j1q84
$$ -592 516 788 -200 -1270 897 1054 -908 -214 840 610 -201 -424 967 456 -689 711 700 -184
936a84N79l7K78n02l78J229n82m59L75j10O15m19j037J119N42r43n91M33J561
$$ -184 395 358 636 134 -244 985 403 -56 319 209 824 405 -632 487 1029 86 -505 -72 1489
955A489j298j727J969R95j594q64P53J490j193j243J471J32o35K88n73N18J64
$$ 1489 191 -1536 433 1428 -166 -1030 -277 1213 20 -1223 248 380 -255 33 -540 -22 142
972A42o53O8l11R22R0j539P98J076j231m1L30J16j44l48J010o35j145K009j13
$$ 142 -511 -443 -754 168 258 -1281 -483 593 -638 -679 -349 -233 -377 -725 285 -350 -1495 514 401
991D01j800L45J347K83j807l81K608m24j757M62P60O70p80j364J263R70o32j137
$$ 401 -1399 -1054 293 576 -1231 -1612 996 572 -1185 -723 37 707 -73 -1437 -174 796 164 -973
1009i73p5K583m99k967J410K114r52j924O20K352j003k088K019M42j433N83N38
$$ -973 -1048 1535 1036 -1931 -521 1593 641 -1283 -663 1689 686 -1402 617 1059 -374 209 747
1026G47l85m60O39P89j717J51J693j053p75J070n9m54j49Q61m58j355K195J04
$$ 747 362 -98 541 1330 -387 -236 1457 404 -371 699 640 186 37 898 440 -915 1280 1384
1044A384k906J024K630j106k927J068L584j745l765K555K481j723k140P48K299
$$ 1384 -1522 -498 2132 1026 -1901 -833 2751 1006 -2759 -204 2277 554 -1586 -838 1461
1059A461l96k369L23J487L32q74j670J598J460j764q37R57J022m16j607P55P87
$$ 1461 1065 -1304 -981 506 838 -36 -1706 -108 1352 -412 -1249 -292 730 314 -1293 -538 249
1076B49m92M87r42p23K219M8k010n69K375J198l533m61L806q47k549J028J811
$$ 249 -243 244 -698 -1421 798 846 -1164 -1733 642 1840 -1693 -2154 1652 805 -1744 -716 1095
1093A095j009j363J525M66k255J515J932l126o59L543J54l672l26M984r97n057
$$ 1095 86 -1277 248 714 -1541 -26 1906 -1220 -1879 1664 1818 -1854 -2180 2804 1807 -3250
1109c250K742L627k839k543K607J996k755j215L216o36k335J797Q39j667m27J663
$$ -3250 -508 3119 280 -2263 344 2340 -415 -1630 1586 950 -1385 412 1251 -416 -843 820
1125H20M28k132L34K139j273q68P29L4J64k83j69J6N7Q59o50j385J513P13j308
$$ 820 1248 -884 -550 1589 316 -552 177 211 375 92 -77 -61 -4 855 205 -1180 333 1046 -262
1144b62l71K78R50N6j614J67J012R38j340k195K401K752l867j840L685J998m110
$$ -262 -633 -355 595 651 -963 -796 216 1154 -186 -2381 20 2772 -1095 -2935 750 2748 -1362
1161a362k191N002J210n237L16M276j150k837J198K229j842j205K725q41k271
$$ -1362 -3553 1449 2659 -2578 -2262 2014 864 -1973 -775 1454 -388 -1593 1132 291 -1980
1176a980K575R61k866l86L114J88l653Q90L625k484k336K947P83k202k71K377
$$ -1980 595 1556 -1310 -1696 1418 1606 -2047 -1157 2468 -16 -2352 595 1378 -824 -1095 1282
1192A282m89k482J981J662l017P9K477n90j806M56J996q61k000J960N84j590K00
$$ 1282 793 -1689 292 1954 -1063 -984 1493 903 -903 -447 1549 688 -1312 648 1232 -358 -158
1209a58P14q7j91j09K21l44L01M29j247N64J186j686n3J474l20j319K74J940j266
$$ -158 556 469 278 169 390 46 347 776 -471 93 1279 -407 -460 1014 694 -625 -351 1589 323
1228C23k048K391R18k648qK156k51j879K96J925j312j083J966n43j151J240J97
$$ 323 -1725 666 1584 -1064 -1072 1084 833 -1046 -750 1175 -137 -1220 746 203 -948 292 489
1245D89j325k6J966n98k644J690K524l193j161L197M50k890m24L163m56l030J892
$$ 489 -836 -862 1104 506 -2138 -448 2076 -1117 -2278 919 1369 -1521 -1945 1218 762 -2268 -376
1262c76J811k236m42J518o8j050L61J155j207m65K009j054j333J821M11j655j21
$$ -376 1435 -801 -1243 275 207 -843 -482 673 -534 -999 1010 -44 -1377 444 855 -800 -921
1279i21J801j01k229J207J788k095o76K074j48j353J72J577o82j481J697L73j740
$$ -921 880 779 -1450 -243 1545 -550 -1226 848 700 -653 -481 1096 414 -1067 630 1003 -737
1296g37Q88O84p54l16P52J43j136M82J352j527n64J991n31j426Q45J046r98j192
$$ -737 151 835 81 -235 517 660 -476 6 1358 -169 -733 1258 727 -699 146 1192 194 -998
1314i98J669P11k368N37J886j228j101R73R44j199p66J669j89j375J179K11j212
$$ -998 671 1382 -986 -449 1437 209 -892 81 1025 -174 -940 729 540 -835 344 555 -657
1331f57N56O47o02q95J207R03k296J35K489j416j614J556J117j498j036J742O21
$$ -657 -101 546 -56 -951 256 1159 -1137 -1002 1487 71 -1543 13 1130 -368 -1404 338 959
1348I59k216O49J623j334o87J127K45p58l09J282m52r41J338k82j095P57O72q14
$$ 959 -1257 -608 1015 -319 -1006 121 366 -392 -701 581 129 -812 526 244 -851 -94 578 -236
1366b36l91J111J97j570N45J762j640j065J898L65j386k27J451J80j939P99J322
$$ -236 -627 484 681 -889 -344 1418 -222 -1287 611 976 -410 -637 814 994 -945 -146 1176
1383A176j215k50P01o1m37J12N02o41j95J148p29p01J267L8j127J38J084k73j333
$$ 1176 -39 -289 412 351 -86 26 528 -113 -308 840 111 -590 677 715 -412 -274 810 537 -796
1402g96P96J246j642l90J586j78j195rJ334l91j443J086P71j443M55N31n09K4
$$ -796 0 1246 -396 -786 800 622 -573 -582 752 361 -1082 4 775 -668 -213 318 -191 -167
1420a67M8K45n38J98Q76j080n92J625m16j261P24R25m44j323J112J077j738k75
$$ -167 -119 126 -412 -214 662 -418 -1010 615 199 -1062 -338 587 143 -1180 -68 1009 -729 -1004
1438a004J632o14q65M31P06k66q13P73L00j039O46J85o19M08K20n5m08J82Q13
$$ -1004 628 14 -851 -420 286 20 -793 -20 280 -759 -113 72 -547 -139 81 26 -382 -200 613
1457F13r68l05J336n11p82Q74L67l37q08Q79M78j199J13R11m18l30K75J53N3m26
$$ 613 -355 -660 676 165 -617 257 624 287 -521 358 836 -363 -250 661 243 -87 188 341 394 -32
1477c2L52L8n34O64k42m30O94j02m58Q9L81J39r82K38J294j059m98Q84K27o51
$$ -32 320 358 -176 488 246 -184 510 408 -50 39 420 559 -423 -185 1109 50 -448 436 663 12
1497A2m40P60L63j141K38Q01p07q2L62n4j52k8J93j23m31O28j16n63N47J53m82
$$ 12 -428 332 695 -446 -208 593 -114 -196 166 112 -40 -68 125 2 -429 199 83 -480 67 220 -262
1518b62r3J71N03q37K6Q41o35k79N82j5k25l17L49M99p67r0N99l33Q5j72J79M17
$$ -262 -355 -184 319 -518 -492 349 -286 -565 17 2 -223 -540 -191 308 -459 -549 50 -283 -198 -370 -191 226
1540B26l46k72L09J30J46p16K8J183o92n68N13L64j22o37J99R80q71k09P35k13
$$ 226 -120 -392 -83 47 193 -523 -495 688 -4 -572 -59 305 183 -454 -255 725 -146 -355 380 167
1560A67k18k6K35J24m30J79L33m71M10k3j86J85k01J09M2l70L47J04m94M56n7
$$ 167 -51 -77 158 282 -148 31 364 -107 303 280 94 279 78 187 229 -141 206 310 -184 272 215
1581B15j98J03l9M15n59k23Q73k76n52K14K74J06o95K1Q81m80m49M01K34j1o99
$$ 215 17 120 81 496 -63 -286 587 311 -241 -27 247 353 -342 -321 560 80 -369 32 266 255 -444
1602d44N6Q67n87m36O65j54n1k78O7N36o08J34N34n28O6N2OL2k91K41L56n60R
$$ -444 -388 479 -108 -544 121 -33 -84 -362 -295 241 -367 -233 301 -227 -161 -109 -103 -71 -362 -121 235 -325 -316
1625c16L65j03j58M2K92Rl68K30L25n52L13q0%q7J04N08m87n23Q22L01r23j4O23
$$ -316 49 -54 -212 -170 122 131 -237 -7 318 -234 79 -1 -1 -88 16 524 37 -486 336 637 -286 -300 323
1648C23K01q13p6J162m48r43O86M39l01o20L21Q95r82j99Q15ko13J13L21J3m74
$$ 323 524 -289 -365 797 349 -594 92 531 230 -390 -69 826 -156 -355 460 458 -155 -42 279 292 -182
1669a82J67N30n40RM08k66j73l7J76J05m50M27N1p48N49J92k97j67J83L58l61
$$ -182 -15 515 -25 -16 392 126 -47 -84 92 197 -253 174 225 -523 26 218 -79 -246 -63 295 -66
1690f6m58N38J29o26J25K79K95n81l45Q54k5n68J0L73O0m18j27Q50k41n89M07
$$ -66 -524 14 143 -483 -358 -79 216 -365 -710 144 119 -449 -439 -66 -6 -424 -551 299 58 -531 -124
1711a24K86m00k09L37K97n98j2Q04m81j80L12J03j09n11L86M05n89J22M69m18
$$ -124 162 -238 -447 -110 187 -411 -423 381 -100 -280 32 135 26 -485 -99 306 -283 -161 308 -110
1731a10l6K12J07l5m49O26J4p23N89L03o02j09M03L20m56m43Q94K6o99K51K75
$$ -110 -146 66 173 138 -311 315 329 -394 195 498 -104 -213 190 510 54 -389 505 531 -168 83 358
1752C58m1m03lO26l09m34N02j01l5j69J1M95m67j73M56k44M4j63p0L57j94j83
$$ 358 317 -86 -89 537 228 -206 296 195 160 -9 2 497 30 -143 313 69 113 -50 -120 237 43 -140
1774a40K99j14k5J18l32L65k14j00J40j02R3Nj47J18o5Qrk62M05o5n16M96L27
$$ -140 159 45 20 138 -194 171 -43 -143 -3 -105 -12 -7 -154 -36 -101 -93 -102 -364 41 -24 -540 -44 283
1797B83n10n1O3L42l13m89P15P5o06K29L57k2l20kO13l65m20M21J50l33J33j15
$$ 283 -227 -278 -215 127 -186 -675 40 115 -491 -262 95 73 -247 -249 364 -1 -421 0 150 -183 -50 -165
1819a65K42j27j01K95j41r1K49l64J70K15j13k3j67L73l9l99K88J54k92J46o1
$$ -165 77 -50 -151 144 3 -88 161 -203 -33 182 69 46 -121 252 213 -186 102 256 -36 110 49
1840D9j7N7K6P1j07m5J45k8%j2l05K48Q2j04M1j1M5j3l09K46K56m85J26M9J89
$$ 49 32 89 115 186 79 34 179 151 151 139 -166 82 164 60 101 90 135 122 -187 59 315 -170 -44 5 194
1865A94k92k36N32j29m74N51o0k53Q5J32K3k27m6K37l10k0L39p1j88N4m0K56m24
$$ 194 -98 -334 198 69 -405 146 86 -167 -82 50 73 -154 -200 37 -273 -293 46 -25 -213 -159 -199 57 -367
1888c67K59L40n24K78K84k37k20J68K8l3k56K39J69l64J58k8J33K4k08J96k1j50
$$ -367 -108 232 -292 -14 270 33 -187 -19 9 -24 -280 -41 128 -236 -78 -106 27 51 -157 39 18 -132
1910a32J30J4K1J11j71N6K12j58R4j65L06j42k61L00J32l39N8J06L3j95n1L41
$$ -132 -2 12 33 144 -27 29 241 83 177 12 318 176 -85 215 347 8 66 172 205 10 -41 300
1932C00r0k34L84l19m6J73j1k08J47o1K21k27K5J54k72L3K33n4Nk43J99O4n53
$$ 300 210 -24 360 41 -5 168 157 -51 96 35 256 29 54 208 -64 -31 202 148 153 -90 109 173 -380
1955c80M75J29m00P3M7J3J53m47K94K25m22Q4J77j34J30k50J12K57l93J09j45
$$ -380 95 224 -176 -103 -56 -43 110 -337 -43 182 -240 -156 21 -113 17 -233 -121 136 -257 -148 -293
1976b93J90J03k83K70L5j57R5j84J94R3m56K89O0k99J56L2J46M8k30K02Jk32K01
$$ -293 -103 0 -283 -13 22 -135 -40 -224 -30 63 -393 -104 -44 -343 -187 -155 -9 39 -191 11 12 -220 -19
1999a9p9J9J45k41J84J72j75J39k20J40J00l3l9K0nO5k63K18J45m18J16L07j23
$$ -19 -98 -79 66 -175 9 181 6 145 -75 65 165 132 93 113 108 173 -90 128 273 -145 -29 278 155
2022A55k8k06J84N4k91J21K28j01k62K03J49q8j81L5K05j51J17j14R0K8k67J38
$$ 155 127 -79 105 159 -132 -11 217 116 -146 57 206 118 -63 -28 177 26 143 29 119 147 -120 18
2044A8R9k63N2Q9L7rl8L5r0m1L8J94k50J3M9J06o5p7J46j44n4L36l43j62J54J02
$$ 18 117 -146 -94 -5 32 23 -15 20 -70 -111 -73 121 -129 -116 -67 39 -26 -103 43 -101 -155 181 -162 -324 -170 -68
2070f8O7k63J69K83k88j73L72j35q5l7K21O5m47K93J85k24j04P7J69K9k67J37
$$ -68 -1 -264 -95 188 -100 -273 99 -36 -121 -158 63 128 -319 -26 159 -65 -169 -92 77 106 -161 -24
2092b4K18l05J78J29k11N9l8J64j19p8J71l7j69J93j35n4K31j49J96j81o2K69
$$ -24 194 -111 67 196 -15 44 6 170 51 -27 144 107 -62 131 -4 -58 173 24 220 39 -23 246
2114B46j04j14l6O2J51j96p9K91j65m5J02rj26j25J99J81m79n3L91O3k19j73K71
$$ 246 142 28 -8 54 205 9 -70 221 56 11 113 104 -22 -147 52 233 -246 -299 92 155 -64 -237 34
2137C4L24o42K64K24k01j65j2K94j38k53K08P5k29K06r5R2j20k6J36O2j00Q9r8
$$ 34 358 -284 -20 204 3 -162 -174 120 -18 -271 -63 12 -217 -11 -106 -14 -134 -160 -24 38 -62 27 -71
2160g1r2J40p1K1l4k56M33q9j34K79l6k28K7J66Q0j71j29K16P2l52K26%P3j46
$$ -71 -163 -23 -94 -73 -107 -363 70 -19 -153 126 90 -138 -111 55 135 -36 -165 51 123 -229 -3 -3 70 -76
2184g6N4K27l00o3M64j44j36M3Q1J43l82L2L29j00j63j6J28Qk85J83L16j56k23
$$ -76 -22 205 -95 -158 306 162 26 69 150 293 -89 -57 272 172 9 -7 121 129 -156 27 343 187 -36
2207c6J57j09J83l11K93J4k44K82l2j19k4mj08j6o9K25j56m0L34k25j42J15jJ17
$$ -36 121 12 195 -116 177 191 -53 229 197 78 54 50 -58 -74 -143 82 -74 -114 220 -5 -147 -32 -33 84
2231H4k66j9K39j20p6K56j48N2j68J33J65k47j45K96j92r1O7L4K22j40r6J41l7
$$ 84 -182 -201 38 -82 -158 98 -50 2 -166 -33 132 -115 -260 36 -156 -247 -180 -146 76 -64 -160 -19 -56
2254e6L9L4j95M02l90J06M0j97J26p3J49j3k01K41J07j89OJ12q0Q7r1Q3jl17L12
$$ -56 -17 17 -178 224 -166 -60 -20 -217 -91 -164 -15 -28 -229 12 119 -70 -64 48 -32 55 -36 47 46 -271 41
2279D1jk24L06M3o4r2N3J54l37R3M57k84k96L22K4k3l31K19J85m84J45L93k40
$$ 41 40 -184 122 165 101 9 62 216 -121 -28 429 145 -151 171 195 172 -159 60 245 -239 -94 299 59
2302E9j82O4Q7M0j76j0M06m07N7J34j77R0K27k81J01k03J77M5k80K94j70m4J66
$$ 59 -123 -59 28 68 -108 -118 288 -119 -62 72 -105 -15 212 -69 32 -171 6 51 -229 65 -105 -149 17
2325A7M3k09J46j12J39j62j2J50j54J44j04O1j6O4Q5k40m6M16k64j28K58nj71
$$ 17 60 -149 -3 -115 24 -138 -150 0 -154 -10 -114 -53 -69 -5 80 -160 -206 210 -54 -182 76 71 -100
2348a00P1J37j04k10N4M59l63r6M32k06j68k9L38j75l26L24K09l68j0K78q3K4
$$ -100 -29 108 4 -206 -152 307 -56 -152 280 74 -94 -123 215 40 -286 38 247 -121 -131 147 64 88
2370H8l6J11j29J7K25k26j09K43Q5l18M5J98l7l13Q3L24l23pL02k12j6M6j3M0
$$ 88 52 163 34 51 276 50 -59 184 269 -49 -4 194 157 -156 -73 251 -72 -79 223 11 -5 41 28 68
2394F8r6O3K0k71K74kk50L68n8k36R5r8J13j49j38N00k58l50M18K66l81j40K18
$$ 68 -28 35 55 -216 58 56 -194 174 116 -120 -25 -123 -10 -159 -297 203 -55 -405 13 279 -102 -242 -24
2417b4Q7k66R4J62k41l4K28m9o7k2L0R0k49K68ol38K69J63j88p9J71J18k86o6
$$ -24 63 -203 -109 53 -188 -222 6 -43 -110 -132 -102 -12 -261 7 1 -337 -68 95 -93 -172 -1 117 -169 -235
2441b35M52j07l74K85Q4j7k06J19J44l42J14L24l16K8J94j37%P1j71J52jN6M1
$$ -235 217 110 -264 21 105 88 -118 1 145 -197 -83 241 -75 -47 147 10 10 81 -90 62 61 117 158
2464A58l09K90J6k56K26J17p4l49J81K64k84l8K75j5k65M3J32m0l9L8K15n98L81
$$ 158 -151 139 155 -101 125 242 168 -181 0 264 -20 -58 217 202 -63 -20 112 72 33 71 286 -312 69
2487F9K15k41o0J70n4k53KK64Ll97M25L6l45L5K86j87j56K27K08l98n7L43r5j14
$$ 69 284 43 -17 153 99 -154 -152 112 115 -282 143 179 -166 -131 155 -32 -188 39 247 -151 -208 135 40 -74
2511g4m9L7L9p9J12o5j86L54j9k23O5J85k33J19P6J24l91k8M37L9l11J49l9p0
$$ -74 -123 -86 -47 -126 -14 -79 -265 89 70 -153 -88 97 -136 -17 59 183 -208 -236 201 240 -71 78 39 -31
2535c1p8K86j83j86J05L27k46j41L53k43jR0k6J57k45K86p1j16O1m3j51N8J20
$$ -31 -109 177 -6 -192 -87 240 -6 -147 206 -37 -38 52 26 183 -62 224 153 37 98 55 -96 -38 82
2558H2J06l26o0N15j91m44L08K38j44l6r1J98k98J30K23j82k0J50k76R7R5l6l5
$$ 82 188 -138 -198 317 126 -318 -10 228 84 48 -43 155 -143 -13 210 28 8 158 -118 -21 74 38 3
2581Cm0J02j19p8K75p0j79m9K82j82Np8L36j53k97K63q9j26J81m8p5J8J28O2j01
$$ 3 -37 65 -54 -132 143 73 -106 -155 127 -55 -50 -128 208 55 -242 21 -68 -194 -13 -61 -136 -118 10 72 -29
2606b9J59J1l35P1K29l00L4Q0J25k0l09L72J16m42J52m1J24r5n6L12j31k04L21
$$ -29 130 141 -194 -123 106 -194 -160 -80 45 25 -284 88 204 -238 -86 -127 -3 -98 -154 158 27 -177 144
2629A44j05J7j87K00o2n1J57n1N8j71k1J9K46q9j2m1Qj8K7l5J01J03k57J48J17
$$ 144 39 56 -131 69 7 -44 113 62 120 -51 -72 -53 193 104 92 51 59 41 68 33 134 237 -20 128 245
2654B45k87K20j45J10j29%M6n0l3J62j75j1J31m0n8m1J91n9l95K12L10k92P4j58
$$ 245 -42 178 33 143 14 14 60 10 -23 139 -36 -47 84 44 -14 -55 136 77 -318 -106 204 -88 -14 -172
2678a72K35p5j23K14p2j14j02K01k11P1J00n8lj35L22p8q0M1n4M6n7p6Q9P3%j9
$$ -172 63 -12 -135 79 7 -107 -209 -8 -219 -148 -48 -106 -109 -244 78 0 -80 -39 -93 -47 -104 -180 -91 -18 -18 -37
2704c7j12Q7K89l61J80qj47J94j71Q7O7q6J3Rk4P1k13J34J75j39m2J11r1J70k64
$$ -37 -149 -62 227 -134 46 38 -109 85 -86 1 68 -18 -5 4 -20 51 -162 -28 147 8 -34 77 -14 156 -108
2729a08J32J20k94J11O5M1p0m7J94l2k04J73N6p9l2j0j6Q2j19J70j21n3K24p9
$$ -108 24 144 -150 -39 26 67 -3 -50 144 112 -92 81 137 58 26 16 0 82 -37 133 12 -41 183 104
2753A04j10m9K4J24j28O3K12j81o1J12J0j53J09O0m4j93O1J03k41J58K5j17O4
$$ 104 -6 -55 -31 93 -35 28 240 59 -2 110 120 -33 76 136 92 -101 -40 63 -178 -20 5 -112 -48
2776d8l5L1J58l38J70J38k02K37l92K90N6j78J21j21J98j64j8K64j94p8J29r2
$$ -48 -83 -52 106 -232 -62 76 -126 111 -281 9 65 -113 8 -113 85 -79 -97 167 -27 -105 24 -68
2798f8k7L43k00m3J34j81J07np2J14j04P0K44k77K0ln1O2k83J77J41k95J21M0
$$ -68 -95 248 48 5 139 -42 65 60 -12 102 -2 68 312 35 55 52 1 63 -220 -43 98 -197 -76 -36
2822c6J17n9J3J07o7j47L58k69Q9l3j62J48J11j92M3J57k17LR7o8P1j41j2J25
$$ -36 81 22 35 142 75 -72 286 17 106 73 -89 59 170 -22 21 178 -39 -36 61 -7 64 -77 -89 36
2846C6K2J9j49OJ74k16O5m2r0L33k57J49p7J2n4L4l4J7l9K6J64k39J63M0j6j23
$$ 36 58 77 -72 -66 108 -108 -43 -85 -175 158 -99 50 -27 -15 -69 -35 -69 -52 -91 -65 99 -140 23 63 47 -76
2872g6Q1M6O5j48n8J10m3K1j17J77j73J1J79l6j34J82k27J27p8m8J45j27J82k4
$$ -76 5 51 116 -32 -90 20 -23 -2 -119 58 -115 -104 75 39 -95 87 -140 -13 -91 -139 6 -121 61 37
2896C7p6j10J32Nl6J16r6K03k08P0k4L4J08j79J7P3n8M5J57k25O5j06O8J32j14
$$ 37 -39 -149 -17 -12 -48 68 -28 175 -33 37 13 47 155 -24 -7 66 8 53 210 -15 50 -56 12 144 30
2921C0k4J1M9p0J03L0O1j87m0J66j66K05j69m5O9p9J03L5l7M1p4j56J44N6p9J04
$$ 30 6 17 66 -4 99 129 190 3 -37 129 -37 168 -1 -46 23 -56 47 82 45 86 12 -144 0 56 -23 81
2947H1l2j51K5P9J52k12j4J99j22j22R9j8M5k15J04K24k44Q0J01j7j69k4K57j15
$$ 81 49 -102 -77 2 154 -58 -72 127 5 -117 -18 -36 9 -206 -102 122 -122 -42 59 42 -127 -151 106 -9
2971in1L1P7j55L5O9J30j97J1J39j47q8K71j23m1K05r8M9j35%J32j32R0Q0k47
$$ -9 -60 -29 48 -107 -72 -3 127 -70 -59 80 -67 -155 116 -7 -48 157 59 108 -27 -27 105 -27 63 143 -104
2996a04N5L6j0K5m1K25j84J02n0k8M7J58k01p8K75j83m9P6m1K27k19o5K10j62
$$ -104 -49 -13 -23 2 -39 186 2 104 54 26 73 231 30 -48 227 44 -5 71 30 257 38 -27 183 21
3020B1K4J0m5k3j05J46J13l5j8N3q3q3k2J52j53j88L39m0k27K03N4j80K60k11
$$ 21 45 55 10 -13 -118 28 141 106 88 141 58 -25 -47 105 -48 -236 103 63 -164 39 93 -87 173 -38
3044c8p0J41j92K86k45J32p3J10j42R5l6J35k64J84p2K0n4L6J00j0q6K7l8J0L7
$$ -38 -108 33 -159 127 -118 14 -59 51 -91 4 -32 103 -161 23 -49 -29 -83 -47 53 43 -43 -16 -54 -44 -7
3069gK7on1m9K6J16PN7k60K13qk4RM7j89J88o5n2%K2J47m5j13j63J93qm7J44j05
$$ -7 20 14 -37 -86 -60 56 63 120 -140 73 65 41 50 97 -92 96 31 -21 -21 1 148 103 -10 -173 20 12 -35 109 4
3098DJ1j7J25p7q9J17j4j24J28q7N1k54K01K39k33r5K29K0j61m9K4O0J0J4L1j13
$$ 4 15 -2 123 46 -43 74 60 -64 64 -23 28 -226 -25 214 -19 -114 115 135 -26 -75 -51 9 19 33 64 -49
3124d9j4P2j0j35J19J34j47j40O6Q4RJ28j75O7L7r8l0J02o6m6J19j26j6P3R8j38
$$ -49 -63 9 -1 -136 -17 117 -30 -170 -104 -20 -11 117 -58 9 46 -52 -82 20 -46 -92 27 -99 -115 -42 56 -82
3150h2m8J54m5m3l0j14J47p0j83K64Q1j38N4R7%k43J71J96k60K3K51k70n1J24
$$ -82 -130 24 -21 -64 -94 -208 -61 -131 -314 -50 31 -107 -53 44 44 -199 -28 168 -92 -69 182 -88 -139 -15
3174a5P6P8k33rK87k55Q3Q9o8J5j89J35Oj10L25j38j09M2k6O5J12j22k0J03j74
$$ -15 61 139 -94 -103 184 -71 12 101 33 48 -141 -6 0 -110 215 77 -32 10 -16 49 161 39 19 122 -52
3199e2K44m8j68R5m6mk6j2J34j22q8J94j34N9P2j66L5j1o0K04j49J9M2n4N6m8
$$ -52 192 144 -24 71 25 21 -5 -17 117 -5 -93 101 -33 26 98 -68 -33 -44 -104 100 -49 -30 12 -42 14 -34
3225c4j9J02o1j37JJ35P7r3m6K48j86N0N4o1M1j38n0K17j16L7J04l89J63N6R5
$$ -34 -53 49 -12 -149 -148 -13 64 -29 -75 173 -13 37 91 30 71 -67 -117 100 -16 21 125 -264 -101 -45 50
3250E0Mj71K15l7j97K51K1k16jK24k87Q4Q5o1J4n4J10L1l9R8j80Q5o6nJ74j08
$$ 50 54 -117 98 61 -136 115 136 -80 -81 143 -144 -60 25 -36 -22 -76 34 65 26 124 -56 29 -37 -42 132 24
3276B4l0k3J17Op4o9J4M1j01J59j36Q0j9k25L42j54K8J20j60J38j94Q5l1J02n3
$$ 24 -6 -29 88 94 20 -49 -35 6 -95 64 -72 8 -11 -236 106 -48 -20 100 -60 78 -116 -31 -62 40 -13
3301a3O3j81P2RRq0J6N9k6l0K19n3l29K69N5j82J9r6J23Q0j98K16j9j34J73J16
$$ -13 50 -131 -59 -50 -41 -121 -105 -46 -72 -102 117 64 -265 4 59 -123 -104 -200 -77 3 -195 21 2 -132 41 157
3327A57j42o7j4Q5Kj61J21Q0O3k45RJ99k13K01j12N4m7J14k55J60K4j35J26L2
$$ 157 15 -52 -66 19 21 -140 -19 61 124 -121 -112 87 -126 75 -37 17 -30 84 -171 -11 13 -122 4 36
3351C6j4L0o2J34j40K6k4K3l5P3j20L5M5L7J08j86K90j27k79R3N1k1J34q9P0n2
$$ 36 22 52 -10 124 -16 10 -14 9 -26 47 -73 -38 7 44 152 -34 256 129 -150 -57 -6 -27 107 18 88 36
3377C6M4o4J1l9J96k35K78j87m2K1N7r1J68k30J1J21k17J10K7j2K3r9J12M6k29
$$ 36 80 16 27 -12 184 -51 227 40 -2 19 76 -15 153 -77 -66 55 -162 -52 -25 -37 -14 -113 -1 45 -184
3402a84J13J23k3J6j62M7J02K0p5L0j14jR1o5O1k9Q6k9j39J52j3j13P9QN9o6p4
$$ -184 -71 52 29 45 -117 -70 32 52 -23 7 -107 -108 -17 -82 -21 -50 36 7 -132 20 7 -106 -27 -19 40 -26 -100
3429a00N0M6J5L4j30R5J2no3r6M9J84j10jo1O8K1j12L2O3k3J36m1p0k3J19o4p6
$$ -100 -50 -4 11 45 -85 10 22 17 -46 -142 -93 91 -19 -20 -81 -13 8 -104 -72 -9 -32 104 63 -7 -30 89 25 -51
3457e1r0R9R6l3J73k62J85j58M2j4Qj02J80P7Qr4j68P0R8j14N1k12J61J00k2j05
$$ -51 -141 -42 54 21 194 -68 117 -41 1 -13 -5 -107 73 150 158 64 -104 -34 64 -50 1 -211 -50 50 28 -77
3483g7J8kON8k6K6M9K1O8k16Q5j0o6J73r7Kk4n3R9k32N4J15j5p9J04J17J1j21
$$ -77 -59 -61 -55 3 -23 3 52 73 141 -75 10 0 -66 107 10 12 -12 -65 34 -198 -144 -29 -44 -123 -19 98 109 -12
3511a2J20m5k29K16Qj62J04J54j73O3j48R0Q5q9j39J13l7M5J2J00j28rL2mK9P5
$$ -12 108 63 -166 50 58 -104 0 154 -19 44 -104 -14 71 -18 -157 -44 -81 -36 -24 76 -52 -61 -29 -33 -4 71
3537G1R5k18L4J29j18k0J62p0j61N9J81k10J51m3Pj21K10j23M6q4K41k05r1J42
$$ 71 166 -52 -18 111 -7 -27 135 65 -96 -37 144 -66 85 42 49 -72 138 15 61 -23 218 13 -78 64
3561F4j29Q8J1j08J47l7M0l7j06j20K61k17N2J56k8j09l1J10j5j00J06l8k4R3
$$ 64 -65 23 34 -74 73 36 76 39 -67 -187 74 -143 -91 65 37 -72 -103 7 -8 -108 -2 -40 -64 29
3585B9n9oj21J66l3j15J7O1M2q6N5q1N8n8M4J36j05J1J03k6j20n2J29J16n7k9
$$ 29 -30 -36 -157 9 -24 -139 -122 -61 -19 -105 -50 -131 -73 -131 -87 49 -56 -45 58 32 -88 -140 -11 105 48 19
3611A9mK0R1q2j62N5l6J54j48J73qN8q8Q7n0o5%m6j15K45m4J81k47J01j0j17J2
$$ 19 15 35 126 44 -118 -63 -99 55 -93 80 72 130 42 129 79 14 14 -32 -147 98 54 235 -12 89 79 -38 -26
3638b6lP7j23J02o5Jk8J04o5N0J33qk24M6J8K3q2J52J49k20n9Q9q3P1L2j18PJ38
$$ -26 -29 48 -75 27 -38 -37 -65 39 -26 24 157 149 -75 -29 -11 12 -70 82 231 11 -48 41 -42 29 61 -57 -50 88
3666H8k1n9q9J14N2r8N8l1o9M5j7P4j43mJ14k3n7L1m7M6J5pN7p8mM9n5P5n1j5
$$ 88 67 8 -81 33 85 -13 45 14 -55 -10 -27 47 -96 -100 14 -9 -66 -35 -82 -36 -21 -28 29 -49 -53 -4 -59 16 -35 -50
3696e0N4K5j5N1j41K9K3M0o2l2N4K0q2P8j01NJ11o7j0R6j64J86j1Q1pk94K56k5
$$ -50 4 29 14 65 -76 -47 -24 16 -46 -78 -24 -4 -86 -8 -109 -104 7 -60 -70 26 -138 48 37 118 111 -183 73 48
3724D8o0j5J82o5M6k0j9q6QJ02n2j54J75l1J2j42l6J82j02N4m0J41j25m4J11n1
$$ 48 -12 -27 155 90 136 116 97 11 19 121 69 -85 90 59 71 -71 -107 75 -27 27 -13 128 3 -41 70 19
3750A9p0L4J78k27J31q9j10J49k8j48L9K07j78M4N1k1M2%r7J23j01j23J81L3j08
$$ 19 -51 -17 161 -66 65 -24 -134 15 -13 -161 -122 85 -93 -49 2 -19 23 23 -74 49 -52 -175 6 39 -69
3775f9J62o0j08M6L8q9JJ9O2P8k03J85J29k37j2J27j83JJ09K9j17J14k7m0J46
$$ -69 93 33 -75 -29 9 -80 -79 -60 2 80 -123 62 191 -46 -58 69 -114 -113 -4 25 -92 22 -5 -45 101
3800A01m3J3p4j1L8Pnk11K86k56Q5J11n5J61k13O8J39k94J99j33K1J52K5p8k7
$$ 101 58 71 -3 -14 24 31 26 -185 101 -155 -70 41 -14 147 -66 2 141 -153 46 -87 -66 86 111 33 6
3825FM1j67K17j42K3L9o9J98j43qJ41j75N7j6L8J00q3j2P8j99P2Q8l2p8J19j59
$$ 6 47 -120 97 -45 -22 17 -52 146 3 -5 136 -39 18 2 40 140 57 45 123 -76 -4 84 52 -26 93 -66
3851f6J24j55p5J73j32K8R4r6J18j47l1%j41L39p0Jl3O2Q0j95L7K40k40P0k1l7
$$ -66 58 -97 -172 1 -131 -103 -9 -105 13 -134 -165 -165 -306 33 -37 -36 -69 -7 73 -122 -85 155 -85 -15 -36 -73
3877g3l0L6K0N5J0q8O1K7J16j66l1O8O5k8j01J25r8Om8R3m5o2N3j2R8O8j70R5
$$ -73 -103 -67 -47 8 18 -70 -9 18 134 -32 -63 5 70 42 -59 66 -32 -26 -74 19 -26 -88 -35 -47 51 119 -51 44
3905D4n0OJ9N1n8pj6mP8L0K2o6M9l9m1J16q1j22O9j7K38k36Q1l8j03R9O6j26J45
$$ 44 -6 0 19 70 12 5 -11 -15 63 93 115 49 98 59 18 134 53 -69 0 -17 221 -15 66 28 -75 24 90 -36 109
3934A09Qj27M3K1l6o5P1O0on9J13o3j05Q8j56J77k22J30P0q9l1J4j03J53qqJ20
$$ 109 117 -10 33 54 18 -47 24 84 78 19 132 69 -36 52 -104 73 -149 -19 51 -38 -69 -55 -158 -5 -13 -21 99
3961I9q6q4J29K4j46pJ7J15r7K9RJ1M0k06J60J9l6J8R9j37Q5j39R5Q4j07k8J92
$$ 99 13 -71 58 82 -64 -71 -54 61 -36 -7 2 13 53 -153 7 26 -10 8 107 -30 55 -84 11 95 -12 -40 152
3988A52j93Q6l3O5j05J65o7o4jq5J50o6M2P1n7M2k07O5J66j5Ln2j30J80j64J03
$$ 152 -41 45 12 77 -28 137 70 6 5 -80 70 4 46 117 60 102 -105 -40 126 111 114 62 -68 112 -52 51
4014E1K0j14k2K12j86O0k1Q8M5j41M5k70K81k6m4P7j79O3Q9j02k3O7n1N3P3j23
$$ 51 71 -43 -65 147 -39 21 0 88 133 -8 37 -233 48 22 -22 55 -124 -61 28 -74 -97 -30 -81 -28 45 -78
4040g8R6j8j54J96j34M9L4n0P3j00N2j41KJ66L4Jo6P6j32J82k1k7l5r7J01o5L0
$$ -78 18 0 -154 42 -92 -43 -9 -59 14 -86 -34 -175 -173 -7 27 28 -38 38 -94 88 67 40 5 -92 9 -56 -26
4067b6L9j0o4K9M2m5j6J17p9J5J6J3j16nJ59p7J11l4j32N8M8Qk7o4J27p0l2P%
$$ -26 13 3 -61 -32 10 -35 -51 66 -13 2 18 31 -85 -90 69 -8 103 69 -63 -5 43 51 24 -40 87 17 -15 -8 -8
4096hj7Q0N1j94J57N8n4o0J7P7k05J15o7jJ22r4P6k0m2K5m9J34j5j96L34j11j30
$$ -8 -25 55 106 -88 69 127 73 13 30 107 -98 17 -50 -51 71 -23 53 33 -9 16 -33 101 86 -110 224 113 -17
4123a7Q5l2r0M8o0J48j22K8j56M6J30n2J41j87L0Q5j06M5Lj5K3p3Q5K9j6M6m1
$$ -17 68 36 -54 -6 -66 82 -40 -12 -168 -122 8 -44 97 -90 -60 25 -81 -36 -33 -48 -25 -98 -13 16 0 46 5
4150Ej73P6O3j5K6R4r6P0j8n9J28r4l8O7n3N2N2k8q5m8J4J16k1k2J1k9Q8k6K8
$$ 5 -168 -92 -29 -44 -18 76 -20 50 32 -27 101 7 -31 36 -17 35 87 59 -26 -74 -60 56 35 13 24 -5 83 57 85
4179H5N8j43M4j6M0M2j21p4J07M2j36J04q4l8k1O7L3Okp0R6J27p7j19j2M5j1L5
$$ 85 143 0 44 28 68 110 -11 -85 22 64 -72 32 -52 -90 -111 -44 -11 -5 -7 -77 19 146 69 -50 -62 -17 -28 7
4207Gk1P5r6PJ08m0Kj7mj8pOm3J4n1k4N9KJ03j29j0R1p2J65r5m9L5Lq4L0O5O8
$$ 7 -14 61 -35 -28 80 40 42 25 21 3 -4 2 -41 -27 -78 -102 -43 -41 62 -67 -77 14 -58 107 12 -37 -2 1 -83 -53 12 80
4239H0j14m7J9Q5j56Q7L5o0N0l1J0J8M9k1n8J81j45M0p3j5o3M4OJ63n2j15J89
$$ 80 -34 -81 -62 23 -133 -46 -11 -71 -21 -52 -42 -24 25 4 -54 127 -18 22 -51 -66 -129 -85 -79 84 32 -83 106
4266A06o9L5j68J2J63j92K52j52k7K36j11j1k1o1j03O4RJ74j2j79M8N5o8p2R4
$$ 106 37 72 -96 -84 79 -113 139 -13 -40 196 85 74 53 -8 -111 -47 -38 136 124 -55 -7 48 -20 -92 2
4291BRp0M1J53k11J08p8P6j90J34k6J04j03L5l9r9K52q9m1J3%k7Q3p1J5n9j8J45
$$ 2 11 -59 -18 135 -76 32 -46 30 -160 -26 -52 52 -51 -16 -55 -154 98 9 -32 -19 -19 -46 37 -34 -19 -78 -96 49
4319D9p7J30j18j40J42n3P6j5n3RR0o6N8n7j73K25OM9K3j70J43m2M3p1QQO6jp8
$$ 49 -28 102 -16 -156 -14 -67 9 -6 -59 -50 40 -26 32 -25 -198 27 33 82 105 -65 78 36 79 8 16 24 90 89 11
4348A1lj23J89q0jkk1Q3j89J60l5n5J14k3j02J39j29K1J47m0j50J26p7p1J54o8
$$ 11 8 -115 74 -6 -7 -9 -30 53 -136 24 -11 -66 48 25 -77 62 -67 -46 101 61 -89 37 -40 -111 43 -25
4374b5M1j31P2K5R0N9j61l5Km4R8R4k62K69j33P1P2m2j89K16o1P1j36j93K04K9
$$ -25 16 -115 -43 -18 72 131 -30 -65 -63 -107 -9 85 -177 92 -41 30 102 60 -129 87 26 97 -39 -232 -28 1
4400AJ42p6L5j18j27J33J17j80J14q9J04j19nj57K38j13R8J78r2J1j48Q5K7m8
$$ 1 143 67 102 -16 -143 -10 107 -73 41 -48 56 -63 -68 -225 13 -100 -2 176 84 95 -53 32 59 11
4424A1m6P6q8RRk3oo6J35K6p0j6K4P7l6lm9Q1j8k4jPQ8np4J59k46L8M2r6J51l0
$$ 11 -35 41 -47 -38 -29 -52 -58 -124 11 37 -33 -49 -25 52 16 13 -36 45 27 3 2 9 97 92 18 177 -69 -31 11 -85 66 36
4456C6m7P7o7J0o6J01m6j6k9N3j2Q2o1o8J57j60L7l6M4j06K09J05j25k7L0o1j54
$$ 36 -11 66 -1 9 -57 44 -2 -18 -47 6 -6 76 15 -53 104 -56 -19 -55 -11 -117 92 197 72 45 75 14 -140
4483a40J60J6j29J04P4p7j75J77l7N8r7M7O2j71R8k1J67k5j40N9j8Nr4J3J97j33
$$ -140 20 36 -93 11 85 8 -167 10 -27 31 -66 -19 43 -128 -30 -51 116 91 -49 10 -8 -3 -97 -84 113 -20
4509b0jM6J1L8j68o5J96K4j57L7oR3j3J06mo9j47J94Oj55J27p1Q3j90J15P4l7
$$ -20 -21 25 36 74 -94 -159 37 61 -96 -59 -65 28 15 121 117 48 -99 95 101 -54 73 2 85 -105 10 84 47
4536D7n1J06p0O5j18N1J9k8j33K15Pj3k8j63J22r5R1p6O3P9l1p3O7j18J98j00
$$ 47 -4 102 32 97 -21 30 49 21 -112 103 110 97 69 -94 28 -67 24 -52 11 90 59 -14 53 -65 133 33
4562C3j40O7kM1rm8k7J58n3Lm6k5jP7j2L5o8J02j93P2k7l8l4K25r7J5m1j64K04
$$ 33 -107 -40 -42 -1 -10 -58 -85 73 20 23 -23 -48 -49 28 16 51 -17 85 -108 -36 -63 -101 -135 90 -7 8 -33 -197 7
4591Gj6k9L3j5J7n6M4k1l3L8m4mJ4q3J20L1q8k9N4O6m8Q8j75J10o7J25N4k01K30
$$ 7 -9 -38 -5 -20 -3 -59 -15 -36 -69 -31 -75 -79 -65 -148 -28 3 -85 -114 -60 6 -42 46 -129 -19 -86 39 93 -108 122
4620A22n8q4k8J27p2pL3R0r0N5p7j7mj1lJ01m2J2j07k8L2J96j02N0Rl9o4M4J0
$$ 122 64 -20 -48 79 7 0 33 123 33 88 11 -6 -10 -21 -24 77 35 47 -60 -88 -56 140 38 88 97 58 -6 38 48
4649D8j44JJ26Ok22J56l5Q5%j8K2k10J72N4l8k7P2j13M5J74j33orN6J6j4q5p2
$$ 48 -96 -95 31 37 -185 -29 -64 21 21 3 25 -185 -13 41 3 -24 48 -65 -20 154 21 15 6 62 78 64 -21 -93
4677i3O5K3p3O0RjK3k2J9P9j7k51M3M1L3J61q0L4r2p0R1q0j3J25q3N4r3k0Q5L2
$$ -93 -28 -5 -78 -18 -9 -10 13 -9 10 89 72 -179 -136 -95 -62 99 19 53 -39 -109 -18 -98 -111 14 -69 -15 -108 -128 -43 -11
4707a1M6R7k92K35k2l1Q3m9p7K4j25K53j25J1J45k08L9L0q5K37j12r6O0j11LJ75
$$ -11 35 132 -160 75 53 22 105 56 -21 3 -122 131 6 17 162 -46 -7 23 -62 175 63 -33 27 -84 -81 94
4733I4j12J5l8l9J00r7N3J08Mj15J02k51K04k2K6o3k5P9j6m5J00p0L1j14p3K52
$$ 94 -18 -3 -41 -80 20 -77 -24 84 88 -27 75 -176 28 6 32 -31 -56 23 7 -38 62 -8 23 -91 -164 88
4759H8l50K11P1p8qP1r9M5K4L1j5j21J37O6l6l6k0J04j16J28j57J27j13n8J06
$$ 88 -262 -51 20 -58 -66 5 -94 -49 -25 6 -9 -130 7 73 37 1 -19 85 -31 97 -60 67 -46 -104 2
4784Bn1n4K5j4J17m1MJ73k60J31l4j9J78p9o4j20K4J93j50o2Q0LM7r9P5N2k2K4
$$ 2 -49 -103 -78 -92 25 -16 -12 161 -99 32 -2 -21 157 78 14 -106 -82 111 -39 -101 -21 -18 29 -70 5 57 35 59
4812E9k5m6O4K6%J2m9NL0k7np7Q6l6k7R9JLr2J09k92J83m7L7n0K0J09J2j77J44
$$ 59 34 -12 52 78 78 90 41 46 76 49 44 -33 53 17 -10 89 90 93 1 110 -182 1 -46 -9 -59 -39 70 82 -95 49
4842D9j2j44J21j32J83j51N4o4m8J13L3p4J16r1P6J13k08rQ6O8l8l6k0P5k0n7
$$ 49 37 -107 14 -118 65 -86 -32 -96 -144 -31 2 -72 44 -47 29 142 -66 -75 11 79 41 5 -15 60 40 -17
4868a7K6k1k5M9mM5j42j29J91p0J79j26L8P7J7q4K5N6L1j36J6N5j7r4N1j0J99
$$ -17 9 -12 -37 12 8 53 -89 -218 -27 -97 82 -44 -6 71 88 4 29 85 116 -20 -4 51 34 -60 -9 -19 180
4895A80j06L2j88R9k1J51k01J12KqL5j64k3R6M9l5k6%l5O1M1KQp8J20q3m2K0q5
$$ 180 74 106 -82 17 -4 147 -54 58 60 52 87 -77 -100 -4 45 10 -16 -16 -51 10 51 53 61 -17 103 20 -22 -2 -87
4924h7R5l4M5k0O6J07j07j03l6M0M5k5J08qj49R0k2j29R8L2r1J41p0o0J78k49
$$ -87 8 -26 19 -1 65 172 65 -38 -74 -34 11 -14 94 86 -63 27 5 -124 -26 6 -85 56 -14 -74 104 -145
4950a45R4K9pJ7j31K65j65m0rQ9k6p1L6nJ32k8O9q0K5j04M0j13K40j21J39k44
$$ -145 -51 -22 -29 -12 -143 122 -43 -83 -92 -3 -29 -100 -64 -69 63 35 104 24 49 -55 -15 -128 112 -9 130 -114
4976a14K15m2l3M5j46P6K9M2N4j78O7pM0j4LO1j80J87j63j0J40n0J1k8J4K3j15
$$ -114 101 59 26 71 -75 1 30 72 126 -52 15 8 48 34 37 98 -82 105 -58 -68 72 22 33 5 19 42 -73
5003g3m4K27k25K63j88M6Q9q4K6J8p1K2J4l4K9Jp2l2J35o4p1Q7j06K6R6pn4l7
$$ -73 -117 110 -115 148 -40 6 95 11 37 55 -16 6 20 -14 15 16 -56 -88 47 -17 -88 -1 -107 -81 15 8 -46 -83
5031h3l0n1K5Q6J8M8j10m1P8R8p5M4p7J93l45L18j48n6J52q0K0J0n6J5J19k00
$$ -83 -113 -164 -139 -53 -35 13 -97 -138 -60 38 -37 7 -70 123 -222 96 -52 -108 44 -36 -16 -6 -62 -47 72 -128
5057a28J32J4m2K6l6M2m5l3j8J65j4r6MPl6L0j0l9J39k7l0K1kl2N0Q0q8j03R4
$$ -128 4 18 -24 2 -34 8 -37 -70 -88 77 63 -33 -29 -22 -58 -28 -38 -77 62 35 5 26 24 -8 42 122 34 -69 25
5086B5O3K8j26R4j48K43q0mJ0j3p3PMo1o8R4k8R4j11j9N6j77J34N8J23o6q7K4
$$ 25 88 116 -10 84 -64 179 99 95 105 92 19 26 30 -31 -99 -5 -33 61 -50 -69 -13 -190 -56 2 125 59 -28 -4
5114dn6j40J90j8M4M7k13J02J38j59P4M9j68N2j24J13J94k37Q2r9M6J70j22p6
$$ -4 -60 -200 -10 -28 16 63 -150 -48 90 -69 5 54 -114 -62 -186 -73 121 -116 -34 -133 -87 83 -39 -115
5138a15L1M6J0j17N2P9m5r3J43j00J22o0J77j50n5J5L9R2p0j65L1K10p7k9m8j5
$$ -115 -84 -38 -28 -145 -93 -14 -59 -152 -9 -109 13 -47 130 -20 -75 -60 -21 71 1 -164 -133 77 0 -29 -77 -92
5164i2N7rJ9Nm5J8N7K5l5L5k1K6j8M2m9j6P2qj4j16l9K13j08n0P7J0oJ0j3o8m
$$ -92 -35 -44 -25 -20 -65 -47 10 35 0 35 14 40 22 64 15 -1 71 63 49 -67 -106 107 -1 -51 26 36 30 40 27 -41 -45
5195d5j06N7J01L6j20J73p7q6R6k8j47K19n3j13J93k22J78j99J48j29O4j05K23
$$ -45 -151 -94 7 43 -77 96 19 -67 29 1 -146 73 20 -93 100 -122 56 -143 5 -124 -60 -165 58
5218E8j01qj2R5l5M8j21LJ4n8K24j72K2Q3j0p3N9k2O0j36R8j30J1J08o5MmL8M4
$$ 58 -43 -51 -63 32 -3 45 -76 -73 -59 -117 107 -65 -43 40 30 -43 16 -6 54 -82 16 -114 -103 5 -60 -56 -60 -22 22
5247B2L3o8K3Qr3J19k2j15J12M6j08J61j25RK0j41J79n6k5L2j10J66N3j64O3j35
$$ 22 55 -13 10 18 -75 44 22 -93 19 65 -43 118 -7 2 22 -119 60 4 -21 11 -99 67 120 -44 19 -116
5273a16J34p5O6L3q1N6J41m3j05k4LJ15p3r5K0J46j53Qj44K35r8mO3j20p0K12
$$ -116 18 -57 9 42 -39 17 158 115 10 -14 -11 104 31 -64 -44 102 -51 -43 -187 48 -50 -54 9 -111 -181 31
5299C1j47J11k3j02L1P6J72k64J17K1no6J59j84LJ46j13Q2J0o9P7k7o8L4n8J07
$$ 31 -116 -5 -28 -130 -99 -23 149 -115 2 23 18 -48 111 -73 -70 76 -37 45 55 -14 63 36 -32 2 -56 51
5325E1nj21P8J7p3R5q1J06j45jJ85j99J65q4K3J2j4Q1qo3P7j04r9J70o5r0Jl3
$$ 51 46 -75 3 20 -53 42 -39 67 -78 -79 106 -93 72 -12 11 23 9 90 82 19 96 -8 -107 63 -2 -92 -91 -124
5353a24J67m1O4q9R5o8R0o2m6Mj37J48J62j02j9kO1j2j5n4o1K03k00pO0L2o1J88
$$ -124 43 2 66 -23 72 4 94 32 -14 -10 -147 1 163 61 42 40 101 89 74 20 -41 162 -38 -45 15 47 -14 174
5381A74j85N1j17L0P2J8j65L3J23r7O0m4N8Opk7K4j48K09O8k22m5j3P6Q0M2n7
$$ 174 -11 40 -77 -47 25 43 -122 -89 34 -63 -3 -47 11 17 10 -17 7 -141 68 136 -86 -131 -144 -68 12 54 -3
5408cqk0Q5P6p9j62J07r8R6N1o8k0K3J07j64R2k4L7J1j45J14N3m4l6J1Pj38J72
$$ -3 -11 -31 54 130 51 -111 -4 -102 -6 45 -23 -43 -20 87 -77 15 -9 28 39 -106 8 61 17 -19 -8 -1 -139 33
5436C3m3P3k2J02j56k7N1q3M2J65o6m0k7r5j0J05J4K5jj4n0K55j67%n3M3ko8J26
$$ 33 -10 63 41 143 -13 -40 11 -72 -30 135 69 29 2 -93 -103 2 16 41 40 26 -24 231 64 64 11 54 52 -16 110
5465A10j99J16%p8j09J40J4n9J14%n5N5m9j24J93j68r8J39J5n7j3L5J23j66J75
$$ 110 -89 27 27 -51 -160 -20 -6 -65 49 49 -6 49 0 -124 69 -99 -197 -58 -43 -100 -113 -78 45 -121 54
5490E4k13J34J17n2M4l8n6Q7k2j16J55k20J43K5j64n5K03J0J2n9p8R2KJj29J59
$$ 54 -159 -25 92 40 84 46 -10 77 55 -61 94 -126 17 42 -122 -177 26 36 48 -11 -89 3 5 6 -123 36
5516C6J23j96mJ59p7mj25J39Qj34J07J10p7M8p9P3j38P6K7r2N0Rj4R4j42J8OK6
$$ 36 159 -37 -41 118 41 37 -88 51 59 -75 32 142 65 113 34 107 -31 45 72 -20 30 39 25 119 -23 -5 1 27
5544B7Q1Kl3j8q6O8j91K29j87K11r9p2J54nj83J63r5L3q7p3K24q1N9j21J56M6
$$ 27 108 110 77 59 -27 41 -150 79 -108 103 4 -68 86 81 -102 61 -34 -1 -88 -161 63 -18 41 -80 76 122
5570A22p0j35P7n2j7J27j8J9j07k4R1J65k09j7J8N5j82R0P0o4m3R6l9j57J97r
$$ 122 52 -83 -6 -58 -75 52 34 53 -54 -78 13 178 -31 -48 -30 25 -157 -67 3 -61 -104 -8 -47 -204 -7 -16
5596a6o1N8l4M2O2r7j65J91oN2k6M4k5q8J10JO1j42k1J6J08n6ol2J18j02J39j29
$$ -16 -77 -19 -53 -11 51 -46 -211 -20 -26 26 0 44 19 -69 41 42 103 -39 -60 -44 64 8 2 -30 88 -14 125 -4
5624dj05J47N1j63N8L6O1j04N2p7J48j96k1K23k58K19j4K6p8j1N9k27J26N9K9
$$ -4 -109 38 89 -74 -16 20 81 -23 29 -48 100 -96 -117 106 -152 67 53 79 1 -10 49 -178 -52 7 36
5649C6n2M0m3r6J08o9J62q0M1j34l5P9L1J24J1k31N3N9N5j21J13J5j37J07j51
$$ 36 -16 24 -19 -115 -7 -76 86 6 47 -87 -122 -43 -12 112 123 -108 -55 4 59 -62 51 66 -71 36 -115
5674a15J03m2N4m9N1J00l23K06J09j93l3J39Q1o8n5o6P6PR3R7k71N5O1N4j35r
$$ -115 -12 -54 0 -49 2 102 -221 -15 94 -99 -132 7 88 20 -35 -101 -25 -18 75 172 -99 -44 17 71 -64 -73
5700g3J39q7O4j6Q0k3m4r4K7R2p6P9k50J24k6K36q4j05j6J9LQ3m2p6J5J07r1O6
$$ -73 66 -21 43 27 107 84 40 -54 -27 65 -11 68 -182 -58 -84 152 68 -37 -53 -34 -31 52 10 -66 -51 56 -35 31
5728C1k2OO8r4J7oK1N6j44k0M3o8J30r9J6MN7o6J67q1p1J1N6M7kj5m3K8j13J20
$$ 31 9 15 83 -11 6 0 21 77 -67 -87 -44 -112 18 -81 -65 -61 -4 -70 97 16 -55 -44 12 59 57 42 -1 27 -86 34
5758C4K6N9q5j5q0Q0j72K04l9k2m6N7lm7k0o7M4R4j12n4J65p6J7J04L5j54P2l0
$$ 34 60 119 34 19 -61 19 -153 51 12 -10 -56 1 -2 -49 -69 -136 -92 2 -110 -164 1 -75 -58 46 81 -73 -1 -31
5786c1J38q1M7p1N7j6%r4rJ74j49R9o6J39k07R0qJ1L0L5m7O9m3j3m2Np1q5O1K5
$$ -31 107 26 73 2 59 43 43 -51 -60 114 -35 64 -2 137 -70 20 12 23 53 88 41 110 67 54 12 17 -54 -139 -78 -53
5816e3R8r1J13lj18M4q5J32O7K4o1q9n5N6q7Q2j9J37j42J7Q3Q1q9L2j49J2J52
$$ -53 45 -46 67 64 -54 -10 -95 37 104 128 67 -22 -77 -21 -108 -26 -45 92 -50 -33 50 131 42 74 -75 -63 89
5843H9l3M4j36p3R2K0Q9j23M2K3m3l1pO3Kj58M7J37o8Q2l0j38J68p2J03Pj72P2
$$ 89 56 100 -36 -109 -17 3 92 -31 11 34 -9 -40 -47 16 18 -140 -93 44 -24 58 28 -110 58 -14 89 96 -76 -4
5871dR8r8O4p3L3qj6J5j32R8K5J3J05k6n7K2L1L2m6j35M5J19k07J69m2P0j5r9
$$ -4 94 -4 60 -13 20 12 -4 11 -121 -23 2 15 120 94 37 59 90 122 76 -59 -14 105 -102 67 25 95 80 -19
5899a9%n1J56j12L1k3m3N0K7M1o7q2m4J53n3O1k0M8m2j5lr8J6M7Q4r5K11j85m4
$$ -19 -19 -70 86 -26 5 -18 -61 -11 16 57 -10 -92 -136 17 -36 25 5 53 11 -4 -7 -105 -89 -42 42 -53 158 -27 -71
5928g1J19j20J07j81J67p5p8J04J15n7k3q7J70j39oK4m3K5R3j02N4J33j36j54
$$ -71 48 -72 35 -146 21 -54 -132 -28 87 30 7 -80 90 -49 -55 -31 -74 -49 44 -58 -4 129 -7 -161
5952a61K02j64rQ5L2K2J01j47J05p4K6j23N8k6K8J9K4M1j21J33R3o2j36Q7j8J18
$$ -161 41 -123 -132 -47 -15 7 108 -39 66 -8 18 -105 -47 -73 -45 -26 -2 39 -82 51 144 82 -54 33 15 133
5978A33j0j71Q4n5J11o0N7l4k3k0k12K37j32J42j43J76q5J8k0J51j14q3n6J60
$$ 133 123 -48 36 -19 92 32 89 55 32 12 -200 37 -95 47 -96 80 -5 13 -7 144 30 -53 -109 51
6002E1j01J66j15Qj55J38j01m0K45Pj01l4N5j09p5J42Q3J2NQ8j34q0m6Q3Q7K0
$$ 51 -50 116 1 9 -146 -8 -109 -149 96 103 2 -32 23 -86 -161 -19 64 76 81 169 35 -45 -91 -8 79 99
6028I9j04lk5K86l10rJ40j43N7QMJ7o9p3J81j18j8J20M6j71J14n3L7Rj01J45q2
$$ 99 -5 -8 -33 253 -57 -66 74 -69 -12 -4 0 17 -52 -125 56 -62 -80 40 86 -85 29 -24 13 22 -79 66 -16
6055a6l2oP1r0O9n7P9j3j37k5J17N1p5O0R0k6q4P0q6l1K21j32o4O1j11N2jJ20
$$ -16 -48 -54 17 -73 -4 -61 18 5 -132 -157 -40 11 -64 -4 86 60 -24 46 -40 -71 150 18 -46 15 -96 -44 -45 75
6083G5m6J5m2K0j13J09r5J19j7j72J77j21N1M1p2J75j51M7P0lj27J05q1m8l8J1
$$ 75 29 44 2 22 -91 18 -77 42 25 -147 30 -91 -40 1 -71 104 -47 0 70 67 -60 45 -36 -84 -122 -111
6109a11J49j75Q0M4O5m4K9j43R6pm6K03j70L1j42K8J97r4J1K4l4n8Kj5M8qJ3O3
$$ -111 38 -137 -57 -13 52 8 37 -106 -10 -17 -63 140 -30 1 -141 -113 84 -10 1 25 -9 -67 -65 -80 -32 -40 -27 36
6137C6j04j3J08j58O9nM5J1r2J30j7k7p8o6J65q9K6J58j52Q5l4P4j25RK7j6J35
$$ 36 -68 -81 27 -131 -62 -67 -22 -11 -103 27 10 -17 -95 -161 4 -85 -59 99 -53 32 -2 72 -53 -44 -17 -33 102
6164A02j15J12q0k7J09k72L6L26k98J23o9L6J45j58J6K8j02J9%N2L6n1o9j5K48
$$ 102 -13 99 19 -8 101 -171 -135 191 -107 16 -53 -17 128 -30 -14 14 -88 -69 -69 -17 19 -32 -101 -116 132
6189A32j45O9l5j6n1M1O2j01K0j45J96n3Pj00K8K17l3J06k67k6R7k7mj5L2k6J16
$$ 132 -13 56 21 5 -46 -5 57 -44 -24 -169 27 -26 -19 -119 -91 126 93 199 -68 -94 3 -24 -28 -43 -11 -37 79
6216G9r7L3k5Q2j87K17j56L1N9j4M9r3j19J30Q3j5o0p5R9o7o8J17J4j33J72n5
$$ 79 -18 15 -10 72 -115 102 -54 -23 36 22 71 -22 -141 -11 72 57 -3 -78 21 -46 -114 3 17 -116 56 1
6242Aj6n0J29N4l7r0K9qJ2K3p4M8k6k6O9N6p1M8oK3j84M7K66j34j34J08l4m7j26
$$ 1 -15 -65 64 118 81 -9 20 12 24 47 -27 21 -5 -31 38 94 23 71 65 88 -96 -49 217 83 -51 57 23 -24 -150
6271a50J65J25k92J90r4K2N7K5N2j61J1N3j28L9K1J10R0P4k72J50j22m1P2r8J20
$$ -150 15 140 -152 38 -56 -34 23 48 100 -61 -50 3 -125 -86 -65 45 135 209 -63 87 -35 -76 -4 -102 18
6296A8K0o8J5j0R7k7n1M1Q9k15KJ42j08K4J36j39J44r5O9m8j5m7K4m6k5K9O3M8
$$ 18 38 -30 -15 -25 72 45 -6 35 124 -91 -89 53 -55 -31 105 -34 110 15 84 36 21 -26 -2 -48 -73 -44 19 67
6324F7r6k7N2j9Q0m4K5J52k72L9J7pJ24j2m8j03M0j00Q5R5j17J99N7k89K13k03
$$ 67 -29 -56 -4 -23 57 13 38 190 -82 -43 -26 -33 91 79 31 -72 -32 -132 -47 48 -69 130 187 -102 111 -92
6350i2M5k0j0O3m0J58p2j7R2k43J96Rj29L4M8R4q8j7J08j67m2K8Q3J8j42K7O4
$$ -92 -47 -67 -77 -14 -54 104 32 15 107 -136 60 69 -60 -26 22 116 28 11 119 -48 -90 -62 21 39 -103 -76 -12
6377a2n5M5J12r1K4L5m3%N5l2j06m5J84j56P3MJ8J9j6o2q4J80r9Q9l9M1P6k5j03
$$ -12 -67 -22 90 -1 23 58 15 15 70 38 -68 -113 71 -85 -12 -8 10 29 13 -49 -133 47 -52 37 -2 39 115 90 -13
6406a3rK2R6j03n4Q8j61K77j27j22J03j28J45L7q2M4j7K7lo1J2k5R5k0r7J91j73
$$ -13 -22 0 96 -7 -61 27 -134 143 16 -106 -3 -131 14 51 -31 13 -4 23 20 -41 -29 -54 41 21 -76 115 -58
$$ [...]
8191e4
##END NTUPLES=NMR FID
##END=
