##TITLE=1H_Pr 02-2
 CCl4, 8 sc, 
 28.9.2020
##JCAMPDX= 6.0         $$ Bruker NMR JCAMP-DX V2.0
##DATA TYPE= NMR FID
##DATA CLASS= NTUPLES
##ORIGIN= UXNMR, Bruker Analytische Messtechnik GmbH
##OWNER= root
$$ XWIN-NMR		Version 3.5
$$ Mon Sep 28 12:07:41 2020 Russian Standard Time (UT+4h)  she@DPX200
##.OBSERVE FREQUENCY= 200.1315066352
##.OBSERVE NUCLEUS= ^1H
##.DELAY= (6, 6)
##.ACQUISITION MODE= SIMULTANEOUS
##.ACQUISITION SCHEME= undefined
##.AVERAGES= 8
##.DIGITISER RES= 18
##SPECTROMETER/DATA SYSTEM= spect
##.PULSE SEQUENCE= zg30
##.SOLVENT NAME= CDCl3
##.SHIFT REFERENCE= (INTERNAL, CDCl3, 0, 15.7039)
##AUDIT TRAIL= $$ (NUMBER, WHEN, WHO, WHERE, WHAT)
$$ ##TITLE= Audit trail, XWIN-NMR		Version 3.5
$$ ##JCAMPDX= 5.01
$$ ##ORIGIN= Bruker BioSpin GmbH
$$ ##OWNER= she
$$ F:/spectra/data/she/nmr/H-F/1/audita.txt
$$ ##AUDIT TRAIL=  $$ (NUMBER, WHEN, WHO, WHERE, WHAT)
(   1,<2020-09-28 12:06:39.68 +0400>,<she>,<DPX200>,
      <created by zg, POWCHK disabled, PULCHK disabled
       configuration hash MD5:
       00 E9 B6 7A A2 85 ED C7 34 08 36 98 17 FE 4E 26
       data hash MD5: 16K
       A1 12 F6 59 AE 59 D6 78 C1 80 73 51 DA 95 68 E1>)
$$ ##END=
$$ 
$$ hash MD5
$$ 5F 09 51 FD E6 8D 2D B1 13 36 38 FE 41 5D 2F 0B
##$RELAX= 
##$RELAX= 
##$RELAX= 
##$RELAX= 
##$RELAX= 
##$RELAX= 
$$ Bruker specific parameters
$$ --------------------------
##$DU= <F:/spectra>
##$EXPNO= 1
##$NAME= <H-F>
##$PROCNO= 1
##$TYPE= <nmr>
##$USER= <she>
##$AMP= (0..31)
100 100 100 100 100 100 100 100 100 100 100 100 100 100 100 100 100 100 
100 100 100 100 100 100 100 100 100 100 100 100 100 100 
##$AQSEQ= 0
##$AQ_mod= 1
##$AUNM= <au_zg>
##$AUTOPOS= <>
##$BF1= 200.13
##$BF2= 200.13
##$BF3= 200.13
##$BF4= 200.13
##$BF5= 200.13
##$BF6= 200.13
##$BF7= 200.13
##$BF8= 200.13
##$BYTORDA= 1
##$CFDGTYP= 0
##$CFRGTYP= 5
##$CHEMSTR= <none>
##$CNST= (0..31)
1 1 145 1 1 1 1 1 1 1 1 1 1 1 1 1 1 1 1 1 1 1 1 1 1 1 1 1 1 1 1 1 
##$CPDPRG= <>
##$CPDPRG1= <>
##$CPDPRG2= <>
##$CPDPRG3= <>
##$CPDPRG4= <mlev>
##$CPDPRG5= <mlev>
##$CPDPRG6= <mlev>
##$CPDPRG7= <mlev>
##$CPDPRG8= <mlev>
##$CPDPRGB= <>
##$CPDPRGT= <>
##$D= (0..31)
0 1.2 0 0 0 0 0 0 0 0.06 0 0.03 0 0 0 0 0.0002 0 0 0 0 0 0 0 0 0 0 0 0 
0 0 0 
##$DATE= 1601280399
##$DBL= (0..7)
120 120 120 120 120 120 120 120 
##$DBP= (0..7)
150 150 150 150 150 150 150 150 
##$DBP07= 0
##$DBPNAM0= <>
##$DBPNAM1= <>
##$DBPNAM2= <>
##$DBPNAM3= <>
##$DBPNAM4= <>
##$DBPNAM5= <>
##$DBPNAM6= <>
##$DBPNAM7= <>
##$DBPOAL= (0..7)
0.5 0.5 0.5 0.5 0.5 0.5 0.5 0.5 
##$DBPOFFS= (0..7)
0 0 0 0 0 0 0 0 
##$DE= 6
##$DECBNUC= <off>
##$DECIM= 32
##$DECNUC= <off>
##$DECSTAT= 4
##$DIGMOD= 1
##$DIGTYP= 9
##$DL= (0..7)
0 120 120 120 120 120 120 120 
##$DP= (0..7)
150 150 150 150 150 150 150 150 
##$DP07= 0
##$DPNAME0= <>
##$DPNAME1= <>
##$DPNAME2= <>
##$DPNAME3= <>
##$DPNAME4= <>
##$DPNAME5= <>
##$DPNAME6= <>
##$DPNAME7= <>
##$DPOAL= (0..7)
0.5 0.5 0.5 0.5 0.5 0.5 0.5 0.5 
##$DPOFFS= (0..7)
0 0 0 0 0 0 0 0 
##$DQDMODE= 0
##$DR= 18
##$DS= 0
##$DSLIST= <SSSSSSSSSSSSSSS>
$$ [...]
##$SUBNAM2= <"">
##$SUBNAM3= <"">
##$SUBNAM4= <"">
##$SUBNAM5= <"">
##$SUBNAM6= <"">
##$SUBNAM7= <"">
##$SUBNAM8= <"">
##$SUBNAM9= <"">
##$SW= 16.880792210976
##$SWIBOX= (0..15)
0 0 2 0 0 0 0 0 0 0 0 0 0 0 0 0 
##$SW_h= 3378.37837837838
##$TD= 16384
##$TD0= 1
##$TE= 0
##$TE2= 300
##$TE3= 300
##$TEG= 300
##$TL= (0..7)
0 120 120 120 120 120 120 120 
##$TP= (0..7)
150 150 150 150 150 150 150 150 
##$TP07= 0
##$TPNAME0= <>
##$TPNAME1= <>
##$TPNAME2= <>
##$TPNAME3= <>
##$TPNAME4= <>
##$TPNAME5= <>
##$TPNAME6= <>
##$TPNAME7= <>
##$TPOAL= (0..7)
0.5 0.5 0.5 0.5 0.5 0.5 0.5 0.5 
##$TPOFFS= (0..7)
0 0 0 0 0 0 0 0 
##$TUNHIN= 0
##$TUNHOUT= 0
##$TUNXOUT= 0
##$USERA1= <user>
##$USERA2= <user>
##$USERA3= <user>
##$USERA4= <user>
##$USERA5= <user>
##$V9= 5
##$VALIST= <valist>
##$VCLIST= <CCCCCCCCCCCCCCC>
##$VD= 0
##$VDLIST= <DDDDDDDDDDDDDDD>
##$VPLIST= <PPPPPPPPPPPPPPP>
##$VTLIST= <TTTTTTTTTTTTTTT>
##$WBST= 1024
##$WBSW= 4
##$XGAIN= (0..3)
0 0 0 0 
##$XL= 0
##$YL= 0
##$YMAX_a= 357675
##$YMIN_a= -328237
##$ZGOPTNS= <>
##$ZL1= 120
##$ZL2= 120
##$ZL3= 120
##$ZL4= 120
##$ABSF1= 10
##$ABSF2= 0
##$ABSG= 5
##$ABSL= 3
##$ALPHA= 0
##$AQORDER= 0
##$ASSFAC= 0
##$ASSFACI= 0
##$ASSFACX= 0
##$ASSWID= 0
##$AUNMP= <proc_1d>
##$AZFE= 0.1
##$AZFW= 0.1
##$BCFW= 1
##$BC_mod= 2
##$BYTORDP= 1
##$COROFFS= 0
##$CY= 11.3945322036743
##$DATMOD= 1
##$DC= 2
##$DFILT= <>
##$DTYPP= 0
##$F1P= 16.9975609425685
##$F2P= -3.02152046262296
##$FCOR= 0.5
##$FTSIZE= 0
##$FT_mod= 4
##$GAMMA= 1
##$GB= 0.15
##$INTBC= 1
##$INTSCL= 1
##$ISEN= 128
##$LB= 0.24
##$LEV0= 0
##$LPBIN= 0
##$MAXI= 10000
##$MC2= 0
##$MEAN= 0
##$ME_mod= 0
##$MI= 1.114404
##$NCOEF= 0
##$NC_proc= 0
##$NLEV= 6
##$NOISF1= 3.799351
##$NOISF2= 2.8
##$NSP= 1
##$NTH_PI= 0
##$NZP= 0
##$OFFSET= 15.70392
##$PC= 1
##$PHC0= -9983.163
##$PHC1= 28.6009
##$PH_mod= 1
##$PKNL= yes
##$PPARMOD= 0
##$PSCAL= 0
##$PSIGN= 0
##$REVERSE= no
##$SF= 200.130013532006
##$SI= 16384
##$SIGF1= 3
##$SIGF2= 2
##$SINO= 400
##$SIOLD= 16384
##$SREGLST= <1H.CDCl3>
##$SSB= 0
##$STSI= 0
##$STSR= 0
##$SW_p= 3612.71676300578
##$SYMM= 0
##$S_DEV= 0
##$TDeff= 0
##$TDoff= 0
##$TI= <>
##$TILT= no
##$TM1= 0
##$TM2= 0
##$TOPLEV= 0
##$USERP1= <user>
##$USERP2= <user>
##$USERP3= <user>
##$USERP4= <user>
##$USERP5= <user>
##$WDW= 1
##$XDIM= 8192
##$YMAX_p= 0
##$YMIN_p= 0
$$ End of Bruker specific parameters
$$ ---------------------------------
##NTUPLES= NMR FID
##VAR_NAME=  TIME,          FID/REAL,        FID/IMAG
##SYMBOL=    X,             R,               I
##VAR_TYPE=  INDEPENDENT,   DEPENDENT,       DEPENDENT
##VAR_FORM=  AFFN,          ASDF,            ASDF
##VAR_DIM=   8192,          8192,            8192
##UNITS=     SECONDS,       ARBITRARY UNITS, ARBITRARY UNITS
##FACTOR=    0.000296,      1,               1
##FIRST=     0,             0,               0
##LAST=      2.424536,      0,               0
##MIN=       0,             -328237,         0
##MAX=       2.424536,      357675,          0
$$ Real data points
##PAGE= N=1
##DATA TABLE= (X++(R..R)), XYDATA
$$ [...]
2534g242J0774q01r961J4215r485q66R386j0067L795M031p069L187L713p845M938
$$ -7242 3532 2731 -7230 6985 -2500 -3366 6020 -4047 -252 3779 -3290 -103 3610 -4235 703
2549G03L068r941J0988m485o068J2572j0792J957P351j0620O624J410o779N705
$$ 703 3771 -6170 4818 333 -5735 6837 -3955 -1998 5353 -5267 1357 2767 -4012 1693
2563A693N52o229O326o84o555R658n866k529R926j0620M553L888r570P935j109
$$ 1693 2245 -3984 2342 1658 -4897 4761 -1105 -3634 6292 -4328 225 4113 -5457 2478 1369
2578A369n230O729k623l422N986k687l038P275o168L0O534r422N953J642p570
$$ 1369 -3861 2868 245 -3177 2809 122 -2916 4359 -1809 -1779 4755 -4667 1286 2928 -4642
2593d642P979k950l700O840m453j320N296m442j31N039o207K245L754p392O204
$$ -4642 3337 387 -3313 3527 -926 -2246 3050 -1392 -1523 3516 -2691 -446 3308 -4084 2120
2608B120m20n654P393m330j070N201n138J331L085m866K328K349n010L662Q55
$$ 2120 1700 -3954 3439 -891 -1961 3240 -1898 -567 2518 -2348 -20 2329 -2681 981 1836
2623A836m954N534k137k960O071m995N55L765n043K609J630m174L073L01l622
$$ 1836 -3118 2416 279 -2681 3390 -1605 -1050 2715 -2328 281 1911 -2263 810 1111 -2511
2638b511L934p67l268N062k914j123M075m645J815K474m520L520k63l114L763
$$ -2511 1423 656 -2612 2450 -464 -1587 2488 -2157 -342 2132 -2388 1132 869 -2245 1518
2653A518j275j972L701k411j063L657l571P31K372l562K091R42l375L320q44j874
$$ 1518 243 -1729 1972 -439 -1502 2155 -1416 -685 1687 -1875 216 1158 -2217 1103 259 -1615
2669a615L301k142m94K708k720N39J958l044J750P25k723K803n01j956K663j198
$$ -1615 1686 -456 -950 1758 -962 -423 1535 -1509 241 966 -1757 1046 545 -1411 1252 54
2685E4j040K626k345m4K224k732J491P61k351J803J01j758K341j111j087K445
$$ 54 -986 1640 -705 -749 1475 -1257 234 995 -1356 447 548 -1210 1131 20 -1067 1378
2701A378j966J45J658k223J303P10k149J676Q2j841K021q64r38K014j491k33K276
$$ 1378 -588 -443 1215 -1008 295 1005 -1144 532 614 -1227 794 -70 -1008 1006 -485 -718 1558
2718A558k363O15J289k142J362M37j728J843p66j127K280j598l10J640j649L96
$$ 1558 -805 -190 1099 -1043 319 756 -972 871 105 -1022 1258 -340 -650 990 -659 -263
2734b63J192j994J437O42k183J730j81j441J640o43p81K135j862J15J405j869
$$ -263 929 -1065 372 1014 -1169 561 380 -1061 579 -64 -845 1290 -572 -457 948 -921
2750i21J006R83k107J365K96j555J763n85j140J842j422r8K158k658R41J280k225
$$ -921 85 1068 -1039 326 622 -933 830 245 -895 947 -475 -573 1585 -1073 -132 1148 -1077
2767a077J329N26k102K231o91j512K481j480o95K295k185K72J911k170P71J116
$$ -1077 252 778 -1324 907 216 -1296 1185 -295 -990 1305 -880 -608 1303 -867 -96 1020
2783A020k683K361j1k304K889j180j275K788k372J46J832k561J143J422k723J905
$$ 1020 -1663 698 687 -1617 1272 92 -1183 1605 -767 -621 1211 -1350 -207 1215 -1508 397
2799C97Q66l074K747n42k159L709k239r25L173l276J282J717l142J686P61k714
$$ 397 1263 -1811 936 394 -1765 1944 -295 -1220 1953 -1323 -41 1676 -1466 220 981 -1733
2815a733K521K32k807L526j461k122M319l630M04L015m419K651Q25l527L195k87
$$ -1733 788 1020 -1787 1739 278 -1844 2475 -1155 -751 2264 -2155 496 1321 -2206 989 702
2831G02k507L237r59k486M291k736j077M349m933K166K293n152M121o92k920M140
$$ 702 -1805 1432 473 -2013 2278 -458 -1535 2814 -2119 47 2340 -2812 1309 617 -2303 1837
2847A837j797j711L618k019j539M128l872L1M365o070L570J510n582N868k152
$$ 1837 40 -1671 1947 -72 -1611 2517 -1355 -1324 3041 -3029 541 2051 -3531 2337 185
2862A85k642N019l236o76L675l436l33M122m472J292L425o534N262p5n254P175
$$ 185 -2457 2562 -674 -1350 2325 -1111 -1444 2678 -1794 -502 2923 -3611 1651 1576 -3678 3497
2878C497m567q00M971n065J394K883m055J394K863n273L014K299o395O490k019
$$ 3497 -1070 -1870 3101 -1964 -570 2313 -1742 -348 2515 -2758 256 2555 -3840 2650 631
2893F31m167P977o452R39M762o895L769J348m547L525Q33m369L692M51n539P517
$$ 631 -3536 4441 -2011 -1072 3690 -3205 564 1912 -2635 890 1723 -2646 1046 1497 -4042 3475
2909C475m131k380P814q272L441L158o951N699p67l862M593r16l488M596j556
$$ 3475 -656 -3036 4778 -3494 -53 3105 -3846 1853 1086 -2776 1817 901 -2587 2009 453
2924D53l945P559n717o83P054q997N107J769p104P551k788k993N411l076j576
$$ 453 -3492 4067 -1650 -2333 4721 -4276 831 2600 -4504 3047 259 -2734 2677 -399 -1975
2939a975M462k834k293O709o656J696N398r519P293o70n973Q406m942j274N416
$$ -1975 2487 -347 -2640 4069 -2587 -891 4507 -5012 2281 1611 -4362 4044 -898 -2172 3244
2954C244m955N35L808m181J12M862o638L453L107q214Q274l104m455Q807o991
$$ 3244 -1711 -1176 2632 -1549 -1437 3425 -3213 240 3347 -4867 3407 303 -4152 4655 -2336
2969b336J143M714o263K918K154m278J755K990o073M626J098o923Q521n046j836
$$ -2336 -1193 3521 -2742 176 2330 -1948 -193 2797 -3276 1350 2448 -4475 4046 -1000 -2836
2984b836P878q432L242K984n914M327Q7l761L413P69m769M954j112m660Q064o318
$$ -2836 5042 -3390 -148 2836 -3078 1249 1336 -2425 988 1757 -3012 1942 830 -3830 4234 -2084
3000b084q5O675q701N225J273n949O037j991k677M216j387l119N016k605k522
$$ -2084 -2169 4506 -4195 1030 2303 -3646 2391 400 -2277 1939 552 -2567 2449 -156 -2678
3015b678O582o625K130M257p981O647p82m988O563l629j308M210l292o01M127
$$ -2678 3904 -2721 -591 3666 -4315 2332 1550 -3438 3125 -504 -1812 2398 -894 -1495 2632
3030B632m049L3M717o393L443K386o909O953k472l419O418n025N01L556l962J175
$$ 2632 -1417 -1384 3333 -3060 383 2769 -4140 2813 341 -3078 3340 -1685 -1184 2372 -1590 -415
3046d15K412m029J898K673n464M186L49n041O521l790j494N555n586K140K593
$$ -415 1997 -2032 -134 2539 -2925 1261 1610 -3431 3090 -700 -2194 3361 -2225 -85 2508
3061B508m768K845R67l563K589P30l853M387j324l210N765m478l6M311n348L264
$$ 2508 -2260 585 1552 -2011 578 1308 -2545 1842 518 -2692 3073 -1405 -1441 2870 -2478 786
3077G86P40l828L513n09k470L408j081k519M153k634j107M284m542J345K826m843
$$ 786 1526 -2302 1211 702 -1768 1640 559 -1960 2193 -441 -1548 2736 -1806 -461 2365 -2478
3093b478L481j20l170L718j624j079K857k035o88K874k606M64K413l794K296Q78
$$ -2478 1003 883 -2287 1431 -193 -1272 1585 -450 -1138 1736 -870 -406 2007 -1787 509 1387
3109A387l499L693j390j733L592k508m79K507k700N47J871k483J254J049k800
$$ 1387 -2112 1581 191 -1542 2050 -458 -937 1570 -1130 -583 1288 -1195 59 1108 -1692
3124a692K329J6k497L695k101r14K725k427O98J475k584J438Q18k404K106o9k036
$$ -1692 637 653 -1844 1851 -250 -1164 1561 -866 -168 1307 -1277 161 979 -1425 681 612 -1424
3141a424K534j255j133K521k088K49K076k589J082R22k347K216l8j910J960o98
$$ -1424 1110 -145 -1278 1243 -845 -596 1480 -1109 -27 895 -1452 764 726 -1184 776 78
3157G8q75J956j501l73J718j941Q34R13j792J535J11j855K002p76j075J923j319
$$ 78 -797 1159 -342 -715 1003 -938 -104 809 -983 552 663 -1192 810 34 -1041 882 -437
3174d37j20J788k017P68J157k317J558J43j439J726o47j144J896j131k97J244
$$ -437 -557 1231 -786 -18 1139 -1178 380 523 -916 810 163 -981 915 -216 -513 731
3190G31j532N90J093j691J172R7j515J422k58j060J782r87l31J622j543P5J379
$$ 731 -801 -211 882 -809 363 460 -1055 367 109 -951 831 -156 -487 1135 -408 -333 1046
3207A046j901P16O04j365J619m95p55J185o31o63J744j344m5J355j574M72P58
$$ 1046 -855 -139 465 -900 719 224 -531 654 23 -640 1104 -240 -285 1070 -504 -32 726
3224G26j494J330k24j057J619p27q87J356r23l41J318j171M85O64j405O63O19
$$ 726 -768 562 338 -719 900 173 -714 642 -281 -622 696 -475 10 674 -731 -68 551
3241E51j548J465j97j062J456n75q17J591j424l5J571j471M97Q95j612J090n9
$$ 551 -997 468 271 -791 665 90 -727 864 -560 -595 976 -495 2 897 -715 375 316
3258C16j111J422p02q80K043j381k93J712j936N72J226j967J443J49j576J730
$$ 316 -795 627 -75 -955 1088 -293 -586 1126 -810 -238 988 -979 464 613 -963 767
3274G67o80j238J851j068l60J694j525J47J463j758P75Q65k474K397l42j886K659
$$ 767 87 -1151 700 -368 -728 966 -559 -412 1051 -707 68 933 -1541 856 514 -1372 1287
3291A287j690m13K127j948L75J356j853N03J278k193J517N34k319K648j259j114
$$ 1287 -403 -816 1311 -637 -262 1094 -759 -256 1022 -1171 346 880 -1439 1209 -50 -1164
3307a164K749k218J20J807k073O85J242k294J379P52k433K288k43k175L218j841
$$ -1164 1585 -633 -513 1294 -779 -94 1148 -1146 233 985 -1448 840 597 -1578 1640 -201
3323b01p04K748k961R36J579k888J724N54j930J780o8j976K375q85j785L514k797
$$ -201 -905 1843 -1118 -182 1397 -1491 233 787 -1143 637 569 -1407 968 83 -1702 1812 -985
3340i85L00K639l735J865J009k894K831n48j746K394j053j372K638j791j013L789
$$ -985 -685 1954 -1781 84 1093 -1801 1030 482 -1264 1130 77 -1295 1343 -448 -1461 2328
3356B328l672Q71K220m175L427l46k547L440j708r87K454j616p36K795k523j6
$$ 2328 -1344 -473 1747 -2428 999 653 -1894 1546 -162 -1149 1305 -311 -1047 1748 -775 -791
3372g91K929m150K435J391m494M617j651k223M160l128K21K352k500K34K219k824
$$ -791 2138 -2012 423 1814 -2680 1937 286 -1937 2223 -905 -684 1668 -832 -598 1621 -1203
3388a203N35K618m270L166J82l703M910k697j200M270m354J662J618l251J885
$$ -1203 -668 1950 -2320 846 1028 -2675 2235 -462 -1662 2608 -1746 -84 1534 -1717 168
3403A68J278l025J778J085l738M007q94l133N367m196K30L852m874K541Q50l187
$$ 168 1446 -1579 199 1284 -2454 1553 659 -2474 2893 -1303 -1073 2779 -2095 446 1296 -1891
3419a891K720K0k458K286L17l452M166j758k176N401m985J574K768n215M040m13
$$ -1891 829 849 -1609 677 994 -2458 1708 -50 -2226 3175 -1810 -236 2532 -2683 1357 944
3435I44k940L444j227j398K383j127j749L576k686p96M274n000K374J927n035
$$ 944 -1996 1448 221 -1177 1206 79 -1670 1906 -780 -1576 2698 -2302 72 1999 -3036
3450c036N083k001j950L864k675l9K237j822n85K963l091J47L201m977L799K31
$$ -3036 2047 46 -1904 1960 -715 -754 1483 -339 -924 2039 -1052 -905 2296 -2681 1118 1349
3466A349m275N190k751j038L601l513J058J776k406O19K059l187J286K082m270
$$ 1349 -2926 2264 -487 -1525 2076 -1437 -379 1397 -1009 -390 1669 -1518 -232 1850 -2420
3481b420L921j059l031N294l815J05L130l942J880J063k575J903N85k663K412
$$ -2420 1501 442 -2589 2705 -1110 -1005 2125 -1817 63 1126 -1449 454 1039 -1624 788
3496G88K70l218M088j985j601M272m222J423K333m626L388l48k209K685m14k007
$$ 788 1058 -2160 1928 -57 -1658 2614 -1608 -185 2148 -2478 910 562 -1647 1038 624 -1383
3512a383K702p44k569L933k745n55L673m405K259J521m158L903j149j734K889
$$ -1383 1319 575 -1994 1939 -806 -1361 2312 -2093 166 1687 -2471 1432 283 -1451 1438
3527A438j759p11K377j744p46K924k710N60K231l996L033J37l033L689k308n76
$$ 1438 -321 -1032 1345 -399 -1145 1779 -931 -371 1860 -2136 897 1034 -1999 1690 -618 -1194
3543a194K768k362L40J799k081L70J785k900J663J059l170L175q60k076L638k718
$$ -1194 1574 -788 -448 1351 -730 -360 1425 -1475 188 1247 -1923 1252 392 -1684 1954 -764
3559g64r7K463k677J092J088j921Q66Q53k416K127j33j988K700j265j200K921
$$ -764 -861 1602 -1075 17 1105 -816 50 903 -1513 614 481 -1507 1193 -72 -1272 1649
3575A649k535O08J496k658J783L36j597J656l38j519K159r51j481K745j798l12
$$ 1649 -886 -278 1218 -1440 343 679 -918 738 400 -1119 1040 89 -1392 1353 -445 -757
3591g57J971k569J304R50k228K103o52j182J908p82p20J594j069o46J891j813
$$ -757 1214 -1355 -51 899 -1329 774 122 -1060 848 66 -654 940 -129 -775 1116 -697
3607f97O38Q98j925J599j64j477K083n68j075J686j383K5J384j800O45J042j799
$$ -697 -59 839 -1086 513 349 -1128 955 387 -688 998 -385 -360 1024 -776 -131 911 -888
3624h88J060M02j649J762m25j021J819j387j16J298j312J53R25j163R66J99j506
$$ -888 172 574 -1075 687 262 -759 1060 -327 -443 855 -457 -304 621 -542 424 623 -883
3641h83J516o19j059J986j027n54J790j544K56J026j662P85L51j171J241o5j186
$$ -883 633 14 -1045 941 -86 -640 1150 -394 -138 888 -774 11 362 -809 432 367 -819
3658h19J431o00p95J396q41m0J134j415M29P62j482J091j0r25J356p76n29J225
$$ -819 612 12 -783 613 -228 -268 866 -549 -120 642 -840 251 241 -684 672 -104 -633 592
3676E92j085K28J062j290N19N66j186R96j05r95J356o25n78J345j086j50R99j063
$$ 592 -493 -265 797 -493 26 592 -594 402 297 -698 658 33 -545 800 -286 -436 563 -500
3694e00M40O91j519J092J44r86J105k21q76J279o54l86J302j461M42N10j089P83
$$ -500 -60 631 -888 204 348 -638 467 246 -630 649 -5 -391 911 -550 -108 402 -687 96
3712I6N50j234Q66j44q24J277m12o22J192j116p0J065j107K55P28j265J161j33
$$ 96 646 -588 278 134 -690 587 175 -447 745 -371 -441 624 -483 -228 500 -765 396 263
3730B63q04Q85l38o19R83o37l5J181j282O45N46j509J011Jr12Q29j0q35J185o35
$$ 263 -541 344 6 -613 370 -267 -302 879 -403 242 788 -721 290 291 -621 208 198 -637 548 -87
3750h7m71J329j295M24Q64j271Q01O2r53J105n65n30J019m93o47J507q83n1Q99
$$ -87 -558 771 -524 -100 764 -507 294 356 -597 508 -57 -587 432 -61 -708 799 -84 -135 764
3769G64j488P93P24j535J341m23q87J082k35o15J011n19o08J358j112L20J190
$$ 764 -724 69 793 -742 599 176 -711 371 136 -479 532 13 -595 763 -349 -29 1161
3786A161k064J138L40j591J764p88q75J743j080k86J039q59j61J540j702O10J062
$$ 1161 -903 235 575 -1016 748 -40 -915 828 -252 -538 501 -358 -519 1021 -681 -71 991
3803I91k382J826R4j494J816j182j60J426j455J81P89r15L99R58j586P04P17j867
$$ 991 -1391 435 529 -965 851 -331 -491 935 -520 -339 450 -465 -66 892 -694 10 727 -1140
3821a140J660j58j368K307j664Q6J244j823J096K41j233P66N19j440R56N28j773
$$ -1140 520 362 -1006 1301 -363 -277 967 -856 240 481 -752 14 533 -907 49 577 -1196
3838a196K392j257q14K460k627P90J353k368J547K96j352J125p1j333J505j45
$$ -1196 1196 -61 -875 1585 -1042 -252 1101 -1267 280 576 -776 349 278 -1055 450 305
3854C05j324K124j530n06K575k680J230O96k239K164m41j224J275l80o15J368
$$ 305 -1019 1105 -425 -931 1644 -1036 194 890 -1349 815 374 -850 425 45 -570 798
3870G98p44r35K029j644j18K186l087K103j04j902K442j260m38J673j241j65J224
$$ 798 54 -881 1148 -496 -614 1572 -1515 588 484 -1418 1024 -236 -674 999 -242 -407 817
3887H17r82m13K003k167P61J445l403K948l43k016K684k114K33J750k006Q39P84
$$ 817 -165 -578 1425 -742 19 1464 -1939 1009 666 -1350 1334 -780 -547 1203 -803 36 820
3904H20j330M06Q50j776J165P48k383K779j309j313L190k887P97J381k463J555
$$ 820 -510 -104 746 -1030 135 883 -1500 1279 -30 -1343 1847 -1040 -243 1138 -1325 230
3920B30L96j292R19L87j749J534Kj771L045k078n55K776l074J475O79k293K053
$$ 230 626 -666 253 640 -1109 425 427 -1344 1701 -377 -932 1844 -1230 245 924 -1369 684
3937F84m06j290J542n2j554K014o21j549K710j970M9J950k924J997J61k028K462
$$ 684 278 -1012 530 478 -1076 938 317 -1232 1478 -492 -443 1507 -1417 580 741 -1287 1175
3954A175j300p66J687p39p79J525j069k14J985k468N98J665k899K698o37j798
$$ 1175 -125 -891 796 57 -722 803 -266 -480 1505 -963 -365 1300 -1599 1099 462 -1336
3970a336K590j738k58J656j237J15R74j443K65J605k441J486O31k504K693j138
$$ -1336 1254 -484 -742 914 -323 -208 766 -677 -412 1193 -1248 238 869 -1635 1058 -80
3986h0q95K275k073O66J093j704Q81M75j386P96P44k036J920j40j918K618j786
$$ -80 -975 1300 -773 -107 986 -718 163 638 -748 48 792 -1244 676 536 -1382 1236 -550
4003e50k94K333k424J319J52j543J469P1j160J130k9j521J751n70j009K133j965
$$ -550 -844 1489 -935 384 536 -1007 462 533 -627 503 474 -1047 704 134 -875 1258 -707
4020g07N14J208k214J711m1j394J725q30p14J305l41q25J607j034n17J840k237
$$ -707 -193 1015 -1199 512 471 -923 802 -28 -742 563 222 -603 1004 -30 -547 1293 -944
4037i44J023O47j954J949o82r21J644r19k52J102j022K0R64j468M08J276j926
$$ -944 79 726 -1228 721 39 -882 762 -157 -409 693 -329 -309 655 -813 -405 871 -1055
4054a055J179N75j772K005r97n32J600j660L95Q44j109L29R67j551P89O68j569
$$ -1055 124 699 -1073 932 -65 -597 1003 -657 -262 582 -527 -198 769 -782 7 675 -894
4071h94J606j69j346J818j383j06J306j466O21M34j047R95o7p34P78p2j080J494
$$ -894 712 543 -803 1015 -368 -474 832 -634 -13 421 -626 369 302 -432 346 274 -806 688
4089F88j008l54J468j238K85P91j375J080M0r71J101l02o99J165q26k37R42r47
$$ 688 -320 -674 794 -444 -159 632 -743 337 377 -594 507 205 -494 671 -155 -392 550 -397
4107c97n2R76r56L92L64r35Q93j29p25J235q66l49J380j257l5R39j165O99P45
$$ -397 -449 527 -429 -37 327 -608 285 156 -569 666 -200 -549 831 -426 -461 478 -687 12 757
4126G57j430R10K49j183J026l67n45J250r62n0R26j085N43M18r37N88L22j009
$$ 757 -673 237 486 -697 329 -38 -583 667 -295 -345 581 -504 39 457 -480 108 430 -579
4144e79Q14k55l63R68o89l84Q96q09M37M24q84O81K38j059R41m66l50R70o89l89
$$ -579 235 -20 -383 585 -104 -488 408 -401 36 460 -424 257 495 -564 377 -89 -439 531 -158 -547
4164e47J135j107L73M95j047R01K56j069Q00J56o49P53n30j09O88q29J72O75q33
$$ -547 588 -519 -146 349 -698 203 459 -610 190 346 -303 450 -80 -189 499 -330 -158 517 -316
4183c16L91M94q76N27k9n77R24m62n32J089r25RQ72q47L11L03p62O02L82r50N27
$$ -316 75 569 -307 220 191 -386 538 76 -456 633 -292 -283 589 -258 53 356 -406 196 578 -372 155
4204A55J27p73Q07m56j84P32p64K82L65o31M33N30j112N96J09n75O05k07l80P28
$$ 155 282 -491 316 -140 -324 408 -356 -74 291 -340 93 623 -489 107 216 -359 246 39 -341 387
4224C87p21K73N17r04L89M88r66P20J36q93J116n45k88O72n57M2N23p14M17M36
$$ 387 -334 -61 456 -448 -59 429 -537 183 319 -574 542 -3 -291 381 -176 -134 389 -325 92 528
4244E28j125O77L88r59P43q2q38J410p68k84R19j040N06K71p19L47J53n32P93
$$ 528 -597 80 468 -491 252 170 -668 742 -26 -310 609 -431 75 346 -373 -26 127 -405 388
4263C88m6r50J231p92m57J245r04K34P48j243Q22O9r42Q00q5l22O22j17p97P85
$$ 388 342 -608 623 -169 -626 619 -285 -51 697 -546 276 345 -597 203 118 -204 418 301 -496 289
4283B89k18n35J335j235K32P69j618J395l25m93R25m75m29J058q02k67J015r85
$$ 289 71 -464 871 -364 -132 637 -981 414 89 -404 521 46 -383 675 -127 -394 621 -364
4301c64j40R48j134O99O83j609J581o68n63J318j063m9R70q57N1J026j055J35
$$ -364 -504 444 -690 9 692 -917 664 -4 -567 751 -312 -361 609 -248 -197 829 -226 -91
4319i1O50j211P09O3j073J644q42l87J107r24N03M13j095K76M32m35J76P24j296
$$ -91 559 -652 57 120 -953 691 -151 -538 569 -355 148 561 -534 -258 174 -261 -85 639 -657
4338f57J008J53j379K019j604K00J138j579O74K65r04R80l7p61N52K31j036J381
$$ -657 351 504 -875 1144 -460 -260 878 -701 -27 238 -666 314 277 -484 68 299 -737 644
4356F44m66q33J710j558K89J296j988J155k84o58J101l36m95N65Q1n96R68o71
$$ 644 178 -655 1055 -503 -214 1082 -906 249 -35 -693 408 72 -423 142 223 -373 595 -76
4374g6o80J760j759Q42Q30k100J858l66q88J232p16j09P42o76j98Q57n31n19J280
$$ -76 -756 1004 -755 87 917 -1183 675 309 -579 653 -63 -172 570 -106 -304 553 22 -497 783
4393G83j769J347L21j759J850r31l28J069j232O13O46p11l33J055r59K58Q26j617
$$ 783 -986 361 682 -1077 773 -158 -486 583 -649 -36 610 -101 -434 621 -338 -80 746 -871
4411h71J345j33j248J977j255m12J512j796Q71L17q65M58M44q98N45N45j214J247
$$ -871 474 341 -907 1070 -185 -597 915 -881 -10 307 -558 -100 344 -554 -9 536 -678 569
4429E69m77r79J763j300J30P64j156Q21J90p98P20p1p60Q31qr30J571r89m61J701
$$ 569 92 -887 876 -424 -294 470 -686 135 325 -473 247 176 -584 247 239 -691 880 -109 -570 1131
4449A131j884Q06J020k113J777n38o68Q71l50n31J061l27r78J649j101m71J712
$$ 1131 -753 53 1073 -1040 737 199 -469 402 52 -479 582 255 -723 926 -175 -646 1066
4466A066j913J015M72j677J624p18o20J253r88K29Q56p39k21R77r98K57R52j480
$$ 1066 -847 168 640 -1037 587 -131 -751 502 -486 -257 599 -140 -361 616 -382 -125 827 -653
4484f53J180J5j387J608j215J27J113j167L27J67q23O67O53j108O57M05j274J125
$$ -653 527 542 -845 763 -452 -325 788 -379 -52 115 -708 -41 612 -496 161 566 -708 417
4502D17l17p40J446j215M71N74j185O13M65q56N82N0q34P63k5q30J248p90k73
$$ 417 100 -640 806 -409 62 636 -549 64 529 -327 255 305 -529 234 209 -621 627 -163 -436
4521d36J298j208K87O43j152O50M16q66N07R7q46Q34n28k65J348r46J13Q09j455
$$ -436 862 -346 -59 584 -568 82 498 -368 139 236 -610 224 -304 -569 779 -167 -54 755 -700
4540g00Q98K86j011Q77l18n16R26p33q1J071o61l04P87j165Q71J74j097J031k16
$$ -700 198 484 -527 350 32 -484 442 -291 -372 699 38 -266 521 -644 227 401 -696 335 119
4559A19n97J058o94k65O64o57K42N74q65K33N96j133R52L5p28Q68l86l14P19p52
$$ 119 -478 580 -114 -379 285 -372 -130 444 -421 -188 408 -725 227 262 -466 402 16 -298 421 -331
4579c31N1O83n33J81L49j062P02Pn47O86O8p43J043o29k90R15p58Q2M13r11Q75
$$ -331 -280 403 -130 51 400 -662 40 47 -500 186 254 -489 554 -75 -365 550 -208 -126 287 -624 251
4600B51J21q72Q46k63l56O62m24n85R10m11Q8K33o06M94K67r84Q04Rp28J019o01
$$ 251 372 -500 346 83 -273 389 -35 -620 290 -121 -33 200 -406 88 355 -629 175 184 -544 475 -126
4621a26k82Q27p96L80L96o60M26J31q07N72J34n28P95k75n10O13n34K25M63p50
$$ -126 -408 419 -377 3 399 -261 165 296 -511 61 195 -333 462 187 -323 290 -244 -19 444 -306
4641c06J12K96n74N87j16l53O27n52Q0P77p50k08P45o75M83J95o52M60l1m97P36
$$ -306 -194 102 -472 115 -1 -354 273 -279 -199 578 -172 -380 365 -310 173 368 -284 176 145 -352 384
4662C84l67k28N63k89k82M57m66r7O03r91Q52K6o37N84J42m28N21n10j16O52n15
$$ 384 17 -211 352 63 -219 238 -228 -325 278 -713 139 165 -472 112 254 -174 347 -163 -279 373 -142
4683a42j19O73n45J4M90p23M33K7n53R38l51l13N21n74J95M65n47L14J15p16M78
$$ -142 -261 412 -133 -119 371 -352 81 108 -445 493 142 -171 350 -224 -29 436 -111 203 318 -398 80
4704H0J62o46Q41k16m71M09k39m8L64m50j27O36p28M96Q2o88R87k60k42L25l48
$$ 80 242 -404 437 221 -250 159 -80 -128 236 -214 -341 295 -433 63 145 -543 444 184 -58 267 -81
4725h1J76J89o30L34K59n20R9N73r36R11j93o63R44n34R6K58l73j62P43p40L43
$$ -81 95 284 -346 -12 247 -273 -174 399 -537 374 181 -482 462 -72 24 282 -91 -253 490 -250 93
4746I3J71n98M04K17n31O00m17l61P88p75J00O11o15L39J81l24L10r1k58K96K06
$$ 93 264 -334 70 287 -244 356 -61 -422 366 -409 -309 302 -313 26 207 -117 193 102 -156 140 346
4767C46r31P07J32n76O36o18M73L21p58M47Q3m10K51j19l02L93K7n28R35o14l97
$$ 346 -585 122 254 -322 314 -304 169 490 -268 179 262 -148 103 -16 -318 75 102 -426 509 -105 -502
4788e02J052j037O78n9p71R93l68k96O39j23n27L16N1j89O10n75R5O71j067M62
$$ -502 550 -487 191 132 -639 354 -14 -310 329 206 -321 -5 46 -143 467 -108 -13 658 -409 53
4808E3J2p31J054m33r3M15l00O1O06r44R0N26m05k43R13j207R32L9q58Q87m22
$$ 53 65 -666 388 -45 -138 277 -23 38 644 -300 -210 316 -89 -332 581 -626 306 345 -513 374 -48
4829d8l56O65p20M53K02n17Q9L41l75K61M73j088Q19J5o21J230j242M18K92o32
$$ -48 -404 261 -459 -6 196 -321 -232 109 -266 -5 468 -620 199 214 -407 823 -419 -1 291 -341
4849c41M61J81n59L72K43j083R49J16o43Q03m86l77J258j201K15N03r01R21k92
$$ -341 120 301 -258 114 357 -726 223 339 -304 499 13 -364 894 -307 -92 411 -490 431 139
4868A39m08M04k80r7N19j41n46J039o01n13J126j098O74J91p06O94o23J67J88
$$ 139 -269 135 -145 -242 277 136 -410 629 28 -485 641 -457 217 408 -298 396 -227 -60 128
4887A28j59k50P57p72M4O65q27J53P10r64Q56k68r03J371o74J0M35n42J3K53j36
$$ 128 -31 -281 476 -296 -252 413 -414 -261 449 -515 341 73 -830 541 -133 -123 312 -230 -217 36 -100
4908a00J16O34j027M48R8r58J180m16l65R24r25J01L19l56K53K90j73n0K03l37
$$ -100 16 650 -377 71 169 -789 391 -25 -390 534 -391 -290 29 -327 -74 216 43 -7 196 -141
4928a41K23J22o33R14n38m98J176r29L53J23n53M35L30o33L3L28p72P03kn21R90
$$ -141 82 204 -429 485 -53 -551 625 -304 49 172 -381 54 384 -249 -216 112 -660 43 41 -480 510
4949E10m67l80P06p89N64J47p09O77l59n5K03K42p87Q63m50n68J308r57K82L91
$$ 510 43 -337 369 -420 144 291 -418 259 -100 -155 48 290 -497 366 -84 -652 656 -301 -19 372
4969C72p76R17l18m60M47l23R6K52j87k95N46o50K9Q74o72J12M68p80O17j45l66
$$ 372 -404 513 195 -265 182 -141 -45 207 20 -275 271 -379 -350 524 -148 -36 432 -348 269 124 -242
4990b42R15q77L01K12o59m9Q30o03J07K91n77O08j80o98J098n16j72O54p92K41
$$ -242 673 -204 97 309 -350 -399 431 -172 -65 226 -351 257 77 -621 477 -39 -211 443 -349 -108
5010a08L28n32N35P5q20M03K00n61Q98j33n99P67n24j86O00o40L84K80o44K60
$$ -108 220 -312 223 298 -522 -119 81 -480 418 285 -314 453 -71 -257 343 -297 87 367 -277 -17
5030a7K34n95N87j57l35L95k03k93R09p20J49K08n26P09l95k41O32k04l46M34
$$ -17 217 -378 209 52 -283 112 -91 -384 525 -195 -46 162 -364 345 -50 -291 341 137 -209 225
5050B25l19k05O79m33m4N69o18K59J43o47N73l16j23O83m78O7K82j96k08K43k10
$$ 225 -94 -299 380 -53 -97 472 -146 113 256 -391 182 -134 -257 426 -52 15 297 101 -107 136 -74
5071g4J2K28n26M31J81p40P22m44r6M47m91Q5P18o53Q1K79l97L42J58o37N92l66
$$ -74 -62 166 -360 71 252 -488 234 -210 -306 141 -350 -265 453 -200 -119 160 -237 105 263 -374 218 -148
5093a48m8M30m19o3M89k33K4J99n50M61r1k92N39m87%N87n45L7L47m97K53nj3
$$ -148 -196 234 -185 -248 241 8 32 231 -319 142 51 -241 298 -189 -189 398 -147 -110 237 -260 -7 -12 -25
5116b5n3K99o90P85j65o96P84m00K37M7k35o5M38n25M43J64o59M76j43l85O62
$$ -25 -78 221 -469 316 151 -545 239 -161 76 123 -112 -177 261 -264 179 343 -316 160 17 -368 294
5137B94k72k39M46m47Q9J88m12K00L13k17R8L61o88M53l4k24M20m53r3N52o65
$$ 294 22 -217 229 -218 -129 59 -353 -153 160 -57 41 402 -286 167 133 -91 329 -124 -217 335 -330
5158c30K12K51m28K94K80l29l0K01k90L94m35K45J25m28L10R0l87N04k65l33P30
$$ -330 -118 133 -295 -1 279 -50 -80 121 -169 225 -210 35 160 -268 42 132 -255 249 -16 -349 381
5179C81j65m83N45l29r6N57n16J66L3l31L06R4l76L19k1n71R68m67J2K00m21l7
$$ 381 216 -267 278 -51 -147 410 -106 60 93 -238 68 162 -214 105 84 -487 481 14 26 226 -195 -232
5201b32N33k62k28L89m08M85k27k23L67j69l07P17o41K19K26m98L71m2m20N24
$$ -232 301 39 -189 200 -208 277 50 -173 194 25 -282 435 -206 13 239 -259 112 70 -350 174
5221A74J4l62L36l12j02M93j90k55K38k24K7O12q09L68K09n10N09j49k04M88j75
$$ 174 188 -174 162 -150 -252 241 51 -204 34 -190 -163 449 -360 8 217 -293 216 67 -137 351 176
5242A76j70L14n02J35K67l56pM32l05J40L1m17P07n56N8L86n79j1L82k09n3L45
$$ 176 6 320 -182 -47 220 -136 -143 289 -16 124 155 -262 445 -111 -53 333 -246 -257 125 -84 -137 208
5264B08m35J85J37k42K09k9j20L46n02p0K99p3J42J72l96J23J61l38K90J14n68
$$ 208 -227 -42 95 -147 62 33 -87 259 -243 -313 -14 -87 55 227 -169 -46 115 -223 67 181 -387
5285c87P22m80r1O01n49J39K00m89L75J9k13N6J02m1J26J78n08J56J21q8P67r69
$$ -387 335 -145 -236 365 -184 -45 155 -334 41 60 -153 -97 5 -36 90 268 -240 -84 37 -51 716 -253
5307b53N9K12k22M63l76k10L55J32k23J03j29q4L86k74j7L69p15M52K28o76N18
$$ -253 -194 18 -204 259 -117 -327 28 160 -63 40 -89 -173 213 -61 -78 291 -424 28 256 -420 98
5328I8n3k90P93p15K08m2j08l7M26l82K19J88o47M55J63o10Q58m37l37N85n92
$$ 98 45 -245 548 -167 41 -1 -109 -146 280 -102 117 305 -342 113 276 -334 524 87 -250 335 -257
5349b57J88L1J19k60K67m69L52J81n52N67j37p0N34o42l3L62n24O76k88k89K65
$$ -257 -69 -38 81 -179 88 -381 -29 152 -400 167 30 -40 494 -148 -181 181 -343 333 45 -244 21
5370B1K34l34L21k32k09M50j81l34P38p21J55L59o60P38j45n60M66j86p5M40m97
$$ 21 255 -79 242 10 -199 251 70 -264 474 -247 -92 267 -393 345 200 -360 106 -80 -155 285 -212
5391b12L3N17l89j96M88m99M37J92p45O52l17j88L93n14J13M86j07m27M11j57
$$ -212 -179 338 -51 -247 241 -258 179 371 -374 278 -39 -227 166 -348 -235 251 144 -283 128 -29
5411b9r8M27m50L03j22k86O31l82l76R05p16K81M8k27L09l36nJM48p86P73j57
$$ -29 -127 300 -150 153 31 -255 376 -6 -382 523 -193 88 136 -91 218 -118 -123 -122 326 -460 313 156
5433A56m43O38p70J48P16q28N9N10l41K92p9k03K94J08q33Q38j02m50O65m90k
$$ 156 -287 351 -419 -271 445 -383 -324 186 -155 137 58 -145 149 257 -576 262 160 -290 375 -115 -117
5454a17L13m65L98j2l30J73K93l70J31ro4L26k51L6K01l51j02M54k94K07K5m50
$$ -117 196 -269 129 117 -213 -40 253 -117 14 5 -59 267 16 52 253 -98 -200 254 -40 167 192 -258
5476b58M13p8o21Q01l46j02K91k57K59K82o43L62n2n27M32j27K1L07j81J53L4
$$ -258 155 77 -544 257 -89 -191 100 -157 102 384 -259 103 51 -476 -44 -171 -150 157 -24 129 163
5497A63m0q8K21m39J82K69o24N38m4k41L18j41k43L48r7k99M52l01J67J77n10
$$ 163 123 35 256 -183 -1 268 -356 182 138 -103 215 74 -169 179 82 -217 235 -66 101 278 -232
5518b32M57j02n12N09j08r9M35o55L26K86m22J73J48m85L90o0k27J84kp8M65o03
$$ -232 225 123 -389 120 12 -87 348 -307 19 305 -117 56 204 -281 109 49 -178 6 4 -74 391 -212
5540b12m1M17m29K31P3k04M6K99k91K98k26J11J24K1p2J08l78J27K91l07J65j74
$$ -212 -253 164 -265 -34 39 -165 -119 180 -111 187 -39 72 196 217 145 253 -125 2 293 -14 151 -23
5562b3r3L07Pj54R8k94jL35k79J9K61k84L38P7k96M1p9k40N36k29m6J22k19n0
$$ -23 -116 191 198 44 142 -152 -153 182 -97 -78 183 -101 237 314 18 59 -20 -260 276 47 1 123 -96 -146
5586a46K04n0o1M30o50K35J40m57M16r4k94M19J17m82O37m37Q4J03k69K00K04
$$ -146 58 8 -53 377 -273 -38 102 -355 61 -33 -327 92 209 -273 364 -73 11 114 -155 45 249
5607B49m06J43p4J37J78k62J83k8k28L4J81k78K20J15j66J92j30k20L36j57k34
$$ 249 -157 -14 -88 49 227 -35 148 120 -108 -74 107 -171 49 164 -2 190 60 -160 176 19 -215
5628b15L37j74P9K76m47O0J31qj0L40o36L59k83l5J10R4k17M17n37L83L80p58
$$ -215 122 -52 27 303 -144 -84 47 39 29 369 -267 92 -191 -226 -116 -22 -239 178 -359 24 404 -354
5650c54N01j92k68M55j62k0K31k98k0K56o0j57J33r6J36M1k58L07k59j38L73k89
$$ -354 147 -45 -313 142 -20 -40 191 -107 -127 129 69 -88 45 -51 85 126 -132 175 -84 -222 151 -138
5672a38%L37j36j05N46n49K8P1k18J94j63l4R1m33M44M12n57Q3K31k19K65k84
$$ -138 -138 199 63 -42 504 -45 -17 54 -164 30 -133 -167 -76 -509 -65 347 -210 -127 104 -115 150 -134
5694a34l28L88L8k08J71l3PN49n47P5L02n74K87j1NP7j11k50L27j53PK85l00N2
$$ -134 -462 -74 -36 -244 -73 -106 -99 450 -97 -22 280 -294 -7 -18 -13 64 -47 -297 30 -123 -116 169 -131 -79
5718g9L18m57L5K24j77K18j52j19J78N7k65L97k37k00M26k80lL36n32L52Rj19
$$ -79 239 -218 -183 41 -136 82 -70 -189 -11 46 -219 178 -59 -259 167 -113 -116 220 -312 40 49 -70
5740g0K29nm60M17o6o5K16p5j67p6J77j41K24l42K15K22k99J74J03m36N04m23
$$ -70 159 154 -306 111 45 -20 196 121 -46 -122 55 -86 138 -204 11 233 -66 108 211 -225 279 -144
5762a44M3J66j46M6O1j08L41j70l29L88j16J82N9n67K77J66j82p6K83l83J82J20
$$ -144 -101 65 -81 -35 26 -82 259 89 -240 148 32 214 273 -294 -17 149 -33 -109 174 -209 -27 93
5784I3k13K89l6m66N63k01k43N78o32K22K77n16L52O8k91J47K64o55N19L06o15
$$ 93 -120 169 133 -333 230 29 -214 364 -268 -46 231 -285 67 135 -156 -9 255 -400 119 425 -190
5805a90L66l79L18Q7k54j45N16o80N45k76j71N52j20j91J15j81j39M14k96N0K9
$$ -190 176 -203 115 202 -52 -197 319 -361 184 -92 -263 289 169 -22 93 -88 -227 187 -109 -59 -30
5826c0j42N14r7m75O37m47OJ69k93K43l2l13J82J87j64r0M48l75K73q4k71K33
$$ -30 -172 342 245 -230 407 -40 -34 135 -158 85 53 -260 -78 109 -55 -145 303 -72 201 117 -154 79
5848G9k2j38M19n01J47J93l65K67Q2l52M5K71m17P10m85j48L54k55j20L97m97
$$ 79 57 -81 338 -163 -16 177 -188 79 161 -191 -146 125 -292 418 -67 -215 139 -116 -236 161 -336
5869c36N59m19J89J81j64k55L35j48p4N43o80M39q0k02q5O20o36L60j44j65Q9
$$ -336 223 -196 -7 174 10 -245 90 -58 -132 411 -269 170 90 -112 -197 423 -213 147 3 -162 -73
5890g3J32r8L13m25L09J59k12j29K06l85K96K41p54O07j66j43L66m53rJ70l2J49
$$ -73 59 -39 274 -151 158 317 105 -24 182 -203 93 334 -420 187 21 -122 244 -209 -218 -48 -80 69
5912F9J7l51J58K85k57J58J12m84P31m35o1K65k71l28O09j96j65L88m85K88J09
$$ 69 86 -265 -107 178 -79 79 191 -293 438 3 -58 207 -64 -392 217 21 -144 244 -241 47 156
5933A56l54J72O9r3K95n41M25r4m23L78K77j94q1K08l74L34k06k98O18L3m71J08
$$ 156 -198 -26 43 -50 245 -296 129 35 -388 -10 267 73 -8 200 -174 160 -46 -344 274 307 -164 -56
5955e6L1R2j51j3K45mj56L10k12q7K54l24K9R8k76L03J73k82K02K2n74N18k03
$$ -56 -25 67 -84 -97 148 144 -12 298 86 -1 253 -71 -42 56 -220 83 256 -26 176 198 -376 142 -61
5978f1j61K44Qk75O64n89J62J61l48J88J34k43J21J65k87K03r4k97M67k08k42
$$ -61 -222 22 30 -245 419 -170 -8 153 -195 -7 127 -116 5 170 -117 86 -8 -305 162 -46 -288
5999b88L31q7QL61k93ML57n60M94n22J51J52j62j16O13o33R8N19n92L95r1k82
$$ -288 43 -44 -36 325 32 36 393 -167 327 -195 -44 108 -54 -170 443 -190 -92 427 -165 230 139 -143
6021a43K14l7k21N26m52n8L40l29j87N81l30o3L76l29L57q9l03K86j54r6J26j16
$$ -143 71 34 -187 339 -113 -171 169 -160 -347 234 -96 -159 217 -112 245 156 -147 139 -15 -111 15 -101
6043a01L9N11o83J87o9j3K49q8l7K73k21k09M76n61J07K12k05j2M37k30J00j14
$$ -101 -62 449 -234 -47 -116 -129 120 32 -5 268 47 -162 314 -247 -140 72 -133 -145 292 62 162 48
6065D8j05K88r9n47M95k0l13L82k32J58J95l34j28L87n9j08k89J00L76k36q6Q3
$$ 48 -57 231 132 -415 80 60 -253 129 -103 55 250 -84 -212 175 116 8 -281 -181 195 -41 -127 -44
6087d4O8k87M35j70Q1K07m59L72l07n2L21j91l49M94l64K68J19n11L44L12n91
$$ -44 24 -263 172 2 83 290 -169 203 -104 -156 165 -26 -375 119 -245 23 142 -369 -25 287 -304
6108c04N11k26J1Q8j8j99r8K43k86M68k61M7J52j56j26J96j15J3J57l02L02j93
$$ -304 207 -19 -8 80 62 -137 -235 8 -278 190 -71 -24 128 -28 -154 42 -73 -60 97 -205 97 -96
6130i6j12M86k83L7K29n01L46L6j82J00o6m61O60j66k65K60p3PJ79r0K0M5k95
$$ -96 -208 278 -5 32 261 -240 106 142 -40 60 -6 -467 193 27 -238 22 -51 -44 135 45 65 110 -185
6153a85K01K11l02J27j43r7L82k73OJ19l65J61L43l14K66j54j34J25O5J9L5j48
$$ -185 16 227 -75 52 -91 -188 194 -79 -73 46 -319 -158 185 -129 137 -17 -151 -26 39 58 93 -55
6175e5j25N87o31J88K66m43K26n8l45N57p9q4J57J5m63P08o69J60L49l95L49j9
$$ -55 -180 407 -224 -36 230 -213 13 -45 -390 167 88 4 161 176 -287 421 -248 -88 261 -134 215 196
6197A96l25K86k19R4K15k19k12K63k33K29R1l04L23j01k86L8J96k12K75j21r2
$$ 196 -129 157 -62 32 247 28 -184 79 -154 75 166 -138 185 84 -202 -164 32 -180 95 -26 -118
6218a18K78k98K58J25l72J91k1M6k06M3J17j54L24l12K57n7k02K93k28K54j59
$$ -118 160 -138 120 245 -127 64 43 89 -117 -74 43 -111 213 -99 158 101 -101 192 -36 218 59
6239E9l60L19q5M5J37m9o9K98l33l15O57m65L17J7m82L45m4l46N26j09j68K37
$$ 59 -301 18 -67 -22 115 66 -3 295 -38 -353 304 -161 156 173 -309 36 -8 -354 172 63 -105 132
6261A32n2l6M0k5j45L07m5o9J58l80K8j8j41J36%M8L23n80K29M7j62M60j79Nj13
$$ 132 80 44 84 59 -86 221 176 107 265 -115 -87 -105 -246 -110 -110 -62 261 -319 -90 -43 -205 255 76 81 -32
6286c2J70l76K51J00k66L97n42M79l07n6K87r7n6p5K62m60J38L20j58R1l8l80
$$ -32 138 -238 13 113 -153 244 -298 181 -126 -182 105 8 -48 -123 139 -321 -183 137 -21 70 32 -348
6308c48N20p6j3j9j4P6J1k94K62j69N9J3N4m10O91l78k12K90r2K26mk65k8K39
$$ -348 172 96 83 64 50 126 137 -157 105 -64 -5 8 62 -348 343 -35 -247 43 -49 177 173 -92 -120 119
6332A19l96K61k7j44L58Ok29M41m91j7J59l36L63J07k20J77Q0l68J20j45J50J47
$$ 119 -277 -16 -43 -187 171 177 -52 389 -102 -119 40 -296 67 174 -46 131 211 -157 -37 -182 -32 115
6354A15n0n2K80j18L5k4l37R4K59k07J83j86l38N32j35j21M13o76N7L51k34j11
$$ 115 65 13 293 175 210 186 -151 -57 202 -5 178 -8 -346 186 51 -70 343 -333 -276 75 -159 -270
6376b70N21m50J96L54m71K11n6k82L38m16L70m7R5j21R6j65J79j13j27J84l80
$$ -270 251 -199 -3 351 -120 91 35 -247 91 -325 45 -2 93 -28 68 -97 82 -31 -158 26 -354
6397c54L87N7j39r6L61k94J86J71m33L63k22n0J40k66O4L83l71r9L76k76L09k82
$$ -354 33 90 -49 -145 216 -78 108 279 -154 209 -13 -63 77 -189 -125 258 -113 -212 164 -112 197 -85
6419h5k41O15l38j8J75k81o5K14L3k81K93k78M51n5k84Q5K60l57L15k11P9J17
$$ -85 -326 289 -49 -67 108 -173 -238 -24 9 -272 21 -257 194 139 -145 -60 200 -157 158 -53 26 143
6441A43k93K25J21j84j39J99r7K42l41k79P20k86l3J27k88J81K25k61j21J53J13
$$ 143 -150 75 196 12 -127 72 -25 217 -124 -403 317 31 -2 125 -163 18 243 -18 -139 14 127
6462A27K8j80p5J92j94q7M22k55r8L11l57P1k7j43M33m5k93K21K94n62K17m5k00
$$ 127 155 -25 -100 92 -102 -189 233 -22 -120 191 -166 -95 -122 -265 168 123 -170 51 345 -217 0 -45 -245
6485b45N17m73K3M71n77K20nK06j90j5l72M29J8K35N9k58j04J24j00L31j24l08
$$ -245 272 -201 -178 293 -284 -64 -69 137 -53 -68 -440 -11 7 242 301 43 -61 63 -37 294 170 -138
6507a38K92k34j36L03j89O1K89j86l01M03k15J7L49j40j17K57o27K29J10j14K52
$$ -138 154 -80 -216 87 -102 -41 248 62 -239 164 -51 -34 315 175 58 315 -312 -83 27 -87 165
6528A65l94Q1J61k86L62J38l57K54j59j33P9J65o8L6j3l03L31l48K26J46k13K15
$$ 165 -229 -148 13 -273 89 227 -130 124 -35 -168 -89 76 8 44 31 -272 59 -289 -63 83 -130 85
6550H5Q9k76L13k87K15J33k59o1M2n5R3r3k35L89r3k61M44p3j85J08k26L8M04
$$ 85 174 -102 211 -76 139 272 13 -48 -6 -61 32 -61 -296 93 0 -261 183 110 -75 33 -193 -155 249
6573B49j41j60L97l43n5jl9J62J96m89L25k70J91J08j88O1K8j82L3K51j80J81
$$ 249 108 -52 345 2 -53 -54 -93 69 265 -224 101 -169 22 130 -58 3 31 -151 -118 133 -47 134
6595A34K57n41K68k4k32J36j91m9K78l45K81K60m90L12J31n11O05l26o5J64k3
$$ 134 391 -150 118 94 -138 -2 -193 -242 36 -309 -28 232 -258 54 185 -326 279 -47 -112 52 29
6616B9J8J05m20K21k5N6K7L3L6O2O7n36K71j13K61J70k61n3M29m39J01O7l28L05
$$ 29 47 152 -268 -47 -72 -16 11 44 80 142 209 -327 -56 -169 92 262 1 -52 377 -62 39 106 -222 83
6640H3l53K59q7n2n8M18m46J51M35m64L3L98l72j16J16n9M14k1m72N1P7q2L01
$$ 83 -270 -11 -98 -150 -208 210 -236 -85 350 -114 -81 317 -55 -171 -55 -114 300 279 -193 -142 -65 -147 154
6663A54k11NK20j48P1m3j55K86m2k27M10k65l31K46j51J31L51m12P0P7j00pQJ90
$$ 154 -57 -52 168 20 91 48 -107 179 137 -90 320 55 -276 -30 -181 -50 301 -111 -41 36 -64 -71 -63 127
6687A27j69k3j03L29j19j97L61l94M4K13l18L57q4o8m7J13l59O43k91j38K97k95
$$ 127 -42 -65 -168 161 42 -155 206 -188 -144 69 -249 108 24 -44 -91 22 -337 306 15 -123 174 -121
6709a21J41L9lj68M17m15O5Q2j65M86o66o3M62l15K27J02j27k33K71l1j25K9m7
$$ -121 20 59 56 -112 305 -110 -45 37 -128 358 -308 -371 91 -224 3 105 -22 -255 16 -15 -140 -111 -158
6732a58J15J3k63N14j45l64K75j81J99K08k08n9K07j39M03m58j17N20o01K13J35
$$ -158 -43 -30 -293 221 76 -288 -13 -194 5 213 5 -54 153 14 417 -41 -158 362 -239 -26 109
6753A09p0O2J33j56J11q0m00M83k21r7K13l0o3K91n05L38mq4Lj3o3L20m40O4N0
$$ 109 39 101 234 78 189 109 -291 192 -29 -126 87 57 -6 285 -220 118 114 30 33 20 -43 277 -163 -99 -49
6778d9qj26K68j8j11Q4j23j24O06n05J96J82m39N17k35j62N96m88k23O16m21k55
$$ -49 -57 -183 85 67 -44 40 -83 -207 399 -106 90 272 -167 350 115 -47 549 61 -162 454 33 -222
6800b22J84N9mN3m47N29n0p4k78K66j57M95l38k62M88k68J49P7m11pJ32M7O7q9
$$ -222 -38 21 17 70 -377 152 102 28 -250 16 -141 354 16 -246 242 -26 123 200 -211 -218 -86 -39 28 -61
6824f1J06K4j60K13J3j14j82K94l45J68O8m73P29j53k86J65j3N1r5k01M66j87
$$ -61 45 69 -91 122 135 21 -161 133 -212 -44 24 -449 280 127 -159 6 -7 44 -51 -252 214 27
6846B7j06K59j18k24L47o9l19L81n04L32J78k40K11p9o5J69j41l22N21l01Q1K24
$$ 27 -79 180 62 -162 185 116 -203 178 -326 6 184 -56 155 76 11 180 39 -283 238 -63 18 242
6868B42j29j93K79k76R4P1k02J51L04l80%M5l29N07j74j41K65j76m2J32k69L39
$$ 242 113 -80 199 -77 17 88 -114 37 341 -39 -39 6 -323 184 10 -131 134 -42 -84 48 -221 118
6890A18j81K4j12J95k83L86n03N7L45k76K46M05n77J14L97o57K58K15k26R3J30
$$ 118 -63 -39 -151 44 -239 147 -356 -299 46 -230 16 421 -156 -42 355 -302 -44 171 -55 38 168
6911A68l42K04j38p4N42n83K79j32l29M90r7m8K79j89k37K55m6j42L42m18J55
$$ 168 -174 30 -108 -182 360 -223 56 -76 -405 85 -12 -60 219 30 -207 48 2 -140 202 -216 -61
6932f1k3o5k1L65j93j22j53J95M42l75j4p5r6J22J01k66J62J92j51O0M02o15M60
$$ -61 -84 -149 -170 195 2 -120 -273 -78 364 -11 -25 -100 -196 -74 27 -239 -77 115 -36 24 426 -189 271
6955B71k26j11j2j2j58M02k23m8K78l65P5L20m30K18P1k65M15j69r1L56l57k4
$$ 271 45 -66 -78 -90 -248 154 -69 -117 161 -204 -129 191 -239 -21 50 -215 200 31 -60 296 -61 -85
6977h5K46l55J66L40k94Rk9l1J14j54j28M10l51L0J27k78O28l78j45L45j4k19
$$ -85 161 -194 -28 312 18 27 -2 -33 81 -73 -201 209 -142 -112 15 -263 365 -13 -158 187 173 -46
6999d6K5J60L7J14o69J38M05n89M90J78m06Q6J18k91K41K19m48M51k99MK67l62
$$ -46 -21 139 176 290 -379 -241 164 -425 65 243 -163 -77 41 -250 -9 210 -238 213 -86 -82 185 -177
7021a77L6K87l27L00J88m46K28L6j48M31l73n7J62k42J61K47m57K71k05q8J27
$$ -177 -141 146 -181 119 307 -139 89 125 -23 408 35 -22 140 -102 59 306 -151 120 -85 -173 -46
7042d6P7l51N21j67k05J03j98K99J00k89K91j57j6J86Q7j79N3j6j7J89j29j27
$$ -46 31 -320 201 34 -171 -68 -266 33 133 -156 135 -22 -38 148 235 56 109 93 76 265 136 9
7064IJ74k05P2L3j56P7Oj62Q9J33k30M33l40O9n5J01J33n4n28J57K51mO1p1j18
$$ 9 183 -22 50 83 -73 4 10 -152 -63 70 -160 273 -67 2 -53 48 181 127 -401 -244 7 3 64 -7 -125
7089a25J91j18l9L92m86K64l9j48N6M20m18K38j06j24J49k42K3L08j98m8P7k63
$$ -125 66 -52 -91 301 -185 79 40 -108 -52 368 -50 188 82 -42 107 -135 -112 196 -2 -50 27 -236
7111b36L43r4k70M43o9n20L03k9O4L18n13J70K65l19J11J66n50N84k81R9M0j67
$$ -236 107 13 -257 186 117 -403 -100 -129 -65 253 -260 -90 175 -144 -33 133 -417 167 -114 -15 25 -142
7133a42J99K42l18k00J29l51O13L8j48j12L9M4J9j81kJ83l54L69J48l33J26j97
$$ -142 57 299 -19 -219 -90 -441 172 210 62 -50 -11 33 52 -129 -131 52 -302 67 215 -118 8 -189
7155a89l9P4l2J24K70j96r4J86l8n3K09j78k46K95j60J64k6k91j3K70p3K82q6
$$ -189 -228 -154 -186 -62 208 12 -82 104 66 13 222 44 -202 93 -67 97 71 -220 -233 37 -36 246 160
7178A60l52K30j05QK65m47K93Q3l24M8L24m66L51j68K30j19j55J20L71k66k1J70
$$ 160 -192 38 -67 -59 206 -241 52 135 -189 -141 183 -283 68 -100 130 11 -144 -24 347 81 60 230
7200B30k73%J03j86L49k52K69n6l79O7L35n26L08L44o68N02j22l00M04j50k52
$$ 230 -43 -43 60 -126 223 -29 240 184 -195 -128 207 -319 -11 333 -335 167 45 -255 149 -1 -253
7221b53N27l55MJ52l97L31p2J67K6K34n48L28Ln10P03n51J81l9Q5n8J57l41L07
$$ -253 274 -81 -77 75 -322 9 -63 104 130 364 -184 144 147 -363 340 -211 -30 -69 16 -42 115 -226 81
7244H1k6k99L06k13o2J54o3q0L94l48L9J84J21j11K7n81P33j6m09J78o1l05P32
$$ 81 55 -244 62 -151 -213 -59 -122 -202 192 -156 -117 67 188 77 104 -477 256 240 -169 9 -52 -357 375
7267C75k86j65O0o9K0j6J19J01K8j04k02K27m71M53q5o0J62k29J01K52k91R4J58
$$ 375 89 -76 -16 -85 -65 -81 38 139 167 63 -139 88 -383 70 -15 -75 87 -142 -41 211 -80 14 172
7290A72L9j78j28J9K48q7k89N19l91r4L79j37jo1j38K78n3l61M34j40r0J2J63
$$ 172 211 33 -95 -76 172 85 -204 315 -76 -170 209 72 71 10 -128 150 97 -264 170 30 -60 -48 115
7313A15k00K48l89K22J52n39L18K48l95L19N3k74J30o7N6J70j48NQ5n11O15Rm05
$$ 115 -85 163 -226 -4 148 -391 -73 175 -220 99 152 -122 8 -59 -3 167 19 24 109 -402 213 222 -183
7336a83K85K0l3j49N5k57M67m34N8K10k47J13J87l14K19L98n77M08m58K17J06
$$ -183 102 122 89 -60 -5 -262 205 -229 -171 39 -208 -95 92 -222 -3 395 -182 226 -232 -15 91
7357I1k29J00L77m43J50N7k99R9R5M8J45k24k02L62l17mM72n35j4P17p95N34k72
$$ 91 -138 -38 339 -104 46 103 -196 -97 -2 46 191 -33 -235 127 -190 -194 278 -257 -271 446 -349 185 -87
7380h7n6J78j37J30K65n18n7N69n60J18K41r5R1J3j61M0K8j02J50j26r0M11l72
$$ -87 -143 35 -102 28 293 -225 -282 287 -273 -155 86 -9 82 95 -66 -26 2 -100 50 -76 -166 245 -127
7403a27M2qJ9J92k8j53J7P1k73L95j81k32M03l14K66j23j92P2L09k13J62n0k81
$$ -127 -85 -93 -74 118 90 -63 -46 25 -248 147 -34 -266 137 -177 89 -34 -226 -154 155 -58 104 54 -227
7426b27K21o3l9J56l9K56o4j79K26r3k82J23M2j25K9n0m3L09l5n6N0j53q4K36
$$ -227 -6 -69 -108 48 9 265 201 22 248 155 -127 -4 38 -87 -58 -108 -151 158 123 67 117 -36 -120 116
7450A16j72q6L60k80K25k37j17L70q0j25kj9k6J4j40M64L4m74J67K24p6Q9l07
$$ 116 -56 -142 218 -62 163 -74 -191 179 99 -26 -28 -47 -73 -59 -199 265 299 -175 -8 216 140 229 -78
7473g8J53J94k43l20O52l45j14L70n69L26M0k83L43l1l84L70k13k4R0J10p1M3
$$ -78 75 269 26 -294 358 13 -101 269 -300 26 66 -217 126 95 -289 81 -132 -156 -66 44 -27 16
7495A6K7J91q1j92J49j81J77o1k06q2L50k31pK43j47pJ72m11K35K66m97N21l62
$$ 16 43 234 153 -39 110 -71 106 45 -161 -243 107 -124 -131 112 -35 -42 130 -281 -46 220 -277 244 -118
7518a18k00N25j32k4l1k56K34J77m98L41M6j76J01r3P8J78k79J07Qk5K21l67P7
$$ -118 -318 207 75 51 20 -236 -2 175 -323 18 64 -112 -11 -104 -26 152 -127 -20 -12 -37 184 -183 -106
7541a06M8l2q8K34O5m09L84j71p8L00l14N8L03l23Q5K80k86J34j21J70n0R4n04
$$ -106 -58 -90 -178 56 121 -288 96 -75 -153 147 -167 -109 194 -129 -44 236 -50 84 -37 133 83 177 -327
7564c27L95o2qJ29k89K61R1q5J24j09k65JJ53j08O6L7J37M7j54m0J44k07J56J05
$$ -327 68 6 -2 127 -162 99 190 105 229 120 -145 -144 9 -99 -33 4 141 188 34 -6 138 -69 87 192
7588A92p02Q61m56J86Q8k01J27K5k35M5L4m71O66N8m85K11j35P1M72o13K78K51
$$ 192 -510 351 -105 81 169 -32 95 120 -115 -70 -36 -507 159 217 -268 -57 -192 -121 351 -262 16 267
7610B67m43M69l59k9J1J16k6J84j61l79P09l18R6J66l71n4L45k98K31k08j38L12
$$ 267 -176 293 -66 -95 -84 32 6 190 29 -350 359 41 137 303 -68 -122 223 -75 156 -52 -190 122
7632A22R2k16K04m87L01L87k94j94J32j3L8K1l71N70j63k23L8N3P1Q7k61J09J78
$$ 122 214 -2 202 -285 16 403 109 -85 47 34 72 93 -278 292 129 -94 -56 -3 68 155 -106 3 181
7655A81l94J99j01LK37n6j56pK25m22L32l9j19K37l48L01r6m9J89l0j76K10j88
$$ 181 -213 -14 -115 -112 125 69 -87 -94 131 -291 41 2 -117 120 -228 73 -23 -72 117 87 -89 121 -67
7678f7l6L91j57l75N79n84L31m7k21J31J25k43M38o6l50K10j64r8M21l68M8K46
$$ -67 -103 288 131 -244 335 -249 82 35 -186 -55 70 -173 265 199 -151 59 -105 -203 218 -150 -102 144
7700A44k03ml0j68N14k20O8K56k04m15L19j79P5M35l71jj28rJ28LL6j23k7K61
$$ 144 -59 -63 -93 -261 253 33 101 357 153 -262 57 -122 -47 388 17 16 -112 -121 7 10 46 -77 -104 157
7724A57J72l54l3K60k79J09J71m31L35j78J0L53l38j10J66J27k63L80r5k51K06
$$ 157 329 -25 -58 202 -77 32 203 -228 107 -71 -61 292 -46 -156 10 137 -126 254 159 -92 114
7745A14k83K24J5j94L09j91k14L51k77J66J7p6K09j69n4NPj32L72o5k55K80r8
$$ 114 -169 55 70 -124 185 -6 -220 131 -146 20 37 -39 170 1 -53 -48 -41 -173 199 134 -121 159 61
7768F1j12N8p7j5N6K2J78l18j52K56J93k8r2R1m06K89j44O9L20l24j23K40j43
$$ 61 -51 7 -70 -85 -29 -7 171 -147 -299 -43 150 122 30 121 -285 4 -140 -71 249 -75 -198 42 -101
7791a01P2L43j75M3j36k8J52O2k87K60k05j82N40l91k6J94m65J62J77j8K67m19
$$ -101 -29 314 139 182 46 18 170 232 -55 205 0 -182 358 -33 -59 135 -330 -168 9 -9 258 -161
7813a61q2L53j9j88O7j4n1K52j98m2L9R8J77j13k45K91j07k16L12m26M22L0k34
$$ -161 -243 110 91 -97 -30 -44 -95 157 -41 -83 -44 54 231 118 -127 164 57 -159 153 -273 149 179 -55
7836e5p4j20l0L85j0j95J30nj56K91k20M3r7k91M29K28m41J39j1j22J81J03j32
$$ -55 -129 -249 -279 106 96 -99 31 26 -130 161 -59 -16 -113 -404 25 253 -188 -49 -60 -182 -1 102 -30
7859c0J26k95J7M70k18J8J33l41K07J80l93M05k72j76J80P0n7q3j65L45Q0j47
$$ -30 96 -199 -182 288 70 88 221 -120 87 267 -126 279 7 -169 11 81 24 -59 -224 121 201 54
7881E4j27J49k51J28j68J12K5q4j60L71j09K38R7l76J89K3j07K25m4m11L53j92
$$ 54 -73 76 -175 -47 -215 -103 -78 -162 -322 49 -60 178 275 -101 88 111 4 229 185 -226 127 -65
7903f5O2K89l54RJ59m57M95R8n10M93j89j56N57q08%N45j54%J50l17K00l0L1K04
$$ -65 -3 286 -68 -59 100 -357 138 236 -274 219 30 -126 431 -377 -377 168 14 14 164 -153 47 17 48 252
7927B52m91O6K01j61L8K55k39J9M2o4q4M59l03K01L8m29K47j44n2K57k29o1N03
$$ 252 -239 -173 28 -133 -95 160 -79 -60 -18 -82 -166 293 -10 191 229 -200 47 -97 -149 108 -121 -182 321
7950C21n22J85m7qJ68P1m04L71j29k22K36j36K38j23j26O9L25k40N1l7j97K92
$$ 321 -201 -16 -63 -71 97 168 -236 135 6 -216 20 -116 122 -1 -127 -58 267 27 78 41 -156 136
7972A36p1r4J39J45l16J21l59M1L38k50J22L34m83j18M14l33L84m19k6K45o9J10
$$ 136 65 -29 110 255 -61 60 -299 -258 80 -170 -48 286 -197 -315 99 -234 150 -269 -295 -50 -119 -9
7994iK66j82l18L05l14N26k47m13N19k48N3J95k97J38O4l1J94l03l9Q9K47m18
$$ -9 257 75 -243 62 -252 274 27 -386 133 -115 -62 133 -164 -26 38 7 201 -102 -141 -52 195 -223
8016b23K59pj89J22l4l6K68j44K19o7m92J40K41j87J80J06m55K56k5r2L23q7j88
$$ -223 36 29 -160 -38 -72 -108 160 16 235 168 -324 -184 57 -130 50 156 -299 -43 -68 -160 163 76 -112
8039a12L56m21K56Ok27J18J19k17L95q8l86N15l85k3k1m8L96j25k10L41k33M5
$$ -112 244 -177 79 85 -142 -24 95 -122 273 185 -201 314 -71 -94 -115 -163 233 108 -102 239 6 51
8061E1J18l4k01J63n9k55M00k48J46J42n57N16J10l35j30J74k47K21L4J12m8k82
$$ 51 169 135 -66 97 38 -217 183 -65 81 223 -334 182 292 -43 -173 1 -246 -25 9 121 73 -209
8083b09R5j52K86qP2k25K70J00l60L58k72O2J37j36k0K21m48J51Q7l32M27j7k67
$$ -209 -114 -266 20 12 84 -141 129 229 -131 227 -45 17 154 18 -2 219 -229 -78 9 -323 104 87 -180
8106a80L60k35j90J98q8M63j67k29K63j74k24K47K71n04L27l27J06M04l65j01
$$ -180 180 -55 -245 -47 -135 328 161 -68 195 21 -203 44 315 -189 138 -189 -83 321 -44 -145
8126a45K98k07O6Nk54K85j1j36j15K17q8K21j56r6L70k75j8K18m16J40K97j06
$$ -145 153 -54 12 17 -237 48 37 -99 -214 3 -85 136 -20 -116 254 -21 -39 179 -237 -97 200 94
8148I4k3J63k79M18m45j18K23q5K28M7l14p6M22n65L44j07j50L49O7l29M5J18
$$ 94 71 234 -45 373 -72 -190 33 -52 176 223 -91 -167 255 -310 34 -73 -223 126 193 -136 -91 27
8170B7k1J53k14o9QJ2J5J32k93L94N0k75L29l62Q9J70q5m6m2k00L43
$$ 27 6 159 -55 -124 -116 -104 -89 43 -250 144 194 -81 248 -114 -25 145 60 14 -28 -228 115
8191A15
$$ Imaginary data points
##PAGE= N=2
##DATA TABLE= (X++(I..I)), XYDATA
0@%%%%%%%%qJ6j6J6k4L2m0N5o3P2q8J12j36J60j92K24k58K99l46M02m66N32o04
$$ 0 0 0 0 0 0 0 0 0 -8 8 -8 8 -16 16 -24 31 -32 40 -48 64 -72 88 -104 120 -138 161 -185 217 -249 283 -321
31c21O84p75Q76r88J111j243J387j546J720j908K115k344K592k860L153l472L821
$$ -321 363 -412 464 -524 587 -656 731 -815 905 -1003 1112 -1232 1360 -1500 1653 -1819 2002
48B002m206M627n090N603o173O808p517Q323r243J0297j1523J2971j4711J6845
$$ 2002 -2204 2423 -2667 2936 -3237 3571 -3946 4377 -4866 5431 -6092 6879 -7832 9013
62I013j9524K2989k7649L4250m4310O1485r7874K87985k56206k15138O02654o06832
$$ 9013 -10511 12478 -15171 19079 -25231 36254 -61620 226365 -29841 -244979 357675 -249157
74b49157K67907J39546l25719K00933P3403k28078J10395J91945m19277L46241
$$ -249157 18750 158296 -167423 33510 106913 -121165 -10770 181175 -238102 108139
84A08139K7932m64308O53626m45640l4154M73024n92780L47308N7889l30215L06259
$$ 108139 136071 -328237 325389 -120251 -154405 318619 -274161 73147 131036 -199179 107080
95A07080o3236j60154J63410N5605l00958L38966q9652k97256N45756m61199P8303
$$ 107080 43844 -116310 47100 102705 -198253 140713 51061 -246195 299561 -161638 -83335
106h3335L56529n59966M15339m6928k79195L52937j69548q5115J89772o5338j65972
$$ -83335 273194 -286772 128567 81639 -197556 155381 -14167 -99282 90490 25152 -140820
117a40820K86256j60547j48100M18451m38026J67241K24030m76601M28766j29922
$$ -140820 145436 -15111 -163211 255240 -182786 -15545 208485 -268116 160650 30728
127C0728k03009L49239k39343m248J73989j43460m0607K02369j84881k1456K68601
$$ 30728 -172281 176958 -62385 -66633 107356 -36104 -76711 125658 -59223 -80679 187922
138A87922l61569K10577R5446l52209L86691j82402j11884K95646k60823O3865
$$ 187922 -173647 36930 132376 -219833 166858 -15544 -127428 168218 -92605 -28740
148b8740J28481j71367N0565J14555j72280O0434J40737k71211K17061N36k35936
$$ -28740 99741 -71626 -21061 93494 -78786 -18352 122385 -148826 68235 68771 -167165
159a67165L25412k07208l3916K30269k56286J13765P6813j69991J09483L7369
$$ -167165 158247 -48961 -82877 147392 -108894 4871 81684 -88307 21176 58545
169E8545j39692J06864L8069j78439J95710o3995j28204K44568k00912K8177J51859
$$ 58545 -81147 25717 63786 -114653 81057 17062 -111142 133426 -67486 -39309 112550
180A12550k17829J34997K3225j36359J28720k0607r0743J12836k9374r0922J48331
$$ 112550 -105279 29718 52943 -83416 45304 24697 -66046 46790 17416 -73506 74825
191G4825r1643m2968J57346j66626O3404P8981j60552J29885j7429r0793J18085
$$ 74825 -16818 -59786 97560 -69066 -5662 73319 -87233 42652 25223 -65570 52515
202E2515n3927m3256R4602o0696k7913R7688r1139R869Q5341j23389P4620K6249
$$ 52515 -1412 -44668 49934 -10762 -38675 59013 -32126 -22257 63084 -60305 14315 40564
214D0564j05974J09860l9685m9983R4134o5372q452O7025o6439J1142N2782p4026
$$ 40564 -65410 44450 4765 -45218 48916 -16456 -24908 42117 -24322 -13180 39602 -34424
226c4424L6062L2041p7956O6583p391n5711P7518m4334j6313N9605n6171J2494
$$ -34424 1638 33679 -44277 22306 14915 -40796 36722 -7612 -23925 35680 -20491 -7997
238g997L5009n0937K6072J8321m6449L6808J634l8446M5870j9236k0649M4136
$$ -7997 27012 -23925 2147 20468 -25981 10827 12461 -25985 19885 649 -20000 24136
250B4136l5011K116K9782l8053J8209J2733l0948K4427l71k2350K6671j0250j2875
$$ 24136 -10875 -8759 21023 -17030 1179 13912 -17036 7391 7020 -15330 11341 1091 -11784
263a1784K5086j8045j837J9329k1780Q472R891j9574J4328L32j3165J5255o133
$$ -11784 13302 -4743 -6580 12749 -9031 -559 9332 -10242 4086 4418 -8747 6508 375
276C75o409J2492q886r64R362r953L669M548q812O213K36n675O267k148k625N147
$$ 375 -6034 6458 -2428 -3392 5970 -3983 -314 4234 -4578 1635 1871 -3804 2463 315 -2310 2837
292B837m017L59K620l261J523R18k639K285n97o00J450j091p0P43p76L26K5l20
$$ 2837 -1180 -821 1799 -1462 61 979 -1660 625 28 -572 878 -213 -283 460 -316 10 35 -285
310b85M16k80M12k94j4r6l04N71m03K56N38j101J078L66k070K124p81j467K940
$$ -285 131 -149 263 -31 -45 -141 -445 126 -277 -21 517 -584 494 860 -1210 914 133 -1334 1606
329A606k319J5L245m462J903K414n846N083ln617P618l988l230Q680p710N12P845
$$ 1606 -713 -698 2547 -1915 -12 2402 -3444 1639 1636 -3981 3637 -351 -3581 5099 -2611 -2099 5746
346E746j0808N207N093j2543J1210r90j1051J5453p876o420J6965j5348J438J4449
$$ 5746 -5062 145 5238 -7305 3905 2915 -8136 7317 -559 -6979 9986 -5362 -3924 10525
360A0525j9794R808Q647k1262J7439R61k0198K5154j0430j4288L0214k4334o58
$$ 10525 -9269 539 9186 -12076 5363 6324 -13874 11280 850 -13438 16776 -7558 -8216
373h216K6511l3724J6111J4053l3789K7618J40k7931L3911j2057k1783M0055k7139
$$ -8216 18295 -15429 682 14735 -19054 8564 8704 -19227 14684 2627 -19156 20899 -6240
386f240r279M2083m5427J4939K8912n3338L9773K445m2408M9901j9720k4501M8078
$$ -6240 -15519 26564 -18863 -3924 24988 -28350 11423 13868 -28540 21361 1641 -22860 25218
399B5218l1718j2094M8076m5885M430M6500o6862L7956K1961p0345P0822k1716
$$ 25218 -6500 -18594 29482 -16403 -11973 34527 -32335 5621 27582 -42763 28059 6343
411F343m1469P2922n0828o737N4587n5401R358M5740o3622K5984M0780q4173O6430
$$ 6343 -35126 37796 -13032 -19769 34818 -20583 -11225 34515 -29107 -3123 37657 -46516 19914
424A9914M573p9678J03870n7145k8411R1747q9013K5606M8776p7426M0872K8628
$$ 19914 24487 -55191 48679 -8466 -36877 54870 -34143 -8537 40239 -37187 3685 32313
436C2313p1512M9894K2271q8689R2250k2738p3993J28081r7340J59R5783j24181
$$ 32313 -39199 10695 32966 -55723 36527 13789 -60204 67877 -29463 -29304 66479 -57702
448e7702O8969K5458q7955P5463m476o2900O8305m637p7110J06766n1081n7068
$$ -57702 11267 36725 -51230 24233 19757 -43143 25162 20525 -56585 50181 -900 -57968
460e7968J40267j34317L7504Q6328j52923J18599j1901q7647J10154m8183m0140
$$ -57968 82299 -52018 -14514 71814 -81109 37490 25589 -62058 48096 -87 -40227
471d0227P9845l7311n2119J10094p9642k8124J37995j65574Q2113O0924j67604
$$ -40227 39618 2307 -49812 60282 -19360 -47484 90511 -75063 7050 67974 -99630
482i9630J66232o1331o9642J34868r7299j039P5789o6769j4198R4104r6521O025
$$ -99630 66602 5271 -64371 70497 -26802 -27841 47948 -18821 -33019 61085 -35436 -29411
494b9411J15960j76049J19466K4663j61378J98316j12057l5390J41708j40649
$$ -29411 86549 -89500 29966 54629 -106749 91567 -20490 -55880 85828 -54821
504e4821M8268N4210q5848K8524O0577r6620L7333Q1002j67718J46219j6864j38539
$$ -54821 -6553 47657 -38191 -9667 50910 -45710 -8377 72625 -95093 51126 34262 -104277
516a04277K14960j58733Q614J32711j74202J00585K0527r4126P0421J7934q5418
$$ -104277 110683 -48050 -39436 93275 -80927 19658 40185 -53941 16480 34414 -51004
527e1004O4477L8438j43885J60755n9231j01055K11859j94387N7650J06429j90209
$$ -51004 13473 51911 -91974 68781 9550 -91505 120354 -74033 -16383 90046 -100163
538a00163J47706k3407q5066J02262l0431n6799P6073m249j01822J50422q7987
$$ -100163 47543 24136 -60930 41332 10901 -45898 30175 25926 -75896 74526 -13461
549a3461n5559J84091k04732R7845O7924j83581J77874o7334o1857J18345p4334
$$ -13461 -69020 115071 -89661 8184 76108 -107473 70401 3067 -58790 59555 -14779
560a4779j7585P2078l9662n3318J24921j04517r434J42750j98376J29629K3203
$$ -14779 -32364 39714 52 -53266 71655 -32862 -42296 100454 -97922 31707 54910
571E4910j60256J92855j06859k9314J19097j08371K2815N7270o3517o895R0292
$$ 54910 -105346 87509 -19350 -48664 70433 -37938 -15123 42147 -21370 -28265 62027
582F2027j07690L0113R4445j75052J46321j9306j23429J87373j34085O628J04002
$$ 62027 -45663 -15550 78895 -96157 50164 30858 -92571 94802 -39283 -32655 71347
593G1347j26548O0048L1624p2073L2974M5973r1059N4387M4326j32919J40387
$$ 71347 -55201 4847 36471 -35602 -2628 43345 -47714 6673 50999 -81920 58467
604E8467n1380p7975J60686j42112L8501P6310j25770Q5518K531o5831N8061O388
$$ 58467 7087 -70888 89798 -52314 -13813 62497 -63273 22245 24776 -41055 17006 23394
616B3394o6966O6465K198q8749J23969p3407l3908J25858j39018O4755M3916j13025
$$ 23394 -43572 22893 25091 -63658 60311 -13096 -47004 78854 -60164 4591 48507 -64518
628f4518J00508k5065n0512P0366k6162l8396O5287k8706m4802R6107q0123J905
$$ -64518 35990 10925 -39587 30779 4617 -33779 31508 2802 -42000 54107 -26016 -24111
640b4111Q5360j19576P6688J3124q7927R8569m3995k9901O7569m6697r872N2175
$$ -24111 61249 -58327 18361 31485 -56442 42127 -1868 -31769 35800 -10897 -20769 31406
652C1406m3674q723O2504p2150K5496M5522r0213P5449j1053n7957Q4499n3265
$$ 31406 -12268 -20991 41513 -30637 -5141 40381 -49832 25617 14564 -43393 41106 -12159
664a2159q807N5037n3763J1718L3965m6098J5452L2365n7428L7644J4456o0676
$$ -12159 -20966 34071 -19692 -7974 25991 -20107 -4655 27710 -29718 7926 22382 -38294
676c8294O6450k6434l1081O5359n4249Q025L7993n0756K4826J6183l9488K7802
$$ -38294 28156 1722 -29359 36000 -18249 -10224 27769 -22987 1839 18022 -21466 6336
688F336Q261l8751L8246o503l2366M9472l1273r226M2629m5363J6845K0684l9626
$$ 6336 14597 -24154 14092 7589 -24777 24695 -6578 -15804 26825 -18538 -1693 18991 -20635
701b0635K8230K333k7557K8586o709k0126L0491j5934j1861L1379k8013L949K2665
$$ -20635 7595 9928 -17629 10957 4248 -15878 14613 -1321 -13182 18197 -9816 -5867 16798
714A6798l2443J9342O307k5413K4870o881j4346K3062j3013o588J9890j7099P35
$$ 16798 -15645 3697 10004 -15409 9461 2580 -11766 11296 -1717 -8305 11585 -5514 -4779
727d779J5948k0466R618Q478k0205J6817j671j3486J7743q972n392J4500j2044
$$ -4779 11169 -9297 321 8799 -11406 5411 3740 -9746 7997 -975 -6367 8133 -3911
740c911N15J0817j3296N927N270j1813Q956K47q761J0527m357m463R740p561j18
$$ -3911 -3396 7421 -5875 52 5322 -6491 2465 2712 -6049 4478 121 -4342 5398 -2163 -2281
755b281O807q030L444L133o993N336K82n044O216k696k587M851l473k05L754m312
$$ -2281 4526 -3504 -60 3073 -3920 1416 1698 -3346 2870 174 -2413 2438 -1035 -1240 2514 -1798
771a798J644J889l641K790r3k383K819j154j237K580k074L8K130k675J027R50
$$ -1798 -154 1735 -1906 884 791 -1592 1227 73 -1164 1416 -658 -620 1510 -1165 -138 812
787H12j692J096K82j364J409k27j057J531r91n44J598j078n4J398j658M52R49
$$ 812 -880 216 498 -866 543 316 -741 790 -201 -745 853 -225 -279 1119 -539 -87 862
804H62j946J299N87j937J758j15j719K360j216j053K676k213k26K514k665P86
$$ 862 -1084 215 802 -1135 623 508 -1211 1149 -67 -1120 1556 -657 -883 1631 -1034 -248
820b48K137m153K918P39m132M452j353k859N417l875j150N594o002J672M604p900
$$ -248 1889 -2264 654 1393 -2739 1713 360 -2499 2918 -957 -2107 3487 -2515 -843 3761 -4139
836d139N257J863p974Q340k156n887R533o054k604R406r038J722P877j1659O149
$$ -4139 1118 2981 -4993 3347 1191 -4696 4837 -1217 -3821 5585 -3453 -1731 6146 -5513 636
851F36M690j3022J1706j396j0398J5299q809m679J4891j3817J936J1528j6015
$$ 636 5326 -7696 4010 2614 -7784 7515 -1294 -5973 8918 -4899 -2963 8565 -7450
864g450P470P575j7423J3837J317j6887K0614q695j0626K3349j9403J278J7773
$$ -7450 20 7595 -9828 4009 5326 -11561 9053 358 -10268 13081 -6322 -5044 12729
877A2729k3290J1441Q719k1629J6731K215k0119K2311o012j7684K9929j9826o202
$$ 12729 -10561 880 9599 -12030 4701 6916 -13203 9108 3096 -14588 15341 -4485 -10687
890a0687K9525l2805J2859J6051l3048K5877k33k3723K7748q836j7367K8794j5847
$$ -10687 18838 -13967 -1108 14943 -18105 7772 7539 -16184 11564 2728 -14639 14155 -1692
903a692j2675L4825l1546L094L1025m5347K8065R048l9311M1680j5058j9729L5884
$$ -1692 -14367 20458 -11088 -7994 23031 -22316 5749 14797 -24514 17166 2108 -17621 18263
916A8263k2631q112L1069k6248l891L5412m2285J5504K7325n4843M6013n211l9800
$$ 18263 -4368 -12480 18589 -7659 -11550 23862 -18423 -2919 24406 -30437 15576 10365 -29435
929b9435N7372l5888p736M0787l9873Q327K6433l4890J0086K8665m8563K9620
$$ -29435 27937 -7951 -15687 25100 -14773 -6446 19987 -14903 -4817 23848 -24715 4905
941D905J7373n9004O3277k3884l3157O8420n8066J0882L7718n3493K8623J3619
$$ 4905 22278 -36726 26551 2667 -30490 37930 -20136 -9254 28464 -25029 3594 17213
953A7213l7703K4309J4952m6410M0115L755n4526P3216m2188j9906P1505p6642
$$ 17213 -20490 3819 18771 -27639 12476 16231 -38295 34921 -7267 -27173 44332 -32310
965c2310L3571K6364o1513M9856n958l2846L5937k569l7194M6242j1422m3894
$$ -32310 1261 27625 -33888 15968 10010 -22836 13101 10532 -26662 19580 8158 -35736
977c5736P7129n9782j689O7315r1795N8527Q748o3354P0066l0058k1643M4102
$$ -35736 41393 -18389 -20078 47237 -44558 13969 22717 -40637 29429 -629 -22272 21830
989B1830k2969k0362M5542k6081k6290P1831p1349J8174N4552r7354P9611j3429
$$ 21830 -1139 -21501 24041 -2040 -28330 43501 -27848 -9674 44878 -52476 27135 13706
1001A3706n5942Q2754n3940l616M4292l9653P9L6552l5345p180N8017p3781L5587
$$ 13706 -42236 40518 -13422 -17038 27254 -12399 -12320 24232 -11113 -18293 39724 -34057 1530
1014A530L5598r1578R2286l5603m0963Q6656p4479J9017L6371n2091K2999K0422
$$ 1530 37128 -54450 37836 2233 -38730 47926 -26553 -7536 28835 -23256 -257 20165
1026B0165l7679J1235L8066o8010M8595J4065p8500R7673n6097k0478Q1921q9031
$$ 20165 -17514 -6279 31787 -36223 12372 26437 -52063 45610 -10487 -30965 50956 -38075
1038c8075M1539K2917n7839M3357P82l3964K7107J4668n4883N5126p780n6703
$$ -38075 3464 26381 -31458 11899 12681 -21283 5824 20492 -34391 20735 12955 -43748
1050d3748R2200o9659J419O8112r3220N9400N097n4236N7282j9392k3199L4352
$$ -43748 48452 -21207 -19788 48324 -44896 14504 19601 -34635 22647 3255 -19944 14408
1062A4408o300l5373N1642k3165l3404P7602p3844J9901M9293q7590P0756j3023
$$ 14408 8108 -27265 24377 1212 -32192 45410 -28434 -8533 40760 -46830 23926 10903
1074A0903m4355O3449l7079q453L5451k3445j4072M2094l3216j0500N7350p0487
$$ 10903 -33452 29997 -7082 -15535 19916 -3529 -17601 24493 -8723 -19223 38127 -32360
1086c2360L5683K6420p4029P4937k9573k9322O1983m9462O852L0221l4141N519
$$ -32360 3323 29743 -44286 30651 1078 -28244 33739 -15723 -8871 21350 -12791 -7272
1098g272K8447l6266P998L5398n9738M3093O754n5873O9988l9863j3514N3071
$$ -7272 21175 -15091 -7093 28305 -31433 11660 18414 -37459 32529 -7334 -20848 32223
1110C2223n3772J9986K0626l7012J9902J2488l1721K0084J4475m3729M2568q728
$$ 32223 -21549 -1563 19063 -17949 1953 14441 -17280 2804 17279 -26450 16118 7390
1122G390l5229N8453m3259O06L9859n1413K8374R266l3547K8435j205k3926K5624
$$ 7390 -27839 30614 -12645 -12039 27820 -23593 4781 14047 -19500 8935 7730 -16196 9428
1135I428k441k6680L7767j9417j6315M3374m2227J2788K4725m3912L2868j826
$$ 9428 6987 -19693 18074 -1343 -17658 25716 -16511 -3723 21002 -22910 9958 8132
1147H132k6091L1111j2230j3866K5074j2815j1686K8353k2793j854K7729l5310
$$ 8132 -17959 13152 922 -12944 12130 -685 -12371 15982 -6811 -8665 19064 -16246
1159a6246J8403J1034l2260L0648q825j6444K7366j7004m691J9813j7060j36J7453
$$ -16246 2157 13191 -19069 11579 2754 -13690 13676 -3328 -8019 11794 -5266 -5402 12051
1172A2051k0922P213J3609k5542J9216P91k0352K5431j2891p770K1116j7839K146
$$ 12051 -8871 -1658 11951 -13591 5625 6416 -13936 11495 -1396 -9166 11950 -5889 -3743
1185c743J3143j6978P194Q497j7052J1459L173j5683J6940n664r921J8043j3102
$$ -3743 9400 -7578 -384 8113 -8939 2520 5693 -9990 6950 1286 -8635 9408 -3694
1198c694m22J2913j5502O549O247j3146R469J080j0161J0858k657p670J1993p121
$$ -3694 -4116 8797 -6705 -156 6091 -7055 2414 3494 -6667 4191 1534 -6136 5857 -1264
1212a264l068J1060j1096L254O571j0713O822J551q297Q481k243n308Q182m589
$$ -1264 -4332 6728 -4368 -1114 5457 -5256 1566 3117 -5180 3301 1058 -4250 3932 -657
1226f57k154P293o840J168M925p239L994J925o170N946j258m018N916l500j664
$$ -657 -2811 4482 -2358 -1190 3735 -3504 490 2415 -3755 2191 933 -3085 2831 -669 -2333
1241b333N324m479N42L519m716K528J589m280L459n81k818M044k172j149L217
$$ -2333 2991 -1488 -946 2573 -2143 385 1974 -2306 1153 572 -2246 1798 -374 -1523 1694
1256A694k669Q4K759l517J975Q94k693K057%k040K443j308r26K551j819l07K096
$$ 1694 -975 -891 1868 -1649 326 1220 -1473 584 584 -1456 987 -321 -1247 1304 -515 -822 1274
1273A274k450R60J490k518J512L56k132K591r25j087J983j174q83K287j899l9
$$ 1274 -1176 -216 1274 -1244 268 624 -1508 1083 158 -929 1054 -120 -1003 1284 -615 -654
1289f54K132k539J256R15k502J923J71k414K871j018j670L168k150o09L020l340
$$ -654 1478 -1061 195 1110 -1392 531 702 -1712 1159 141 -1529 1639 -511 -1120 1900 -1440
1305a440J152K012l732K486O89l523L785p92k927M439k327j862M876m341O5M427
$$ -1440 -288 1724 -2008 478 1167 -2356 1429 637 -2290 2149 -178 -2040 2836 -1505 -1440 2987
1321B987n304K488K293n706M974j43m858O265k558l621P198n325j071O992p604
$$ 2987 -2317 171 2464 -3242 1732 1589 -3269 2996 438 -3183 4015 -1310 -2381 4611 -2993
1336b993K408M730q984O541J310q163Q974l468n028R833o477k032Q903q932J665
$$ -2993 -585 4145 -4839 1702 3012 -5151 3823 355 -4673 5160 -1317 -3349 5554 -3378 -1713
1351a713P701j1966O947L919j2427J2213l300q018J3756r120k406J1685j1428
$$ -1713 5988 -5978 969 4888 -7539 4674 1374 -6644 7112 -2008 -4414 7271 -4157
1364d157J726R438j2689N561O796j5333J2653J83j3982J8262r397o258J7395j5870
$$ -4157 -2431 7007 -5682 -121 6675 -8658 3995 4178 -9804 8458 -939 -7197 10198 -5672
1378e672K672J1409j5783P707O783j5434J1004L394j7231J8642n399j3616K4323
$$ -5672 -3000 8409 -7374 333 7116 -8318 2686 6080 -11151 7491 2092 -11524 12799
1391A2799j7995j003J9399k3891J1634P657j9584J5779L72j5391J6661k967j5491
$$ 12799 -5196 -6199 13200 -10691 943 8600 -10984 4795 5167 -10224 6437 3470 -12021
1404a2021K3505j2483j0350K7623k6872P590J7905l0928K2738K4k0507K3775q605
$$ -12021 11484 -999 -11349 16274 -10598 -3008 14897 -16031 6707 6731 -13776 9999 1394
1417A394j1694K0028r848j0678K4526j8908m290K8297l4256J6658J3216l4742
$$ 1394 -10300 9728 -120 -10798 13728 -5180 -9470 18827 -15429 1229 14445 -20297
1429b0297L3139j0066j7028K9281j9448l510K0371j7022l236K2579k4450M268
$$ -20297 12842 2776 -14252 15029 -4419 -7929 12442 -4580 -7816 14763 -9687 -5419
1441e419K4483l9173K7351M256l4936M3340k3702r251L2498l0876Q080J6105k2669
$$ -5419 19064 -20109 7242 11498 -23438 19902 -3800 -13051 19447 -11429 -3349 12756 -9913
1454i913P092J6511k6332J2477J6602l8895L5432o082l0536M8748l5617Q24L1566
$$ -9913 -2821 13690 -12642 -165 16437 -22458 12974 6892 -23644 25104 -10513 -9689 21877
1467B1877l9900K0628Q839k5204J7107O445k3879J8777P146l4215L9819j6047
$$ 21877 -18023 2605 11444 -13760 3347 9792 -14087 4690 11836 -22379 17440 1393
1479A393k2693M9594m5910J3642K5377m4969L3674k911k2852K5695n688j7590
$$ 1393 -21300 28294 -17616 -3974 21403 -23566 10108 7197 -15655 10040 4352 -13238
1491a3238K2548l517k5787M0668k5831j1073M5191n2414K6254J5884m5631M4549
$$ -13238 9310 5793 -19994 20674 -5157 -16230 28961 -23453 2801 18685 -26946 17603
1503A7603j6127j7248L1292j8485p154K2186j3011j3392L4860l1118J041L5730
$$ 17603 1476 -15772 15520 -2965 -10119 12067 -944 -14336 20524 -10594 -9553 26177
1515B6177n2694L5865M285m0906N0016k7249q781L1817k7919M194J7852j9237
$$ 26177 -26517 9348 13633 -27273 22743 -4506 -13287 18530 -9389 -5195 12657 -6580
1527f580j508K6045l1880J0857K4360m8069M1368p238l2241N0642l6893K280K8318
$$ -6580 -8088 17957 -13923 -3066 21294 -26775 14593 7355 -24886 25756 -11137 -8857 19461
1540A9461l4520J5507J0559k1429R252J4711k8838J8523J1118l8800M3142j8327
$$ 19461 -15059 448 11007 -10422 -1170 13541 -15297 3226 14344 -24456 18686 359
1552C59k0361M6637m3127J2892K1873l7059K5514J005k0713J8201K493k2034K2247
$$ 359 -20002 26635 -16492 -3600 18273 -18786 6728 7733 -12980 5221 7714 -14320 7927
1565G927o72k7122L9192k4616q321L7878m3203K0968J2546l4351L0827p511j5814
$$ 7927 7255 -19867 19325 -5291 -13612 24266 -18937 2031 14577 -19774 11053 3542 -12272
1578a2272K2068q142j2917K1434r408j4344L1478k6966J718K7324l9501K6378
$$ -12272 9796 1654 -11263 10171 763 -13581 17897 -9069 -7351 19973 -19528 6850
1590F850K914k8161L2254j5093q951K1823j5296l266J7776j5240k371K1593k6248
$$ 6850 9764 -18397 13857 -1236 -10187 11636 -3660 -6926 10850 -4390 -6761 14832 -11416
1603a1416J0249J5149l2084K8077n531j9448K9964k0021j878J8901j9430M798
$$ -11416 -1167 13982 -18102 9975 4444 -15004 14960 -5061 -6939 11962 -7468 -2670
1615b670J1938j6506N628J1809k1242J4279M970k2613K5394j0833j1116K5016
$$ -2670 9268 -7238 -1610 10199 -11043 3236 8206 -14407 10987 154 -10962 14054
1627A4054k1184L688J3693j9150R846N732j4735J0483L289j5301J5521k688j3484
$$ 14054 -7130 -3442 10251 -8899 947 6679 -8056 2427 5716 -9585 5936 3248 -10236
1640a0236K0674j3701k943J7420j9611Q339P632j6527J2809j64j1037J2335l133
$$ -10236 10438 -3263 -6206 11214 -8397 -58 7574 -8953 3856 3692 -7345 4990 1857
1653A857q778J3550p411n066J4473j3395K376J0338j5804R993K491j2160J2274
$$ 1857 -6921 6629 -782 -5848 8625 -4770 -2394 7944 -7860 2133 4624 -7536 4738
1666D738l789o413J1059o570k967R742q676J35Q834j0823M983M631j0930R274
$$ 4738 949 -5464 5595 -975 -3942 5800 -2876 -2741 6093 -4730 253 4884 -6046 3228
1680C228j191p621J0436n815k333Q247p636J179N909p690L090L765p803N938K99
$$ 3228 2037 -5584 4852 -963 -3296 4951 -2685 -1506 4403 -3287 -197 3568 -4235 1703 2002
1695B002o417P931l427l520P428n750J14N172o517L065K708n985M609Q7m607N293
$$ 2002 -4415 3516 89 -3431 3997 -1753 -1639 3533 -2984 81 2789 -3196 1413 1500 -3107 2186
1711B186j742l144N490l804o34M394m881J957K532m828L530j96l342M296j815
$$ 2186 444 -2700 2790 -1014 -1648 2746 -2135 -178 2354 -2474 1056 860 -2482 1814 -1
1726ak133M256k698m30K985l539J488J680l451K560L20l012L196j050j619K941
$$ -1 -2134 2122 -576 -1006 1979 -1560 -72 1608 -1843 717 1037 -1975 1221 171 -1448 1493
1742A493j830o11K550k654J006J492k807J813M39k396K375l26j747K669j625j130
$$ 1493 -337 -948 1602 -1052 -46 1446 -1361 452 891 -1505 870 544 -1203 1466 -159 -1289
1758a289K875k162N5J875k570J310J108k481J797K1k046K411q14j346K494j487
$$ -1289 1586 -576 -521 1354 -1216 94 1202 -1279 518 539 -1507 904 90 -1256 1238 -249
1774b49o02K251k545Q56J569k702J819Q08k813K277o9k303L092j576q81K822k523
$$ -249 -851 1400 -1145 -289 1280 -1422 397 1205 -1608 669 600 -1703 1389 -187 -1068 1754 -769
1791g69J96K459l298J674J251l609K998Q5l145L846j122k626M159k894o25L947
$$ -769 -573 1886 -1412 262 1513 -2096 902 987 -2158 1688 566 -2060 2099 -795 -1420 2527
1807B527m185J357K418m239K717J009m279M459p54l810N212k891j940N670n065
$$ 2527 -1658 -301 2117 -2122 595 1604 -2675 1784 1030 -2780 2432 -459 -2399 3271 -1794
1822a794Q06M385o583L816J968o096N188m57m639O235k763l419P170n319n93O601
$$ -1794 -988 3397 -3186 630 2598 -3498 1690 1233 -3406 2829 66 -3353 3817 -1502 -2095 4506
1838D506p977L414L495q023O657j83o117P672l099l995P673m925j936P918q299
$$ 4506 -3471 -57 3438 -4585 2072 1889 -4228 3444 345 -3650 4023 -902 -2838 5080 -3219
1853c219J779O618j0792P380J787r752J0764m258m827J0033p073j391Q375q407
$$ -3219 -1440 5178 -5614 1766 3553 -6199 4565 307 -4520 5513 -1560 -2951 5424 -2983
1867b983J043Q004j1018N304M997j3085J1878j886r824J4650r098k168J0872j0753
$$ -2983 -1940 6064 -4954 350 5347 -7738 4140 2254 -7570 7080 -2018 -4186 6686 -4067
1881d067K456P307j0363M329O440j2804Q743K868j3901J6021o926p600J6902j4692
$$ -4067 -1611 5696 -4667 -338 6102 -6702 2041 4909 -8992 7029 103 -7497 9405 -5287
1895e287K784J0112j4222P740L808j1431Q359K587j2223J2298j440j2596J9095
$$ -5287 -2503 7609 -6613 1127 4935 -6496 1863 4450 -7773 4525 3085 -9511 9584
1908I584j2333l806J7870k0144R182P234j7045J3984j342j0135J1561k205r833
$$ 9584 -2749 -6555 11315 -8829 353 7587 -9458 4526 3184 -6951 4610 2405 -7428
1921g428J3935n789r868K0596j7432J505J6713k4023J5702K206j7159J9001p655
$$ -7428 6507 718 -9150 11446 -5986 -4481 12232 -11791 3911 6117 -11042 7959 304
1934C04o928J3618p778n587J4033r542n122J8754k0247O875J3297k6013K2077
$$ 304 -6624 6994 -784 -6371 7662 -1880 -7002 11752 -8495 -1620 11677 -14336 7741
1947G741m124j5005K2919j5072j596J3157j2194K28J1715j2382N58J5504k2306
$$ 7741 3617 -11388 11531 -3541 -5137 8020 -4174 -3946 7769 -4613 -4055 11449 -10857
1960a0857J2891P351k4393K6651j2097j0115K4506k1429N022J1422j6222P024
$$ -10857 2034 9385 -15008 11643 -454 -10569 13937 -7492 -2470 8952 -7270 -246
1972b46P035j3330N989R492k0300J6461J170k1276K8778j7632m726K3489k6037
$$ -246 6789 -6541 -552 8940 -11360 5101 6271 -15005 13773 -3859 -8585 14904 -11133
1985a1133J2042O986j7404J2985P35j1211R822K947j6630J8025m523j5402K7708
$$ -11133 909 7895 -9509 3476 4211 -7000 2822 5769 -10861 7164 2641 -12761 14947
1998A4947k2162K031J9385k7965J8706R30j6786J8155o276p706J1871l210j0570
$$ 14947 -7215 -5184 14201 -13764 4942 5872 -10914 7241 965 -6741 5130 1920 -8650
2011h650J7275r772q262K3848k4421Q770J3209k7006K3488n828j3333K0486j2614
$$ -8650 8625 -1147 -9409 14439 -9982 -1212 11997 -15009 8479 2651 -10682 9804 -2810
2024b810k265J2137q592m083J4209j2282j833J7995k3829J3495O799k3803K5249
$$ -2810 -5075 7062 -1530 -5613 8596 -3686 -5519 12476 -11353 2142 8941 -14862 10387
2037A0387j0736q744K0404j7100K978J0016j1869K245R643j2957L891J1574k0858
$$ 10387 -349 -9093 11311 -5789 -2811 7205 -4664 -2419 7224 -5733 -1842 9732 -11126
2050a1126J5950O43j8243K4493j5268l259J8096j9272Q131O160j2879P787L768
$$ -11126 4824 5467 -12776 11717 -3551 -6810 11286 -7986 145 6305 -6574 1213 4981
2063D981j1596Q091M180j5283J6237m796j1929K1770j7374K140J3594j9243J1978
$$ 4981 -6615 1476 5656 -9627 6610 1814 -10115 11655 -5719 -3579 10015 -9228 2750
2076B750K162j2187J0651r98q255R823j686r797J4453p883n633J6528j6817N985
$$ 2750 4912 -7275 3376 2378 -5877 3946 2260 -7537 6916 -967 -6600 9928 -6889 -904
2090i04Q734j6898J3651k307q986J2102n471m469R303n667l792J1249r534j22
$$ -904 7830 -9068 4583 2276 -6710 5392 -79 -4548 4755 -912 -4704 6545 -2989 -3111
2104c111J0701j4704Q675L744j3316J3760n564n530J1357q302m61P815p663Q89
$$ -3111 7590 -7114 1561 5305 -8011 5749 185 -5345 6012 -2290 -2751 5064 -2599 -1710
2118a710O692q984L432N819j1746R471k96r183J2409p038k612R479r232K633M843
$$ -1710 4982 -4002 -570 5249 -6497 2974 2678 -6505 5904 -1134 -3746 5733 -3499 -866 3977
2133C977p604L826L247p493N706J123p731Q805l278n083R758p547N00O354q249
$$ 3977 -3627 199 3446 -4047 1659 2782 -4949 3856 578 -4505 5253 -2294 -1794 4560 -3689
2148c689M147K449o516N323j73n096O084j814m086O566m165j476O604p165K643
$$ -3689 458 2907 -3609 1714 1541 -3555 2529 715 -3371 3195 -970 -2446 4158 -3007 -364
2163c64L330o343M835k7m701N290j907k735N281l456r55M606m414P79L371n251
$$ -364 2966 -3377 1458 1431 -3270 2020 113 -2622 2659 -797 -1752 2854 -1560 -781 2590 -2661
2179b661L341J040m580M629j235k681M309k862r25L896l599Q18K644m179K483
$$ -2661 680 1720 -2860 1769 534 -2147 2162 -700 -1625 2271 -1328 -510 2134 -2045 438
2194D38J156l662L097k34k854M006k512n97K973k885M36K491l431J924P90k945
$$ 438 1594 -2068 1029 795 -2059 1947 -565 -1162 1811 -1074 -638 1853 -1578 346 1136 -1809
2210a809K817j08k447K971j357j325K771k334K28J953k458J094J053k373J966
$$ -1809 1008 900 -1547 1424 67 -1258 1513 -821 -593 1360 -1098 -4 1049 -1324 642
2225F42L40k387K241q37j226K751k122j28K018k055P21Q70k275J784L40j914K356
$$ 642 982 -1405 836 -1 -1227 1524 -598 -726 1292 -763 -42 828 -1447 337 677 -1237 1119
2242A119q26j563K340j616l73K224k069N93J508k472J322O72k079J829j91j760
$$ 1119 293 -1270 1070 -546 -919 1305 -764 -171 1337 -1135 187 859 -1220 609 418 -1342
2258a342K349j123j105K400j962N27J631k614J487O84k340K020Q4j979K222r43
$$ -1342 1007 -116 -1221 1179 -783 -256 1375 -1239 248 932 -1408 612 696 -1283 939 -4
2274dj377K950k191m13K528k415Q95J429k911J711P37k639K938o92k238L425k015
$$ -4 -1381 1569 -622 -1035 1493 -922 -27 1402 -1509 202 939 -1700 1238 546 -1692 1733 -282
2291b82q54K721k570M01K214k765J267J517l409K583L9l011L810j559k110M274
$$ -282 -1136 1585 -985 -584 1630 -1135 132 1649 -1760 823 862 -2149 1661 102 -2008 2266
2307B266l426J58L330m035J708J889m049K667J015m006L802o21l248M984l080
$$ 2266 -1160 -1002 2328 -1707 1 1890 -2159 508 1523 -2483 1319 698 -2550 2434 -646
2322f46j269M823n012J619K912m908L196Q53m018L943m78l790N136k456k642O419
$$ -646 -1915 2908 -2104 -485 2427 -2481 715 1568 -2450 1493 1015 -2775 2361 -95 -2737 3682
2338C682n261J10N257p088L871J675n818N401q08m089N325j856l446O212l887
$$ 3682 -1579 -1469 3788 -3300 571 2246 -3572 1829 1021 -3068 2257 401 -3045 3167 -720
2353g20j859P018p471K872M063q440O637m64n753P476l495k848O349m155j597
$$ -720 -2579 4439 -3032 -160 3903 -4537 2100 1636 -4117 3359 -136 -2984 3365 -790 -2387
2368b387O211n939K38O686r438N409K904r509R592l393m727Q999o495k33O164
$$ -2387 3824 -2115 -1877 4809 -4629 780 3684 -5825 3767 374 -4353 4646 -1849 -2082 4082
2383D082o241Q93N471p539K418N524j0225Q092J89r308J2302p021k337R507r875
$$ 4082 -2159 -1266 4205 -3334 -916 4608 -5617 2475 2664 -6644 5658 -1363 -3700 5807 -4068
2398d068L141M697p261L791L190p432M557L268j0373J0790k958p784J3712j0672
$$ -4068 -927 3770 -3491 300 3490 -3942 615 3883 -6490 4300 1342 -6442 7270 -3402
2412c402R25Q805j2035O770K298q084O745N64o850O532K57q583J1427n694n104
$$ -3402 -2477 6328 -5707 1063 3361 -4723 2022 2586 -4264 2268 2525 -6058 5369 -325 -5429
2427e429J3669j4077N025P048j3478J0620j410p157Q906l216m731P818l014n803
$$ -5429 8240 -5837 -812 6236 -7242 3378 1968 -5189 3717 501 -4230 3588 574 -5229
2441e229J1489q565j828J2314j5718Q899M040j3864J4336n638n159J0381o963
$$ -5229 6260 -2305 -4133 8181 -7537 1362 5402 -8462 5874 236 -4923 5458 -1505
2454a505j450P125n319k798J0248j0079J537R863j6002J1822L81j2457J6166r602
$$ -1505 -2955 4170 -1149 -3947 6301 -3778 -2241 7622 -8380 3442 3823 -8634 7532 -2070
2468b070k004J0529j0168K579N419p177J054P192j0148M861N871j4481J3918l730
$$ -2070 -4074 6455 -3713 -1134 4285 -2892 -1838 5354 -4794 67 5938 -8543 5375 1645
2482A645r393J6268j2795J690R122j2152O355K854p643M537L445r199O822K337
$$ 1645 -7748 8520 -4275 -2585 6537 -5615 740 3594 -4049 488 3933 -5266 1556 3893
2496C893j1776J4441p056n703J5426j5123N228O736j2718R533p80o534O834o56
$$ 3893 -7883 6558 -498 -6201 9225 -5898 -670 6066 -6652 2881 2101 -4433 2401 1745
2510A745o445Q193j841q048J3195r110j915J2363j5276Q765L073j2017J2004m183
$$ 1745 -4700 3493 1652 -6396 6799 -2311 -4226 8137 -7139 1626 4699 -7318 4686 503
2524E03m969Q544m253l400P356m282l506J0309j0020J797R132j4748J0706k79
$$ 503 -4466 4078 -175 -3575 3781 -501 -4007 6302 -3718 -1921 7211 -7537 3169 2890
2538B890r602J2569p234j997Q311o974P0N929o161M3P460r857M754M886j1826
$$ 2890 -6712 5857 -1377 -3374 4937 -2037 -1967 3962 -2199 -2156 5304 -4553 201 5087 -6739
2553f739J0869k927o923J2105r028M65O989q338L212L770o751L072L669p811N934
$$ -6739 4130 1203 -5720 6385 -2643 -2178 4811 -3527 -315 3455 -3296 -224 3445 -4366 1568
2568A568J048q378J0458m977l701R929r918L097M940q306N565J215n952M982J87
$$ 1568 2616 -5762 4696 -281 -3982 5947 -3971 -874 4066 -4240 1325 2540 -3412 1570 1757
2583A757n761O590j795m989Q706o145p09P564r448M871K443p474O682j248m420
$$ 1757 -4004 2586 791 -4198 4508 -1637 -2346 5218 -4230 641 3084 -4390 2292 1044 -3376
2598c376O040k239l021N745m008j821O464o348J587M796p982N906J82n646O444
$$ -3376 2664 425 -2596 3149 -859 -2680 3784 -2564 -977 3819 -4163 1743 1925 -3721 2723
2613B723k962k168N164l730o36M380m290M12M047n699L115J986o072N752j375
$$ 2723 -239 -2407 2757 -973 -1609 2771 -1519 -1107 2940 -2759 356 2342 -3730 2022 647
2628F47l663N900m018k82M169m398J191K620m300K239J714m087L754k16l702M657
$$ 647 -3016 2884 -1134 -1416 2753 -1645 -454 2166 -2134 105 1819 -2268 1486 1270 -2432 2225
2644B225k572j680M539m132O55K859l800K295J077l508L067n3k955L418j169j974
$$ 2225 -347 -2027 2512 -1620 -965 1894 -1906 389 1466 -2042 1025 972 -1983 1435 266 -1708
2660a708L625k839L2L187l913J611J389l427K998k29k419K778j172j343L075k219
$$ -1708 1917 -922 -890 2297 -1616 -5 1384 -2043 955 726 -1693 1085 -87 -1430 1645 -574
2676e74k33K499k912J099J617l215K282L88k450K729r43j406K446j873l27K408
$$ -574 -807 1692 -1220 -121 1496 -1719 563 951 -1499 1230 287 -1119 1327 -546 -873 1535
2692A535k701J008J442k388J468K71k249K576q06j478K451j363l64J730j881N04
$$ 1535 -1166 -158 1284 -1104 364 635 -1614 962 156 -1322 1129 -234 -598 1132 -749 -245
2708b45J392k306J507K97j939K038o10j200J969r33q16J923j645K48J353j928
$$ -245 1147 -1159 348 645 -1294 744 134 -1066 903 -30 -846 1077 -568 -320 1033 -895
2724h95J092P63j979J606j51j559K121r81p67J774j410k77J641j930R28J103k026
$$ -895 197 960 -1019 587 436 -1123 998 17 -750 1024 -386 -663 978 -952 -24 1079 -947
2741i47J266M93j951J950m48j215J893j213o28K080k197P58J215k012J065P89
$$ -947 319 812 -1139 811 363 -852 1041 -172 -800 1280 -917 -159 1056 -956 109 898
2757H98j890J454j00j566K410j385o81K137j869J99J571k165P54Q76k209K293
$$ 898 -992 462 362 -1204 1206 -179 -860 1277 -592 -393 1178 -987 -233 643 -1566 727
2773G27M2j943K199j144j058K602j681n89K233k143L64J784k561J365Q15k857
$$ 727 769 -1174 1025 -119 -1177 1425 -256 -845 1388 -755 -391 1393 -1168 197 1012 -1845
2789a845K819m02j935K987j979p05K239j938K6K262k587Q16J686l210K420K16
$$ -1845 974 572 -1363 1624 -355 -1060 1179 -759 -733 1529 -1058 -242 1444 -1766 654 870
2805H70k827L680j943j141L165k873O93J828k467J008J311k799J913J160l689
$$ 870 -1957 1723 -220 -1361 1804 -1069 -376 1452 -1015 -7 1304 -1495 418 1578 -2111
2820b111L574q77k703M512l383N7L246l902J528J609l354K155J020l404K942J85
$$ -2111 1463 586 -2117 2395 -988 -931 2315 -1587 -59 1550 -1804 351 1371 -2033 909 1094
2836A094l641M476k332j766N125m715J224K995m886L397M95l639L244j94k980
$$ 1094 -2547 1929 -403 -2169 2956 -1759 -535 2460 -2426 971 1466 -2173 1071 877 -2103
2851b103L705j176k926N291l711p40N011o280L326J924n487M909r82l129M174
$$ -2103 1602 426 -2500 2791 -920 -1660 3351 -2929 397 2321 -3166 1743 761 -2368 1806
2866A806j901j719L879k501j774N400n117Q44M476o940M919J36n197O224k889
$$ 1806 -95 -1814 2065 -436 -2210 3190 -1927 -1083 3393 -3547 1372 1508 -3689 2535 -354
2881c54j819M584l208m20L508l399j75M780o140K574L078p432P133k053m369P534
$$ -354 -2173 2411 -797 -1217 2291 -1108 -1283 3497 -2643 -69 3009 -4423 2710 657 -3712 3822
2897C822n398J6M514m850J333K820m149J310L633o384M172J831p336Q199l700
$$ 3822 -1576 -1560 2954 -1896 -563 2257 -1892 -582 3051 -3333 839 2670 -4666 3533 -167
2912a67l092P856p231J996L611n723L248J389m397K919J928n571M998k96n806
$$ -167 -3259 4597 -2634 -638 2973 -2750 498 1887 -2510 409 2337 -3234 1764 1468 -4338
2927d338Q670n605j010P053q594M246K206o206N158n73l426M119n63m227N514
$$ -4338 4332 -1273 -2283 4770 -3824 422 2628 -3578 1580 1007 -2419 1700 1137 -3090 2424
2942B424j928m089Q568p601J368N856r270O676o0n771O704l023k484M970k514
$$ 2424 496 -3593 4975 -2626 -1258 4598 -4672 2004 1944 -3827 2877 -146 -2630 2340 -174
2957a74k355N531l684j846O973p854L290L969r195Q205k176m343P217m902l54
$$ -174 -2529 3002 -682 -2528 4445 -3409 -119 3850 -5345 2860 684 -3659 3558 -1344 -1698
2972a698M050l732j98M295m348M08N248q041M874K019p692Q852m486k655O997
$$ -1698 2352 -1380 -1578 2717 -1631 -1223 4025 -4016 858 2877 -4815 4037 -449 -3104 3893
2987C893o433J914L328m886K112K408m416K145K766o759N965o39n817Q553n594
$$ 3893 -2540 -626 2702 -2184 -72 2336 -2080 65 2831 -3928 2037 1398 -4419 4134 -1460
3002a460o98O656p966L804J990n223L853O42m164L563P81n190O055k179l897P897
$$ -1460 -2158 4498 -3468 336 2326 -2897 956 1598 -2566 997 1778 -3412 2643 464 -3433 4464
3018D464o851J182N022p833N609Q9m566M771j441k843M028j339k793N494l571
$$ 4464 -2387 -1205 3817 -4016 1593 1682 -2884 1887 446 -2397 1631 292 -2501 2993 -578
3033e78j510O318p229L106K892o599N744j640l063N206l314q61L885l035p12L849
$$ -578 -2088 4230 -2999 107 2999 -3600 2144 504 -2559 2647 -667 -1528 2357 -678 -1390 2459
3049B459l968M57M046o108M102J001n652O391k900k097N196m423O61K726l380
$$ 2459 -1509 -1052 2994 -3114 988 1989 -3663 2728 -172 -2269 2927 -1496 -835 1891 -1489
3064a489R98K460l680J867J757m811M633r14l670O025m305l41M291m666J823J694
$$ -1489 -491 1969 -1711 156 1913 -2898 1735 821 -2849 3176 -1129 -1470 2821 -1845 -22 1672
3080A672l617K235P49l157K906K22l510M448j973k020M832m362R85K672m469L249
$$ 1672 -1945 290 1039 -2118 788 1010 -2500 1948 -25 -2045 2787 -1575 -590 2082 -2387 862
3096H62K24k959K858n56k091L158j235j918L530k602k44K870l585J705J586l767
$$ 862 1086 -1873 985 429 -1662 1496 261 -1657 1873 -729 -973 1897 -1688 17 1603 -2164
3112b164L307o35j911K814j514j088K646k045l71K501k632Q28J664l004K153M45
$$ -2164 1143 508 -1403 1411 -103 -1191 1455 -590 -961 1540 -1092 -264 1400 -1604 549 994
3128I94k863L396j490j518L092k246k8K132k278M65J644k668J514N97k262K517
$$ 994 -1869 1527 37 -1481 1611 -635 -663 1469 -809 -344 1300 -1368 146 743 -1519 998
3144I98o51j908L068j994j72K040k249N99J374j992J054Q02k346K150m72j118
$$ 998 347 -1561 1507 -487 -659 1381 -868 -269 1105 -887 167 969 -1377 773 301 -817
3160h17J964j555l24J589j407J33J487k054R55P33j633J415n0j561J899r13o46
$$ -817 1147 -408 -732 857 -550 -417 1070 -984 -29 704 -929 486 436 -1125 774 -139 -785
3177g85J880j602K24J214j679O28Q65j787J236L1j322J864p61p47J766j626L62
$$ -785 1095 -507 -283 931 -748 -120 745 -1042 194 225 -1097 767 6 -741 1025 -601 -239
3194b39J114j723P79J000j894J163J68j136J487p14q34J645j071k98J314j087
$$ -239 875 -848 -69 931 -963 200 368 -768 719 5 -829 816 -255 -553 761 -326
3210c26J23Q22j439J100L05j278J370n18j031J593q32l15J454j502M8J091j523
$$ -326 -203 619 -820 280 585 -693 677 159 -872 721 -111 -426 1028 -474 -426 665 -858
3227h58Q82Q77j883J393k53j011J694j053m97J537r08j28J021j402J93J009j364
$$ -858 24 901 -982 411 158 -853 841 -212 -709 828 -80 -208 813 -589 -396 613 -751
3244g51J184m7j367J611l67j191K040j223p01J793j783N53J232k002J399O3j549
$$ -751 433 386 -981 630 263 -928 1112 -111 -812 981 -802 -249 983 -1019 380 443 -1106
3261a106J636q6j476J776p81p92J485j135J0J402j850Q89R74k007J719l55j149
$$ -1106 530 444 -1032 744 -37 -829 656 -479 -469 933 -917 -28 946 -1061 658 303 -846
3278h46J425n91q03J957j594l34K054k080N82J280k425J837K39j520J893j106
$$ -846 579 -12 -815 1142 -452 -786 1268 -812 -230 1050 -1375 462 701 -819 1074 -32
3294c2r08J715q21n14J652j713J00J630k440J572Q51k790K786p33j658K658j760
$$ -32 -940 775 -46 -560 1092 -621 -521 1109 -1331 241 1092 -1698 1088 355 -1303 1355 -405
3311d05k83J949j972L27J414j653L84J488k705J955N7k273L219j600j085K794
$$ -405 -688 1261 -711 -384 1030 -623 -239 1249 -1456 499 556 -1717 1502 -98 -1183 1611
3327A611k537O32J426k225R59J116k381J675Q62k796K823k93k896L864k537k99
$$ 1611 -926 -294 1132 -1093 -134 982 -1399 276 1138 -1658 1165 872 -2024 1840 -697 -996
3343i96K912l635J953P24k481J780O31k157J860L18k816L620j768j822M146l664
$$ -996 1916 -1719 234 958 -1523 257 888 -1269 591 909 -1907 1713 -55 -1877 2269 -1395
3359a395Q05K471l964K719K84k604K843q72j413K137p34j856L354k128j129L975
$$ -1395 -590 1881 -2083 636 920 -1684 1159 287 -1126 1011 277 -1579 1775 -353 -1482 2493
3375B493m524J931K049m502L963j258j764L192j671q64K170j362j310L285k858
$$ 2493 -2031 -100 1949 -2553 1410 152 -1612 1580 -91 -955 1215 -147 -1457 1828 -1030
3390a030J30L390m682K999Q52m252M744k408j247L664l159J94K271k025j83K684
$$ -1030 -900 2490 -2192 807 1659 -2593 2151 -257 -1504 2160 -999 -805 1466 -559 -742 1942
3406A942l251J125K345m912M156k35l812N508m032j81L635l815J517J570k954
$$ 1942 -1309 -184 2161 -2751 1405 1170 -2642 2866 -1166 -1347 2288 -1527 -10 1560 -1394
3421a394J473J373l171K155J048l968M401j847k391N341m693R15K838m077K833
$$ -1394 79 1452 -1719 436 1484 -2484 1917 70 -2321 3020 -1673 -758 2080 -1997 836
3436H36K53k473K076L66k774K719j06l330M672k765j330M705n006K155K034m646
$$ 836 1089 -1384 692 1058 -1716 1003 897 -2433 2239 -526 -1856 2849 -2157 -2 2032 -2614
3452b614L993r72k062K976r44j909K906j107k136M213l746L76L733n073L130Q40
$$ -2614 1379 407 -1655 1321 377 -1532 1374 267 -1869 2344 -1402 -1026 2707 -2366 764 1604
3468A604m187M609k055j424L016k106l44K362k027m56L146l715J114K718m998
$$ 1604 -2583 2026 -29 -1453 1563 -543 -887 1475 -552 -1008 2138 -1577 -463 2255 -2743
3483b743M124m87l219M599l135l47L022k777L94J929k230M68K117l390K049J187
$$ -2743 1381 894 -2325 2274 -861 -1208 1814 -963 -569 1360 -870 -402 1715 -1675 374 1561
3499A561m398M634j683k015M578l835N69K486l602K392M87k434J293J242k930
$$ 1561 -2837 1797 114 -1901 2677 -1158 -589 1897 -1705 687 1174 -1260 33 1275 -1655
3514a655K428K06l242M189k353r64L633m030J840J546l379K698l16k098K158j27
$$ -1655 773 979 -2263 1926 -427 -1391 2242 -1788 52 1598 -1781 917 601 -1497 661 534
3530E34j918K591j055j611L270k715K92K543l837K687L34k889K951j115j508K606
$$ 534 -1384 1207 152 -1459 1811 -904 -612 1931 -1906 781 1115 -1774 1177 62 -1446 1160
3546A160j228q48K122j549o03K758k955Q71J775l566L294q25k208L291j813m63
$$ 1160 -68 -916 1206 -343 -946 1812 -1143 -272 1503 -2063 1231 406 -1802 1489 -324 -787
3562g87K130j979J73J521j994P52J398k636J863N18k390K912j570j215K861k273
$$ -787 1343 -636 -463 1058 -936 -184 1214 -1422 441 959 -1431 1481 -89 -1304 1557 -716
3578g16L53J451k065J034R06j893Q61R18j806J954q06j728K775j627k00J960k323
$$ -716 -363 1088 -977 57 963 -930 -69 849 -957 997 191 -1537 1238 -389 -589 1371 -952
3595i52R77J087k246J622J03j637J541m08j076J962j130n99K121j970L70J521
$$ -952 25 1112 -1134 488 591 -1046 495 87 -989 973 -157 -756 1365 -605 -235 1286
3611A286k329J229M38j503J519m05j290J871r18o71J661j243j10J251j748Q48
$$ 1286 -1043 186 624 -879 640 235 -1055 816 -102 -773 888 -355 -465 786 -962 -114
3627a14J018k061J662j63j285J710o93p29J397r92j5J007j152L33O81j294J118
$$ -114 904 -1157 505 342 -943 767 74 -655 742 -250 -265 742 -410 -77 604 -690 428
3644D28lj377J751p00o77J316j107j06J200j417L67J044j507J142J20j226J267
$$ 428 425 -952 799 99 -578 738 -369 -475 725 -692 -325 719 -788 354 474 -752 515
3661E15j92j111J671j027k52J079j288N26P58j372Q99J51j191J325n03o37J439
$$ 515 323 -788 883 -144 -396 683 -605 -79 679 -693 206 357 -834 491 -12 -649 790
3678G90q43o55J412j013J92N45j184Q04L95j301J176j59r81J426q38l22J220j059
$$ 790 -53 -708 704 -309 -117 428 -756 48 443 -858 318 159 -822 604 -234 -556 664 -395
3696c95K94O98j062M72O09j118O39L33j059J096m63p38J192m31k99Q28j101N21
$$ -395 -101 597 -465 7 616 -502 137 470 -589 507 44 -694 498 67 -232 596 -505 16
3714A6L83q95R31m0j101J237m17q27J184p13j35J228j256K02O04j118Q26M38j238
$$ 16 399 -496 435 395 -706 531 114 -713 471 -242 -377 851 -405 -203 401 -717 109 547 -691
3733f91J130J22j280J431p68m18J234j177K83P12r31N64L44j221Q21K97j179J417
$$ -691 439 561 -719 712 -56 -474 760 -417 -134 578 -353 211 555 -666 155 452 -727 690
3751F90m47r06J337j044r3J265j294L13M69q68O78L93j104J106j14r93J294o26
$$ 690 243 -663 674 -370 -463 802 -492 -179 290 -578 100 493 -611 495 381 -612 682 56
3769E6n76J456j260K24R61j776Q86N95j072R08k62r07J092m51n28J425r99j44
$$ 56 -520 936 -324 -100 861 -915 -29 566 -506 402 140 -767 325 -126 -654 771 -228 -372
3787c72J507j840R01M11j511J098q8p88J133m65o12J233o76o39J732j522K30J238
$$ -372 1135 -705 196 607 -904 194 106 -682 451 -14 -626 607 -69 -708 1024 -498 -268 970
3805I70j899J360J20j814J963o59q63J360p52j52J014q88k02J470j645M44J190
$$ 970 -929 431 551 -1263 700 41 -822 538 -214 -366 648 -240 -442 1028 -617 -173 1017
3822A017k217J874l29j235K183j731J5J418j523K99R81j206L8J120j619R95P72
$$ 1017 -1200 674 345 -890 1293 -438 -423 995 -528 -229 752 -454 -416 704 -915 80 852
3839H52k225K364r13j010K175k049M65J281j685Q36O12j419R81O70j963J647J12
$$ 852 -1373 991 78 -932 1243 -806 -341 940 -745 91 703 -716 265 935 -1028 619 731
3856G31k124K594j317q44K473k714J331N45j928J675j20r37R40Q3j364J618l39
$$ 731 -1393 1201 -116 -960 1513 -1201 130 675 -1253 422 302 -635 305 388 -976 642 303
3873C03j520K697k217L74K019l161J844N48k262K244p20r70J505n55q76J383q77
$$ 303 -1217 1480 -737 -363 1656 -1505 339 887 -1375 869 149 -821 684 129 -747 636 -241
3890b41q63K700k835P61J758l269K935n22j737K787j726j16J207j092m01J715
$$ -241 -1104 1596 -1239 -478 1280 -1989 946 424 -1313 1474 -252 -368 839 -253 -654 1061
3906A061j431k68K181k601J058J256l002K909j033j274K292j950M27J249j403
$$ 1061 -370 -638 1543 -1058 0 1256 -1746 1163 130 -1144 1148 -802 -375 874 -529
3921e29L91Q39j468R05J060k579J950M03k820L181j638n64K433k434R46P12j732
$$ -529 -138 701 -767 138 1198 -1381 569 972 -1848 1333 -305 -869 1564 -870 76 788 -944
3938i44R48N70j489J050P84k245K037l12j760L020k290j2K283k861J446N22j872
$$ -944 4 574 -915 135 919 -1326 711 399 -1361 1659 -631 -643 1640 -1221 225 747 -1125
3955a125J828m09q90J026P5j552K006j118q79K667k679Q71J421k962K839n97j548
$$ -1125 703 294 -596 430 505 -1047 959 -159 -1038 1629 -1050 -179 1242 -1720 1119 522 -1026
3972a026K155j026p33J473r32p48K004j648j50K356l074J446Q78k702K808j040
$$ -1026 1129 103 -630 843 -89 -837 1167 -481 -631 1725 -1349 97 975 -1727 1081 41
3988D1j035K185j831L53R62j103k5J462j718M69J553k518J970j60j986K482j410
$$ 41 -994 1191 -640 -287 675 -428 -453 1009 -709 -240 1313 -1205 765 605 -1381 1101 -309
4005c09l60K163k276O52P64j149O73N24j443J064M27k106K315p90j127K363k060
$$ -309 -669 1494 -782 -130 634 -515 158 682 -761 303 730 -1376 939 149 -978 1385 -675
4022f75N21J372j920J026L53j416R90Q0j178J189r7j180K032j028q97J942k044
$$ -675 -154 1218 -702 324 677 -739 251 331 -847 342 245 -935 1097 69 -828 1114 -930
4039i30Q85R04j902J786m12j187J419n82m26J053o88o37J583j493J93J581j945
$$ -930 -45 859 -1043 743 331 -856 563 -19 -445 608 -80 -717 866 -627 -434 1147 -798
4056g98R81P44j691J608p18j015J422p54l20R90j038J14J095j179M09J128j982
$$ -798 183 927 -764 844 126 -889 533 -221 -541 449 -589 -475 620 -559 -150 978 -1004
4073a004J471p1j205J785j160k68J305j113m7J119j084L34M80j165J098o9j286
$$ -1004 467 396 -809 976 -184 -452 853 -260 -307 812 -272 62 542 -623 475 406 -880
4090h80J602o68o08J386j169j09R59q23M19M46j124P41K91j353J200l20m12J089
$$ -880 722 54 -554 832 -337 -446 513 -310 109 555 -569 172 463 -890 310 -10 -422 667
4108F67q20k95Q66q42L52O11j173P35J71r34J263m25q07J361r13l5Q80j107J47
$$ 667 -153 -448 418 -424 -72 539 -634 101 272 -662 601 176 -631 730 -183 -218 662 -445 -298
4127b98R42j027N76R3r06J051k62q20J027n20j35R73j168K48Q74j196M85L21p40
$$ -298 644 -383 193 286 -620 431 169 -651 376 -144 -279 694 -474 -226 648 -548 -63 258 -482
4146d82Q70j66o81Q65l53k90R46r39J27P77j028N72K33j000O91j00n43J001m37
$$ -482 388 222 -459 406 53 -237 709 -230 -103 674 -354 218 451 -549 142 42 -501 500 63
4165F3k39Q61j082J49P53r51M10N87j191P00J29p39J031m22o65R98o07k17Q07
$$ 63 -176 685 -397 -248 505 -446 -36 551 -640 60 189 -550 481 59 -606 392 -215 -432 375
4184C75p34K88N28r71M33M69r18J151m41q82J138m57n0O46r48L3O49q39P56K78
$$ 375 -359 -71 457 -514 -81 388 -530 621 180 -702 436 -21 -71 575 -373 -340 309 -530 226 504
4204E04j129P44k37l72Q33l12m41J175j214J72P07p98K96P08j137N44L4m91Q76
$$ 504 -625 119 -118 -490 343 31 -410 765 -449 -277 430 -368 -72 636 -501 43 77 -414 462
4223D62m51l28Q45n63l95R77j026M85N11r76O72q9p14J008l76l71P67l40l70Q50
$$ 462 11 -317 528 -35 -430 547 -479 6 517 -459 213 124 -590 418 42 -329 438 98 -272 578
4243E78r07N5R93j214L19N12p47N79%j002J317m08l82P59p45Q5O88o24J54K81
$$ 578 -329 -274 719 -495 -176 336 -411 168 168 -834 483 75 -307 452 -293 -208 480 -144 10 291
4263B91q60N74K96r22J086k63r06J176o25K1O33j147O79K71p50L73L13n69M32
$$ 291 -569 5 301 -621 465 202 -704 472 -153 -132 501 -646 33 304 -446 -73 240 -329 103
4282A03J89j128J272j07r47J424j271K59J113j714J139k70o51Q51j89o09O30m3
$$ 103 292 -836 436 329 -618 806 -465 -206 907 -807 332 62 -589 262 73 -536 94 51
4300E1m82J052p16l69J243j639P67M38j367J378q1q16R93o27n5O19l31k68Q01
$$ 51 -431 621 -95 -464 779 -860 -93 345 -1022 356 275 -541 452 -175 -230 389 58 -210 591
4319E91q56j73J048j234P69L18j539J929q47l51J025q92J5M95l02l25Q05r81L55
$$ 591 -265 -438 610 -624 145 463 -1076 853 6 -345 680 -212 -197 298 -4 -329 476 -505 -150
4338a50Q96j463J236j56j065J747j124m03J275j139K88N20n77M8P37j211L48O88
$$ -150 746 -717 519 363 -702 1045 -79 -482 793 -346 -58 462 -115 -67 670 -541 -193 495
4356D95j492J598n75q98J735j436L38R60j467Q61J37o67N11L07p60N91K41j179
$$ 495 -997 601 26 -872 863 -573 -235 725 -742 119 256 -411 100 407 -353 238 479 -700
4374g00J324n74o40J635j907J063N80j729J522m77o22M57K75o87Q38M6j213J666
$$ -700 624 50 -590 1045 -862 201 781 -948 574 97 -525 -68 207 -480 358 404 -809 857
$$ [...]
8191B17
##END NTUPLES=NMR FID
##END=
