##TITLE=1H_Pr 02-1
 CCl4, 8 sc, 
 28.9.2020
##JCAMPDX= 6.0         $$ Bruker NMR JCAMP-DX V2.0
##DATA TYPE= NMR FID
##DATA CLASS= NTUPLES
##ORIGIN= UXNMR, Bruker Analytische Messtechnik GmbH
##OWNER= root
$$ XWIN-NMR		Version 3.5
$$ Mon Sep 28 12:11:21 2020 Russian Standard Time (UT+4h)  she@DPX200
##.OBSERVE FREQUENCY= 200.1315066352
##.OBSERVE NUCLEUS= ^1H
##.DELAY= (6, 6)
##.ACQUISITION MODE= SIMULTANEOUS
##.ACQUISITION SCHEME= undefined
##.AVERAGES= 8
##.DIGITISER RES= 18
##SPECTROMETER/DATA SYSTEM= spect
##.PULSE SEQUENCE= zg30
##.SOLVENT NAME= CDCl3
##.SHIFT REFERENCE= (INTERNAL, CDCl3, 0, 15.7039)
##AUDIT TRAIL= $$ (NUMBER, WHEN, WHO, WHERE, WHAT)
$$ ##TITLE= Audit trail, XWIN-NMR		Version 3.5
$$ ##JCAMPDX= 5.01
$$ ##ORIGIN= Bruker BioSpin GmbH
$$ ##OWNER= she
$$ F:/spectra/data/she/nmr/H-F/1/audita.txt
$$ ##AUDIT TRAIL=  $$ (NUMBER, WHEN, WHO, WHERE, WHAT)
(   1,<2020-09-28 12:10:30.21 +0400>,<she>,<DPX200>,
      <created by zg, POWCHK disabled, PULCHK disabled
       configuration hash MD5:
       00 E9 B6 7A A2 85 ED C7 34 08 36 98 17 FE 4E 26
       data hash MD5: 16K
       93 FF 2D A7 75 6A B0 2F E3 02 01 09 B0 C8 0C AD>)
$$ ##END=
$$ 
$$ hash MD5
$$ 16 7D 81 F9 47 E9 8A D2 85 3F 3C AC 0A 64 98 9B
##$RELAX= 
##$RELAX= 
##$RELAX= 
##$RELAX= 
##$RELAX= 
##$RELAX= 
$$ Bruker specific parameters
$$ --------------------------
##$DU= <F:/spectra>
##$EXPNO= 1
##$NAME= <H-F>
##$PROCNO= 1
##$TYPE= <nmr>
##$USER= <she>
##$AMP= (0..31)
100 100 100 100 100 100 100 100 100 100 100 100 100 100 100 100 100 100 
100 100 100 100 100 100 100 100 100 100 100 100 100 100 
##$AQSEQ= 0
##$AQ_mod= 1
##$AUNM= <au_zg>
##$AUTOPOS= <>
##$BF1= 200.13
##$BF2= 200.13
##$BF3= 200.13
##$BF4= 200.13
##$BF5= 200.13
##$BF6= 200.13
##$BF7= 200.13
##$BF8= 200.13
##$BYTORDA= 1
##$CFDGTYP= 0
##$CFRGTYP= 5
##$CHEMSTR= <none>
##$CNST= (0..31)
1 1 145 1 1 1 1 1 1 1 1 1 1 1 1 1 1 1 1 1 1 1 1 1 1 1 1 1 1 1 1 1 
##$CPDPRG= <>
##$CPDPRG1= <>
##$CPDPRG2= <>
##$CPDPRG3= <>
##$CPDPRG4= <mlev>
##$CPDPRG5= <mlev>
##$CPDPRG6= <mlev>
##$CPDPRG7= <mlev>
##$CPDPRG8= <mlev>
##$CPDPRGB= <>
##$CPDPRGT= <>
##$D= (0..31)
0 1.2 0 0 0 0 0 0 0 0.06 0 0.03 0 0 0 0 0.0002 0 0 0 0 0 0 0 0 0 0 0 0 
0 0 0 
##$DATE= 1601280629
##$DBL= (0..7)
120 120 120 120 120 120 120 120 
##$DBP= (0..7)
150 150 150 150 150 150 150 150 
##$DBP07= 0
##$DBPNAM0= <>
##$DBPNAM1= <>
##$DBPNAM2= <>
##$DBPNAM3= <>
##$DBPNAM4= <>
##$DBPNAM5= <>
##$DBPNAM6= <>
##$DBPNAM7= <>
##$DBPOAL= (0..7)
0.5 0.5 0.5 0.5 0.5 0.5 0.5 0.5 
##$DBPOFFS= (0..7)
0 0 0 0 0 0 0 0 
##$DE= 6
##$DECBNUC= <off>
##$DECIM= 32
##$DECNUC= <off>
##$DECSTAT= 4
##$DIGMOD= 1
##$DIGTYP= 9
##$DL= (0..7)
0 120 120 120 120 120 120 120 
##$DP= (0..7)
150 150 150 150 150 150 150 150 
##$DP07= 0
##$DPNAME0= <>
##$DPNAME1= <>
##$DPNAME2= <>
##$DPNAME3= <>
##$DPNAME4= <>
##$DPNAME5= <>
##$DPNAME6= <>
##$DPNAME7= <>
##$DPOAL= (0..7)
0.5 0.5 0.5 0.5 0.5 0.5 0.5 0.5 
##$DPOFFS= (0..7)
0 0 0 0 0 0 0 0 
##$DQDMODE= 0
##$DR= 18
##$DS= 0
##$DSLIST= <SSSSSSSSSSSSSSS>
$$ [...]
##$SUBNAM2= <"">
##$SUBNAM3= <"">
##$SUBNAM4= <"">
##$SUBNAM5= <"">
##$SUBNAM6= <"">
##$SUBNAM7= <"">
##$SUBNAM8= <"">
##$SUBNAM9= <"">
##$SW= 16.880792210976
##$SWIBOX= (0..15)
0 0 2 0 0 0 0 0 0 0 0 0 0 0 0 0 
##$SW_h= 3378.37837837838
##$TD= 16384
##$TD0= 1
##$TE= 0
##$TE2= 300
##$TE3= 300
##$TEG= 300
##$TL= (0..7)
0 120 120 120 120 120 120 120 
##$TP= (0..7)
150 150 150 150 150 150 150 150 
##$TP07= 0
##$TPNAME0= <>
##$TPNAME1= <>
##$TPNAME2= <>
##$TPNAME3= <>
##$TPNAME4= <>
##$TPNAME5= <>
##$TPNAME6= <>
##$TPNAME7= <>
##$TPOAL= (0..7)
0.5 0.5 0.5 0.5 0.5 0.5 0.5 0.5 
##$TPOFFS= (0..7)
0 0 0 0 0 0 0 0 
##$TUNHIN= 0
##$TUNHOUT= 0
##$TUNXOUT= 0
##$USERA1= <user>
##$USERA2= <user>
##$USERA3= <user>
##$USERA4= <user>
##$USERA5= <user>
##$V9= 5
##$VALIST= <valist>
##$VCLIST= <CCCCCCCCCCCCCCC>
##$VD= 0
##$VDLIST= <DDDDDDDDDDDDDDD>
##$VPLIST= <PPPPPPPPPPPPPPP>
##$VTLIST= <TTTTTTTTTTTTTTT>
##$WBST= 1024
##$WBSW= 4
##$XGAIN= (0..3)
0 0 0 0 
##$XL= 0
##$YL= 0
##$YMAX_a= 303561
##$YMIN_a= -275712
##$ZGOPTNS= <>
##$ZL1= 120
##$ZL2= 120
##$ZL3= 120
##$ZL4= 120
##$ABSF1= 10
##$ABSF2= 0
##$ABSG= 5
##$ABSL= 3
##$ALPHA= 0
##$AQORDER= 0
##$ASSFAC= 0
##$ASSFACI= 0
##$ASSFACX= 0
##$ASSWID= 0
##$AUNMP= <proc_1d>
##$AZFE= 0.1
##$AZFW= 0.1
##$BCFW= 1
##$BC_mod= 2
##$BYTORDP= 1
##$COROFFS= 0
##$CY= 11.3945322036743
##$DATMOD= 1
##$DC= 2
##$DFILT= <>
##$DTYPP= 0
##$F1P= 16.9975609425685
##$F2P= -3.02152046262296
##$FCOR= 0.5
##$FTSIZE= 0
##$FT_mod= 4
##$GAMMA= 1
##$GB= 0.15
##$INTBC= 1
##$INTSCL= 1
##$ISEN= 128
##$LB= 0.24
##$LEV0= 0
##$LPBIN= 0
##$MAXI= 10000
##$MC2= 0
##$MEAN= 0
##$ME_mod= 0
##$MI= 1.114404
##$NCOEF= 0
##$NC_proc= 0
##$NLEV= 6
##$NOISF1= 3.799351
##$NOISF2= 2.8
##$NSP= 1
##$NTH_PI= 0
##$NZP= 0
##$OFFSET= 15.70392
##$PC= 1
##$PHC0= -9982.609
##$PHC1= 28.6009
##$PH_mod= 1
##$PKNL= yes
##$PPARMOD= 0
##$PSCAL= 0
##$PSIGN= 0
##$REVERSE= no
##$SF= 200.130013532006
##$SI= 16384
##$SIGF1= 3
##$SIGF2= 2
##$SINO= 400
##$SIOLD= 16384
##$SREGLST= <1H.CDCl3>
##$SSB= 0
##$STSI= 0
##$STSR= 0
##$SW_p= 3612.71676300578
##$SYMM= 0
##$S_DEV= 0
##$TDeff= 0
##$TDoff= 0
##$TI= <>
##$TILT= no
##$TM1= 0
##$TM2= 0
##$TOPLEV= 0
##$USERP1= <user>
##$USERP2= <user>
##$USERP3= <user>
##$USERP4= <user>
##$USERP5= <user>
##$WDW= 1
##$XDIM= 8192
##$YMAX_p= 0
##$YMIN_p= 0
$$ End of Bruker specific parameters
$$ ---------------------------------
##NTUPLES= NMR FID
##VAR_NAME=  TIME,          FID/REAL,        FID/IMAG
##SYMBOL=    X,             R,               I
##VAR_TYPE=  INDEPENDENT,   DEPENDENT,       DEPENDENT
##VAR_FORM=  AFFN,          ASDF,            ASDF
##VAR_DIM=   8192,          8192,            8192
##UNITS=     SECONDS,       ARBITRARY UNITS, ARBITRARY UNITS
##FACTOR=    0.000296,      1,               1
##FIRST=     0,             0,               0
##LAST=      2.424536,      0,               0
##MIN=       0,             -275712,         0
##MAX=       2.424536,      303561,          0
$$ Real data points
##PAGE= N=1
##DATA TABLE= (X++(R..R)), XYDATA
$$ plain form
0 0 0 0 0 0 0 0 0 0 0 0 0 0 0 0 6 -8 8 -8 8 -16 16 -20 24 -32 36 -40 48 -56 68 -77 92 -104 119 -138 155 -178
36 -178 202 -227 256 -287 323 -361 403 -450 500 -557 615 -681 754 -832 918 -1014 1117 -1231
54 -1231 1355 -1496 1650 -1822 2016 -2235 2482 -2766 3095 -3474 3914 -4412 4918 -5215 4060
69 4060 -558 282359 -222315 12208 185929 -238306 132858 26714 -109528 57119 69876
80 69876 -148843 93649 71214 -224788 242756 -92541 -135444 288799 -266523 87196 123039
91 123039 -224988 168471 -17264 -101182 102346 -2747 -99129 102293 9371 -154752 215103
102 215103 -126760 -63130 228860 -256618 126265 72230 -205926 194864 -66478 -72796 120962
113 120962 -56312 -50376 98013 -38830 -84192 168524 -135996 -5025 163022 -226116
$$ packed form
0@%%%%%%%%%%%%%%Oj4J6j6J6k4L2l6M4n6O8p6Q8j04J24j45J69j96K23k57K93l33
36a78L80m29M83n43O10o84P64q53R50j057J172j296J435j586J750j932K131k348
54a231K586k851L146l472L838m251M717n248N861o569P388q326R330j0133R275
69D060m618K82917n04674K34523J73721m24235L71164j06144j36242J66647J2757
80F9876k18719K42492k2435k96002M67544l35297m2903M24243n55322L53719L5843
91A23039l48027L93459j85735q3918K03528j05093r6382K01422r2922j64123L69855
102B15103l41863O3630K91990m85478L82883n4035k78156M00790k61342o318J93758
113A20962j77274N936J48389j36843m5362K52716l04520J30971J68047l89138
$$ plain form
123 -226116 147969 20128 -165112 193680 -100595 -37342 118070 -92318 -1573 76741
133 76741 -66939 -21032 111983 -124690 37022 94367 -175292 145513 -21665 -112264 167872
144 167872 -113895 -3162 95309 -103510 33847 47527 -72022 21781 59117 -99312 58829
155 58829 39049 -123775 130035 -49050 -65311 135520 -115326 24942 68291 -101227 57846
166 57846 18784 -65813 47846 16397 -70078 65848 -2021 -74063 104189 -62098 -24542
177 -24542 95623 -101693 42319 38231 -83334 64861 -4746 -48490 54394 -12814 -39004
188 -39004 57256 -25408 -32383 71203 -59670 3701 56160 -78469 47314 12509 -58315
199 -58315 59850 -19927 -28000 48103 -27514 -14053 41563 -33345 -4276 41841 -48934 18786
$$ packed form
123b26116L74085j27841j85240L58792k94275O3253J55412k10388R0745P8314
133G6741j43680M5907J33015k36673J61712N7345k69659L20805j67178r0599K80136
144A67872k81767J10733R8471j98819J37357J3680j19549R3803L7336j58429J58141
155E8829j9780j62824K53810j79085j6261K00831k50846J40268M3349j69518J59073
166E7846l9062q4597J13659l1449q6475J35926o7869p2042J78252j66287L7556
177b4542J20165j97316J44012m088j21565J48195o9607m3744J02884o7208k6190
188c9004R6260q2664o975J03586j30873O3371N2459j34629J25783l4805p0824
199e8315J18165p9777q073P6103p5617J3461N5616p4908K9069M6117r0775O7720
$$ plain form
211 18786 26459 -53981 43875 -4398 -35743 48409 -26332 -11150 36116 -30973 2331 25710
223 25710 -31605 10927 18831 -34228 23526 5527 -30700 33771 -12589 -16180 31828 -24143
235 -24143 587 20931 -24879 9961 11005 -21562 14257 3828 -18923 18821 -4375 -13029
247 -13029 20814 -12777 -3660 16721 -17360 5230 9264 -15980 10476 2457 -11923 11693 -2703
260 -2703 -7739 11538 -6743 -3164 10235 -9308 1677 6485 -9477 5296 1878 -7617 7129
273 7129 -1382 -4302 6193 -3626 -1338 4908 -4534 965 2771 -4248 2517 874 -3132 3053 -602
288 -602 -1875 2628 -1674 -420 1707 -1591 542 912 -1328 957 133 -1117 812 -559 30 640
304 640 -145 250 3 -84 -97 -160 -150 -213 -62 -178 -10 277 -245 -35 146 -232 168 57 -642 466 -52 -640
$$ packed form
211A8786P673q0440R7856m8273l1345Q4152p4741J5182M7266o7089L3304K3379
223B5710n7315M2532P904n3059N7754j7999l6227O4471m6360l591M8008n5971
235b4143K4730K0344m5810L4840J044l2567L5819j0429k2751L7744k3196q654
247a3029L3843l3591R117K0381l4081K2590M034k5244K6456q019j4380K3616j4396
260b703n036J9277j8281L579J3399j9543J0985M808j5962J4773l418r495J4746
273G129q511k920J0495r819K288O246r442N499J806p019O765j643m006O185l655
288f02j273M503m302J254K127l298K133L70k240K285q24j250J929j371N89O10
304F40p85L95k47q7j3o3J0o3J51j16J68K87n22K10J81l78M00j11o99J108n18n88
$$ plain form
326 -640 1039 -778 -394 1595 -1668 502 903 -2025 1640 525 -2303 2640 -909 -2071 3432 -2514
342 -2514 -410 3342 -3876 1425 2604 -4985 3759 685 -5106 6173 -2160 -3712 7494 -5606
356 -5606 -546 6529 -8069 3442 4465 -8752 6545 1429 -8502 9312 -2750 -6925 12119
369 12119 -7803 -2866 12159 -13166 4143 8194 -14977 10535 1504 -12917 14069 -4300 -9114
382 -9114 15822 -9603 -5250 17083 -16118 2519 14655 -21997 13136 5683 -20794 21221 -6430
395 -6430 -12893 21766 -13650 -4759 19270 -17849 633 18360 -24008 10536 13375 -29565 25043
408 25043 -1719 -23516 33104 -19146 -7678 27689 -26632 5486 18397 -25847 10991 14561
420 14561 -29770 20514 7576 -34102 37628 -13301 -22122 44120 -36002 3676 29750 -40171
$$ packed form
326f40J679j817L84J989l263K170M01k928L665j115k828M943l549j162N503n946
342b514K104L752p218N301J179p589Q744l074n791J1279q333j552J1206j3100
356e606N060P075j4598J1511J023j3217J5297n116r931J7814j2062m175J9044
369A2119j9922M937J5025k5325J7309M051k3171K5512r031j4421K6986j8369m814
382i114K4936k5425M353K2333l3201J8637J2136l6652L5133p453k6477M2015k7651
395f430o463L4659l5416Q891K4029l7119J8482J7727m2368L4544K839m2940N4608
408B5043k6762k1797N6620n2250J1468L5367n4321L2118J2911m4244L6838L570
420A4561m4331N0284j2938m1678P1730n0929q821O6242q0122L9678K6074o9921
$$ plain form
432 -40171 21275 11025 -30924 23420 4744 -29681 30058 -2481 -32183 46744 -27282 -14612
444 -14612 49444 -52268 20300 24122 -49708 39254 -3778 -29279 34587 -10065 -22224 34244
456 34244 -14010 -23998 49795 -39835 -2528 48683 -65312 39103 12963 -54632 58514 -23640
468 -23640 -21570 43424 -28253 -8542 34151 -26084 -11253 47120 -50261 12729 41669 -73819
480 -73819 58521 -4260 -52478 73699 -46599 -6272 45803 -45790 11057 26343 -33925
491 -33925 5156 35974 -52618 26450 28046 -71881 71433 -22799 -42466 80583 -66433 13455
503 13455 40494 -58380 32626 10492 -34964 20911 18319 -46906 36217 11711 -62752 77544
515 77544 -40606 -26653 79448 -82719 34939 28779 -65566 53623 -8263 -30984 34128
$$ packed form
432d0171O1446j0250m1949N4344j8676l4425N9739l2539k9702P8927p4026J2670
444a4612O4056j01712P2568L822p3830Q8962m3032k5501O3866m4652j2159N6468
456C4244m8254r988P3793q9630L7307N1211j13995J04415k6140o7595J13146q2154
468b3640K070O4994p1677J9711M2693o0235J4831N8373r7381O2990K8940j15488
480g3819J32340o2781m8218J26177j20298M0327N2075r1593N6847J5286o0268
491c3925L9081L0818q8592P9068J596r9927J43314r4232j9667J23049j47016P9888
503A3455K7039r8874R1006k2134m5456N5875k592o5225Q3123k4506p4463J40296
515G7544j18150J3953J06101j62167J17658o160r4345J19189o1886k2721O5112
$$ plain form
526 34128 -1866 -35556 41703 -6050 -47157 76934 -55664 -7377 70657 -91430 55490
537 55490 11405 -64086 69048 -29871 -19712 41046 -21089 -17585 38441 -19641 -26987 64834
549 64834 -60629 10586 53575 -88333 68302 -7448 -53996 76016 -48072 -3755 40244
560 40244 -36933 2718 29430 -28783 -6155 47715 -59618 26335 33467 -78390 75889 -25740
572 -25740 -39118 75810 -62331 13229 34208 -46355 21108 16305 -31352 11214 27984 -52127
584 -52127 36423 12575 -61700 74459 -39693 -21243 66978 -68688 28947 22362 -49011 35718
596 35718 426 -27535 23356 7483 -37300 38567 -4726 -40508 64074 -45940 -3471 51576
608 51576 -65818 38665 8825 -43408 42872 -13556 -19270 28301 -8685 -21631 35139 -17032
$$ packed form
526C4128l5994l3690P7259m7753m1107J24091j32598M8287P8034j62087J46920
537E5490m4085p5491J33134r8919J0159O0758o2135L504N6026n8082p346R1821
549F4834j25463P1215M2989j41908J56635p5750m6548J30012j24088M4317M3999
560D0244p7177L9651K6712n8213K2628N3870j07333Q5953P132j11857J54279j01629
572b5740j3378J14928j38141P5560K0979q0563O7463m803m7657M2566J6770q0111
584e2127Q8550k3848p4275J36159j14152J8450Q8221j35666R7635o585p1373Q4729
596C5718l5292k7961N0891j5873m4783P5867m3293l5782J04582j10014M2469N5047
608E1576j17394J04483k9840n2233Q6280n6428n714M7571l6986j2946N6770n2171
$$ plain form
620 -17032 -20427 49936 -47157 11431 34058 -58119 45051 -4934 -33612 45161 -24592 -8767
632 -8767 28239 -20307 -6174 27213 -23939 -3016 33178 -41836 20529 17084 -44984 43414
644 43414 -14276 -21816 39902 -29731 930 22675 -24907 6147 16626 -23364 8446 16620
656 16620 -31496 23742 2637 -29566 37239 -19935 -9653 30787 -29621 9233 14546 -23718
668 -23718 13580 6515 -19633 14625 3895 -21270 22839 -6523 -16118 28416 -21089 -173
680 -173 20868 -25872 13512 6711 -19373 16288 -1097 -13235 15731 -4459 -10855 17789 -10898
693 -10898 -5202 18350 -18368 5555 10841 -19295 13693 394 -12981 14622 -5664 -7036 12847
706 12847 -7767 -2969 11424 -11125 1481 9392 -13225 7479 3541 -12021 11569 -3072 -6770
$$ packed form
620a7032l395P0363r7093N8588K2627r2177J03170m9985k8678P8773o9753J5825
632h767L7006m8546J4133L3387n1152K0923L6194p5014O2365l445o2068Q8398
644D3414n7690p540O1718o9633L0661K1745m7582L1054J0479l9990L1810Q174
656A6620m8116N5238k1105l2203O6805n7174J0282M0440o0408L8854N313l8264
668b3718L7298p065k6148L4258j0730k5165M4109k9362r595M4534m9505K0916
680a73K1041m6740L9384o801k6084L5661j7385j2138K8966k0190o396K8644k8687
693a0898N696K3552l6718K3923N286l0136L2988j3299j3375K7603k0286j372J9883
706A2847k0614M798J4393k2549J2606P911k2617K0704l938j5562K3590j4641l698
$$ plain form
719 -6770 10819 -6951 -2040 8260 -8090 1674 6055 -8437 4198 2834 -8011 7081 -741
732 -741 -5853 7979 -4225 -2224 6490 -5890 898 4198 -5678 3079 1786 -4930 4303 -452 -3550
747 -3550 4602 -2086 -1736 4152 -3497 18 3131 -3800 1909 1073 -3173 2398 104 -2251 2489 -1244
763 -1244 -1044 2105 -1853 52 1582 -2008 722 683 -1867 1426 -6 -903 1364 -860 -678 1102
779 1102 -979 77 829 -975 395 282 -970 677 -135 -789 911 -410 -248 858 -468 -430 510
796 510 -659 76 401 -658 333 194 -570 613 95 -527 647 71 -457 746 -199 -233 957 -488
814 -488 104 779 -1228 795 460 -1412 1157 78 -1321 1829 -718 -808 1983 -1809 -69 1753 -2506
831 -2506 787 1464 -3003 2024 249 -2810 3296 -989 -1783 3646 -2645 -346 3244 -4023 1339 2312
$$ packed form
719f770J7589j7770M911J0300j6350R764M381j4492J2635j364j0845J5092p822
732g41n112J3832j2204K001Q714j2380O788L300r876Q757j293o716R233m755l098
747c550Q152o688L50N888p649L515L113o931N709q36m246N571k294k355M740l733
763a244K00L149l958J905J530l590K730l9k550L293j432q97K267k224J82J780
779A102k081J056P52j804J370j13j252J647q12o54J700j321J62J106j326L8R40
796E10j169P35L25j059R91j39p64J183n18o22J174n76n28J203r45l4J190j445
814d88N92O75k007K023l35j872K569j079j399L150k547r0K791l792J740J822m259
831b506L293O77m467N027j775l059O106m285p94N429o291K299L590p267N362R73
$$ plain form
847 2312 -4287 3201 661 -4206 4642 -1214 -3332 5620 -3859 -1358 5304 -5742 1681 3679 -6832
862 -6832 4314 1211 -6144 5751 -1262 -4642 7273 -3742 -2808 8189 -7585 955 6688 -9521
876 -9521 5861 2327 -8674 8602 -2165 -5879 9069 -4920 -3471 9410 -7695 -621 9406
889 9406 -11792 5158 5770 -13509 11549 -1693 -9630 13756 -7680 -3393 11472 -9558 58
902 58 9505 -11031 2916 8673 -14821 9756 3278 -15057 16952 -7182 -8076 17537 -14377 1553
916 1553 10897 -14140 5899 6873 -13217 7850 5300 -15907 14872 -1373 -15243 22357 -14478
929 -14478 -3385 19418 -21822 9558 7801 -17428 13261 841 -12718 12277 154 -14597
941 -14597 18584 -7104 -12361 25283 -21807 3108 18664 -27635 18425 1998 -18561 20134
$$ packed form
847B312o599P488k540m867Q848n856k118Q952r479K501O662j1046P423J998j0511
862f832J1146l103p355J1895p013l380J1915j1015R34J0997j5774Q540N733j6209
876i521J5382l534j1001J7276j0767l714J4948j3989J449J2881j7105P074J0027
889I406k1198J6950O12j9279K5058j3242p937K3386k1436M287J4865k1030R616
902E8R447k0536J3947N757k3494K4577o478j8335L2009k4134q94K5613l1914J5930
916A553R344k5037K0039R74k0090K1067k550k1207L0779j6245j3870L7600l6835
929a4478J1093K2803m1240L1380j757k5229L0689j2420j3559K4995j2123j4751
941a4597L3181k5688n257L7644m7090K4915J5556m6299M6060j6427k0559L8695
$$ plain form
953 20134 -7004 -9392 15282 -6323 -9806 19277 -12530 -6937 24489 -27152 10268 14430 -30635
966 -30635 27145 -6750 -16143 25035 -16143 -2526 14799 -12396 -2664 16312 -15983 -380
978 -380 21105 -30002 18172 7698 -30703 34407 -16584 -10100 28045 -24932 6546 12493 -17484
991 -17484 6134 10837 -17602 6704 14633 -28922 24111 -410 -26288 37795 -25340 -2586
1003 -2586 26708 -31732 16077 6590 -19381 13809 3023 -15438 11740 6529 -24254 26324
1015 26324 -8113 -19889 37278 -31871 6139 22154 -34971 25156 -1471 -18069 20095 -6305
1027 -6305 -10438 14456 -1994 -16909 25481 -14492 -10701 32974 -35281 15271 14893 -34697 31625
1040 31625 -10370 -14052 24180 -14854 -3122 14409 -9083 -7765 21453 -18571 -1568 25359
$$ packed form
953B0134k7138k388K4674k1605l483K9083l1807N593L1426n1641L7420M162m5065
966c0635N7780l3895r393M1178m1178J3617J7325k7195R732J8976l2295J5603
978c80K1485n1107M8174j0474l8401O5110n0991O484L8145n2977L1478N947k9977
991a7484K3618M703k8439K4306P929m3555N3033k4521k5878O4083o3135K2754
1003b586K9294n8440M7809r487k5971L3190j0786j8461K7178n211l0783N0578
1015B6324l4437j1776N7167o9149L8010J6015n7125O0127k6627j6598L8164k6400
1027f305m133K4894j6450j4915M2390l9973L791M3675o8255N0552l78m9590O6322
1040C1625m1995l682L8232l9034J1732J7531k3492J318K9218m0024J7003K6927
$$ plain form
1052 25359 -34459 21766 5996 -30144 34927 -17998 -7764 24174 -21106 4888 11238 -13391
1064 -13391 704 14382 -18730 5425 16127 -29732 24688 -2221 -22869 34033 -23396 -270
1076 -270 20797 -24936 12084 6066 -15061 8612 6586 -16016 10951 6529 -23017 25096 -9703
1089 -9703 -14317 29809 -26513 6867 15129 -24943 17362 213 -13684 13446 -1333 -11237 13143
1102 13143 -1317 -14366 21609 -13478 -5796 22758 -25332 11522 8848 -22080 19824 -5004
1114 -5004 -10193 14827 -7270 -5679 12228 -7034 -6202 16480 -14542 1276 14816 -21876 14267
1127 14267 2476 -16706 19512 -9308 -5569 14140 -10944 -318 9692 -9674 421 10350
1139 10350 -13657 5866 7615 -16874 14841 -2887 -11038 16947 -11456 -716 11304 -11853
$$ packed form
1052B5359n9818N6225j5770l6140O5071n2925J0234L1938m5280K5994O350k4629
1064a3391J4095J3678l3112K4155J0702m5859N4420k6909k0648N6902n7429K3126
1076b70K1067m5733L7020o018k1127K3673k026k2602K6967m422k9546M8113l4799
1089i703m614M4126n6322L3380Q262m0072M2305j7149j3897K7130j4779r904K4380
1102A3143j4460j3049L5975l5087P682K8554m8090L6854k674l0928M1904k4828
1114e004n189K5020k2097J591J7907j9262Q32K2682l1022J5818J3540l6692L6143
1127A4267j1791j9182L6218k8820L739J9709k5084J0626J0010j9366J0095R929
1139A0350k4007J9523J749k4489L1715j7728q151K7985k8403J0740J2020k3157
$$ plain form
1151 -11853 4058 5713 -9498 5000 4605 -10598 8051 1165 -10716 12569 -5743 -5543 12601
1164 12601 -10983 2234 7203 -10748 6364 2090 -7703 6655 76 -6653 7810 -2633 -5569
1177 -5569 9209 -6980 -847 8162 -9631 3801 3509 -8203 6760 -549 -5337 6759 -2520
1190 -2520 -3141 6293 -4481 -1249 6129 -6067 1734 4011 -7001 4760 766 -5205 5782 -2189
1204 -2189 -2629 5063 -3564 -458 4017 -4190 1016 2791 -4575 2437 1243 -4131 4020 -1031 -2652
1219 -2652 4350 -2578 -624 3146 -3274 691 2210 -3165 1821 800 -2662 2583 -574 -1819 2602
1234 2602 -1564 -724 2404 -2068 353 1592 -2275 1139 551 -2067 1624 -263 -1338 1664 -921
1249 -921 -728 1558 -1337 296 934 -1363 883 547 -1562 1311 -168 -751 1297 -770 -341 913
$$ packed form
1151a1853J5911J655j5211J4498l95j5203J8649o886j1881K3285j8312K00J8144
1164A2601k3584J3217M969j7951J7112m274r793J4358o579o729J4463j0443k936
1177e569J4778j6189O133R009j7793J3432k92j1712J4963p309m788J2096r279
1190b520o21R434j0774L232P378j2196P801K277j1012J1761l994n971J0987p971
1204b189m40P692q627L106M475q207N206J775p366P012j194n374Q151n051j621
1219b652P002o928J954L770o420L965J519n375M986j021l462N245l157j245M421
1234B602m166Q40L128m472K421J239l867L414n88k618L691j887j075L002k585
1249i21J93K286k895J633O38k297K246l36k109K873j479n83K048k067M29J254
$$ plain form
1265 913 -1006 -32 787 -1136 449 631 -991 802 141 -1061 895 -305 -332 868 -638 104 857
1282 857 -834 129 705 -1157 478 270 -1078 943 -297 -671 1132 -374 -376 1109 -646 44 926
1299 926 -1120 327 649 -1524 767 174 -1202 1439 -276 -1225 1516 -1045 -91 1668 -1540 418
1315 418 1104 -1626 1326 453 -1963 1969 -429 -1741 2104 -1153 -827 2217 -2459 139 1979 -2609
1331 -2609 1209 1296 -2715 2328 263 -2563 2963 -1235 -1657 3751 -3014 -278 3093 -3839 1573 1704
1347 1704 -3909 2811 198 -3274 3890 -1044 -2486 5017 -3184 -787 4840 -5093 2006 3002 -5824
1362 -5824 4029 642 -4588 5186 -1429 -3100 5170 -2979 -1670 5669 -5117 552 5206 -7121
1376 -7121 4458 2015 -6811 6985 -2121 -4176 6766 -4318 -1648 5750 -5222 -175 5857 -7252
$$ packed form
1265I13j919R74Q19j923J585J82j622J793o61j202J956j200k7J200j506P42P53
1282H57j691R63N76j862J635k08j348K021j240l74J803j506kJ485j755O90Q82
1299I26k046J447L22k173K291n93j376K641j715r49K741k561R54J759l208J958
1315D18O86k730K952q73k416L932k398j312L845l257L26L044m676K598J840m588
1331b609L818Q7m011N043k065k826N526m198m22N408o765K736L371o932N412J31
1347A704n613O720k613l472P164m934j442P503q201K397N627r933P099R96q826
1362e824R853l387n230R774o615j671Q270q149J309P339j0786N669M654j2327
1376g121J1579k443q826J3796r106k055J0942j1084K670P398j0972N047O032j3109
$$ plain form
1390 -7252 2899 4590 -9411 7732 -630 -7408 10186 -5958 -2141 8161 -7766 1695 5356
1403 5356 -7194 2693 4570 -8620 5622 2633 -10095 10578 -4013 -6338 12360 -10194 988
1416 988 8064 -10878 5623 3208 -8109 5849 1751 -8456 8179 -323 -9267 12911 -7504
1429 -7504 -3882 13382 -14115 5592 6203 -12865 10360 -561 -7780 8820 -1903 -6722 9346
1442 9346 -3699 -6797 14005 -11379 -371 12448 -17557 10615 2883 -13616 14769 -6015
1454 -6015 -5258 10938 -6526 -2733 9502 -7027 -3048 12895 -13658 3828 10459 -18762 15403
1467 15403 -1588 -12484 17889 -11421 -1720 11199 -10779 1680 7252 -8810 1046 9764 -14100
1480 -14100 7631 6373 -18091 18634 -6961 -9354 19435 -16435 3566 9344 -13643 6876
$$ packed form
1390g252J0151J691j4001J7143q362o778J7594j6144L817J0302j5927R461L661
1403E356j2550R887J877j3190J4242k989j2728K0673j4591k325J8698k2554J1182
1416I88P076j8942J6501k415j1317J3958m098j0207J6635q502q944K2178k0415
1429g504L622J7264k7497J9707O11j9068K3225j0921p219J6600j0723m819J6068
1442I346j3045l098K0802k5384J1008J2819l0005K8172p732j6499K8385k0784
1454f015P57J6196j7464L793J2235j6529L979J5943k6553J7486O631k9221L4165
1467A5403j6991j0896L0373k9310R701J2919k1978J2459N572j6062R856Q718k3864
1480a4100K1731j258k4464L6725k5595k393K8789l5870K0001N778k2987K0519
$$ plain form
1492 6876 3673 -9295 5183 5538 -13294 10720 1497 -15402 20167 -11828 -4939 18470 -20121
1505 -20121 9521 6223 -15080 12214 -1481 -8323 8723 209 -9962 12163 -2999 -10942 19137
1518 19137 -14787 134 15622 -21580 13825 1669 -14135 15264 -6305 -5082 9907 -4367
1530 -4367 -5417 10991 -6668 -5553 16163 -16402 4991 10959 -20625 17170 -3552 -11369 17278
1543 17278 -11188 -1410 9478 -8748 -285 8672 -8792 -396 11801 -16033 8732 5786 -17633
1556 -17633 18547 -7556 -7595 16696 -14097 2885 8061 -10941 4356 5115 -9293 3946 6076
1569 6076 -13242 10902 619 -13211 17639 -10681 -3348 14064 -15363 6452 4999 -11090
1581 -11090 7874 1044 -7872 6648 1423 -9643 10841 -3305 -8080 14786 -12123 957 10244
$$ packed form
1492F876l203j2968J4478L55j8832K4014r223j6899L5569l1995O889K3409l8591
1505b0121K9642l298k1303K7294j3695o842J7046q514j0171K2125j5162p943L0079
1518A9137l3924J4921J5488l7202L5405j2156j5804K9399k1569J223J4989j4274
1530d367j050J6408j7659J115K1716l2565K1393N968l1584L7795k0722p817K8647
1543A7278k8466R778J0888j8226Q463Q957j7464Q396J2197k7834K4765k946k3419
1556a7633L6180k6103l9K4291l0793J6982N176j9002J5297P59j4408J3239K130
1569F076j9318K4144j0283j3830L0850k8320P333J7412k9427K1815j453j6089
1581a1090J8964o830q916J4520n225j1066K0484j4146m775K2866k6909J3080R287
$$ plain form
1594 10244 -14684 9442 1505 -9823 9864 -2735 -5323 7853 -2768 -5226 9583 -5909
1606 -5909 -2836 10999 -11730 4285 6046 -12576 10625 -2003 -7106 9848 -5745 -2590 7398
1619 7398 -5458 -1324 7057 -7111 869 6550 -10218 6089 2539 -9318 10053 -3911 -4271
1632 -4271 8846 -6606 188 5446 -6496 1627 4040 -6417 3359 2760 -7434 6515 -894 -6186
1646 -6186 8652 -5116 -1494 6483 -6930 2491 3272 -6202 3661 1204 -5102 4215 26 -4554
1660 -4554 5982 -2746 -2585 6124 -5381 654 4247 -5990 3335 1419 -4787 4083 -711 -3196
1674 -3196 4295 -1756 -1825 4312 -3199 -305 3885 -4235 1832 2020 -4370 3496 -140 -2897 3826 -1641
1690 -1641 -1330 3231 -2543 -249 2659 -3104 1236 1603 -3061 2168 324 -2615 2730 -1218 -1281 2995
$$ packed form
1594A0244k4928K4126p937j1328J9687j2599k588J3176j0621k458J4809j5492
1606e909L073J3835k2729J6015J761j8622K3201j2628n103J6954j5593L155R988
1619G398j2856M134Q381j4168P980N681j6768J6307l550j1857J9371j3964l60
1632d271J3117j5452O794N258j1942Q123K413j0457R776n99j0194J3949p409n292
1646f186J4838j3768L622P977j3413R421P81r474R863k457o306R317m189m580
1660d554J0536q728J61Q709j1505O035L593j0237R325j916o206Q870m794k485
1674c196P491o051o9O137p511K894M190q120O067J88o390P866l636k757O723n467
1690a641L11M561n774K294K908n763M340L67m664N229j844k939N345l948o3M276
$$ plain form
1706 2995 -2077 -274 2017 -2476 800 1484 -2579 1414 334 -2049 2086 -593 -1296 2206 -1426
1721 -1426 -263 1877 -1634 564 1168 -1751 1287 156 -1730 1650 -373 -1268 1495 -897 -373 1248
1737 1248 -1496 246 939 -1665 989 310 -1364 992 -326 -896 1125 -762 -450 1021 -1073 44
1753 44 812 -1208 814 301 -1111 771 -237 -670 1142 -550 -403 917 -981 -102 1068 -1287 292
1770 292 617 -1124 695 227 -1158 1060 -173 -755 1003 -802 -370 1178 -787 250 839 -1283
1786 -1283 811 282 -1381 1185 109 -812 1233 -315 -419 1522 -1405 -261 1004 -1738 597 893
1802 893 -1652 1211 205 -1514 1561 -782 -1313 1998 -1395 -230 1905 -1946 618 1144 -1933 1380
1818 1380 696 -2021 1944 -295 -1613 2662 -1509 -867 2354 -2772 452 2002 -2731 1234 1010 -2614
$$ packed form
1706B995n072J803K291m493L276O84m063L993j080k383M135k679p03L502l632
1721a426J163K140l511K198O04k919L038j131j886L380k023q95K763k392N24J621
1737A248k744J742O93k604K654o79j674K356j318n70K021j887L12J471k094J117
1753D4P68k020K022n13j412J882j008m33J812j692J47J320j898Q79J170k355J579
1770B92L25j741J819m68j385K218j233n82J758j805M32J548j965J037N89k122
1786a283K094n29j663K566j076r21K045j548j04J941k927J144J265k742K335K96
1802H93k545K863j006j719L075k343n31L311l393J165K135l851K564N26l077L313
1818A380o84k717L965k239j318M275m171O42L221n126L224J550m733L965k24l624
$$ plain form
1834 -2614 2387 8 -2388 3049 -1117 -1722 3345 -2416 -82 3264 -3686 1808 1643 -3584 3078
1849 3078 -42 -2859 3612 -1361 -1952 3676 -2467 -1262 3892 -4006 987 3336 -5105 3736 685
1864 685 -4030 4774 -1739 -2238 4460 -2742 -1210 3882 -3826 104 4041 -5403 2679 2175 -5882 5289
1880 5289 -1117 -3924 6388 -3914 -882 4527 -4279 634 3793 -4762 1691 3192 -6025 4860
1894 4860 691 -6021 7441 -3612 -2374 6990 -6501 1446 4119 -5692 2690 2350 -5426 3683
1908 3683 1715 -6484 6336 -1366 -5638 8783 -6291 -677 6961 -8527 4433 2248 -6578 5334
1922 5334 47 -4545 4923 -196 -5265 7443 -3491 -4131 9394 -8827 2062 6123 -10134 7474
1936 7474 -108 -6472 7601 -2564 -3299 5657 -2858 -3445 7133 -5424 -1717 8642 -10256 4898
$$ packed form
1834b614N001k379k396N437m166o05N067n761K334L346o950N494j65n227O662
1849C078l120k817O471m973n91N628o143J205N154p898M993K349q441Q841l051
1864F85m715Q804o513m99O698p202J532N092p708L930L937r444Q082n04q057J1171
1880E289o406k807J0312j0302L032N409q806M913L159q555O453J501r217J0885
1894D860m169o712J3462j1053J238R364j3491P947K673r811Q382l40p776R109
1908C683j968q199J2820p702m272J4421j5074N614P638j5488J2960k185q826J1912
1922E334n287m592R468n119n069J2708j0934o40J3525j8221J0889M061j6257J7608
1936G474p582o364J4073j0165p35Q956q515n87J0578j2557L707J0359j8898J5154
$$ plain form
1950 4898 4307 -10581 9804 -3022 -4939 8822 -5986 -976 5588 -4918 -931 6251 -6912
1963 -6912 1033 6736 -10841 7635 1471 -9795 11608 -6223 -2934 8877 -8698 2456 4631
1976 4631 -6231 2482 3843 -6634 3303 4516 -9847 9082 -1602 -7913 12498 -9014 -202
1989 -202 8191 -10150 5310 2211 -6658 4599 1192 -5928 4972 1485 -7683 9722 -4053 -5295
2003 -5295 11512 -10868 3353 6262 -11070 8262 -687 -6000 6777 -1733 -4024 5596 -1858
2016 -1858 -5306 9018 -6216 -2039 9924 -11439 5754 3817 -10511 9797 -3450 -4658 7581
2029 7581 -4715 -1725 5398 -3727 -1896 7381 -7042 843 7040 -10774 7488 1074 -8647 10323
2043 10323 -5439 -2013 7451 -6581 1064 4285 -4999 644 4665 -6735 3050 3826 -9256 8511
$$ packed form
1950D898n91j4888K0385j2826j917J3761j4808N010O564j0506L987P182j3163
1963f912P945N703j7577J8476o164j1266K1403j7831L289J1811j7575J1154K175
1976D631j0862Q713J361j0477R937J213j4363J8929j0684o311K0411k1512Q812
1989b02Q393j8341J5460l099q869J1257l407p120J0900l487r168J7405j3775j242
2003e295J6807k2380J4221K909j7332J9332q949n313J2777q510k291R620p454
2016a858l448J4324j5234M177J1963k1363J7193j937j4328K0308j3247j208J2239
2029G581j2296K990P123r125J831R277j4423P885O197j7814J8262o414r721J8970
2043A0323j5762L426R464j4032P645L221r284N643M021j1400R785P76j3082J7767
$$ plain form
2057 8511 -1845 -6099 10081 -7208 171 5944 -7592 3671 2338 -5340 3267 1840 -5478 4312
2071 4312 1070 -6574 7989 -3845 -3184 8248 -8074 2391 4331 -7390 5195 136 -4698
2084 -4698 4527 -886 -3723 4806 -1519 -3790 6691 -4709 -761 6359 -7570 3801 2223 -6476
2098 -6476 5810 -1425 -3244 4902 -2410 -1739 4400 -2814 -1220 4947 -4943 698 3818 -6226 4578
2113 4578 348 -4738 5769 -2806 -1858 4394 -3616 331 3164 -3337 851 3070 -4255 2522 1549
2128 1549 -4480 4618 -1169 -2931 4879 -3339 -223 3476 -3921 1288 2040 -3379 1947 1115 -3099
2143 -3099 2734 -117 -2691 3922 -2174 -1341 3637 -3799 817 1997 -3356 2140 637 -2446 2345
2158 2345 -249 -1927 2915 -1464 -1281 2800 -2330 154 2272 -2811 1659 683 -2679 2345 -493
$$ packed form
2057H511j0356m254J6180j7289P379N773j3536J1263j333p678Q607j427p318R790
2071D312l242p644J4563j1834O61J1432j6322J0465J940j1721J2585n059m834
2084d698R225n413k837Q529o325k271J0481j1400L948P120j3929J1371j578q699
2098f476J2286p235j819Q146p312O71O139p214J594O167r890N641L120j0044J0804
2113D578m230n086J0507q575R48O252q010L947K833o501M188K219p325O777r73
2128A549o029R098n787j762P810q218L116L699p397N209P52n419N326q32m214
2143c099N833k851k574O613o096Q33M978p436M616J180n353N496j503l083M791
2158B345k594j678M842m379J83M081n130K484K118n083M470r76l362N024k838
$$ plain form
2173 -493 -1829 2351 -1299 -662 2027 -1653 -130 1976 -2045 967 1184 -2053 1516 -26 -1583 1957
2189 1957 -853 -842 1615 -1664 61 1267 -1430 509 951 -1827 1297 133 -1139 1738 -531 -774
2205 -774 1494 -1205 -165 1317 -1626 354 784 -1067 1063 169 -1156 1115 -365 -702 1407 -750
2221 -750 -223 1015 -1227 236 857 -1190 832 214 -1185 1211 -84 -789 1108 -391 -62 1301
2237 1301 -977 273 606 -930 440 529 -852 1015 -64 -679 1162 -556 -299 1152 -643 -94
2253 -94 647 -1075 373 620 -1126 813 -72 -816 964 -172 -593 1160 -726 -126 909 -1129 305
2270 305 676 -1139 693 300 -1098 1116 -119 -885 1118 -716 -415 987 -1361 -37 735 -1117
2286 -1117 657 630 -1066 1119 -70 -1226 1354 -499 -622 1313 -1286 3 1354 -1279 483 871
$$ packed form
2173d93j336M180l650O37K689l680J523K106m021L012K17l237L569j542j557L540
2189A957k810J1K457l279J725J206k697J939M42k778L124j164j272K877k269k43
2205g74K268k699J040J482k943J980M30j851K130q94j325K271j480l37K109k157
2221g50N27J238k242J463O21k047K022o18j399K396j295p05J897j499L29J363
2237A301k278J250L33j536J370Q9j381J867j079o15J841j718K57J451j795N49
2253i4P41j722J448K47j746J939q85p44J780j136m21J753j886O00J035k038J434
2270C05L71j815J832l93j398K214j235p66K003j834L01J402k348J324P72j852
2286a117J774k7j696K185j189j156K580j853j23J935k599J289J351k633J762L88
$$ plain form
2302 871 -1602 811 566 -1705 1595 -261 -1225 1878 -1202 -367 1686 -1893 464 1217 -1998 930
2318 930 433 -1542 1413 -112 -1464 2082 -902 -1198 2483 -1895 174 1759 -2392 1311 791 -2193
2334 -2193 1949 -120 -1810 2257 -634 -1414 2538 -1806 -597 2561 -2935 992 1686 -3187 2581
2349 2581 -26 -2252 2553 -1069 -1485 2279 -1726 -843 2769 -2512 158 2372 -3725 2233 1032
2364 1032 -3277 3673 -1521 -1832 3203 -2333 -409 2738 -2758 -40 2326 -3345 1280 2134 -4094
2379 -4094 3702 -237 -2948 4298 -3077 -1010 3897 -3565 351 1874 -3772 736 2141 -3719 2000
2394 2000 831 -4165 4440 -1151 -2207 5019 -4104 482 3224 -4485 2430 1298 -3250 2602 727
2409 727 -3171 3370 -177 -3529 5225 -2777 -1689 5452 -5826 2366 2197 -4917 3893 -487 -2782
$$ packed form
2302H71k473K413k45k271L300j856r64L103l080Q35K053l579K357P53l215K928
2318I30m97j975K955j525j352L546k984k96L681m378K069J585m151L703n20k984
2334b193M142k069j690M067k891p80L952m344J209L158n496L927O94m873N768
2349B581k607k226M805l622m16L764m005Q83L612n281K670K214o097N958j201
2364A032m309O950n194l11N035n536J924L147n496K718K366n671M625Q54o228
2379d094P796l939k711P246p375K067M907p462L916J523n646M508J405n860N719
2394B000j169m996Q605n591j056P226r123M586K742p709O915j132m548N852j875
2409G27l898O541l547l352Q754q002J088P141j1278Q192j69p114Q810m380k295
$$ plain form
2424 -2782 3532 -1137 -2210 3757 -1379 -2495 5161 -4280 129 4556 -6590 3909 1048 -5272
2438 -5272 5436 -2360 -2130 4117 -2686 -776 3469 -2872 -1153 4483 -4884 1459 3519 -6620 5795
2453 5795 -840 -4288 6322 -3876 -656 4200 -3907 358 2784 -3486 661 3150 -4818 2846
2467 2846 1717 -6114 6404 -2498 -3230 6494 -5567 1309 3433 -4946 2539 1007 -3396 1969 1547
2482 1547 -4373 4041 -52 -4593 6806 -4194 -1524 6018 -6477 2837 2243 -5019 3926 -329
2496 -329 -3371 3134 -326 -3414 4224 -1383 -3237 6246 -4885 60 4630 -7054 4202 711
2510 711 -4643 4978 -2076 -2012 3659 -1764 -1796 3536 -2468 -1409 4740 -5247 1774 3173 -6360 5239
2526 5239 -1043 -3549 5304 -3404 -552 3430 -2914 25 3167 -3079 443 3351 -5080 2838 1441
$$ packed form
2424b782O314m669j073N967n136j116P656r441M409M427j1146J0499k861o320
2438e272J0708p796K30O247o803J910M245o341J719N636r367O343K060j0139J2415
2453E795o635l448J0610j0198L220M856q107M265K426o270M147K489p968P664
2467B846j129p831J2518q902p32R724j2061O876K124q379P485j532m403N365m22
2482A547n920Q414m093m541J1399j1000K670P542j2495R314n94p262Q945m255
2496c29l042O505l460l088P638n607j854R483j1131M945M570j1684J1256l491
2510G11n354R621p054O4N671n423l2N332o004J059O149r987P021J399r533J1599
2526E239o282k506Q853q708K852L982o344K939L142o246L522K908q431P918j397
$$ plain form
2541 1441 -5042 5719 -2371 -2557 5106 -4528 646 2920 -3712 1598 1737 -3191 1675 1662 -4206 3335
2557 3335 -163 -3579 5071 -3350 -946 4251 -4711 2025 1577 -3622 2565 285 -2503 2549 -60
2572 -60 -2895 3340 -1393 -1625 4358 -3609 332 2843 -4523 2760 424 -3024 3279 -1093 -1678 2626
2588 2626 -1469 -1144 2831 -2066 -633 3178 -3599 1240 1821 -3663 3199 -824 -2082 2931 -1901
2603 -1901 -940 3134 -1649 -203 2192 -2136 601 1627 -2953 2081 520 -2661 2947 -1208 -1278 2887
2619 2887 -2318 236 1817 -2453 775 954 -2083 1440 548 -2030 2324 -491 -1524 2684 -1714
2634 -1714 -600 2162 -2279 1185 1166 -2072 1259 291 -1725 1614 -330 -1167 1869 -1299 -734 1844
2650 1844 -1704 271 1197 -1768 1370 290 -1479 1561 -312 -1190 1376 -770 -470 1413 -1084 282
$$ packed form
2541A441o483J0761q090j86P663r634N174K274o632N310J39m928M866j3n868P541
2557C335l498l416Q650q421K404N197q962O736m48n199O187k280k788N052k609
2572f0k835O235m733k32N983p967L941K511p366P283k336l448O303m372n85M304
2588B626m095L25L975m897J433L811o777M839N81n484O862m023j258N013m832
2603a901R61M074m783J446K395m328K737J026m580N034j561l181N608m155p0M165
2619B887n205K554J581m270L228J79l037L523q92k578M354k815j033M208m398
2634a714J114K762m441L464j9l238L331r68k016L339j944q37L036l168N65K578
2650A844l548J975R26k965L138j080j769L040j873q78K566k146L00J883k497J366
$$ plain form
2666 282 1185 -1583 831 463 -1353 1408 -124 -1078 1431 -681 -409 1305 -931 75 779 -1182
2682 -1182 514 565 -1092 1057 25 -708 1452 -819 -311 1177 -998 60 941 -1103 512 701
2698 701 -987 1109 93 -790 1005 -606 -346 1126 -525 -11 1135 -928 262 586 -955 583
2714 583 -13 -1057 1143 -376 -664 765 -792 -254 785 -623 328 573 -969 489 443 -771 585
2731 585 -81 -530 777 -414 -314 705 -842 3 552 -850 323 87 -722 679 188 -760 925
2748 925 -378 -311 858 -830 -379 1041 -478 218 260 -1079 646 377 -1013 702 -169 -503 931
2765 931 -700 -219 876 -1065 149 480 -1071 408 433 -769 844 -216 -926 1238 -432 -279 870
2782 870 -820 191 836 -1123 527 366 -1088 872 30 -1078 1028 -489 -726 1430 -1080 -170
$$ packed form
2666B82R03k768K414l68j816K761j532r54K509k112K72J714k236J006P04j961
2682a182J696N1j657K149j032p33K160k271N08J488k175J058Q81k044J615J89
2698G01j688K096j016q83J795j611K60J472j651N14J146k063J190L24j541J538
2714E83n96j044K200j519k88J429j557N38J039j408R51K45j542J458m6j214J356
2731E85o66m49J307j191J00J019j547Q45N49j402J173k36q09J401m91r48J685
2748I25j303O7J169j688M51J420j519O96M2j339J725k69j390J715q71l34J434
2765I31j631M81J095j941J214L31j551J479K5j202J613j060p10K164j670J53J149
2782H70j690J011O45j959J650j61j454J960q42j108K106j517k37K156k510R10
$$ plain form
2798 -170 1272 -1446 523 552 -1216 905 404 -987 1155 -357 -1187 1428 -1088 -534 1592 -1414
2814 -1414 552 919 -1589 1243 199 -1249 1161 -209 -906 1491 -700 -762 1489 -1243 -124 1226
2830 1226 -2086 1122 294 -1891 1707 -99 -1021 1435 -581 -853 1845 -1244 -423 2033 -2096 731
2846 731 1351 -2414 1872 -49 -1856 2365 -1289 -821 1864 -1266 -407 1564 -1586 277 1317 -2303
2862 -2303 1510 753 -2818 2763 -1053 -1381 2678 -2247 138 1685 -1768 535 1102 -1984 1028 1374
2878 1374 -2420 2301 282 -2550 3285 -1800 -742 2748 -3051 785 1404 -2261 1558 485 -1899
2893 -1899 1552 217 -2418 2603 -721 -1793 3574 -2614 0 2668 -3782 1999 573 -2157 2077
2908 2077 -339 -1511 1958 -474 -1793 2886 -1625 -1385 3647 -3424 894 2135 -3870 2972 -423
$$ packed form
2798a70J442k718J969K9j768K121n01j391K142j512q30K615k516N54K126l006
2814a414J966L67k508K832j044j448K410j370o97K397k191o2K251k732J119J350
2830A226l312L208q28k185L598j806r22K456k016k72K698l089Q21K456m129K827
2846G31O20l765M286j921j807M221l654M68K685l130Q59J971l150J863J040l620
2862b303L813p57l571N581l816l28M059m925K385J547l453K303N67l086L012L46
2878A374l794M721k019k832N835n085J058L490n799L836O19l665L819j073k384
2893a899L451j335k635N021l324j072N367o188K614K668o450N781j426k730M234
2908B077k416j172L469k432j319M679m511K40N032p071M318J241o005O842l395
$$ plain form
2923 -423 -2230 2917 -1329 -981 2011 -1462 -1075 2661 -2162 -452 2889 -3718 2065 1093 -3866 3740
2939 3740 -1597 -1606 3176 -2515 103 2078 -1913 58 1971 -2283 463 2162 -3781 2903 265 -3123
2955 -3123 4269 -2486 -781 3302 -3189 923 1237 -2253 1057 864 -2411 1423 1140 -3344 3398 -794
2971 -794 -2550 4225 -3467 442 2638 -3683 2119 604 -2400 1754 292 -2046 1976 135 -2539
2986 -2539 3489 -1920 -1259 3790 -3751 1444 1502 -3807 3177 -585 -1860 2376 -976 -1218 2263 -721
3002 -721 -1513 3153 -2237 -210 2947 -3985 2215 839 -3364 3129 -1219 -1293 2681 -1773 -387 2049
3018 2049 -1736 -94 2100 -2571 732 1926 -3154 2977 -206 -2777 3865 -2100 -256 2445 -2537
3033 -2537 769 1440 -1873 766 1005 -2423 1485 596 -2670 2946 -922 -1572 3279 -2769 345 1825
$$ packed form
2923d23j807N147m246L48K992l473L87L736m823J710L341o607N783r72m959P606
2939C740n337rM782n691K618J975l991J971J913m254K746J699n943O684k638l388
2955c123P392o755J705M083o491M112L14l490L310j93l275L834k83m484O742m192
2971g94j756O775p692L909K196o321N802j515l004M154j462k338M022j841k674
2986b539O028n409O61N049p541N195N8n309O984l762j275M236l352k42L481k984
3002g21p92M666n390K027L157o932O200j376m203O493m348p4L974m454J386K436
3018B049l785J642K194m671L303J194n080O131l183k571O642n965J844K701m982
3033b537L306O71l313K639K39l428L908q89l266N616l868o50M851o048L114J480
$$ plain form
3049 1825 -2812 1450 134 -1940 1478 76 -1756 1802 -210 -1816 2710 -1709 -998 2818 -2739
3064 -2739 1100 1291 -2486 1995 -293 -1492 1711 -452 -1126 1753 -984 -912 2242 -2066 379 1599
3080 1599 -2504 1713 262 -1969 2271 -921 -914 1951 -1140 -196 1465 -1311 -59 1256 -1929 924
3096 924 610 -2050 1776 -49 -1513 2108 -1510 -552 1726 -1605 556 1021 -1482 460 728 -1436
3112 -1436 1046 22 -1543 1646 -806 -521 1712 -1504 284 1019 -1501 925 585 -1177 1329 205
3128 205 -1394 955 -335 -804 1463 -1064 -70 1339 -1396 782 422 -1153 858 -248 -1115 1177
3144 1177 -540 -789 1157 -918 -189 1076 -1313 539 782 -1289 702 105 -1173 1247 -207 -427
3160 -427 969 -556 -153 719 -1008 469 519 -1307 720 396 -978 779 -150 -553 1120 -574 -222
$$ packed form
3049A825m637M262j316k074L418j402j832L558k012j606M526m419P11L816n557
3064b739L839J91l777M481k288j199L203k163o74K879k737P2L154m308K445J220
3080A599m103M217j451k231M240l192PK865l091R44J661k776J252J315l185K853
3096I24l14k660L826j825j464L621l618R58K278l331K161M65k503J942K68k164
3112a436K482j024j565L189k452K85K233l216J788P35k520K426l40j762K506j124
3128B05j599K349j290m69K267k527R94J409k735K178l60j575K011j106q67K292
3144A177j717k49J946k075P29J265k389J852K43k071J991n97j278K420j454k20
3160d27J396j525M03Q72j727J477N0j826K027l24j374J757r29m03J673j694L52
$$ plain form
3177 -222 1058 -784 -33 537 -1031 467 167 -1108 734 -70 -676 685 -504 -210 821 -741 54
3194 54 570 -564 502 323 -897 766 -203 -638 942 -262 -102 690 -608 -91 629 -863 157
3211 157 435 -806 739 -38 -633 816 -238 -553 847 -799 -118 721 -808 145 460 -623 574
3228 574 288 -855 758 62 -424 824 -415 -203 835 -767 -107 594 -727 546 211 -760 440
3245 440 -127 -252 816 -394 -304 700 -859 66 775 -677 363 564 -856 705 410 -721 824
3262 824 -261 -527 852 -799 -163 671 -879 184 370 -1169 539 118 -839 898 -19 -600 1142
3279 1142 -527 -4 1030 -870 213 582 -1242 627 334 -917 693 76 -990 963 -555 -808
3295 -808 1445 -987 4 833 -1236 565 592 -1176 995 21 -1010 768 -324 -775 1027 -829 -257
$$ packed form
3177b22J280j842P51N70j568J498l00j275J842q04o06J361j189K94J031j562P95
3194E4N16j134J066j79j220J663r69m35J580j204J60P92j298N17P20j492J020
3211A57K78j241J545p77n95J449j054l15J400j646O81Q39j529R53L15j083J197
3228E74k86j143J613o96m86J248j239K12J038j602O60P01j321J273l35r71J200
3245D40n67j25J068j210R0J004j559R25P09j452J040K01j420J561k95j131J545
3262H24j085k66J379j651O36Q34j550J063J86j539J708m21r57J737r17n81J742
3279A142j669N23J034j900J083L69j824J869k93j251J610o17j066J953j518k53
3295h08K253k432R91Q29k069J801K7j768K171r74j031J778j092m51J802j856N72
$$ plain form
3312 -257 1498 -1454 564 781 -1380 1133 -157 -1007 1206 -699 -583 1038 -695 -512 1268 -1221
3328 -1221 -132 1354 -1734 798 529 -1830 1884 -515 -1020 1620 -905 -354 1034 -897 67 1226
3344 1226 -1258 387 1268 -1667 1411 59 -1593 2011 -946 -549 1519 -1462 261 858 -1406 264
3360 264 901 -1339 894 792 -1992 1896 -632 -1399 2220 -1642 154 1565 -1958 795 623 -1337
3376 -1337 817 512 -1442 1421 568 -2069 2133 -1144 -1034 2245 -2515 687 1291 -2143 1764 226
3392 226 -1425 1210 -257 -1342 1738 -253 -1553 2331 -1676 -242 2376 -2647 1271 744 -2236
3407 -2236 2126 -667 -1285 1633 -786 -641 1530 -962 -859 2116 -1985 476 1809 -2692 1831 363
3423 363 -2093 2539 -1204 -562 1736 -1407 -313 1141 -1356 48 1525 -2304 1085 1044 -2633 2699
$$ packed form
3312b57J755k952K018K17k161K513j290q50K213j905J16J621j733J83J780k489
3328a221J089J486l088K532k69k359L714k399n05K640k525N51J388j931R64J159
3344A226k484J645Q81k935L078j352j652L604k957L97K068k981J723N97k264J670
3360B64O37k240K233j02k784L888k528p67L619l862J796J411l523K753j72j960
3376a337K154l05j954K863q53k637M202l277J10L279m760L202O04l434L907j538
3392B26j651K635j467j085L080j991j300L884m007J434K618n023L918n27k980
3407b236M362k793o18K918k419J45K171k492J03K975m101K461J333m501M523j468
3423C63k456M632l743O42K298l143J094J454k497J404J477l829L389m1l677N332
$$ plain form
3439 2699 -1043 -1500 2767 -2011 59 1691 -1772 795 718 -1608 643 1046 -1953 1326 250 -2409
3455 -2409 2686 -1101 -1123 2711 -2532 565 1208 -2152 1380 258 -1407 1248 165 -1568 1757 -283
3471 -283 -1521 2757 -1808 -185 2262 -2916 1616 620 -2099 1989 -419 -1173 1576 -668 -979 1705
3487 1705 -902 -1042 2267 -2093 591 1535 -2606 1836 190 -1897 2758 -730 -942 1195 -1145 -245
3503 -245 1698 -1644 -267 1932 -2363 451 535 -2298 2542 -1301 -1872 2486 -1332 441 1470 -1846
3519 -1846 188 568 -1973 539 1355 -1678 1295 228 -1885 2444 -1323 -606 1913 -1896 604 1037
3535 1037 -1658 946 525 -1211 1181 139 -1205 1139 -558 -632 1602 -2047 586 1599 -2014 1296
3551 1296 537 -1661 1209 -213 -1142 1250 -316 -805 1411 -762 -530 1818 -1588 357 786 -1973
$$ packed form
3439B699l742m57M267m778K070J632l463K567p7k326K251M03k999L279j076k659
3455b409N095l787k2L834n243L097O43l360L532j122j665K655j083j733L325k040
3471b83j238M278m565J623K447n178M532r96k719M088k408p54K749k244l11K684
3487A705k607j40L309m360K684R44m141M442j646k087M655l488k12K137k340R00
3503b45J943l342J377K199m295K814Q4k833M840l843n71M358l818J773J029l316
3519a846K034L80k541K512Q16l033K973j067k113M329l767P17K519l809K500M33
3535A037k695K604m21j736K392j042j344K344j697p4K234l649K633J013l613L310
3551A296p59k198K870j422r29K392j566m89K216k173K32K348l406J945M29k759
$$ plain form
3567 -1973 1502 -150 -1363 1647 -872 -647 1302 -855 -35 1054 -802 166 1097 -1372 857 458
3583 458 -1517 1413 -283 -962 1528 -756 28 1007 -1004 203 701 -1321 488 557 -1201 1048 -108
3600 -108 -711 1452 -741 -278 1110 -995 67 770 -1057 1061 769 -1143 1115 12 -772 1109
3616 1109 -499 -597 838 -979 -232 762 -1117 606 105 -1016 940 -69 -707 918 -408 -423 950
3633 950 -614 -145 770 -846 281 641 -855 789 -107 -981 916 -183 -840 644 -469 -43 720
3650 720 -855 59 612 -950 523 104 -720 808 -286 -407 1207 -393 -172 604 -743 69 497
3667 497 -640 501 -4 -759 313 24 -554 896 -581 -326 625 -453 191 700 -694 443 98
3684 98 -731 610 -205 -436 734 -365 -88 644 -656 62 618 -708 351 491 -719 757 -201 -718
$$ packed form
3567a973L475j652j213L010k519K25J949k157Q20J089j856R68R31k469K229l99
3583D58j975K930j696o79K490k284P84R79k011J207M98k022J809O9j758K249j156
3600a08o03K163k193M63J388k105J062P03j827K118k92j912K258j103p84J881
3616A109j608r8J435j817P47R94j879J723n01j121J956j009o38J625j326j5J373
3633I50j564M69R15j616J127L60j496J644q96q74J897j099o57J484j113M26P63
3650G20j575R14N53j562J473m19q24J528j094j21J614j600K21P76j347Q12M28
3667D97j137J141n05p55J072k89n78J450j477K55R51j078O44N09j394J137l45
3684I8q29J341q15k31J170j099K77P32j300P18N56j326J059J40j210J476r58n17
$$ plain form
3702 -718 311 -182 -66 610 -496 -66 423 -484 361 219 -764 418 113 -845 683 -275 -309 474 -483
3721 -483 -57 648 -639 42 388 -898 689 404 -460 750 -101 -505 628 -498 -331 679 -460
3738 -460 65 484 -644 335 270 -717 526 -189 -485 852 -584 -239 580 -666 -92 417 -708 -50
3756 -50 510 -841 438 283 -778 684 -316 -243 586 -630 -153 827 -806 229 340 -837 651
3773 651 381 -757 650 -63 -768 675 -504 -544 1003 -1084 -61 364 -1047 442 366 -709 365
3790 365 242 -494 839 -217 -690 1158 -706 -96 1108 -1272 548 290 -775 590 -141 -737 741
3807 741 -171 -595 815 -281 -518 780 -982 177 1002 -1120 948 -169 -1034 968 -562 -424 782
3824 782 -410 -365 891 -567 -358 968 -937 375 557 -1508 1254 -439 -851 1080 -829 9 628
$$ packed form
3702g18J029m93J16O76j106M30M89r07Q45j42r83J182l05r58J528r58l4P83r57
3721d83M26P05j287O81L46j286J587k85q64J210q51m04J133j126J67J010j139
3738d60N25M19j128R79o5r87J243p15k96J337j436L45Q19j246N74N09j125O58
3756e0N60j351J279j55j061J462j000P3Q29j216M77R80j633J035J11j177J488
3773F51k70j138J407p13p05J443j179m0J547k087J023M25j411J489p6j075J074
3790C65j23p36J333j056m73J848j864O10J204k380J820k58j065J365p31n96J478
3807G41r12m24J410j096k37J298j762J159Q25k122K068j117q65K002j530J38J206
3824G82j192M5J256j458K09J326j905J312J82k065K762j693m12J931j909Q38O19
$$ plain form
3841 628 -715 15 742 -636 272 695 -1195 651 375 -1349 1634 -603 -681 1341 -1136 58 770
3858 770 -1121 607 679 -918 417 607 -1126 859 14 -1255 1737 -1120 -587 1331 -1666 531
3874 531 691 -1055 700 69 -510 694 34 -1029 1222 -197 -965 1554 -1346 101 1267 -1781
3890 -1781 1221 205 -1054 1217 -263 -548 754 -308 -558 1319 -704 -703 1568 -1374 586 984
3906 984 -1823 1448 -432 -818 1606 -818 -307 1005 -873 -326 865 -711 -116 1256 -1595 802
3922 802 482 -1469 1675 -586 -586 1502 -1163 252 913 -1025 256 520 -1010 384 725 -1647 955
3939 955 155 -1365 1794 -1322 -533 1464 -1428 693 591 -1210 699 462 -864 660 345 -960
3955 -960 1464 -253 -943 1482 -1317 158 1252 -1552 922 110 -1202 883 -222 -735 976 108
$$ packed form
3841F28j343P30P27j378R08M23j890J846k76j724K983k237p8K022k477J194P12
3858G70j891J728P2j597J335J90j733J985q45j269K992k857N33J918k997K197
3874E31J60j746J755o31n79J204o60j063K251j419p68K519k900J447J166l048
3890a781L002j016j259K271j480k85J302j062k50J877k023JK271k942J960L98
3906I84k807L271j880l86K424k424N11J312j878N47J191j576N95J372k851K397
3922H02l20j951L144k261%K088k665J415O61j938J281K64j530J394L41k372K602
3939I55q00j520L159l116P89J997k892K121j02j801J909k37j326J524l15j305
3955i60K424j717o90K425k799J475J094k804K474q12j312K085j105n13J711q68
$$ plain form
3971 108 -1024 1234 -659 -346 1452 -1338 650 861 -1628 1014 -189 -690 1329 -650 -464 1053
3987 1053 -416 -344 1039 -1157 -124 1217 -1414 703 244 -1651 1732 -559 -430 1133 -814 -93
4003 -93 685 -715 -42 1012 -1069 316 513 -1430 1104 -233 -1218 1448 -992 -286 1113 -907 -46
4020 -46 321 -808 250 188 -917 351 165 -1021 1155 -342 -550 1259 -1071 241 769 -1145 1000
4037 1000 14 -750 891 -257 -741 617 -58 -571 1164 -831 -110 805 -1111 508 705 -1081 773
4054 773 71 -604 875 -478 -413 823 -346 -144 941 -928 -14 794 -1090 713 215 -854 952
4071 952 -654 -251 671 -714 -92 498 -556 134 734 -903 696 289 -909 597 -330 -550 1110
4088 1110 -528 -397 480 -590 331 551 -617 396 491 -666 562 135 -533 786 -410 -155 686
$$ packed form
3971A08j132K258j893L13J798k790J988K11k489K642j203n01K019j979J86J517
3987A053j469P2J383k196J033J341k631K117m59j895L383k291J29J563j947P21
4003i3P78j400O73J054k081J385J97j943K534j337r85K666k440P06J399k020Q61
4020d6L67j129J058o2j105J268j86j186K176j497k08J809k330J312N28j914K145
4037A000r86p64J641j148m84J358o75n13J735j995P21R15j916J619J97j786J854
4054G73p02o75J479j353O5J236j169K02J085j869R14Q08j884J803m98j069J806
4071I52j606M03R22j385O22N90j054O90O00j637J599m07j198J506r27k20J660
4088A110j638J31Q77j070R21K20j168J013R5j157J228m27o68J319j196K55Q41
$$ plain form
4105 686 -657 203 604 -930 587 256 -719 550 4 -460 747 -311 -307 521 -235 -147 575 -781 365
4124 365 301 -499 728 137 -670 724 -364 -586 608 -348 -94 210 -565 173 500 -466 620 182 -274
4143 -274 376 -260 -69 449 -242 41 356 -575 137 177 -502 577 177 -249 401 110 -190 609 -275 -142
4163 -142 383 -507 -44 240 -552 365 157 -263 396 15 -257 555 -312 -239 636 -392 17 401 -497 401
4183 401 302 -544 527 15 -489 267 -238 -314 637 -327 240 411 -373 138 293 -483 292 117 -315 809
4203 809 -208 -445 596 -261 13 485 -648 224 332 -595 383 -40 -327 337 -82 -351 722 -185 -16
4222 -16 366 -305 200 233 -544 163 19 -432 430 -219 -297 437 -239 -138 452 -192 66 483 -324 260 266 -360
4244 -360 645 102 -493 487 -340 -272 407 -501 305 279 -474 227 192 -324 475 141 -762 524 -213 -550
$$ packed form
4105F86j343Q60M01j534J517l31r75J269n46m64J207j058MQ28p56Q8P22j356J146
4124C65o4q00J227n91q07J394j088k22J194r56K54L04p75P38L27r66J086m38m56
4143b74O50o36J91N18o91K83L15r31P12M0o79J079m00m26O50k91l00P99q84J33
4163a42N25q90M63K84p92R17k08m20O59l81k72Q12q67P3Q75j028M09L84q98Q98
4183D01r9q46J071n12n04P56n05p6R51r64N67J71p84N11J55p76P75j75m32J124
4203H09j017k37J041q57K74M72j133Q72J08r27R78m23k87O64m19k69J073r07J69
4222a6L82o71N05L3p77P07j44m51Q62o49p8P34o76J01N90o44K58M17q07N84Oo26
4244c60J005n43n95R80q27O8O79r08Q06k6p53P01l5n16P99l34r03J286p37l37
$$ plain form
4264 -550 712 -565 -205 56 -664 153 446 -383 308 285 -502 435 6 -351 626 -242 -148 560 -448 172
4284 172 279 -852 475 159 -522 344 -176 -292 579 75 -459 768 -423 -205 632 -970 105 418
4302 418 -942 747 28 -530 413 -226 -318 297 -314 -173 956 -623 -220 624 -611 484 229 -875
4320 -875 805 -348 -362 531 -661 -108 582 -164 -56 532 -406 250 369 -803 578 -75 -811 1028
4338 1028 -656 215 860 -879 246 17 -463 109 404 -679 119 357 -1088 1487 30 -607 981
4355 981 -800 332 614 -1213 380 52 -592 289 302 -420 319 18 -617 729 -685 -272 1073 -1129
4373 -1129 578 244 -1278 810 -151 -239 649 -118 -209 680 -155 -345 883 -810 -24 949 -921 545
4391 545 357 -989 870 -216 -394 702 -345 -194 347 -372 -53 874 -814 182 793 -1165 850
$$ packed form
4264e50J262j277L60K61p20Q17K93q29O91k3p87R37m29l57R77q68R4P08j008O20
4284A72J07j131J327l16o81Q66n20j16Q71n04n34J227j191K18Q37j602J075L13
4302D18j360J689p19n58R43o39r2O15o11J41J129j579M03Q44j235J095k55j104
4320h75J680j153j4Q93j192N53O90p46J08N88r38O56J19j172J381o53p36J839
4338A028j684Q71O45j739J125k29m80N72K95j083P98K38j445K575j457o37J588
4355I81j781J132K82j827J593l28o44Q81J3p22P39l01o35J346j414M13J345k202
4373a129J707l34j522K088r61q8Q88p67r1Q89q35j90J228j693P86R73j870J466
4391E45j88j346J859j086j78J096j047J51N41p19L19R27j688R96O11j958K015
$$ plain form
4408 850 -114 -955 1402 -766 -231 596 -699 403 550 -553 146 553 -734 268 368 -974 947
4425 947 -302 -529 1450 -794 182 717 -725 404 305 -359 7 24 -855 351 141 -691 1034 -470
4443 -470 -281 934 -950 411 676 -726 1073 -73 -592 583 169 -531 425 -217 -464 850 -752
4460 -752 172 925 -1034 722 196 -861 922 -212 -232 685 -174 -321 529 -473 -483 813 -688 13
4478 13 749 -1226 824 -278 -624 954 -322 -211 359 -584 -100 573 -511 68 480 -797 394 205
4496 205 -674 901 -186 -670 840 -763 48 267 -538 210 204 -850 213 294 -445 762 6 -632 925
4515 925 -590 -448 659 -724 414 239 -892 359 74 -190 509 9 -536 545 -174 -443 973
4532 973 -513 11 438 -716 576 154 -388 734 -222 -298 616 -154 -265 751 -387 -42 680 -668
$$ packed form
4408H50r64q41K357k168N35Q27j295J102J47j103O99M07j287J002J00j342J921
4425I47j249k27J979k244R76N35j442J129r9o64L66J7q79J206k10q32J725j504
4443d70J89J215j884J361K65j402J799j146n19J175m14p00R56o42k47J314j602
4460g52R24P53j959J756n26j057J783j134k0R17q59j47Q50j002j0J296j501P01
4478A3P36j975K050j102l46J578j276J11N70r43M84O73j084N79M12j277J191j89
4496B05q79J575j087m84J510j603Q11K19q05P48oj054J063Q1p39J207p56o38J557
4515I25j515J42J107j383J138j75j131J251k85k64O99n00n45J081p19k69J416
4532I73j486N24M27j154J292m22n42J122r56p6R14p70j11J016j138L45P22j348
$$ plain form
4550 -668 34 534 -829 592 -190 -302 684 -278 -416 566 -369 -31 417 -446 85 340 -677 410 -41
4569 -41 -674 751 -49 -350 500 -545 85 483 -408 120 395 -562 310 51 -383 510 -53 28 603 -501
4589 -501 -28 325 -316 94 206 -386 126 233 -492 563 -82 -309 688 -294 -419 534 -510 86 285
4608 285 -427 474 172 -472 213 -44 -328 429 -277 -190 446 -240 51 205 -438 256 47 -436 452 44
4628 44 -475 636 -48 -340 558 -272 -21 159 -463 176 105 -319 285 0 -351 338 -5 -242 606 -366
4648 -366 -106 619 -301 67 140 -561 353 105 -517 336 -81 154 415 -437 -186 509 -472 -61 379 -509
4668 -509 364 3 -455 523 -121 -210 438 -145 -300 332 -117 56 400 -392 228 21 -212 564 4 -393
4688 -393 265 -171 102 337 -348 76 371 -416 49 176 -251 317 149 -464 420 -180 -310 585 -468 -22
$$ packed form
4550f68P02N00j363J421p82j12R86r62j38R82r35L38M48q63N31K55j017J087m51
4569d1o33J425q00l01Q50j045O30L98q91N28K75r57Q72k59m34Q93n63Q1N75j104
4589e01M73L53o41M10J12n92N12J07p25J055o45k27R97r82j25R53j044N96J99
4608B85p12R01l02o44O85k57k84P57p06Q7O36o86K91J54o43O94k09m83Q88m08
4628D4n19J111o84k92Q98q30K51J80o22O39p1m24O04k85l51O89l43k37Q48r72
4648c66K60P25r20L68P3p01R14k48o22Q53m17K35K61q52K51O95r81M11M40q88
4668e09Q73l61m58R78o44q9O48n83j55O32m49J73L44p92O20k07k33P76n60l97
4688c93O58m36K73K35o85M24K95p87M65J27m27N68j68o13Q84o00j30Q95j053M46
$$ plain form
4708 -22 17 -288 298 260 -576 379 142 -298 358 -28 -74 432 -212 17 545 -446 225 410 -376 -67 255
4729 255 -792 515 -55 -607 465 -516 92 380 -455 187 297 -308 290 356 -136 585 102 -277 295
4748 295 -140 -302 252 -317 123 278 -237 31 14 -383 147 89 -353 266 113 -386 634 -374 -118 424
4768 424 -430 257 139 -457 315 -47 -464 229 1 -323 290 -223 -439 517 -295 238 314 -503 417 -60
4788 -60 -277 270 -171 -212 283 -69 -205 261 -194 -84 538 -511 186 326 -681 750 -145 -350 468 -217
4808 -217 -168 311 -498 -48 375 -229 -3 442 -379 298 270 -350 542 -335 -363 483 -516 93 242 -197 224
4829 224 347 -243 241 357 -667 582 80 -563 532 -494 -309 737 -452 286 -37 -723 339 411
4847 411 -309 121 246 -195 480 -193 -377 534 -533 -251 670 -824 408 -95 -384 484 90 -259 312
$$ packed form
4708b2L9l05N86l8q36R55k37m40O56l86m6N06o44K29N28r91O71J85p86L09L22
4729B55j047J307n70n52J072r81O08K88q35O42J10o05N98O6m92P21m83l79N72
4748B95m35j62N54n69M40J55n15K68j7l97N30n8m42O19j53m99J020j008K56N42
4768D24q54O87j18n96P72l62m17O93k28l24O13n13k16R56q12N33P6q17R20m77
4788f0k17N47m41m1M95l52j36M66m55J10O22j049O97J40j007J431q95k05Q18o85
4808b17M9M79q09M50M23o04K26M45q21O77k8o20Q92q77k8Q46r99O09J49m39M21
4829B24J23n90M84J16j024J249n02o43J095j026J85J046j189P38l23o86J062P2
4847D11p20M30J25m41O75o73j84R11j067K82R21j494J232n03k89Q68l94l49N71
$$ plain form
4866 312 -202 -503 326 -136 -299 539 -679 -87 410 -604 658 -190 -459 568 -357 -109 444 -238 -135
4885 -135 244 -291 8 313 -716 306 304 -720 426 -180 -323 678 -353 115 401 -42 -34 322 -358
4904 -358 130 413 -414 427 88 -622 536 -341 -415 692 -590 35 248 -318 88 195 -294 349 177
4923 177 -488 385 -123 -526 681 -422 4 668 -819 420 106 -495 411 13 -392 395 -96 -475 699
4942 699 -312 -209 737 -649 304 540 -838 540 -149 -509 374 -289 -260 496 152 -345 92 -405 82
4961 82 801 -536 426 207 -525 696 -326 -290 681 -295 72 343 -569 -54 348 -517 80 445 -631
4980 -631 523 236 -663 870 -582 -195 545 -508 66 220 -344 52 177 -511 147 170 -500 564 -106
4999 -106 -447 704 -634 51 400 -366 87 36 -260 288 -90 -268 617 86 -405 309 -550 -158 587 -570
$$ packed form
4866C12n14l01Q29m62j63Q38j218N92M97j014J262q48k69J027r25K48N53o82J03
4885a35L79n35K99L05j029J022kj024J146o06j43J001j031M68K86m43QL56o80
4904c58M88K83q27Q41l39p10J158q77p4J107j282O25K13n66M06J07m89O43j72
4923A77o65Q73n08m03J207j103M26O64j487J239l14o01R06l98m05P87m91l79J174
4942F99j011J03R46j386R53K36j378J378o89l60Q83o63K9P56l44m97M37m97M87
4961H2P19j337R62k19p32J221j022L6R71r76L67K71r12N15M02q65N97L65j076
4980f31J154k87q99J533j452L87P40j053N74J54n64L96J25o88O58K3o70J064o70
4999a06l41J151j338O85L49p66M53n1k96N48l78j78Q85n31m91P14q59L92P45j157
$$ plain form
5019 -570 267 416 -380 303 -169 -446 359 128 -286 209 -70 -73 472 -505 132 491 -389 -79 204 -532 410
5040 410 -57 -443 377 -217 -79 282 -189 14 271 -425 239 156 -558 319 -84 -433 464 -403 -470 576
5060 576 -149 -140 211 -332 81 107 -304 387 199 -556 511 6 -396 565 -388 -268 464 -502 122 71 -583
5081 -583 101 136 -199 341 -41 -112 330 -193 -198 400 -378 99 81 -334 316 -136 -193 302 -115 -362 404 -204
5103 -204 -81 462 -184 280 318 -353 287 -88 -1002 491 -557 -478 486 11 -279 449 51 55 157 -421 53
5124 53 87 -261 132 -129 -506 300 -83 -132 81 -506 226 110 -315 64 199 -491 174 -35 -294 183 -255
5145 -255 -87 152 -157 2 601 -392 -17 137 -505 267 19 -223 302 -255 -11 386 -231 -124 203 -112
5165 -112 113 77 -444 270 151 -351 93 108 -46 408 -525 127 212 -298 -49 262 -237 277 413 -387 151
$$ packed form
5019e70Q37J49p96O83m72k77Q05k31m14M95k79lN45r77O37L59q80L10K83p36R42
5040D10m67l86Q20n94J38L61m71K03K57o96O64q3p14Q77m03l49Q97q67o7J046
5060E76p25RL51n43M13K6m11O91j88p55J067n05m02R61r53J20P32r66O24n1o54
5081e83O84L5l35N40l82p1M42n23nN98p78M77j8m15O50m52n7M95m17k47P66o08
5103b04J23N43o46M64L8o71O40l75r14J493j048P9R64m75k90P28l98MJ02n78M74
5124E3L4l48L93k61l77Q06l83m9K13n87P32j16m25L79J35o90O65k09k59M77m38
5145b55J68K39l09J59N99r93L75J54o42P72k48k42N25n57K44L97o17J07L27l15
5165a12K25l6n21P14j19n02M44J5j54M54r33O52Q5n10K49L11m99N14J36q00N38
$$ plain form
5186 151 -334 -40 491 -120 10 257 -226 -23 180 -272 221 309 -295 123 225 -299 355 -20 -114 467 -484
5207 -484 -48 112 -38 105 176 -544 573 103 -127 385 -60 -99 326 -320 145 141 -184 46 133 -334 120
5228 120 25 -292 311 163 -95 197 -432 -310 219 -394 135 -189 -80 -250 229 -372 330 99 -242 354
5248 354 -310 -338 357 -180 135 147 176 425 -8 -192 294 258 -406 351 133 -333 452 -201 -177 536 -233 20
5270 20 -43 -354 176 105 -275 218 -75 -280 295 11 -268 229 -185 86 281 -352 146 4 -503 286 -218
5291 -218 74 295 -159 -8 90 -101 -99 87 -182 70 362 -526 281 48 -494 421 -139 -252 485 -329 -10
5312 -10 287 -239 -18 256 -298 301 242 -319 163 -22 -126 430 -253 48 222 -351 -118 130 -527 142 60
5333 60 -400 33 -105 -460 321 -332 -23 676 -543 119 266 -475 259 -277 -189 195 159 -64 129 -54 -137
$$ packed form
5186A51m85K94N31o11J30K47m83K03K03m52M93Q8o04M18J02n24O54l75r4N81r51
5207d84M36J60j50J43P1p20J117m70k30N12m45l9M25o46M65ml25K30Q7m67M54
5228A20r5l17O03j48k58K92o29J22N29o13N29l24J09j70M79o01P02k31l41N96
5248C54o64k8O95n37L15J2K9K49m33j84M86l6o64P57k18m66P85o53K4P13p69K53
5270B0o3l11N30p1l80M93k93k05N75k84k79M97m14K71J95o33M98j42n07P89n04
5291b18K92K21m54J51R8j91KJ86k69K52K92q88Q07k33n42R15n60j13P37q14L19
5312a0K97n26K21K74n54N99n9n61M82j85j04N56o83L01J74n73K33K48o57O69q2
5333F0m60M33j38l55P81o53L09O99j219O62J47p41P34n36Q8L84l6k23J93j83q3
$$ plain form
5354 -137 382 -308 -150 400 -442 128 184 -322 323 35 -120 303 -152 -260 49 -97 -143 48 -44 -89 485
5375 485 -743 206 144 -179 730 -290 -356 192 -341 -72 181 -135 -22 216 -155 -58 433 -601 267 242
5395 242 -289 520 -295 -256 417 -305 -47 145 -410 -62 88 -217 222 186 -222 166 -44 -211 535 -497
5415 -497 -16 326 -399 462 173 -379 278 -56 -395 259 170 -120 598 -271 14 413 -519 256 -90 -247
5435 -247 110 -262 -30 112 18 -176 -100 112 -236 308 -362 -46 203 -555 337 203 -281 345 -366 -31 98
5456 98 -133 -35 130 -341 -283 385 -360 -14 38 -486 419 135 -309 390 -494 -121 211 -246 -33 165 -116
5477 -116 -195 -20 -387 -32 111 -395 168 -90 -247 366 -252 145 318 -357 174 -48 -199 366 57 -166
5497 -166 104 13 -292 351 38 8 309 -340 -74 293 -263 314 134 -103 229 85 -180 241 -150 -75 372
$$ packed form
5354a37N19o90J58N50q42N70N6n06O45k88j55M23m55j08L09j46m6J91r2m5N74
5375D85j228R49o2l23R09j020o6N48n33K69K53l16J13K38l71R7M91j034Q68k5
5395B42n31Q09q15L9O73p22K58J92n55L48J50l05M39l6m08L88k10j67P46j032
5415d97M81L42p25Q61k89n52O57l34l39O54q9k90P18q69K85L99r32P75l46j57
5435b47L57l72K32J42r4j94P6K12l48N44o70L16K49p58Q92j34m84O26p11L35J29
5456I8k31R8J65m71N8O68p45L46N2n24R05k84m44O99q84L73L32m57K13J98k81
5477a16p9J75l67L55J43n06N63k58j57O13o18L97J73o75N31k22j51N65l09k23
5497a66K70r1l05O43l13l0L01o49K66L67n56N77j80k37L32j44k65M21l91P5M47
$$ plain form
5518 372 -378 -29 264 -380 258 -171 -154 476 195 37 352 -10 30 405 -155 -123 188 -297 130 204 -114
5539 -114 205 -197 -99 436 -224 -263 235 -44 -130 181 -152 232 168 -78 372 -40 -247 186 -94 -188 191 -300
5561 -300 -142 245 -172 196 -12 -281 341 160 -194 63 -99 -89 160 -252 -13 255 -39 -26 164 -250 203
5582 203 84 -161 365 -152 -13 338 -279 -253 198 -289 -8 43 -112 -52 -20 -131 442 -9 -277 -73 -144 -226
5604 -226 216 -285 -91 61 -302 300 74 -39 277 -10 -239 233 -331 16 326 -313 23 285 -225 413
5624 413 -260 -91 247 -133 -274 321 176 -217 238 -173 291 295 -303 153 161 -18 320 -162 -84 -96 -269 -70
5646 -70 244 -263 200 280 -437 86 273 -315 217 -92 -456 312 -88 -103 154 -206 -73 134 -1 -49 187
5667 187 -225 -25 244 -260 167 -163 116 184 -227 148 334 -225 30 320 -338 88 93 -407 47 -25 -142
$$ packed form
5518C72p50L49K93o44O38m29J7O30k81j58L15l62M0L75n60L2L11m85M27P4l18
5539a14L19m02R8N35o60l9M98k79q6L11l33L84o4k46M50m12k07M33k80r4L79m91
5561c00J58L87m17L68k08k69O22j81l54K57j62J0K49m12K39K68k94J3J90m14M53
5582B03j19k45N26n17J39L51o17K6M51m87K81N1j55O0L2j11N73m51k68K04p1q2
5604b26M42n01J94J52l63O02k26j13L16k87k29M72n64L47L10o39L36K62n10O38
5624D13o73J69L38l80j41N95j45l93M55m11M64Mn98M56Qj79L38m82P8j2j73J99
5646g0L14n07M63Q0p17N23J87n88N32l09l64P68m00j5K57l60J33K07j35m8K36
5667A87m12K00K69n04M27l30K79O8m11L75J86n59K55K90o58M26Nn00M54p2j17
$$ plain form
5688 -142 287 -98 -318 190 -99 175 -22 -244 205 225 -206 43 -55 -310 328 132 -48 213 -294 18 408
5709 408 81 -220 254 -265 217 -90 -63 171 -36 -165 -152 -297 -22 130 -236 -82 97 -89 36 220 -163
5730 -163 151 -188 -209 146 -285 84 255 -142 420 227 -193 -50 -41 -83 -91 -114 -17 208 19 -128 263 -309 119
5753 119 54 -265 278 45 -203 326 -99 24 26 155 -119 186 -11 -151 227 -9 137 122 -373 308 66
5774 66 -263 258 137 -317 162 73 13 59 -156 71 192 -302 363 252 -241 409 -219 -184 214 -331 200 160
5796 160 190 83 212 58 -51 96 -110 -35 43 -99 240 -318 -73 136 -95 196 32 -71 18 14 40 -26 85
5819 85 -117 237 -229 -142 519 -184 -121 317 -413 40 275 -273 249 39 -136 163 -178 -122 248 -119 74
5840 74 231 -207 -34 182 -242 172 -34 -467 303 1 -81 331 -99 -62 221 -158 -95 443 -311 -12 201
$$ packed form
5688a42M29l85k20N08k89K74j97k22M49K0m31K49r8k55O38j96j80K61n07L12L90
5709D08l27l01M74n19M82l07K7K34k07j29J3j45K75J52l66J54J79j86J25J84l83
5730a63L14l39k1L55m31L69J71l97N62j93m20J43Rm2qk3R7K25j89j47L91n72M28
5753A19o5l19N43k33k48N29m25J23KJ29k74L05j97j40L78k36J46j5m95O81k42
5774F6l29N21j21m54M79q9o0M6k15K27J21m94O65j11m93O50o28L5L98n45N31m0
5796A60L0j07J29j54j09J47k06P5P8j42L39n58K45K09k31K91j64j03Q9mK6o6J11
5819H5k02L54m66Q7O61p03O3M38p30M53K35n48N22k10j75K99l41N6L70l67J93
5840G4J57m38J73K16m24M14k06m33P70l02q2M12m30L7K83l79O3N38p54K99K13
$$ plain form
5861 201 -216 347 -127 -5 395 -142 -32 370 -33 -121 148 -90 -134 160 -287 194 151 -304 8 -4 -48 230
5883 230 -15 277 123 -139 263 156 -208 8 70 -159 143 166 -3 293 -54 221 186 -353 165 133 -424
5904 -424 354 -153 -55 45 84 -375 63 45 -402 142 -247 -30 -6 -262 33 -115 -137 188 -74 -152 307 58
5926 58 3 366 -136 -100 243 -145 93 297 -368 129 141 -69 104 -163 -73 234 -220 -219 -71 -188 -2 364
5948 364 -302 217 175 -365 78 -73 -112 400 -235 -180 -61 -279 180 199 -339 -83 -50 -333 224 -25 36 314
5970 314 44 -13 194 -138 -14 -137 -219 327 -132 -38 196 -136 190 181 -185 -171 -42 14 87 73 -49 18 181
5993 181 -316 244 24 -330 125 -289 -14 437 -15 -147 -59 -6 182 119 -491 398 -203 -226 134 -158 27
6014 27 323 -315 -188 159 -72 -66 40 -553 -60 60 -415 242 90 -76 176 -76 -63 116 -244 91 169 -152
$$ packed form
5861B01m17N63m74J22M00n37J10M02m03q8K69k38m4K94m47M81m3m55L12j2m4K78
5883B30k45K92j54k62M02j07l64K16O2k29L02K3j69K96l47K75l5n39N18l2n57
5904d24P78n07R8J00L9m59M38j8m47N44l89K17K4k56K95j48k2L25k62p8M59k49
5926E8n5L63n02L6L43l88K38K04o65M97J2k10J73k67R0L07m54JJ48j17J86L66
5948C64o66N19m2n40M43j51l9N12o35N5J19k18M59J9n38K56L3k83N57k49O1K78
5970C14k70n7K07l32J24j23q2N46m59R4K34l32L26rl66J4J29N6P3j4j22O7J63
5993A81m97N60k20l54M55m14K75M51m52j32Q8N3J88o3o10Q89o01k3L60k92J85
6014B7K96o38J27L47k31OJ06n93M93J20m75O57j52j66K52k52J3J79l60L35P8l21
$$ plain form
6036 -152 170 180 53 165 -39 77 216 -118 -209 119 -102 -219 -17 -146 43 57 -113 1 -266 77 -229
6057 -229 -220 -181 137 -239 146 34 -239 106 -137 -114 104 -117 35 293 -353 -16 264 -302 -238 137 -152 129
6079 129 34 -129 65 -188 -101 177 -149 -240 185 60 -85 -68 -67 -43 334 -134 53 85 -104 314 -89 -47 75
6102 75 23 -251 353 -232 -58 -205 -123 96 -76 69 -23 128 -67 143 -2 -39 167 -198 99 282 -63 360
6124 360 153 -18 33 -60 -72 146 13 -89 57 5 83 26 -262 317 -84 -83 392 -142 -67 172 -181 -22 265
6147 265 -127 -301 106 -167 376 -125 -91 -152 -79 2 -46 -11 -192 185 -295 -9 67 -273 41 164 -337 -102
6169 -102 184 -99 9 26 33 103 -335 -315 172 -102 76 110 112 286 103 -64 80 -148 -102 316 -171 -195 67
6192 67 -131 165 -5 -1 184 -45 -350 37 -136 -263 263 -50 -241 308 -10 -264 255 -169 102 215 -37
$$ packed form
6036a52L22J0j27J12k04J16J39l34r1L28k21j17K02j29J89J4j70J14k67L43l06
6057b29RL9L18l76L85j12k73L45k43K3K18k21J52K58o46L37K80n66O4L75k89K81
6079A29r5j63J94k53Q7K78l26r1M25j25j45J7JK4L77m68J87L2j89M18m03M2J22
6102G5n2k74O04n85J74j47Q2K19j72J45r2J51j95K10j45l7K06l65K97J83l45M23
6124C60k07j71N1r3j2K18j33j02J46n2P8n7k88N79m01JM75n34P5K39l53J59K87
6147B65l92j74M07k73N43n01L4o1P3Q1m8L5j81L77m80K86P6l40L14J23n01K35
6169a02K86k83J08J7PP0m38K0M87k74J78L4KJ74j83j67J44k28M6M18m87k4K62
6192F7j98K96j70MJ85k29l05L87j73j27N26l13j91N49l18k54N19m24K71J13k52
$$ plain form
6213 -37 -43 32 -11 187 -153 -384 175 27 248 27 123 273 -13 -243 89 -16 -40 275 -261 -96 41 -58 -86
6236 -86 92 -28 -52 -85 -225 213 -263 -30 108 -227 61 185 -114 37 169 -390 215 311 78 12 -3 -260
6258 -260 271 26 -408 -107 -263 139 162 -69 -78 135 -150 55 172 -278 117 -171 10 7 -314 -371 45 -77
6280 -77 -86 104 -206 -40 13 -89 69 -83 -255 201 208 90 89 9 -72 209 -190 -62 112 -180 134 18 -267
6303 -267 134 70 -386 227 -81 -70 103 -305 -53 132 -154 7 240 -385 -67 -23 -186 33 -6 -22 113 81
6325 81 -8 202 -241 15 137 -18 20 21 -198 179 -313 -12 216 -190 -156 -101 -133 123 187 -451 200 67 -75
6348 -75 -65 -193 64 113 -306 -34 296 -180 97 -64 -198 102 -89 170 63 47 -227 366 26 -103 238
6369 238 -316 -22 232 -43 86 -128 -157 149 16 135 -21 -47 -426 293 -158 -275 199 -150 -93 -63 14 322
$$ packed form
6213c7oP5m3J98l40k31N59j48K21k21R6J50k86k30L32j05k4L15n36J65J37r9k8
6236h6J78j20k4l3j40M38m76K33J38l35K88J24k99J51J32n59O05R6k33o6j5k57
6258b60N31k45m34L01j56M02K3k31rK13k85K05J17m50L95k88J81ll21n7M16j22
6280g7rJ90l10J66N3j02J58j52j72M56Pj18jq0q1K81l99J28J74k92L14j16k85
6303b67M01o4m56O13l08J1J73m08K52J85k86J61K33o25L18M4j63K19l9j6J35l2
6325H1q9K10m43K56J22j55L8Jk19L77m92L01K28m06L4N5l2K56O4o38O51j33j42
6348g5J0j28K57M9m19K72L30m76K77j61j34L00j91K59j07j6k74N93l40j29L41
6369B38n54K94K54k75J29k14k9L06j33J19j56k6l79P19m51j17M74l49N7L0P7L08
$$ plain form
6391 322 130 72 58 -17 -257 148 64 321 171 -103 132 132 -126 465 14 -114 232 -13 -40 137 -9 -51 -103
6414 -103 -118 59 58 -231 264 21 -312 156 -38 -246 -16 -120 -97 170 -300 121 -22 -116 280 76 -318 95
6436 95 -385 -141 265 -150 21 -47 -93 129 165 -208 -82 139 -142 31 159 -109 181 -61 72 -121 -154 264
6458 264 123 -128 210 133 -206 -45 114 -282 -109 -119 -70 -65 -79 -110 -55 -226 167 98 -110 261 -90 -223 -119
6481 -119 292 -32 381 20 0 269 -328 204 173 -137 -60 40 33 117 -269 -206 -16 -158 135 75 -182 141 -71
6504 -71 -37 -36 -7 -7 80 -115 -1 274 -92 -235 220 31 95 -22 20 92 22 -191 201 -104 -74 20 -228 20 145
6529 145 4 29 11 -55 170 79 -48 -39 49 3 354 -17 136 244 -72 99 139 -150 -39 265 -7 291 149
6552 149 -134 51 -35 -136 -123 -27 -215 32 4 30 -168 -283 41 -69 -192 39 -138 -31 -101 -65 95 244
$$ packed form
6391C22j92n8j4p5k40M05q4K57j50k74K35%k58N91m51j28L46k45k7J77j46m2n2
6414a03j5J77jk89M95k43l33M68j94k08K30j04K3K67m70M21j43r4L96k04l94M13
6436I5m80K44M06m15J71o8m6K22L6l73J26K21k81J73J28k68K90k42J33j93l3M18
6458B64j41k51L38p7l39J61J59l96J73j0M9Nj4l1N5j71L93o9k08L71l51j33J04
6481a19M11l24M13l61k0K69n97N32l1l10P7J00pQ4l86O3J90j42K93o0k57L23k12
6504g1L4JK9%Q7j95J14K75l66j43M55j89O4j17M2P2p0k13L92l05L0R4k48K48J25
6529A45j41K5j8o6K25r1j27RQ8m6L51l71J53J08l16J71M0k89J11L04k72K98j42
6552A49k83J85q6j01J3R6j88K47k8K6j98j15L24j10j23K31j77J07p0L6J60J49
$$ plain form
6574 244 -193 -27 147 -252 -10 82 -133 9 -64 12 126 -31 -132 96 -113 -42 80 -61 -40 -55 -71 178
6596 178 -30 -166 -18 -274 -65 182 -104 -115 51 -469 258 93 -101 118 -146 -47 207 -380 -5 2 -58 125
6618 125 -62 -274 -207 237 23 206 35 -140 26 108 26 152 -243 -166 165 -104 136 38 -163 13 233 99
6640 99 96 -136 -13 -45 -322 170 113 4 163 324 -164 124 -44 -59 215 225 -106 229 -2 -99 93 -43 -130
6663 -130 291 197 99 124 -171 107 92 -36 -36 71 -243 138 -68 -162 -28 -90 238 -145 -100 -129 13 -221 -215 30
6687 30 -134 149 118 -28 106 -45 -23 262 -131 275 347 -234 197 95 66 208 67 26 85 3 114 103 55
6710 55 -63 28 -190 110 190 -208 156 -228 -210 75 -182 48 215 -172 272 -293 -112 -29 116 -126 135 37
6732 37 -155 74 -494 -99 86 114 25 20 -189 80 60 -102 -204 -182 -109 145 -66 -15 55 -118 -76 18 20 157 170
$$ packed form
6574B44m37J66J74l99K42R2k15J42p3P6J14j57j01K28k09P1J22j41K1j5j6K49
6596A78k08j36J48k56K09K47k86j1J66n20P27j65j94K19k64R9K54n87L75Po0J83
6618A25j87k12O7M44k14J83j71j75J66Q2q2J26l95P7L31k69K40r8k01J76K20j34
6640I9lk32J23l2k77M92n7j09J59J61m88K88j68j5K74J0l31L35k31r7J92j36q7
6663a30M21r4r8K5k95K78j5j28%J07l14L81k06r4J34o2L28l83M5k9J42k34OK45
6687C0j64K83l1j46J34j51K2K85l93M06P2n81M31j02k9J42j41m1N9q2J11j1m8
6710E5j18R1k18L00Q0l98L64l84J8K85k57K30J67l87M44n65J81Q3J45k42K61r8
6732C7j92K29n68L95J85K8q9nk09K69k0j62j02K2P3K54k11N1P0j73M2R4KJ37J3
$$ plain form
6757 170 -149 47 202 1 132 -73 -184 92 53 -84 309 11 303 160 -235 107 189 -275 31 -18 -225
6778 -225 204 -147 287 -85 60 202 241 -126 110 -68 -145 45 98 -61 191 105 17 61 -153 -98 -111 9 -173
6801 -173 186 -107 392 -31 -190 129 -97 -124 286 -55 -122 184 110 257 99 62 143 -56 -34 12 21 4 290
6824 290 -81 -212 158 22 -142 246 -325 49 -46 -61 266 145 134 235 -232 -5 76 -94 112 150 -58 -74
6846 -74 -5 -186 204 -243 65 160 -121 19 217 -38 -22 -147 -91 93 219 -219 -67 38 -165 98 -90 17
6868 17 239 -407 80 246 -106 196 -5 -94 69 -38 91 217 -18 17 -9 -130 -28 -56 -24 61 -55 -323
6890 -323 46 -86 -114 93 185 -149 -52 -15 54 122 20 156 -91 -38 14 -53 68 355 63 -65 158 -129 -287
6913 -287 25 -3 -2 184 -129 -203 135 -67 204 71 -273 22 97 -7 -235 16 89 112 -7 -124 -91 -2 277
$$ packed form
6757A70l19J96J55k01J31k05j11K76l9j37L93k98K92j43l95L42Q2m64L06m9k07
6778b25M29l51M34l72J45J42L9l67K36j78p7J90N3j59K52q6q8M4k14N5j3J20j82
6801a73L59k93M99m23j59L19k26k7M10l41o7L06p4J47j58l7Q1j99K2M6Rj7K86
6824B90l71j31L70j36j64L88n71L74r5j5L27j21j1J01m67K27Q1j70K06L8k08j6
6846g4O9j81L90m47L08R5k81J40J98k55J6j25N6J84J26m38J52J05k03K63j88J07
6868A7K22o46M87J66l52L02k01q9J63j07J29J26k35L5k6j21J02k8L2Q5j16k68
6890c23L69j32k8K07R2l34R7L7O9O8j02J36k47N3N2o7J21K87k92j28K23k87j58
6913b87L12k8JJ86l13p4L38k02K71j33l44K95P5j04k28K51P3K3j19j17L3Q9K79
$$ plain form
6936 277 59 -281 -28 8 86 252 117 81 148 -134 -40 45 33 180 165 -190 204 131 -134 154 -309 -127 -2
6959 -2 -226 113 109 -153 41 -284 99 171 70 -10 60 -7 -143 89 -92 -68 150 -151 174 7 -171 74 -168
6982 -168 -97 133 15 -64 29 -140 4 31 -73 -164 167 -69 258 -110 19 320 -229 106 22 -53 16 144 -48
7005 -48 9 -123 -266 -9 125 -215 -25 -8 -17 -75 -284 -112 228 19 -19 215 118 161 -27 267 236 77 20 18
7029 18 235 -62 224 -37 12 17 -188 -118 87 -65 105 -134 -164 12 300 59 -45 -157 -171 -174 -128 119 -21
7052 -21 -93 76 -74 307 24 -226 -153 21 -153 -90 94 -209 123 -163 -107 436 -31 11 273 31 125 47 -154
7075 -154 -105 178 78 86 166 90 233 -56 -84 37 53 13 109 -30 65 251 -274 7 265 -329 -5 73 173 132
7099 132 -25 57 225 129 -178 112 -183 -210 -154 116 198 79 -38 73 -98 36 25 200 -164 160 43 77
$$ packed form
6936B77k18l40K53L6P8J66j35l6O7k82R4Q5j2J47j5l55L94p3k65K88m63J82J25
6959bk24L39mk62J94l25L83P2j01q0P0o7j36K32j81K4K18l01L25j67j78K45k42
6982a68P1K30j18p9R3j69J44K7j04r1L31k36L27l68J29L01n49L35q4p5O9J28j92
7005d8N7j32j43K57J34l40J90J7rn8k09J72L40k09l8K34r7M3j88K94l1j59n7k
7029A8K17k97K86k61M9Nk05P0K05j52J70k39l0J76K88k41j04j12j4lM6K47j40
7052b1p2J69j50L81k83k50P3J74j74O3J84l03L32k86N6N43m67M2K62k42R4p8k01
7075a54M9K83j00QQ0p6J43k89k8J21J6m0R6j39R5J86n25K81K58n94L24P8J00m1
7099A32j57Q2J68r6l07K90k95k7N6K70Q2j19j17J11j71J34j1J75l64L24j17L4
$$ plain form
7121 77 212 51 -62 76 -24 5 82 -86 298 -232 -24 -223 -39 148 149 -48 81 265 -297 20 -208 -110
7143 -110 20 18 -24 51 66 -85 -97 -83 4 294 102 -81 -152 -124 226 -46 20 208 -322 -98 240 -261 11 189
7167 189 40 215 11 0 48 -48 -155 -23 -256 20 31 24 -23 255 -223 99 -36 -216 62 -86 82 -61
7189 -61 44 231 -87 -29 144 120 -61 -178 208 -67 126 56 86 -99 -283 -189 252 -37 102 -2 -6 60 -112
7212 -112 -38 35 90 43 123 52 -304 160 -168 -149 -42 -148 82 116 -94 252 148 -133 217 85 -40 97 57
7235 57 -199 62 -245 26 116 -106 -114 214 -258 -34 33 -103 225 -278 165 -19 164 8 81 -20 33 -682
7257 -682 -495 -93 154 -30 40 -115 122 20 -83 288 -61 76 65 130 -120 -50 -56 -83 157 -217 -139 -2 -162
7280 -162 -56 161 -68 -76 108 -131 -29 -175 -141 81 78 -242 -9 -113 -164 199 -146 187 -41 -50 -257 52 -103
$$ packed form
7121G7J35j61j13J38j00K9P7j68L84n30K08j99J84J87Jj97J29J84n62L17k28R8
7143a10J30km2P5J5j51j2J4Q7K90j92j83p1K8L50k72O6J88n30K24L38n01K72J78
7167A89j49J75k04j1M8r6j07J32k33K76J1pm7K78m78L22j35j80K78j48J68j43
7189f1J05J87l18N8J73k4j81j17L86k75J93p0L0j85j84R4M41k89J39j04mO6j72
7212a12P4P3N5m7Q0p1l56M64l28J9J07j06K30L4k10L46j04k81L50j32j25J37m0
7235E7k56K61l07K71R0k22qL28m72K24O7j36L28n03M43j84J83j56P3j01N3p15
7257f82J87M02K47j84P0j55K37j02j03L71l49J37j1O5k50P0ok7K40l74P8J37j60
7280a62J06K17k29qJ84k39J02j46L4K22ll20K33j04n1L63l45L33k28rk07L09j55
$$ plain form
7303 -103 9 -111 -6 51 -235 37 197 -207 164 149 -361 208 -213 -234 9 148 -221 -8 7 61 248 37
7325 37 130 58 26 211 -25 -63 110 -23 -182 175 -31 2 400 -6 -107 36 69 -6 -16 -289 -103 -69 -153 265
7349 265 121 -242 281 -36 10 147 -292 -32 244 -52 -24 14 -304 184 -143 4 294 -143 5 27 -101
7370 -101 84 243 -145 152 -4 -186 195 150 -189 115 -83 115 113 185 73 207 52 113 22 132 53 -241
7392 -241 -251 -7 -74 181 167 14 139 505 -79 68 127 -54 78 304 91 -32 -58 -154 198 237 154 35 -130
7415 -130 59 136 -192 -45 33 78 -44 -64 -183 340 -48 -143 189 48 -38 -16 -89 106 38 -25 -53 42 24 120 101
7440 101 -81 31 -108 -135 187 -38 254 -33 -367 152 111 -228 276 -120 -161 -52 94 -102 290 -31 127
7461 127 445 -435 34 -24 25 239 41 -75 223 -53 96 24 -130 -79 -14 -71 9 55 -66 55 -31 -71 200
$$ packed form
7303a03J12j20J05N7k86K72J60m04L71j5n10N69m21k1K43J39l69K13J5N4J87k11
7325C7R3p2l2J85k36l8J73j33j59L57k06L3L98m06j01J43L3p5j0k73J86L4q4M18
7349B65j44l63N23l17M6J37m39K60K76k96K8L8l18M88l27J47K90m37J48K2j28
7370a01J85J59l88K97j56j82L81m5l39L04j98J98kP2j12J34j55O1r1J10p9k94
7392b41j0K44o7K55j4j53J25L66n84J47N9j81J32K26k13j23k6r6L52L9q3j19j65
7415a30J89P7l28J47P8M5j22k0j19N23l88r5L32j41q6K2p3J95o8o3k8R5j8R6j9
7440A01j82J12j39k7L22k25K92k87l34N19m1l39N04l96m1J09J46j96L92l21J58
7461A27L18q80M69n8M9K14j98j16K98k76J49p2j54N1O5n7Q0M6j21J21q6m0K71
$$ plain form
7484 200 -115 17 69 -117 -47 212 -459 -39 165 -205 -105 38 -174 -75 -168 64 90 -77 94 311 -227 -95
7506 -95 18 -188 181 -128 -80 214 -63 -135 112 -256 -144 93 -111 134 72 70 125 170 -81 -95 9 77 68 -59
7530 -59 38 174 -196 144 238 -218 52 -228 -72 -15 0 56 60 -231 -36 -32 82 195 93 205 -48 101 -337
7553 -337 125 -4 61 128 -170 186 30 136 -20 22 -264 -32 -152 38 3 -250 -172 437 10 -87 289 -65
7575 -65 -251 5 -131 -134 5 -284 41 -15 -118 56 -71 103 319 -83 39 -252 -74 -172 127 -207 136 -94
7597 -94 23 219 76 22 150 -91 77 93 84 51 109 -188 -21 -15 -132 -62 -24 -128 196 34 -164 315 55 15
7621 15 103 63 80 -250 -75 152 137 -1 54 86 -111 -54 -140 -73 -61 -240 78 34 -259 37 277 140 261 -96
7645 -96 -14 206 -298 -38 92 -5 -35 -84 -202 -65 117 -252 25 85 13 164 -53 -188 -72 -74 -5 -117 -46 97
$$ packed form
7484B00l15J32N2j86P0K59o71M20K04l70J00J43k12R9r3K32K6j67J71K17n38J32
7506i5J13k06L69l09M8K94k77p2K47l68J12K37k04K45o2kN5M5k51j4J04O8rj27
7530e9R7J36l70L40R4m56K70k80J56N7J5N6Mk91J95MJ14J13j02J12k53J49m38
7553c37M62j29O5O7k98L56j56J06j56M2k86K32j20J90l5k53P8O09m27r7L76l54
7575f5j86K56j36lJ39k89L25n6j03J74j27J74K16m02J22k91J78r8K99l34L43k30
7597i4J17J96j43n4J28k41J68J6rl3N8k97J67Oj17P0L8j04L24j62j98M79k60m0
7621A5Q8m0J7l30J75K27j5j38N5L2j97N7q6O7J2j79L18m4k93K96K40j37J21l57
7645i6Q2K20n04K60J30r7l0m9j18J37J82l69K77O0p2J51k17j35J16kO9j12P1J43
$$ plain form
7669 97 222 172 -186 -201 -155 196 -184 -180 -69 156 -71 -148 -60 -75 138 124 -42 85 -51 319 -37 26 87 91 13
7694 13 126 -174 3 -18 -40 15 -26 10 96 -262 127 49 -177 1 -238 147 229 47 -108 65 -38 10 80 125
7718 125 -100 316 -136 165 114 -27 175 79 15 6 86 -110 101 -125 -136 12 -50 -143 -53 155 -52 141 13
7741 13 27 89 38 79 117 -49 139 103 -91 -140 125 -15 197 -126 293 20 -189 31 -157 -84 264 -161 115
7764 115 -46 -140 46 44 -137 265 54 -274 246 -172 -204 128 -62 -37 -42 -179 -21 34 -309 21 -4 -91 71
7787 71 160 -166 158 -29 -59 281 -140 -25 26 -50 -79 -127 -219 -233 -97 7 -80 -89 -227 400 -84 26 45 -237
7811 -237 -24 -100 117 72 269 -109 -6 9 -151 51 -214 -151 343 26 4 121 -102 -19 -11 -52 -196 -134 92
7834 92 -7 88 -16 -248 230 22 194 -257 13 124 -23 3 52 -80 130 -29 -99 110 -151 -22 -70 2 47
$$ packed form
7669I7J25n0l58j5M6L51l80MJ11K25k27p7Q8j5K13j4j66J27j36L70l56O3O1Mp8
7694A3J13l00J77k1k2N5m1L6Q6l58L89p8k26J78k39L85Q2j82j55J73j03M8P0M5
7718A25k25M16m52L01n1j41K02r6o4rQ0j96K11k26j1J48o2r3R0K08k07J93j28
7741A3J4O2n1M1L8j66J88l6j94m9K65j40K12l23M19k73k09K20j88P3L48m25K76
7764A15j61r4J86kj81M02k11l28N20m18l2L32j90K5nj37J58N5l43L30k5q7J62
7787G1Q9l26L24j87l0L40m21J15N1p6k9m8r2j4J36J04q7rj38O27m84J10J9k82
7811b37K13p6K17m5J97l78J03J5j60K02k65O3M94l17k2J17k23Q3Qm1j44O2K26
7834I2r9R5j04k32M78k08J72m51K70J11j47K6M9j32K10j59p0K09k61J29m8P2M5
$$ plain form
7857 47 34 -101 76 44 21 214 -75 -31 163 28 -102 191 -174 -26 46 -203 -72 14 -35 69 -108 -6 278
7880 278 -43 -19 226 -101 0 -54 -99 -25 168 -99 9 149 -230 160 -82 -187 -2 4 49 52 -139 131 -54
7903 -54 -66 126 -184 105 32 -132 184 183 184 270 -41 -278 120 171 28 142 -218 -377 237 -132 97 34 225
7926 225 -187 -28 92 202 145 -307 -135 247 -192 97 139 -47 217 -59 -73 73 -27 43 47 -243 206 -232
7948 -232 -205 76 -89 94 53 -40 316 157 -130 95 212 -74 51 179 -88 11 -144 4 189 -167 -47
7969 -47 203 124 -215 195 -170 50 48 -117 -2 -17 -24 -94 22 -41 -36 -27 -99 51 -157 -209 47 -56 -76 111 -210
7994 -210 -47 12 39 33 -287 4 58 -271 35 63 -156 38 17 -75 141 -83 -75 31 79 -284 283 17 28 -165
8018 -165 -102 138 -13 -114 -158 110 -189 436 217 -115 85 74 94 153 -112 99 -184 4 -271 63 -370 35
$$ packed form
7857D7j3j35J77l2k3J93k89M4J94j35j30K93l65J48P2k49J31Q6m9J04j77J02K84
7880B78l21K4K45l27J01n4m5P4J93k67J08J40l79L90k42j05J85OM5Lj91K70j85
7903e4j2J92l10K89p3j64L16jJQ6l11k37L98N1j43J14l60j59O14l69K29o3J91
7926B25m12J59J20J10n7m52J72L82m39K89M2j86K64k76j4J46j00P0Mk90M49m38
7948b32K7K81j65J83m1r3L56j59k87K25J17k86J25J28k67R9j55J48J85l56J20
7969d7K50p9l39M10l65K20kj65J15j5pp0J16o3NRp2J50k08n2K56j03k0J87l21
7994b10J63N9K7ol20K91N4l29L06K8k19J94k1r2K16k24QJ06M8l63N67k66J1j93
8018a65O3K40j51j01m4K68k99O25k19l32K00j1K0N9k65K11k83J88k75L34m33M05
$$ plain form
8040 35 -17 27 103 -83 42 231 11 -129 -20 -123 171 -103 -45 -166 307 46 -169 -236 -15 -89 -154 136 -89
8063 -89 -118 95 -48 -127 82 -114 -210 59 -23 -84 -26 -90 42 131 -11 -99 241 -58 114 -38 -267 106 155 -101
8087 -101 133 14 -138 -97 117 68 183 86 -113 109 -108 2 -36 -279 -77 140 51 311 -185 163 -97 -84
8109 -84 6 10 106 157 -96 97 -108 -200 -237 209 24 -198 35 207 37 195 3 -37 -3 6 152 38 -140 149
8133 149 -79 30 195 -17 -1 -75 -210 43 -247 -153 77 -207 -1 176 -99 -130 -53 99 62 -16 -129 214
8155 214 -89 -83 138 -17 -49 24 31 -328 393 -37 175 -21 -242 -34 96 179 63 -81 43 47 150 105 -117
8178 -117 -21 -217 301 -148 -51 -16 -223 -124 -137 7 89 -119 51
$$ packed form
8040C5n2M4P6j86J25J89k20j40J09j03K94k74N8j21M73k61k15o7K21p4o5K90k25
8063h9k9K13j43p9K09j96r6K69q2o1N8o4J32Q9j42q8L40k99J72j52k29L73M9k56
8087a01K34j19j52M1K14m9J15r7j99K22k17J10l8k43K02K17q9K60m96L48k60J3
8109h4R0MR6N1k53J93k05r2l7M46j85k22K33J72j70J58j92m0L4RJ46j14j78K89
8133A49k28J09J65k12J6p4j35K53k90R4K30k84K06J77k75l1P7J52l7p8j13L43
8155B14l03OK21j55l2P3Pl59P21m30K12j96k21K08J30Q3j16j44J24MJ03m5k22
8178a17R6j96N18m49R7L5k07R9j3J44Q2k08J70
8191E1
$$ Imaginary data points
##PAGE= N=2
##DATA TABLE= (X++(I..I)), XYDATA
$$ plain form
0 0 0 0 0 0 0 0 0 0 -8 8 -8 8 -8 16 -17 24 -32 33 -40 50 -64 73 -88 104 -120 137 -160 184 -209 241 -273
31 -273 308 -348 393 -443 495 -554 616 -686 762 -846 936 -1035 1145 -1262 1389 -1528 1682
48 1682 -1850 2035 -2239 2464 -2716 2998 -3314 3675 -4087 4563 -5121 5785 -6593 7591 -8864
63 -8864 10537 -12832 16171 -21438 30897 -52732 195277 -23169 -210095 303561 -208653
74 -208653 12669 135877 -141293 27207 90395 -101386 -10303 152675 -198158 88149
84 88149 116351 -275712 270617 -97034 -132632 268385 -228636 59230 111913 -167943 90230
95 90230 35541 -96900 40290 83537 -162281 115162 43034 -204121 247656 -132391 -71670
106 -71670 228898 -238888 105408 70360 -166605 130810 -12659 -82576 75996 18410 -113515
$$ packed form
0@%%%%%%%%qJ6j6J6j6K4l3M1n6O5p3R0j14J37j61J92k24K57k97L44l93M50n14
31b73N81o56P41q36R38j049J170j302J448j608J782j971K180k407K651k917L210
48A682l532L885m274M703n180N714o312O989p762Q650r684J0906j2378J4184j6455
63h864J9401k3369K9003l7609N2335q3629K48009k18446j86926N13656n12214
74b08653K21322J23208k77170J68500O3188j91781R1083J62978l50833K86307
84H8149K8202l92063N46329l67651l5598M01017m97021K87866N2683k79856K58173
95I0230n4689j32441J37190M3247k45818K77443p2128k47155M51777l80047O0721
106g1670L00568m67786L44296l5048k36965K97415j43469o9917J58572n7586j31925
$$ plain form
117 -113515 117684 -11431 -133253 207954 -147948 -14884 172759 -221382 132464 26693
127 26693 -144361 149194 -54015 -54302 90312 -33389 -59489 101752 -48851 -64564 152065
138 152065 -140456 29261 109573 -180235 136528 -11858 -106487 140563 -78209 -22558
148 -22558 83488 -62151 -13893 74012 -64363 -13394 97232 -119324 54427 56369 -136159
159 -136159 128912 -39575 -68475 122370 -91017 5004 67246 -74877 20878 44982 -65764
170 -65764 22641 49154 -91063 65191 13620 -89665 108123 -54683 -32227 92250 -86927
181 -86927 25399 43286 -69537 39574 17467 -53056 39370 11922 -57842 59580 -13906
192 -13906 -47678 78497 -55642 -4533 59989 -71762 35330 20132 -54372 44297 -3036
$$ packed form
117a13515K31199j29115j21822L41207l55902J33064J87643l94141L53846j05771
127B6693j71054K93555k03209k87J44614j23701k6100J61241j50603j5713K16629
138A52065k92521J69717Q0312k89808L16763j48386r4629K47050k18772N5651
148b2558J06046j45639M8258Q7905j38375N0969J10626k16556J73751J942j92528
159a36159K65071j68487k8900J90845k13387R6021O2242j42123R5755K4104j10746
170f5764Q8405K6513j40217J56254n1571j03285J97788j62806K2456J24477j79177
181h6927J12326J7887j12823J09111k2107p0523R2426k7448o9764J17422p3486
192a3906l3772J26175j34139N1109O4522j31751J07092j5198p4504R8669m7333
$$ plain form
203 -3036 -35590 40858 -10479 -29328 46656 -26436 -16974 50071 -48021 11517 32612 -53199
215 -53199 36750 3675 -36723 40413 -14757 -19024 34161 -20702 -8946 31320 -27720 1997
227 1997 26171 -35157 18171 11630 -32584 29666 -6332 -18910 29124 -17206 -5940 22040
239 22040 -20085 2335 15684 -20677 9399 9494 -20704 16281 16 -15767 19505 -9440 -6860
252 -6860 16852 -13856 1807 10731 -14103 6444 5095 -12340 9163 623 -9243 10951 -4451
265 -4451 -5193 9931 -7471 -364 6959 -8329 3612 3393 -6791 5184 81 -4897 5522 -2247
279 -2247 -2411 4706 -3336 -265 3241 -3633 1595 1574 -3157 1981 -20 -1866 2252 -624 -825 1610
295 1610 -865 87 1114 -1153 163 377 -856 573 -200 -148 350 -387 68 9 -217 60 54 -39 155 203
$$ packed form
203c036l2554P6448n1337j8849P5984p3092R462O7045r8092N9538K1095q5811
215e3199Q9949l3075m0398P7136n5170m267N3185n4863J1756M0266n9040K9717
227A997K4174o1328N3328o541m4214O2250l5998j2578M8034m6330J1266K7980
239B2040m2125K2420J3349l6361L0076R5l0198L6985j6265j5783L5272k8945K580
252f860K3712l0708J5663Q924k4834K0547j349j7435K1503q540r866K0194j5402
265d451p42J5124j7402P107P323j5288J1941k19j0184J1975n103m978J0419p769
279b247j64P117q042L071L506o874N228k1m731N138k001j846M118k876k01K435
295A610k475R52J027k267J316K14j233J429p73N2M98p37M55n9k26K77or3J94M8
$$ plain form
315 203 104 -163 341 -377 -79 524 -604 305 353 -691 794 199 -1093 1327 -678 -536 1862 -1726
333 -1726 142 1779 -2541 1397 959 -3101 2974 -357 -2390 3740 -2256 -1646 4112 -4057 418 3684
349 3684 -5840 3228 1826 -6334 5944 -1011 -5254 7812 -4705 -2403 7909 -7524 1099 6597
363 6597 -9581 4518 4068 -10595 9132 -48 -9673 12920 -6371 -5536 14002 -12492 1422
376 1422 10523 -15075 8062 5474 -14582 12178 305 -13445 16227 -6223 -10154 19983 -15225
389 -15225 -1493 18447 -22316 10420 9451 -22193 18426 -934 -16623 20511 -7770 -11766 21906
402 21906 -14311 -6328 24435 -25123 6071 19240 -32301 23031 2659 -26851 31204 -13219
414 -13219 -12841 27524 -19627 -4188 24182 -23501 1702 25031 -34745 17334 15681 -40706 38439
$$ packed form
315B03r9k67N04p18K98O03j128R09M8j044J485n95j292K420k005J42K398l588
333a726J868J637m320L938m38m060O075l331k033O130n996O10N758q169M475L266
349C684r524R068j402q160J2278o955m243J3066j2517K302J0312j5433Q623N498
363F597j6178J4099m50j4663J9727r180r625K2593j9291Q35J9538k6494J3914
376A422R101k5598K3137k588k0056K6760j1873j3750K9672k2450l931L0137l5208
389a5225J3732J9940m0763L2736r69l1644M0619j9360j5689L7134k8281l996L3672
402B1906l6217P983L0763m9558L1194J3169n1541N5332k0372k9510N8055m4423
414a3219L78M0365m7151J5439K8370m7683K5203K3329n9776N2079j653n6387P9145
$$ plain form
427 38439 -9086 -26885 43848 -30285 -2903 30955 -32805 9254 20001 -30869 13049 18923
439 18923 -39007 28985 6784 -42632 51322 -24574 -20119 51903 -47934 13326 26767 -43413
451 -43413 26168 8467 -31488 24337 7219 -36583 37239 -4747 -38411 59858 -40844 -8042
463 -8042 54268 -64889 33647 16940 -50828 45548 -9379 -27229 34734 -8671 -28093 42287
475 42287 -18307 -28661 63133 -56399 8222 49897 -77470 55680 131 -50767 62633
486 62633 -31196 -14917 39456 -25621 -12445 39271 -29424 -13304 56650 -63851 24544 37474
498 37474 -80430 72582 -19670 -42923 72496 -52927 3009 37421 -40437 8205 28350
509 28350 -34754 2825 42858 -64295 38614 21258 -75382 84481 -39934 -28563 75945
$$ packed form
427C8439m7525j7799P0733p4133K7382L3858o3760M2059J0747n0870M3918N874
439A8923n7930O7992k2201m9416R3954p5896M455P2022r9837O1260J3441p0180
451d3413O9581j7701l9955N5825j7118m3802P3822m1986l3664R8269j00702L2802
463h042O2310j19157R8536j6707o7768R6376n4927j7850O1963m3405j9422P0380
475D2287o0594j0354R1794j19532O4621M1675j27367J33150n5549n0898J13400
486F2633r3829J6279N4373o5077J3176N1716o8695J6120O9954j20501Q8395J2930
498C7474j17904J53012r2252k3253J15419j25423N5936L4412p7858M8642K0145
509B8350o3104L7579M0033j07153J02909j7356r6640J59863j24415J1371J04508
$$ plain form
520 75945 -72163 24590 29155 -50733 28969 12161 -35353 18677 24787 -58228 49236 2318
532 2318 -62720 88895 -58208 -9832 70681 -84578 46094 14557 -52927 46986 -7867
543 -7867 -27901 29304 4504 -42734 50057 -13787 -43524 80564 -67499 8954 57002 -86360
555 -86360 62053 -3025 -47822 58595 -27699 -15144 33612 -14556 -23710 44860 -26881 -22809
567 -22809 67129 -70627 26739 38553 -81202 73266 -21585 -37280 63068 -44277 189
578 189 31791 -28271 -4163 34504 -33434 -2705 47963 -66145 39041 18535 -67775 75672
590 75672 -36578 -22015 59928 -54967 16235 24298 -35754 13974 18841 -32656 12872 26487
602 26487 -53320 43326 201 -48645 68284 -44625 -5935 49161 -57019 27802 12939
$$ packed form
520G5945j48108R6753M565p9888P9702j6808m7514N4030O110q3015J07464m6918
532B318o5038J51615j47103M8376Q0513j55259J30672l1537o7484R9913n4853
543g867k0034N7205k4800m7238R2791o3844k9737J24088j48063P6453M8048j43362
555h6360J48413o5078m4797J06417q6294J2555M8756m8168r154O8570p1741M072
567b2809Q9938j37756R7366J1814j19755J54468r4851j5695J00348j07345M4466
578A89L1602o0062K4108L8667o7938L0729N0668j14108J05186k0506q6310J43447
590G5672j12250J4563Q1943j14895P1202Q063o0052M9728M867n1497M5528J3615
602B6487p9807R6646m3125m8846J16929j12909L8690N5096j06180Q4821j4863
$$ plain form
613 12939 -35879 26163 3830 -26947 22086 7321 -37749 42651 -13983 -29410 57045 -48474
625 -48474 8841 35213 -54188 36835 1110 -31317 33240 -9556 -17663 25684 -7796 -20971
637 -20971 35719 -22500 -11577 41277 -44787 18052 20509 -44729 38367 -8366 -22364 33166
649 33166 -18404 -7660 22777 -16129 -6044 25178 -24041 2158 24545 -35975 22638 6489
661 6489 -31704 34761 -15211 -12143 27931 -22343 1366 16992 -19441 4398 14535 -21506
673 -21506 10331 11250 -25935 22917 -3087 -19358 28114 -18028 -3611 20810 -21594 7817
685 7817 10033 -17691 10127 5114 -16062 13181 831 -15428 18707 -8155 -8500 19585 -16782
698 -16782 2510 12200 -17376 9800 3841 -13076 11787 -1096 -9557 11989 -4757 -6765 12977
$$ packed form
613A2939m8818O2042k2333l0777M9033j4765m5070Q0400n6634j5427Q6455j05519
625d8474N7315K6372q9401R1023l5725l2427O4557m2796q107M3347l3480j3175
637b0971N6690n8219J0923N2854q6064O2839K457o5238Q3096m6733j3998N5530
649C3166n1570J0744L0437l8906J0085L1222m9219K6199K2387o0520N8613j6149
661F489l8193O6465m9972L068M0074n0274K3709J5626l6433K3839J0137l6041
673b1506L1837R19l7185M8852k6004j6271M7472m6142J4417K4421m2404K9411
685G817K216k7724K7818n013k1176K9243j2350j6259L4135k6862l45K8085l6367
698a6782J9292R690k9576K7176n959j6917K4863j2883q461K1546j6746k008J9742
$$ plain form
711 12977 -9251 -1483 11103 -12878 5480 5484 -11627 9357 -823 -7743 9619 -4259 -3923 8534
725 8534 -6322 -1211 7328 -7871 2219 4783 -8090 5667 740 -6424 6999 -2739 -3359 6344
739 6344 -4599 -607 4803 -5137 1592 2997 -5014 3225 1004 -4029 4269 -1177 -2352 4372 -2774
754 -2774 -497 3302 -3486 723 1726 -3077 1803 391 -2446 2331 -717 -1453 2180 -1272 -524 1724
770 1724 -1604 496 1018 -1555 1136 234 -1521 1137 -441 -1073 1443 -890 -207 802 -768 218
786 218 538 -1141 517 198 -1016 743 -13 -570 697 -244 -430 824 -349 -42 498 -599 296 282
804 282 -922 393 -21 -818 668 30 -748 949 -419 -509 1059 -1055 -109 1104 -1452 506 904
821 904 -1567 1099 450 -1773 1784 -459 -1405 2435 -1227 -705 2581 -2279 203 2029 -2993 1684
$$ packed form
711A2977k2228P768J2586k3981J8358Mj7111K0984j0180o920J7362j3878L36J2457
725H534j4856N111Q539j5199J0090K564j2873J3757m927p164J3423r738o20R703
739F344j0943L992N410r940O729J405q011Q239k221n033Q298n446j175O724p146
754b774K277L799o788M209J003m803M880j412k837M777l048p36L633l452P48K248
770A724l328K100N22k573K691r02j755K658j578o32K516k333O83J009j570R86
786B18L20j679J658l19j214J759p56n57J267r41j86J254j173L07N40j097Q95j4
804B82j204J315m14p97J486o38p78J697j368r0J568k114R46J213k556J958L98
821I04k471K666o49k223L557k243r46L840l662N22L286m860K482J826n022M677
$$ plain form
837 1684 883 -2998 3102 -492 -2705 3834 -2205 -1127 4083 -3436 404 3225 -4770 2205 2340 -5154
853 -5154 4302 -63 -4664 6177 -2939 -2632 6391 -5345 540 4782 -6481 2871 3098 -6715 4995
868 4995 1206 -6490 7510 -2458 -5040 9157 -6676 -557 8007 -9509 4273 4065 -9247 6985
882 6985 518 -7879 8674 -2214 -6633 10776 -6521 -3598 11820 -12247 3482 8120 -13799
895 -13799 10019 1044 -10536 12142 -4154 -6469 11482 -6448 -3974 12496 -10757 -207 12668
908 12668 -16595 8819 5892 -16784 16371 -4628 -9401 16214 -10544 -2670 12002 -11064 11
921 11 11415 -14108 4470 10893 -19949 14923 1262 -17933 22947 -12649 -5803 18971 -18342
934 -18342 5125 10074 -15425 6684 7551 -15681 9624 6507 -20643 20818 -4940 -16151 27565
$$ packed form
837A684q01l881O100l594k213O539o039J078N210p519L840K821p995O975J35p494
853e154R456m365m601J0841r116L07R023j1736N885M242j1263R352K27r813J1710
868D995l789p696J4000r968k582J4197j5833O119Q564j7516J3782k08j3312J6232
882F985o467q397J6553j0888m419J7409j7297K923J5418k4067J5729M638k1919
895a3799K3818q975j1580K2678j6296k315J7951j7930K474J6470k3253J0550J2875
908A2668k9263K5414k927k2676L3155k0999m773K5615k6758P874J4672k3066J1075
921A1J1404k5523J8578O423l0842L4872j3661j9195M0880l5596O846K4774l7313
934a8342K3467M949k5499K2109Q67k3232K5305l117k7150M1461k5758j1211M3716
$$ plain form
947 27565 -20981 639 19182 -25198 13805 5184 -16963 13462 1075 -14169 13589 658
959 658 -17741 23679 -11447 -11333 28952 -28431 9186 15851 -28945 22828 -2773 -15473 19293
972 19293 -6919 -9274 15350 -5316 -12774 23798 -17250 -4844 27488 -33702 18080 9482 -30183
985 -30183 31571 -12655 -11252 23096 -16555 -1468 14607 -11698 -4864 20703 -20998 2658
997 2658 21743 -35219 25761 1155 -28074 36708 -22214 -4103 23652 -23692 7414 10720
1009 10720 -15028 3400 14149 -20958 9193 14261 -32401 29869 -7082 -22278 37865 -29925
1021 -29925 4727 20639 -28507 16936 3562 -15875 10855 5631 -17724 13980 5514 -26314
1033 -26314 31538 -15205 -13835 35615 -35618 13677 14470 -30198 24872 -4995 -13814 16428 -3466
$$ packed form
947B7565m8546K1620J8543m4380L9003q621k2147L0425j2387j5244K7758j2931
959F58j8399M1420l5126J14M0285n7383L7617O665m4796N1773k5601j2700L4766
972A9293k6212k355K4624k0666p458L6572m1048J2406L2332o1190N1782q598l9665
985c0183O1754m4226J403L4348l9651J5087J6075k6305O834K5567m1701K3656
997B658J9085n6962O0980k4606k9229O4782n8922J8111K7755m7344L1106L306
1009A0720k5748J8428J0749l5107L0151N068m6662O2270l6951j5196O0143o7790
1021b9925L4652J5912m9146M5443j3374j9437K6730n224k3355L1704q466l1828
1033b6314N7852m6743J370M9450p1233M9295P93m4668N5070k9867q819L0242j9894
$$ plain form
1046 -3466 -12314 16157 -2939 -17638 29234 -20392 -4478 29490 -36476 20771 6659 -28142
1058 -28142 29424 -12366 -8914 18564 -11267 -4783 14630 -8960 -8493 23219 -21946 3291 20694
1071 20694 -33579 25012 -1138 -22796 30719 -18687 -2682 18034 -17016 3062 10909 -12418
1083 -12418 520 15497 -21150 9953 11323 -27922 27126 -8433 -15418 28541 -23194 4158
1095 4158 14586 -19716 9896 5700 -13181 6873 7278 -17307 13307 2722 -19986 24916 -13108
1108 -13108 -7697 23759 -23934 8943 9730 -18825 14059 -67 -11121 10484 -111 -11416
1120 -11416 13453 -3626 -11279 19963 -14982 -806 16955 -21809 12615 3787 -16189 15904
1132 15904 -5046 -7613 11913 -5664 -5677 11853 -7943 -4184 14269 -14723 4276 9757 -17426
$$ packed form
1046c466q848K8471j9096j4699M6872m9626J5914L3968o5966N7247j4112l4801
1058b8142N7566m1790L452K7478k9831O484J9413k3590M67L1712m5165K5237J7403
1071B0694n4273N8591k6150k1658N3515m9406J6005K0716l5050K0078P847k3327
1083a2418J2938J4977l6647L1103J370l9245N5048l5559o985M3959n1735K7352
1095D158J0428l4302K9612m196j8881K0054M05k4585L0614j0585k2708M4902l8024
1108a3108N411L1456m7693L2877P87k8555L2884j4126j1054K1605j0595j1305
1120a1416K4869j7079p653L1242l4945J4176J7761l8764L4424q828j9976L2093
1132A5904k0950k567J9526j7577j3J7530j9796L759J8453k8992J8999N481k7183
$$ plain form
1145 -17426 13714 -965 -11476 14721 -7793 -3644 10556 -8398 -287 8338 -9027 1596
1157 1596 8208 -12196 6654 3734 -12143 12337 -4319 -6676 12071 -8869 -148 7708 -8874
1170 -8874 3000 4469 -8147 4587 2638 -8526 7451 -491 -7320 9784 -5647 -2574 8591
1183 8591 -8235 2416 4163 -7603 4655 1296 -5365 5468 -471 -4687 6416 -2736 -3020 6691
1197 6691 -5809 712 4796 -6632 3593 1502 -5249 4998 -725 -3427 4650 -2464 -2029 4512
1211 4512 -3281 -423 3588 -4503 1785 1912 -4280 3427 -84 -3015 3547 -1627 -1608 3500 -2644 -15
1227 -15 2355 -2814 1126 1419 -2975 2108 174 -2228 2484 -988 -1001 2328 -1803 31 1741 -1918
1243 -1918 967 839 -1800 1094 214 -1380 1614 -670 -857 1603 -1400 165 1230 -1489 623 892
$$ packed form
1145a7426L1140j4679j0511K6197k2514M149J4200j8954Q111Q625j7365J0623
1157A596O612k0404J8850k920j5877K4480j6656k357J8747k0940Q721P856j6582
1170h874J1874J469j2616J2734j949j1164J5977p942o829J7104j5431L073J1165
1183H591j6826J0651J747j1766J2258l359o661J0833n939m216J1103r152k84R711
1197F691j2500O521M084j1428J0225k091o751J0247n723k702Q077p114M35O541
1211D512p793K858M011q091O288J27o192P707l511k931O562n174J9N108o144K629
1227a5K370n169L940K93m394N083j934k402M712l472j3L329m131J834J710l659
1243a918K885j28k639K894q80j594K994k284j87K460l003J565J065k719K112K69
$$ plain form
1259 892 -1141 622 -85 -994 919 -430 -648 1048 -883 -407 841 -1211 243 413 -1043 643
1275 643 217 -846 1019 -291 -894 1132 -586 -333 852 -793 117 638 -983 464 407 -1328 714
1292 714 307 -994 1023 -370 -653 1212 -800 -211 1367 -1062 312 1102 -1372 547 489 -1613 1464
1309 1464 -100 -1034 1699 -645 -380 1708 -1445 -189 1521 -1815 567 1142 -2051 1551 376 -1982
1325 -1982 2469 -953 -1599 2873 -1939 -248 2426 -2758 658 2037 -3148 2085 911 -3344 2776
1340 2776 -841 -2413 3809 -2508 -736 3516 -3360 909 2546 -4331 2248 1381 -4328 3652 -279
1355 -279 -3713 4872 -2392 -2120 5336 -4883 580 3932 -5443 2891 1653 -4935 4140 57 -4334
1370 -4334 5130 -1781 -3686 6490 -4986 -607 6441 -7440 3369 2791 -7181 5850 -451 -5106
$$ packed form
1259H92k033J763p07r09J913j349k18J696j931M76J248k052J454J70j456J686
1275F43m26j063J865j310o03K026j718K53J185j645R10N21j621J447n7j735K042
1292G14m07j301K017j393k83J865k012N89J578k429J374P90k474J919n8k102L077
1309A464j564r34K733k344K65K088l153J256J710l336K382N75l193L602j175k358
1325a982M451l422o46M472m812J691K674n184L416J379n185N233j174m255O120
1340B776l617j572O222o317J772M252o876M269J637o877O579q67n709P980l931
1355b79l434Q585p264K72P456j0219N463L352r375Q334j238o588R075m083m391
1370d334R464o911j905J0176j1476M379P048j3881J0809n78r972J3031o301m655
$$ plain form
1384 -5106 6083 -2521 -3592 6506 -4168 -2421 7739 -7811 1555 6228 -10145 6987 918
1397 918 -8068 9393 -3776 -3658 7969 -5238 -1446 6923 -6649 251 7500 -10059 4953 4749
1411 4749 -11844 10858 -2582 -7442 12125 -8552 -940 8420 -8637 2236 5584 -8210 2960
1424 2960 5772 -10825 7770 2074 -11893 14276 -6766 -5418 13670 -12826 3586 7181 -11222
1437 -11222 6419 2841 -8599 6071 2878 -10494 10685 -1403 -10443 16157 -11610 -1388
1449 -1388 13983 -16906 9129 4038 -12696 11394 -1925 -7133 8914 -1625 -7975 11882 -5133
1462 -5133 -7366 16615 -15001 2810 11998 -19197 14199 -477 -12187 15066 -7230 -4278 9842
1475 9842 -5840 -4204 10900 -7855 -3128 14700 -17130 7369 8415 -19659 18531 -5719 -9772
$$ packed form
1384e106J1189q604j071J0098j0674J747J0160j5550R366M673j6373J7132o069
1397I18q986J7461j3169J18J1627j3207L792Q369j3572O900P249j7559J5012k04
1411D749j6593K2702j3440m860J9567k0677P612R360j7057J0873L348j3794J1170
1424B960K812j6597J8595n696j3967K6169k1042J348J9088k6496J6412L595j8403
1437a1222J7641l578j1440J4670l193j3372K1179j2088r040K6600k7767J0222
1449a388J5371l0889K6035n091j6734K4090j3319n208J6047j0539o350J9857j7015
1462e133k233K3981l1616J7811R188l1195L3396j4676j1710K7253k2296K952J4120
1475I842j5682J636J5104j8755M727J7828l1830K4499J046k8074L8190k4250m053
$$ plain form
1488 -9772 16956 -12760 304 9098 -9323 955 8316 -9895 1191 11027 -17305 11637 3720
1501 3720 -17941 21151 -11130 -5586 17406 -17067 5963 7047 -11574 6248 4094 -10153 5450
1514 5450 5952 -15015 13923 -1283 -13669 21425 -15002 -1093 15308 -19581 10798 3213 -12140
1527 -12140 10114 -655 -8121 8043 861 -11101 14118 -5637 -9123 19424 -17478 4405
1539 4405 11988 -19536 14720 -1240 -10547 13264 -5657 -4639 9176 -3953 -6278 12460 -8835
1552 -8835 -3318 15417 -17764 8616 7146 -17978 17198 -5756 -7889 14194 -9924 -804 8363
1565 8363 -6953 -967 9425 -9893 1245 10440 -16341 11067 2153 -14529 17319 -9126 -4099
$$ packed form
1488i772K6728k9716J3064Q794j8421J0278P361j8211J1086R836k8332K8942p917
1501C720k1661L9092l2281N544K2992l4473K3030J084j8621J7822k154j4247J5603
1514E450N02k0967K8938j5206j2386L5094l6427J3909J6401l4889L0379p585j5353
1527a2140K2254j0769p466J6164p182j1962K5219j9755l486K8547l6902K1883
1539D405P583l1524L4256j5960r307K3811j8921J018J3815j3129k325J8738k1295
1552h835N517J8735l3181K6380j470k5124L5176k2954k133K2083k4118R120R167
1565H363j5316N986J0392j9318J1138R195k6781K7408q914j6682L1848k6445N027
$$ [...]
8191a3
##END NTUPLES=NMR FID
##END=
