##TITLE=1H_Pr NCO
 CDCl3
 8 sc, 
 19.09.2022
##JCAMPDX= 6.0         $$ Bruker NMR JCAMP-DX V2.0
##DATA TYPE= NMR FID
##DATA CLASS= NTUPLES
##ORIGIN= UXNMR, Bruker Analytische Messtechnik GmbH
##OWNER= root
$$ XWIN-NMR		Version 3.5
$$ Mon Sep 19 14:17:37 2022 Russian Standard Time (UT+4h)  she@DPX200
##.OBSERVE FREQUENCY= 200.1313499994
##.OBSERVE NUCLEUS= ^1H
##.DELAY= (6, 6)
##.ACQUISITION MODE= SIMULTANEOUS
##.ACQUISITION SCHEME= undefined
##.AVERAGES= 8
##.DIGITISER RES= 18
##SPECTROMETER/DATA SYSTEM= spect
##.PULSE SEQUENCE= zg30
##.SOLVENT NAME= CDCl3
##.SHIFT REFERENCE= (INTERNAL, CDCl3, 0, 15.7039)
##AUDIT TRAIL= $$ (NUMBER, WHEN, WHO, WHERE, WHAT)
$$ ##TITLE= Audit trail, XWIN-NMR		Version 3.5
$$ ##JCAMPDX= 5.01
$$ ##ORIGIN= Bruker BioSpin GmbH
$$ ##OWNER= she
$$ F:/spectra/data/she/nmr/H-F/1/audita.txt
$$ ##AUDIT TRAIL=  $$ (NUMBER, WHEN, WHO, WHERE, WHAT)
(   1,<2022-09-19 14:16:36.23 +0400>,<she>,<DPX200>,
      <created by zg, POWCHK disabled, PULCHK disabled
       configuration hash MD5:
       00 E9 B6 7A A2 85 ED C7 34 08 36 98 17 FE 4E 26
       data hash MD5: 16K
       66 1F 55 AB C1 4F 0A C1 0C 3F 91 10 4F B1 31 6F>)
$$ ##END=
$$ 
$$ hash MD5
$$ 5A CD D6 98 38 EB 31 EE 4E EF A3 4A 21 B8 BF 0B
##$RELAX= 
##$RELAX= 
##$RELAX= 
##$RELAX= 
##$RELAX= 
##$RELAX= 
$$ Bruker specific parameters
$$ --------------------------
##$DU= <F:/spectra>
##$EXPNO= 1
##$NAME= <H-F>
##$PROCNO= 1
##$TYPE= <nmr>
##$USER= <she>
##$AMP= (0..31)
100 100 100 100 100 100 100 100 100 100 100 100 100 100 100 100 100 100 
100 100 100 100 100 100 100 100 100 100 100 100 100 100 
##$AQSEQ= 0
##$AQ_mod= 1
##$AUNM= <au_zg>
##$AUTOPOS= <>
##$BF1= 200.13
##$BF2= 200.13
##$BF3= 200.13
##$BF4= 200.13
##$BF5= 200.13
##$BF6= 200.13
##$BF7= 200.13
##$BF8= 200.13
##$BYTORDA= 1
##$CFDGTYP= 0
##$CFRGTYP= 5
##$CHEMSTR= <none>
##$CNST= (0..31)
1 1 145 1 1 1 1 1 1 1 1 1 1 1 1 1 1 1 1 1 1 1 1 1 1 1 1 1 1 1 1 1 
##$CPDPRG= <>
##$CPDPRG1= <>
##$CPDPRG2= <>
##$CPDPRG3= <>
##$CPDPRG4= <mlev>
##$CPDPRG5= <mlev>
##$CPDPRG6= <mlev>
##$CPDPRG7= <mlev>
##$CPDPRG8= <mlev>
##$CPDPRGB= <>
##$CPDPRGT= <>
##$D= (0..31)
0 1.2 0 0 0 0 0 0 0 0.06 0 0.03 0 0 0 0 0.0002 0 0 0 0 0 0 0 0 0 0 0 0 
0 0 0 
##$DATE= 1663582595
##$DBL= (0..7)
120 120 120 120 120 120 120 120 
##$DBP= (0..7)
150 150 150 150 150 150 150 150 
##$DBP07= 0
##$DBPNAM0= <>
##$DBPNAM1= <>
##$DBPNAM2= <>
##$DBPNAM3= <>
##$DBPNAM4= <>
##$DBPNAM5= <>
##$DBPNAM6= <>
##$DBPNAM7= <>
##$DBPOAL= (0..7)
0.5 0.5 0.5 0.5 0.5 0.5 0.5 0.5 
##$DBPOFFS= (0..7)
0 0 0 0 0 0 0 0 
##$DE= 6
##$DECBNUC= <off>
##$DECIM= 32
##$DECNUC= <off>
##$DECSTAT= 4
##$DIGMOD= 1
##$DIGTYP= 9
##$DL= (0..7)
0 120 120 120 120 120 120 120 
##$DP= (0..7)
150 150 150 150 150 150 150 150 
##$DP07= 0
##$DPNAME0= <>
##$DPNAME1= <>
##$DPNAME2= <>
##$DPNAME3= <>
##$DPNAME4= <>
##$DPNAME5= <>
##$DPNAME6= <>
##$DPNAME7= <>
##$DPOAL= (0..7)
0.5 0.5 0.5 0.5 0.5 0.5 0.5 0.5 
##$DPOFFS= (0..7)
0 0 0 0 0 0 0 0 
##$DQDMODE= 0
##$DR= 18
##$DS= 0
##$DSLIST= <SSSSSSSSSSSSSSS>
$$ [...]
##$SUBNAM2= <"">
##$SUBNAM3= <"">
##$SUBNAM4= <"">
##$SUBNAM5= <"">
##$SUBNAM6= <"">
##$SUBNAM7= <"">
##$SUBNAM8= <"">
##$SUBNAM9= <"">
##$SW= 18.0517283424941
##$SWIBOX= (0..15)
0 0 2 0 0 0 0 0 0 0 0 0 0 0 0 0 
##$SW_h= 3612.71676300578
##$TD= 16384
##$TD0= 1
##$TE= 0
##$TE2= 300
##$TE3= 300
##$TEG= 300
##$TL= (0..7)
0 120 120 120 120 120 120 120 
##$TP= (0..7)
150 150 150 150 150 150 150 150 
##$TP07= 0
##$TPNAME0= <>
##$TPNAME1= <>
##$TPNAME2= <>
##$TPNAME3= <>
##$TPNAME4= <>
##$TPNAME5= <>
##$TPNAME6= <>
##$TPNAME7= <>
##$TPOAL= (0..7)
0.5 0.5 0.5 0.5 0.5 0.5 0.5 0.5 
##$TPOFFS= (0..7)
0 0 0 0 0 0 0 0 
##$TUNHIN= 0
##$TUNHOUT= 0
##$TUNXOUT= 0
##$USERA1= <user>
##$USERA2= <user>
##$USERA3= <user>
##$USERA4= <user>
##$USERA5= <user>
##$V9= 5
##$VALIST= <valist>
##$VCLIST= <CCCCCCCCCCCCCCC>
##$VD= 0
##$VDLIST= <DDDDDDDDDDDDDDD>
##$VPLIST= <PPPPPPPPPPPPPPP>
##$VTLIST= <TTTTTTTTTTTTTTT>
##$WBST= 1024
##$WBSW= 4
##$XGAIN= (0..3)
0 0 0 0 
##$XL= 0
##$YL= 0
##$YMAX_a= 450965
##$YMIN_a= -697607
##$ZGOPTNS= <>
##$ZL1= 120
##$ZL2= 120
##$ZL3= 120
##$ZL4= 120
##$ABSF1= 10
##$ABSF2= 0
##$ABSG= 5
##$ABSL= 3
##$ALPHA= 0
##$AQORDER= 0
##$ASSFAC= 0
##$ASSFACI= 0
##$ASSFACX= 0
##$ASSWID= 0
##$AUNMP= <proc_1d>
##$AZFE= 0.1
##$AZFW= 0.1
##$BCFW= 1
##$BC_mod= 2
##$BYTORDP= 1
##$COROFFS= 0
##$CY= 11.3945322036743
##$DATMOD= 1
##$DC= 2
##$DFILT= <>
##$DTYPP= 0
##$F1P= 2.36226072786647
##$F2P= -0.459571619588291
##$FCOR= 0.5
##$FTSIZE= 0
##$FT_mod= 4
##$GAMMA= 1
##$GB= 0.15
##$INTBC= 1
##$INTSCL= 1
##$ISEN= 128
##$LB= 0.24
##$LEV0= 0
##$LPBIN= 0
##$MAXI= 10000
##$MC2= 0
##$MEAN= 0
##$ME_mod= 0
##$MI= 1.114404
##$NCOEF= 0
##$NC_proc= 0
##$NLEV= 6
##$NOISF1= 3.799351
##$NOISF2= 2.8
##$NSP= 1
##$NTH_PI= 0
##$NZP= 0
##$OFFSET= 15.70392
##$PC= 1
##$PHC0= -18036.65
##$PHC1= 12.00069
##$PH_mod= 1
##$PKNL= yes
##$PPARMOD= 0
##$PSCAL= 0
##$PSIGN= 0
##$REVERSE= no
##$SF= 200.130013532006
##$SI= 16384
##$SIGF1= 3
##$SIGF2= 2
##$SINO= 400
##$SIOLD= 16384
##$SREGLST= <1H.CDCl3>
##$SSB= 0
##$STSI= 0
##$STSR= 0
##$SW_p= 3612.71676300578
##$SYMM= 0
##$S_DEV= 0
##$TDeff= 0
##$TDoff= 0
##$TI= <>
##$TILT= no
##$TM1= 0
##$TM2= 0
##$TOPLEV= 0
##$USERP1= <user>
##$USERP2= <user>
##$USERP3= <user>
##$USERP4= <user>
##$USERP5= <user>
##$WDW= 1
##$XDIM= 8192
##$YMAX_p= 0
##$YMIN_p= 0
$$ End of Bruker specific parameters
$$ ---------------------------------
##NTUPLES= NMR FID
##VAR_NAME=  TIME,          FID/REAL,        FID/IMAG
##SYMBOL=    X,             R,               I
##VAR_TYPE=  INDEPENDENT,   DEPENDENT,       DEPENDENT
##VAR_FORM=  AFFN,          ASDF,            ASDF
##VAR_DIM=   8192,          8192,            8192
##UNITS=     SECONDS,       ARBITRARY UNITS, ARBITRARY UNITS
##FACTOR=    0.0002768,     1,               1
##FIRST=     0,             0,               0
##LAST=      2.2672688,     0,               0
##MIN=       0,             -697607,         0
##MAX=       2.2672688,     450965,          0
$$ Real data points
##PAGE= N=1
##DATA TABLE= (X++(R..R)), XYDATA
0@%%%%%%%Qj6J6j6J6k4M0m8N6p2Q8j12J36j60J92k32K79l27L78m39N12n94O85
$$ 0 0 0 0 0 0 0 0 8 -8 8 -8 8 -16 24 -24 32 -40 48 -64 72 -88 104 -128 151 -176 202 -237 275 -319 366
30C66p81Q90j017J157j308J473j656J859k083K328k593K883l204L554l935M350
$$ 366 -415 475 -542 615 -693 780 -876 983 -1100 1228 -1365 1518 -1686 1868 -2067 2283
46B283m802N300n844O438p092P811q607R491j0477J1583j2831J4256j5903J7823
$$ 2283 -2519 2781 -3063 3375 -3717 4094 -4513 4978 -5499 6084 -6747 7509 -8394 9429
60I429k0094K2837k6232L0554l6267M4216n6119P6113j17962L54769n33992l13244
$$ 9429 -10665 12172 -14060 16494 -19773 24443 -31676 44437 -73525 281244 -252748 -565992
72e65992R61304l62341l21918N87841j36922o28015O15506K51329p37092J11200
$$ -565992 395312 32971 -288947 298894 161972 -466043 149463 400792 -336300 -225100
82b25100N62085m55260m7421N69635m08137m66237O46994M9673n70812M21253
$$ -225100 336985 -118275 -165696 403939 -4198 -470435 176559 226232 -344580 76673
92G6673L22746p19510O1460O62754m12826l39500O07846j16213n15193N13082
$$ 76673 399419 -320091 -258631 404123 -8703 -348203 259643 143430 -371763 141319
102A41319K15364p06295J48940N83762m12295k01805N00871k65703l93592N76868
$$ 141319 356683 -349612 -200672 383090 -29205 -231010 269861 4158 -389434 187434
112A87434J40803n96707J67580L35843l94320M9848M14377l96436k11571N67601
$$ 187434 328237 -268470 -100890 234953 -159367 -109519 304858 -91578 -303149 264452
122B64452r9995m88272L64832J76988m86839K22253M35723m93361k01895N27716
$$ 264452 164457 -323815 41017 218005 -268834 -46581 389142 -104219 -306114 221602
132B21602j38272l60752M16392R1325m80617J93647L22180l89036n4285L89353
$$ 221602 83330 -277422 138970 230295 -250322 -56675 265505 -123531 -177816 211537
142B11537k06905j92054L75870q1048l77589K84428J82445l60312J08525K98495
$$ 211537 4632 -187422 188448 107400 -270189 14239 196684 -163628 -55103 243392
152B43392l34602j13657L91144j33691k82278L27481P1452l62038J69859K39756
$$ 243392 -91210 -204867 186277 52586 -229692 97789 169241 -192797 -22938 216818
162B16818l40431l3840L54495j66820k04068K93442k3406k91970K15234J58005
$$ 216818 -123613 -157453 197042 30222 -173846 119596 96190 -195780 19454 177459
172A77459k96404M7070K45827k21107r2540K79724j00372k08856K42172M3350
$$ 177459 -118945 -71875 173952 -47155 -139695 140029 39657 -169199 72973 116323
182A16323k71835J39497J78051k62834j2355K74956j46878j66932K35044q106
$$ 116323 -155512 -16015 162036 -100798 -113153 161803 14925 -152007 83037 74931
192G4931k23083J69457J22421k41161K5719K02864j55877q1704K09706o1912j63826
$$ 74931 -148152 21305 143726 -97435 -71716 131148 -24729 -106433 103273 41361 -122465
203a22465J71187M8144k00534P9439J36368j67843j5773J80378j04782j13320
$$ -122465 48722 96866 -103668 -24229 112139 -55704 -71477 108901 4119 -109201
213a09201J67092o179j55657J21082Q0984j77652K6626J54755j19249o9931J57184
$$ -109201 57891 51712 -103945 17137 98121 -79531 -52905 101850 -17399 -87330 69854
224F9854l6404j24421J22902M2489j49671M8440J09943j08657k1093J18502p0478
$$ 69854 33450 -90971 31931 74420 -75251 -26811 83132 -25525 -46618 71884 1406
235A406p5601J23085P24j19805P0009O2146j06713J7988R2503q7436l9753J13397
$$ 1406 -74195 48890 49614 -70191 -182 61964 -44749 -26761 65742 -21694 -61447 51950
247E1950k7273q8940Q0142K7866r7127L8851P2726q1859j8332Q7095l9085n3796
$$ 51950 24677 -64263 15879 43745 -53382 -14531 58195 -23664 -41996 45099 6014 -47782
259d7782P4919M156p3189M3354L9816o6400R671N8554n2000k5696O8252j6790
$$ -47782 27137 31293 -41896 1458 41274 -25126 -15455 43099 -8901 -34597 33655 16865
271A6865n4040M7204J6434n5642K3966L7657n1554m956N5237k9568l6018M8138
$$ 16865 -37175 10029 26463 -29179 -5213 32444 -19110 -24066 31171 1603 -34415 13723
283A3723M176m4868K6066K3457m1781O925L8176k9136j7718L8224p199k8534K6630
$$ 13723 17899 -26969 -903 22554 -19227 -12302 25874 -3262 -20980 17244 10045 -18489 8141
296H141R282l1584J1822K1029k5587k589K5886j6036j5296K3887j154k2184J5941
$$ 8141 17423 -14161 -2339 18690 -6897 -9486 16400 364 -14932 8955 7801 -14383 1558
309A558J0671k3362J880K0051j1495j0657J4430j621j0432J0415L733j1232L572
$$ 1558 12229 -11133 -9253 10798 -697 -11354 3076 1455 -8977 1438 5171 -6061 -2489
322b489Q797o561k864P487r73m169K334L00r82K428p64k760k25J609Q77r67l147
$$ -2489 6308 -253 -3117 4370 3397 -772 1562 1862 880 3308 2544 -216 -441 1168 2045 1078 -2069
339b069J699K104n317K80O779m884o420Q676R34r209P342N661j2924K267J4909
$$ -2069 -370 1734 -3583 -3303 3476 -1408 -7828 848 1782 -7427 -85 5576 -7348 -5081 9828
354I828j0137q295J6722k445j5646J3743P573j9276N793J6820j8791o193K3968
$$ 9828 -309 -8604 8118 5673 -9973 3770 11343 -7933 -2140 14680 -4111 -10304 13664
367A3664r062j8709K1149K913k5313J4807J6923k8183m84K8188j8137j6616L0268
$$ 13664 4602 -14107 7042 9955 -15358 -551 16372 -11811 -12295 15893 -2244 -18860 11408
380A1408l372k9852K3989J5782l4550Q365L1924k9686j3798L9086j0045l0423
$$ 11408 8036 -21816 2173 17955 -16595 -8230 23694 -5992 -19790 19296 9251 -21172
392b1172L2159P336m0359J9626L0629l9079n927M2018k3745k7104M2954j655m4016
$$ -21172 10987 18323 -22036 -2410 28219 -10860 -16787 25231 1486 -25618 17336 15681 -28335
405b8335K9459K3668m6278P870M3255l9054k1313N4022j0086m3855L8247J4548
$$ -28335 1124 24792 -21486 -13616 29639 -9415 -30728 23294 13208 -30647 7600 22148
417B2148n0575K2418M1256m9581j0599N5381k4208l6908N0321J152n3853L6609
$$ 22148 -28427 -6009 35247 -14334 -24933 30448 6240 -30668 19653 20805 -33048 3561
429C561L4587n9849K74N5694l7343k7614N8723j2862n5586M6477K5450o0501J6935
$$ 3561 38148 -21701 -21427 34267 -3076 -30690 28033 15171 -40415 6062 31512 -28989 -12054
442a2054M7348n3309j3012O8098k7637n3200N6713J4129o0314L5395M0165p1004
$$ -12054 35294 -18015 -31027 37071 9434 -43766 12947 27076 -33238 2157 42322 -28682
454b8682m447P5130l1088m3215N4322q050n5149N5918L0399p9109R334O6871m7186
$$ -28682 -33129 42001 10913 -32302 22020 13970 -41179 14739 45138 -33971 -24637 42234 -4952
467d952k5593O5495k9985n9348P0942L0034p8934J3499N0279n3916j929P1691
$$ -4952 -30545 34950 4965 -54383 16559 46593 -32341 -18842 31437 -22479 -24408 47283
479D7283m3855n5947P0598J4288o6023L4882L2909o9994J6590P8124n6695n2662
$$ 47283 3428 -52519 18079 32367 -33656 1226 34135 -35859 -19269 58855 2160 -50502
491e0502P1952J476n8594N1951K5424q1836J3306P2310m5879k8080N7506l0814
$$ -50502 21450 22926 -35668 16283 41707 -40129 -26823 45487 -392 -28472 29034 -1780
503a780m6702P6625J5471q9207K2470O1521n2319m877O3367n4543n2520Q9553
$$ -1780 -48482 28143 43614 -45593 -23123 38398 -13921 -18798 44569 -9974 -62494 27059
515B7059K4112q1113J5638L7345n1456J9549O5048o1324m5269P6577J268o1288
$$ 27059 51171 -29942 -14304 23041 -28415 -8866 56182 -5142 -50411 26166 27434 -33854
527c3854M3606J9506p1701K9831P2486o2860m3911O3281q386m0861N8829Q778
$$ -33854 9752 29258 -42443 -12612 59874 -2986 -46897 16384 7998 -32863 25966 34744
539C4744p8234K3998N6830n0005j0511N5677l8036l4916P4661N55q1089L0523
$$ 34744 -43490 -19492 37338 -12667 -23178 32499 -5537 -40453 34208 34763 -46326 -15803
551a5803N2209m8824J315N4232m9898m0813O8998R001n5908K8720K0120n3965
$$ -15803 36406 -12418 -11103 43129 -6769 -47582 21416 30417 -25491 3229 23349 -30616
563c0616K2378N3569n6179k9693O4715r214m6376M6915R244o8624K8430O3522
$$ -30616 -8238 45331 -10848 -40541 24174 14960 -31416 15499 24743 -43881 -15451 48071
575D8071n0479l0168M9610j6775l0383N7222L115o6937K6409M4938m9182n810
$$ 48071 -2408 -32576 17034 259 -30124 27098 30213 -36724 -10315 34623 -14559 -20369
587b0369N2689l0655l1129N5415l930n8963L2712L3834m8532P548M9354m0208
$$ -20369 32320 1665 -29464 25951 22021 -36942 -4230 29604 -18928 -11380 37974 -2234
599b234l2253M7049o106l5063M5886J2833o1881J5569M9518m3531k0649N4335
$$ -2234 -34487 12562 6456 -28607 17279 30112 -31769 -16200 33318 -10213 -30862 23473
611B3473j2688l7414M5090Q320o2190J8479M8489l4197r843M0259k9952l0520
$$ 23473 10785 -26629 18461 26781 -35409 -16930 31559 -2638 -12481 27778 -2174 -32694
623c2694N2149L133n2684K8472L2052m7405K563M5299l8889k7593N6884j181m8981
$$ -32694 19455 22588 -30096 -1624 30428 -16977 -14414 30885 -8004 -35597 21287 20106 -28875
636b8875L1751K0760n0951J2276M8871l6947k2817M4711j3842l3606M5846J0219
$$ -28875 2876 23636 -27315 -15039 33832 -3115 -25932 18779 4937 -28669 17177 27396
648B7396n7644J8253M4983l7903j4196M1623k1135k8008M7515L375n2871J9810
$$ 27396 -30248 -11995 32988 -4915 -19111 22512 1377 -26631 20884 24259 -28612 -8802
660h802L1336l5744N164L8037l8228k5377N3363k069m6822K9014K2520m1595J1619
$$ -8802 22534 -13210 -8046 29991 -8237 -33614 19749 17680 -29142 -128 22392 -19203 -7584
673g584L8004m1456k0174N0890m854l5282L1333O362m4014K1516L6039l8944r868
$$ -7584 30420 -11036 -31210 19680 14826 -20456 10877 17239 -26775 -5259 30780 -8164 -18032
686a8032M0607j9942k4265M0499l724m6200K8578L1057l8941j768L2610l0109
$$ -18032 22575 2633 -21632 18867 15143 -31057 -2479 28578 -10363 -12131 20479 -9630
698i630j6175M7191o857m1166K6911J8747l6056J0428K9819l4194j0361M2606
$$ -9630 -25805 21386 14529 -26637 274 19021 -17035 -6607 23212 -10982 -21343 21263
710B1263j1635l0699K8898N665l3308K1128K4073l6905l576L5112j8552j9422
$$ 21263 9628 -21071 7827 13492 -19816 1312 25385 -11520 -15096 20016 1464 -17958
722a7958L2510m761l1892K5120J7320l4937L903K8498k3789r841L2197j2387k6999
$$ -17958 14552 9791 -22101 3019 20339 -14598 -10695 17803 -5986 -15827 16370 3983 -23016
735b3016K7743J0582l0209J1579J9964k7134j828L0248j5326j9109K5697M11k3923
$$ -23016 4727 15309 -14900 -3321 16643 -10491 -12319 17929 2603 -16506 9191 9602 -14321
748a4321J8843J1723k9136N078K5944j9604j1062K4544q076k0070K2040O612k6221
$$ -14321 4522 16245 -12891 -7813 18131 -1473 -12535 12009 3933 -16137 5903 12515 -13706
761a3706R287J8364k1157l927K3305j1651j4713K0741O45j9914J3533J0475j9951
$$ -13706 -4419 13945 -7212 -11139 12166 515 -14198 6543 7188 -12726 807 11282 -8669
774h669L419J7505j4376o888J9782o744j5249J6618M590j9338P928J3341j6775
$$ -8669 -5250 12255 -2121 -9009 10773 4029 -11220 5398 9988 -9350 -1422 11919 -4856
787d856k596J7528q925j1017J5224O0j5643R890Q310j4971K380J2084j0674m788
$$ -4856 -7452 10076 1151 -9866 5358 5418 -10225 -335 7975 -6996 -4616 7468 -3206 -7994
801g994J4867m408j1631J1873L611j3256N768R681j1832j564J2565o243p280J1326
$$ -7994 6873 2465 -9166 2707 6318 -6938 -1170 8511 -3321 -4885 7680 1437 -5843 5483
815E483n98j0800O723N588r959J193Q315p555l962R676k114p851O289K558p957
$$ 5483 4885 -5915 808 6396 -3563 -2370 5945 -1610 -5572 4104 1990 -5861 428 2986 -4971
830d971L267N560o377j589O931l040l874O110Q64n964L006L409m424P49M147l376
$$ -4971 -1704 3856 -2521 -4110 2821 -219 -4093 2017 2881 -3083 -77 3332 -1092 -343 3804 428
846D28k652M637k51l286K069Q97k914L3K812j065k331J126Q0j154J060N30j099
$$ 428 -2224 2413 2162 -1124 945 1842 -1072 -1039 1773 708 -1623 -497 -417 -1571 -511 19 -1080
863a080o63J516K38j297N80J869j175j344K016L80j793J610J777l678n9N001j738
$$ -1080 -1743 -227 11 -1286 -706 1163 -12 -1356 660 1040 -753 857 2634 -1044 -1103 3898 2160
880B160m468L477J433m599K104L191m962r02N334l305m070O652K35o949L712L686
$$ 2160 -2308 1169 2602 -1997 107 3298 -1664 -2566 2768 -537 -4607 2045 2280 -4669 -957 2729
896B729o925K078P742p866m215J0281r76p872O927K654j0085N371Q560j0428l395
$$ 2729 -4196 -2118 5624 -2242 -6457 3824 2848 -5024 1903 4557 -5528 -157 8403 -2025 -5420
911e420J2000m513p696J0719K42j3345P610Q529j2433k74J1939r313o355J4265
$$ -5420 6580 2067 -5629 5090 5332 -8013 -403 8126 -4307 -4581 7358 -1955 -8310 5955
925E955l247j3215J1653O482j5285N158J1815j5078k948J9468p432j4466J5890
$$ 5955 2708 -10507 1146 7628 -7657 -2499 9316 -5762 -8710 10758 3326 -11140 4750
938D750L122j7578R514J2563j8345j485J9399j0460j1114J7192l166j7002J6178
$$ 4750 7872 -9706 -192 12371 -5974 -7459 11940 1480 -9634 7558 4392 -12610 3568
951C568J0219k3104J919J7443j4827m752K2465r463k0446J9964P790k1546Q084
$$ 3568 13787 -9317 -7398 10045 -4782 -9534 12931 3468 -16978 2986 10776 -10770 -2686
964b686J4296k0011J73K4690j5150j7901K3384K921k1698J5944J1778k8045K417
$$ -2686 11610 -8401 -8228 16462 1312 -16589 6795 9716 -11982 3962 15740 -12305 -9888
977i888K6594j5947j3319K3674n838k0753K0810P582k7511R043K1555k1681n389
$$ -9888 16706 759 -12560 11114 5276 -15477 5333 12915 -14596 -5553 16002 -5679 -11068
990a1068K5181j5293j8991K9190N379k9297J1977J7545k5480O65K8164j7313j7215
$$ -11068 14113 -1180 -20171 9019 14398 -14899 -2922 14623 -10857 -10192 17972 659 -16556
1003a6556K7566r79k4793J8349J0515k8534Q621K7148k2946j4194K6967q113j9612
$$ -16556 11010 10031 -14762 3587 14102 -14432 -5811 21337 -1609 -15803 11164 3051 -16561
1016a6561K6068O132l2110R602K2056k3104k654K6267j6975j6831L0242k18l1008
$$ -16561 9507 15639 -16471 -6869 15187 -7917 -10571 15696 -1279 -18110 12132 11914 -19094
1029a9094J7167J7382k6897N043K7791k3740j6647K9868k863k2508K1664Q179
$$ -19094 -1927 15455 -11442 -6399 21392 -2348 -18995 10873 8010 -14498 7166 15345
1041A5345l0260J0047K2624k4402o227K8547j3205j9044K8102K6l2627J6346K2215
$$ 15345 -14915 -4868 17756 -6646 -12873 15674 2469 -16575 11527 11553 -21074 -4728 17487
1054A7487k4892p39K4815k0976j5580L1239q01k7290J8729J2489k7023P827K3264
$$ 17487 -7405 -8144 16671 -4305 -19885 11354 10553 -16737 1992 14481 -12542 -4715 18549
1067A8549k5920r583L3331o272k4828J9849M939k7206J5607K3157k6846p948K5585
$$ 18549 -7371 -16954 16377 10105 -14723 5126 10065 -17141 -1534 21623 -5223 -13171 12414
1080A2414j2675j4771K6940k993k7993K0067J7376k9698L37K4594j8839r126L1760
$$ 12414 -261 -15032 11908 8915 -19078 989 18365 -11333 -10996 13598 -5241 -14367 17393
1093A7393p451l0221J8873J3779k3181R653J9653k5402p286K9302j0529k1110
$$ 17393 9942 -20279 -1406 12373 -10808 -1155 18498 -6904 -14190 15112 4583 -16527
1105a6527K3270M678k4089J5367J5197l0659k752L0761j1046j5414K1779n234
$$ -16527 6743 11421 -12668 2699 17896 -12763 -15515 15246 4200 -11214 10565 5331
1117E331k5342K0432J5768k7034K020K3365j6323r945K3554j0182k1757K5020
$$ 5331 -20011 421 16189 -10845 -8825 14540 -1783 -11728 11826 1644 -20113 4907
1129D907J2900k6111L920J5833k0581j306K7751j1912k0391K0409M260k1429J2634
$$ 4907 17807 -8304 -4384 11449 -9132 -10438 17313 5401 -14990 5419 9679 -11750 884
1142H84J2474k4046K781K4612j5254j5976K0155j967j7343J9252Q693k6331K473
$$ 884 13358 -10688 -7907 16705 1451 -14525 5630 3663 -13680 5572 14265 -12066 -9593
1155i593K0949j4231n856K0040r177j6613K0276N578k2420P269J5670j5797j256
$$ -9593 11356 -2875 -8731 11309 2132 -14481 5795 11373 -11047 -3778 11892 -3905 -5161
1168e161J8038j3646j3666K0926L576j8397R760Q138j9507L606J8689j3302j0100
$$ -5161 12877 -769 -14435 6491 10067 -8330 1430 9568 -9939 -6333 12356 -946 -11046
1181a1046J8538l007j4938J2748M619j8229P010J6480j3584n851J3802p569r300
$$ -11046 7492 4485 -10453 2295 6914 -11315 -4305 12175 -1409 -7260 6542 -1027 -10327
1194a0327J7067J630j6707P522R403j3834J280J3732j0934p592J6726k022j4347
$$ -10327 6740 8370 -8337 -815 8588 -5246 -3966 9766 -1168 -8760 7966 5944 -8403
1207h403R519N447j3769M696J2285j2088n623J3294m556q910J1746J350j2471
$$ -8403 1116 6563 -7206 -2510 9775 -2313 -7936 5358 802 -8108 3638 4988 -7483
1220g483O374Q110j1699K08J1431p393o055J2552k356j1189Q669O066j1323K186
$$ -7483 -1109 7001 -4698 -4490 6941 -452 -6507 6045 3689 -7500 1169 7235 -4088 -1902
1234a902R469r424l730J1179k964q760Q458K120r736M222O388r108n08R583n239
$$ -1902 7567 -1857 -5587 5592 2628 -6132 2326 4446 -5290 -1068 5320 -3788 -4296 5287 48
1249D8n618Q471j249q252P171M255q286J166P250o591k544R206l004p000P126
$$ 48 -5570 2901 1652 -6600 571 4826 -3460 -2294 4956 -1635 -4179 5027 2023 -4977 2149
1264B149K062p864L632N307p118j298P640l417m941N844K24o407M123L699o267
$$ 2149 4211 -3653 -21 5286 -1832 -3130 4510 1093 -3848 1996 2220 -4187 -64 3635 -2632
1279b632M60N158m622j871N914j592m827M964J466n839K678M350m907j004N543
$$ -2632 -2172 2986 -1636 -3507 2407 815 -4012 952 2418 -3421 -743 3607 -1300 -2304 3239
1294C239k170l749M593O60m839K569K848m080l05L892l074j687L467n36k825K418
$$ 3239 1069 -2680 1913 2573 -2266 303 3151 -929 -1234 2658 -416 -2103 1364 828 -1997 421
1310D21O17l410J660K563l082p49L354j761k159L469N08l302J489K302k582k93
$$ 421 1038 -2372 -712 1851 -1231 -1980 1374 -387 -2546 923 1431 -1871 -382 1920 -662 -955
1326i55L087j563j754K296K43k158J720M27k248R25J294j511p58J709o92j787
$$ -955 2132 569 -1185 1111 1354 -804 916 1343 -905 20 1314 -197 -955 754 62 -1725
1342a725J933K59j636O05Q26j197k52J821q71j279J757J50j139R10J152j539n0
$$ -1725 208 467 -1169 -564 262 -935 -1187 634 -237 -1516 241 391 -748 162 1314 -225 -275
1359b75J341m92o60P55j4m89k2P73n27m46J83j56l89L30K04q44M26j78j11R3K79
$$ -275 1066 574 -86 669 655 166 144 917 390 -56 127 -29 -418 -88 116 -728 -302 -480 -591 -498 -219
1380b19j30o71M95J10K09N4M95r3q13R36J76k96J00Q96j119n12J239K53j186J77
$$ -219 -349 -1020 -525 -415 -206 -152 343 250 -563 373 549 253 353 1249 130 -382 857 1110 -76 101
1400A01O06j012k18J487r81j142R53K99q28M84J09j472Q62J820j650o27K079p91
$$ 101 707 -305 -523 964 -17 -1159 -206 93 -735 -251 -142 -1614 -752 1068 -582 -1209 870 79
1418G9j712K154J065k247L35J887j798m35K383o89k001K089K82k848J479J825
$$ 79 -1633 521 1586 -661 -326 1561 -237 -672 1711 1022 -979 1110 1392 -1456 23 1848
1434A848k921k8K857j800k859L682M89l493J527K643l497j79L854k273k425L597
$$ 1848 -1073 -1101 1756 -44 -2903 779 1268 -2225 -698 1945 -1552 -1731 2123 -150 -2575 1022
1450A022K42l160K755J423m818J106N207l568k075M392j490m294M602K360n637
$$ 1022 1264 -1896 859 2282 -2536 -1430 3777 209 -1866 2526 1036 -3258 1344 3704 -1933
1465a933R66L700l816j243N129k834l744N346R88n817K957K486n893J454O392
$$ -1933 -967 2733 -1083 -2326 2803 -31 -3775 1571 2559 -3258 -301 2185 -3708 -2254 4138
1480D138m192l797N849p61n520N680K944p494J551O475n605k313O819k676n136
$$ 4138 -54 -3851 1998 1237 -4283 1397 4341 -3153 -1602 4873 -732 -3045 3774 1098 -4038
1495d038O931J535q728K779N624o030n76P562n185n529P934O60q039M842M715
$$ -4038 2893 4428 -4300 -1521 4103 -1927 -2503 5059 -126 -5655 2279 2939 -5100 -258 4457
1510D457q115J604P645p223m681R714j37p106O150J485r609L914Q908p626l092
$$ 4457 -3658 -2054 5591 -1632 -6313 3401 3264 -3842 2308 3793 -5816 -1902 7006 -620 -3712
1525c712Q335l785o142Q785N29j0070N323P679r340r37P848o751m235J1205o87
$$ -3712 4623 838 -5304 3481 4010 -6060 -737 6942 -2398 -3335 4513 -2238 -6473 4732 4045
1540D045j0138O170L665r201L607Q932r306l354J1340l495q767Q634K261r701
$$ 4045 -6093 77 3742 -5459 -1852 7080 -2226 -5580 5760 2265 -6502 2132 4393 -5308
1554e308O149P555j1395k681J1007m599n511J0040j329j1184P286O262j1528J536
$$ -5308 841 8396 -2999 -5680 5327 728 -4783 5257 3928 -7256 30 6292 -5236 -3700
1568c700J0492p570m476J0652m422j0416J0178N900j0161K364O853j0573j155
$$ -3700 6792 -778 -5254 5398 976 -9440 738 6638 -3523 -1159 5694 -4879 -6034
1581f034J2712m426q216R968L36j0477O506O500j1765J025J2471p336p277R531
$$ -6034 6678 2252 -5964 4004 4340 -6137 369 6869 -4896 -3871 8600 1264 -6013 3518
1595C518k363q672J0027N340j2558J354Q498q628j759J1264m410q693J0318J657
$$ 3518 1155 -7517 2510 7850 -4708 -3354 5144 -3484 -5243 6021 1611 -7082 3236 4893
1609D893j2039M889Q174r277O12J1098q378q187J1011J210q789P232M307j1877
$$ 4893 -7146 -2257 5917 -3360 -2748 8350 -28 -8215 2796 4006 -4783 2449 6756 -5121
1623e121J584J0287p664m721J0757k255q796Q424K187j2040M085J0101q019k366
$$ -5121 -3537 6750 -914 -5635 5122 2867 -5929 2495 4682 -7358 -3273 6828 -1191 -3557
1637c557Q712o301o921J1082K083r789M679N360r896R95R832o950m958J0988j188
$$ -3557 5155 -1146 -8067 3015 5098 -4691 -12 5348 -4548 -3553 6279 -671 -5629 5359 4171
1652D171r445O289L180r743L952R270q043l792P918l723o228R356J519r793M049
$$ 4171 -5274 1015 4195 -5548 -1596 7674 -369 -4161 3757 34 -6194 3162 4681 -5112 -1063
1667a063O030q629p19Q952n019m770R680j179r456N403M930p656K308P689p247
$$ -1063 4967 -3662 -4381 4571 -448 -5218 4462 3283 -6173 -770 4160 -3496 -1188 6501 -746
1682g46m008Q472j843o435O711K622q595K997O152p919j498Q303l225m890O771
$$ -746 -4754 3718 1875 -4560 2151 4773 -3822 -825 5327 -2592 -4090 4213 988 -3902 2869
1697B869l82q417M949N637o817R0O028n545l262P909q23o431N019L076p138K227
$$ 2869 2487 -5930 -981 4656 -2161 -2071 3957 -1588 -4850 3059 2236 -4195 824 3900 -3238 -1011
1713a011N479n995j963P623k111n296M852J028o864L992N070n882j129N452l883
$$ -1011 4468 -1527 -3490 4133 2022 -3274 1578 2606 -4258 -266 4804 -1078 -2207 3245 -638
1728f38l266N899j78n557M120K711o258J168M813m042j879O451k140n033M679
$$ -638 -3904 1995 1817 -3740 380 3091 -3167 -1999 2814 -1228 -3107 3344 1204 -3829 850
1743H50J827n534K283M090m415j117M890k264l727M823N54m887L273K258m979
$$ 850 2677 -2857 -574 3516 -899 -2016 2874 610 -3117 1706 2260 -2627 646 2904 -2075
1758b075n2M960l249j929M200j252l817L662J557m431J557L280l803q47M488j909
$$ -2075 -2127 2833 -416 -2345 1855 603 -3214 448 2005 -2426 -869 2411 -1392 -2239 2249 340
1774C40k906L884M66l767K447J755l478K32L718k335k024L322j92l832K932J269
$$ 340 -2566 1318 1784 -1983 464 2219 -1259 -1027 2691 356 -1668 1654 1462 -2370 562 1831
1790A831l282J003K432l103q79L504j550k110K734L38k951K044J867l367K96K863
$$ 1831 -1451 -448 1984 -1119 -1998 1506 -44 -2154 580 918 -2033 11 1878 -1489 -1193 1670
1806A670j972j533L331l62k818K156J150k613J044J892k420o02K377q77j543J963
$$ 1670 -302 -1835 1496 1134 -1684 472 1622 -991 53 1945 -475 -1077 1300 423 -1120 843
1822H43K26k584J488J344k513K88K079j776r88K575o77j775J639O28k049Q67J803
$$ 843 1069 -1515 -27 1317 -1196 -908 1171 -605 -1593 982 305 -1470 169 797 -1252 -385 1418
1839A418j856m24K185q16j220J531J78j744J010J027j845K54J461j520o01J697
$$ 1418 -438 -862 1323 507 -713 818 996 -748 262 1289 -556 -302 1159 -361 -962 735
1855G35k38j650R14R86j741N05J111j042o30J475o63m90J024L71j417O22Q93r53
$$ 735 497 -1153 -239 747 -994 -489 622 -420 -1050 425 -238 -728 296 667 -750 -128 765 -188
1873a88k33J301m28p34Q00K86j238M51O61q62J8N79l50j15P9k16l96M92M18r41
$$ -188 -421 880 452 -282 518 804 -434 17 678 -184 -166 413 63 -52 27 -189 -585 -93 325 -616
1893f16L70N86q85j41P67J17n66J55L03j18k8O47l20l11L3K83k7K35P6o19K27
$$ -616 -246 340 -545 -686 81 198 -368 -213 90 -28 -56 591 271 -40 -7 276 249 484 560 -59 168
1914A68K47k07n07M71p7l83L63L18m89m93K98K81m96K13M68m06l77N40k3j30J13
$$ 168 415 208 -299 172 95 -288 75 393 -96 -589 -291 -10 -506 -293 175 -231 -608 -68 -91 -221 -108
1935a08M12n21M76L67p12j79J248o40p06Q72K33j216M00N30p07p1J153o39q72
$$ -108 304 -217 259 626 -86 -265 983 343 -363 509 742 -474 -74 456 -251 -322 831 192 -680
1954f80Q62k44q75J093N53j512j82J032o65K2J273m38j228J337N90j764O76J149
$$ -680 182 -62 -937 156 709 -803 -985 47 -618 -596 677 239 -989 348 938 -826 -150 999
1972I99j426J6J860j042j333J509Q5j340J171J218k627M3J498r44o48K082q11
$$ 999 -427 -411 1449 407 -926 583 668 -672 499 1717 -910 -867 631 -313 -961 1121 310
1989C10k097J590Q23k215Q87J869j306p75J702q33j990K350J061k321P92J833
$$ 310 -1787 -197 626 -1589 -702 1167 -139 -914 788 -45 -2035 315 1376 -945 -153 1680
2005A680k226o93K704j024j608K361K40k818J079J663k452K89K976j974k176K390
$$ 1680 -546 -1239 1465 441 -1167 1194 1434 -1384 -305 1358 -1094 -805 2171 197 -1979 411
2021D11j51j989K121J131l192M23K896k265j416L176o75k203K924L35l433J233
$$ 411 260 -1729 392 1523 -1669 -1246 1650 -615 -2031 1145 470 -1733 1191 1526 -1907 -674
2037f74K412k046j88K809j855k660K934R21l051J899J720l380N1K724k072j914
$$ -674 1738 -308 -496 2313 458 -2202 732 1653 -1398 501 2221 -1159 -1108 1616 -456 -2370
2053b370L925j49l371K145O94l153J159L583k780j485L259j178k607L144J056
$$ -2370 1555 1406 -1965 180 874 -2279 -1120 2463 -317 -1802 1457 279 -2328 816 1872
2068A872l635J437L109l023j699L533j342j889L480M62m117P81K415k507M15L330
$$ 1872 -1763 -326 2783 -240 -1939 1594 252 -1637 1843 2305 -1812 -1031 1384 -1123 -708 2622
2084B622k978j984L294M0l523K635J642l425J052K828k923j873L905n03k101K805
$$ 2622 -356 -2340 954 994 -2529 106 1748 -1677 -625 2203 -720 -2593 1312 809 -1292 1513
2100A513K56l848J338K626k372m01L147j922k537L353K51l558K162K168l378K50
$$ 1513 1769 -2079 -741 1885 -487 -888 2259 337 -2200 1153 1404 -2154 8 2176 -1202 -952
2116i52K908k964j603M094l36k602K123M12l938J940L264l002j281L824j026k913
$$ -952 1956 -1008 -2611 1483 1147 -1455 668 1080 -2858 -918 2346 -656 -1937 1887 861 -2052
2132b052L028L37l670K446K866l301r06K760j823j348L633n35l471J882J718k897
$$ -2052 976 1313 -2357 89 2955 -346 -1252 1508 -315 -1663 1970 1435 -2036 -154 1564 -1333
2148a333M89K752k618j273L682r86k732K136Q30k551J642K536l643r23L207r82
$$ -1333 -844 1908 -710 -1983 1699 713 -2019 117 947 -1604 38 2574 -1069 -1992 1215 233
2164B33j774L152k9l499J827K151k814j33K399j912j117K916m31l145K199J316
$$ 233 -1541 1611 1582 -1917 -90 2061 -753 -886 1513 -399 -1516 1400 969 -2176 23 1339
2180A339k588N95K296k781o24L457j203k215K371O02k744R03J981k032n59L104
$$ 1339 -1249 -654 1642 -1139 -1763 1694 491 -1724 647 1249 -1495 -592 1389 -643 -1202 1902
2196A902j439j586K015K1k383K091J022k205j50J988j572r27K564o49k247J603
$$ 1902 463 -1123 892 913 -1470 621 1643 -562 -712 1276 -296 -1223 1341 692 -1555 48
2212D8J013j888K03J707j836l23K286j114j502J548M49j916J394J206j708l52
$$ 48 1061 -827 -624 1083 -753 -1076 1210 96 -1406 142 591 -1325 69 1275 -433 -785
2228g85J770p79r13J593Pj878J170P94j390J42J156j075p24J661n36q34Q50M23
$$ -785 985 206 -707 886 893 -985 185 979 -411 -269 887 -188 -912 749 213 -621 229 652
2246F52j557M12J381j501l12J432q66q11J502K08j486Q57Q10j017K8J206p20r09
$$ 652 -905 -493 888 -613 -925 507 -359 -1170 332 540 -946 -89 721 -296 -268 938 218 -691
2264f91J252J19j189R48Q7p73K47Q58r22j35R51o96r82J320Kj308P58N93j279
$$ -691 561 680 -509 439 526 -247 0 858 -64 -199 752 56 -926 394 396 -912 -154 439 -840
2283h40J16J294p71q86J420P3r95O14O36r17PJ083r15l17J025j47r57O01L69q91
$$ -840 -724 570 -201 -1087 333 406 -589 25 661 -256 -249 834 -81 -398 627 480 -477 124 493 -398
2303c98L78N20p02j25Q07l24o98R32k30r82P26N15q82o1R21q42r9P76K37r39M91
$$ -398 -20 500 -202 -327 480 156 -542 390 160 -822 -96 419 -463 -524 397 -445 -544 232 469 -470 21
2324B1M66p18J23O04m58j03O31k15m21K83j8q31Q03J76o22k3P45n16m52P37k4
$$ 21 487 -231 -108 496 38 -65 566 351 -70 213 195 -636 167 343 -279 -302 443 -73 -525 212 188
2345A88q10L78N3k24L38M30p10M2O49l90n99Q84P8n55L51J54k50n3L32K0o84N21
$$ 188 -622 -244 -191 -415 -77 353 -357 -315 334 -56 -655 229 307 -248 103 257 7 -46 286 306 -378 143
2367A43J29r9j48K06n43L68J41n20k5L36J84p53M75J40m60J83N05l73K9K81k45
$$ 143 272 173 25 231 -312 56 197 -323 -348 -12 172 -581 -106 34 -426 -243 262 -111 -82 199 -46
2388d6k53K50L61k8J13k94j94l3P18m88l64N01K3m78K12Q33p98j97K12m01l8N29
$$ -46 -299 -49 312 284 397 103 -91 -124 594 106 -258 243 266 -212 0 833 35 -162 50 -351 -389 140
2410A40j5n08M05J94m97J21J33Q6k23K69N2k79J55L05l45n5M22r6j63R0M4j27
$$ 140 125 -383 22 216 -281 -160 -27 59 -164 105 157 -122 33 338 -7 -62 360 264 101 191 235 108
2432A08k08M08l64l7M59m46k74K98Mn19K63K55j60R5J78k30j90N21m4m15L94Q5
$$ 108 -100 308 -56 -93 366 -80 -354 -56 -52 -571 -308 -53 -213 -118 60 -170 -360 161 117 -298 96 181
2454A81o30J73O20l66J87J36k17k29J75K17m55J84J24k71k4L14l48l31J78N30
$$ 181 -449 -276 344 -22 165 301 84 -145 30 247 -208 -24 100 -171 -195 119 -229 -560 -382 148
2474A48l01RJ07l38K85M11k74m83Q63k80o97N32M34n06P0O55n06m25P50k44n75
$$ 148 -153 -144 -37 -375 -90 321 47 -436 427 147 -550 -18 416 -90 -20 635 129 -296 454 210 -365
2495c65M02L25n60l54Q15k80l52P63l32o13O16K87q75k49J040l93j50L93n29P0
$$ -365 37 362 -198 -552 263 -17 -369 394 62 -551 65 352 -523 -772 268 -125 -275 118 -411 -341
2515c41L27O59q11K28K78p71R2R47k09m59P64m39o98O50K79o09pN99m28o09R35
$$ -341 -14 645 -166 62 340 -431 -339 608 399 -60 704 265 -433 217 496 -113 -120 479 51 -558 377
2536C77l93n56O99L75j083J57O02p60L4P94L0r02R96K31j119K61R03j186M74Q85
$$ 377 -16 -572 127 502 -581 -424 178 -582 -548 246 276 -626 370 601 -518 -257 646 -540 -66 819
2556H19o76p23N85N05p28K72P65r03k51N04j18o81J227j30j151O34M96r90rJ112
$$ 819 143 -580 5 510 -218 54 819 -84 -335 169 51 -630 597 467 -684 -50 446 -544 -553 559
2576E59m24q60J220j90j283J200M59o61k0O87q81m39J231p1r83Q67K28j150N44
$$ 559 135 -725 495 305 -978 222 681 20 0 687 -194 -633 598 527 -456 411 639 -511 33
2595C3O46j294J84Q70o8p28N12l8j072P06J144r61n12Q69o92k23J184k58o80O05
$$ 33 679 -615 -431 439 371 -357 155 117 -955 -249 895 -66 -578 291 -401 -624 560 302 -378 227
2615B27M45j074J88O55k44o23J374n28j136M25P25r17M64J145j208l08P87k50
$$ 227 672 -402 -214 441 197 -426 948 420 -716 -291 434 -483 -19 1126 -82 -390 397 147
2633A47j109J150K07j019N73L42r69n9J096m18j35J043n22j016Q97J15l96K6P16
$$ 147 -962 188 395 -624 -51 291 -678 -737 359 -59 -194 849 327 -689 208 323 -73 -47 669
2652F69n46q11J284l89p59Q61L32j071M86N17j039j61J528o10r50P61l9j121O80
$$ 669 123 -688 596 207 -552 309 641 -430 56 573 -466 -627 901 291 -659 102 63 -1058 -378
2671c78P40p41j03J041r19m37J107k00p01Q05L32r87K73P60p03l24J413o62q73
$$ -378 362 -379 -482 559 -360 -797 310 110 -591 214 546 -441 -168 592 -111 -435 978 316 -557
2690e57P16J36j085M71J198j041l5P54r48n20J162K02j066R51K3j041M66O90n58
$$ -557 159 295 -790 -319 879 -162 -197 557 -391 -911 251 453 -613 338 361 -680 -214 476 -82
2709h2j95Q00p0j080Q42K67j071O55N39n07k15Q50r92l78J136j99q47N04M47q38
$$ -82 -277 523 453 -627 215 482 -589 66 605 98 -117 733 -259 -637 499 300 -547 -43 404 -434
2729d34O3J212j021k77M36K39j106Q73M93j213P86J66n39j65Q29k16l63M92K02
$$ -434 -371 841 -180 -457 -21 218 -888 -15 478 -735 51 217 -322 -487 342 126 -237 255 457
2748D57q31P75K80r50r8Q88k58m77P75n17m17K47N75q60M34J47o01j67J012k63
$$ 457 -374 401 681 -269 -367 521 263 -214 561 44 -373 -126 449 -411 23 170 -431 -598 414 151
2768A51m21L02j07l63M27L53q36J71N67j26l49N73j81o16M21N22o47K2P65q35
$$ 151 -270 32 -75 -438 -11 342 -494 -323 244 118 -231 342 161 -455 -34 488 -159 -137 628 -207
2788b07Q9M93l20k43N40k97n14L59M78n28j73O73j70n41N30p0l42L96J4l12J63
$$ -207 -118 375 55 -188 352 55 -459 -100 378 -150 -323 350 180 -361 169 99 -243 153 167 -145 18
2809A8K10l32qN15k92k42M16p1k21J73L68o53J51K55l54m11N78J18k40J37J10
$$ 18 228 -104 -112 403 111 -131 285 214 -7 166 534 -119 32 287 -67 -478 100 218 -22 115 225
2830B25o85J77N01l33j12L06J05l22L04j94J1L4L10l01l00M42J3m10N14p2k34
$$ 225 -460 -283 218 -115 -227 79 184 -138 166 -28 -17 17 327 26 -274 168 181 -229 285 213 -21
2851b1K80l04j29J92K57k32m6L6J1k93J05J43k14j47M31j55J30J0m3k43J48l8
$$ -21 259 -45 -174 18 275 43 -3 33 44 -249 -144 -1 -215 -362 69 -86 44 54 11 -232 -84 -122
2873a22K33j43R3K48k61K94l28K4K46r4l27L63k5o5o7k10J72j91L18j69J27j10
$$ -122 111 -32 61 309 48 342 14 38 284 190 -137 226 201 136 69 -141 31 -160 158 -11 116 6
2895Fk21JJ09O8j7P7K83k75j6j68L21j86p6K97m9l39M55j52q6l7J24J54k25J25
$$ 6 -215 -214 -105 -37 -54 23 306 31 15 -153 168 -18 -94 203 154 -185 270 118 32 -5 119 273 48 173
2919A73Q5n71M48J89n24R9J20J15j03M0o2m9J48k34k83M51k6k39K09K9j72K85
$$ 173 258 -313 135 324 -200 -101 19 134 31 71 9 -40 108 -126 -409 42 16 -223 -14 15 -157 128
2941A28Q3k95J60J05k66k0J31K80k17J5k9r6j10J07j38j42M01j08j99k2j2L92
$$ 128 211 -84 76 181 -85 -105 26 306 89 104 75 -21 -131 -24 -162 -304 97 -11 -210 -232 -244 148
2963A48n04L62J06m54K47Q7J45j0n9j38Q7K03j35QP0k00jP5R6k47o8R7M47n12
$$ 148 -356 6 112 -342 -95 -8 137 127 68 -70 17 220 85 93 163 -37 -38 37 133 -114 -182 -85 362 -150
2987a50L57n9l22L34k00k2L9L14l06l26L91l58J36K21jj56J52L05m42J4K45r7
$$ -150 207 148 -174 160 -40 -62 -23 291 -15 -341 50 -308 -172 49 48 -108 44 349 -93 -79 166 69
3009F9K31k38J46m40J72J00J05l87L13L2k26K78j44n70M04M46j83j86k02J46k69
$$ 69 300 62 208 -232 -60 40 145 -242 71 103 -123 155 11 -559 -155 291 108 -78 -280 -134 -403
3030d03M21R9k97J71K85m90J92N6p3j33N20j65k39O4J98m08N15P1l20n42N74k14
$$ -403 18 117 -180 -9 276 -214 -22 34 -39 -172 348 183 -56 8 206 -202 313 384 64 -478 96 -118
3052a18j3K42o2m05J71M68n97Q8M71om22L78j91l49M23L12n85L69k70L0n1K77
$$ -118 -131 111 49 -356 -185 283 -314 -226 245 239 -183 195 4 -345 78 390 -195 174 -96 -66 -117 160
3074A60j11lM8J20m43K01J07m50N60N2p2k91o1K65m82K40M84k39k20M51q10N4
$$ 160 49 46 94 214 -229 -28 79 -371 189 241 169 -122 -183 82 -400 -160 324 85 -135 316 -494 -440
3096d40O63j16k19L76j47m23m4N71k77J12K66k94k51K09J87j82K4L63m67LM76
$$ -440 223 107 -112 264 117 -306 -350 221 -56 56 322 28 -223 -14 173 -9 15 378 -89 -86 390
3117C90l08j4J47r1j72o2K95k46j91K81P5j84M21l43k8Q7n4j30K37K27j90j06
$$ 390 82 68 215 124 -48 -110 185 -61 -252 29 104 -80 341 -2 -30 57 3 -127 110 337 147 41
3139D1K71l46j7N62l73j84k11L76k04j72P88l91l09J86J0n13J05O99l32r4m6R1
$$ 41 312 -34 -51 511 138 -46 -257 119 -85 -257 531 140 -169 17 27 -486 -381 318 -14 -108 -154 -63
3161f3J7j36K45k35K72j4l89J55M25j68k10M18l50q4K45j4m16M40J09l41o6Q7
$$ -63 -46 -182 63 -172 100 86 -303 -148 277 109 -101 317 -33 -117 128 114 -302 138 247 -94 -160 -73
3183g3j4R0K10l84O7J44P0m54J56K69j68j55M79n4n27L30o7l6mO35q76J00L21
$$ -73 -87 3 213 -171 -104 40 110 -344 -188 81 -87 -242 237 183 -344 -14 -81 -117 -121 514 -362 -262 59
3206E9j2j23L81j91k24L32j19o6k97N96k59pm4j97j32K51J70k28n3J44N2j70J69
$$ 59 47 -76 305 114 -110 222 103 37 -260 336 77 70 26 -171 -303 -52 118 -110 -163 -19 33 -137 32
3229C2K47k80r2M15m56j74N51j80k13L23J06l54L9K21l29N1K49m47K41O0JkM9
$$ 32 279 -1 -93 322 -134 -308 243 63 -150 173 279 -75 -36 185 -144 -93 156 -291 -50 10 11 9 58
3252E8J35l83K60kj32J37r3K0K0JL33o02M53j19j61K80M25o56k31K57K00l22K33
$$ 58 193 -190 70 68 -64 73 -20 0 20 21 354 -248 205 86 -75 205 630 -26 -257 0 200 -122 111
3275A11j54L2J5P5Q2k55J24k53L3O9J00j39j61N19j60q3m0J77j10K5O5k33M24
$$ 111 -43 -11 4 79 161 -94 30 -223 -190 -121 -21 -160 -321 198 38 -45 -85 92 -18 7 72 -161 263
3298B63k4n7j86K81k39k32L39j19j26j21K31K1j61K11j24P8j04j80M2J02J45k35
$$ 263 239 182 -4 277 38 -194 145 26 -100 -221 10 31 -130 81 -43 35 -69 -249 -207 -105 40 -195
3320a95j8M72l22O4N8j76mJ25J7j16N12l72j62J65r1m3M9j18K39J42n1l19jM68
$$ -195 -213 259 -63 1 59 -117 -121 4 21 -95 417 45 -117 48 -43 -86 -37 -155 84 226 175 -144 -145 323
3344C23J5l45jm0k03l8K35J42r7n1jJ68l7k21O8j05K69L00n17K56J51o6j29J59
$$ 323 338 -7 -8 -48 -251 -289 -54 88 -9 -60 -61 107 70 -151 -83 -188 81 381 -136 120 271 205 76 235
3368B35k20J31l69J97P1L0P9k88K18L0l44L04J4j02n9Q2p4J62p0Q5j54jK36j08
$$ 235 15 146 -223 -26 45 75 154 -134 84 114 -230 74 88 -14 -73 9 -65 97 27 112 -42 -43 193 85
3392H5Q0k40J01JM8m8k29J67K29m61L54M0j1O0k61j13K96J27Kk71k9J46j75J14
$$ 85 165 -75 26 27 75 27 -202 -35 194 -267 87 127 116 176 -85 -198 98 225 227 -44 -73 73 -102 12
3416A2jj66J93j35K61j60j71K7O3o3J59q4j81K65P2q3J45m9j29n1J95j49k26J74
$$ 12 11 -155 38 -97 164 4 -167 -140 -77 -140 19 -65 -246 19 91 8 153 104 -25 -76 119 -30 -256 -82
3440h2J79k07R2j1j56K30Qk34J65o8K6L10n82L61q0K33k41Q8L12j33k08j74Q4
$$ -82 97 -110 -18 -29 -185 45 53 -181 -16 -84 -58 252 -330 31 -49 184 -57 31 343 210 2 -172 -88
3463h8J19P0k7m5J2J91j0j96j46J89j11L8J76J55k13j30J16L0K6j45j39K82m18
$$ -88 31 101 74 29 41 232 222 26 -120 69 -42 -4 172 327 114 -16 100 130 156 11 -128 154 -264
3486b64K50J7j48K83q1j08K39l1k04J87jk16K2n4o9K68o0j70J71M8J34k75k6M48
$$ -264 -14 3 -145 138 57 -51 188 157 -47 140 139 -77 -55 -109 -178 90 30 -140 31 79 213 -62 -88 360
3510C60l69o4R8K6K27m33L73l62q8K95j12J17J98r9J7n9l70L98j01K1P4k11K38
$$ 360 -9 -73 25 51 278 -155 218 -144 -232 63 -49 68 266 167 184 125 -245 153 52 73 147 -64 174
3533A74k58l7K73j03r2J9L77k01l13J76j84P1J17oJ87m35J85ON3J97k67K80j67
$$ 174 -84 -121 152 49 -43 -24 353 152 -161 15 -169 -98 19 13 200 -235 -50 -44 9 206 -61 219 52
3556E2M7k43n0J59kK34J93m02K28k20P5P4R4n8M2j11j57j01K32P5N7l99LJ80q2
$$ 52 99 -144 -194 -35 -37 197 390 -12 216 -4 71 145 239 181 223 112 -45 -146 86 161 218 -181 -178 2 -80
3581h0l2L23n5j77m4j16p7J06J43j5L64k23l45P1K04J43l46L51j45j15Q4M4m95
$$ -80 -112 211 156 -21 -65 -181 -258 -152 -9 -24 340 117 -228 -157 47 190 -156 195 50 -65 19 63 -432
3604d32N25J55l90K22r6k75J49O55p03JK17J64o42K54K79j72j90O37n13l07M75
$$ -432 93 248 -142 80 -16 -291 -142 513 -190 -189 28 192 -450 -196 83 -89 -279 358 -155 -462 13
3625A3Ql01N72k7l96l2M38k11k85N22k27n6J86j6m77J71J52l4j88M85k01k32J57
$$ 13 21 -280 292 265 -131 -163 275 64 -221 301 74 18 204 188 -289 -118 34 0 -188 297 96 -136 21
3648B1Q5j55kK08qj75K84J32n31L25%k61J21J4k5k6M1J33m65J61J36j77K95k91
$$ 21 106 -49 -51 157 149 -26 258 390 -141 184 184 -77 44 58 33 7 48 181 -284 -123 13 -164 131 -160
3672a60L04k19j14J6J35O9p8l0L43k89k18Q2K11O1k52L90j02k28K09k58N0K37
$$ -160 144 -75 -189 -173 -38 31 -47 -77 266 -23 -241 -159 52 113 -139 251 149 -79 130 -128 -78 159
3694A59l79Q8P2Q5R4o13M88J16k69J23lk26M78m5n02L53j36J03l31L33Q4r6j13
$$ 159 -220 -132 -60 25 119 -494 -6 110 -159 -36 -39 -265 213 168 -334 19 -117 -14 -345 -12 72 -24 -137
3717a37K79m17M9M68mk32J39J02n95M50mj17j10L03j58j00L4J2n5K59j72J82l38
$$ -137 142 -275 -226 242 238 6 145 247 -348 102 98 -19 -129 174 16 -84 -50 -38 -93 166 -6 176 -162
3740a62M02m29q8J40J36r5J0K38k74J33J5m2L60k72k57N3J2J09p9Q4J32j72qO6
$$ -162 240 -189 -277 -137 -1 -96 -86 152 -122 11 26 -16 344 72 -185 -132 -120 -11 -90 -6 126 -46 -54 12
3764A2j5j99J95o1k26K76o6q7K01J48l27pJ53k2j08L99m34K45p0j77K69j88L27
$$ 12 -3 -202 -7 -68 -294 -18 -84 -171 30 178 -149 -156 -3 -25 -133 266 -168 77 7 -170 99 -89 238
3787B38l78J53N8K19k30p0K42k85K2J64J8k83K43k91K83r4k66J46pr5l0K86k77
$$ 238 -140 13 71 290 60 -10 232 -53 -31 133 151 -132 111 -180 103 9 -257 -111 -118 -213 -243 43 -234
3810b34L58l16K67j07j59J79J45j47m6J79K7j19J10m7j62J48K93l90k12L25p8
$$ -234 124 -192 75 -32 -191 -12 133 -14 -60 119 146 27 137 90 -72 76 369 -21 -233 92 14
3831A4n4K26m3l21K35KO0k31R4j48k08K34N8m1N6p1l0K89K1pl0j21J02p5l0kR6
$$ 14 -40 186 143 -178 57 59 119 -112 -18 -166 -374 -140 -82 -123 -67 -138 -168 121 142 135 105 -16 86 11 -19 -21 75
3858G5n8j33K33j40J50l22K33q2p2jk90M08l27M11l2j29MJ88j35k04K55k8j13
$$ 75 17 -116 117 -23 127 -195 38 -44 -116 -117 -407 1 -326 85 53 -76 -72 116 -19 -223 32 4 -109
3881a09J85R8j17Rj48L5K13j25J83k22J75j87R1j32j49K60o1J08n2Rl3Q4N0k67
$$ -109 76 174 57 66 -82 -47 166 41 224 2 177 -10 81 -51 -200 60 -1 107 55 64 31 115 165 -102
3905a02O5J09j00O5J72J46l81J24k59M75k66K7NK35l38R3l73M04l59L10j84J88
$$ -102 -37 72 -28 37 209 355 -26 98 -161 314 48 75 80 315 -23 70 -303 101 -258 52 -132 56
3927E6J52k04j18K9Q3j16J2R6J97l06nK32R7j46O1j07j78J95J17j98K0N8J58k12
$$ 56 208 4 -114 -85 -2 -118 -106 -10 187 -119 -124 108 205 59 120 13 -165 30 147 -51 -31 27 185 -27
3951b7L63j65k14J00J2p8Q4J40n24L31N2j07j95M91k15k62K1J38O5J60k05j01
$$ -27 336 171 -43 57 69 -9 75 215 -309 22 74 -33 -228 263 48 -214 -193 -55 10 170 -35 -136
3973a36k05M06r3o2n4K15M9k10j00K92k4j59K28r3K90k30j08j12QJ89o0J08l58
$$ -136 -341 65 -28 -90 -144 71 120 -90 -190 102 78 -81 147 54 344 114 6 -106 -98 91 31 139 -219
3996b19J64k6J36l35L26m7Pp8j7m0J66r9qj17R5k5J98J04j03J50l25J43k33J09
$$ -219 -55 -81 55 -280 46 -1 6 -72 -89 -129 37 -62 -70 -187 -92 -117 81 185 82 232 -93 50 -183 -74
4020g4n5n0Q4k1M13k48j61L7Oj32P3N0p1L95n1l21J68J20j63J81k25K58j13l0
$$ -74 -129 -179 -95 -116 297 49 -112 -75 -69 -201 -128 -78 -149 246 195 -126 42 162 -1 180 -45 213 100 70
4044G0k00J39J23r7k54N2K62J19N0o8k60l9n4O7J95O3k90k93M08R6r0l9R5o7j98
$$ 70 -130 9 132 35 -219 -167 95 214 264 196 -64 -103 -157 -90 105 168 -122 -415 -7 89 -1 -40 55 -12 -210
4069b10K20K85n8l98K06j39J63m5J68l49P0R7pq9K34M1l31J23J8K2po4L5k91K57
$$ -210 10 295 237 -161 45 -94 69 24 192 -157 -87 10 3 -86 148 189 -142 -19 -1 21 14 -50 -15 -306 -49
4094d9j10K1L45k65M3N5k2l5j14J85LNk2k15j4O2N18n34K22L0Kk92J90J90l26
$$ -49 -159 -138 207 -58 -15 40 18 -17 -131 54 57 62 40 -175 -189 -127 391 -143 79 109 111 -181 9 199 -127
4119a27J98n8O3l8n9k36L66k56J89p8QK35l61K31J96l59P4M7J67m97K62K03j60
$$ -127 71 13 76 38 -21 -257 109 -147 42 -36 -28 207 -154 77 273 -86 -12 35 202 -295 -33 170 10
4142A0N2j03K66l21M04K3m82L42l18R5j62K06J1k42L10N4o16M85j17lK64l12p9
$$ 10 62 -41 225 -96 308 331 -151 191 -127 -32 -194 12 23 -219 91 145 -471 14 -103 -106 158 -154 -233
4165b33K79mJ04j88K07Q1l24J20j83PJ72N5p1j89M05j48q2J08k8j02qK67k69l8
$$ -233 46 42 146 -42 165 246 -78 42 -141 -134 38 93 22 -167 238 90 8 116 88 -14 -22 245 -24 -62
4189f2J22j14p9L16j23r9Q8j81R8J01O6j41j56K90j97l8O3N1N3Q9q6k65J72Lj08
$$ -62 60 -54 -133 183 60 -39 49 -132 -34 67 133 -8 -164 126 -71 -109 -46 5 58 147 61 -204 -32 -29 -137
4214a37L06Q7k83k07K31K56j89j36L24l59r4J11Jp6k1K07j7J53p4k02m2K16n0
$$ -137 169 256 -27 -234 -3 253 64 -72 252 -107 -201 -90 -89 -165 -186 21 4 157 83 -119 -161 55 5
4237Em8K43k04o5Q3j7pJ75j55LJ59n0J5l81k3M59k70P3P7j31k85K08J94l81L56
$$ 5 -43 200 -4 -69 14 -3 -10 165 10 13 172 122 137 -244 -267 192 -78 -5 72 -59 -344 -136 58 -323 33
4262C3k51J09j3R6J59r7K92l26P1K31n2j39J81l12J5m3J11J4K08j8j67n7q2K00
$$ 33 -218 -109 -122 -26 133 36 328 2 73 304 252 113 294 -18 -3 -46 65 79 287 269 102 45 -37 163
4286A63k70L1J88O4k58jN3q1j18N08n5j60O4l09L74j67J76k26J03j3j91%J40K
$$ 163 -107 -76 112 176 -82 -83 -30 -111 -229 279 224 64 128 -181 193 26 202 -24 79 66 -125 -125 15 17
4310A7L7K5k39L50j13K1j67J84pj56J3j08J2K09l9N9j3m1O2l85L00P3l21L25j01
$$ 17 54 79 -160 190 77 98 -69 115 108 -48 -35 -143 -131 78 39 98 85 44 106 -279 21 94 -227 98 -3
4335cJ69m0P7r7J18k00N3j55K71j5k31J92k18K46q7q3j22O5j3pj74K50J93j52
$$ -3 166 126 203 106 224 24 77 -78 193 178 -53 139 -79 167 80 -3 -125 -60 -73 -80 -254 -4 189 37
4359C7j76K52j14J38n5J17o58L88J77k81K97J09j84j42k9O4R0J60l03o3M05L0
$$ 37 -139 113 -1 137 82 199 -459 -71 106 -175 122 231 47 -95 -124 -60 30 190 -113 -176 229 259
4381B59k89j01K84k62L79k96q2jn5j14J90K28k31k5J51j05J41K56m61L12k39N2
$$ 259 -30 -131 153 -109 270 -26 -108 -109 -164 -278 -88 140 -91 -116 35 -70 71 327 -134 178 -61 -9
4403iO5j31J81k02L09k21Qj5j39J60k04J44K70j42Q6n29O73m25l6L48j72k1j70
$$ -9 56 -75 106 -96 213 -8 0 -15 -154 6 -198 -54 216 74 160 -369 304 -121 -157 191 19 -2 -172
4426a72L4Q9l3K03n58K69J67n4J49j98L0M18j59o3Q0j03j99J72k25J75j44j48
$$ -172 -138 -49 -82 121 -437 -168 -1 -55 94 -104 -74 344 185 122 202 99 -100 72 -153 22 -122 -270
4448b70J41J2r6J39K43j41Q3k09o4J91k22M04l64m0J69j06R7j93L24m7J49j56
$$ -270 -129 -117 -213 -74 169 28 111 -98 -162 29 -193 211 -153 -193 -24 -130 -33 -226 98 51 200 44
4470D4J8j39n7J04l99N00k54N15k93j06j23J79J7m0J17j13J8j47J45k56L66n4
$$ 44 62 -77 -134 -30 -429 71 -183 332 39 -67 -190 -11 6 -34 83 -30 -12 -159 -14 -270 96 42
4492D2p9R5l32n8N04J26k61J56j86K59j72j27J83Nk27K20o3j31J88p9j38J86j84
$$ 42 -37 58 -274 -332 172 298 37 193 7 266 94 -33 150 155 -72 148 85 -46 142 63 -75 111 -73
4515g3K1J32R6k36j48j15P4L83k81P2K32j35Q2Q0n9%l53K10o0J42j18K40l19k4
$$ -73 -52 80 176 -60 -208 -323 -249 134 -147 -75 157 22 104 184 125 125 -228 -18 -78 64 -54 186 -133 -157
4539a57L42j92o7k4o6l3L21p3k14K57p1k30K20L2r6P8l2J06k57K95L0j40oK27
$$ -157 185 -7 -74 -98 -164 -197 124 51 -163 94 23 -207 13 45 -51 27 -5 101 -156 139 169 29 23 250
4563B50n66J67L94m80J96K20P5k32Q2P5j44l6k8P8j84L59k09j37J96J12k9j28
$$ 250 -316 -149 245 -235 -39 181 256 24 106 181 37 1 -27 51 -133 226 17 -120 76 188 159 31
4585C1K4l5K0m8j45M1k2J34Q3J13k93L7K5K1J74j22N8j35R9k5K35m20m4k2J10
$$ 31 55 20 40 -8 -153 -112 -134 0 83 196 -97 -60 -35 -14 160 38 96 -39 60 35 270 -150 -194 -216 -106
4610a06J06J39k21K56m12q7L40K9K29m63K49j59j98K48J23q4rR2J71j77l32M02
$$ -106 0 139 -82 174 -238 -325 15 44 273 -190 59 -100 -298 -50 73 -11 -20 72 243 66 -266 136
4632A36L9q7j32J65j88J54k56J60j30M37m43K70J21l57o9K24K8r1ON1l03M8M01
$$ 136 175 88 -44 121 -67 87 -169 -9 -139 298 -145 125 246 -111 -180 44 72 -19 -13 38 -265 -217 184
4655A84q3j70L62R9o58L30k3j67M78k60L5l33J70p4K9K23K6nl23K96j94M0N0J32
$$ 184 101 -69 293 392 -266 64 41 -126 352 92 127 -206 -36 -110 -81 142 168 163 -160 136 -58 -18 32 164
4679A64p1k59L04m07K43K10l54K25K07j21j59J29p4q1rJ38K3j66r1K99jM0k51
$$ 164 93 -166 138 -269 -26 184 -170 55 262 141 -18 111 37 -44 -53 85 108 -58 -149 150 149 189 -62
4702f2P6K61m23o7k55O22j79j54O8J50j38R7l6R9k96M57j73ok42K53l58J90K30
$$ -62 14 275 -148 -215 -470 152 -27 -181 -113 37 -101 -4 -40 59 -237 220 47 41 -201 52 -306 -116 114
4725A14k12O9J11K7l62M34k09j60N5q6j1K49J70k73J40k6n6k37K18O9J5j51J46
$$ 114 -98 -29 82 109 -253 181 -28 -188 -133 -219 -230 19 189 -84 56 30 -26 -263 -45 24 39 -112 34
4748C4M6l68L88J39o28K10L89l38r5L63q9j29J98j11j49L9J60o6PQ0l2j99J46
$$ 34 80 -288 100 239 -389 -179 210 -128 -223 140 51 -78 120 9 -140 -101 59 -7 0 80 48 -151 -5
4771el7k49M25j22oj42L09j67J3j63O7qK51o6l14M29n15L39NJ99k94P6o2lK53
$$ -5 -42 -291 134 12 6 -136 173 6 19 -144 -77 -85 166 100 -214 215 -300 39 44 243 -51 25 -37 -40 213
4796B13p1r0k30K17J17l95Ll1l8K71J22k06q5L35j04r4N9J70j01J14j36l59K81
$$ 213 142 52 -178 39 156 -239 -236 -267 -305 -34 88 -118 -203 132 28 -66 -7 163 62 176 40 -319 -38
4819c8%K17m38K08K34Kk12J00J77k59L3r5M6k23L52k15K92m79J19K36J58N9l95
$$ -38 -38 179 -259 -51 183 185 -27 73 250 -9 24 -71 -25 -248 104 -111 181 -298 -179 57 215 274 -121
4842a21n3Q0k06K93p4l0l1K15Pj31J7J65l0J3J97o36J42L20j77N0j3j70R3J6j50
$$ -121 -174 -94 -300 -7 -81 -111 -142 73 80 -51 -34 131 101 114 311 -325 -183 137 -40 10 -3 -173 -80 -64 -214
4867b14L2Q6J46l32K45m4J40k10j6j0M84n22J48P4j4M1j38M7O8M03o41L14M9j76
$$ -214 -182 -96 50 -282 -37 -81 59 -151 -167 -177 307 -215 -67 7 -7 34 -104 -57 11 414 -227 87 136 -40
4891d0K42j9m1Q3j15j64j55L23k58KJ49l11K35J3J29r8l0M9J53Mn8j16N6P7K4
$$ -40 202 183 142 225 110 -54 -209 114 -144 -142 7 -304 -69 -56 73 -25 -55 -6 147 151 93 -23 33 110 134
4916A34N8l50K09l91L54J74l41R2n9L01l69K43j54J87k63K78k1J00l05J53j22
$$ 134 192 -158 51 -340 14 188 -153 -61 -120 181 -188 55 -99 88 -175 103 82 182 -123 30 -92
4937i2j61J99q9R4j01J11m3j0K86l12K33K69l42j58J38o9K02L03m53N6p6N1J64
$$ -92 -253 -54 -143 -49 -150 -39 -82 -92 194 -118 115 384 42 -116 22 -47 155 458 5 61 -15 36 200
4960B00p6j24J9p7j06K6Q6j62R4%N2J5j80K6K26l2p8J14Q3k7J58k58Q2J28k59
$$ 200 124 0 19 -58 -164 -138 -52 -214 -120 -120 -68 -53 -233 -207 19 -13 -91 23 106 79 237 -21 61 189 -70
4985g0r7J87K3J27k09J77m5k49J7R4j59P7O2Qj16j3J57j74J96l27L84O2k7k32
$$ -70 -167 20 43 170 -39 138 93 -156 -139 -45 -204 -127 -65 -57 -173 -186 -29 -203 -7 -334 50 112 85 -147
5009a47j35J49n2R8L52j99K3QR5j27k61L10Jj66L36l53J25Nk7j28J04J3M8r8j3
$$ -147 -282 -133 -185 -87 265 66 89 97 192 65 -196 114 115 -51 285 -68 57 62 35 -93 11 24 72 -26 -39
5034c9j03R7J53j16m1J3n3K51k54J89R0l63J47l7L4r6K20j40J08LQ1m51P17l77
$$ -39 -142 -45 108 -8 -49 -36 -89 162 -92 97 187 -176 -29 -66 -32 -128 92 -48 60 63 144 -307 410 33
5058C3j54M25j55k18j2K26k48j9L0J05Rj22R6N2k05L00l66L87j27j72m8j59L77
$$ 33 -121 304 149 -69 -81 145 -103 -122 -92 13 22 -100 -4 48 -157 143 -223 164 37 -135 -183 -342 35
5081C5l44K18N0L6o2J99r5k3j53J91q0K6L6j59j22R7J74j32J49k36J82o9j26L90
$$ 35 -309 -91 -41 -5 -67 132 37 14 -139 52 -28 -2 34 -125 -247 -150 24 -108 41 -195 -13 -82 -208 182
5105A82l09L43R1m46J96J37m06K00K01l05K0K37n2J90j99M7k01J45k23M24k84
$$ 182 -127 216 307 -139 57 194 -212 -12 189 -116 -96 141 89 279 80 127 -74 71 -152 272 -12
5126a2j39J14Q9K60m59L4L07j65j59P7p5J69n0K41j06j1O6j69j25P2K04l95J4
$$ -12 -151 -37 52 312 -147 -113 194 29 -130 -53 -128 41 -9 232 126 115 181 12 -113 -41 163 -232 -218
5149b18M27k97jj06K38r5N5j58J04Q2%J85k78J60N0j88j7K46k17j02L51k68J06
$$ -218 209 -88 -89 -195 43 -52 3 -155 -51 31 31 216 -62 98 148 -40 -57 189 -28 -130 221 -47 59
5172E9j09j4j7R6M6J17j62j5j55N4L53l00K0J64n2O7k41J31j46j6L10k41Q2N2
$$ 59 -50 -64 -81 15 61 178 16 1 -154 -100 253 -47 -27 137 85 152 -89 42 -104 -120 190 -51 31 83
5196H3k45j33L29J43k32l2j59J51K77l19j38K83j23K88l6j21p9J11o3K87j25n8
$$ 83 -162 -295 34 177 -55 -87 -246 -95 182 -137 -275 8 -115 173 137 16 -63 48 -15 272 147 89
5218H9q8L0j02lJ00J13k19R0k39J11L36r4n3On4n9q1L04j92m5K30j64R3l7o5m9
$$ 89 1 31 -71 -74 26 139 -80 10 -229 -118 218 124 71 77 23 -36 -117 187 -5 -50 180 16 109 72 7 -42
5244d2P5M6m3k05K63k91K66k7j60k00K50l1O1k5J99j40j27QK15j05l34N35m28
$$ -42 33 79 36 -169 94 -197 69 42 -118 -318 -68 -99 -38 -63 136 -4 -131 -123 92 -13 -347 188 -240
5267b40L84m8J5k19J32nj10J33N8j55O7J55lj11j96r7RK73l8j15J47NRP8o2k31
$$ -240 144 96 111 -108 24 19 -91 42 100 -55 12 167 164 53 -143 -240 -231 42 4 -111 36 41 50 128 66 -165
5293a65Q9O2J36j95K0q1n5M31l73J0J47J90m9k63K8K43n0l22M4J68J20k67R9J0
$$ -165 -76 -14 122 -73 -53 -134 -189 242 -131 -121 26 216 167 -96 -68 175 125 -197 -153 15 135 -132 -33 -23
5317b3o0n2oM17l16j41J67J11k07K9p5JJ93k95J38J82N5Q0l1l46P5K12P4n3n9
$$ -23 -83 -135 -141 276 -40 -181 -14 97 -110 -81 -156 -155 38 -257 -119 63 118 198 167 -179 -104 108 182 129 70
5342G0p4JrR8Nk25P7M4q4J85j60N7P9j75J57J4l23L94j23J65j43j80m5J00M19
$$ 70 -4 -3 -12 86 91 -134 -57 -13 -97 88 -72 -15 64 -111 46 60 -263 131 8 173 30 -150 -195 -95 324
5367C24k30k20J36j05L10k45r7L80m47K59l8Kk12J80J65l07j14L38j35R4o6o2
$$ 324 94 -126 10 -95 215 -30 -127 253 -194 65 27 29 -183 -3 162 -145 -259 79 -56 38 -28 -90
5389i0l4J91n1J48k53L5P5m1L30r3l44K87r9n4m0o5J54Q3n5P0k96O2J12q1j5L12
$$ -90 -124 67 16 164 -89 -54 21 -20 310 217 -127 160 61 7 -33 -98 56 139 84 154 -142 -80 32 -49 -64 248
5415B48l67L7r1J75j91K45m58J96K80R1m10K00N5o7o1p4J72O7m5k0L8q6R6j0L36
$$ 248 -119 -82 -173 2 -189 56 -402 -206 74 165 -245 -45 10 -57 -118 -192 -20 47 2 -18 20 -66 30 20 356
5440C56l20j14K36j01J48l53q5K99j53j09M01j54k40J34K1m8J55r4j00K9J93j96
$$ 356 36 -78 158 57 205 -148 -233 66 -87 -196 205 51 -189 -55 -34 -82 73 -21 -121 -92 101 -95
5462i5n3J92j0N6j88k7J42K5Jo8j11L30K3k51k4j80J43J85K6j82J9O7J90l44K08
$$ -95 -148 44 34 90 -98 -125 17 42 43 -25 -136 194 217 -34 -58 -238 -95 90 116 -66 -47 20 210 -134 74
5487G4P0k67Q7j23J05j07L14K9j80j21j14L01J01j15Qn6k3J36j63r2L25l15L10
$$ 74 144 -123 -36 -159 -54 -161 153 182 2 -119 -233 68 169 54 62 6 -17 119 -44 -136 189 -126 184
5510A84m8r2N1J4p4j97R7K32k45L45k27M6p3J31j17J7j3k65L38j54J31n8j8l6
$$ 184 136 44 95 109 35 -162 -65 167 -78 267 40 86 13 144 27 44 31 -234 104 -50 81 23 5 -31
5534c1J23j71q8J92M7r0J70k25J5Q3R8j62O5J69k51j48r8K72J60J86k02j46j02
$$ -31 92 -79 -167 25 72 -18 152 -73 -58 25 123 -39 26 195 -56 -204 -302 -30 130 316 114 -32 -134
5557a34J34o1P6J27k13O9k99J63J3K15l0J99l11k14L23M0k80R2n2N1m7J59k4k4
$$ -134 0 -61 15 142 -71 -2 -301 -138 -125 90 60 259 -52 -266 57 97 -183 -91 -143 -92 -139 20 -4 -28
5581b8R7r2k19L38m0k63M38q4k16K28n8k39L41j64j45J22o7j6j17K06m1J44r0
$$ -28 69 -23 -242 96 56 -207 231 147 -69 159 101 -138 203 39 -106 16 -51 -67 -184 22 -19 125 35
5604C5n1j74K16p1R4m4J61k56P5o9J34k83J41J07j55J95K3Q5j60J6O5k11J78j8
$$ 35 -16 -190 26 -45 49 5 166 -90 -15 -84 50 -233 -92 15 -140 55 78 163 3 19 84 -127 51 33
5628C3j46N9J55j19L8K6NJ4j08OK21k69K57k45J41r2K3K5j82j26N12j50l17M17
$$ 33 -113 -54 101 -18 20 46 51 65 -43 -37 184 -85 172 -73 68 -24 -1 24 -158 -284 228 78 -239 178
5652A78k13o1P5j75L8K77l9q8l1m4j60L51j82J64k49k5K08j74R8j20NK22j03J98
$$ 178 -35 -96 -21 -196 -158 119 80 -8 -39 -83 -243 108 -74 90 -159 -184 24 -150 -52 -172 -167 55 -48 150
5676A50k57R1o7J31k0P9o7j68N3L0l6K93m56K25j47L53k2k28L03k92n0K22Jj42
$$ 150 -107 -16 -83 48 28 107 40 -128 -75 -45 -81 212 -244 -19 -166 187 165 -63 240 -52 -102 120 121 -21
5700b1j0j0P6Rj39J21J17J0L01n15J15L63m94M55j76l6o8n9J7l87K66K94j68m9
$$ -21 -31 -41 35 44 -95 26 143 153 454 -61 54 417 -77 378 202 166 98 39 56 -331 -65 229 61 12
5724A2o0rJ20J10l95M18J6l51J93k2KK9N3M4K9k9ql01m5K26q1p0n8K22l6j36L08
$$ 12 -48 -57 63 173 -222 196 212 -139 54 32 34 63 116 160 189 160 152 -149 -194 32 -49 -119 -177 45 9 -127 181
5751A81k08L3Q5j79j43M50p6k58j39N9K64j9m2k69J07P5J98K9k8j48k23K83K34
$$ 181 -27 6 91 -88 -231 219 143 -115 -254 -195 69 50 8 -261 -154 -79 119 148 120 -28 -251 32 266
5774B66k96k14L63l25L43k54J75j43k9L6o4J88j23L27l16R9M2jj0Lj06L55k56
$$ 266 -30 -244 119 -206 137 -117 58 -85 -114 -78 -142 46 -77 250 -66 33 75 74 64 67 -39 316 60
5797F0j5K7M3o9K3j43J26k62J82j3J65j11o2J90N3o1l01R3M2l36J22P7J85r5l1
$$ 60 45 72 115 46 69 -74 52 -210 -28 -41 124 13 -49 141 194 133 -168 -75 -33 -369 -247 -170 15 -80 -111
5822a11J27J37k52R7%k89L30Ql2k73K77j24K8L24r1j92j2K3J23j1j25J24j87J71
$$ -111 16 153 -99 -2 -2 -291 39 47 15 -258 19 -105 -77 247 156 -36 -48 -25 98 87 -38 86 -101 70
5846G0p4p9N7K0k42J98L16k15K14l65K50j27J6j40j06J29p1m9N16n62K78q7j52
$$ 70 -4 -83 -26 -6 -248 -50 266 51 265 -100 150 23 39 -101 -207 -78 -149 -198 318 -244 34 -53 -205
5869b05K81j8k3k2q7P1L95m55j03J08J95k69J83M7p7J99j38k0J07R6m19J79j95
$$ -205 76 58 35 13 -74 -3 392 -63 -166 -58 137 -132 51 98 21 220 82 62 169 265 -154 25 -170
5892a70L05K79l41q9K7j70K15n4j69K39M1l47K95j83MO7j2K69k34k6m7K36nM3
$$ -170 135 414 73 -16 11 -159 56 2 -167 72 113 -234 61 -122 -118 -51 -63 206 -28 -54 -101 135 130 173
5916A73j26j58K57j70j44K94p0k18J10j08K40o4K9j43k9K58J53j82l41J87N0q3
$$ 173 47 -111 146 -24 -168 126 56 -162 -52 -160 80 16 45 -98 -127 131 284 102 -239 -52 -2 -85
5938h5P6q9K38R0o5j92k04L63n6l38L08p8k6K58o9k59p2M32l91K24j46L22j95
$$ -85 -9 -98 140 230 165 -27 -231 132 76 -262 46 -32 -58 200 131 -128 -200 232 -159 65 -81 241 46
5961D6J00m9l6K84l97RQj03K22N1m22K39jK67l80rL10r0k49J31k05M56j04j27
$$ 46 146 97 61 345 -52 -43 -35 -138 84 135 -287 -48 -49 218 -162 -171 139 49 -200 -69 -274 182 78 -49
5985d9J71l19N67m63P7K2K08k62q9J06j65J36K8L1J7k5j81J37N6O0k85J73k0M3
$$ -49 122 -197 370 -93 -16 6 214 -48 -137 -31 -196 -60 -32 -1 16 -9 -190 -53 3 63 -222 -49 -69 -26
6009b6k74L79p6P6qj64Q1J15j03J49l77L11j78q0L2O2K09o4J5j35J52k77O1K39
$$ -26 -300 79 3 79 71 -93 -12 103 0 149 -228 83 -95 -175 -143 -81 128 64 79 -56 96 -181 -120 119
6033A19k20N2M1j24K06l13K83J21J07l55J61P6L8m35M59j20j98L08j41k5o2K03
$$ 119 -101 -49 -8 -132 74 -239 44 165 272 -83 78 154 192 -243 216 96 -102 206 65 40 -22 181
6055A81j54K4l6J38r3J72l42N0MQLP6L0j06N3k39R9p4p0L69j82j2j01m2J99r5
$$ 181 27 51 15 153 60 232 -110 -60 -56 -48 -45 31 61 -45 8 -231 -132 -206 -276 93 -89 -101 -202 -244 -45 -140
6081a40p0PL56J8j09L0k5P9j92K57k00r0m2J41l85N15k8J4j60q2M6j2J58p2j70
$$ -140 -210 -203 153 171 62 92 67 146 -46 211 11 -79 -121 20 -365 150 122 136 -24 -106 -60 -72 86 14 -156
6106a56J26J27j32n0j48M39M0j74k1O5p1q3m3j19J19K00q2RP5j48K19m10Q4J46
$$ -156 -30 97 -35 -85 -233 206 246 72 51 116 45 -38 -81 -200 -81 119 37 46 121 -27 192 -218 -134 12
6130A2J18m9q3n5o0j35M76j93O3k11M05j66j50M04m60j52M0L48o2k7j91J13N0
$$ 12 130 81 -2 -57 -117 -252 224 31 94 -117 288 122 -28 376 -84 -236 -196 152 90 63 -128 -15 35
6153C5jJ56j71J87j72J6K7J40J6l16K34qk39K00p4r4k8J04m9K43j99O2J60j79
$$ 35 34 190 19 206 34 50 77 217 233 -83 151 143 -96 104 30 -64 -92 12 -37 206 7 69 229 50
6177E0J26k00l1J67J15k60q9L07k29K56Q1l13j14K08j00J81K7l62K55k15P8k59
$$ 50 176 -24 -55 112 227 -33 -122 185 -44 212 293 -20 -134 74 -26 155 182 -180 75 -140 -62 -321
6199c21K17J39k63L30k29O5O0J31q1j47L66j96j26j47J18J21j18k10L58J03j36
$$ -321 -104 35 -228 102 -127 -62 -2 129 48 -99 267 71 -55 -202 -84 37 -81 -291 67 170 34
6220C4o7k1K2j65L71k60L4q3N7K08k47J8M5o3j37K92j20q0K38j48J00l55J92K36
$$ 34 -33 -54 -32 -197 174 -86 -52 -135 -78 130 -117 -99 -54 -117 -254 38 -82 -162 76 -72 28 -327 -135 101
6244A01K3j97K30k8PM2l50qL72k36J14p3j9Q4K58l15k67K84J96n77P9M16L0m5
$$ 101 124 -73 157 129 136 178 -172 -180 192 -44 70 -3 -22 62 320 5 -262 22 218 -359 -280 136 166 121
6268A21q9K2l87K18L69k60j28J64R9l10J93p4m5K36k81K22k60K64N9Lj75n4P8
$$ 121 32 54 -333 -115 254 -6 -134 30 129 -181 12 -62 -107 129 -152 70 -190 74 133 136 -39 -93 -15
6291a5J66j32N4j84PR5J54k29K96q0j15k28K26K20j97OJ20j82j8MN3k33J48J69
$$ -15 151 19 73 -111 -104 -9 145 -84 212 132 17 -211 15 235 38 44 164 -18 -36 -32 21 -212 -64 105
6315A05j83P9P1K4k42k0j14K92j24J51R6j98j06jR9R9N2O2O4k05Q9m6L7L5j26
$$ 105 -78 1 72 96 -146 -166 -280 12 -112 39 135 -63 -169 -170 -71 28 80 142 206 1 90 44 81 116 -10
6340a0K61k41R2KL9j50j42K64j1q9l7k13J73o4J99j01k13J76P9k59K19K49j21
$$ -10 251 10 102 104 143 -7 -149 115 104 15 -22 -235 -62 -126 73 -28 -241 -65 14 -245 -26 223 102
6363A02j11j66L42j02o8N3j27J09R4r7k4j26J17j09P2J98m5n3j69K44n7m3m7J86
$$ 102 -9 -175 167 65 -3 50 -77 32 126 29 5 -121 -4 -113 -41 157 112 59 -110 134 77 34 -13 173
6387A73j65k30K79j15J94l10P7N3k2m4N4j27J01j02J31pK05K0j03l4l1L35n83
$$ 173 8 -222 57 -58 136 -174 -97 -44 -66 -110 -56 -183 -82 -184 -53 -60 145 165 62 28 -3 332 -251
6410b51L03P3q8N3j59P5R6n6K12m67L47Nk79O2l52M96J2k26K41m00K46K93k33
$$ -251 52 125 37 90 -69 6 102 46 258 -209 138 143 -136 -74 -426 70 82 -144 97 -303 -57 236 3
6433Cr8j25L98q7j89jK74j32Q0r6N6j12J54k40L84m05K21J23j37k41jL42k91p
$$ 3 -95 -220 178 91 -98 -99 175 43 123 27 83 -29 125 -115 269 -136 85 208 71 -170 -171 171 -120 -127
6457a27j83N27l07o2R1Q4k23J95j16j16K25J0M4R8j59J56r9q8J6k5l6P4K2k65
$$ -127 -310 217 -90 -152 -61 23 -200 -5 -121 -237 -12 -2 42 140 -19 137 38 -50 -34 -59 -95 -21 1 -264
6481b64J14K22q5l5R2j19k33K24j5o1O6J88q8k9j49p6K47R8K6n0k30R4J29l11
$$ -264 -150 72 -13 -48 44 -75 -308 -84 -99 -160 -94 94 6 -23 -172 -248 -1 97 123 73 -157 -63 66 -245
6505b45M71n8p3J69m07Q8K52r2j54jJ57k59J83k4K01k67j86L02q3o1K73k53J1
$$ -245 226 168 95 264 -143 -55 197 105 -49 -50 107 -152 31 7 208 -59 -245 57 -26 -87 186 -67 -56
6528e6O1R4j77J07j83K75k28J22J12j54M6o9P8J40lj68j06J00NK78m11R4M2k84
$$ -56 5 99 -78 29 -154 121 -107 15 127 -27 19 -50 28 168 165 -3 -109 -9 -4 274 -137 -43 -1 -285
6552b85M74j4m18O07k83k11J23k1l4p2L4L40j85J26q5j55Q3j01M1P6n8KOk19K90
$$ -285 189 175 -243 364 81 -130 -7 -28 -62 -134 -100 240 55 181 96 -59 24 -77 -36 40 -18 -16 -10 -229 61
6577F1j16J72p7j49k07J69K73j25j54J61k46K23J23j00L7r6K03j0p2J60k07J44
$$ 61 -55 117 40 -109 -316 -147 126 1 -153 8 -238 -15 108 8 45 -51 152 142 70 230 23 167
6599A67j36j28j9j3K42K32l03j30j00j9N9L9J55n1k0m7L7j21r2N31l25j72J14
$$ 167 31 -97 -116 -129 113 345 42 -88 -188 -207 -148 -109 46 -5 -25 -72 -35 -156 -248 283 -42 -214 -100
6622a00K56m83J83J64j52j13N70p8m05K02o5M7J32j08k54J69P5m0K55J73o63K12
$$ -100 156 -327 -144 20 -132 -245 325 247 -158 44 -21 26 158 50 -204 -35 40 0 255 428 -235 -23
6644b3q1N5J24J8j33j6n8J96k43J50O1J80m43r3K37L52l42P6K45m24J11J52j29
$$ -23 -104 -49 75 93 -40 -56 -114 82 -161 -11 50 230 -213 -306 -69 283 -59 17 262 -162 -51 101 -28
6667b8j43K61l19J83J03j49J02J60k93O4J75j17j43L50k59M4l95N10P8l55J40
$$ -28 -171 90 -229 -46 57 -92 10 170 -123 -59 116 -1 -144 206 -53 -9 -404 106 184 -171 -31
6688c1Q0j58J63k66M01q4l17p3L48L6q3j19j73L67j41M8J56j12Q8m8k44J31J9
$$ -31 49 -109 54 -212 189 105 -212 -285 63 99 16 -103 -276 91 -50 -2 154 42 130 82 -162 -31 -12
6711a2K60m40M43k12m5J89j44l9j55o3K11N8M6K8j90j5k7J17P7J49m81k5L39j26
$$ -12 248 -192 251 39 -6 183 39 0 -155 -218 -7 51 97 125 -65 -80 -107 10 87 236 -245 -270 69 -57
6735e7r8K42j12J19k07J1J24j73P4m0O6J07j12j10J36M7K3p7O0lP3K6j3m74M05
$$ -57 -155 87 -25 94 -113 -102 22 -151 -77 -117 -51 56 -56 -166 -30 17 40 -37 23 20 93 119 106 -368 37
6760C7j93n1J68j82J81K1l0k1j5K15o0j04j16PL65o11O65m17J37J94k24NJ53J54
$$ 37 -156 -207 -39 -221 -40 -19 -49 -70 -85 130 70 -34 -150 -143 222 -389 276 -141 -4 190 -34 -29 124 278
6784B78m4k76k58J92k19L37k9r3K42k12K66j28j5R4q4O2l2j6k32L94j77k98K92
$$ 278 234 -42 -300 -108 -327 10 -19 -112 130 -82 184 56 41 135 51 113 81 65 -167 227 50 -248 44
6807D4n4J46j02j81L85q5l15Q2q7R7q9P1n8N6j0p9L06j06k95K92M0k6M2j43L8
$$ 44 -10 136 34 -147 238 153 -162 -80 -167 -70 -159 -88 -146 -90 -100 -179 127 21 -274 18 58 32 74 -69 -31
6832c1J4J76Kk56K18L3L2k29j6Q8l6K77m50J50P3ok57K01j1M2K9o8j10N74m62
$$ -31 -17 159 161 -95 123 156 188 -41 -57 31 -5 272 -178 -28 45 39 -218 -17 -28 14 43 -25 -135 439 -23
6857b3PQ0k78%P9K17j46J4j03J29L8k38N4J15K94j48l18K32L07k78j29j66K42
$$ -23 -16 64 -214 -214 -135 82 -64 -50 -153 -24 14 -224 -170 -55 239 91 -227 5 312 34 -95 -261 -19
6880a9j13K48j86J08K6J40l13J03Q6J05j5j12N2k3j54J7j56K14P9K6k05J95J6
$$ -19 -132 116 -70 38 64 204 -109 -6 80 185 170 58 110 87 -67 -50 -206 8 87 113 -92 103 119
6903A19k58J61j72R5J59j37K5k2L8J9q2J99j12k23P2J31J51l41J35r0J66j16j5
$$ 119 -139 22 -150 -55 104 -33 -8 -30 8 27 -55 144 32 -191 -119 12 163 -178 -43 -133 33 -83 -98
6926i8J70j74R3l75K08J42j05K05J50k56J13k23J58P7j77k04J95P3m9K2J40l6
$$ -98 72 -102 -9 -384 -176 -34 -139 66 216 -40 73 -150 8 85 -92 -296 -101 -28 -77 -55 85 49
6948D9j62J73p0j07r0J90rP1k97j10M19J69j54N2j32J22O3r9l7K80l80K00j12
$$ 49 -113 60 -10 -117 -207 -17 -26 45 -252 -362 57 226 72 124 -8 114 177 78 41 321 -59 141 29
6971B9J0k29L1l8J87J27p3k47K45J09o1o5j77K75n5j48k8K72k19L06k08M3J22
$$ 29 39 -190 -159 -197 -10 117 44 -203 42 151 90 25 -152 123 68 -80 -108 164 -55 251 43 86 208
6994B08j77o4J49j14K4K65k27j36p2J19J32j41P7j07n8L32j45R9k36J19M9j36
$$ 208 31 -33 116 2 26 291 64 -72 -144 -25 107 -34 43 -64 -122 210 65 164 -72 47 96 -40
7016d0J87j6k00J66m7r0J12j43M19m32K27n9j51n0J71j53qo5J13K18j13rq1K5
$$ -40 147 131 -69 97 50 -40 72 -71 348 -84 143 84 -67 -117 54 -99 -107 -172 -59 159 46 37 -44 -19
7040a9J7O0j36j08J28J97k89M25j45j11n0Q2j06J08M5J58l83J55j20L5J74l30
$$ -19 -2 58 -78 -186 -58 139 -150 275 130 19 -31 51 -55 53 98 256 -127 28 -92 -57 117 -213
7062b13J83o6K66l28N7R7K0MP8j27o5P3K9qL5K5l10L27j49j55J62J31j88q4L79
$$ -213 -30 -96 170 -158 -101 -4 16 20 98 -29 -94 -21 8 0 35 60 -250 77 -72 -227 -65 66 -122 -206 173
7087A73K44k31k72Q0j4O3q8p5J5mJ48LQ1n2R1k42r2M31m13L35l7k48K43l07J53
$$ 173 417 186 -86 -6 -20 43 -45 -120 -105 -109 39 42 123 71 162 -80 -172 259 -154 181 144 -104 139 -168 -15
7112a5J8k02L23p9J69j33j07R4j9K6j84K42J0p9p6p2J83p6J02m42J97K30J49j46
$$ -15 3 -199 124 45 214 81 -26 68 49 75 -109 133 143 64 -12 -84 99 23 125 -317 -120 110 259 113
7136A13j91K02k79K16QK3p7j13K8j41J82kJ01O4k80K33Oqk27L77k10R2Q2k14R4
$$ 113 -78 124 -155 61 69 92 15 -98 -70 -211 -29 -31 70 134 -146 87 93 85 -142 235 25 117 199 -15 79
7161G9l10J41J36j62N2J04n1nm6M02m43nK16j44M2r0L3N9r5J74k58L85k11k52
$$ 79 -231 -90 46 -116 -64 40 -11 -16 -62 340 -103 -108 108 -36 6 -84 -51 8 -87 87 -171 214 3 -249
7185b49O06l78j05J33J84j66J18q8n1K6N5j05j30J42J50k73K37j77J66k03j05
$$ -249 357 -21 -126 7 191 25 143 55 4 30 85 -20 -150 -8 142 -131 106 -71 95 -108 -213
7206b13J80NK5J19J41n51K11J05m1n2j26K12j40M90m86L23N5m53M1K18J3j79r
$$ -213 -33 -28 -3 116 257 -294 -83 22 -19 -71 -197 15 -125 365 -121 202 257 -196 -155 63 76 -103 -112
7229a12J27n5K0M58o17J37m9K06j34j96K48j58L11J45k37o8k23L39j91L0K56k01
$$ -112 15 -40 -20 438 -179 -42 -91 115 -19 -215 33 -125 186 331 94 26 -197 142 -49 -19 237 36
7251C6qJ61k14K04k11jR0k67K0J11r9J30q5M0J44J65j37M2l02J51J09j96Q1K05
$$ 36 28 189 -25 179 -32 -33 57 -210 -190 -79 -178 -48 -133 -93 51 216 79 121 -181 -30 79 -117 -36 169
7275A69m33O1M02j54j02k15J29N6P5N9L7k4j4l31L04K5j17Q3j12N6J35j46j79
$$ 169 -264 -203 199 45 -57 -272 -143 -87 -12 47 84 60 46 -285 19 44 -73 10 -102 -46 89 -57 -236
7298b36K86Kq9p0J13k0j88J81j09j34N13j14J3k38Q0J44k48K5L16j01N1k62P2
$$ -236 50 52 -37 -107 6 -14 -202 -21 -130 -264 249 135 148 -90 -10 134 -114 -89 227 126 177 -85 -13
7321a3O6J31k12J08n6J21L1l25k7M2j14L29k9p7k6O5l1j98Q8R1o0J03P5NJ2J56
$$ -13 53 184 -28 80 24 145 176 -149 -176 -134 -248 81 52 -25 -51 14 -17 -215 -127 -36 -96 7 82 87 99 255
7347B55j18j49r2J33m2J76j26l86L50m1J61k21M6L1p7m4P1j85M28p5O3m1j45J01
$$ 255 137 -12 -104 29 -13 163 37 -349 1 -40 121 -100 -54 -23 -100 -144 -73 -258 170 95 158 117 -28 73
7371G3j9j57p8K87k65Q7K2J38k48N3J89N5K5m02P3L08j53Mm4r6L87j49k06q3L80
$$ 73 54 -103 -181 106 -159 -72 -50 88 -160 -107 82 137 162 -240 -167 141 -12 -8 -52 -148 239 90 -116 -199 181
7396A81M7m30J1P3K76k15J18O8j30J5j07j16L67k10J02k6J37j88J01l0l23K70
$$ 181 228 -202 -191 -118 158 -57 61 129 -1 14 -93 -209 158 -52 50 24 161 -27 74 44 -279 -9
7418iN2kj37R8j53N6k26K64J82k43P7M4Rj08J63L5j47j30J93j8l2j61J2J81Q8
$$ -9 43 41 -96 2 -151 -95 -321 -57 125 -118 -41 3 12 -96 67 102 -45 -175 18 0 -32 -193 -181 0 88
7443H8K18j76j70K93j92j01l9j53M32k40K06q8l13K63qL4n2L8m1l4j13k4J52j22
$$ 88 306 130 -40 253 61 -40 -79 -232 200 -40 166 78 -235 28 20 54 2 40 -1 -35 -148 -172 -20 -142
7467a42j19K68j62K83j30j96J91l2j35K11l4j32q8K04K00k21M01l33k42j51L03
$$ -142 -261 7 -155 128 -2 -198 -7 -39 -174 37 3 -129 -217 -13 187 -34 367 34 -208 -359 -56
7488e6m9r8K35N0o4j0%n0l1J10l0q8J3K01j53r3J46o1M0j61L86m78K95j2j19J69
$$ -56 -105 -203 32 82 18 8 8 -42 -73 37 7 -81 -68 133 -20 -113 33 -28 12 -149 237 -241 54 42 -77 92
7514I2L1l95L28k40K58j38k6j05J51O5j26J18m6n2K32l01K39k22j11K28J44LN4
$$ 92 123 -272 56 -184 74 -64 -90 -195 -44 21 -105 13 -33 -85 147 -154 85 -137 -248 -20 124 127 181
7537A81j3r9o3l5j40L23j18j07K42p3o4J24p3j97J95m0j29Q4m2J18J9j83J56K93
$$ 181 168 69 6 -29 -169 154 36 -71 171 98 34 158 85 -112 83 43 -86 -2 -44 74 93 -90 66 359
7561C59k77k26N8K10j9j64K01j13O9j18J62J37m50K11J95k07M5m3L7j50j01L2
$$ 359 82 -144 -86 124 105 -59 142 29 98 -20 142 279 -171 40 235 28 73 30 67 -83 -184 -152
7583a52Q5r0J13J68rl87K70j06K45Lk45M7J67k4j34M9j26k26L21j76J69o1L10
$$ -152 -67 -157 -44 124 115 -272 -2 -108 137 140 -105 -58 109 85 -49 0 -126 -352 -31 -207 -38 -99 211
7606B11k81J59j96J62j8K05l46lO5M2J57j20K54k59P3j4j85J34jJ41j21l95L69
$$ 211 -70 89 -107 55 37 242 -104 -107 -42 0 157 37 291 32 105 91 -94 40 39 180 59 -336 33
7629C3K21p9k43m3K41l11J08J65j52J45m5q6P4Mj94n8L42j8j74K47l68J44o2J15
$$ 33 254 175 -68 -111 130 -181 -73 92 -60 85 40 -46 28 32 -162 -220 122 104 -70 177 -191 -47 -109 6
7653Fk4QJ98j9l15K40N8j66p4j78J82l2J23j1k2J30j85j08L18j16j05J69j29j18
$$ 6 -18 -10 188 169 -146 94 152 -14 -88 -266 -84 -116 7 -4 -26 104 -81 -189 129 13 -92 77 -52 -170
7677a70M79o64N60L6m09N5N9m2L74o36M85j65R9J01k22J77l50L61l37K32r4J05
$$ -170 309 -355 205 241 -168 -113 -54 -96 278 -358 127 -38 61 162 -60 117 -233 128 -209 23 -71 34
7699C4m5n9J83K5k52K5R1n1L0K88J53m31k49K68l1j18J44J1K34j01j00m3j66K22
$$ 34 -11 -70 113 138 -114 -89 2 -49 -19 269 422 -9 -258 10 -21 -139 5 16 250 149 49 6 -160 62
7723F2l01J34J06J7J1l3J09o2q1J71k60j6j31M38M6k15J31j1p6k44J61K4O6k12
$$ 62 -239 -105 1 18 29 -4 105 43 -38 133 -127 -143 -274 164 210 -5 126 115 39 -205 -44 -20 46 -166
7747a66J37J39k47J68Np6q2P1N6j60K60j91J04R0J41k50k35N85k62j99K46k11
$$ -166 -29 110 -137 31 36 -40 -122 -51 5 -155 105 -86 18 108 249 -1 -236 349 87 -112 134 -77
7769g7p0J95k00K00j53J09J12j30j21L31m09J44J84j85j75L72j28p4J20m0j34
$$ -77 -147 48 -152 48 -105 4 116 -14 -135 196 -213 -69 115 -70 -245 127 -1 -75 45 5 -129
7790a29q2K88K37k41J7q2PM0r1q0K00j26J3K57j99m85M77P5r2K2q4Q8j29J41j58
$$ -129 -211 77 314 73 90 8 15 55 -36 -116 84 -42 -29 228 29 -456 21 96 4 26 -58 30 -99 42 -116
7815a16N2l57M57p0M4o4Oo3K72l85K50K9K2k71L32k13k71J44L74l19K47k20L26
$$ -116 -64 -421 36 -34 10 -54 -48 -111 161 -224 26 55 77 -194 138 -75 -346 -202 172 -147 100 -120 206
7838B06p1k11J90Rj0j44J75j32K3M6J5j37Ok10K14K31j59M2o4q5Qj11L7j46J72
$$ 206 135 -76 114 123 113 -31 144 12 35 81 96 -41 -35 -245 -31 200 41 83 19 -66 -58 -169 -132 -278 -106
7863a06O6L4J57L00m27n1j7j02K63j30k34M23j42j4j59J55J10r2L13k55L16n95
$$ -106 -40 -6 151 451 24 -27 -44 -146 117 -13 -247 176 34 20 -139 16 126 34 347 92 408 -187
7885a87J05J34K2l16J93J57k11O4JP9J6Qk38J67o9k30M81L9k33p8O7q6Q6k8N0
$$ -187 -82 52 74 -242 -49 108 -103 -39 -38 41 57 65 -173 -6 -75 -305 176 215 -18 -96 -29 -115 -29 -57 -7
7910gN7k41K43J57q9K9J6j09m52L83K74m26J26n9K3M6rO6L51m96J8k7K87l80J70
$$ -7 50 -191 52 209 120 149 165 56 -396 -13 261 -165 -39 -98 -75 -29 -38 28 379 -117 -99 -126 161 -219 -49
7935d9K88k46l8J01m9j83J85m5L0M1r6K2o3K42k12K18k63O9K42j71k30L20j12
$$ -49 239 -7 -45 56 7 -176 9 -36 -6 35 -61 -39 -102 140 -72 146 -117 -48 194 23 -207 113 1
7958AL5K0p4r1J31k0J6M4q0k04j93N28j7l03L91k9l2k50K30M3j59k04r7L27p4
$$ 1 36 56 -18 -109 22 2 18 62 -18 -222 -415 113 96 -207 184 155 123 -127 103 146 -13 -217 -314 13 -61
7983f1J00k95k2J84O84o57j79L38j38j3j63L56j35l34M90k08j35K3K97k41p7K37
$$ -61 39 -256 -278 -94 590 -67 -246 92 -46 -59 -222 134 -1 -335 155 -53 -188 -165 132 -109 -186 51
8005E1J24l83L23L2m3m5r6J0k31K34J12j05K02k76L44l09q5J71j41K76j0k28J07
$$ 51 175 -208 115 147 104 59 -37 -27 -258 -24 88 -17 185 -91 253 -56 -141 30 -111 165 155 -73 34
8028C4k4j84k20K85Nj3O2J28j46J38L3k74L11j88n2m6J68j44K10k9j87J86j10
$$ 34 10 -174 -394 -109 -104 -117 -55 73 -73 65 98 -176 135 -53 -105 -151 17 -127 83 54 -133 53 -57
8051e7R7Ln9J00K9j04Q3l11K13q8%J37J41k62j73J31J86j34j29N9M1J38R1l28
$$ -57 40 43 -16 84 113 9 92 -219 -6 -94 -94 43 184 -78 -251 -120 66 -68 -197 -138 -97 41 132 -196
8075a96M5J48J18k63J09Jn6K10M2k10j70l58N91l3L4j8J07l38K81j35NM2L31l27
$$ -196 -151 -3 115 -148 -39 -38 -94 116 158 -52 -222 -580 11 -22 12 -6 101 -237 44 -91 -86 -44 287 -40
8099d0j61K58j68qN3K48q0j84O6r8P3J11j85K29m6j91N4J15Q8j01J65k59k60K64
$$ -40 -201 57 -111 -119 -66 182 102 -82 -16 -114 -41 70 -115 114 68 -123 -69 46 134 33 198 -61 -321 -57
8123e7j45L47rj43J04j94M1j91RN00Kk84k05Q9J29O0n4o9j12NK58n7o2K37j42
$$ -57 -202 145 136 -7 97 -97 -56 -247 -238 262 264 -20 -225 -136 -7 53 -1 -70 -182 -177 81 24 -38 199 57
8148E7j47j27J91q0j42J66J39O4j50O6J7j13l64M92k89M27k93r0o4n4K45L7o3
$$ 57 -90 -217 -26 -106 -248 -82 57 121 -29 37 54 -59 -423 69 -220 207 -86 -176 -240 -294 -49 -12 -75
8171g5jo2N6m5j89M34j6m38K70J08J02k47l5J96q6k28K11j04K00R5
$$ -75 -76 -138 -82 -127 -316 118 102 -336 -66 42 144 -103 -138 58 -28 -256 -45 -149 51 146
8191A46
$$ Imaginary data points
##PAGE= N=2
##DATA TABLE= (X++(I..I)), XYDATA
0@%%%%%%%%%%Qj6J6j6K4l2M0n3O1p2Q8j04J25j49J71j98K32k67L06l51M00m55
$$ 0 0 0 0 0 0 0 0 0 0 0 8 -8 8 -8 16 -16 24 -29 32 -40 48 -56 69 -80 91 -107 125 -142 164 -187 213 -242
32b42N16n85O56p35Q28r29J036j152J280j422J578j745J929k128K347k589K852
$$ -242 274 -311 345 -390 438 -491 545 -607 673 -749 829 -916 1013 -1115 1232 -1357 1495
49A495l138L456l809M200m638N127n680O314p047P902q918J0146j1663J3596j6150
$$ 1495 -1643 1813 -1996 2204 -2434 2693 -2987 3327 -3720 4182 -4736 5410 -6253 7343 -8807
64h807J9681k4890L3325m9113Q7942l43984m11761J066484q4340o21184M86979
$$ -8807 10874 -14016 19309 -29804 58138 -285846 -697607 368877 284537 -336647 150332
75A50332J07378o71938M12944M52249p07770p5731P04745l07582l18090N32592
$$ 150332 257710 -414228 -1284 450965 -256805 -332536 372209 64627 -253463 279129
85B79129j96954n60856N69147K80298o36481J90584M68519o12576j36602P32115
$$ 279129 82175 -478681 90466 370764 -265717 -75133 393386 -219190 -355792 376323
95C76323k46580n29446N42542J15033n93511L30933L84384o45035k8045O85213
$$ 376323 129743 -399703 142839 257872 -335639 -4706 379678 -265357 -293402 391811
105C91811k98093m16828M82287l6327m68444M52637K80962o27404J4418M93181
$$ 391811 93718 -323110 159177 122850 -345594 107043 388005 -239399 -224981 268200
115B68200l00593j49015M34132k38477l36200N09314N7672n61906K46240L55797
$$ 268200 -32393 -181408 252724 14247 -321953 187361 245033 -316873 -70633 285164
125B85164m46859K4467M84306l84267l39418N40583L6292m62698K97989K33821
$$ 285164 -161695 -137228 347078 -37189 -376607 163976 200268 -262430 35559 269380
135B69380m79229N5959M24188l09019j92980M17316q2667l09502L08418N4184
$$ 269380 -209849 -153890 270298 -38721 -231701 185615 102948 -206554 101864 156048
145A56048m02386J96726L01272l39616l9285L45417k39362k20273L85541q701
$$ 156048 -246338 -49612 251660 -87956 -127241 218176 -21186 -241459 144082 135381
155A35381l54849K45151J85474l67625N0740L16568k70259j41140L70449p1281
$$ 135381 -219468 25683 211157 -156468 -105728 210840 -59419 -200559 169890 98609
165I8609k95555K43880R3431l09516J30145K39561k71881n7337K86930j44646
$$ 98609 -196946 46934 140365 -169151 -39006 200555 -71326 -128663 158267 13621
175A3621j78617K67548m556k59815J82283J32908k73324N0719K37521k13266j00192
$$ 13621 -164996 102552 97996 -161819 20464 153372 -119952 -69233 168288 -44978 -145170
186a45170K84421p3191k34524K02036Q2699k41827R6422J81572k19102n0609K36055
$$ -145170 139251 66060 -168464 33572 116271 -125556 -29134 152438 -66664 -117273 118782
197A18782r6650j48741J95036J0318j97860J24469J12049j97727J8274J78949
$$ 118782 22132 -126609 68427 78745 -119115 5354 117403 -80324 -62050 116899
207A16899j30942p9841J84460m8997j55783J44367N6856j71040O7814J24173j59058
$$ 116899 -14043 -93884 90576 41579 -114204 30163 87019 -84021 -16207 107966 -51092
218e1092k9919J75339p8061j18210J46536J6407j48827Q5026Q7460j44564M849
$$ -51092 -81011 94328 16267 -101943 44593 61000 -87827 -2801 84659 -59905 -55056
229e5056J37994q3531o8415J20924k6706j02330J03789L9998j28466L7831R6213
$$ -55056 82938 -593 -69008 51916 25210 -77120 26669 66667 -61799 -23968 72245
240G2245r3984k2813J05491n6626o9981J06980N777j07546N5958O1106r4225O244
$$ 72245 -21739 -44552 60939 4313 -65668 41312 47089 -60457 -4499 56607 -37618 -31374
252c1374Q8972o4874m7886Q9625j1613p4410O0848L0462p8323K1915N9973n8781
$$ -31374 57598 -7276 -55162 34463 22850 -51560 9288 39750 -38573 -16658 43315 -15466
264a5466j4846O6782l2849m3742O4239M538o4389L4374L7370n4670M313M9551
$$ -15466 -30312 36470 3621 -40121 24118 28656 -35733 -1359 36011 -18659 -14346 35205
276C5205m0521k2917N6222j3744m8483M0727K0449m9924J1622L5857l6489q432
$$ 35205 -5316 -28233 27989 14245 -34238 6489 26938 -22986 -11364 24493 -11996 -20428
288b0428M2196j9340k9130L5760N176l4875J8733K0096l0779J923K8242j9286
$$ -20428 21768 2428 -26702 9058 14234 -20641 -1908 18188 -12591 -10668 17574 -1712
300a712j1856K7418p051k1609K2012P125k4519Q821J7238k1117m490K2398q000
$$ -1712 -13568 13850 6799 -14810 7202 14327 -10192 -1371 15867 -5250 -9740 12658 4658
313D658j6193J3559L634j3359O601P296j2239K68J0615n925n666P700O12n899
$$ 4658 -11535 2024 5658 -7701 -1100 6196 -6043 -5775 4840 -1085 -6751 949 1561 -4338
327d338K291K839j124R89O21k109R46K166L86n86j941J100K613l638j336O003
$$ -4338 -2047 792 -332 657 1278 -831 115 2281 2667 2081 140 1240 3853 215 -1121 4882
343D882k914p630O689L542r378K724P547j0763k423J5132o576j2823J4513L624
$$ 4882 1968 -5662 1027 4569 -4809 -2085 5462 -5301 -7724 7408 832 -11991 2522 6146
357F146j7273R095J2285j7171n94J9560j2250j2098K2811r12k2183J5531J1482
$$ 6146 -11127 -2032 10253 -6918 -7512 12048 -202 -12300 10511 9599 -12584 2947 14429
370A4429k4381O011K2703k3235r937K9612q951k4329K4955P018l1958J3757K4159
$$ 14429 -9952 -3941 18762 -4473 -14410 15202 6251 -18078 6877 13895 -18063 -4306 19853
383A9853l1168m381L4995k0159k3975L6414K278l6590K2569K0510l7940O458L8559
$$ 19853 -11315 -15696 19299 -860 -24835 11579 13857 -22733 -164 20346 -17594 -11136 27423
396B7423l0840j9273M2561q724l6482L5566J3736m6849J6502L6117m0330q818
$$ 27423 -3417 -22690 19871 11147 -25335 10231 23967 -22882 -6380 29737 -10593 -19411
408a9411M6969k5227l4271M9267N618n2678K5368L0992m7258L984M8458l7920
$$ -19411 27558 2331 -31940 17327 22945 -29733 -4365 26627 -20631 -16647 31811 -6109
420f109k7363N5827p177m8778L9860K1034n5234J9145M7390n1075j7850O1263
$$ -6109 -33472 22355 15178 -33600 6260 27294 -27940 -8795 38595 -12480 -30330 30933
432C0933j9689m4169N1011Q199o1033L0944M3268n6600n392N7035l7640l2514
$$ 30933 11244 -32925 18086 26285 -34748 -3804 39464 -17136 -22528 34507 -3133 -35647
444c5647O4134p579o5036M4545L5749o2229J1170N2915n6522k2773P8257j4310
$$ -35647 28487 20908 -44128 417 36166 -26063 -14893 38022 -18500 -41273 36984 22674
456B2674o2781M5404J8971n7645L4174M5625p1257j0988P7590k9564m8852N8793
$$ 22674 -40107 5297 24268 -33377 797 46422 -24835 -35823 41767 12203 -36649 22144
468B2144j859o5824N3378M7244q0024r764O7575l4854k7584O6205k2781o7877
$$ 22144 20285 -45539 7839 55083 -24941 -34705 32870 -1984 -29568 36637 13856 -54021
480e4021O0195L7294p2471J0569N2968n5178q464P8483l8889o9382O8790K9227
$$ -54021 6174 43468 -29003 -18434 34534 -20644 -29108 49375 10486 -58896 9894 39121
492C9121o8270K6863M4146p1417n820Q2663l1353n3498N4181j147n5186N6735
$$ 39121 -29149 -2286 41860 -29557 -35377 47286 15933 -37565 16616 15469 -39717 17018
504A7018L2598q8063L017P9714l9192l6006O0169k6119o0913P6522L9841r0260
$$ 17018 49616 -38447 -35430 44284 5092 -30914 29255 3136 -57777 18745 58586 -31674
516c1674n121O2642l4644q314O1974m2956n8862P3302K4870p2393K2684M3063
$$ -31674 -36795 25847 -8797 -17111 44863 1907 -56955 16347 41217 -31176 -8492 34571
528C4571o0239N788P5838n0008o1881O6840J9718n4628L5540K5175p4274P596
$$ 34571 -25668 -19880 55958 5950 -55931 10909 30627 -24001 11539 36714 -37560 -29964
540b9964P1676l8559l5486N5749j4842m8092N8502J8377q2135J6237P1200m1366
$$ -29964 41712 3153 -32333 23416 8574 -39518 18984 37361 -44774 -28537 42663 1297
552A297k6314N3792k7918m9959O3984K7189o5443J0332M0302m4053J484N7125
$$ 1297 -25017 28775 857 -49102 14882 42071 -23372 -13040 27262 -16791 -15307 41818
564D1818m1720m4300O3917J0979n8987K8979K8998o0945J0344O9257m2602m9447
$$ 41818 98 -44202 19715 30694 -28293 686 29684 -31261 -20917 48340 5738 -43709
576d3709N2393O821m1442L9629J7315o6324J1755N9231l8806k6100N4487j3367
$$ -43709 8684 15505 -25937 13692 31007 -35317 -23562 35669 -3137 -29237 25250 11883
588A1883m4439M5431J4054n9920J9962M9677m1563j4253N0882k6552m4023M7079
$$ 11883 -32556 12875 26929 -32991 -13029 36648 -4915 -19168 31714 5162 -38861 8218
600H218J4930m3312K7046K4873n7814l9N8880l1064l6396N1917M549m9008K9863
$$ 8218 23148 -20164 6882 31755 -26059 -26098 32782 1718 -34678 17239 21788 -27220 2643
613B643K2933n6286O310N9331k7029l0793L8958j1203l7542M4327J8534n5068
$$ 2643 25576 -30710 -24400 34931 7902 -22891 16067 4864 -32678 11649 30183 -24885
625b4885J3620M4829m0257j6010M8558k1828l8247N1249J3833n6518J6949L5862
$$ -24885 -11265 33564 -6693 -22703 25855 4027 -34220 17029 30862 -25656 -8707 27155
637B7155m4097l735N2776k6500l8548M2884N183m1137L1462K3011n4667M248N4473
$$ 27155 -16942 -20677 32099 5599 -32949 9935 15118 -26019 5443 28454 -26213 -21965 32508
650C2508k9553l0726M2559l603l6365L6445J6368n3172Q885M5329k9035j4061
$$ 32508 2955 -27771 14788 11185 -25180 11265 27633 -25539 -16654 28675 -360 -14421
662a4421L8704k3757l3651M8217J2454n2415J5683L6459l7657o380M1820k8681
$$ -14421 24283 526 -33125 15092 27546 -24869 -9186 27273 -10384 -16764 25056 -3625
674c625l0100M9486P597m5414J8883K1640l9906Q210M3281l1470k4041M2439n885
$$ -3625 -33725 15761 23358 -22056 -3173 18467 -21439 -13229 30052 -1418 -25459 16980 11095
687A1095l4088L2326J0697m5555J7589M1479l6161j7721L7855j5770k5762M1302
$$ 11095 -22993 9333 20030 -25525 -7936 33543 -2618 -20339 17516 1746 -24016 17286
699A7286M530m7141J7841L1275l4031m101L4629k4254k0637M0758r41l8920K1741
$$ 17286 21816 -25325 -7484 23791 -10240 -14341 20288 -3966 -24603 16155 15214 -23706 -1965
712a965J9246l2655Q896L0160l0517j4450L8372p914k8587K7605P418l3996J6109
$$ -1965 17281 -15374 -6478 23682 -6835 -21285 17087 9173 -19414 8191 15609 -18387 -2278
725b278K6290l2284p006L3405j4730k0339K9122j387l1914K1311J9465l0740N28
$$ -2278 24012 -8272 -15278 18127 3397 -16942 12180 10793 -21121 190 19655 -11085 -10557
738a0557K6235k0630j1618L0636p158k6387K2096J0471k6497J0311J9299k5443
$$ -10557 15678 -4952 -16570 14066 6908 -19479 2617 13088 -13409 -3098 16201 -9242
750i242l023K9454j2966j9554K3354J582k3640J6601J3999k5972J599K3423j6537
$$ -9242 -12265 17189 4223 -15331 8023 9605 -14035 2566 16565 -9407 -7808 15615 -922
763i22j1912K3246m560j9943J6805P948k1788O846J6158j8119l715K0341r792
$$ -922 -12834 10412 5852 -14091 2714 10662 -11126 -4280 11878 -6241 -9956 10385 593
776E93j2852J8209J81j8076J2334J1222j9059J915J7427j3131q088J7968l000
$$ 593 -12259 5950 6131 -11945 389 11611 -7448 -5533 11894 -1237 -9325 8643 5643
789E643j5124J2966N639j6617N236J2297j3287l167J3987p212r030J4123p81j4261
$$ 5643 -9481 3485 9124 -7493 -2257 10040 -3247 -6414 7573 361 -8669 5454 4673 -9588
803i588Q558P940j3039J326J1916r588n354J2800k140j0137R510L606j1571M352
$$ -9588 -1030 6910 -6129 -4803 7113 -2475 -7829 4971 2831 -7306 2204 5810 -5761 -1409
817a409Q837q928k637J0319m863o331R204N61r457M571N096p490j0O998n374l966
$$ -1409 7428 -1500 -4137 6182 1319 -5012 4192 4753 -4704 -133 4963 -2527 -2537 4461 -913 -4879
833d879P049q04n727M492K510o243J209M564l447j535M688j555l440M108J464
$$ -4879 2170 1366 -4361 131 2641 -3602 -2393 2171 -1276 -2811 1877 322 -3118 990 2454
848B454l773J344K393k868K6L242j074k347R79J262j412K69P07j255p21O69P29
$$ 2454 -1319 25 2418 -450 -424 2818 1744 -603 376 1638 226 495 1202 -53 -774 -105 624
865F24j746k22J732j214j604J894R46k187O44K132k478q24M719m85m887K871L218
$$ 624 -1122 -1344 388 -826 -2430 -536 410 -1777 -1133 999 -1479 -2303 2416 1931 -2956 -85 3133
882C133m351O38M220l734k333N717j282m973M848K383p639J881N700o030q89P316
$$ 3133 -1218 -580 3640 -94 -2427 3290 2008 -2965 1883 4266 -3373 -1492 4208 -1822 -2711 4605
898D605n247o729R727J691r652L812N775q461J164R982p922o369J1886k11r931
$$ 4605 -642 -7371 2356 4047 -5605 -1793 3982 -4479 -3315 6667 -1255 -7624 4262 4051 -5880
913e880Q180M051j2406L809J1718j0637m539J3066n326r876J2497J780j4725P602
$$ -5880 2300 6351 -6055 -2246 9472 -1165 -5704 7362 2036 -7840 4657 6437 -8288 -686
927f86J0177j4855p32J4234j0469q026J7862k245j7491J1939R363j7503L814J6290
$$ -686 9491 -5364 -6096 8138 -2331 -10357 7505 5260 -12231 -292 9071 -8432 -4618 11672
941A1672j4879p415K0168m832j6214J5025M838j8423J0387J4555k1045m262K1537
$$ 11672 -3207 -10622 9546 4714 -11500 3525 8363 -10060 327 14882 -6163 -10425 11112
954A1112q841j1937J9369k670k3091J5521J4830k1875l53J9321j5271p801K4196
$$ 11112 2271 -9666 9703 7033 -16058 -537 14293 -7582 -7935 11386 -3885 -11686 12510
967A2510q406k2669K0638J1427k3935P152J7262k2946m783K9614r609k0713K0469
$$ 12510 4104 -18565 2073 13500 -10435 -3283 13979 -8967 -13750 15864 6255 -14458 6011
980F011M217k3338J3778J5208k5736R24K6169j6369j5056K4741n349k3533K3578
$$ 6011 10228 -13110 668 15876 -9860 -8936 17233 864 -14192 10549 5200 -18333 5245
993E245J3094l1395K981K5109k0208q789K8527r984k3516K3747Q845k8000J0462
$$ 5245 18339 -13056 -10075 15034 -5174 -13963 14564 4580 -18936 4811 13656 -14344 -3882
1006c882J9205k4545j123K9716j6773k1687K6126L577k4252J8191J3855l1496
$$ -3882 15323 -9222 -10345 19371 2598 -19089 7037 10614 -13638 4553 18408 -13088
1018a3088J750K8592j7549j3296K6476p825k3282K4921Q771l2821R552K5412k3558
$$ -13088 -11338 17254 -295 -13591 12885 5060 -18222 6699 15470 -17351 -7799 17613 -5945
1031e945o012K8271j5171k3781K8680Q097k7556J3175J5958k7440J153K8195j8300
$$ -5945 -11957 16314 1143 -22638 6042 14139 -13417 -242 15716 -11724 -10571 17624 -676
1044f76j5033K8577l788k5211K1359R984l2020Q468K9346k1675j2512K5766j0963
$$ -676 -15709 12868 9080 -16131 5228 15212 -16808 -8340 21006 -669 -13181 12585 1622
1057A622k1463K7886P487l0722J0127K0913k4499k611K6809j7805j6574L1241
$$ 1622 -19841 8045 15532 -15190 -5063 15850 -8649 -11260 15549 -2256 -18830 12411
1069A2411J816l1068J3767J5818k4450O228K6815k2586j6611K7900k730k1274
$$ 12411 14227 -16841 -3074 12744 -11706 -5478 21337 -1249 -17860 10040 7310 -13964
1081a3964K1187O694k9688J2030K3754k6460r203K8456r425j8203K6331L28l2774
$$ -13964 7223 13917 -15771 -3741 20013 -6447 -15650 12806 3381 -14822 11509 11837 -20937
1094b0937J4066K3603k2626j595K2756j8989j4714K9367j425k5982J8178J3550
$$ -20937 -6871 16732 -5894 -7489 15267 -3722 -18436 10931 9506 -16476 1702 15252
1106A5252k5101N479K0607k4415q904L2736m176k4164J7049M628k5079J3802K1497
$$ 15252 -9849 -4370 16237 -8178 -17082 15654 11478 -12686 4363 8991 -16088 -2286 19211
1119A9211k4802p125K6597j0506j8161K1215J3k4187J9098J8153k7092n147K2089
$$ 19211 -5591 -12716 13881 3375 -14786 6429 6442 -17745 1353 19506 -7586 -12733 9356
1132I356j2719q749K6386n824k5694J7221J3125k2546N400J7998j9283m924K5698
$$ 9356 -3363 -12112 14274 8450 -17244 -23 13102 -9444 -4044 13954 -5329 -10253 15445
1145A5445r833k1729J8929P163j9264J0653J3567k4382l466K4877r047j3694J7946
$$ 15445 5612 -16117 2812 9975 -9289 1364 14931 -9451 -12917 11960 2913 -10781 7165
1158G165k066j9566J5303J2069k2595J488K0575j2858q678J7629o705j6328J8753
$$ 7165 5099 -14467 836 12905 -9690 -8202 12373 -485 -9163 8466 1761 -14567 4186
1171D186R608k0862L220J3517j5444k206K0533r230j4693J6548L379j8014Q489
$$ 4186 13794 -7068 -3848 9669 -5775 -7981 12552 3322 -11371 5177 8556 -9458 -969
1184i69J0105j6680J631J8336j1329j2147J4482j285j1710J3459N837j8398L217
$$ -969 9136 -7544 -5913 12423 1094 -11053 3429 2144 -9566 3893 9730 -8668 -5451
1197e451J3911j1578l893J5364o697j1083J4533K973j6281N831J0963j2320rJ3656
$$ -5451 8460 -3118 -7011 8353 1656 -9427 5106 8079 -8202 -2371 8592 -3728 -3737 9919
1211I919r293r225J3307L92j1800Q567M996j2856K372J0985r869m180J2294m239
$$ 9919 626 -8599 4708 5100 -6700 1867 6863 -5993 -3621 7364 -2505 -6685 5609 1370
1225A370r068J0470J845j2401O012R083j0395j549J0908n976o868J0962K81j0336
$$ 1370 -7698 2772 4617 -7784 -1772 7311 -3084 -4633 6275 299 -6569 4393 4674 -5662
1239e662O272N568r687J248Q779p653l608J0072k769q040O856K054q882M482O955
$$ -5662 610 6178 -3509 -2261 6518 -1135 -4743 5329 2560 -5480 1376 3430 -5452 -970 5985
1254E985q788j808Q548m670m784Q785o84q100N251M764p836P89P543n868l258
$$ 5985 -2803 -4611 3937 -733 -5517 3268 2584 -5516 -265 4499 -3337 -2548 4995 -873 -4131
1269d131Q108j473o433M944K411o262K510M807n382j460N524k711l680N169K1
$$ -4131 3977 2504 -3929 1015 3426 -2836 -326 4481 -901 -2361 3163 452 -3228 1941 1962
1284A962n759L284L174n551M85N556m205k755N986r84m969M255K190m855P92M485
$$ 1962 -3797 -513 2661 -2890 -2405 3151 -1054 -3809 2177 1193 -3776 479 2669 -2186 -1394 3091
1300C091l262j937M550j260l220L265J013l488J802J610l407M65L415l123j603
$$ 3091 -171 -2108 2442 1182 -2038 1227 2240 -1248 554 2164 -1243 -778 2637 -486 -2089
1315b089L383p92l176L004J426l719L84L018k154j306K984n71k293J816J316k021
$$ -2089 1294 502 -2674 330 1756 -1963 -1579 1439 -715 -2021 963 392 -1901 -85 1231 -790
1331g90O54J541j919Q9K013q22j119J416p5j591J047J112j887j84J530j237q00
$$ -790 -136 1405 -514 -425 1588 766 -353 1063 988 -603 444 1556 -331 -515 1015 -222 -1022
1348a022J820k85j889Q37Q38j314K05J081j140k45J031N5p35O36M53p49K10J049
$$ -1022 798 513 -1376 -539 299 -1015 -810 271 -869 -1114 -83 -28 -763 -127 326 -423 -213 836
1366H36k95l65J75K82o14L96L90m04l77J90j33R4Q1l03j88j93O73l37l02L33n71
$$ 836 541 176 351 633 19 415 805 401 24 214 81 175 256 -47 -235 -428 245 -92 -394 -61 -632
1387f32n30Q65N49p28k76Q69j96q43J197J243j899J31J020n13m10J453l11j642
$$ -632 -1162 -297 252 -476 -752 117 -79 -922 275 1518 -381 -250 770 257 -153 1300 989 -653
1405f53Q88P30j027K24M97j314J88J426j133j518J904K9j842J611J093k596p4
$$ -653 235 965 -62 162 659 -655 -467 959 -174 -1692 212 241 -1601 10 1103 -1493 -1567
1422a567K311r88j371K566M4k494J758J211k500N52K805k141j260K996q23l179
$$ -1567 744 -244 -1615 951 995 -1499 259 1470 -1030 -478 2327 186 -1074 1922 1099 -2080
1438b080K798J652l639L12K976k600j539L816j342l104L276J241l954J457K323
$$ -2080 718 2370 -1269 -957 2019 -581 -2120 1696 354 -2750 526 1767 -2187 -730 1593
1453A593l915j36N513k352l588L889J65m065L278L637n207q19M842k354k870M636
$$ 1593 -2322 -2458 3055 703 -2885 1004 1169 -2896 382 4019 -1188 -2007 2835 481 -2389 2247
1469B247n97m765M645K240n941P22M013m207j127P064l549n409M869J819n939
$$ 2247 1650 -3115 1530 3770 -2171 -1449 2564 -1643 -2770 4294 745 -4664 205 2024 -3915
1484c915L444M427o394r56P107l930m144O844K09o668N091L532q325P91P921m350
$$ -3915 -471 3956 -2438 -3394 3713 -217 -4361 2483 2692 -3976 1115 4647 -3678 -2887 5034 684
1500F84l502O785k369p162O874L413q635K545O361o813j620P883m766o236Q828
$$ 684 -2818 3967 1598 -5564 1310 4723 -3912 -1367 4994 -1819 -3439 4444 -322 -6558 2270
1515B270K137q380L001M350q100J479R590n775o236Q356j49p655O737L632r847
$$ 2270 4407 -3973 -972 3378 -4722 -3243 6347 572 -5664 2692 2543 -5112 1625 5257 -4590
1530d590K547R408p767m507Q477k635o348R729J749j1707L040P560q588M90R718
$$ -4590 -2043 7365 -402 -4909 3568 933 -5415 4314 6063 -5644 -2604 4956 -3632 -3142 6576
1545F576o876o416J0239L8j1085P239N840r781J842R457r272n505J2062p21q428
$$ 6576 -300 -6716 3523 3561 -7524 -285 5555 -4226 -2384 7073 -2199 -7704 4358 3637 -4791
1560d791P791K151j1499M522R474r984k258J1308n152p555R370k99j1033P510
$$ -4791 3000 5151 -6348 -1826 7648 -2336 -4594 6714 1562 -5993 3377 3078 -7955 -445
1574d45Q965j0794k029Q918p320m246J2721j827j0852P290M591j0977L383R074
$$ -445 8520 -2274 -4303 4615 -2705 -6951 5770 3943 -6909 381 4972 -6005 -2622 6452
1588F452r354k349J2810m590j0636R098K738r731O940P670j2410k330J1122n571
$$ 6452 -2902 -5251 7559 2969 -7667 1431 4169 -5562 1378 9048 -3362 -5692 5430 -141
1602a41n597J1066j469j0904P945M984j2018J957J0769p363m478J1069m932j0453
$$ -141 -5738 5328 3859 -7045 900 5884 -6134 -4177 6592 -771 -5249 5820 888 -9565
1616i565J0682N209j0657L573O910j0216j225J1941n328p501R948J374j0639N828
$$ -9565 1117 6326 -4331 -758 6152 -4064 -5289 6652 1324 -6177 3771 5145 -5494 334
1630C34N324j0679J358J1709o459p248Q678j991q263R455M759j1472J686Q008
$$ 334 5658 -5021 -3663 8046 1587 -5661 3017 1026 -7237 2218 6977 -4495 -2809 5199
1644E199q510k144J0911m447p442R542J823j0853M283O589q330O10J0353o679
$$ 5199 -3311 -5455 5456 1009 -6433 3109 4932 -5921 -1638 4951 -3379 -2769 7584 905
1658I05p194Q593J68p353O959M153j0024R83Q198p073l056R230k134p623P458
$$ 905 -6289 2304 2472 -4881 2078 6231 -3793 -2810 5388 -1685 -4741 4489 2355 -5268 2190
1673B190J619r579L063P618o782j276Q004m968o262Q447J566p847M413M609p843
$$ 2190 3809 -5770 -2707 4911 -1871 -3147 4857 -111 -6373 2074 3640 -4207 206 4815 -3028
1688c028M05P792n787l944Q288m71o991N130K252q038K836P148o248k650O711
$$ -3028 -2623 5169 -618 -4562 3726 3255 -3736 1394 3646 -4392 -1556 5592 -656 -3306 3405
1703C405l426m951P138J358p689L150M640o482J29O136l916l980P622m86o821
$$ 3405 -21 -4972 2166 3524 -4165 -1015 3625 -2857 -2728 3408 -508 -4488 3134 2648 -4173
1718d173M149L337o208J655O240n176l363O292j554m841N467J709o394K150M350
$$ -4173 -24 3313 -2895 -1240 5000 -176 -3539 2753 1199 -3642 1825 3534 -2860 -710 3640
1733C640n578j094O288l235l429N452k50n957L398L733n187K62N125l721k712
$$ 3640 -1938 -3032 3256 21 -3408 2044 1794 -4163 -765 2968 -2219 -1957 3168 -553 -3265
1748c265N261p16m433M085K015m983J615L213m124o67N177j826l739L863M59m720
$$ -3265 1996 1280 -3153 932 2947 -2036 -421 2792 -1332 -1999 3178 1352 -2387 1476 1935 -2785
1764b785K811K847m538l4M139k843k115M187p80l641K860J959m145R66L155k731
$$ -2785 26 2873 -1665 -1699 2440 -403 -2518 1669 889 -2752 108 2067 -2078 -1112 2043 -688
1780f88j344L881r68l211L557M09l579J911K636l364j77K987k041j731L157k38
$$ -688 -2032 1849 881 -2330 1227 1636 -1943 -32 2604 -760 -937 2050 9 -1722 1435 1197
1796A197k795K117J099l185Q73K626k837r44L078r47k157K218O02l020J802J884
$$ 1197 -1598 519 1618 -1567 -694 1932 -905 -1849 1229 282 -1875 343 945 -2075 -273 1611
1812A611k239l63K419j522j166K300n0k473K052J102k641P53K144k160p42K267
$$ 1611 -628 -991 1428 -94 -1260 1040 990 -1483 569 1671 -970 -217 1927 -233 -975 1292
1828A292r19j839K496l19k263J487J114k209L25J807j344j008J933k11j538J158
$$ 1292 373 -1466 1030 711 -1552 -65 1049 -1160 -835 972 -372 -1380 553 342 -1196 -38
1844c8P56j787N82J605j341m53J417m38j046J589J53j573O68J001j514L83J082
$$ -38 718 -1069 -487 1118 -223 -676 741 303 -743 846 999 -574 94 1095 -419 -36 1046
1861A046j032q62J273k02j118P10R35j622K58J341j349l26J545p42r69R01J178
$$ 1046 14 -848 425 223 -895 -185 750 -872 -614 727 -622 -948 597 -145 -1114 -213 965
1878I65j410j36J075n31p2M17j9l70N97k11l65N89J79j112L52L28m28l23N90J64
$$ 965 -445 -581 494 -37 -109 308 289 -81 516 305 -60 529 708 -404 -52 276 -152 -475 115 279
1898B79p87L6L64m09K06L66k85k3r7K82j49k1O0m4J36O25k10m09J18N84k47j36
$$ 279 -508 -472 -108 -517 -311 55 -230 -253 -350 -68 -217 -238 -178 -222 -86 539 329 -80 38 622 375 239
1920B39M89n26l76J83P37p98j26L59m60j89M45Q9o74L58L86r62K04P73n15o60
$$ 239 728 202 -174 9 746 -52 -178 181 -279 -468 -23 66 -608 -250 136 -826 -622 151 -364 -1024
1940a024J291o5r59P76P30j091P0J271j006m09J159l75q52P21J56q35M00J071
$$ -1024 267 202 -757 19 749 -342 -272 999 -7 -416 743 368 -484 237 393 -442 -42 1029
1958A029j629k12J167k86n86O57K01j568P04J030j258n8J368q64m09J615n69j628
$$ 1029 -600 -812 355 69 -517 140 341 -1227 -523 507 -751 -809 559 -305 -714 901 332 -1296
1976a296J427J156j661M93J307j636q18K253m08j548J608J93k020R03J315k033
$$ -1296 131 1287 -374 119 1426 -210 -1028 1225 817 -731 877 1070 -950 -47 1268 -765
1992g65J70K165j628j211J574K37k251J791J655k853MK339j739r83K462j49k378
$$ -765 -595 1570 -58 -1269 305 542 -1709 82 1737 -1116 -1112 1227 -512 -1495 967 818 -1560
2009a560K120J006k963O86K117j462p27K848j491k443K233R04k257R59J956k941
$$ -1560 560 1566 -1397 -711 1406 -56 -783 2065 574 -1869 364 1268 -989 -30 1926 -1015
2025a015l21K695j369j825K631N64k991J507J590l712N23L551j424j514K728j057
$$ -1015 -1336 1359 -10 -1835 796 1360 -1631 -124 1466 -2246 -1723 1828 404 -1110 1618 561
2041E61l099K968J584l156R38K517k821j158L276j027k590L028J107l587M15K547
$$ 561 -2538 430 2014 -1142 -204 2313 -508 -1666 1610 583 -2007 1021 2128 -1459 -1044 1503
2057A503k900R1L549j822k867L210J9k929K133K115l533J15L491k330k373L312
$$ 1503 -1397 -1306 2243 421 -2446 764 783 -2146 -13 2102 -1431 -1316 2175 -155 -2528 784
2073G84J24k251K428J227l824J56L135j879q68L177j845k831L394Q55l478J328
$$ 784 908 -1343 1085 2312 -1512 -1356 1779 -100 -968 2209 364 -2467 927 1782 -1696 -368
2089c68K421k974r8K760k460k423L888R81l017J503J286l821P97L709j878j950
$$ -368 2053 -921 -1019 1741 -719 -3142 746 1727 -1290 213 1499 -2322 -1525 2184 306 -1644
2105a644L387j150k998L114J209l517J113L129k831j157K914j602j918L567O61
$$ -1644 1743 593 -2405 709 1918 -1599 -486 2643 -188 -1345 1569 -33 -1951 1616 2277
2120B277m018J325J887l234P64L583k527k533L562k36k990J912J872l226P77L359
$$ 2277 -1741 -416 1471 -1763 -999 2584 57 -2476 1086 850 -2140 -228 1644 -1582 -805 2554
2136B554l165j557L216n55j769K916J99l788J147K860k779k66L276k206k265L780
$$ 2554 -611 -2168 1048 493 -1276 1640 1839 -1949 -802 2058 -721 -987 2289 83 -2182 1598
2152A598N6l898J843J854k663M52L013k904k225L605K54k576J972J026l328J138
$$ 1598 1654 -2244 -401 1453 -1210 -758 2255 -649 -2874 731 985 -1591 381 1407 -1921 -783
2168g83K923k560j065K829r72j891K493K16k930J585K282k438n72K143j483j729
$$ -783 2140 -420 -1485 1344 372 -1519 974 1190 -1740 -155 2127 -311 -883 1260 -223 -1952
2184a952K998J61k833J632J283k522K77K433j869j370L131p58k534K032R72k034
$$ -1952 1046 1207 -1626 6 1289 -1233 -956 1477 -392 -1762 1369 611 -1923 109 1081 -953
2200i53P46J882k271q73K535q69j471K235M74k853J363J485j866j52J988j356
$$ -953 -207 1675 -596 -1469 1066 197 -1274 961 1435 -1418 -55 1430 -436 -588 1400 44
2216D4j174K481n11k461J501J042j759K80J603j859o05J909q7j755J470Q32k019
$$ 44 -1130 1351 840 -1621 -120 922 -837 -557 1046 -813 -1418 491 404 -1351 119 951 -1068
2233a068N62J437j071l70J650q36j168J672J64j820J213O71j401j7J508j047j130
$$ -1068 -506 931 -140 -510 1140 304 -864 808 972 -848 365 1036 -365 -382 1126 79 -1051
2250a051J542l0j335J245K09j559L39J484j310n01J480m17r05J350n8j081M89
$$ -1051 491 461 -874 371 580 -979 -640 844 -466 -967 513 96 -809 541 483 -598 -109
2267a09O09j069M76J037r06o87J258l20r83P48J113j679M51R41p62q09J242k84
$$ -109 500 -569 -93 944 38 -649 609 289 -694 54 1167 -512 -61 880 118 -691 551 267
$$ [...]
8191e4
##END NTUPLES=NMR FID
##END=
