##TITLE=1H_PrEtNCO
 CDCl3
 8 sc, 
 5.05.2022
##JCAMPDX= 6.0         $$ Bruker NMR JCAMP-DX V2.0
##DATA TYPE= NMR FID
##DATA CLASS= NTUPLES
##ORIGIN= UXNMR, Bruker Analytische Messtechnik GmbH
##OWNER= root
$$ XWIN-NMR		Version 3.5
$$ Thu May  5 10:51:34 2022 Russian Standard Time (UT+4h)  she@DPX200
##.OBSERVE FREQUENCY= 200.13135
##.OBSERVE NUCLEUS= ^1H
##.DELAY= (6, 6)
##.ACQUISITION MODE= SIMULTANEOUS
##.ACQUISITION SCHEME= undefined
##.AVERAGES= 8
##.DIGITISER RES= 18
##SPECTROMETER/DATA SYSTEM= spect
##.PULSE SEQUENCE= zg30
##.SOLVENT NAME= CDCl3
##.SHIFT REFERENCE= (INTERNAL, CDCl3, 0, 15.7039)
##AUDIT TRAIL= $$ (NUMBER, WHEN, WHO, WHERE, WHAT)
$$ ##TITLE= Audit trail, XWIN-NMR		Version 3.5
$$ ##JCAMPDX= 5.01
$$ ##ORIGIN= Bruker BioSpin GmbH
$$ ##OWNER= she
$$ F:/spectra/data/she/nmr/H-F/1/audita.txt
$$ ##AUDIT TRAIL=  $$ (NUMBER, WHEN, WHO, WHERE, WHAT)
(   1,<2022-05-05 10:49:47.70 +0400>,<she>,<DPX200>,
      <created by zg, POWCHK disabled, PULCHK disabled
       configuration hash MD5:
       00 E9 B6 7A A2 85 ED C7 34 08 36 98 17 FE 4E 26
       data hash MD5: 16K
       0B F4 4E 15 C7 32 A9 F9 5E 39 8B 87 24 76 BB 1E>)
$$ ##END=
$$ 
$$ hash MD5
$$ C2 F6 C9 C2 AD 9A FC A7 7C 5E EF 87 4D 88 7B 2B
##$RELAX= 
##$RELAX= 
##$RELAX= 
##$RELAX= 
##$RELAX= 
##$RELAX= 
$$ Bruker specific parameters
$$ --------------------------
##$DU= <F:/spectra>
##$EXPNO= 1
##$NAME= <H-F>
##$PROCNO= 1
##$TYPE= <nmr>
##$USER= <she>
##$AMP= (0..31)
100 100 100 100 100 100 100 100 100 100 100 100 100 100 100 100 100 100 
100 100 100 100 100 100 100 100 100 100 100 100 100 100 
##$AQSEQ= 0
##$AQ_mod= 1
##$AUNM= <au_zg>
##$AUTOPOS= <>
##$BF1= 200.13
##$BF2= 200.13
##$BF3= 200.13
##$BF4= 200.13
##$BF5= 200.13
##$BF6= 200.13
##$BF7= 200.13
##$BF8= 200.13
##$BYTORDA= 1
##$CFDGTYP= 0
##$CFRGTYP= 5
##$CHEMSTR= <none>
##$CNST= (0..31)
1 1 145 1 1 1 1 1 1 1 1 1 1 1 1 1 1 1 1 1 1 1 1 1 1 1 1 1 1 1 1 1 
##$CPDPRG= <>
##$CPDPRG1= <>
##$CPDPRG2= <>
##$CPDPRG3= <>
##$CPDPRG4= <mlev>
##$CPDPRG5= <mlev>
##$CPDPRG6= <mlev>
##$CPDPRG7= <mlev>
##$CPDPRG8= <mlev>
##$CPDPRGB= <>
##$CPDPRGT= <>
##$D= (0..31)
0 1.2 0 0 0 0 0 0 0 0.06 0 0.03 0 0 0 0 0.0002 0 0 0 0 0 0 0 0 0 0 0 0 
0 0 0 
##$DATE= 1651733387
##$DBL= (0..7)
120 120 120 120 120 120 120 120 
##$DBP= (0..7)
150 150 150 150 150 150 150 150 
##$DBP07= 0
##$DBPNAM0= <>
##$DBPNAM1= <>
##$DBPNAM2= <>
##$DBPNAM3= <>
##$DBPNAM4= <>
##$DBPNAM5= <>
##$DBPNAM6= <>
##$DBPNAM7= <>
##$DBPOAL= (0..7)
0.5 0.5 0.5 0.5 0.5 0.5 0.5 0.5 
##$DBPOFFS= (0..7)
0 0 0 0 0 0 0 0 
##$DE= 6
##$DECBNUC= <off>
##$DECIM= 32
##$DECNUC= <off>
##$DECSTAT= 4
##$DIGMOD= 1
##$DIGTYP= 9
##$DL= (0..7)
0 120 120 120 120 120 120 120 
##$DP= (0..7)
150 150 150 150 150 150 150 150 
##$DP07= 0
##$DPNAME0= <>
##$DPNAME1= <>
##$DPNAME2= <>
##$DPNAME3= <>
##$DPNAME4= <>
##$DPNAME5= <>
##$DPNAME6= <>
##$DPNAME7= <>
##$DPOAL= (0..7)
0.5 0.5 0.5 0.5 0.5 0.5 0.5 0.5 
##$DPOFFS= (0..7)
0 0 0 0 0 0 0 0 
##$DQDMODE= 0
##$DR= 18
##$DS= 0
##$DSLIST= <SSSSSSSSSSSSSSS>
$$ [...]
##$SUBNAM2= <"">
##$SUBNAM3= <"">
##$SUBNAM4= <"">
##$SUBNAM5= <"">
##$SUBNAM6= <"">
##$SUBNAM7= <"">
##$SUBNAM8= <"">
##$SUBNAM9= <"">
##$SW= 18.05172834244
##$SWIBOX= (0..15)
0 0 2 0 0 0 0 0 0 0 0 0 0 0 0 0 
##$SW_h= 3612.71676300578
##$TD= 16384
##$TD0= 1
##$TE= 0
##$TE2= 300
##$TE3= 300
##$TEG= 300
##$TL= (0..7)
0 120 120 120 120 120 120 120 
##$TP= (0..7)
150 150 150 150 150 150 150 150 
##$TP07= 0
##$TPNAME0= <>
##$TPNAME1= <>
##$TPNAME2= <>
##$TPNAME3= <>
##$TPNAME4= <>
##$TPNAME5= <>
##$TPNAME6= <>
##$TPNAME7= <>
##$TPOAL= (0..7)
0.5 0.5 0.5 0.5 0.5 0.5 0.5 0.5 
##$TPOFFS= (0..7)
0 0 0 0 0 0 0 0 
##$TUNHIN= 0
##$TUNHOUT= 0
##$TUNXOUT= 0
##$USERA1= <user>
##$USERA2= <user>
##$USERA3= <user>
##$USERA4= <user>
##$USERA5= <user>
##$V9= 5
##$VALIST= <valist>
##$VCLIST= <CCCCCCCCCCCCCCC>
##$VD= 0
##$VDLIST= <DDDDDDDDDDDDDDD>
##$VPLIST= <PPPPPPPPPPPPPPP>
##$VTLIST= <TTTTTTTTTTTTTTT>
##$WBST= 1024
##$WBSW= 4
##$XGAIN= (0..3)
0 0 0 0 
##$XL= 0
##$YL= 0
##$YMAX_a= 612644
##$YMIN_a= -545340
##$ZGOPTNS= <>
##$ZL1= 120
##$ZL2= 120
##$ZL3= 120
##$ZL4= 120
##$ABSF1= 10
##$ABSF2= 0
##$ABSG= 5
##$ABSL= 3
##$ALPHA= 0
##$AQORDER= 0
##$ASSFAC= 0
##$ASSFACI= 0
##$ASSFACX= 0
##$ASSWID= 0
##$AUNMP= <proc_1d>
##$AZFE= 0.1
##$AZFW= 0.1
##$BCFW= 1
##$BC_mod= 2
##$BYTORDP= 1
##$COROFFS= 0
##$CY= 11.3945322036743
##$DATMOD= 1
##$DC= 2
##$DFILT= <>
##$DTYPP= 0
##$F1P= 2.36226072786647
##$F2P= -0.459571619588291
##$FCOR= 0.5
##$FTSIZE= 0
##$FT_mod= 4
##$GAMMA= 1
##$GB= 0.15
##$INTBC= 1
##$INTSCL= 1
##$ISEN= 128
##$LB= 0.24
##$LEV0= 0
##$LPBIN= 0
##$MAXI= 10000
##$MC2= 0
##$MEAN= 0
##$ME_mod= 0
##$MI= 1.114404
##$NCOEF= 0
##$NC_proc= 0
##$NLEV= 6
##$NOISF1= 3.799351
##$NOISF2= 2.8
##$NSP= 1
##$NTH_PI= 0
##$NZP= 0
##$OFFSET= 15.70392
##$PC= 1
##$PHC0= -18388.79
##$PHC1= 9.00075
##$PH_mod= 1
##$PKNL= yes
##$PPARMOD= 0
##$PSCAL= 0
##$PSIGN= 0
##$REVERSE= no
##$SF= 200.130013532006
##$SI= 16384
##$SIGF1= 3
##$SIGF2= 2
##$SINO= 400
##$SIOLD= 16384
##$SREGLST= <1H.CDCl3>
##$SSB= 0
##$STSI= 0
##$STSR= 0
##$SW_p= 3612.71676300578
##$SYMM= 0
##$S_DEV= 0
##$TDeff= 0
##$TDoff= 0
##$TI= <>
##$TILT= no
##$TM1= 0
##$TM2= 0
##$TOPLEV= 0
##$USERP1= <user>
##$USERP2= <user>
##$USERP3= <user>
##$USERP4= <user>
##$USERP5= <user>
##$WDW= 1
##$XDIM= 8192
##$YMAX_p= 0
##$YMIN_p= 0
$$ End of Bruker specific parameters
$$ ---------------------------------
##NTUPLES= NMR FID
##VAR_NAME=  TIME,          FID/REAL,        FID/IMAG
##SYMBOL=    X,             R,               I
##VAR_TYPE=  INDEPENDENT,   DEPENDENT,       DEPENDENT
##VAR_FORM=  AFFN,          ASDF,            ASDF
##VAR_DIM=   8192,          8192,            8192
##UNITS=     SECONDS,       ARBITRARY UNITS, ARBITRARY UNITS
##FACTOR=    0.0002768,     1,               1
##FIRST=     0,             0,               0
##LAST=      2.2672688,     0,               0
##MIN=       0,             -545340,         0
##MAX=       2.2672688,     612644,          0
$$ Real data points
##PAGE= N=1
##DATA TABLE= (X++(R..R)), XYDATA
0 0 0 0 0 0 0 0 0 0 -2 1 -8 8 -15 16 -17 24 -32 40 -47 56 -65 81 -94 113 -129 153 -176 205 -235 271 -310 354
32 354 -402 454 -515 579 -649 727 -815 907 -1011 1122 -1245 1379 -1525 1686 -1859 2053
48 2053 -2262 2491 -2743 3022 -3332 3677 -4063 4500 -4995 5566 -6227 7010 -7947 9102
62 9102 -10558 12460 -15068 18881 -25010 36513 -65793 311786 494598 74839 210759
73 210759 474048 612644 325746 12290 -93260 52292 78501 -79067 -287858 -331187
83 -331187 -330789 -363453 -406716 -335194 -246528 -265967 -388415 -366827 -121465 150317 151081 -57741
95 -57741 -121737 158466 485977 492511 210263 40805 197371 458267 462251 191658 -44818
106 -44818 -18134 122006 115992 -52931 -193002 -210152 -188778 -217532 -242680 -201138 -160027 -207294
118 -207294 -281552 -228057 -30690 106670 21785 -145823 -113937 146017 337032 238660 6559
129 6559 -47548 144192 328980 261836 28775 -82830 19838 143298 104611 -36781 -112276
140 -112276 -86136 -50807 -61893 -78807 -60662 -50687 -99998 -147561 -88299 45576 86095 -34200
152 -34200 -148043 -79047 104466 178108 49841 -116580 -101914 77684 185021 83557 -85929
163 -85929 -108465 15343 107138 66628 -29421 -57875 -6413 36243 25314 10281 25668 31812
175 31812 -6973 -34221 15880 87823 68415 -38478 -102553 -36955 76343 80434 -46148 -150839
187 -150839 -102705 28675 62862 -37933 -131650 -102443 2673 53637 8061 -50554 -38953
198 -38953 23872 60446 49130 40930 56641 59707 38054 33504 67860 93658 59170 -9863 -35407
211 -35407 10175 60104 25666 -72286 -116350 -59452 10042 -4189 -82965 -126225 -85350 -14166
223 -14166 6400 -32599 -61253 -31180 18739 35938 27876 29168 43746 51027 49420 56570 72711
236 72711 76338 50453 13150 8937 41670 55401 12658 -45411 -56960 -22180 -1672 -28540
248 -28540 -74764 -89274 -57004 -21143 -26430 -55681 -60860 -33004 -2493 6799 6422 10832 20739
261 20739 31999 38987 43640 52276 56350 45698 32291 34014 46011 39632 11453 -10064 -10480 -1678
275 -1678 -1552 -22238 -48587 -53638 -38060 -27978 -37816 -48765 -43179 -28914 -17773 -11666 -10488 -6226
289 -6226 7090 20909 26764 29087 34157 38158 35401 33844 36800 35585 28961 20680 11548 4353 -122
304 -122 -5623 -16300 -26986 -28170 -26527 -31126 -35790 -35945 -33719 -28701 -21093 -14708 -10657 -5232 4713
319 4713 11731 14742 21394 27380 30112 32687 34347 31283 25756 22390 20497 13506 5600 1696 -4948
334 -4948 -13929 -19073 -23488 -29096 -31698 -29854 -28283 -28833 -26693 -21171 -17572 -11581 -2587 3095 7504
349 7504 16149 24646 27033 26108 27878 30767 31229 31443 27913 17763 11119 9961 5350 -5498 -14968
364 -14968 -18528 -21135 -24710 -27535 -32755 -36575 -32566 -26745 -24676 -19853 -10910 -5039 -4768 143 13334
379 13334 24667 27303 25069 24071 31400 42818 41426 24363 9979 14695 26323 20737 -546 -19093
393 -19093 -22572 -14945 -12171 -25903 -41415 -41508 -29143 -24012 -28272 -27967 -20788 -15309 -11182 -1960 11739
408 11739 23429 21295 10789 11408 33585 55287 44814 12641 2075 23424 44206 31993 -5597
421 -5597 -29358 -16270 10605 9324 -24136 -49520 -40559 -18952 -13627 -21950 -28780 -25908 -17997 -12799
435 -12799 -5354 7491 16750 7025 -8469 2937 39222 54220 25077 -14038 -11891 30969 58519
448 58519 31140 -23380 -40001 -83 37357 19677 -28310 -46254 -19868 11156 9965 -13357
460 -13357 -26046 -16921 -4239 -2606 -334 11290 11877 -11746 -28308 -5536 35157 37658 -9634
473 -9634 -49432 -27007 34007 55265 1266 -60084 -46052 25312 61697 21142 -37714 -39451
485 -39451 11725 50679 35342 -3444 -12824 9404 23472 15712 10119 14641 5091 -22579 -32750
498 -32750 -4178 26856 8264 -52971 -85050 -36741 35292 34817 -43338 -94779 -45845 44482
510 44482 67074 4802 -52157 -26609 51347 86410 47960 672 3002 36779 50543 37558
522 37558 26468 20679 1538 -25525 -28496 2058 21865 -18529 -87266 -97942 -28219 33711
534 33711 283 -87732 -110982 -31059 59564 57074 -21900 -63356 -7238 78249 93988 39945
546 39945 1318 21013 58266 64865 45178 28876 20864 3213 -17728 -12864 15789 16802 -40707
559 -40707 -100953 -82853 -3722 30892 -30881 -112563 -103157 -4248 66344 27458 -59370 -68811
571 -68811 17545 93430 76647 11025 -12823 25779 67446 65265 37085 20942 17817 6316
583 6316 -8703 2440 26864 11741 -48530 -84517 -43890 25665 28328 -49662 -111386 -71297
595 -71297 29673 66846 -2781 -80036 -59818 32520 84038 43108 -22305 -27916 23511 61948
607 61948 48144 13944 3200 8775 5916 3174 18245 30816 4876 -44638 -55021 -3792 47943
620 47943 26434 -52480 -88521 -27611 56302 54663 -28996 -82688 -38929 44808 64672 6097
632 6097 -50542 -36552 19690 43639 18215 -11120 -10713 792 2412 5088 18596 23330 104
645 104 -29491 -21435 26811 56288 18218 -45759 -51134 15179 67274 35550 -40089 -65552 -12751
658 -12751 47592 38460 -25093 -60704 -29516 18442 23107 -8979 -29761 -21481 -5417 2288 6321
671 6321 12947 12843 -4720 -18047 1964 42752 51198 8435 -33171 -14998 41263 62290 16422
684 16422 -42392 -42260 11578 46270 15008 -41829 -54732 -17657 14266 5217 -23662 -34864 -20949
697 -20949 -4887 -417 -245 3866 4653 -4380 -6663 15628 41583 34700 -223 -18457 6985 45482
711 45482 46379 3655 -33293 -20625 21450 32687 -3638 -41198 -37905 -6563 10295 -4928 -28538
724 -28538 -32647 -15893 -1410 -552 -2538 401 1093 -3071 955 18033 29831 20157 -87 -3906
738 -3906 15744 36093 26620 -6072 -22036 -3915 20968 16708 -12446 -31922 -22798 -2148 3905
751 3905 -10810 -25345 -21430 -6818 374 -2303 -3987 -1146 520 1917 8397 16580 18178 11166
765 11166 1868 3258 16573 24098 12611 -6467 -10354 2758 11676 2396 -14191 -21810 -12770 -472
779 -472 -1944 -13982 -20186 -12977 -3666 -1282 -2398 -2168 -448 2392 5772 8570 11063 12196 9794
794 9794 6767 8572 14141 13483 4610 -2329 -1562 3005 3649 -2646 -11137 -13939 -9033 -5028 -8633 -13968
810 -13968 -13073 -8443 -4775 -3672 -3973 -3827 -782 4427 6925 7232 8187 9828 9497 9180 10823 11165 9166
827 9166 6633 4690 3290 1446 -354 -3219 -7376 -8045 -7091 -8029 -10878 -11934 -11481 -10095 -8209 -6218
843 -6218 -5676 -4180 -665 2443 2905 4661 7033 8932 9927 11454 11517 9944 8759 8774 7268 4742 3627
860 3627 1937 -1334 -3790 -5306 -7937 -9421 -10029 -9793 -10793 -10665 -9039 -8707 -7955 -5516 -3371 -1441
876 -1441 1301 4928 6600 6217 6762 9465 10764 11489 11155 8446 6560 7453 6815 2784 -1871 -3095 -2768
893 -2768 -4139 -5410 -7846 -10921 -11218 -9495 -8519 -7925 -6153 -4881 -5211 -4312 717 4727 4789 3320 3434
910 3434 7185 12568 13356 7365 1168 3613 10605 10213 2748 -4216 -4780 -948 1318 -3056 -9732 -11466
926 -11466 -6789 -3643 -5430 -6840 -5760 -5599 -4503 -1817 2982 5602 3390 -975 -1002 6495 14802 11406
942 11406 -970 -5580 3524 13893 11011 -2872 -12291 -6440 6028 8853 -2992 -14163 -11717
955 -11717 -1317 2679 -529 -4898 -5880 -4059 -1163 2498 5476 5547 -95 -6773 -1748 11999 17428
970 17428 3873 -12890 -11724 6928 19161 9075 -12922 -20466 -3931 14898 11077 -8892 -18292
983 -18292 -8223 6340 8998 1335 -6062 -6032 -1055 2936 5313 8743 5784 -4944 -11017 -398
997 -398 16215 16024 -4691 -21165 -11822 13272 22543 1201 -25218 -22451 6426 23585 8697
1010 8697 -16704 -20814 -1926 15668 12332 -2359 -9459 -3186 4594 5852 6014 6603 1366 -9743
1024 -9743 -9924 5681 19063 10246 -15724 -27011 -6458 23233 22509 -10189 -33792 -17254 18758
1037 18758 28030 1749 -25428 -19884 8822 25454 13072 -8878 -12691 -682 9260 9386 6881
1050 6881 3052 -5132 -11459 -5940 9882 17376 1107 -24760 -25841 3747 28946 14300 -24011
1063 -24011 -36773 -6389 29986 27954 -7250 -30842 -13882 20230 30053 7675 -13865 -11177
1075 -11177 4921 13808 10926 3820 -2515 -9059 -10915 -1602 13166 13509 -9757 -31662 -21114 13141
1089 13141 28122 2641 -32669 -31295 6880 35238 19756 -18683 -29958 -567 30917 27440
1101 27440 -560 -16361 -6175 11911 17006 8860 -503 -5595 -7832 -6954 1937 11688 4775 -18593
1115 -18593 -30334 -10605 19388 20786 -11470 -37605 -21921 19034 35712 7765 -27339 -23978
1127 -23978 12435 35710 20658 -8828 -16741 684 19018 17544 3737 -5483 -6494 -6067 -2852
1140 -2852 5496 9527 -2970 -23021 -24695 -1282 20440 11800 -19963 -34353 -9735 26464 28650
1153 28650 -5045 -29536 -13623 21327 32855 11089 -14658 -14582 6993 20676 13483 -1408 -7352
1166 -7352 -5825 -2753 1829 6513 3871 -8996 -20206 -14180 7011 18304 2299 -24105 -25819
1179 -25819 3068 27831 17650 -13454 -24980 -3288 24054 24479 62 -17815 -8606 11839
1191 11839 17826 5761 -6086 -8140 -4031 573 3711 4948 147 -9401 -14335 -5078 10809 13617
1205 13617 -4207 -21086 -13064 11551 22816 6104 -17027 -17813 4630 22529 14294 -8808 -17039
1218 -17039 -3485 12267 11618 -673 -8927 -7050 -781 3636 3696 1277 -2843 -7254 -6757 2505 11898
1233 11898 7768 -6778 -14150 -2909 13797 15251 -825 -15209 -9696 8662 16428 3093 -12532
1246 -12532 -12317 891 9613 5435 -4877 -9009 -4844 1663 3658 1782 -99 -2154 -4146 -1504
1260 -1504 5031 8451 2486 -6044 -6325 2894 11149 7638 -4724 -11019 -2940 8991 9264 -2141 -10166
1275 -10166 -6645 2737 6174 1361 -6155 -6579 -1067 3010 1986 -339 -1536 -2321 -1795 909 4244
1290 4244 3500 -450 -3991 -2243 3538 6485 2981 -4186 -5033 1585 6370 3617 -2559 -5205 -1446
1305 -1446 4188 4450 -768 -4703 -3181 459 1610 -173 -1796 -2665 -2342 -691 -318 5 -560 -1796
1321 -1796 -1877 -208 2476 2946 473 -1363 568 3788 4732 3001 275 -106 1958 3716 2312 -942
1337 -942 -1653 -928 -116 -851 -2709 -4065 -3990 -2715 -2065 -2659 -3202 -2273 -1666 -1595 -39 1121 1494 1761 2794
1356 2794 4095 4356 4361 4273 3116 2911 3804 3607 1351 -114 -915 -1655 -2058 -2981 -4084 -5280 -4820 -4060 -4664
1375 -4664 -5193 -4228 -2969 -1838 -510 651 1268 2145 3664 4541 4841 5312 5867 5413 4786 4605 3988 2362
1393 2362 1003 48 -1177 -2120 -3125 -3968 -5628 -6072 -5969 -5677 -5564 -4426 -3615 -3536 -2279 -402 1114
1410 1114 2493 3149 3848 4471 6184 7225 6121 4531 4096 4765 4337 3076 1113 -1127 -2262 -2478 -2754
1427 -2754 -3975 -5151 -5442 -6053 -5909 -4161 -2849 -3148 -4108 -2999 -137 3079 3962 1823 518 2755
1443 2755 6781 7833 5084 1838 1750 3906 5098 3081 -736 -2732 -1619 -145 -1044 -2714 -4198 -4867
1459 -4867 -4913 -3338 -1535 -912 -2481 -4482 -3099 846 4618 3205 -1735 -3269 2126 7480 6610 441
1475 441 -3351 -1062 5102 6806 1585 -4308 -4291 -56 2635 1249 -1725 -3589 -3667 -1319 997 2274
1491 2274 554 -3093 -4594 -1572 4918 6639 138 -6877 -5364 3270 8652 4035 -5611 -8864 -1647
1506 -1647 7051 6249 -2777 -8259 -4453 2670 5777 2868 -2495 -4267 -1457 2579 5452 5135 1474
1521 1474 -3583 -4035 2159 9421 6944 -3635 -10295 -4588 6591 9417 -756 -13235 -12050 399
1535 399 8972 3063 -8653 -11983 -4233 5387 6727 946 -4391 -3388 1797 6615 7731 6117 1330
1550 1330 -3168 -584 7852 12124 5430 -6613 -10839 -1624 9966 8397 -7069 -18187 -11246 4415
1564 4415 8921 -2554 -15045 -14249 -1236 8725 6145 -3601 -7239 -2127 5493 9591 8667 4743 -513
1579 -513 -1679 4263 12355 12329 1955 -9182 -8811 4289 13291 4183 -13980 -20212 -6978 8385
1593 8385 7375 -8098 -19513 -12926 2954 10427 2586 -7662 -7910 639 9001 11096 7488 1959
1607 1959 -1698 1160 8957 14235 9742 -2468 -10857 -5006 9473 12538 -1678 -18359 -17723 -1042
1621 -1042 10734 3222 -14201 -20220 -7829 8523 9739 -1542 -10365 -6767 3767 11258 10502 4563
1635 4563 -563 -1112 3516 10253 12829 5170 -6679 -10553 5 11612 8765 -7602 -19443 -12493
1649 -12493 4613 11199 -1250 -17134 -16650 -1002 11435 7534 -5050 -10259 -3048 8013 12041
1662 12041 7019 -46 -2671 74 5619 10478 8883 -353 -8876 -6675 4257 10710 3361 -11465
1676 -11465 -16774 -5500 9506 8919 -6429 -17246 -10933 4978 12063 3700 -7851 -9402 257
1689 257 9606 9706 2770 -2870 -2897 1264 6582 8588 4448 -4145 -7658 -2152 7170 8857 -755 -12043
1705 -12043 -11746 1005 10415 4636 -9229 -14159 -4581 7839 9200 -1312 -9701 -7076 3399 9286
1719 9286 5369 -1492 -4612 -2192 3192 7052 6060 819 -4407 -4101 2143 7859 6197 -3156 -9907
1734 -9907 -5280 5480 8958 441 -9717 -10124 -208 7392 5070 -4985 -9599 -4265 3985 6036
1748 6036 1209 -3810 -4093 -270 4170 5499 3176 -1048 -2982 -382 4385 7242 3306 -3686 -5670
1763 -5670 -286 6082 5298 -2295 -8386 -5800 1870 5505 64 -6786 -7506 -1427 3826 3063 -1319 -4360
1779 -4360 -2727 1813 4331 3688 945 -894 -746 1860 4836 4743 767 -3117 -2382 1634 4598 1833
1795 1833 -3499 -5994 -2378 2677 2634 -2084 -5758 -4165 557 2945 1211 -1811 -2869 -9 2764
1810 2764 3109 1263 -257 -889 603 1984 2580 1130 -1341 -2292 -916 967 1307 -670 -3212 -3416
1826 -3416 -106 1915 532 -1781 -2655 -529 2264 2844 1107 -551 -145 1558 2584 1631 449 -498
1842 -498 -418 273 482 -549 -1885 -2316 -2167 -1594 -686 -960 -2163 -2468 -1081 533 973 524 116 623 1670
1861 1670 3262 3132 1768 1489 2380 2831 2058 918 -205 -954 -578 -831 -1396 -2638 -3122 -3154 -2814 -2247
1879 -2247 -2263 -2456 -2478 -1282 -220 418 698 1048 1469 2157 3231 3815 3140 2898 2851 2839 2712 1744 1093 -426
1899 -426 -418 -526 -1285 -2452 -3024 -2873 -2941 -2981 -2790 -2904 -2756 -1961 -1320 -564 -7 815 1398 1608 2430 3030 2693
1920 2693 2790 2896 2899 2685 2278 1664 796 151 -305 -386 -1254 -1619 -2202 -2840 -2463 -2122 -1906 -2423 -2398 -1909 -1433
1941 -1433 -612 247 287 -104 716 1560 2348 2606 2261 1565 1714 2045 2388 1710 770 -3 127 28 28 -402 -1437
1962 -1437 -2396 -1952 -1221 -513 -934 -1841 -2379 -1137 288 1158 -99 -1239 -745 987 2085 2138 707 -424
1980 -424 230 1591 2161 1166 -95 -497 -696 590 1599 666 -1140 -1893 -1377 409 1395 320 -2213
1997 -2213 -2914 -201 2361 1802 -1009 -2490 -1560 1574 2703 1028 -1528 -2047 -25 2107 1879 173
2013 173 -1165 -1754 -25 2086 1826 34 -2083 -2005 -144 2533 2655 -584 -3289 -1944 1798 3831
2029 3831 1805 -2330 -3721 -665 3329 3683 -613 -3740 -3081 737 2841 1736 -1462 -3399 -2497 502
2045 502 2620 1730 -1041 -3226 -2333 1560 4335 2584 -2045 -4109 -921 4411 5439 828 -4235 -4220
2061 -4220 1294 5304 3124 -2490 -5223 -2404 2210 3721 739 -3434 -4534 -1372 2201 2810 845
2076 845 -2610 -3988 -1210 3457 4976 1144 -4045 -4092 902 6343 5119 -1229 -5962 -3071 3780 6334
2092 6334 1731 -4689 -5678 -670 4358 3870 -1026 -5126 -4067 412 3603 2792 -595 -4108 -3604 1249
2108 1249 5067 4142 -1082 -5388 -2984 3149 7005 2869 -3982 -6448 -1022 5703 5700 -580 -6285 -4890
2124 -4890 1872 5950 2991 -3235 -5994 -2753 2719 4840 2171 -2667 -5105 -1941 3341 5464 2035
2139 2035 -3557 -5625 -1340 5316 6198 -99 -6420 -5683 1751 6632 4200 -3422 -7269 -2828 4468
2154 4468 6290 1137 -4602 -4664 -60 4255 4476 280 -4201 -4154 237 4144 4193 -337 -5410 -5113 1158
2171 1158 5995 4093 -2861 -6716 -3112 3990 6748 1702 -5142 -5607 191 5838 5107 -1029 -5089
2186 -5089 -3406 1839 5210 2747 -2003 -4900 -3083 1761 4254 2144 -2704 -5566 -2857 2891 5429
2201 5429 1478 -4311 -5748 -391 5655 5323 -694 -5520 -3171 3091 6430 2842 -2668 -4793 -1424
2216 -1424 3382 4554 687 -3817 -4099 -1286 2553 2967 -281 -4248 -4562 -678 3548 3710 -321 -4527
2232 -4527 -3571 2210 5985 3590 -2183 -4314 -530 4560 5605 1068 -3539 -3748 611 3812 2614
2247 2614 -1353 -3889 -3436 -96 2637 1307 -2127 -4578 -2983 983 3055 1871 -1972 -3770 -1118
2262 -1118 3663 5045 1496 -2363 -2293 1441 4946 3752 -535 -3041 -1539 1924 3143 942 -2190
2277 -2190 -3305 -1758 816 1753 -491 -3079 -3392 -1330 1416 2127 121 -2451 -2394 753 3380 2707
2293 2707 -33 -1998 -623 2515 3998 1768 -1436 -2271 191 2418 2042 -333 -2387 -2211 -382 1126
2309 1126 517 -1577 -2701 -2003 -251 1141 622 -1168 -2244 -837 1429 2299 982 -846 -1160 558
2325 558 2349 2276 172 -1218 -797 881 1819 1044 -1006 -1758 -969 800 791 -133 -1419 -1672 -1047 367
2343 367 510 -252 -1098 -1197 -116 959 1006 -108 -1012 -552 879 1741 911 -298 -492 68 832 951 240
2362 240 -888 -667 285 733 51 -710 -882 -333 224 532 39 -732 -677 -302 311 217 -98 -545 -708 -185
2382 -185 322 637 -134 -431 -221 215 706 129 -316 -388 90 343 576 175 -190 -605 333 445 209 -160
2402 -160 -309 -63 127 356 385 -470 -299 -186 216 300 -318 -470 -249 -83 146 527 -356 -403 -79 122 584
2423 584 -5 146 -281 -180 405 214 226 -57 -130 347 374 306 58 -312 -2 201 223 -12 -174 -226 -34 -149
2445 -149 111 82 -326 -331 -61 -238 1 -17 -468 -291 -34 389 114 -184 44 281 -66 773 297 83 -44
2466 -44 345 527 518 230 253 -66 -259 135 251 -78 -275 -496 -385 -335 -211 -129 -619 -725 -401 -57 353 -169
2488 -169 -354 -478 -85 500 791 438 149 -89 367 1193 1010 120 -445 -5 506 981 503 -676 -1260 -695
2508 -695 -126 284 -120 -1141 -1131 -741 -3 477 69 -768 -709 -87 715 1145 344 -535 -427 828 1841 1355
2528 1355 81 -829 -25 1054 1410 767 -831 -1397 -578 644 623 -676 -1686 -1711 -550 645 912 -439
2546 -439 -1464 -1059 248 1285 1349 -67 -1296 -410 1330 2002 962 -870 -916 64 1604 1563 -114 -1699
2564 -1699 -1642 215 1457 870 -949 -1967 -1777 304 1403 644 -855 -1868 -782 1088 2252 1016
2580 1016 -1487 -1860 -215 2042 2228 276 -1936 -1829 261 2125 1596 -944 -2614 -1513 1137 2076
2596 2076 761 -1555 -2323 -710 1579 2039 201 -1615 -1856 -76 2213 2338 3 -2132 -1741 422
2612 422 2508 1583 -1001 -2736 -1524 1576 2538 440 -1963 -2556 -551 2172 2405 149 -2223 -1690
2628 -1690 703 2562 2028 34 -1969 -1608 1041 2594 1474 -1319 -3158 -1463 1424 2651 687
2643 687 -2713 -3193 -784 2143 2193 -426 -3033 -2158 706 2846 2099 -876 -2700 -874 1911 3035
2659 3035 1780 -1413 -2295 -632 2041 2733 379 -2010 -2884 -412 2209 2120 -834 -3322 -2672 484
2675 484 2882 1545 -1592 -3168 -1033 2137 3296 1000 -1690 -2354 90 2884 2933 581 -2231 -2071
2691 -2071 422 2645 2116 -672 -2910 -2191 553 2614 1122 -1910 -3358 -1431 1336 2737 293
2706 293 -2494 -2621 -114 2613 2509 -353 -2214 -1654 1054 3064 1876 -791 -2459 -981 1336 2539
2722 2539 1009 -1860 -2576 -855 1867 2181 -21 -2234 -2482 66 2251 2188 -654 -2703 -1671 1568
2738 1568 2997 1530 -1295 -2547 -869 1865 2648 623 -1900 -1929 -158 1973 1967 43 -1957 -1789 226
2755 226 2097 1829 -522 -2363 -1356 1024 2430 1351 -1346 -2141 -536 1621 1964 374 -1926 -1786
2771 -1786 89 2016 1438 -759 -2209 -1432 585 1659 1032 -1010 -1983 -940 834 1867 438 -1193
2787 -1193 -1702 -311 1580 2303 322 -1412 -1345 756 1998 1417 -390 -1854 -882 756 1391 446 -1473
2804 -1473 -1631 -682 750 1190 -246 -1517 -1592 -341 1050 1018 -201 -1302 -574 764 1870 1049 -85
2821 -85 -694 -228 1225 1473 633 -986 -1280 -454 1079 817 -475 -1461 -1596 -259 493 139 -732 -1342 -713
2840 -713 310 853 597 -524 -1048 158 1223 1348 783 -111 -401 576 992 987 64 -886 -447 279 859
2859 859 106 -969 -1380 -796 210 321 -624 -851 -754 -156 385 838 -368 -388 -52 595 839 651 228 -209
2879 -209 248 761 880 386 -122 -436 115 486 33 -308 -824 -474 -149 203 -125 -499 -663 -423 110 43
2899 43 256 -407 -247 423 714 231 50 -85 -13 488 635 223 -222 -273 3 291 304 158 -382 -134 -52 252
2921 252 39 -442 -205 -170 96 343 137 -48 -149 -78 -75 340 130 -72 -68 -41 429 95 -176 -520 -21 42 181
2944 181 266 -125 -341 -28 408 388 30 -163 -72 6 37 236 -185 -187 -148 38 -57 -229 -139 -589 -178 -127 -126 -47 -688
2969 -688 -105 -24 58 128 76 -303 157 368 231 150 208 -255 20 272 526 368 29 29 53 46 113 92 -98 -73 -41
2994 -41 -155 -102 41 -97 -50 -143 146 -15 -212 -324 -264 -26 99 269 76 -14 184 310 344 187 245 -242 -124
3017 -124 360 436 160 -33 -247 -77 59 129 78 -347 -491 -173 -26 126 202 -579 -398 -174 480 380 114
3038 114 -517 -413 174 738 601 48 -27 -71 493 822 690 90 -291 -325 264 815 230 -386 -650 -504 -20
3059 -20 293 -195 -947 -1002 -364 102 338 -260 -690 -563 70 894 782 -44 -433 80 515 1224 633 -105 -505
3080 -505 -211 625 929 238 -712 -1143 -306 436 408 -536 -1237 -1230 28 585 391 -452 -961 -573 574 1336
3100 1336 705 -328 -639 46 835 1250 822 -524 -858 293 981 798 -305 -1142 -1002 262 850 328
3118 328 -770 -1326 -836 484 705 464 -629 -1232 -45 993 1190 557 -561 -1011 368 1215 1167 -5
3136 -5 -1201 -723 469 1331 767 -987 -1338 -789 504 1176 167 -1082 -1486 -185 1042 1257 -40 -1342
3154 -1342 -1004 306 1562 912 -348 -1077 -736 806 1353 440 -658 -1222 -383 767 1300 229 -1120
3171 -1120 -1396 -387 992 1146 -25 -1220 -1053 307 1362 981 -276 -1197 -549 999 1599 655 -798
3188 -798 -1145 -188 1013 1182 24 -1474 -1383 -363 661 1012 -720 -1532 -1087 453 1359 582 -774 -1259
3206 -1259 -675 1153 1423 479 -959 -1145 -13 1030 1246 85 -1264 -1137 45 1146 825 -691 -1665
3223 -1665 -1120 368 1111 474 -910 -1574 -419 1020 1301 -69 -1014 -897 250 1615 1349 136 -946
3240 -946 -910 568 1510 1129 -447 -1302 -614 693 1017 190 -1053 -1381 -669 838 890 -123 -1193 -1194 168
3259 168 1138 760 -377 -1075 -368 853 1494 767 -144 -844 -185 1248 1563 229 -937 -956 43 949 827
3278 827 -343 -1104 -1021 -13 807 545 -473 -1118 -579 628 979 601 -695 -849 52 750 1047 95 -743
3297 -743 -506 420 1224 794 -250 -897 -400 333 827 364 -857 -1057 -549 554 614 -78 -799 -590 -92
3316 -92 335 488 -62 -730 -545 640 613 662 -519 -592 -265 389 719 143 -660 -565 1 550 703 338 -800
3337 -800 -654 -32 509 59 -212 -684 -354 549 464 306 -251 -624 -109 347 649 142 -622 -590 236 658 312
3358 312 -524 -390 -327 30 455 209 -393 -659 -86 117 489 263 -204 -358 143 646 360 -6 -396 -573
3378 -573 221 248 192 -116 -688 -165 9 438 -214 -364 -306 -191 322 287 -163 -450 -298 298 434 424 -184 -275
3400 -275 163 298 562 102 189 -192 -245 338 381 50 -240 -323 -316 222 20 -360 -313 -273 -39 244 -147 -387 -364
3423 -364 173 167 244 149 -197 -132 -109 213 -16 34 127 136 172 261 -202 -440 -152 26 174 329 86 -333 -111 -67
3447 -67 96 14 -94 -126 -87 -20 38 250 -174 -258 -51 108 202 241 -144 -33 455 562 50 -170 -316 -55 161
3470 161 174 -32 -257 -230 -22 200 -168 -184 -424 -228 -57 30 -136 -147 -288 26 12 379 173 140 -140 212
3492 212 473 318 336 -6 -93 189 363 459 199 -259 -216 -165 304 131 84 -438 -108 -19 -85 -152 -280 -193 -66
3515 -66 37 -26 18 -36 -34 26 74 318 128 144 -223 224 194 289 87 -403 -241 -310 65 71 -155 -129 6 -121 153
3540 153 -68 187 -181 -136 -115 187 281 -127 20 -99 238 177 101 -260 -60 -155 239 -132 10 -85 -429 -88
3562 -88 -78 261 -88 -213 -287 277 174 212 -55 -2 -112 232 650 251 46 -174 -105 331 101 87 -324 -199
3584 -199 -224 -34 -158 -183 -202 -468 95 68 -157 -63 -111 -189 72 272 552 171 140 74 171 603 342 -53 -261
3607 -261 -247 283 253 -371 -616 -454 -306 -32 -69 -574 -672 -583 -6 244 359 -173 -244 132 570 699 334 90
3629 90 -56 255 576 566 63 -385 -286 23 357 -68 -627 -819 -618 -88 350 170 -706 -804 -91 314 916
3650 916 268 82 -205 138 842 918 344 -29 -67 449 755 447 187 -443 -559 142 186 -236 -468 -580 -334
3671 -334 -44 427 -149 -546 -1037 -118 426 663 75 -458 -353 287 727 845 -216 -428 -13 546 735 390
3691 390 -488 -607 67 601 222 -271 -607 -533 -307 539 199 -415 -494 -444 -160 673 369 -263 -358 -221 452
3712 452 959 271 -330 -516 144 707 472 58 -355 -17 186 427 451 -297 -594 -528 25 537 333 -352 -435
3733 -435 -267 249 676 56 -421 -342 -38 675 401 -8 -354 -171 344 473 88 -394 -634 -452 265 456
3753 456 -20 -316 -471 -185 307 395 83 -506 -606 131 765 488 -169 -618 -183 241 563 282 -25 -456
3773 -456 -143 363 312 -10 -317 -493 90 440 438 -189 -315 -453 322 1045 434 -135 -397 -122 409 494 223
3794 223 -368 -575 35 458 537 -89 -315 -482 75 501 142 -157 -630 -323 178 225 167 -201 -689 80 386
3815 386 380 110 -271 -39 131 427 461 105 -157 -320 167 403 82 -81 -328 -210 90 154 188 -409 -592 -92
3837 -92 111 132 -6 -376 -106 86 245 527 -208 -272 -234 127 319 279 51 -276 79 148 464 138 -66 -60 101
3860 101 157 125 -130 -356 -341 111 210 1 -401 -242 -249 89 30 -131 -497 -333 -19 30 111 -322 -82 -184 -53
3883 -53 182 259 8 126 -76 33 457 159 -263 -328 13 256 85 -158 -508 -9 232 153 -105 -189 -387 -19
3905 -19 -109 169 147 -176 -97 81 246 116 247 206 127 168 273 408 -107 -23 63 301 189 100 82 -228 -211 28
3929 28 -59 -425 -335 -449 46 -94 -58 -260 -304 103 297 -65 152 74 74 380 466 214 185 -236 221 86 179 166
3953 166 -286 -259 -222 1 -255 -337 -472 -401 -234 -125 -14 359 -339 -74 -22 -85 353 -34 -90 188 241 6 511
3976 511 1 240 32 304 -29 -76 33 -220 -70 -143 3 -59 -107 -155 -186 14 12 -191 -6 -61 311 397 28
3999 28 -140 -107 3 216 237 32 12 171 50 199 -76 -435 -310 -199 -137 -76 -294 -97 -368 39 255 32
4021 32 175 -209 357 139 214 168 37 183 20 156 205 64 -89 -122 -102 -160 60 -98 -336 33 -109 -92 -79
4044 -79 101 -125 -15 238 140 84 96 -11 -48 488 542 243 96 -114 260 18 18 -42 -121 -7 -184 -13 -182
4067 -182 73 -311 -204 -175 115 -19 -176 -323 -144 88 255 155 331 353 155 397 276 94 -27 -240 144
4088 144 242 128 -22 -150 -408 -221 -220 -177 -398 -301 -246 -20 -129 -49 108 65 -100 -31 210 140 390 -204 182
4111 182 110 308 184 200 339 214 -58 169 -16 -60 -384 -211 -78 -177 -210 -297 -159 -248 28 104 -156 37 -114
4134 -114 123 146 253 27 58 109 172 319 208 136 80 396 479 80 55 -33 -203 -183 32 -180 -310 -438 -327
4157 -327 -425 -18 -376 -323 -243 29 327 448 -34 80 156 19 167 99 360 52 133 326 -40 8 67 -476 -115
4180 -115 -259 3 -138 -235 -348 -80 -174 -243 14 -191 -241 -105 221 285 -4 -60 24 103 489 205 136 -13 130
4203 130 -32 103 29 -185 -118 -131 -27 123 29 -350 -164 -185 381 150 -139 -53 77 58 221 189 31 -211 -276
4226 -276 327 311 93 -234 -143 -60 155 146 -133 -423 -214 -182 117 174 35 -148 43 375 266 247 -22 100 -37
4249 -37 187 309 209 -14 -349 -119 113 176 -118 -263 -87 145 225 -271 36 -16 -117 334 158 203 32 3
4271 3 99 349 275 242 -85 -8 118 332 -44 40 -269 63 77 143 36 -215 -485 -146 -19 -6 -63 -305 -290 -192
4295 -192 204 473 -5 -67 -94 -112 397 188 -82 18 -180 185 308 -133 -16 -182 -188 156 117 -147 -51 -52 67
4318 67 15 -72 -279 -207 -132 86 329 111 -103 -72 101 137 218 67 -61 109 256 15 238 306 -203 -84 123
4341 123 -9 135 -62 -165 0 121 14 -319 -252 -229 -274 88 39 -167 -220 60 -99 85 243 -229 -84 -117
4363 -117 45 193 -110 298 -173 227 353 360 149 -46 -85 216 213 114 -28 -154 -122 140 83 -42 25 -130 -53
4386 -53 36 -90 -83 -289 7 -217 -69 239 -181 -39 59 311 176 400 38 -19 -57 -77 302 152 -108 -102 -163 102
4410 102 -170 -226 -125 -3 32 1 190 -103 -14 71 86 142 -15 -39 70 22 150 -9 12 50 -201 63 169 125
4434 125 -341 -219 197 126 105 67 -35 -283 44 218 201 -294 -120 -170 243 -157 -271 153 -289 24 -34 258
4456 258 164 -64 -61 -233 -16 -263 -58 -10 -87 -272 -106 97 60 18 -114 22 149 -31 338 -109 147 188 -68
4479 -68 -60 -92 -132 -156 198 211 -310 -454 -309 20 164 -112 92 -397 -13 -59 86 233 -135 34 144 304 203
4502 203 121 240 221 93 219 -42 18 -14 -106 -16 -172 66 -276 -350 -300 -166 68 99 51 -158 -131 88 110 174
4526 174 42 -70 205 158 -89 -175 26 181 263 332 93 -106 150 -136 -85 -77 -95 -140 -296 -143 20 -388 -224
4549 -224 -263 -307 -78 -159 80 -30 138 324 196 409 444 -29 494 219 115 181 88 18 60 -117 -2 -71 -132
4572 -132 -358 -119 -269 -274 -393 -156 -201 -25 132 22 77 -139 -34 275 196 201 85 145 281 392 181 6 185
4595 185 281 89 -30 -295 -72 -174 -77 -350 -123 37 -382 -246 -185 124 8 144 41 -189 313 87 250
4616 250 199 109 421 154 100 252 223 0 -9 -138 -338 -2 -84 -231 -201 -147 -116 24 -312 -295 -351 -52 220 -97
4640 -97 -139 38 272 386 160 255 197 150 134 74 122 50 -3 -110 74 -28 -94 -2 -209 -189 58 68 137 -97 -35
4665 -35 233 130 -5 145 95 265 74 183 351 -13 39 81 -135 -40 -31 -286 -107 -168 -288 -67 -126 40 -316
4688 -316 -233 -116 178 -75 -63 -12 -132 15 -33 158 159 138 218 354 207 -117 -311 14 24 -319 -313 -270 -369 -316 -347
4713 -347 -191 -244 -268 -7 101 -118 174 -219 18 130 -16 281 365 277 382 385 93 201 305 110 -243 -301
4735 -301 21 -158 -122 -177 -430 -189 -302 -407 -68 -343 45 16 2 -132 -138 289 401 -103 327 500 162 289
4757 289 347 363 130 57 117 -12 -189 159 29 -5 -250 -356 -71 -120 -247 -13 -521 -485 6 40 126 -144 -49
4780 -49 -5 348 340 139 141 494 323 416 182 -107 -63 -56 86 -68 -38 11 -399 -398 -164 -239 -362 -133 -285 -64 236
4805 236 102 12 -39 -55 34 256 361 6 78 120 161 161 167 130 35 -59 89 -290 6 -107 -213 -137 -22 51 -166
4830 -166 -115 -249 94 141 -99 -25 -155 145 195 26 8 42 270 129 -5 -82 137 -79 50 129 49 118 33 -177
4854 -177 -177 102 -75 -56 -27 70 32 199 58 161 -134 277 37 -10 155 64 -22 186 171 188 119 -258 -78 -85 -22
4879 -22 68 -150 -144 -169 -25 64 259 65 -56 -86 -28 368 -115 202 -69 135 -82 140 306 40 -82 230 44
4902 44 -97 -64 69 -170 102 130 -52 2 -299 -98 -107 -154 116 -66 -234 111 118 -22 -82 171 55 236 12
4925 12 105 15 127 161 110 85 -71 -64 13 -376 -8 168 -129 -36 -190 5 74 -301 -64 -139 -68 228 134 381 -39
4950 -39 -16 22 455 341 227 199 232 -48 359 -62 25 130 145 198 98 -71 20 -252 -250 131 -134 -129 -353 -161
4974 -161 -46 -52 -32 -27 -142 96 -38 204 -26 339 -141 218 270 -38 20 -107 186 -190 -4 -49 -234 6 -140
4997 -140 -136 -231 -34 -207 -52 -124 122 -202 -11 101 6 224 -46 249 53 160 183 299 235 29 212 219 -100
5020 -100 120 93 -97 25 -103 -240 14 -41 -135 -83 -172 44 61 76 -64 -125 -7 109 -184 273 32 49 -132
5043 -132 396 319 15 10 38 -131 -128 236 -201 -174 24 -142 -8 202 -108 -143 28 21 -138 -54 -157 -30 -130 181
5067 181 212 -149 43 -125 58 56 85 67 -191 -183 -110 204 -117 -188 -181 -178 135 125 -76 -200 -65 -289 142 -31 44
5092 44 81 -107 -36 76 -27 -56 18 -90 160 38 167 102 88 -116 295 -246 -225 -98 -45 -172 -41 -71 -60 -88
5116 -88 137 120 -82 150 -83 282 74 238 29 30 -15 -19 -17 305 68 -79 -69 -77 -168 41 -295 -228 -26 25 0
5141 0 9 -81 51 -15 55 126 -157 -179 -73 321 229 102 132 -38 73 101 68 202 -16 -96 139 -213 -69 -142 -72
5166 -72 -116 -28 131 -52 -17 -53 94 95 -144 95 -247 27 77 -120 -43 53 -160 -70 -110 25 -62 9 -43 -19 -76 16
5192 16 148 -62 -176 89 -246 165 -99 90 -106 -260 234 13 45 125 -35 12 280 54 -2 189 119 183
5214 183 199 330 37 -145 -208 -264 -125 -123 15 -23 -132 -68 -174 -59 -37 -89 167 -54 155 128 150 71 -219 78
5238 78 321 76 48 65 68 303 54 -69 -13 -74 -360 -76 85 8 47 -197 -305 -98 -66 6 -143 -98 102 10
5262 10 220 157 -253 2 -46 60 -21 -33 -53 69 31 1 -126 -122 -126 46 -127 -38 136 -279 -364 47 -129 52 -174
5287 -174 -24 -109 -17 53 -151 142 34 -110 210 35 43 124 -373 77 50 114 -46 -23 -191 -10 93 95 97 11 -127
5312 -127 20 218 57 -86 -124 73 159 51 2 151 -15 -183 -86 -154 -23 -120 -13 236 250 -121 -135 -101 99
5335 99 -63 1 111 24 -239 415 268 123 18 165 273 324 -109 38 179 34 -199 -121 -43 -238 75 -168
5357 -168 -25 126 -86 -211 -60 -189 57 -21 272 52 185 158 206 198 -148 -40 -91 -90 18 350 163 161 -76
5380 -76 171 -126 -156 -181 -153 -169 -56 -219 55 147 -247 134 -111 169 -155 222 11 127 140 -29 128 -124
5402 -124 23 97 386 95 57 -20 -53 195 22 -69 -144 -21 -191 -100 -9 -313 8 -291 -109 -40 -74 30 -86
5425 -86 98 -69 146 -77 13 -269 57 -188 103 35 66 -28 172 -53 169 107 -159 3 -91 -209 -18 -217
5447 -217 -307 81 -99 -198 64 88 -156 -235 -138 -78 50 -34 148 73 -258 -35 304 118 254 92 -14 240 -3
5470 -3 -4 10 -18 -246 174 -72 -207 -31 -194 24 -9 -238 -382 51 -164 -131 32 -142 -39 -60 -139 -19 11 3
5494 3 68 46 -22 86 -31 241 6 73 81 177 53 89 -229 -276 -69 -340 -20 -82 10 8 -36 6 61 -106 -12 9 139
5521 139 125 43 -68 -174 117 16 -80 -56 -161 -71 174 -87 -139 -17 0 15 -54 60 9 -106 -182 85 -10 161
5545 161 53 -205 -37 165 219 -33 -38 -110 -247 -108 -146 -62 -196 -205 -32 -88 -44 -95 -1 -20 168 70 100 -147 -158
5570 -158 152 -84 -262 -146 -455 247 12 -4 -105 -79 -219 20 -49 63 -41 -95 176 24 -62 77 221 -20
5592 -20 34 69 -19 38 100 7 68 180 212 -25 -127 35 -179 50 -30 -151 -263 15 -10 -28 -34 -112 -310 -313 -94 -60
5618 -60 5 -211 -113 44 -89 148 138 105 102 171 -111 113 42 52 111 -254 61 69 -39 -326 -92 74 -133 -157 -40
5643 -40 -194 -261 -74 175 123 -182 45 48 187 -32 35 113 -196 -32 143 24 83 -5 22 99 -125 -258 16 94
5667 94 -209 141 -4 102 -314 -356 -248 -148 -68 82 63 -10 25 181 -64 -42 -101 -63 -52 88 -137 129 152 -60
5691 -60 45 -29 -43 -27 227 -204 -212 169 59 -81 -42 61 -48 83 -66 -190 -337 -283 107 48 16 -108 266
5714 266 234 -10 116 -330 -84 202 102 71 -239 73 2 -11 -109 44 -7 -254 39 201 -76 -108 -154 1 -48
5737 -48 88 224 -97 -62 113 7 3 82 -232 107 -74 100 -104 143 -163 -190 -169 123 28 -5 -139 233 -88
5760 -88 -210 138 204 -24 75 147 149 28 37 -78 146 27 -263 -70 -299 81 46 131 61 166 -35 -100 76 208
5784 208 -50 -9 -20 -146 197 203 -41 -6 -115 250 144 -99 141 35 -45 -177 -7 -63 -110 -9 -136 39 -40
5807 -40 48 48 -134 98 -134 -101 -112 25 248 114 -89 83 41 105 -147 113 229 78 43 -172 174 132 -87
5830 -87 15 -65 58 153 89 34 7 -22 119 -212 -53 -117 -209 -195 -85 48 -39 -220 -67 14 50 -121 62 250
5854 250 -20 121 -59 65 150 156 121 -49 272 313 -106 -230 -75 -167 -1 44 -3 -171 -81 44 -261 -138 -223
5877 -223 -169 -70 -129 38 -23 323 90 27 22 43 180 45 -94 254 110 12 -93 -28 9 -207 66 -125 -99 -125
5901 -125 -96 66 0 -195 93 8 5 -104 78 -64 -302 -12 65 209 144 215 97 104 233 272 26 168 -28 233
5925 233 -164 -147 -142 -90 51 148 52 147 52 -4 46 -72 -69 150 236 34 429 114 213 57 -153 -152 33 40 94 -9
5951 -9 -49 -56 -139 311 -88 -167 -435 37 -149 -392 53 -44 -4 -187 49 247 84 -175 49 291 91 104 113 -151
5975 -151 -217 -30 128 -127 6 -68 -39 -142 -267 48 -114 -107 91 69 213 137 22 -31 259 57 14 186 -138
5998 -138 94 57 288 238 -8 -221 -85 6 -158 -188 -235 -99 -274 51 -52 -42 66 29 -41 169 92 118 97 104
6022 104 95 32 57 -88 223 354 166 67 107 -72 -73 17 -213 128 -36 -117 -264 202 -208 -10 -40 -89 -18 40 201
6047 201 161 118 62 157 271 194 -141 -172 -172 44 -111 84 -172 30 -173 -40 -120 -44 -8 18 -41 132 27 40 119
6072 119 -27 -116 330 -192 51 129 -14 105 74 76 -116 -79 143 -256 132 -84 162 -18 -89 169 -258 -18
6094 -18 -62 114 -123 18 -61 -51 -130 -164 -95 40 296 -56 -199 298 423 74 359 -193 -29 -44 -55 177 -99
6117 -99 -68 -81 86 -45 -105 -307 -335 -142 -306 165 169 22 128 26 58 12 -17 -91 -259 161 120 140 -179 56
6141 56 -179 -117 -16 -166 -180 22 -210 -9 41 -133 33 -70 -77 -40 27 142 276 -119 89 -90 209 172 20
6164 20 128 103 -12 82 -198 55 -29 123 -273 -67 -128 87 -175 12 -143 13 35 -129 104 24 -130 155
6186 155 -96 54 197 24 106 193 -213 -157 -21 21 -57 -35 110 -123 -93 -26 -314 18 72 139 22 146 35
6209 35 -122 99 52 -44 -79 146 157 70 130 23 -7 13 -250 126 -145 -179 -143 -505 -239 58 -140 55 62 -12 -250
6234 -250 -104 163 162 -121 247 -176 199 181 7 -156 -20 2 195 41 197 40 -279 -132 215 78 -226
6255 -226 -138 -76 -94 -104 -187 -92 133 -28 -9 -112 150 -42 221 261 295 6 117 148 -145 138 51 272 -43 -80
6279 -80 154 -100 -51 -175 -7 6 -154 7 176 -245 -33 -15 -73 -55 229 255 170 102 45 253 31 9 197 32
6303 32 202 72 190 97 166 -30 6 -54 -15 17 -257 105 39 -175 -309 -164 -20 137 -40 -22 -5 -27 -81 75
6327 75 204 142 52 266 411 273 342 39 29 106 148 167 324 24 -31 -67 -53 -34 -16 -16 -146 -213 -311 -257 107 -157
6353 -157 -128 -173 44 26 -139 -159 151 142 155 130 138 111 -73 15 214 56 101 40 -203 65 -74 -119 186 -52 105
6378 105 123 17 -80 92 -12 -101 41 -12 -147 -199 -128 150 50 -187 127 -212 -162 233 -93 -185 74 24 45
6401 45 134 -20 143 61 -33 177 13 -260 -87 -239 -16 -69 129 127 -114 42 36 41 -65 -43 -101 331 -128 -45 -8
6426 -8 -47 -57 -142 -97 -313 -60 -101 -92 -67 -55 84 131 -17 157 246 61 159 -12 -122 -216 97 129 185 104 -211 -132
6452 -132 -295 -341 -163 -182 -275 -345 -193 66 63 -140 101 138 120 -47 44 212 292 106 454 449 33 113 170 104 -90
6477 -90 -211 72 -99 -94 -160 60 171 -95 -238 -83 -42 41 -34 -132 68 300 504 222 166 309 -20 -61 162
6500 162 101 -69 -67 -45 41 297 -275 -65 -150 -138 -276 -211 -350 -105 4 -63 -70 55 -117 34 -26 -22 127 74 -94
6525 -94 179 48 146 13 302 189 82 -204 11 224 -198 -91 -179 -120 -215 -88 -47 -184 -182 208 -242 57 0
6548 0 4 -38 51 199 169 -62 74 76 381 236 116 50 227 -80 -4 87 -228 -350 67 -77 55 -137 138 -58
6572 -58 -67 -129 -153 -318 68 191 141 31 -88 204 95 45 38 97 207 150 -35 423 181 -159 -61 -343 -75 291
6596 291 -137 -265 -232 -46 -280 -36 -22 -112 71 -22 -135 243 37 143 49 61 -12 289 67 25 113 5 99
6619 99 22 55 16 -227 -28 -54 -90 -73 90 -16 -190 -109 233 301 -163 6 -251 124 84 151 -36 -134 -22 85
6643 85 60 56 210 32 79 -115 -133 12 -130 -122 -26 -212 -60 -262 -155 -164 -85 -8 -226 110 49 -22 115 138 85 2
6669 2 41 -119 -158 -64 -81 370 -213 -56 -53 118 47 -103 -235 14 103 -168 -230 130 -193 -94 -117 -182 -50 -13 -106
6694 -106 -7 -354 -297 -24 -219 211 80 -152 22 -13 -9 132 171 183 -78 157 -25 -89 -167 14 124 222 -183
6717 -183 308 125 213 63 4 284 116 5 -1 -83 -89 -42 -214 -179 -32 -181 71 -155 -242 -21 35 -107 -183 157
6741 157 109 -53 -113 293 -8 269 78 107 134 19 205 134 79 -167 -77 -130 35 25 -77 -100 -10 -34 -117 -186 -62
6766 -62 -53 -8 -156 220 81 219 70 44 -106 222 254 142 142 124 175 153 -26 66 247 -73 178 -87 -223 -63
6790 -63 41 -90 19 3 -106 -195 -101 -42 135 -154 32 53 92 153 364 -71 -33 168 178 -68 228 11 88 102
6814 102 -50 -38 88 287 -174 -190 101 -106 -49 -117 -125 34 -19 -205 -107 -123 159 -59 8 310 -189 -321 -204
6837 -204 18 39 292 168 -22 42 119 151 193 3 -31 181 217 8 -19 217 86 120 66 11 -114 -37 46 158
6861 158 71 -56 -179 -64 -95 -182 40 -138 196 116 163 -56 28 -35 101 -13 346 -19 -257 59 -68 267
6883 267 -104 167 34 86 10 -133 76 291 -110 -180 -116 -195 185 -8 -212 -292 -9 -87 -78 262 -34 -80 187
6906 187 64 248 -272 116 82 118 43 118 87 58 -2 -67 -77 137 -70 -14 -116 -17 -78 -108 45 -223 -210 49 -2
6931 -2 205 58 -91 -161 204 53 56 -66 28 -101 -98 80 87 -130 111 121 185 -173 -50 106 48 414 44 257
6955 257 -60 -145 7 158 -84 -385 -120 62 -22 -10 136 41 95 168 37 117 -219 -117 -2 125 269 -103
6977 -103 -38 -16 89 -35 -21 -176 35 -180 39 98 -112 -32 -196 -53 247 -50 190 102 2 -168 67 -199
6999 -199 -48 -20 77 -9 -23 115 -11 -134 99 130 -119 99 166 113 66 -286 116 -95 67 55 113 -44 -188
7022 -188 71 -49 154 -54 208 -76 133 -109 -75 -75 305 279 252 8 -198 -3 -67 34 -19 117 -493 -132
7044 -132 -88 137 -50 2 53 -196 -9 -188 78 -39 111 197 197 79 68 33 -27 -148 -20 -51 23 -271 113 180
7068 180 -265 78 10 -215 -102 89 -327 -190 137 -170 229 -230 -103 24 -110 -102 -33 17 308 120 201 12
7090 12 173 124 -271 -68 18 -152 113 -145 -368 117 80 -128 135 133 -189 -40 -109 -80 -159 -140 88 111 -174 -50
7114 -50 96 -90 65 -62 217 196 29 99 -109 40 -92 239 -77 -77 -175 135 128 225 113 -127 164 -364 255
7137 255 -93 144 -63 -148 -48 257 80 -113 -6 33 -11 170 -13 -117 179 -242 -86 93 -150 -28 -105
7158 -105 -12 48 -56 -144 122 -71 196 -10 -176 -190 -144 -28 -36 -184 10 -71 -19 56 -161 -43 -221 -75 202
7181 202 -88 122 -44 24 213 -74 -84 204 194 86 -18 66 96 39 76 -206 -237 97 -191 114 -196 211 -287
7204 -287 -208 -149 -7 141 -101 23 -16 -160 87 -158 57 -83 168 -7 131 148 -143 317 -48 -59 -54 72
7226 72 -170 -278 251 -79 -52 -84 -273 103 -2 -337 -73 -184 -147 -116 -1 110 -97 53 -3 150 147 229 209
7249 209 27 -58 44 229 74 -98 93 0 -98 8 -200 149 -38 134 44 96 -102 -268 26 129 -4 -214
7271 -214 39 -16 109 145 160 -58 81 -246 129 118 -38 272 36 -26 373 -11 -60 -81 130 -66 54 77 -100
7294 -100 -126 34 -149 132 5 -77 -51 272 16 -97 -57 115 -214 88 159 -78 17 60 100 60 150 -49 103
7317 103 -109 -145 149 -23 119 180 -45 57 102 245 -299 -198 -71 -18 191 -113 -175 -119 -321 151 321 35
7339 35 106 -199 -68 55 75 -35 45 -148 -44 -135 -146 -145 174 -74 -184 71 28 97 -118 155 31 -67 -97 23
7363 23 -27 -150 49 -42 -13 -227 -5 -37 63 -38 144 28 131 185 265 -54 -78 -36 -249 -39 278 15 -41
7386 -41 -145 -45 193 113 -363 -48 -352 183 278 -117 -159 -340 -119 31 206 45 -93 -45 182 189 148 -39 -135
7409 -135 -222 355 305 33 34 -88 -104 363 402 -175 -144 -83 -90 -116 72 -98 -271 -213 -80 253 9 73 -185 106
7433 106 101 307 -56 -18 -146 -313 163 79 116 -55 -63 -41 -14 210 254 -187 -395 181 179 -42 147 -89 -210 162
7457 162 -199 -48 -124 -251 -16 -107 277 76 -1 -224 -163 -3 84 -161 60 43 -48 199 100 50 117 -21 110
7480 110 175 164 -210 -260 -222 330 208 -90 -70 -30 -59 90 -170 -192 -237 134 94 26 192 -144 -176 -22 -185 18
7504 18 24 -154 -79 -155 164 218 139 -201 -183 -176 -85 43 122 -82 -14 -66 186 -217 79 171 -40 74 4 -97 -108 -257
7530 -257 -179 -67 -77 -117 -254 -173 246 -34 266 25 52 -148 62 160 95 48 -74 244 335 120 -230 -322 -73
7553 -73 108 -103 -74 -101 -32 -79 -160 116 120 -101 -72 80 336 122 -56 164 7 124 150 189 -98 -226 81 -256
7577 -256 69 -143 158 -83 -127 -51 144 -72 79 -39 -98 67 165 -124 -179 84 13 126 134 -99 -211 50 35
7600 35 -129 119 44 -105 56 246 -198 -34 107 -5 35 9 -12 341 -8 -49 180 -131 -23 -39 -152 31
7622 31 -7 -139 -7 -289 -44 -212 245 -23 -29 -55 -42 70 -163 105 4 3 -43 23 106 134 47 -202 -34 131
7646 131 80 -177 -66 -272 -245 3 -151 220 70 -190 -226 27 -72 -10 -17 306 -32 -88 223 -89 96 -90 87
7669 87 370 -218 125 -71 228 76 193 -229 -290 10 -136 -172 109 -2 66 -116 -71 3 7 -101 -70 30 -81
7692 -81 25 -57 5 -76 22 127 163 192 -269 -222 -73 -60 98 47 -31 69 171 -246 -104 -133 29 -37 25 203 -45
7717 -45 57 55 -213 -128 45 25 -101 93 -26 67 217 46 -265 114 81 234 105 -159 107 -137 70 248
7739 248 422 -57 165 144 -90 -37 100 -118 -122 242 211 -117 -127 -28 177 10 78 37 59 -122 -137 -161 60 296
7763 296 -58 -59 106 110 156 181 -8 -115 36 337 300 -180 -136 143 159 53 -295 -140 -170 -176 -116 33 -104 -86 -394
7788 -394 -47 -87 -173 -262 100 -72 60 -3 30 -150 14 -8 -116 352 62 -31 -73 175 105 -87 -161 -144 -42 19
7812 19 38 52 122 -366 -21 141 148 -186 -142 -35 -96 117 236 72 -72 -114 58 -119 387 131 11 48 242
7835 242 224 195 4 46 -261 205 -50 -36 -307 -192 -378 97 48 -157 -200 -88 -180 211 5 -157 -27 27 285
7858 285 247 284 -184 12 -89 261 -164 16 -56 -132 32 4 -215 -128 -307 -91 23 -16 85 112 -179 -119 84
7881 84 128 -33 168 -166 64 74 120 -66 -338 -23 -15 155 143 -95 54 -122 190 408 19 13 -26 0 30 114
7905 114 -62 -74 -342 115 -36 -51 -92 3 -200 -100 223 111 -379 -267 -164 -126 383 3 56 38 94 -48 144
7928 144 -283 -65 -188 71 120 90 42 -167 -217 -25 214 147 159 -191 92 -150 292 -146 -45 -70 -163 -209 212
7951 212 -21 -47 -59 103 41 170 -10 -314 55 -150 224 86 15 -214 -152 67 213 62 -209 -550 -142 -42
7973 -42 -29 -283 -459 -192 151 260 -6 -145 -415 53 -41 162 114 -197 -215 253 137 331 188 -71 66 -112
7995 -112 -26 -32 -57 -320 -162 -236 -72 -153 101 -299 -24 33 259 -256 35 -128 -297 138 175 133 -92 -142 224
8018 224 101 116 143 -47 324 30 78 46 165 -253 16 -18 55 56 -211 -143 -119 50 313 -34 -442 -366 -78 130
8042 130 15 132 -120 -208 -57 253 324 -124 -46 -123 197 247 -7 95 -160 -176 247 296 -99 -151 -152 -8 256
8065 256 -23 -127 -151 71 117 191 -44 35 -320 -165 -25 23 -5 127 28 12 167 15 -237 116 73 140 236 45
8089 45 193 149 5 49 38 97 147 -288 47 176 -55 -36 91 -140 -243 333 -109 -177 71 -41 -83 116 35
8112 35 -47 -124 26 184 124 -103 -52 -128 99 224 81 49 160 -60 -261 -19 -149 83 -59 -334 -32 132
8134 132 43 313 -43 -129 134 -1 279 -29 -310 42 80 37 17 -33 156 230 9 57 85 -144 -11 224 -83
8157 -83 45 -181 -90 -146 -123 7 38 -28 -161 147 24 -144 107 -218 89 110 60 -24 83 44 -141 10 54 167
8181 167 91 -186 -47 125 53 -133 -114 47 -168 51
8191E1
$$ Imaginary data points
##PAGE= N=2
##DATA TABLE= (X++(I..I)), XYDATA
0 0 0 0 0 0 0 0 0 0 0 0 0 -7 8 -8 8 -9 10 -16 16 -24 24 -32 40 -47 55 -62 72 -82 96 -109 127 -141 161 -184
34 -184 208 -230 262 -294 325 -364 405 -450 497 -552 609 -674 742 -821 902 -996 1096 -1208
52 -1208 1331 -1469 1625 -1801 2001 -2230 2503 -2822 3209 -3687 4299 -5106 6232 -7910 10686
67 10686 -16110 30738 -157618 -438804 -97331 324119 464303 241327 81880 211409 500039
78 500039 581927 424327 252780 252710 285415 223278 115198 75697 32324 -113279 -307208 -343603
90 -343603 -203896 -114846 -275347 -531451 -545340 -245058 12160 -71560 -326402 -341643 -27496
101 -27496 285230 280786 62467 -18326 176664 407318 411231 245261 146756 184402 227240
112 227240 179120 102945 74085 37392 -71936 -178816 -162582 -55358 -44435 -213846 -376014
123 -376014 -299695 -52148 57211 -103411 -292697 -228174 41246 212451 113663 -78778
133 -78778 -80914 116531 259415 196095 51979 16571 87494 132962 101077 51953 36576 20019
145 20019 -36234 -78016 -30492 50886 26446 -114647 -193217 -85745 78226 86440 -72220
156 -72220 -190789 -103513 91711 149946 6342 -139252 -97364 60522 125551 40215 -65186
167 -65186 -67326 6497 46042 17086 -13454 -3653 5888 -16833 -24394 30040 84624 48878 -40179
180 -40179 -56510 41297 137034 102178 -29471 -91411 -4176 114949 99407 -34894 -116303
191 -116303 -60605 34907 39963 -47902 -115159 -91875 -28202 -8697 -40215 -58380 -38596 -22361
203 -22361 -25311 -10387 34587 62162 36723 -1388 14831 83450 125730 81963 -43 -9842
215 -9842 64282 113854 62357 -32513 -64920 -16459 31688 9387 -61532 -99636 -71533 -32189
227 -32189 -37419 -64640 -69336 -51560 -36877 -30876 -15370 7155 17419 9624 2405 27173 74214
240 74214 89510 52810 15786 30763 76489 86578 44287 -2129 -8610 19770 33527 655
252 655 -46880 -59226 -38789 -25353 -38450 -57076 -60504 -52889 -43551 -36106 -29446 -17937 -7407
265 -7407 -5257 -2208 15990 39610 43323 28946 26094 43716 60361 58592 37991 17403 17169 29958
279 29958 28365 4780 -17512 -20538 -16613 -21715 -32152 -42364 -46360 -40345 -33412 -32917 -33456 -27548
293 -27548 -18616 -13712 -6177 7485 16827 19977 23705 28056 32645 37868 39025 33969 27862 27411 27412 17674
309 17674 5146 -1495 -6988 -12297 -16672 -22425 -30181 -34129 -32565 -31426 -32765 -29391 -22423 -17324 -11367
324 -11367 -3812 1237 5785 13295 22228 26453 27716 31605 33097 29696 26968 25431 19500 13812 9711
339 9711 4433 -4932 -13285 -17447 -22849 -27556 -28066 -29825 -32334 -29578 -24497 -22702 -21985 -14996 -4737
354 -4737 2748 9818 15126 16261 20460 30166 34225 30734 28323 29645 29552 24440 17463 9317 306 -2838
370 -2838 -5653 -13754 -21017 -24083 -28529 -35860 -37021 -29425 -23896 -25979 -27715 -22393 -9887 5084 8157
385 8157 1385 2994 22347 42177 41226 25625 19191 28235 40098 39844 22481 5527 4824 10920
399 10920 5439 -11194 -22205 -23652 -26511 -31486 -30905 -27261 -26479 -32675 -39787 -31338 -6591 10902
413 10902 749 -19131 -10930 24983 47918 34674 7145 3480 31379 57913 47488 10755
425 10755 -8292 7864 26879 18591 -3884 -18405 -20078 -17424 -19147 -21397 -19156 -20215 -31405
438 -31405 -40704 -24771 7686 13322 -17065 -39323 -15475 33536 51236 16823 -25021 -16973 33639
451 33639 62228 30317 -17963 -22239 13696 37404 20232 -12292 -23126 -9038 3567 1083
463 1083 -4469 -1343 -3897 -21513 -26350 1212 31963 20138 -25856 -46319 -7146 46174 43805
476 43805 -19380 -64344 -28680 40682 51878 -9552 -62408 -43259 16663 40855 8438 -31478
488 -31478 -28373 7113 25631 16189 9308 16200 15842 2468 6452 36604 54752 24609 -28244
501 -28244 -37575 16891 64982 29996 -57637 -90441 -27641 43683 25728 -58578 -102184 -54567
513 -54567 21767 33281 -22022 -60594 -32624 20853 39630 26324 19706 26849 26903 22267 35697
526 35697 65594 71561 26326 -26640 -17067 47378 73505 5153 -85703 -89474 -8123 45553 -3739
539 -3739 -98701 -121628 -47380 26747 13802 -51803 -73466 -24719 29343 37777 20027 15466 27511
552 27511 34232 35530 52077 76352 67375 14858 -22943 11180 74869 69713 -19082 -92376 -64053
565 -64053 23318 47613 -32416 -120879 -106810 -13106 38135 -9608 -79304 -76229 -11491 37222
577 37222 29829 2364 504 19174 29962 31801 47257 65438 46146 -2450 -15769 32915 79965
590 79965 48576 -39738 -81369 -24723 55836 47993 -49018 -113672 -66912 24871 44818 -22566
602 -22566 -81844 -60595 8106 40707 14078 -20088 -16035 8863 20083 21758 32959 38058 13252
615 13252 -19941 -10342 41448 68843 24259 -49305 -59477 12889 73787 36785 -54793 -84356
627 -84356 -16884 57366 45867 -29653 -71787 -33266 28730 38590 -2606 -32074 -20506 1844
639 1844 6078 4097 9938 8119 -12420 -28277 -8369 33788 43496 -3429 -51754 -31842 39671
652 39671 70865 18829 -49638 -45918 23216 69978 36815 -31267 -48185 -487 43193 28850
664 28850 -16590 -35164 -18199 836 1115 -5746 -9118 -14279 -26941 -30081 -6574 23813 18912
677 18912 -23025 -45173 -7444 48692 52834 464 -39408 -13094 48447 67708 21316 -30414
689 -30414 -24397 23225 44806 17177 -20560 -27792 -9629 2528 -3668 -15200 -18172 -20109 -25682
702 -25682 -24221 -4775 11941 -1746 -29597 -29832 7149 42100 32304 -7975 -25337 6563 50051
715 50051 49992 7021 -21375 -3277 30508 34947 6155 -20847 -20455 -3267 4580 -5688 -17236
728 -17236 -18971 -19444 -21453 -16629 -3631 2620 -9442 -21970 -14203 11984 28083 15273 -9886
741 -9886 -11044 18065 41392 29358 -1215 -11509 6290 25153 20706 -1334 -17170 -11161 1324
754 1324 885 -10199 -17305 -16022 -14163 -13093 -8859 -3721 -4269 -9950 -11881 -3908 11794 18099 7034
769 7034 -4595 1090 19248 26351 14295 -836 -1668 9751 17851 9617 -6367 -12515 -5620 393
783 393 -3189 -10738 -13509 -13069 -11309 -9333 -8012 -6887 -5461 -5166 -4557 850 7951 9327 3963 2436
799 2436 9119 15949 16022 9590 3966 4245 9297 10864 3933 -4121 -4722 -1824 -2767 -6665 -10714 -12561
815 -12561 -11352 -8981 -8151 -9127 -9188 -6785 -5034 -3248 842 4001 4132 5281 7439 9514 10486 11134 10298
832 10298 8527 9020 9989 7812 3119 657 -561 -1613 -3571 -5491 -8390 -10444 -10105 -9733 -11161 -11544
848 -11544 -9164 -7591 -5959 -3856 -1812 -1189 1069 4803 6929 7770 9794 11274 10842 10435 10117 9242
864 9242 7462 6425 5063 2315 -253 -1993 -4424 -7441 -8422 -8576 -10152 -10432 -9500 -9720 -10306 -9239 -5465
881 -5465 -2819 -1112 329 1347 3147 7097 9525 8823 7797 9384 11475 11012 8838 6508 3336 2067
897 2067 2277 744 -2475 -4708 -6338 -9121 -10214 -8206 -6602 -8636 -10970 -9256 -4747 -10 97 -3842
913 -3842 -4620 2173 10851 11243 4725 1516 5603 11151 12494 7075 1091 359 4678 5527 316 -4143
929 -4143 -5028 -5180 -5985 -5048 -3305 -4425 -8007 -10691 -7948 -162 5370 756 -8294 -7181 5921 14783
945 14783 8875 -3372 -6158 4596 16035 13883 -177 -9212 -2786 7863 7421 -175 -6535 -6846
959 -6846 -4134 -1891 -851 -779 -3125 -7299 -9286 -2433 8878 9778 -4047 -15123 -5924 13863 20345
974 20345 4702 -14127 -12777 7826 21320 9972 -11624 -15840 -857 11825 8166 -4838 -11372
987 -11372 -7741 -533 2575 2080 1593 -1766 -8916 -8577 4381 16600 10258 -9447 -17374 -563 21499
1002 21499 20810 -4917 -24645 -11744 17485 24578 351 -23252 -18439 4919 17241 6138 -11762
1015 -11762 -14990 -3363 5843 4722 1752 466 -2613 -7374 -2740 11982 18579 4470 -16750 -17431
1029 -17431 7907 28778 16262 -18045 -31040 -5087 26677 21934 -11998 -32167 -15200 14929
1041 14929 22367 428 -20412 -15940 3162 12737 7891 1223 -1775 -4525 -4216 4189 16391 15877
1055 15877 -2783 -20335 -11815 17086 29817 4237 -30874 -30301 6162 32062 14642 -24543
1067 -24543 -36709 -8477 23491 21381 -7952 -24847 -11210 10500 16504 7859 -1024 -3667 -3039
1080 -3039 1558 10731 18922 11553 -10152 -22154 -4052 24887 25116 -8963 -36826 -22761 16229
1093 16229 30070 898 -35117 -32961 4035 28820 12871 -18311 -25034 -3391 17379 17332 4440
1106 4440 -3808 -2601 2350 6921 13524 16637 5458 -13301 -15719 6732 27011 14589 -20829
1119 -20829 -36339 -11220 24522 24432 -13824 -41688 -24403 15261 27964 1920 -25423 -21069 5770
1132 5770 22288 14498 -1585 -6618 303 6881 10554 14361 12499 -620 -14319 -8517 13960 23832
1146 23832 4269 -25999 -29800 65 26525 13339 -24008 -38392 -11067 22154 21617 -7450
1158 -7450 -27170 -15028 12339 22168 8746 -6552 -6534 2645 8787 11006 11226 5463 -5600 -10262
1172 -10262 -378 15797 16339 -5527 -26512 -19087 10389 24243 2398 -27487 -27688 941 23313
1185 23313 13257 -14071 -23298 -4740 17391 17406 603 -9536 -5016 4436 8617 8292 5498 -671
1199 -671 -7233 -7234 3123 13196 8464 -10320 -20752 -6732 15610 16919 -5619 -23655 -14642 10498
1213 10498 21643 5479 -16292 -16694 3598 17199 10399 -4445 -9883 -2825 5326 7133 3427
1226 3427 -1230 -4480 -5709 -3134 4832 8906 1126 -11873 -13128 1625 14984 9446 -7860 -16138
1240 -16138 -3892 14022 15368 -1100 -13697 -7164 8230 13160 3533 -7351 -8212 -671 5294
1253 5294 4152 -1040 -3794 -4487 -4124 -673 3793 3914 -2670 -8632 -5019 5085 9798 3163 -7844
1268 -7844 -8885 2695 12566 8349 -4288 -9318 -1602 7894 8024 -192 -6583 -4378 2027 4257 848
1283 848 -2784 -3209 -2472 -1448 821 2182 56 -3562 -4751 -1183 3905 4916 -599 -5881 -3781 3846
1299 3846 6754 1818 -3937 -4130 1541 6017 4181 -1449 -3786 -668 3559 3645 595 -1191 -1227 -464
1315 -464 659 418 -667 -1533 -2397 -2245 -1111 132 -856 -3218 -4261 -1547 1797 1613 -737 -1719 -937
1332 -937 2304 3912 2955 526 631 3497 4473 3311 1562 681 642 1463 1336 -394 -2132 -2130 -2409 -3710
1350 -3710 -3425 -3001 -3798 -3942 -3207 -2136 -1715 -1174 -542 3 1492 3174 3906 3369 3441 4155 5171 4928 4313
1369 4313 3571 2090 1937 1353 -363 -2345 -2884 -3170 -3757 -4627 -4921 -5871 -5503 -4782 -3926 -3482 -2124 -892
1387 -892 237 560 2624 4048 4168 4853 5843 6214 5808 5940 4880 3116 2385 2042 597 -397 -2050 -3138
1405 -3138 -4925 -5535 -5450 -5433 -5948 -5844 -5359 -4436 -2609 -1192 -959 -1000 1023 3717 5112 5094 4963 4510 5264
1424 5264 6223 6232 4666 2980 1764 592 -118 -210 -1096 -3738 -5706 -5329 -4027 -3127 -4205 -6180 -6966 -3704
1442 -3704 351 1068 -1726 -2791 130 4140 5700 4328 2015 1757 4654 6486 4527 2089 1067
1457 1067 779 484 908 1150 -468 -3667 -5211 -3555 -512 615 -2530 -6809 -6028 -48 3969 1320
1473 1320 -4132 -5292 406 6307 6128 677 -3775 -1226 4319 5705 2525 -1248 -1887 -761 1231
1488 1231 2378 1419 -1453 -3642 -3602 225 4652 3352 -3460 -7593 -2849 5707 8229 653 -7334 -6191
1504 -6191 2655 9096 4680 -5311 -8205 -1635 5440 4813 -1174 -6008 -5622 -1183 2668 3292 665 -2962
1520 -2962 -4922 -2386 4592 8980 4361 -4767 -6822 2057 12199 10637 -1678 -10490 -4922 8187
1534 8187 11988 1243 -10856 -10259 -493 6412 2896 -6214 -10672 -6463 -480 2587 808 -2477 -5404
1549 -5404 -5461 155 8441 9867 1910 -6243 -3783 8358 16832 10414 -5132 -10579 790 14456
1563 14456 11955 -4117 -14860 -9314 3605 8125 -1238 -12528 -13884 -5756 1810 2152 -2030 -5927
1577 -5927 -7535 -3585 4123 10114 7775 -1297 -6345 583 14581 18606 6343 -8996 -8305 7720
1591 7720 18290 9021 -9406 -16389 -5742 7932 7359 -6362 -16544 -13182 -2877 3186 805
1604 805 -5197 -8989 -7336 -688 7409 9818 4243 -4390 -5669 5755 18400 16291 -42 -10925
1618 -10925 -3341 13263 17716 3277 -14091 -15074 65 11008 4657 -11510 -17801 -10039 1378
1631 1378 4412 -1046 -7674 -9294 -4783 2948 8508 7956 938 -5646 -2460 10076 18405 10562 -5401
1646 -5401 -10978 1122 15564 14039 -3294 -16718 -11180 5215 10945 -329 -14310 -15530 -4534
1659 -4534 5359 4431 -3437 -9076 -7010 -400 5992 8228 4357 -2671 -5713 1323 12286 14275 3694
1674 3694 -8742 -7585 5608 15629 8065 -8918 -15702 -4940 9376 9202 -4129 -15101 -11436
1687 -11436 731 7515 2561 -5385 -8540 -4084 2645 6548 5659 462 -4655 -3712 4208 11408 9164
1702 9164 -1950 -9171 -4142 8896 13299 2374 -10878 -11034 1188 10687 5785 -6572 -12807 -5825
1716 -5825 4814 7021 -514 -7537 -7228 -1666 3873 5175 1771 -3256 -4897 -1184 5319 8202 3731
1731 3731 -4306 -6790 661 9953 9011 -1218 -9189 -5072 5481 9964 2931 -7614 -8934 -1066
1745 -1066 5789 4042 -3043 -7366 -5244 146 3180 1959 -1995 -4690 -3775 214 4750 5006 502
1760 502 -4510 -2977 4050 8825 5301 -2644 -5554 -141 6991 6925 -412 -6706 -4587 1963 4904 1220
1776 1220 -4720 -6417 -3525 1055 2172 -672 -3235 -3708 -1833 1475 3403 2234 -969 -2889 259
1791 259 4958 5774 1931 -2698 -2965 1936 5763 3446 -2249 -5157 -1950 2093 2680 -1066 -4338 -4002
1807 -4002 -933 1534 699 -1455 -2224 -1309 631 2156 2439 617 -934 -728 1512 3359 2502 -237
1823 -237 -2105 -1082 1687 2238 -560 -3371 -3115 -653 1197 775 -1815 -3070 -1580 1277 2059 700
1839 700 -74 -52 1132 2328 2711 1527 587 190 791 1240 736 -427 -1791 -2395 -1511 -612 -1533 -2676
1857 -2676 -3046 -2524 -1289 -159 -703 -1260 -959 1042 2412 2179 1703 1523 2159 2941 3645 2813 1670 1068
1875 1068 1322 771 -83 -499 -1672 -2090 -2358 -2491 -2776 -3060 -3040 -3027 -2602 -1586 -1032 -1046 -602 608 1736
1894 1736 2155 2443 2482 2515 3209 3858 3386 2257 1999 1826 1483 847 -110 -1071 -1912 -2081 -2111 -2755 -3221 -3091
1914 -3091 -3177 -3102 -2458 -1934 -1816 -1120 -292 708 1115 1731 2179 2161 2272 2925 3350 2823 2573 1841 1666 1189
1934 1189 753 364 -558 -1248 -1550 -1834 -1469 -1855 -2469 -2913 -2537 -1513 -1119 -1053 -1293 -965 -192 818 1504
1953 1504 1491 1095 1312 2041 2497 2333 1929 1023 272 716 1569 1267 219 -1086 -1653 -895 412 -202 -1965
1972 -1965 -3066 -1962 -380 280 -569 -1775 -1857 -273 1118 1502 257 -458 -253 649 2028 2009 927
1989 927 -455 -787 567 1920 1527 72 -2187 -1844 790 2046 771 -2101 -2806 -747 1685 1841
2005 1841 -262 -2921 -2167 835 2414 1236 -977 -1840 -919 1047 2020 1371 -913 -2308 -1433 1146
2021 1146 2628 1408 -1869 -3391 -1026 2946 3611 24 -3099 -2767 1162 4232 2557 -1796 -3735
2036 -3735 -1185 2737 3524 803 -2558 -2899 -765 2253 2604 -66 -2718 -3051 -1048 2522 2926 -39
2052 -39 -4400 -3998 752 4609 3583 -1604 -4907 -2179 3738 5695 1840 -3614 -3853 602 4543 3921
2068 3921 -456 -4079 -3259 803 3489 1999 -1669 -4067 -3493 341 3657 2628 -2407 -5580 -3187
2083 -3187 2555 5588 2255 -3800 -5442 -333 6118 5765 -457 -5246 -3435 2615 6249 3183 -2741
2098 -2741 -5152 -1705 2939 4307 847 -3291 -4625 -2303 2412 4422 1038 -3953 -5295 -1021 4686
2113 4686 5579 -101 -6136 -4585 2482 7175 4159 -3261 -6720 -2197 4533 6115 891 -4988 -4922 18
2129 18 4344 3787 -709 -4686 -4324 427 4378 4178 -774 -5177 -4332 1548 5891 4198 -2883 -6787
2145 -6787 -2897 4743 6691 1589 -5563 -6294 315 6198 5083 -1927 -6026 -3572 2184 5125 2833
2160 2833 -2434 -4739 -2447 2495 4864 2308 -2777 -5219 -2166 3686 6105 1665 -5015 -6236 -248
2175 -248 6088 5423 -1590 -6983 -4572 2832 6660 2593 -3983 -5468 -1324 4330 5263 1070 -3636 -3911
2191 -3911 -141 3958 4405 648 -3703 -4369 -181 4671 4106 -1546 -5754 -4568 1629 5688 2844 -4068
2207 -4068 -6650 -1733 4578 5407 550 -4523 -3909 1498 5422 3948 -885 -3648 -1982 2203 4425
2222 4425 2549 -1460 -4251 -2743 1582 4102 1350 -3539 -5905 -2610 2730 4310 -84 -5104 -4812
2237 -4812 519 4881 3740 -1199 -4276 -1703 3197 5391 2618 -1692 -2830 63 2929 3753 892
2252 892 -2555 -3757 -965 1922 2533 -832 -4085 -4212 -735 2988 2132 -1912 -4950 -2699 2172 4104
2268 4104 1647 -2241 -3023 696 4390 3953 656 -1715 -1514 1273 3471 2556 -599 -2824 -2005 530
2284 530 2156 1021 -1834 -3914 -2688 546 2175 184 -2873 -3356 -809 1972 2634 321 -2099 -1346
2300 -1346 1830 3565 2304 -191 -1374 -3 2121 2842 917 -902 -1734 -436 1152 1275 -395 -1964
2316 -1964 -2513 -882 849 945 -886 -2360 -1718 -29 1830 995 -1192 -1660 -87 1639 2243 729 -550
2333 -550 -721 680 1830 1432 -142 -874 -611 522 983 751 -607 -1347 -1104 220 817 -42 -979 -1488
2351 -1488 -712 607 795 -166 -1304 -851 336 936 687 21 -786 -318 647 1262 525 -503 -410 317 839
2370 839 966 -66 -544 -390 229 624 52 -170 -449 -465 233 438 231 -517 -667 -176 236 331 -200 -711
2390 -711 -656 325 462 -82 -368 -555 -157 432 411 286 -237 -172 344 549 229 85 -250 -79 259 595 81
2411 81 -211 -246 -194 -8 109 -187 -319 -585 -43 -44 181 -64 -505 -258 -179 147 35 -172 -488 -146 266 335
2433 335 59 -132 -173 -45 335 387 -53 12 21 279 305 455 138 5 -36 139 177 -33 -132 -386 -487 -207 -9
2456 -9 -437 -584 -505 14 -40 130 -237 -214 -335 34 185 236 192 172 97 198 711 614 307 61 157 287 577 451
2480 451 113 -310 -334 12 328 -75 -461 -897 -945 -365 53 -272 -818 -603 -560 14 714 408 -102 -468 157
2501 157 771 1256 584 -139 -123 384 1214 1045 361 -620 -738 0 519 354 -435 -1235 -1135 -147 395 -183
2521 -183 -1012 -1354 -963 256 1092 503 -615 -940 159 1457 1585 374 -366 -641 773 1686 972 146
2539 146 -924 -613 481 1233 244 -1201 -1578 -691 279 967 -13 -1475 -1850 -395 1356 1583 -242 -1399
2557 -1399 -1024 723 2165 1410 -211 -1362 -297 1387 2075 914 -1056 -1461 -308 1194 1547 -253
2573 -253 -1617 -1760 -344 1428 1261 -346 -2039 -1812 562 2158 1296 -885 -2287 -929 1474 2611
2589 2611 940 -1842 -2154 -73 2135 1840 -119 -2318 -1838 458 1876 1528 -842 -2158 -1472 874
2605 874 2536 1353 -1026 -2136 -638 1927 2582 811 -1826 -2318 -147 2288 2282 -682 -2748 -2183 789
2622 789 2555 1090 -1389 -2811 -1534 1440 2281 718 -1753 -2247 -487 2102 2739 804 -1983 -1972
2638 -1972 264 2772 2849 -1 -2803 -2148 864 2948 1503 -1964 -3228 -1544 1608 2465 43 -2281
2654 -2281 -2823 -419 2326 2370 0 -2675 -2213 601 2952 2445 -365 -1949 -1396 1678 3144 1619
2670 1619 -1638 -3195 -813 2169 2787 98 -2856 -2977 -212 2232 1831 -1105 -3351 -2152 961 2650
2686 2650 1502 -1060 -2761 -1011 1931 3303 1423 -1149 -2118 -255 2475 3141 349 -2461 -2449 372
2702 372 2739 1819 -888 -3137 -2212 902 2301 1049 -2113 -3034 -1000 1870 2470 301 -1934 -2089
2718 -2089 305 2533 2259 12 -1795 -1760 633 2772 1964 -945 -2588 -1677 1167 2625 1010 -1784
2734 -1784 -3037 -1045 2026 2196 -158 -2313 -2436 245 2431 1866 -641 -2130 -1501 1225 2277 1286
2750 1286 -1019 -2316 -1136 1243 2417 527 -1603 -2383 -538 1880 1845 -151 -2423 -1802 554 2099
2766 2099 1636 -623 -1924 -1330 1106 2489 1142 -1243 -2019 -178 1457 2045 204 -1467 -1790 -26
2782 -26 1497 1199 -383 -1888 -1720 221 1643 1079 -1047 -1574 -1013 1204 2114 622 -925 -1478 272
2799 272 1701 1826 186 -1254 -977 411 1388 1141 -512 -1751 -950 474 1006 57 -1177 -1697 -629
2816 -629 793 1070 -54 -1062 -1186 27 1389 1142 -95 -817 -593 981 1722 1088 -387 -916 -5
2833 -5 792 1239 -43 -961 -1520 -345 415 450 -600 -1367 -1383 -62 565 156 -392 -1084 -208 642 1070 788
2853 788 -59 -416 378 1303 1163 389 -132 -298 357 809 523 -550 -781 -908 7 305 -66 -710 -907 -400
2873 -400 -71 95 -12 -638 -535 229 499 713 66 -247 176 602 833 681 -23 35 77 575 437 -108 -380
2894 -380 -435 -60 144 -102 -85 -628 -440 -234 255 117 -368 -527 -187 349 311 146 -193 -113 374 430 418 133
2916 133 -67 206 302 522 201 -28 -105 310 256 224 -42 -278 -261 13 159 201 -116 -288 -180 120 370 20
2938 20 -232 -265 -42 30 143 -141 -157 -135 -27 -39 285 -189 -274 186 26 101 74 -156 -43 177 249 240 -9 179
2962 179 -36 50 320 382 -54 -234 -56 -134 -175 -198 -384 -388 4 -80 141 -282 -143 -274 -15 260 138 187 4
2985 4 85 234 420 193 161 128 165 167 154 152 -235 -173 -34 3 3 282 -206 -396 -282 -49 59 19 -257 -383 -383 33
3011 33 379 150 -287 -390 -128 174 344 110 -71 -230 276 304 478 320 -102 -343 108 566 394 91 -145
3032 -145 -570 -443 322 487 -533 -779 -604 -34 23 64 -452 -611 -249 280 587 374 10 -191 67 763
3052 763 775 510 -203 -17 522 956 463 -130 -656 -151 17 346 18 -736 -766 -1022 71 365 -296 -723
3072 -723 -1062 -266 582 525 92 -153 -104 -1 1057 718 129 -326 -395 661 1147 646 -135 -869 -423 506
3092 506 480 49 -916 -1132 -293 334 654 -258 -1227 -1130 -20 851 402 -306 -753 -522 686 1624 632 -148
3112 -148 -540 -214 950 1509 432 -841 -1108 -100 998 447 -498 -1195 -1125 -4 851 567 -773 -1253
3130 -1253 -746 395 1152 649 -634 -1081 -33 1109 1465 406 -689 -844 214 1374 1246 -171 -1081
3147 -1081 -1068 370 1117 556 -542 -1592 -791 477 1035 253 -948 -1264 -114 1405 1222 116 -1164
3164 -1164 -852 201 1408 1009 -363 -1333 -854 415 1118 557 -821 -1501 -308 668 1307 365 -1054
3181 -1054 -1265 -163 1202 1082 -93 -1118 -774 576 1703 767 -455 -1075 -404 816 1343 550 -893
3198 -893 -1323 -417 856 1197 -320 -1335 -1550 -143 1300 786 -207 -1205 -894 677 1459 904 -505 -1056
3216 -1056 -229 1238 1385 582 -859 -958 -79 1307 1186 -255 -1377 -1451 83 1051 609 -635 -1753 -1154
3234 -1154 635 1039 395 -922 -1361 -105 1138 1439 488 -883 -1015 332 1422 1174 -46 -1114 -520
3251 -520 442 1501 738 -684 -1294 -592 335 1052 94 -1154 -1518 -466 783 1079 -19 -1370 -777 120
3269 120 1281 761 -184 -885 -510 559 1413 812 -352 -976 -528 839 1014 206 -826 -1052 -298 715
3287 715 853 -251 -1036 -1102 83 1054 607 -718 -1306 -550 497 1202 218 -567 -910 -71 831 1132 309
3306 309 -797 -821 360 879 634 -316 -815 -545 318 888 63 -723 -955 -347 548 641 -82 -641 -439 3
3326 3 751 637 -137 -591 -580 209 643 431 -520 -723 -389 392 558 71 -561 -590 57 643 625 -230 -416 -357
3348 -357 275 719 458 -315 -614 -302 147 642 80 -471 -574 -193 312 480 197 -461 -296 46 498 498 -120
3369 -120 -123 -446 242 325 192 -231 -206 0 378 570 185 -200 -227 196 323 407 -130 -399 -594 55 294 207
3391 207 -584 -419 104 274 239 116 -258 -488 -4 211 254 -99 -185 -226 67 428 373 41 -34 -87 511 250
3413 250 0 -190 -325 -181 185 308 -193 -233 -535 -217 168 256 -440 -173 -245 156 65 -81 21 -122 364
3434 364 -81 245 122 171 6 159 443 182 -112 -289 -6 50 75 -84 -336 -32 -34 106 265 -39 -265 -553
3456 -553 28 26 179 -330 -187 -85 99 99 141 -125 -36 24 103 232 255 -262 -90 278 432 440 -137 0 15 -73
3480 -73 321 84 -287 -420 -190 -142 102 -66 -190 -334 9 170 -133 118 -244 28 380 426 292 7 -42
3501 -42 109 402 205 -6 249 -82 -101 75 105 -88 -276 -327 -228 -193 -192 -140 -107 -324 -38 67 64 -26 5 21 -75
3526 -75 366 136 -58 176 175 269 284 203 -140 -230 -169 51 68 -75 -37 -85 -143 141 -57 13 95 -381 -127 287 150
3551 150 154 -126 -71 62 128 248 -118 120 50 43 -34 4 -321 -471 -226 -531 -26 -189 -379 -371 -322 326 324 129 -59
3576 -59 -84 314 566 605 353 174 63 73 266 157 -269 -117 -86 -196 103 -275 -521 -826 -314 -26 156 -72
3598 -72 -426 -308 99 318 235 151 -9 45 413 598 528 -10 82 140 231 370 2 -336 -657 -245 -44 -156 -101
3621 -101 -653 -741 -564 160 425 -74 -520 -482 263 531 512 227 -5 279 459 844 499 81 -159 -23 309
3642 309 222 89 -518 -631 -320 -9 124 -538 -706 -663 -10 265 146 -302 -647 -151 531 728 380 55 -41
3663 -41 296 866 525 496 -65 -282 110 393 284 -29 -526 -473 18 84 -22 -810 -669 -363 345 350 -324 -331 -475
3686 -475 -35 782 595 169 -172 -129 394 845 621 -244 -402 -71 243 558 -114 -698 -687 -11 175 146 -151
3707 -151 -552 -714 76 297 79 -343 -656 -208 215 715 485 -185 -337 53 556 691 150 -423 -321 101
3727 101 348 461 24 -436 -537 160 558 277 -199 -496 -285 243 678 131 -329 -558 -164 429 234 92
3747 92 -495 -652 -98 328 667 -296 -180 -333 153 376 113 -35 -333 -234 247 443 141 -202 -472 -344 522
3768 522 311 -272 -380 -505 408 349 488 -117 -497 -34 221 492 -1 -340 -438 -385 510 349 -124 -500 -711
3789 -711 100 407 233 -138 -406 -298 58 260 359 -216 -222 -103 137 445 85 -251 -380 -115 418 145 242
3810 242 -264 -535 -220 323 215 -110 -495 -185 295 630 150 -191 -352 27 356 440 203 -360 -117 -122 319
3831 319 180 -218 -203 -34 232 120 49 -512 -295 -366 -15 95 -149 -379 -560 19 142 -7 -165 -248 -32
3852 -32 422 365 281 29 -297 76 412 311 184 -118 -204 -42 214 243 -96 -228 -143 30 88 -78 -174 -534 -69
3875 -69 -25 324 51 -369 -194 -149 -18 198 -325 -311 -116 49 436 -4 -130 -168 -78 104 211 144 82 -55 243
3898 243 361 108 134 -141 -253 86 222 -123 -93 -307 -359 -194 152 -87 -25 -313 -61 -64 121 70 -121 -88 163
3921 163 305 435 246 136 -25 482 204 438 -58 -130 -165 -206 248 -102 -490 -445 -136 -173 -117 -440 -355 -274 -288
3944 -288 171 165 42 -104 -204 371 314 240 158 290 134 633 298 -10 126 47 94 -113 -136 -257 -134 -66 -200
3967 -200 174 -364 -69 -274 -186 -28 114 -70 -298 -39 134 311 366 93 13 85 308 294 86 47 -120 -214
3989 -214 -54 117 95 -196 -187 -199 -112 -71 -303 -264 -144 -4 -117 -118 -55 -21 133 56 143 -96 -127 -86 28 209 -59
4014 -59 130 -159 12 21 29 100 -253 -257 -391 111 35 117 30 26 131 116 421 33 79 137 119 240 271 17 35 -19 -48
4041 -48 162 -23 -48 -223 -11 -86 -23 -26 34 -199 -89 -96 -38 132 62 -50 125 357 107 448 273 -22 48 -89
4065 -89 -92 -122 -206 52 -80 -303 -41 -121 -397 -302 -254 60 -99 -177 -264 -104 155 91 -22 -58 83 278 478 266
4089 266 173 -81 83 271 111 101 -109 -41 -200 -56 -232 -321 -217 -342 -202 -187 -467 -72 -149 -332 -253 -68
4111 -68 -38 7 117 4 107 375 463 65 269 207 141 155 425 45 -178 -219 40 -98 -292 -341 -268 -422 -282
4134 -282 -228 -13 -358 -286 71 156 -47 -202 -98 -266 191 194 540 264 43 290 31 222 222 -50 96 -48
4156 -48 20 -34 -96 -260 -382 -90 -148 6 -235 -328 -295 -206 102 -122 18 -232 127 158 65 36 -98 -52 162 210
4180 210 480 -6 -60 -170 -224 -33 -110 1 -145 -329 -114 -1 124 -145 -253 109 116 81 233 -134 -125 143 386
4203 386 86 208 -173 -24 81 88 158 -12 -6 -167 116 -61 -9 110 -115 25 49 261 -90 -119 -211 -180 17
4226 17 135 47 -265 -55 -14 87 15 -109 -130 225 11 203 -26 -211 -261 17 162 154 -7 -288 18 -19 184
4249 184 289 -169 -64 94 99 328 24 -180 -36 57 -109 38 -30 -215 -256 89 1 0 -132 -534 -172 126 77
4272 77 -29 -138 -96 100 260 176 178 -134 -184 -58 347 278 189 -39 -87 66 357 -40 -212 -284 -134 -211 222 -172
4296 -172 -61 -324 -71 -156 145 18 -364 -48 -87 144 112 235 101 197 39 248 173 -60 56 45 240 142
4318 142 -44 -136 -5 224 133 133 181 -336 -166 110 184 -118 -51 -256 27 -20 333 -9 -252 -27 14 191 -133
4341 -133 34 -85 -197 22 133 -23 -144 -159 87 -192 84 263 -96 -297 -200 33 309 -87 84 -122 -108
4362 -108 214 38 86 -254 -102 -65 220 102 -20 -341 -56 174 -86 82 77 -17 -72 320 64 -11 -106 -376 66
4385 66 -39 174 -105 -142 9 -35 -71 13 -128 -39 -242 202 200 -73 -60 -89 238 136 188 -47 -71 291 138 89
4409 89 -15 -3 -124 95 107 6 41 -266 -172 -113 52 54 -94 54 -105 -24 21 203 -238 -177 197 -26 19 -246
4433 -246 -230 9 30 -57 120 132 -142 -168 -138 124 -191 74 -23 11 -137 25 55 201 8 85 -122 188 81
4456 81 -97 -55 -96 38 -21 19 51 80 58 -55 -134 -153 -28 -78 139 130 22 -79 171 273 -10 213 202 124 154
4481 154 363 214 11 123 -255 -57 134 -30 166 -174 -24 202 43 -187 -15 -156 -214 34 -24 146 -49
4502 -49 -281 217 284 162 301 130 152 49 110 -8 244 -135 -91 314 9 -55 -110 -155 -115 -42 -207 -108 -222 -246
4526 -246 -365 -172 23 -55 -418 -178 -53 128 162 65 398 -177 253 221 298 86 95 115 90 217 20 -163 -47
4549 -47 -59 -142 -247 46 -195 -248 -122 -220 84 -171 -167 -152 119 221 33 27 -82 0 312 332 21 98 110 334 433
4574 433 21 -127 -237 73 -43 -108 -91 -188 -503 -338 -55 17 12 -33 -469 -187 101 95 102 -44 260 38 450 264
4598 264 162 101 -40 76 -11 -114 197 -230 -450 -139 -272 -406 -460 -588 -25 -113 -5 -175 -213 -179 105 10
4620 10 170 144 175 64 372 462 66 578 89 388 30 -56 174 -64 -156 -277 -162 -101 -198 -200 -34 -232 -282 -59
4644 -59 65 131 -13 88 51 91 259 72 246 382 121 73 -71 -64 -80 24 -105 139 -150 -227 -60 -405 -161
4667 -161 -267 -289 -77 -363 -72 33 67 -2 146 -130 19 298 264 167 107 298 109 222 -48 72 104 -35
4689 -35 -68 -144 -85 -133 -50 -20 -170 -196 -299 -160 -74 -98 200 215 -98 177 -51 187 223 145 74 260 -88 124 122
4714 122 -174 -44 -172 -251 -129 -127 -247 -561 22 4 -250 128 -76 136 250 376 7 201 291 261 123 190
4736 190 -6 28 290 115 109 39 -77 -274 -96 -415 -378 -76 19 -520 91 -165 -229 -229 -337 22 48 320 210
4759 210 227 72 260 164 79 249 104 -66 309 28 174 6 -239 -173 -126 -276 -65 -225 -420 -488 -66 -162
4781 -162 -292 35 -7 -204 68 358 96 55 235 159 376 175 122 209 258 488 155 110 9 232 -122 -126 -293
4804 -293 -87 -217 -267 -249 -330 6 -164 -79 -124 -86 -27 157 193 45 238 281 146 148 148 1 89 130 18 22 137 -4
4830 -4 10 74 -147 -154 -32 -222 73 13 77 145 -175 113 -63 99 -108 -25 -61 -135 11 91 -36 -162 104 113 154
4855 154 101 -233 -169 -344 -49 349 81 -69 -37 107 160 -57 -159 35 -226 7 281 -47 13 145 -138 195
4877 195 -57 70 -53 22 243 143 219 -107 -34 -275 -40 62 29 70 72 -103 161 83 -30 -103 -9 169 345
4900 345 321 86 118 66 -64 172 -35 143 73 23 140 2 -40 38 -270 -121 -36 -82 -18 -323 -12 -240 15
4923 15 43 72 -150 20 139 33 274 165 243 82 262 -24 179 75 -187 167 -73 -50 28 1 -115 -205 302
4946 302 -94 -418 -196 10 -189 171 -95 68 -110 169 -14 154 33 37 -22 -104 266 235 116 187 72 100
4968 100 34 139 -126 138 9 -120 29 -10 -255 -183 -130 -26 -88 34 -359 -238 -104 81 -10 63 -65 225
4990 225 398 -22 77 274 15 -39 -156 14 -152 103 -20 62 -262 -116 -31 -32 4 -48 125 -273 -24 -257 -188
5013 -188 36 240 -60 57 37 121 -45 296 85 -159 143 78 148 185 -249 -166 -64 359 27 -144 -64 -198
5035 -198 -292 -128 -153 -33 30 -160 149 -16 -103 98 -135 12 277 115 92 -14 3 -66 65 -187 134 -19
5057 -19 57 -64 -24 87 -16 -27 -39 184 -15 -53 -127 29 83 61 18 80 -63 15 -171 -85 41 -32 164 -23 -210
5082 -210 -21 196 -195 -53 26 147 268 -55 -329 11 -368 122 -71 220 -187 47 -128 27 -117 -70 91
5103 91 164 -101 -24 -15 -46 155 -57 169 47 99 114 -104 -122 -300 -174 106 -58 -205 -25 0 14 133 -273 99
5127 99 119 130 307 74 6 -69 -61 108 -25 5 48 -102 136 225 -244 -187 -67 -86 39 104 37 81 10 -165 -137 -120
5153 -120 -64 -55 36 -14 27 -27 98 -98 304 65 -16 131 -100 -77 -307 -97 -112 -28 -76 -281 -17 4 -134 -39 5
5178 5 -130 100 42 -18 -114 6 -91 417 65 146 -161 -201 103 73 -174 46 -50 -82 -67 -10 -118 -45 -198 -168 130
5203 130 33 98 -90 -157 7 170 -50 -81 37 113 8 133 52 76 165 93 -117 78 -173 -124 115 -73 173
5226 173 -198 -35 -137 -239 -267 -152 -431 -88 -100 -306 -110 35 39 -159 123 170 203 -26 -76 10 -143 42 149
5249 149 -259 48 128 286 86 -87 18 -71 27 50 1 -296 76 -53 -61 -308 31 136 -6 -129 -185 218 95
5272 95 62 -28 -183 137 78 -66 189 -69 -24 82 300 51 263 -159 -22 -132 -136 -120 155 -184 -209 -33 275
5295 275 197 -133 -68 -6 62 89 -124 12 -41 208 38 94 -108 -136 -35 184 -145 124 -113 181 -266 -115 156
5318 156 -12 22 80 -148 54 215 67 233 -43 189 -153 -149 -7 -146 121 36 -50 234 -54 78 77 355 103
5341 103 107 47 9 -38 167 612 81 -76 322 274 52 97 40 -9 -3 86 -61 -232 -282 -107 -318 -131 -20 -35 -183
5366 -183 -195 -109 -26 173 90 -100 233 136 55 187 108 310 -60 223 297 10 70 -291 179 -67 -59 124 -79 6
5390 6 -142 -14 -197 -204 -149 -186 -332 -52 24 -86 91 -33 50 145 300 295 333 55 374 352 154 186 133 46 144 97
5416 97 -158 123 15 -151 91 241 -360 -74 -335 254 101 -193 -75 -28 3 23 -102 -263 -144 151 200 47
5438 47 -51 358 -133 -11 48 323 124 268 -75 -140 55 67 35 -113 -41 -7 12 114 117 -63 -168 -41 135 -20
5462 -20 -28 77 68 -142 99 95 -140 22 192 125 191 0 188 -79 -211 26 48 192 -178 -63 -170 -110 41 -151
5486 -151 -171 -182 -173 58 -81 -6 -201 -60 32 160 137 -302 107 37 250 252 131 296 -123 114 141 187 164 167 131
5511 131 16 -200 62 -83 -99 180 77 212 66 -50 161 52 51 172 -182 -8 -64 128 56 62 149 25 156
5534 156 22 151 72 86 -83 99 2 112 111 57 84 -122 327 -249 10 13 -125 147 146 -13 -244 -243 200 -35
5558 -35 -69 22 -42 -42 27 83 -77 6 -217 -117 74 -104 20 25 -95 117 -89 268 12 170 284 -175 363 -263
5582 -263 -47 1 -59 -186 -1 24 -280 24 -265 -8 -121 42 74 -71 -154 -158 92 210 -9 95 -17 65 186
5605 186 286 134 190 242 278 -27 29 80 79 16 -80 183 135 -105 -238 -333 -259 -67 -83 -167 -48 64 139 -272 88
5630 88 46 -198 207 254 45 138 130 239 81 28 45 12 154 -71 250 75 -72 -96 -116 -276 -283 -235 50 -242 13
5655 13 -156 -46 -207 48 154 -36 294 -8 380 102 201 49 84 272 85 43 -162 329 140 -86 -72 -210
5677 -210 -295 19 -276 -473 -222 -53 -86 -72 -97 -116 64 -129 -90 234 115 133 225 -75 50 61 -74 161 -107
5700 -107 -117 -18 161 -33 31 289 -48 -10 -24 71 33 50 -82 95 -122 -242 -105 343 197 75 -36 -29 143
5723 143 -69 17 26 98 -302 156 -237 -239 140 78 -3 158 -193 149 146 -138 32 -141 74 -259 -220 -105 -62 77
5747 77 244 88 141 -111 -55 152 376 10 -298 -34 149 61 24 -200 -331 1 277 69 -132 -55 160 -104
5769 -104 156 91 55 3 -194 96 -80 -90 -100 81 24 2 21 -13 -27 6 -140 -119 -246 200 -147 -2 -194 -175
5793 -175 154 121 -93 -45 1 -118 221 35 33 -21 194 305 -82 101 2 -127 87 196 1 -109 -56 -64 149
5816 149 2 32 -183 -44 -10 -42 -100 -111 -23 -185 28 165 -124 36 63 -63 41 -44 -131 -250 114 42 366
5839 366 125 -33 -220 -147 -70 24 -143 -108 -158 -82 126 -245 -171 -157 17 220 224 -77 47 -133 -65 122 400 -199
5863 -199 182 142 158 154 176 102 -92 20 -58 -53 274 224 -59 -68 61 78 112 -224 -245 -191 -7 112 130 -22 -121 -1
5889 -1 438 310 -203 -25 68 22 168 -110 -54 -72 -167 151 -130 174 -42 130 234 -301 21 -191 9 -181
5911 -181 -127 -28 51 -258 -163 85 127 373 14 42 5 190 55 72 -46 -39 27 -415 -11 -75 -87 -84 -154 151 43
5936 43 -91 72 -140 138 -164 130 66 271 245 -168 36 -19 178 -45 125 -156 -17 103 108 -263 -232 -13
5958 -13 131 160 -117 -342 -259 -42 -199 -132 -15 53 309 35 391 230 174 64 230 -152 350 -84 -188 -165
5980 -165 -110 223 93 132 -59 -269 -165 -101 -53 -215 -47 -21 -197 -65 -229 6 85 -233 -210 223 349 148
6002 148 205 204 56 172 165 93 128 8 -260 -34 -38 -112 -138 -49 -70 -289 -209 -80 -122 85 -66 51 -176 66 7
6027 7 226 84 162 -54 168 -148 313 45 -134 -156 -277 -117 112 -66 211 173 -293 -315 56 55 -206 -108 -58
6050 -58 195 48 96 190 -40 121 208 158 3 25 -29 33 -88 102 247 139 -107 15 71 -41 154 75 -148
6073 -148 -100 83 -113 45 106 192 -245 85 110 91 -5 99 301 -200 -55 43 103 103 109 112 43 24 -176 19 -10 -50
6099 -50 -121 -82 265 -222 151 9 -102 249 -40 -5 355 124 230 93 -65 471 20 135 -182 -97 -108 16
6121 16 -137 -394 153 147 97 -28 -31 -222 84 -186 -187 130 3 117 -41 -52 -15 4 15 -115 88 -120 85 -106
6145 -106 160 -110 14 -14 9 -62 169 -204 -204 -70 -232 -117 -295 34 309 122 -37 193 -29 44 -29 73
6167 73 264 -40 113 -74 198 -248 -11 226 -158 90 46 -65 22 -248 -23 388 -34 -167 -22 -40 -8 237
6189 237 153 100 65 44 -160 -80 -69 -139 46 -147 -17 -136 115 -25 186 -197 11 -303 -221 -15 -66 51 308
6212 308 71 -177 125 67 -22 -16 -114 102 -105 248 100 59 205 -285 -78 40 -146 -46 44 -226 316 -163
6234 -163 -36 -233 -66 -227 28 -254 -9 -141 -93 81 223 263 -5 99 216 -23 202 -5 69 -73 79
6255 79 -193 198 121 -268 -259 -40 102 34 -238 -183 -313 -239 -250 76 124 131 -68 -100 171 125 -46 -11 165 21 121
6280 121 168 153 124 111 -193 84 186 146 -123 -87 -138 -113 -75 -228 -27 -325 -136 -248 -126 -178 -394 -34 215
6303 215 264 -146 107 113 307 71 251 -11 -26 -46 25 331 192 86 38 -149 55 209 -172 -37 -227 -141 -109
6326 -109 56 -194 -232 -249 44 58 61 179 -143 41 151 117 362 -46 69 217 57 29 -77 -197 -110 -89 -63
6349 -63 -136 -212 -273 -97 -6 -134 18 -77 -50 -266 182 -68 -302 -193 137 183 -72 78 197 78 88 78 7 149
6373 149 -39 -182 204 8 76 -31 -237 4 -146 122 134 -189 8 191 60 -10 -54 -139 16 153 -19 133
6395 133 -22 96 130 -23 164 -161 -61 -45 -18 75 -146 249 -195 -443 121 -31 64 34 -69 8 43 123 238
6418 238 48 10 -43 65 170 25 126 104 -211 11 14 -84 -339 -97 -307 -49 145 -117 -151 55 -50 -106 113
6441 113 124 29 -98 208 -6 183 134 85 135 26 51 158 -46 110 -50 -116 15 -22 -14 -82 -115 -196 -215 -198 -7
6466 -7 -153 -98 4 28 116 147 -73 246 254 -45 257 230 -5 85 105 199 60 12 -26 165 101 -211 -288 -42 -333
6491 -333 -195 -216 -71 -103 -69 -181 -94 7 12 253 -17 179 283 49 76 161 34 46 -31 77 73 -169 89 -21
6515 -21 -31 64 -235 -45 -145 -151 -76 115 28 -78 120 92 273 84 14 155 -18 -55 58 45 221 -122 34 88
6539 88 -126 43 -204 -188 -148 -262 -210 -296 -274 -17 -284 -26 -40 -160 -186 144 169 21 -98 -38 357 161 412
6562 412 87 67 -63 -108 132 -150 49 173 -181 -23 70 -161 -132 -26 -118 -19 44 -7 203 22 -110 44 -46
6585 -46 110 121 -227 83 -157 6 56 340 110 103 -199 -305 -136 197 48 30 -4 38 1 -148 -17 -212 -356
6608 -356 -263 -203 -166 -257 -30 -122 65 132 -44 330 -11 245 70 197 -227 124 2 10 155 -35 -147 262 -157
6631 -157 114 -68 -70 -95 -276 -135 41 -13 -12 -118 -130 -87 -23 114 0 120 16 226 118 69 -148 303 47
6654 47 -86 47 -18 227 98 -94 8 -175 314 325 -67 49 -200 37 -230 156 -150 -31 185 82 96
6675 96 -127 124 94 -94 -145 65 69 84 15 -183 133 -159 24 -27 -6 119 -91 177 124 156 -59 -170 -51 45
6699 45 231 -117 10 69 -26 -72 -161 -31 95 209 91 -87 169 140 43 -137 56 118 -51 59 210 -27 -130
6722 -130 112 374 281 -18 -18 111 -64 210 431 87 93 31 20 -10 54 -64 -112 -291 -271 -331 -94 -175 -19 -30 -22
6747 -22 -184 70 -88 50 -125 -77 35 289 98 108 -52 128 141 -92 127 54 -93 -315 -180 -189 -163 -134 -144
6770 -144 -260 12 -15 -64 -77 -148 59 -131 -23 237 -13 -171 254 159 109 127 163 207 69 234 298 349 -251 31
6794 31 -62 53 47 20 16 -75 -300 -9 -89 -369 -112 -139 -154 13 36 91 -147 36 -106 107 88 -148 51 16 83
6819 83 185 50 219 -123 -132 106 61 61 115 84 231 -65 -160 102 -149 49 -35 -223 -301 103 -25 -111 236 -37
6843 -37 -34 -214 -62 127 -183 0 75 210 39 280 -157 55 195 -262 202 161 128 292 -171 -209 176 62
6865 62 -57 -351 -140 23 -35 -96 -106 -163 88 -135 -206 -66 -163 -22 -176 129 146 45 -9 -38 -244 2 302
6888 302 203 275 85 -67 -97 216 -35 -157 -248 -209 -35 56 -275 -41 -237 114 182 37 74 95 -173 15 -22
6911 -22 -80 249 -89 -145 -34 -227 374 320 13 -235 52 90 160 124 -64 170 -73 221 -33 -108 -4 -99 -43
6934 -43 -124 -28 -36 69 -232 -317 -69 167 85 54 23 82 -88 -58 12 46 111 139 121 -144 14 -174 38 -87 101
6959 101 -238 -145 -71 -50 -227 -74 -52 -39 157 -103 -36 -149 39 -7 98 -34 37 32 -114 -79 -134 -153 -114 68 -97
6984 -97 -58 175 -99 -22 8 -224 -64 82 40 122 -308 -247 46 -169 -224 -146 63 135 176 -265 -91 -34 -179 2
7008 2 140 43 -159 -124 289 -85 145 -113 -25 61 -93 168 -125 122 87 -15 235 56 -53 75 -8 -217 -96
7031 -96 3 -63 44 -132 -90 -115 141 -171 31 238 252 -37 31 118 21 -175 -133 -9 51 -148 -174 -25 -186 -44
7055 -44 -110 -59 54 66 2 182 40 79 -27 155 269 -149 354 -185 -104 -65 -113 -17 7 37 -142 -94 -101 142 51
7080 51 139 -179 -31 156 136 -204 92 209 85 46 41 -22 68 99 34 299 131 277 108 217 -122 39 -256
7103 -256 -144 -88 -6 -378 -201 -12 -66 185 119 86 47 -125 -246 -233 -6 -209 9 321 -143 -176 -1 6 -221
7126 -221 97 36 50 110 10 -100 -37 145 270 -183 64 -206 -52 165 -1 -61 -56 -173 97 -6 142 -57
7148 -57 -293 229 77 136 139 -30 -130 -32 -28 -28 -156 -95 -183 -31 14 20 168 -113 162 -83 112 -127 -132 169 227 28
7174 28 -69 345 118 -113 147 26 117 -14 78 -153 -202 -17 -143 -42 -143 51 113 -36 300 95 -66 79
7196 79 -151 28 -67 201 -57 139 -278 53 -36 -121 -154 28 -69 180 -198 -158 63 36 94 -22 42 52 33 186
7220 186 235 23 183 36 -93 -2 337 134 121 9 31 37 2 -184 -91 9 67 66 -114 -62 7 -227 -107 -173 102
7245 102 -16 -226 -242 41 -220 -19 -58 -67 -44 159 175 190 105 44 62 12 28 354 -67 335 191 21 193 -39
7269 -39 -91 -190 48 -31 -249 9 49 -214 -69 -34 1 -142 72 191 204 -144 -101 -126 -103 -97 379 89 164 -89 -41
7294 -41 -449 115 -128 121 -286 -158 -243 184 -45 -137 -219 -18 10 111 -146 -80 107 233 310 40 -124 -125 -135
7317 -135 140 184 130 -6 95 270 -24 -72 -84 -192 28 275 279 75 91 -132 14 110 152 -66 -88 -333 37
7340 37 24 151 237 -369 -128 -22 125 207 259 -46 -181 216 19 -30 228 90 -77 106 204 -34 86 -268
7362 -268 -81 76 132 25 -180 -36 -261 -143 165 -136 -404 -204 -153 74 -34 190 -159 -237 -13 240 -103
7383 -103 3 -19 73 70 158 39 -143 1 217 -36 25 -221 156 -157 -263 147 311 3 -404 -234 253 -69
7405 -69 45 -96 -249 -128 109 123 27 -208 -108 79 140 115 92 -179 -57 146 135 -83 -8 -165 -84 290 319
7428 319 -6 -70 -198 -117 261 145 -50 50 130 -119 193 261 -73 -174 95 158 -126 237 35 -246 -50 308
7450 308 2 41 -309 -140 53 -21 -44 -34 91 -110 220 46 88 180 -166 -144 198 216 203 -364 -169 246 -112
7473 -112 -102 168 -84 -125 -86 190 20 11 -182 -59 -40 -3 75 215 -9 -148 -101 275 42 97 31 -76 -3 -140
7497 -140 -7 31 -162 -307 -30 58 -304 -159 -129 -245 112 73 26 -102 -316 198 176 22 134 -3 -45 120
7519 120 135 -58 -133 -50 73 218 84 -76 -257 -130 159 103 159 222 -135 -27 14 350 119 -16 98 -53
7541 -53 23 148 230 -47 -10 -8 125 96 -69 -63 33 67 -64 79 167 13 -5 -21 -413 -83 -103 152 -128 144 -104
7566 -104 -150 -116 10 325 -33 233 309 -187 -37 79 30 58 105 -197 -1 84 -84 39 100 -79 122 262 -280
7589 -280 -151 50 37 -64 47 -52 -110 -257 62 -2 -81 -45 64 19 -14 130 67 13 5 -254 122 230 -16 200
7613 200 -68 -33 39 205 99 -94 -166 85 -2 148 223 -80 -208 62 62 -92 -43 124 -145 -58 126 -36 94
7636 94 86 -170 106 2 -22 104 -35 78 132 151 224 -124 -183 15 -326 299 57 -138 -196 71 171 128 -116
7659 -116 -175 -78 17 52 -82 -33 -90 -74 58 156 -71 -2 145 68 193 111 1 -244 40 246 295 34 244 -104
7683 -104 -58 -29 170 -92 -16 145 171 131 -183 -14 -155 137 -225 -42 -202 62 68 -38 17 -183 77 -130 42
7706 42 -229 -45 -19 -125 3 82 140 37 88 -45 -356 -64 63 -30 348 -269 11 222 18 -242 9 -159
7728 -159 287 -147 -101 116 -209 -68 58 -128 200 184 -140 9 102 2 82 172 -40 88 58 39 72 108 315
7751 315 -40 104 -230 -211 115 -145 -279 -108 11 15 97 -124 -182 -17 -74 359 -44 -140 -12 72 -69 10 124
7774 124 4 33 -116 77 29 196 -230 21 97 143 -75 -307 63 -191 51 -149 -29 -19 -190 -104 140 248
7796 248 -123 -369 5 253 298 207 -114 -58 -18 -128 48 -181 135 -75 209 221 -107 -41 -334 -55 31 221
7818 221 -80 -178 -33 11 95 50 -213 -111 29 -41 15 -60 20 8 59 -35 299 77 -197 -46 63 148 59 216
7842 216 22 -38 165 68 -65 126 -130 -113 247 218 58 -147 -186 159 -46 193 -124 8 -179 55 -99 291
7864 291 136 -189 84 128 459 158 -247 -137 -103 -89 374 -25 -192 -143 79 158 -285 -68 -228 -163 -135 137
7886 137 246 -280 77 -272 57 51 138 -15 43 -100 250 -65 58 63 11 234 282 262 -59 -203 -240 210 270 161
7910 161 177 -33 21 313 31 -22 -200 -58 42 188 -144 -142 -215 -30 -29 326 39 39 -100 -128 318 215 52 -46
7934 -46 -226 30 226 195 -208 -24 -172 -2 130 144 118 -203 -300 43 86 -24 -263 -226 -82 48 203 -68
7956 -68 -286 -11 160 274 344 111 39 -22 142 73 93 7 -45 -87 -149 186 -17 -180 -23 -89 168 263 -108 -327
7980 -327 22 -176 25 144 -135 -330 11 -50 99 30 -187 94 21 150 59 81 -173 -47 306 271 136 -58
8002 -58 67 91 57 -233 142 -151 -66 -216 -94 1 40 48 34 -56 11 188 115 -241 -250 -160 185 114 136 -51 -161 96
8028 96 165 154 31 126 65 30 341 78 -9 113 61 132 35 17 -38 -327 -168 -187 -104 -153 -256 -89 124 192 135 -138
8054 -138 -60 70 127 268 55 165 -111 93 92 301 28 -112 285 -75 -115 78 66 202 -242 113 160 8
8076 8 -282 -196 -59 -190 217 98 -250 -206 154 -55 23 -19 -92 -145 -382 42 90 -51 212 -151 164 331 117
8099 117 -210 -48 -140 155 126 -78 -148 295 -16 85 -53 -9 -144 -272 -188 -291 -77 268 86 -127 237 -28
8121 -28 202 23 -203 133 33 -91 271 25 42 40 173 52 109 217 191 36 75 188 73 -76 92 -111
8143 -111 -32 -3 -10 -130 -166 12 390 106 -122 -173 123 323 179 75 22 103 153 126 -119 -4 -40 167 -72 -33
8167 -33 -125 -56 -60 148 206 104 -146 246 139 -210 237 165 54 -15 -148 39 -149 -160 446 -86 3 40 174 -113
8191a13
##END NTUPLES=NMR FID
##END=
