##TITLE=1H_PR-2
 CDCl3, 8 sc, 
 4.08.2021
##JCAMPDX= 6.0         $$ Bruker NMR JCAMP-DX V2.0
##DATA TYPE= NMR FID
##DATA CLASS= NTUPLES
##ORIGIN= UXNMR, Bruker Analytische Messtechnik GmbH
##OWNER= root
$$ XWIN-NMR		Version 3.5
$$ Wed Aug  4 10:14:44 2021 Russian Standard Time (UT+4h)  she@DPX200
##.OBSERVE FREQUENCY= 200.131506
##.OBSERVE NUCLEUS= ^1H
##.DELAY= (6, 6)
##.ACQUISITION MODE= SIMULTANEOUS
##.ACQUISITION SCHEME= undefined
##.AVERAGES= 8
##.DIGITISER RES= 18
##SPECTROMETER/DATA SYSTEM= spect
##.PULSE SEQUENCE= zg30
##.SOLVENT NAME= CDCl3
##.SHIFT REFERENCE= (INTERNAL, CDCl3, 0, 15.7039)
##AUDIT TRAIL= $$ (NUMBER, WHEN, WHO, WHERE, WHAT)
$$ ##TITLE= Audit trail, XWIN-NMR		Version 3.5
$$ ##JCAMPDX= 5.01
$$ ##ORIGIN= Bruker BioSpin GmbH
$$ ##OWNER= she
$$ F:/spectra/data/she/nmr/H-F/1/audita.txt
$$ ##AUDIT TRAIL=  $$ (NUMBER, WHEN, WHO, WHERE, WHAT)
(   1,<2021-08-04 10:13:35.10 +0400>,<she>,<DPX200>,
      <created by zg, POWCHK disabled, PULCHK disabled
       configuration hash MD5:
       00 E9 B6 7A A2 85 ED C7 34 08 36 98 17 FE 4E 26
       data hash MD5: 16K
       15 4D 61 F2 8A 6C AA A3 DC AA 2F 6D 39 7C 61 9D>)
$$ ##END=
$$ 
$$ hash MD5
$$ 31 29 25 BE A5 59 B6 7E 3C 4F 7F 67 5F BA B1 B4
##$RELAX= 
##$RELAX= 
##$RELAX= 
##$RELAX= 
##$RELAX= 
##$RELAX= 
$$ Bruker specific parameters
$$ --------------------------
##$DU= <F:/spectra>
##$EXPNO= 1
##$NAME= <H-F>
##$PROCNO= 1
##$TYPE= <nmr>
##$USER= <she>
##$AMP= (0..31)
100 100 100 100 100 100 100 100 100 100 100 100 100 100 100 100 100 100 
100 100 100 100 100 100 100 100 100 100 100 100 100 100 
##$AQSEQ= 0
##$AQ_mod= 1
##$AUNM= <au_zg>
##$AUTOPOS= <>
##$BF1= 200.13
##$BF2= 200.13
##$BF3= 200.13
##$BF4= 200.13
##$BF5= 200.13
##$BF6= 200.13
##$BF7= 200.13
##$BF8= 200.13
##$BYTORDA= 1
##$CFDGTYP= 0
##$CFRGTYP= 5
##$CHEMSTR= <none>
##$CNST= (0..31)
1 1 145 1 1 1 1 1 1 1 1 1 1 1 1 1 1 1 1 1 1 1 1 1 1 1 1 1 1 1 1 1 
##$CPDPRG= <>
##$CPDPRG1= <>
##$CPDPRG2= <>
##$CPDPRG3= <>
##$CPDPRG4= <mlev>
##$CPDPRG5= <mlev>
##$CPDPRG6= <mlev>
##$CPDPRG7= <mlev>
##$CPDPRG8= <mlev>
##$CPDPRGB= <>
##$CPDPRGT= <>
##$D= (0..31)
0 1.2 0 0 0 0 0 0 0 0.06 0 0.03 0 0 0 0 0.0002 0 0 0 0 0 0 0 0 0 0 0 0 
0 0 0 
##$DATE= 1628057614
##$DBL= (0..7)
120 120 120 120 120 120 120 120 
##$DBP= (0..7)
150 150 150 150 150 150 150 150 
##$DBP07= 0
##$DBPNAM0= <>
##$DBPNAM1= <>
##$DBPNAM2= <>
##$DBPNAM3= <>
##$DBPNAM4= <>
##$DBPNAM5= <>
##$DBPNAM6= <>
##$DBPNAM7= <>
##$DBPOAL= (0..7)
0.5 0.5 0.5 0.5 0.5 0.5 0.5 0.5 
##$DBPOFFS= (0..7)
0 0 0 0 0 0 0 0 
##$DE= 6
##$DECBNUC= <off>
##$DECIM= 32
##$DECNUC= <off>
##$DECSTAT= 4
##$DIGMOD= 1
##$DIGTYP= 9
##$DL= (0..7)
0 120 120 120 120 120 120 120 
##$DP= (0..7)
150 150 150 150 150 150 150 150 
##$DP07= 0
##$DPNAME0= <>
##$DPNAME1= <>
##$DPNAME2= <>
##$DPNAME3= <>
##$DPNAME4= <>
##$DPNAME5= <>
##$DPNAME6= <>
##$DPNAME7= <>
##$DPOAL= (0..7)
0.5 0.5 0.5 0.5 0.5 0.5 0.5 0.5 
##$DPOFFS= (0..7)
0 0 0 0 0 0 0 0 
##$DQDMODE= 0
##$DR= 18
##$DS= 0
##$DSLIST= <SSSSSSSSSSSSSSS>
$$ [...]
##$SUBNAM2= <"">
##$SUBNAM3= <"">
##$SUBNAM4= <"">
##$SUBNAM5= <"">
##$SUBNAM6= <"">
##$SUBNAM7= <"">
##$SUBNAM8= <"">
##$SUBNAM9= <"">
##$SW= 20.0188882624521
##$SWIBOX= (0..15)
0 0 2 0 0 0 0 0 0 0 0 0 0 0 0 0 
##$SW_h= 4006.41025641026
##$TD= 16384
##$TD0= 1
##$TE= 0
##$TE2= 300
##$TE3= 300
##$TEG= 300
##$TL= (0..7)
0 120 120 120 120 120 120 120 
##$TP= (0..7)
150 150 150 150 150 150 150 150 
##$TP07= 0
##$TPNAME0= <>
##$TPNAME1= <>
##$TPNAME2= <>
##$TPNAME3= <>
##$TPNAME4= <>
##$TPNAME5= <>
##$TPNAME6= <>
##$TPNAME7= <>
##$TPOAL= (0..7)
0.5 0.5 0.5 0.5 0.5 0.5 0.5 0.5 
##$TPOFFS= (0..7)
0 0 0 0 0 0 0 0 
##$TUNHIN= 0
##$TUNHOUT= 0
##$TUNXOUT= 0
##$USERA1= <user>
##$USERA2= <user>
##$USERA3= <user>
##$USERA4= <user>
##$USERA5= <user>
##$V9= 5
##$VALIST= <valist>
##$VCLIST= <CCCCCCCCCCCCCCC>
##$VD= 0
##$VDLIST= <DDDDDDDDDDDDDDD>
##$VPLIST= <PPPPPPPPPPPPPPP>
##$VTLIST= <TTTTTTTTTTTTTTT>
##$WBST= 1024
##$WBSW= 4
##$XGAIN= (0..3)
0 0 0 0 
##$XL= 0
##$YL= 0
##$YMAX_a= 291785
##$YMIN_a= -288900
##$ZGOPTNS= <>
##$ZL1= 120
##$ZL2= 120
##$ZL3= 120
##$ZL4= 120
##$ABSF1= 10
##$ABSF2= 0
##$ABSG= 5
##$ABSL= 3
##$ALPHA= 0
##$AQORDER= 0
##$ASSFAC= 0
##$ASSFACI= 0
##$ASSFACX= 0
##$ASSWID= 0
##$AUNMP= <proc_1d>
##$AZFE= 0.1
##$AZFW= 0.1
##$BCFW= 1
##$BC_mod= 2
##$BYTORDP= 1
##$COROFFS= 0
##$CY= 11.3945322036743
##$DATMOD= 1
##$DC= 2
##$DFILT= <>
##$DTYPP= 0
##$F1P= 2.36226072786647
##$F2P= -0.459571619588291
##$FCOR= 0.5
##$FTSIZE= 0
##$FT_mod= 4
##$GAMMA= 1
##$GB= 0.15
##$INTBC= 1
##$INTSCL= 1
##$ISEN= 128
##$LB= 0.24
##$LEV0= 0
##$LPBIN= 0
##$MAXI= 10000
##$MC2= 0
##$MEAN= 0
##$ME_mod= 0
##$MI= 1.114404
##$NCOEF= 0
##$NC_proc= 0
##$NLEV= 6
##$NOISF1= 3.799351
##$NOISF2= 2.8
##$NSP= 1
##$NTH_PI= 0
##$NZP= 0
##$OFFSET= 15.70392
##$PC= 1
##$PHC0= -13357.67
##$PHC1= 14.80099
##$PH_mod= 1
##$PKNL= yes
##$PPARMOD= 0
##$PSCAL= 0
##$PSIGN= 0
##$REVERSE= no
##$SF= 200.130013532006
##$SI= 16384
##$SIGF1= 3
##$SIGF2= 2
##$SINO= 400
##$SIOLD= 16384
##$SREGLST= <1H.CDCl3>
##$SSB= 0
##$STSI= 0
##$STSR= 0
##$SW_p= 3612.71676300578
##$SYMM= 0
##$S_DEV= 0
##$TDeff= 0
##$TDoff= 0
##$TI= <>
##$TILT= no
##$TM1= 0
##$TM2= 0
##$TOPLEV= 0
##$USERP1= <user>
##$USERP2= <user>
##$USERP3= <user>
##$USERP4= <user>
##$USERP5= <user>
##$WDW= 1
##$XDIM= 8192
##$YMAX_p= 0
##$YMIN_p= 0
$$ End of Bruker specific parameters
$$ ---------------------------------
##NTUPLES= NMR FID
##VAR_NAME=  TIME,          FID/REAL,        FID/IMAG
##SYMBOL=    X,             R,               I
##VAR_TYPE=  INDEPENDENT,   DEPENDENT,       DEPENDENT
##VAR_FORM=  AFFN,          ASDF,            ASDF
##VAR_DIM=   8192,          8192,            8192
##UNITS=     SECONDS,       ARBITRARY UNITS, ARBITRARY UNITS
##FACTOR=    0.0002496,     1,               1
##FIRST=     0,             0,               0
##LAST=      2.0444736,     0,               0
##MIN=       0,             -288900,         0
##MAX=       2.0444736,     291785,          0
$$ Real data points
##PAGE= N=1
##DATA TABLE= (X++(R..R)), XYDATA
0@%%%%%%%%%%%Qj6J6k4L2l2M0n6O4p2Q8j04J26j50J76k06K38k74L15l61M10m68
33b50N32o01O78p63Q57r58J073j198J328j475J638j813K003k213K442k693K968
50A555l267L599l966M373m829N338n910O567p327Q212r262J0529j2094J4092j6737
65i127K0420k5950L5279n4966J68594k26690j55320M36813j10830j65714J30687
76D3196o8735j05498L20829o4752l98678K10235L54395l13060j69173K54420k3750
87C9429r2540J64162j45182j76846L32724R6577m17407M1867L46796j40282j68248
98a18950J50036n8254m8281K25281j12223k83209K62080K21133l21285q5777K62764
109I3315n3535r4717J24757j15014r9342K83438l305l43170J21883K82610j87136
$$ y = [0, 0, 0, 0, 0, 0, 0, 0, 0, 0, 0, 0, 8, -8, 8, -16, 16, -16, 24, -32, 32, -40, 48, -56, 70, -80, 96, -110, 128, -146, 169, -192, 218, -250, 282, -319, 359, -404, 453, -505, 568, -630, 698, -777, 861, -952, 1051, -1162, 1280, -1413, 1555, -1712, 1887, -2079, 2294, -2535, 2803, -3107, 3460, -3867, 4345, -4917, 5612, -6482, 7610, -9127, 11293, -14657, 20622, -34344, 134250, -92440, -247760, 189053, 78223, -87491, 43196, -25539, -131037, 189792, 125040, -273638, -63403, 290992, -22068, -191241, 63179, 39429, -53111, 111051, -34131, -210977, 121747, 218324, -199083, -157216, 189580, 49298, -118950, 31086, -27168, -75449, 149832, 37609, -245600, 16480, 237613, -83672, -169449, 93315, 39780, -54937, 69820, -45194, -144536, 138902, 135597, -207573, -85690, 196920, 9784]
120I784j31604J62438l9235m6086J61613j17803j88695K56555J23849l06084j3229
131a28497K45954p6923r9157J02736p3599m8813K05475n8118k48487J61783J93877
142A76231k06021p6679J62114m0192m3991J07484r9856j02116K12752L3854k48835
153a25255N3450J94241j09802p5535J01268n3294k8336J41518p5382j60113J62682
164B5442J10213j94303k4624J50753n3457m7142Q3114p2660n3359J59692j5192
175F8477j83225Q4159J38540j18975n1873R6716l9983k3569R4812o9065r3505
186i7491J39417M5617j56993J6212J15316o1304l4533O4602n3957k4514J13204
197F5576l9511j20411R4221P9787j10904j7340Q1772l8074j8557O2228n2642m7488
$$ y = [9784, -121820, 40618, 1383, -44703, 116910, -893, -189588, 66967, 190816, -115268, -128497, 117457, 40534, -58623, 44113, -29486, -78299, 127176, 69058, -179429, -17646, 176231, -29790, -106469, 55645, 15453, -28538, 78946, -20910, -123026, 89726, 123580, -125255, -71805, 122436, 12634, -62901, 38367, -14927, -43263, 98255, 22873, -137240, 25442, 135655, -58648, -83272, 67481, 14024, -33118, 49996, -22664, -76023, 83669, 68477, -114748, -30589, 107951, -11024, -62897, 33819, -6164, -29733, 65079, -3986, -97491, 41926, 87543, -69450, -53238, 62078, 774, -33759, 30843, -23114, -47628, 65576, 26065, -94346, -125, 79662, -31242, -48582, 33190, -4884, -23441, 38787, -13855, -61343]
209f1343J03845N237j12435M1163P8545o3821j9580N2597l6841j2941O9892l6693
221G625o8614P6272L9025q5205L178O1160l3477j3828L8821l4026k0035O4527
233C5423j1633o6877M1249M4654n3483o035M0559k7694q352M2094k8133l4176
245c2404N1447J1981n5314J3892L7430k9609o531K7996k3835j0074L9544j5680
257H843l6820L3456J9607l8332K661K7173j9718p017K5404j6266j7559K9983L84
270A1799l0022J3764J7670j9925j504J6799j3294n513K0541r330j7656K0003N944
283I276k0834M869J3596j1505k640J1846p079o729J2997j527j2431Q867O084j1507
297f717K644P929p952p34Q550m313o244Q540J690r015L598O191o765m15N997l359
$$ y = [-61343, 42502, 47739, -64696, -23533, 55012, -8809, -28389, 24208, -12633, -25574, 44318, 7625, -60989, 15283, 54308, -30897, -27719, 33441, -36, -13864, 24957, -9069, -29104, 35423, 23790, -43087, -1838, 42816, -10667, -16702, 23857, -3837, -12189, 29905, 1772, -32404, 19043, 31024, -24290, -10398, 27032, -2577, -9108, 18888, -4947, -15021, 24523, 8843, -27977, 5479, 25086, -13246, -10585, 16588, -3130, -10147, 15257, -1009, -18568, 11415, 11799, -18223, -4459, 13211, -6714, -8218, 8581, -4713, -10226, 10315, 985, -16671, 3332, 9276, -11558, -6689, 6907, -4598, -7238, 4608, -2471, -9200, 3797, 2270, -10161, -1294, 4790, -6717, -4073, 3856, -4096, -4830, 3720, -593, -6837, 1703, 3393, -5622, -2024, 4167, -2598, -3013, 2984, -375]
313c75j847M427m87k897K569J239l295R46K863l203J08L295j895j422K531M21
329B978j725K52J474n20j020J026k38o71M53n72O45Q82j726o7J606q18j088K49
347A120J352j375j318K007m11j183P04j62p79P83n73l79n6L49j084m18K000j604
365a027k093L320l1l874J974K877l393j215K777p23k448L312k94m098L884K258
381A206o163J899M663n053p53O303m072m765Q373Q93j0401N424Q657r795j860
396e444R449m523m235R103l299q968J1319M273j5551M449J3926j2180l957J3612
410G974p098p522J5743k887j7759J3873J3081k0839j907J9279r812p693J5976
423A0409q819j2481K3149K89k7858J2884K2428k2954p221K2804j1271j0521K3760
$$ y = [-375, -2222, 2205, 1718, -1179, 1390, 2629, -666, 280, 3143, -60, 48, 3343, 1448, 26, 2557, 2978, 1253, 1505, 2979, 2459, 1439, 2465, 2227, 1556, 2009, 1437, 2082, 2964, 1238, 1171, 2777, 1959, 871, 1120, 2472, 1097, -221, 1786, 1375, 192, 896, 734, -45, 738, 165, -214, -270, 79, -1005, -1423, 577, -1027, -3120, 200, 169, -3705, -1731, 1146, -2247, -3462, -685, -1408, -3856, -544, -838, -4936, -1052, 1206, -4957, -3058, 1605, -3448, -4201, 2102, -1970, -6735, 1638, 2531, -7870, -2446, 6211, -3584, -5444, 4005, -518, -4753, 4350, 1051, -7917, 3402, 7675, -7876, -3427, 10499, -1681, -5638, 7974, 876, -6646, 9097, 6210, -11549, 2324, 15405, -5434, -7341, 11938, 2126, -5567, 10409, 1590, -10891, 12258, 12547, -15311, -2427, 20001, -2953, -10174, 12630, 1359, -9162, 14598]
436A4598r703k5286K8382J3677l7048M029K9918j8759j0417K2086j4227j2964
448a5714L4129p562m0698K9378K8892m0155o790L3287j5701j0976K7291j8369
460b988k4596M3889P080n4326J6228M2380l1087j4421K9186j7495r447L9556k0070
473C889m3834M7352K9091n9132k144M7224k2007j4260L0544k5298j9307N6567
485B8685o714o5463L4393M9924m8774j6045M0660k0780q604M3726l3969m2137
497d5098O8550K0189p9360J1034O0727l3512j8945L5133k9528j1588O4180k6223
509A5559p1228O0192M9696p1425j2147N3044k3110r628M0524m3862l0577Q3849
521D0887O07r4027L2769O9567n0022k1980L8913k7997k904O0491m5176o3457Q3448
$$ y = [14598, 4895, -20391, 7991, 21668, -15380, -11351, 18567, -192, -10609, 11477, -2750, -15714, 18415, 10853, -29845, -467, 28425, -11730, -18520, 14767, -934, -11910, 15381, -2988, -27584, 16305, 23385, -30941, -14713, 27667, -3420, -17841, 11345, -6150, -15597, 23959, 3889, -39945, 7407, 36498, -22634, -24778, 22446, 439, -13821, 16723, -8575, -27882, 28685, 21971, -43492, -9099, 40825, -7949, -23994, 16666, -4114, -12718, 31008, -2961, -45098, 23452, 43641, -35719, -24685, 36042, 2530, -16415, 18718, -10810, -22398, 41782, 15559, -55669, 4523, 54219, -17206, -29353, 23691, 581, -9047, 31477, -12385, -42962, 40887, 41494, -52533, -19764, 49803, -219, -22199, 16714, -11283, -14187, 46304, 1128, -62329, 21119]
534B1119L7272r2681P38O5731l0562j3332L6365m5378j5346Q6774k3317r4741
546f7358N8263O7460p1238j8402M9103k8521P28N2210n7780m6355R9297J5623
558E3030j07307K2238P5732m4790j7278L7202m3564p31Q2417m7657q4941Q4758
570I109N5067r0763q871N9334k9306k70M2136o3303k3798J05846j3012j09543
582f7374M8001P5434n9274j9234L8807l4776Q175O6184o2933o2937J00967L1795
594F2835j02595P704O6244l3577n426L2282n6827l476R6003l8500r7619P1758
606a194O4129p6701j3182M5312l0173R383M9252o8292l7318J05759L826j06330
618e5529L0893O8217m5550r126L0374m8017J0167P9910n8412p5806Q9380M4164
$$ y = [21119, 58391, -34290, -33552, 32179, 1617, -11715, 24650, -20728, -36074, 50700, 27383, -67358, -9095, 58365, -12873, -31275, 17828, -10693, -9965, 42245, -15535, -61890, 37407, 53030, -54277, -32039, 43693, -1097, -18375, 18827, -24737, -25468, 56949, 9292, -75649, 9109, 64176, -26587, -35458, 23876, -5430, -5700, 36436, -26867, -50665, 55181, 42169, -67374, -19373, 56061, -3213, -22447, 16360, -18416, -10241, 55943, -6990, -69927, 31040, 62835, -39760, -32056, 34188, 611, -4815, 27467, -29360, -32836, 63167, 24667, -72952, -1194, 62935, -13766, -26948, 18364, -11809, -2426, 46826, -21466, -58784, 46975, 50801, -55529, -24636, 43581, -1969, -11095, 19279, -28738, -18571, 61339, 2927, -72879, 16501, 60665]
630F0665q9460r79N2172l0344P091L5311o5398j2747R8940k3422r5937N1877O0376
643D8145n6795q255L0999l7317J5863N8535o5400m8424R3849J7484q8742J5532
655b4526N1931l3006K876K5057n3308M764Q0301m1528p5157O6420M2816o3580
667a6940j605L3040k9669J5042L8832o1500k2866Q6826o365q0977L2385M6377
679C2580l8264N70K1111m0492J3798N9016n0155n0483P0798K3024o5405R145L3498
692A8741k7493J1327K4808n0646m236O9908k2826o2848M1922L4492m2016K419
704f448J9829l0802J5167L9660m8412k7852O4394M345n7355J7353K9511k6488
716g098O783J7370l7560M983N0580l0448m2018M3928J9378m0049N916J8569k3082
$$ y = [60665, -28795, -29774, 22398, -7946, -855, 34456, -30942, -43689, 55251, 31829, -64108, -12231, 48145, -8650, -16905, 14094, -23223, -7360, 51175, -14225, -62649, 31200, 48684, -40058, -24526, 27405, -5601, -2725, 22332, -30976, -26212, 54089, 12561, -62596, 3824, 46640, -16940, -18545, 14495, -15174, -132, 38700, -22800, -45666, 41160, 34795, -46182, -13797, 32580, -5684, -5114, 15997, -24495, -10697, 48319, -1836, -52319, 18479, 41503, -23902, -14757, 18741, -8752, 2575, 27383, -23263, -27499, 42409, 19583, -43265, -1343, 33149, -8867, -6448, 13381, -17421, -2254, 37406, -11006, -38858, 25536, 29881, -27474, -10121, 19390, -7098, -315, 17055, -20505, -15522, 35058, 4610, -37408, 6520, 25898, -14151, -8235, 10334, -12748]
729a2748J1985K4374l9320j0700N1590r755m4184K3833K2242k5416M780J2808
741I489k5686Q945L2646l0265k4057M0761O024l4829J1448J5240j9209R382J4671
754A4560k8350j132L6596j5123k9683K5167J3278k3881O692R829j7979Q339J9302
767A7615k3794j1000L0984k158k5576J3031J1562j6447O262R408j8382K830K1900
780A6235j4467j6088K0148N279j7928N941P988j2391N715J0730j6673k793K0012
793A1708o469j5397J1380O211j1533L894O209j1407K698J2297j0834p718J4596
806E635k67j1784O147M600q214L347N666r873j01J1590o161q029R130J750p697
821d261L192L695o316J603O230o437k810P417j153n878M469J930m835K310K557
$$ y = [-12748, -763, 23611, -15709, -26409, 25181, 15426, -28758, -4925, 17317, -8099, -3319, 9489, -16197, -7252, 25394, -4871, -28928, 11833, 17857, -16972, -5524, 9716, -9493, -111, 14560, -13790, -14922, 21674, 6551, -23132, 2035, 15313, -8568, -1876, 7953, -10026, -1687, 17615, -6179, -17179, 13805, 11647, -13929, -898, 10664, -5783, 479, 9887, -8495, -5665, 16235, 1768, -14320, 5828, 11107, -6821, -880, 7108, -5283, 432, 11162, -5511, -8304, 11708, 5239, -10158, 1222, 7433, -4100, -206, 6003, -5404, -2706, 9591, -1243, -8961, 5635, 5368, -6416, -269, 4331, -3883, -536, 5130, -4743, -4844, 6746, 585, -7444, 1686, 3436, -4261, -1069, 2626, -3690, -2087, 4143, -2294, -5104, 2313, 1160, -4718, -249, 1681, -3154, -844, 1713]
836A713m749P06M752l353l109M814Q28m516K500J704k935R95K039k649j63K800
852A377r84k043K153Q42k631J604J477k372M02J983j395j157K036R1j350M99J114
869A646r61k27J063r22L00M53o04l21Q45P6j000O73N76j482J20J289r15m11Q55
888A053l75l12L25p1j42q2J06r09L31J62l48l42J448j019r76J429J39j430M18
907e95P21n33l95L36k83o15J424o03j417J698M42j943O79J230j747K59K079j782
925a045j553L225l45l093K035J916k717L71J904k441J86L408k160k675M281P01
941A998m519K183K694m295J188L807m137j574O305j973n424M571L183n691J272
956d12L882n048Q70N783n464l658Q596n06q187M239M866o717J155N557p082m93
$$ y = [1713, -3036, -2330, 2422, -931, -4040, 774, 1602, -2914, -414, 1290, -1645, -650, 1389, -1260, -1423, 1377, 393, -1650, 503, 1345, -1286, 318, 1795, -577, -175, 1808, 413, -744, 1292, 1383, 33, 532, 1646, 685, 458, 1521, 599, 899, 1352, 748, 427, 1272, 1348, 348, 1021, 1597, 115, 235, 1524, 609, 198, 1053, 678, 366, 691, 620, 478, 396, 502, -407, -76, 86, -262, -604, 844, -175, -1151, 278, 417, -1013, -595, 126, -407, -802, -466, -749, -1364, 60, -543, -1960, -262, 180, -1763, -1084, 146, -1601, -1342, 737, -1045, -2598, 627, 282, -2811, -776, 1140, -1577, -1206, 698, -1743, -1557, 1851, -309, -2984, 1297, 1998, -2521, -338, 2356, -1939, -751, 3056, -1081, -2655, 3650, 1677, -3747, 824, 4007, -1684, -412, 3470, -1578, -708, 5075, -389, -4047, 4549, 4043, -4144, 95, 4961, -1756, -601, 4956, -2126, -2619]
972b619R652n716p895R515L126r655K585N199o982K148P287r888l390J4127l266
987D228j2940Q664O379j0184K404O161r834J746J2611j0815r614J6412K203j5726
1001h305O003P475r927L861P559j4040n72J9190q851j6351J5065P929j5360L803
1015b521P087j1672N554J2891j7166p575K3613j921k0986J0382J0291j2739M254
1028e08P467j7141M682K2124j6809j7445K3246P074k1061N258R544j2675P833
1041A589J1421k2918j975K9432r483k4944J7659J1334j7060N088O915j7774R919
1054g97K1397k5868j4019L2429J244k7090R874J1296j3995R023Q491k6320N105
1067i230L2772k0051k6004K7388J0313k3006O188P368j7059J3791J7110l2094
$$ y = [-2619, 7033, 1317, -6578, 2937, 6063, -3592, -1007, 4192, -2790, -642, 6645, -3243, -6633, 7494, 4228, -8712, -48, 6331, -3853, -1449, 4712, -5122, -3376, 9235, -1580, -11194, 5218, 7421, -8305, -2302, 5173, -4754, -893, 6666, -7374, -7946, 11244, 2393, -13958, 1107, 9036, -6324, -2521, 4566, -7106, -1552, 11339, -5827, -13402, 10211, 8290, -12696, -2314, 7977, -4762, -508, 6959, -10182, -5500, 16624, -185, -17630, 5616, 12690, -8371, -3113, 6431, -6244, 1589, 13010, -9908, -11883, 17549, 8066, -16878, 781, 12115, -4945, 143, 7058, -10716, -797, 20600, -5268, -19287, 13142, 14386, -12704, -2830, 8466, -5529, 3494, 11985, -14335, -9230, 23542, 3491, -22513, 4875, 15188, -7818, -1630, 5738, -11321, 2470, 19580, -12514]
1079a2514p384L9093o763l2138J6970J3507j6581Q277N122k5217J2951K9986k9366
1092d057k2325L6111O994k8933P819J0012j5659J4914J1035l4246K196M0666j6648
1105G879l2757K4786J3675k0513Q017M178k2633J8442K4562l7078j4058M2723
1117A7223j384l3069J3624J1620j5689J4188N668l3340J2310L8176k8248k8414
1129b7335L4346R418k4961Q273M474j8015K0853J5384m0348k471M5446j2540l4083
1142b1559K0902J1971j6768J1664J262k7459J9561K9873l5912j9962M0512K433
1154A6518k8510J1120N353j4713J9566P143l7824Q392M1160k2046l0459K7261
1166B961R999j9527J0285l90k1504K2898K0218l9380q535M2100o256k9561J5052
$$ y = [-12514, -19898, 19195, 12432, -19706, -2736, 10771, -5810, 2467, 7589, -17628, -4677, 25309, -4057, -26382, 9729, 16723, -12210, -4391, 5621, -10038, 4876, 15911, -18335, -16139, 24527, 7879, -24878, -92, 13583, -6930, 1087, 5265, -17368, 1074, 25636, -11442, -25500, 17223, 15839, -17230, -3606, 8014, -7675, 6513, 12181, -21159, -8849, 29327, 1079, -27335, 7011, 16429, -8532, -259, 4215, -13800, 7053, 22437, -17911, -20382, 25064, 12524, -21559, -657, 11314, -5454, 6210, 7472, -19987, -426, 29447, -6465, -26427, 14085, 16518, -11992, -872, 4481, -10232, 9334, 16477, -21347, -12955, 28205, 6159, -24300, 2961, 12960, -6567, 3718, 3328, -18176, 4722, 24940, -14440, -22975, 19125, 12869, -16692, -1640]
1179a640P008j3629J6768J114l2288J6776L3665l0870k2116L3011M531k1505R888
1192G13Q37j5849K2111J0621l7669K581L9420j5828k6883K0551O707j3951J2956
1205F317j641k4038K0217K3446l3260j2586L4618j941k2238J1598K145j2065J8656
1218I228L446l1433J0392L1572k0876k0786K3629L797j4622J0756k529j6649J9857
1231E782J3612l1482k868L1116p952k0422J4211K175j0520J4736j333k3580J5107
1244a418K2340k4880j2484K4727k34j4910R763j471j1472J7118N232k6338N072
1257h955K5343j3873j5230J5496J223r699J1168k767j6133J5361J3208k3075m529
1270a2462K2010m724j3056R751p49p784J2719R88j9372Q475J7605j5107r505J5295
$$ y = [-1640, 5368, -8261, 8507, 9621, -22667, -5891, 27774, -3096, -25212, 7799, 12330, -9175, 713, 1550, -14299, 7812, 18433, -19236, -16655, 22765, 6937, -19946, 605, 7312, -6639, 6317, 4676, -19362, 855, 24301, -8959, -21545, 13073, 11132, -11106, 492, 2637, -9428, 9228, 12674, -18759, -8367, 23205, 2329, -18457, 5172, 8969, -5653, 5103, 2574, -14075, 5782, 19394, -12088, -14956, 16160, 8208, -12214, 1997, 4172, -6348, 8388, 7055, -16525, -1418, 20922, -3958, -16442, 8285, 8051, -6859, 2904, 1433, -10039, 7079, 12311, -14027, -8955, 16388, 2515, -12715, 2781, 4004, -5695, 5473, 2706, -13427, 1934, 15142, -7933, -12462, 9548, 4824, -8232, 1519, 770, -7014, 5705, 6693, -12679, -4204, 13401, -1706, -11211, 4084]
1284D084r91q303Q465k355j0148J2546O628j8373P04J6913p097r298R355n97o285
1299d752R474j320j2491Q977J0457j3974l979J3183k639p429P577j792o936R677
1313D033J956j2851L697J1556p987n898Q699j367m663O307j492p468P534M911
1327F967j0871j34R487l909m755N721j365l947O001Nq079M416O264o853k710O753
1343B991j863l323M191j294m169M864K290p368J280O249l920k990M279r50k537
1358b270L559l75m285L140K848m659n11L990j573k218K979n30k662L056O80l874
1374b705J242L363k693j332K772m49j989K362k94k086J906J175k806L06K509j465
1390a84j085J936l17j391J649J97j818Q63J378j230l87J360m02r66J375l54j100
$$ y = [4084, 3093, -5210, 3255, 900, -9248, 3298, 9926, -8447, -7743, 9170, 2073, -7225, 2130, 1533, -4752, 4722, 3402, -9089, -112, 10345, -3629, -7608, 5575, 2936, -4493, 3084, 1292, -5644, 4033, 5989, -6862, -3165, 8391, 404, -5494, 3205, 1838, -2825, 3482, 1990, -5478, 2056, 6967, -3904, -4038, 5449, 1540, -3215, 2506, 1141, -2806, 3195, 3200, -4879, -463, 5801, -1052, -3762, 2991, 1128, -2195, 1996, 702, -3467, 1397, 3687, -3681, -2401, 3848, -72, -3062, 1217, 267, -2270, 1289, 914, -3371, -231, 2617, -2042, -2553, 1437, -136, -2354, 625, 95, -2567, 489, 1169, -2705, -1463, 1900, -793, -2125, 647, 198, -1791, 571, 277, -1809, 97, 1272, -1534, -1228, 1281, -184, -1269, 667, 350, -1041, 608, 805, -1013, -150, 1228, -2, -389, 971, 569, -397, 978, 624, -476]
1407d76J120M91j377M77R36r44l10R15j09r51R68K64q08K05N58r37J35M94j64
1426D87l78R6O5m67M66J98m72J19L46n59k02R73p71k85N82r7o51M94M4l39j82
1447e33R61q98l91P56j27q81Q37N7p23O64L15j104K73J085r77p09J642k10j313
1466a276J081K44j040Q53K34j353P56J189j226o35J620j66j780K115K2j857J213
1483fJ250k239k78L047j186j662J816l9j530J859N50l088J715K401k934r86L176
1500A866p46k371K261M41l024K688J548m690J367L767k734k251L657q15k077K652
1516A539l69l371K987L101n755m49N626k487l187L484l20l055L673Q11n997K733
1532a036N549n880k314N783j110l502L878j128m093N205K344p803P48P736m394
$$ y = [-476, 644, 1135, -242, 235, 1171, 227, -83, 832, 723, -228, 740, 1004, 196, 401, 959, 22, 157, 651, 487, 109, 205, 270, -197, 269, 467, -5, 114, 460, -99, -301, 672, -99, -384, 198, 101, -550, -56, -12, -351, -533, 428, -470, -861, -105, -232, -1113, -276, -219, -942, -278, 37, -1067, -794, 291, -686, -1395, 247, 37, -1276, -195, 49, -991, -138, 96, -1257, -501, 688, -538, -1173, 447, 281, -1499, 616, 638, -1219, -6, 1244, -995, -1273, 1774, 588, -1074, 742, 703, -827, 1032, 1582, -1506, 209, 2610, -324, -1310, 1866, 1120, -1251, 1010, 1451, -1573, 1115, 2663, -2027, -660, 3107, 373, -1878, 1779, 964, -1113, 1539, 1170, -2201, 786, 3887, -1868, -2317, 3309, 822, -2365, 1119, 799, -2256, 1417, 2228, -3769, -1036, 4513, -1367, -3681, 2102, 992, -2510, 1368, 240, -3853, 1352, 3696, -4107, -3359, 4377, -17]
1547a7m235N614o16l793N184j064o703N508N630q838j771Q907k536m740M902j340
1563I2m326P461O43j0233M229R208p577n187Q425j214m361O008k553o847Q814
1578B582M748j2804N64J1515m790n972O228j418m144Q256j519j1194P955R990
1592I997j2097m443J1005j820n575O461l711n586J1053K075j5463L962J3668q690
1606H36o951Q945j869l962Q530m081j0810J1982Q115j6517j387J3700m271o589
1620d329P192l968m539J2556j792j6413Q799J3946j3341o122J1306k241m290Q061
1634D825o010q715J5180M187j9258K671J5971p513p374P827l111l133J2282o123
1648A706j4434J3521J1451j7108m395J4632l131n316O912o315n521J6176m77j9836
$$ y = [-17, -4252, 1362, 746, -3047, 2137, 1073, -5630, -122, 5508, -3330, -5101, 3806, 1270, -3470, 1432, 92, -4234, 3227, 3870, -6363, -2134, 7074, -503, -5690, 2735, 1521, -2840, 3168, 615, -6232, 2582, 7330, -5474, -4910, 6605, 1815, -4157, 2071, 653, -3491, 4765, 3246, -7948, 7, 9997, -2100, -6543, 4462, 2642, -2933, 3528, -183, -5769, 5284, 7359, -8104, -4142, 9526, 836, -6115, 2830, 961, -3001, 5529, 1448, -9362, 2620, 10735, -5782, -7169, 6531, 2260, -4329, 2863, -1105, -5644, 6912, 5120, -11293, -2494, 11452, -1889, -8011, 3295, 1054, -3236, 4825, -1185, -9900, 5280, 9467, -9791, -7120, 8851, 1338, -6036, 1791, -1320, -4453, 7829, 1706, -12728, 793, 12244, -4864, -9259, 5373, 2242, -3074, 3838, -2477, -7998, 8178, 7701, -12135]
1662a2135P634J6125j1527p237R929k710k676J0301p687j1819J6688P656k0350
1675g808l1J6368o152o028P118n765l057J5217n008j7979J2388J4391j6006n443
1689g795J2277l467k875Q734r250p740J8381K184k1232M616J6847r438o694Q304
1703B852n016j236J2815q308j4392J5807J0432j8949k097J3735m406l939O977
1716D275p714m690J7381l015j9085R329J4500j2041n547R042l631j233R741r095
1730a783j0221J7491M897j9128J882J3984o654l976O645o945j367J4579o533j5623
1744a2752J2976J0952j4517l112J0282m479p70P594r508n053J6174j43j7565O017
1758c904J2609q412l961O618n597K49J0962q512j0406J4168O029j5157J44J0479
$$ y = [-12135, -4501, 11624, 97, -7140, 2789, 79, -2597, 7704, 17, -11802, 4886, 12542, -7808, -7839, 8529, 2377, -3651, 3467, -2298, -5355, 9862, 4854, -13125, -737, 13654, -2352, -7795, 4482, 1015, -1860, 6874, -2376, -10116, 8265, 10449, -10783, -6167, 10680, 1242, -5452, 2852, -2164, -3400, 9415, 1107, -13285, 2522, 12954, -5995, -8092, 5643, 1237, -2702, 4275, -3439, -8129, 9252, 6237, -12848, -3519, 10981, -1060, -6607, 2435, -1196, -2429, 7312, -1783, -12004, 5487, 10384, -8744, -6862, 7122, 468, -3508, 3137, -3808, -5175, 9404, 2871, -12752, 224, 11176, -3341, -6453, 3829, -650, -1420, 6174, -3334, -8387, 7787, 7644, -9921, -3904, 8705, 293, -3668, 2950, -2647, -2398, 8564, 52, -10354, 3814, 9843, -5314, -5170, 5309]
1772E309m601k023N715p628j776J3355l753j4279Q849R750j0456k454O899m094
1786a187J81P517q018o929J3696J967j3798K872R409n725j974M830n558n59J0459
1801G183n514j0627J0058N842j0714j16O709m093L42M974o977l025J1395j681
1815C756j1213N778O822o686r21M427m588O26O949n962n681R286K635r482J221
1830c033O040l962l39L841m660q55P840l264p269N654M724o616Q3M061l589L58
1846i86M829m912k994P327J69o941K365M434l724m24L199l586k35N362l358m499
1862c974N421K075n266P65L231k833J93L057l462j324N113r02n029L207K522l447
1878f53J7K156k581J54L367k598k519M643J84m133J259K157k244K41J844k196
$$ y = [5309, 708, -1315, 4400, -3228, -5004, 8351, 4598, -9681, -832, 8918, -1538, -3992, 2907, -1187, -1006, 6511, -1507, -8436, 5260, 7227, -6571, -3699, 5710, -15, -1989, 2841, -2717, -3276, 7183, 1669, -8958, 1100, 6942, -3772, -3888, 2821, -1272, -930, 4044, -2933, -5958, 5437, 3756, -7457, -1679, 5143, -1543, -2464, 1963, -2625, -1999, 4950, -1012, -6693, 2593, 5228, -4254, -3033, 3007, -955, -1294, 2547, -2113, -2968, 4872, 1608, -5661, -7, 4717, -1899, -1816, 2245, -1344, -986, 3843, -1069, -4063, 3264, 3433, -3508, -1143, 3291, -433, -857, 2342, -1244, -1479, 3883, 525, -3974, 1447, 3522, -1744, -979, 2252, -581, -388, 2669, -793, -2117, 2996, 2094, -2935, 272, 2794, -653, -636, 1520, -1061, -907, 2460, -138, -2657, 1986, 2170, -1963, -704, 1453, -791, -550, 1294, -902]
1894i02l63K671j209k653K605J456k946O24J364j494K7J812j973r35L102o77k210
1911a701J405J328j975N8J254r79p6J465j000j281J741N80j871M64J100j068K83
1928b73J049j190j76J320j16j400N48P78q47l8R02o33J17R44r07m16Q37K52r75
1947b24K97N69m52m09P48l81n72J066l00l97M90P0q21M00Q72r23n2M03j18m76
1967b10M61J61m44K36M11r35l4Q87p12j50N62p2o41M51P3m74L86J9m65K04O23
1988C37l75m13L71j13m97L71O9l94L99L33l43k03L99j39j86J41L5m27O46N2q53
2009g90N80N54p89k17Q55j74n05N47Q4p57O37L58p14q5R38n81n23J038m59m93
2029d96J284j93j183O71Q60j018k26J112o95m08J004n40r19J788q8j490M58J347
$$ y = [-902, -1265, 1406, 197, -2456, 149, 1605, -1341, -717, 647, -847, -820, 992, -981, -1916, 1186, 509, -1701, -296, 1032, -943, -885, 369, -610, -686, 779, -221, -1502, 239, 819, -1052, -588, 512, -556, -273, 776, -414, -590, 730, 614, -786, -238, 540, -307, -345, 557, -76, 41, 985, 78, -338, 499, 751, -224, 73, 642, 190, -219, 529, 148, -424, 642, 342, -55, 435, 505, -316, 84, 956, 33, -19, 384, 266, -210, 251, 412, -32, 204, 615, -320, -354, 533, -179, -329, 233, 161, -480, -29, 44, -430, -44, -25, -490, -286, 337, -38, -451, -80, -193, -690, -319, -250, -644, -245, 88, -255, -458, -59, -198, -384, -243, -208, -635, 11, 63, -790, -210, 344, -445, -662, 193, 19, -486, 61, 145, -612, 25, 383, -331, -416, 522, -59, -582, 456, -3, -496, 788, 595, -588, 83, 943, -75, -301, 811, 116, -292, 712, 172, -747, 1041, 953, -537, -79, 1268]
2047A268j445j74J339j200n67K044q02j707K023O82k228J89J755j339k19J742
2063A361j561j060K427k48k791J370K105k279L9J754j754j61K400j976j756L038
2079I08L08k860O48K273k089oJ833j967l38L402j887k968K852K217l751n7K559
2096A077j866j05K636k812j380M291k0m897K287K804k810oK116k520J08L861l097
2113c33l276M981J535m708P11K972k188J88K209l537p09N763j721n609L820L133
2129C231m183J6K340k513R31L702m403l066O830N82o314J745L711k902L21K160
2145B188m314J53O447l650n629N807L327n907L6L102k746J290K953n083j578P577
2161C973j553o950L603M126m082O1K141l719J483N307n578m335P775J538o871
$$ y = [1268, -177, -351, 988, -212, -779, 1265, 463, -1244, 779, 1461, -767, -578, 1177, -162, -381, 1361, -200, -1260, 1167, 919, -1872, -502, 1603, -676, -637, 1117, -637, -798, 1602, -374, -2130, 908, 1216, -1644, -996, 1277, -812, -818, 1015, -952, -1290, 2112, 225, -2743, 109, 2326, -1425, -1482, 1077, -789, -894, 1742, -1070, -2450, 1841, 1821, -3076, -789, 2015, -795, -801, 1315, -1205, -1097, 2764, -333, -3609, 1372, 2907, -1801, -1090, 1882, -306, -118, 2091, -1446, -2155, 3608, 1887, -3722, 98, 3231, -952, -936, 1404, -1109, -178, 3524, -879, -3945, 2885, 3467, -2847, -1102, 2609, -293, 28, 2188, -2126, -1973, 4474, 824, -4805, 1002, 4329, -1578, -1542, 1560, -1186, 104, 3057, -2026, -3604, 3973, 2420, -4530, -927, 3199, -883, -822, 1319, -2400, -917, 4390, -1188, -5523, 2252, 3790, -3081]
2176c081J231L724l139J369K491o008L34Q025l542o859N417L966n659M12K410
2191A091l652K663M505p157k684R397m43q202L177M144l882J458J441n465K384
2206a225O995n762n996P688L072o989Q79K789k585K206L028p864j62R463k735
2221B802p942M765M417m576O32J557m642L184N387p116m022R032R40p704K241
2236a045L039l347K716J483p015J707Q584m894p507P129L138n624J113J525l745
2251b743L848L686q326j532R764j295p953L605L240l418J756R50n804L023O841
2266E642o619n430Q218J899o299J247K167k872L075K196p500N84Q797l410p000
2281e305M985L289l887R50Q77m502M024M498p220k846Q494k64o330K419K354k546
$$ y = [-3081, -1850, 1874, -1265, 104, 2595, -3413, -3079, 4946, 1404, -5455, -38, 3928, -1731, -1319, 1091, -2561, 102, 4607, -2550, -5234, 4163, 3720, -4482, -1305, 2839, -1043, 415, 1856, -3609, -1225, 5770, 8, -5988, 1700, 4772, -2217, -1338, 1451, -1134, 1072, 4100, -3764, -3926, 5537, 2802, -5140, -375, 4042, -534, 98, 1655, -2987, 197, 5584, -1532, -5554, 3478, 4418, -3286, -1045, 1994, -1353, 1363, 2846, -4169, -2462, 6122, 1228, -6279, 850, 3988, -1636, -523, 1002, -2743, 1105, 4791, -3535, -5067, 4697, 3402, -4551, -946, 2294, -1124, 632, 1582, -4222, -1199, 5642, -977, -6407, 1811, 3710, -2589, -1342, 825, -2047, 1028, 3224, -4276, -3692, 5105, 1695, -5305, -320, 2969, -918, 32, 909, -3593, 431, 4929, -2291, -5137, 3357, 3093, -3237, -818, 1536, -1010]
2297a010K358J030o397K408P201n306n243O451J725m431J186J079l213L620K594
2312D052o878o46P808j917n791L429J922k665J892K02m888L443N257o218l094
2327d092O309N93m758J870J038k552K831J237n604J226N953l126m653M203J415
2342A890k804J190m7k747L346K719n656j460N956q27m038K400P40j995K266L24
2358A257m165J981M371m143k748M525M66l150J692L71k475K674J375m230K57M577
2374B635k021l136K856N51j722J390p9k787K371K861l898j197L963n74k529J596
2390B80K97j637J990N69l079J158K972k421j895K553M54j853J288q8j687J750
2406F51J414l004j00K737q51k104J754K53j238J301o9j807R37J885j989j287K370
$$ y = [-1010, 1348, 2378, -4019, -1611, 5590, 284, -4959, 1492, 3217, -1214, -28, 1051, -2162, 1458, 4052, -2826, -3472, 4336, 2419, -3372, 57, 1979, -686, 1206, 1408, -3480, -37, 5220, -998, -4092, 2217, 2810, -1948, -78, 960, -1592, 1239, 2476, -3128, -1902, 4051, 925, -3728, 475, 1890, -914, 276, 229, -2518, 828, 3547, -2109, -3569, 2387, 1560, -2478, -78, 662, -1333, 933, 1257, -2908, -927, 3444, -699, -3447, 1078, 1544, -1606, 86, 457, -2018, 656, 2031, -2199, -1942, 2635, 614, -2522, 334, 885, -837, 553, 474, -2313, 58, 2919, -979, -2176, 1787, 1213, -1316, 280, 577, -1060, 930, 1499, -1580, -422, 2550, 129, -1766, 787, 1241, -612, 676, 588, -1099, 651, 2065, -939, -1039, 1698, 847, -1257, 497, 750, -488, 813, 744, -1063, -126, 1759, -230, -1517, 853]
2423H53l08j236J130j92j072J194M53k064O50J778j144j458J587K53r82P10J35
2440B87j241R04Q73j506k43J852q73j067J184l01p03O84L24r80J21J450j000o97
2458i32J423m76m35M45J41o77M48L77q82L70P64n55m82P60k58r0L24j05k24L43
2478B79M06p10o0M44j50j47MK45o24N07N35p32K28N36o14k66L09M2n44N29m1m36
2500b60L49K66l16Q9K27Qk04j51J78k18l13L24%J20N81p11r1M57j15m73J71K99
2522B17o44J74M46n35J58j8K98k18R2J52l48J15J98l22j55L67l48L77Q1m66k03
2543e82K78L84l95R4K88m48K47L25l81l1L00M3l28J61K31m16K79j09k09R8N26
2564C55k81m63Q59l65m46N25K91o66L15O6l79J09L94j67l74O46p9o69P11n1l83
$$ y = [853, 545, -691, 439, 247, -825, 369, 822, -1242, -592, 1186, 42, -1416, 171, 424, -558, 152, 287, -954, -50, 823, -683, -926, 926, 53, -1014, 170, -131, -834, -150, 174, -806, -685, 765, -235, -932, 491, 15, -420, 25, 166, -511, -63, 314, -568, -198, 566, 11, -471, 289, 31, -59, 265, 160, -64, 279, 685, -25, -85, 359, 209, 62, 66, 311, -313, 194, 729, -3, 225, 761, 147, -119, 190, 232, -312, 217, 176, -260, 89, 355, 39, 128, 355, 363, 159, 8, 186, -32, -345, -21, -21, 99, 680, -31, -122, 335, 220, -253, -82, 217, -427, -253, 193, -342, -184, -202, 96, -122, -30, 122, -226, -111, 87, -235, -390, -23, -371, 6, 87, -379, -582, -304, 80, -315, -221, 67, -381, -134, 191, -190, -221, 79, 122, -206, -45, 186, -230, 49, -60, -269, -171, 355, 74, -389, 470, 105, -341, 184, 475, -191, 124, 190, -189, -80, 314, 147, -227, 419, 340, -329, 382, 331, -52]
2585e2J79N03o30m5P02n94m76P19M8q39P20Ko86P85L77p93n24J339m11j136Q74
2606F2L83p45M54J82r59L71J228j184n70J276k22q05N49L13p18N42K61j149K04
2625e27J348r69r70J135L25j003M61N93j446R72Q87j281p76J996m14j167L81M62
2643Gj56L51N80k168J160J796j668j442J894J88r65P13l1j219J129J003k127k3
2661i78K706r84j785J452L34r53R07P5k049J470J728k332j252K779l59j403Q13
2678A69j21r96J882P12l158O04L002j862j773K175k7j247J238Mk256J940J665
2695A951l109p54L358n72j944J059M38j309J852k51k965J918K454k596j600L006
2711I36k43j431R68j61j837K707Q40l823O08L565j833j951J618J38p48J986q29
$$ y = [-52, 127, 630, 0, -45, 657, 63, -413, 306, 354, -485, 235, 237, -449, 336, 713, -80, -604, 735, 324, -812, 62, 445, -300, 154, 336, -623, -252, 976, -208, -778, 498, 276, -529, 20, 333, -385, 157, 418, -731, -527, 821, -148, -1118, 17, 342, -661, -200, 393, -1053, -81, 806, -475, -1251, 745, 331, -836, -455, 7, -149, 202, 782, -1386, -226, 1570, -98, -1540, 354, 542, -423, 290, 259, -960, 169, 1172, -955, -978, 1728, 744, -1041, 411, 745, -208, 699, 774, -1275, 195, 1923, -409, -1661, 1118, 759, -644, 169, 48, -948, 934, 1646, -1512, -908, 2094, 232, -1541, 634, 607, -640, 598, 602, -1654, 286, 1951, -1158, -1912, 1446, 874, -1070, -11, 427, -882, 970, 719, -2246, -328, 2126, -470, -2070, 936, 693, -738, 230, 69, -1768, 939, 1779, -2044, -1436, 2129, 296, -1655, -37, 101, -647, 1339, 510]
2728E10k955K723K256l523j144L523l23k021J227k80j193K736J4m048J514L675
2744B691k414k141K637k30j116J700j346j662L129J154m279J55M086j423k060
2759a119J515m89n67K378q78l281K545K943l588j363K945k7j756J799j244j567
2775a754L531N47m670Q28M241k133k368K089O0r20J915r86k941L254J979m046
2791a374r96L685o53j627J314q64r41L273o13l763J641L698l188j861K950m34
2807B47q00J596j497k232L735J353m639N83L301j309j640J574o48n67K754j583
2823B28l008K875K425l530j078K855m03n91R10j416o03L075q0l901J418L184j802
2840E58j894J912m09m15J936j822k278L415J243l366q6K717j104j154J451j205
$$ y = [510, -2445, 278, 2534, -989, -2133, 1390, 1067, -954, 273, -7, -1200, 1536, 1550, -2498, -984, 2691, 277, -1864, 773, 543, -573, 1127, -219, -1881, 1248, 2402, -1877, -1722, 2364, 941, -1119, 396, -93, -660, 1718, 840, -2441, 104, 3047, -541, -1904, 1041, 1014, -742, 1057, -187, -1754, 1777, 2324, -2346, -1518, 2723, 590, -1778, 311, 371, -549, 1366, 380, -2561, 693, 2672, -1374, -2370, 1315, 662, -965, 349, -515, -1456, 1817, 1204, -2559, -918, 2780, -408, -2269, 681, 247, -553, 1043, -454, -2686, 1049, 2402, -2237, -1654, 1647, 338, -1302, 272, -376, -943, 1811, 228, -2780, 95, 2520, -1010, -2088, 767, 364, -227, 683, -733, -1336, 1739, 1659, -2242, -824, 2360, 558, -1336, 576, 167, -248, 1688, -134, -2412, 1003, 2246, -1120, -1206, 1511, 407, -747, 704, -501]
2856e01j94K231n03l059J700K756k765o33J924o25l88R83r48j487K735N65l546
2873a755Q87K276j112q70R88p89k90J887r29k097K067J494k344n13J841n69r04
2890g32J215j168l50K200j98k709J252K249j972o22J207p62j62J076q32j191K020
2907E21Q29k597K16J867n69q83J069j064J09J530q33j700J576J155j782k78J312
2924D78l96k68O29p11m10J489Kj691N50J325p29o35J039n21k44R81o40j283J431
2943C96P99j144n60J100n68l70Q10m22m63J024L30j566M96R40n73o63Q18j96o23
2962d35R65l56j054J133M96j035j21Q01m73k70M25k46l41Q89k38q42L78Q85p64
2981b03J19K82l46r2L18k25l49P35P9q87M92L97m28q1M07k99l41N11m21q9N92
$$ y = [-501, -695, 1536, 1033, -2026, -326, 2430, -335, -968, 956, 331, -57, 926, -22, -1509, 1226, 1791, -1755, -868, 1408, 296, -574, 414, -375, -665, 1222, 293, -1804, 263, 1757, -587, -1100, 741, 172, -732, 483, -685, -1035, 1165, 967, -1742, -490, 1759, -213, -835, 372, -390, -552, 524, -308, -1499, 521, 1350, -1247, -1031, 836, 267, -616, 453, -611, -502, 1028, 195, -1505, 71, 1226, -556, -834, 478, 82, -186, 443, -268, -678, 811, 813, -878, -328, 997, 268, -367, 672, 151, -93, 888, 248, -1035, 396, 1195, 51, -509, 591, 23, -347, 463, 41, -422, 602, 932, -634, -138, 802, 229, -434, 384, 188, -435, 530, 174, -880, 253, 749, -286, -407, 394, -79, -349, 76, -170, -511, 378, 140, -702, -324, 561, -203, -84, 198, -148, -240, 78, -147, -496, 239, 318, -569, -77, 320, -108, -189, 218, -81, -422, 89, -332, -421, 171]
3002A71M1m67J75K08l95J03M04k65k58N20j60l16l3M42k62n4O26m90j63M02q4
3023A45n32O62q7m30k2M78k74R5K52j96l1L06j83n3l5O0k63J98J47j65Q3L18k30
3046B43l56M45k63k91L44J40k04k33L20j25n7J43m35L47K92j91l93K30R4L0n9
3067B1Nk98P6L43j56L3j70L64k28j04L3k62J92J15Q1k79L7J72qJ60m30J43K0J46
3091Fm5j73M20l71K52j88L93m47J95J50l85J3L76j47J83k98rK3J89j12k15K95
3113A05K0k43J28K46n32R4L74M4j69J28L10o30J31N08m22j50K46J37k11L15k48
3134A81n83L00K04l25J49M19m10PM06n67m0M54N9l83J80K32m52r9N26k22m1N25
3156E20m59n13M28M41r88J41P57l47n17P41m03j0N51m60m34L56J62l64k18P45
$$ y = [171, 212, -255, -80, 128, -267, -164, 240, -25, -283, 237, 77, -239, -272, 170, -92, -146, 480, -10, -173, 229, 145, -387, 275, 188, -242, -264, 214, -60, 35, 287, 91, 60, 366, 183, 130, 95, 155, -108, 90, 237, 72, 155, 473, 243, -113, 332, 69, -222, 122, 262, 58, -175, 145, 20, -37, 106, -329, 18, 310, 119, -274, -44, 50, 80, 21, 26, -272, -196, 147, -9, 24, -146, 218, -10, -114, -81, -343, -151, -36, 45, -234, -197, -25, -33, 127, -303, -160, -140, 6, -39, -212, 208, -163, 89, -99, 294, -153, 42, 192, -193, -180, 196, 49, 232, -66, -75, -52, 137, 25, -190, 105, 125, -118, 10, 256, -276, -182, 192, 236, 67, 195, 505, -125, 6, 514, 92, -58, 188, 325, 114, 429, 181, -402, -102, 102, -223, -74, 345, -65, -58, 348, -219, -259, 195, 254, -129, 51, 283, -169, -268, 258, 36, -5, 520, 61, -452, -24, 417, -571, -430, 327, -20, -537, 204, -199, -209, 342, -118, -552, -196, -34, -398, -616, 129]
3176A29j7m82M97l57o2M91L87j214J66Q89o43K6K89j65m8M44m89o23J167K39r65
3197c41j70R95m08m7K13o76K26R46m34j046J025N31q40k40N43k01j33N12m54n96
3217e95J251L8j179J13J278r23j49P72r47J38J062o69j041J157P16j424p0R76
3235E04o15p3N42p97m14J595j35j587J236L96r32J08J20j38j37J025q35j067J611
3254D07J87j447M13J013o14j14K94p02J46J037m11j621J164J340j536L1Q13p25
3272c25J90Q43j263n15J817K74j937N01J302r73q0N87j047J98J487q81j484J654
3290C48P93j540j7R83l61p2O49j310j95J922l55j855O47J331o62m33M97p21M92
3309A41R72j389p60J856K03j782O01O32o26Q2M67p75k47J700o75j607J381R17
$$ y = [129, 112, -370, 127, -230, -292, 199, 586, -628, -462, 427, -216, -190, 99, -66, -114, 330, -159, -782, 385, 624, -341, -511, 484, 76, 29, 242, -434, -208, 738, 304, -742, 283, 814, -26, -266, 277, 76, -57, 455, 1, -595, 656, 694, -485, -372, 906, -17, -166, 606, -341, -203, 859, 190, -851, 306, 1022, -402, -472, 504, -111, -184, 358, -439, -853, 742, 607, -980, 256, 652, -280, -172, -52, -190, -327, 698, -137, -1204, 407, 594, -853, -440, 573, -41, -155, 139, -563, -417, 620, 209, -1412, -248, 1092, -444, -413, 400, -325, -135, 708, -555, -1070, 747, 1021, -916, -415, 887, -86, -166, 421, -626, -428, 1059, 178, -1306, 348, 1141, -399, -416, 567, 206, 134, 783, -527, -722, 1200, 845, -1010, -363, 968, 306, -127, 370, -351, 141, 1113, -276, -1036, 820, 1023, -759, -158, 474, -152, -70, 397, -378, -625, 1075, 400, -1207, 174, 1091]
3327A091j436O3L75o97P16O81j372l93K111k60j944Q55P98p08q9O74j145O47J280
3346A247j693j046J986N72j695K08J009o58K28J74o84k72J838r45j361Q63J113
3363H84r79r9K94m88M39R09j475n61K105j10j683L32O26k42L88J70j177M04J618
3382A355j245j271J673K77j021jO71o07K47P75j416N7J478k54j602R68O14p72
3400g4J70L9o56N60Q41r81q26J519J79j426O30M34m15K03M29j113J31J176m35
3419C85j224J021K9n09R9K08n92M16Q31j258k95J555r5j337L88M15l95N93J31
3438C66j001M73Q44q62p32J090J43o39L24L6n17O73J69q72j04J254Kj404O59M80
3458C82m48J19J22p36M96M14o85J80M27J08o41J83J08j50L50L00r57L74P13r32
$$ y = [1091, -345, -282, 93, -604, 112, 793, -579, -972, 1139, 879, -1065, -210, 588, -120, -209, 465, -680, -33, 1247, -446, -1492, 494, 1066, -629, -421, 588, -70, 158, 332, -352, -624, 1214, 269, -1092, -229, 884, -95, -194, 100, -388, 51, 960, -515, -1076, 1029, 919, -764, -432, 194, -48, 340, 510, -667, -263, 1355, 110, -1161, 512, 789, -232, -233, 438, -169, 78, 853, -563, -506, 972, 718, -884, 84, 698, -74, 96, 135, -521, 39, 880, -101, -927, 592, 771, -655, -25, 409, -6, 197, 626, -487, -356, 820, 385, -839, 182, 211, -298, -199, 9, -583, -167, 664, -594, -889, 666, 571, -766, -378, 37, -358, 235, 366, -635, -162, 682, -180, -912, 178, 321, -318, 6, 42, -475, 198, 367, -505, -609, 645, 647, -757, -98, 382, -66, 53, 175, -561, -65, 349, -336, -156, 271, 379, -262, -79, 29, -121, 229, 529, -428, -54, 659, -273]
3478b73k80P86J52m69K36K51l15l4M87q54k32Q84o9n70M47L08n69l5L73p58M91
3499d3L62j12n42P52R7p40o6L09l31N49k19m24K18L77m4n00K60K74k57j8J27l78
3521c49M26J29l29n23R25l85p6j03M79l5l1k8j46k48L77m73J62K30k27j79M49
3542D5R7j31O5N6l13j99K05O4m4M63j47j88P4l6j10Q4L66k42j58J58Q5k03r3P9
3566b3M5K0J31k77p2L17j39P9K83N6p22J15L31j15K0L92m43lk1Q1k26L1J46k30
3590b24J23J89j02J7R6k94J64J39j50j22L81n6QP3l02K78l82L3J20r2R0j9r7j51
3614b80K55o4j81K00m7k21L58k12L12k08K99k40k7N1LJ35j83q0K80m05p3po6O84
3638B83k62m2J97j99m1R8J99n04J83K3l8L28j1k39k56L6K31q4K70J9k06k11L8
$$ y = [-273, -553, 233, 385, -84, 152, 403, 88, 54, 541, -313, -545, 339, 270, -300, 147, 455, -114, -149, 224, -534, -43, 319, 207, -335, 417, 514, -226, -292, 17, -314, 235, 16, -408, -190, 187, 143, -357, -97, 177, -80, -98, 29, -349, 77, 206, -123, -646, 279, -106, -182, -285, 194, 159, 128, 100, -46, -294, 83, -390, -228, 2, -225, -404, 45, 142, 11, 76, 132, -181, -380, -175, -111, -155, 308, 161, -27, 47, 11, -99, -15, 351, 109, -49, 109, 194, -9, -102, -23, 22, 42, 173, -104, -176, 141, 2, 81, 364, 420, -302, -187, 144, 29, 49, 441, -2, -5, -26, 55, -171, -140, 6, -224, -101, 88, -14, 3, 99, -195, -31, 108, -42, -164, 217, 161, 169, 242, -60, 218, -164, -131, -11, -103, -13, -32, -129, -280, -25, -89, -270, -70, -117, -338, 20, -192, 120, -88, 211, -29, -56, -5, -2, 133, -50, -130, 150, -255, -328, -335, -401, 283, 21, -21, 176, -23, -64, 34, 233, -271, -88, -65, -103, 225, 214, -25, -281, -245, -14, -98, 172, 191, -15, -226, -188]
3661a88K15J48Rj64k1M8M9j31K45Q5n36K60Q5j16m4l1J32j08J67l36J41K85J04
3684B98k58l99N99m74J49L13k49j65M82k34l93N82m95qK36J58j34m3L53m37K03
3705H4J67l0l08K30r7J51l44P8j79K5O27n26j80N02N3m95L02L0n67L01L5o2j5
3728b18M07k07j71K48K07k39j25Q8l6n3J04p8ON48l13m03N7K19o9J82o1k17K3
3751a01O01q48J82K27K22n12J64J86k61Q1L13l65LN24m05k19K45K24n94M99k24
3772e8O7R6L16n81k26P65k58m06K4O22o24L44q2m28L21O17p04m07Q49j35l39k5
3794b52M38n00J60O09q88L36K57J19n29L17N8l63K07J4r6J20L39k49m33P10l38
3815C6l54M68Q9o33O01n1p89M47N94l21n80N01K86l43L18n71k83Q77J21o47j2
$$ y = [-188, 27, 175, 184, 20, -1, 47, 96, -35, 210, 295, -241, 19, 104, -12, -56, -87, 45, -63, 104, -232, -91, 194, 298, 40, -359, 240, -234, -85, 228, -21, -186, 296, 62, -331, 251, -244, -252, -16, 142, 8, -35, 318, -119, 84, 251, 221, -87, 143, 46, 197, -147, -69, -248, -223, 404, -122, -302, 200, 253, -242, 60, 90, -477, -176, -141, -203, -218, 189, -18, -189, 59, 266, 27, -98, -10, -46, -99, 5, -73, -67, 481, 168, -235, -178, 41, -28, 154, 93, -124, -101, 500, -348, -166, 61, 283, -229, -65, 121, -140, -59, 254, -111, -108, 416, 11, -208, 37, 261, -333, 166, -58, 9, 105, 421, -160, -386, 379, 121, -285, -261, 361, -263, 81, -1, -429, -108, 509, -195, -602, 247, 112, -227, -252, 186, -314, -154, 455, -433, -97, 160, 279, -250, 67, 125, -238, -31, -17, -113, 7, 346, 97, -336, 374, 36, -318, 150, 239, -394, 207, 156, -633, -186, 408, 87, -493, 8, 294, -49, 269, -302, -585, 292, 413, -234, -246]
3836b46M00j71L4R4j59M8K84j84n13N41M95o55l41N31L52o72K69K3o18P42M2n72
3858b76j58P51q0o66L66j72J00J7J35l73L78L85n49j85P30k64l96L17n7o8M48
3879C83j31r36N31O15n29k67M33p4j43K67l1p17Q51l7o78J47O60k70p17R22n18
3900b39OM12N3o32N33J93m18NK06Mpj10j00m71R09j49o73K27P70p87J9M19l3k42
3924a05L65j26n83R26n6p96J76K89n5j44L61l93j0L63j4n22N30L37p36n7L69j7
3946A02r3M58l50n10Q11J04j148N28M24l53k67K08J90nQ0m3n49K34O14n52j0J54
3968B7k1r9J12j42o5N68m68m28N82L32m77r5K64k76Q9lJ11m05M63M05r06L91L33
3991B92m48J43J96j89j47J42J52l32L60K78l34j32J8j43K58J80k83p2O1J36l57
$$ y = [-246, 154, -17, 17, 111, -48, 0, 284, 100, -413, 128, 623, -32, -373, 158, 510, -162, 107, 130, -488, 254, 296, -276, -434, 317, 237, -429, -63, -235, -135, -118, 17, -356, 22, 407, -142, -327, 403, 139, -257, 60, 3, -65, 383, 252, -684, -153, 462, -67, -334, 99, 25, -118, 149, 118, -599, 252, 215, -463, -316, 344, 74, -643, 279, -239, -233, 179, 232, -400, 133, 326, -92, -87, 119, 123, 116, 6, -94, -565, 344, 195, -478, -251, 519, -268, -249, 170, 137, -105, 260, 134, -449, 477, 421, -375, -199, 90, 35, -109, 252, -141, -151, 212, 198, -324, 206, 543, -193, -250, 119, 102, 9, 467, 117, -393, 418, 522, -626, -98, 326, -27, -294, -86, 104, 99, 179, 136, -413, -179, 435, -117, -127, 27, 6, -93, 19, -123, -188, 380, -88, -516, 66, 398, -79, -174, 90, -186, -97, -100, 11, -394, 69, 474, -432, -41, 292, -156, -13, 183, -6, -153, -11, 141, -191, 169, 447, 113, -19, -1, -144, 114, 294, 11, -61, 0, 136, -221]
4012b21K8J51P2l26M77l2k91K75j03j77N27J74n67k17M61J61k34q3m2l88L96R
4034E0m37K46K95j2l85N75k39j59K68j38p5k7P2k58K22J94l58j5J67J36p2N3j99
4057i6N9j49L59o14J69K15J05j5l0j86J80j67N10n23J00J41k18Q9Q0r0m0K29q0
4080B8j19K95k76l7l9L28Q5o6r3j15L4p6J70j45J32J2k24j9L49l26R4K75j51r5
4104B1j1Nj40l0K43l82K48L8q4J54N7m40K92K8J9%O1m7J58k31L3l40J78L43j11
4129F2r0N4K6k04j17N31l24M4J70M9l33K07p9J71j42n7K22p02M31L34k12k3J40
4152A58l33R2m7J44j12J95j90n9L3J59r4J78j92j11L11o3k99J58P7L1n7J76j21
4175C4l7n1K63m63Q8L03k63K59j41q3L8Op9p6L49J92k81m9JJ18J11p4J11k75Q3
$$ y = [-221, -193, -42, 30, -296, 181, 149, -142, 133, 30, -147, 380, 554, -13, -230, 231, 392, 158, 75, 33, -355, 41, 50, -387, -141, 154, 142, -243, 332, 93, -66, 202, 64, -11, -38, 34, -224, -2, 192, -166, -181, -14, 122, 50, 103, -96, -37, -186, 173, -441, -272, -57, 48, 33, 3, -183, -3, -170, 340, -183, -83, 58, -160, -71, 9, -81, -121, 108, 28, -91, 204, -72, -109, -148, 180, 265, 199, 106, -9, 25, -51, 119, -26, 106, 118, -106, -125, 224, -102, -8, 267, 116, 21, 10, 15, -125, -155, 88, -294, -46, -8, -92, 62, 119, -321, -29, -1, 18, 18, 79, 32, 190, -41, -8, -348, -170, 173, 62, -28, 26, 52, -152, -269, 262, -62, -18, 152, 201, -132, 75, -4, 167, 25, -32, 190, -512, -81, 253, 41, 18, 158, -175, -83, -130, 14, -98, 97, -93, -152, -119, 40, -54, 124, -68, -179, 132, 69, -230, -72, 5, 36, -21, 155, 34, -3, -54, 209, -254, -166, 137, -126, 133, -8, -91, -53, -47, -126, -202, 147, 339, 58, 9, 10, 128, 239, 165, 276, 1, 84]
4200H4J62k06r0R0n7J22J22j40j57J84J46m38J04R3j3J33k21j76L28J66j21Mj6
4223A03jl66L46J37j86j43kL0J69k02J74k3j15K39j70O3r7k08K37j5r8j20L19
4246G1R2k30Q1j66J27M1Kk07J95K13l60J09P4Q4m23L89j44k03M07j22J85m40K85
4269F0k41K35m8L79m79L39J36k81j99L49k73k81L19j85J68J36j53j29M0J81J06
4290A79k06J15J19m25K99N4l96M52r3r3k12M56j49m1J34j98q5OJ5J70p4N6j4j53
4314h4j81K26J87m5k38J51j84J97j90K24O5k15K5O1J58k85J55Q9k70K41P8k41
4336g6J01k27k30N36M5k50j13K09j68m93M83M91m46j26L47J1l06J15j24J13L3
4357g5J84l67J11L26k74J71j65r1J88K61j85j69J25M15n39K8n9O2R3K40k21o5
$$ y = [84, 246, 40, -50, 40, -17, 105, 227, 87, -70, 114, 260, -178, -74, 19, 6, 139, -82, -258, 70, 236, 115, 119, 103, 102, -264, 82, 219, 33, -110, -112, -82, 87, -115, 59, 36, -79, 160, -10, 53, -44, -252, -15, -30, -128, -248, 71, 163, -67, 14, -152, -25, 16, 18, -189, 6, 219, -141, -32, 42, 126, -297, 92, -52, -255, 152, 30, 215, -225, 60, -181, 54, 6, 385, -94, 245, 381, 100, -99, 250, -23, -304, 15, -170, -2, 134, -19, -148, -108, 73, 179, -27, 88, 207, -218, 81, 135, -261, 191, 98, 5, -207, 249, 100, 59, 193, -5, -90, -84, -69, 101, 27, 83, 69, -84, -265, -39, 148, 103, -135, 16, -168, 29, -161, 63, 128, -87, -62, -1, 157, -128, 27, 116, -154, 87, 165, -76, 25, -202, -432, 104, 149, -101, -214, -5, -173, -666, -183, 308, -138, -264, 83, 94, -212, -97, -221, -108, -75, 109, -258, -147, 179, -95, 76, -89, -180, 8, 269, 84, -85, 40, 455, -84, -56, -115, -53, 40, 280, 59, -6]
4379fj3m1M7J8L23j82L6p6M8O2P2n75Q4K79J47n31J01K18K5j19K03q1n3J24rj99
4405i8Q7R5k76K18j52k9kK98k64j63L50P7p17P07k8lJ83l45l7N3K95l69r2K45
4429C3J70m93jL21p7K7M0k99J44J83J33n75M46k30q4J78K04j08k77L90j44k51
4451b70M22j21l61J42K84l42J04M25n77K44L39k38j43J04L0r5P5J52l75K01K54
4472B54j59q1k02M03j35J08j84o4J08K7j30L31j40j51r1O03l27m46K78J6n3J14
4494G9j70n9p6M09k34L9K48L4m66K82j89J51J43o8l03J54j8K8j74K31J4m4N9m9
4518B1k13r6K62n1Q7ol6r0q7K66j75n3K22m2l59N82l12o9J34KJ4K6J21j69m7O2
4544fj04r2J71k73K43M8K97k60R6j74l26J11M11k41j8L79M0k53N7j06J60j00J22
$$ y = [-6, -19, -60, -13, 5, 328, 146, 182, 106, 154, 216, 288, -287, -203, 76, 223, -308, -207, 11, 36, -83, 120, 39, -14, 110, 101, -98, -11, 84, -192, 26, -126, -155, -157, 141, -123, -286, 64, 141, -576, 131, 103, 100, 283, -62, -99, -46, 249, -120, -212, 33, 203, -290, -291, 30, -47, -20, 20, -279, -135, 48, 181, -394, 52, -178, -262, -84, 120, 12, -265, 125, -19, -270, 152, 31, -330, -188, 96, -246, -142, 283, -294, -50, 289, 51, -92, 12, 42, -53, 22, 174, -201, 0, 254, 95, 14, -188, 215, 80, 188, 4, -60, 48, 75, -55, 276, 136, -15, -106, 497, 170, -276, 2, 18, -35, 79, -91, -150, -226, 183, -51, -12, 236, 270, -196, 86, -103, 48, 191, 123, -180, -26, -44, -16, -190, 41, 55, 11, 70, 21, -192, -288, -26, -77, 10, 4, -32, -122, -209, 57, -118, -171, 51, 9, -350, 232, -80, -149, -15, -13, 1, 27, 148, -21, -68, -6, -110, -202, -31, -304, -61, -13, 284, 24, 120, -54, -380, -269, 142, -99, -117, 262, 302, 49, 106, 0, 160, 60, 182]
4567A82l61J40J29m6J77k11K2j01Q9J21K42m70N12n39j04K63l13M12j49J81n2
4588A24oj77J75l39K12J95j17R1k13j84K96k89L99k72L0m4J43K20m83J97J28j27
4610d1J16j28N5k78K69J23r8J19K51r4m07L7J2Q4J46j32r8J63j22K21k82n3Q5
4633e2J73j7l02N7J82k62q4K59J85l49j8J24K07J8j35Kl18M20j81L9l6k31N42
4656B23l41J57J52l61K88M7k30rk3J14N6l96L98K14k81J65J30j46k48L9k5P3j9
4679b3R3P2k62j10K37M1j81J11P9K0l9K40k67J09k84J59p4K6M4p9k23J87Q2M2
4703@j84L40n5m05LM42oj91oJ48Nk27J82qj82K77j19o8P2j91J51pl4n0P6k13M59
4730B09O7o31K68R1K3r9p7J74k13P6R6J50j93j8j11J79J7L04m71O1J70l1j01M39
$$ y = [182, -179, -39, 90, 44, 221, 10, 32, -69, 20, 141, 383, -87, 425, -114, -218, 45, -268, 144, -5, 176, 124, 118, -59, 116, -223, -11, 184, 67, 158, -55, -239, 57, -232, 167, -105, -75, -119, 24, 244, -239, -42, 86, -41, 75, -53, 2, -276, -7, 116, 18, 137, 388, 294, -113, -76, -64, 20, 166, 34, -64, 99, -23, 198, -84, -137, -52, 121, 104, -198, -141, 41, -221, -305, -46, 139, -210, -228, -104, 103, 121, -14, -12, -330, 90, -91, -52, -88, -319, 223, -118, 39, 191, -170, 118, 165, -65, -74, -97, 17, 73, -323, 75, 289, 8, 173, 303, 157, -91, -52, -77, -4, -23, 70, 142, -120, -230, 7, 48, -133, -22, 57, 77, 38, 278, 11, 120, -164, -5, -79, -53, -9, -88, -311, -124, -42, 0, -184, 156, 101, -304, -301, 141, 135, -56, -62, 86, 91, -136, 46, 38, -144, 133, 14, -54, 18, -173, -22, -29, -63, -113, -37, -250, 209, 276, -355, -87, 4, 27, -72, -149, 25, -188, -112, -16, 134, -59, -77, -188, -9, 8, 312, -159, -98, 72, 41, -60, 379]
4754C79k47j79J47j60R6k10K28N4n2n6j15K30l79M35j5k81L9J81Rm6k69K22j40
4777a29L89k68k0J18k98K24l11M69j0l7l01J9J35r9p7J88K0J8j11J49m16M44l43
4800b47J03K02K80l13J7m1j69L42k41j94L84k18j47L88j9j79j00K28k5j06j18
4821a73K25p8q8K48P3k92Q3M2J71m6k68J17r1L12o9J78j32k49J7R6l8k46J92K35
4845B19m46Q8K82j79j82L71Lj78Q9q5J09L6j00m5P8K73k81j7R8j03j2j37L08k05
4869a6k13J22K41J55j62rl7p1j64J25J59p5o2j01K71j56J79j48K52n73K57J25
4891I9kk00K76k06J73j20K9o5N2K21o00K62K03j98k74M41l67K43p1K12j58K3K39
4914B12m72J84k1K07j60j21J00j29K35l3k40K92j33M02j03k70K9q7J21J4j48J27
$$ y = [379, 132, -47, 100, -60, 36, -174, 54, 108, 56, 0, -115, 115, -264, 171, 156, -125, -86, 95, 104, 58, -211, 11, -129, 260, -8, -28, 90, -208, 16, -295, 174, 164, 127, -174, -155, -20, -119, -196, -8, 12, 30, -81, 68, -348, 96, -247, -144, 58, 338, 25, 42, 1, -168, 174, -67, -261, 123, -95, -242, 146, 127, -52, -152, 76, 51, -55, -173, 52, -26, -114, 134, 207, -85, -2, 40, 211, 165, -103, 14, -77, 235, 166, 344, 212, -37, -20, 76, 38, -208, -16, 219, -227, -139, 143, -36, -218, 153, 156, -22, 67, -18, 91, 127, 27, -18, 60, 333, 52, 35, 133, 30, 18, -119, 189, -16, -229, -107, 134, 289, 127, 118, 81, 10, -154, -29, 130, 55, -7, -108, 163, 7, 186, 38, 290, -283, -26, 99, 97, -103, 173, -33, 140, 20, 49, -16, 36, 257, -343, -81, 122, -76, -350, 91, -276, -33, -104, 108, -50, -27, 212, -260, -76, -97, 110, -50, -171, -71, -200, 35, 2, -238, 54, -79, 323, 220, -50, -21, -108, 13, 27, -121, 6]
4936FM1J1k45K81P8p9k4j2R2j1k29k24L05R1l61R1QK87j03p8L9l48M10j62j5L75
4962B24j33k25O5R7N7j85J90J10n85N40j64OM9j96n0K35j6k96K02K43k36Q1K40
4985B53j06k64M8N5K50N8k37k90J86J72k79p8L50m3q2j86K88l57K88M7Q6k74K64
5008A49j14k8j54J70J66k48mn9K18j16l5j87L21j07k2J37j19Q6K6J16m95M47P2
5031B20j76j60Q6K48k81j9K90k74J95m0K2O8O3l89J98j18M7N3k0m9Q6rJ87j66
5055F2k42L81k23l6k69L6J83P5M9N9k11J54r1j83L23J58j33Pj83J09l1J74j2l35
5079a79j18K82J09L14j85l18KJ03M7O9o1J19j89M6j65p4L15J88o4J01j41j90n3
5102d2k93L57oJn1Oj53K84j85J19j1k15J16K27m3R5k08q7J55j0J9O0l46J48K92
$$ y = [6, 47, 58, -187, 94, 172, 93, 69, 57, 149, 138, -91, -315, -10, 81, -280, -189, -181, 106, 3, -75, -36, -384, 26, -136, -151, 224, 91, -134, -69, 28, 85, -100, 90, 200, -385, 155, -9, -3, 46, -150, -200, 35, 19, -277, -75, 168, -68, 13, 253, 147, -117, -69, -14, 236, 294, 57, -233, -47, 125, -154, -232, 118, 75, -7, -193, 95, -262, 26, 73, 159, -115, 149, 35, 7, -147, 23, 189, -59, -63, -122, 96, -20, -55, -242, 79, -28, -50, 87, -32, 54, 80, 196, -299, 148, 220, 44, -116, -30, 218, -63, -82, 208, -66, 129, 89, 111, 179, 242, -147, 51, -67, -20, 33, 13, -36, 50, 41, 228, 62, -180, 201, -22, -58, -327, -291, -108, -33, 16, 75, -136, 18, -73, -256, 67, 225, 92, 99, -84, 25, -6, 168, 156, -179, -297, -15, 94, 408, 223, -95, -93, 10, 57, 126, 65, 184, -5, 41, -124, -198, 117, 305, 241, 342, 201, 11, -42, -335, 22, 16, 17, -34, -28, -181, 103, -82, 37, 26, -189, -73, 154, 111, 206, -2, -89, 66, 56, 75, 135, -211, -63, 229]
5127B29j38L4j45N5L4K96l42k99M02j88J67q0k27m5K07J74l81K66L6r7K42k33
5149c3J54J12q1k66K13k58J90J22k56J44o7J65J08k38j01j93M34k26n2J18k01
5170b12K08k99K60j80J4K65J62J35m76J68m6p8j27J33J38J2L4O8j87J55R7l30
5192h6P3O2L5J14OJ9%l66J41k92M30k18L00j91j13Q3J77l93J74M3l5M0J6j18p5
5217a74J27l1M3j16q6K14mL10k05k50J90Nj64j42J45J39M5j04P5J41j09q0K2o3
5241g2j89J65j39Q1O8L3J50Ll5L0j14P8L3j29j30J85k14j42L80j24k73L75J47
5264A67k02n2K04k15J98l11K22l0J5J3K0k30L7J27m4J41k58M46j99k43L94r9j96
5287i5J75m7J04k15j52K72n6l4K35J9k4m1j91p6J91N7j92k52M65J1l64J32o8J75
$$ y = [229, 91, 125, -20, 35, 69, 365, 23, -276, 126, -62, 105, 25, -202, -247, -40, 134, -247, 19, 55, -42, 200, -33, 121, 233, 152, -114, 99, -159, 31, 153, -103, 41, -26, 139, 247, 9, -92, -285, 149, -77, -129, -11, -212, -4, -303, -43, -223, -209, 56, 218, 353, -123, 45, -1, -79, -206, -73, 65, 77, 111, 179, -8, 147, 244, -86, -13, 49, 84, 198, 204, 223, 223, -143, -2, -294, 136, -82, 218, 27, -86, -3, 174, -219, -45, -2, -37, 3, 19, -99, -174, -47, -78, -35, -151, -237, -23, -27, 283, 78, -172, 18, 23, -141, -283, -138, 1, 46, -58, 17, 158, 49, -31, -9, -72, -261, -96, -235, -154, -86, -53, 97, 100, 65, 95, -19, 59, 92, -37, -167, 18, -196, -338, 42, -82, -355, 20, 167, -35, -87, 117, -98, 100, -211, 11, -19, -4, 9, 29, -201, -164, -37, -81, 60, -198, 248, 49, -194, 200, 101, -95, 80, 33, 137, -78, -230, 42, -14, -48, 187, 206, 182, 141, -50, -126, 65, 122, -70, -322, 143, 154, -210, -78, -146, 29]
5311B9n7J63j42M1O8J8l55M3J03M3j1m1K7O0l2j12M94j24m05K86l65M48K6m37
5335b32M26l99J93J99N6l29J64P8j15o0k2k28K19j4l5P1J80j76j48J1K88k22J19
5358B4N5j53J70k88K16J71O0m88K74j01K42l34J92k5j41K86j91K2j86k2K43OJ37
5381A69m9l04L39j75m1K10j23j53R6L6o4L7k3R3k00M00L0k67K9k36K04J6M2o8
5405bj59J79J19k25o9k0M00k23M8K10k11k80K5J62J83j67k9l1K36l24K21J3n7
5428aJ22K8j48Rk3j19l9r8L02M5j46P3o2q6J30j06J05k02L46j84p9K38J16n02
5452b81M00l08K26K30l6k57J00k17Q9K58j83j68P3J42O1m32K38L08l52K17j41
5473c3K85l19K8k31L1K61j81J19l9K63K3j67O1r2p0q0k6Q9J16J79n6j70J55j77
$$ y = [29, -28, 135, -7, 34, 102, 120, -235, -192, -89, -46, -57, -98, -71, -11, -43, -155, 339, 215, -190, 96, -269, 179, 205, -232, 194, -205, -12, 187, 243, -86, 78, 156, 41, -19, -41, -269, -50, -64, -99, -28, 152, -24, -172, -161, 127, -95, 24, 79, -74, 96, -192, 24, 195, 255, -233, 41, -60, 182, -152, 40, 15, -126, 160, -31, -9, -195, -217, 26, 32, 169, 120, -184, 155, -20, -61, 149, 26, -127, -31, 5, -59, -22, -45, 48, -152, 248, 278, 11, 40, -196, 8, 24, 66, -2, -161, 18, 137, -88, -157, -177, 223, 0, 48, 258, 47, -233, -208, -46, 137, -30, -59, -90, 146, -178, 43, 56, -1, 121, 149, 1, 10, -13, -132, -171, -269, 33, 78, -68, 5, -57, -143, -13, -119, -14, -216, 130, -54, -133, 105, 221, -281, 119, -189, 37, 267, 231, -26, 74, -143, -54, 204, 21, -147, -74, 68, 129, -303, -65, 243, -109, 108, -33, 252, -67, -39, -270, -239, 22, -159, -40, -79, 184, 207, 40, 101, 9, -61, -141, -167, -78, 38, 217, 161, -9, 146, -31]
5497c1K92l55K7J2J78k8j01jK17l34R6J89j31o2m1O8J09j67J92j78K9L4M0l3j7
5522Dj27p5L37j28j23k03K44J8J91j51k9K1K80m24%J1J53M1M2j20J0L0K01j52
5546E1k8j28j60L10K04k29q2q8J35J36qm87K31k3J21O0n7J92K6rj6o6j38j38K95
5571A04l26K14K4J66k24m2L71k66N8k21l5J70J08l13L97q7J72n35K63j35L58l50
5593a29J18j57j18K32N3kj03J10L62n31K18j36j30M54m80K30L15m26J06k7k28
5614b69K02K28o2n1j40p5K53m1M2j39M2k8K47l30L10r9p4k47M7J80P4M2Q6l99
5638b01J37K07j28J28j9l17L07k74rp6K75j9j45J11Q7l7k08q7M28k70M7L62l08
5661ij03K51l17J75k08K06Q8Q7L0j53K04j37j05R8K44j79M3q5J22j71k6k24L22
$$ y = [-31, 261, -94, -67, -55, 123, 95, -6, -7, 210, -124, -28, 161, 30, -32, -73, -5, 104, -63, 129, -49, -20, 14, 54, 21, 4, -123, -198, 139, 11, -112, -315, -71, -53, 138, -13, -42, -21, 259, -165, -165, -154, -1, 40, 82, -38, -28, 2, 203, 51, 23, -105, -265, 45, 249, 20, -62, -150, -15, 121, 113, -374, -143, -166, -45, 15, -42, 150, 176, 167, 151, 85, -53, -191, 104, -222, -8, 16, 182, -42, -84, 287, 21, 79, -142, -177, -7, 101, -212, 185, 98, 270, -265, -2, -137, 221, -129, -11, -168, -286, -54, -1, -3, -106, 4, 366, -165, 53, -83, -213, 241, -239, -9, 306, -120, -14, -41, -269, -67, 161, 99, 48, -92, -167, 86, 45, 87, -52, -10, -38, 209, -121, 189, 90, 16, -231, -184, -4, 70, 112, 198, -201, -64, 143, 15, 143, 124, -193, 114, -160, -169, -245, 30, 11, -134, -23, 64, 27, -181, -268, 160, -110, -63, 299, -9, -112, 139, -178, -3, -211, -5, 83, 170, 200, 47, 251, 114, 9, 107, 351, 172, 215, 130, 252, 81, 55, -169, 153]
5684A53l81J72j44l4K84l7J09m52L00J48k11o8K34j35L41l05L0L31j24l45R6J3
5706b5o2O20p14K7J94k39L15l77M44j07O9j50j04J83J45l53O9o9M11k23m05N37
5728A86l77N5L06k40K20l8k87K37j10O8J30l21q3K9J97L19k36j9k26L09j38k0
5750c9j44J86Nl4J17l20L87l67L75r4j96J08L6n3m4r0M46n26L40l3j1j28j48R6
5774a31J82R5j91j15j2K84j54l2J06K31o50K97K49l6j77p8J50J1j53L08l84J72
5796b8J47m5j66O6J89j8j90M3l0J12K3K8k31Q5k0Q7l82K83l7R4M6R7j87j5L15
5821B66m06K25j21M3J06K3J36l12j24J59P6J31j77J75q5m8j63K70k36l9j57p1
5843c29M28k3m5j67j22M25k4J89m59P3j56J38lJ94Q1l70L75l45K62l40K13k53
$$ y = [153, -228, -56, -200, -234, 50, 13, 122, -330, -30, 118, -93, -161, 73, -62, 279, -26, 4, 335, 211, -134, -38, -25, -87, 533, -181, -154, 40, -199, 116, -261, 183, 76, 145, -5, -109, 74, 219, -134, -65, -134, 277, 54, -351, 186, -191, -136, 170, -70, 150, 112, -175, 62, -48, 20, 150, -171, -254, -225, -28, 291, 55, 36, -190, 119, -19, -39, -183, 3, 8, -26, 91, -229, 158, -209, 166, 72, -124, -16, 20, -33, -77, -167, 279, -247, 93, 60, 49, -79, -227, -131, 51, 146, -45, -160, -172, 112, -42, -74, 32, 263, -387, -90, 159, 123, -54, -132, 18, 29, -124, 184, -200, -28, 119, 74, -92, -26, 163, 145, -45, -2, -32, 80, 103, 131, -100, -15, -35, 52, -330, -47, -84, 10, 56, 153, -34, -49, 266, -140, 85, -36, 7, 113, 136, 272, -40, -164, -5, 71, 202, 25, 200, 115, 67, -96, 174, -62, -101, -258, -329, 99, 76, 31, -136, -258, 167, 143, 332, -127, -54, -210, -72, -75, 119, 200, -170, 205, -140, 122, -218, -5, -258]
5865b58M26l07k7L29j30j44J39J52l50L91o7l5o3mj39J68j91K14k62j23J99J95
5887A13l8k18Q9P9q8j82J22K67l38L61l34M68m22P6k4J38P2j84p9o6O8p9r3M04
5911A12J10nk33K6M9J1J45q3l46K97l91L37Q1j4k1j96K76j84j39L60N8k61nMQ1
5936F9q5l0J22M3k81K81j73j02P7J94P3j13j68K59k60j01K34lq7Q2l1k2J5J85
5960A78n0j91Q5J85k01k42K98O4p1mj01J12p8R1k43O2O4mL7m6J4k98L91O3j66
5985e1j1L21n37K77J36m9n4N8q6M5l5R0k67L00L4K05n55J12R8j87L0j52J23J24
6009c1L50l47j40N35n70K43j15J51k28J10Qo9K3J63k22j26M10k52RK29k95J47
6031a7J27k57m0Q6J65j33Q9n5p5K30j5n7l22N11p1l32R2L2N4l5j65M14l85J31
$$ y = [-258, 168, -139, -166, 163, 33, -111, 28, 180, -170, 221, 154, 119, 56, 52, -87, 81, -110, 104, -158, -281, -82, 113, 75, -143, -54, 25, -63, -245, -123, 144, -194, 167, -167, 301, -121, -45, -69, 69, 141, -43, -122, -188, -120, -199, -292, 112, 222, 217, -16, 10, 59, 70, 215, 132, -214, 83, -308, 29, 110, 96, 75, -121, 155, -29, -168, 192, 250, -11, -16, -12, 69, -16, -46, 76, 119, -162, 119, -54, -156, -79, 115, 188, 75, -93, 166, -94, -195, 39, 36, -51, 31, 0, -22, -7, 178, 128, -63, 22, 207, 6, -236, 62, 126, 55, 51, -50, 62, -16, 75, -168, -106, -42, -46, -9, -55, -41, -339, 52, 115, -51, -62, 259, -278, -1, 135, 86, 32, 90, 4, 49, 14, 104, -163, 137, 171, 376, -179, -67, 31, -156, -126, -278, -155, -31, 319, -28, -168, 367, -203, 40, -75, 76, -152, -42, -34, -103, -80, 83, -139, -265, 145, -107, -98, 131, -164, -17, 110, -147, -187, -101, 64, -69, 20, -35, -110, 120, 105, 48, -274, 237, 166, -166, -74, -42, 12, -23, -188, 226, -159, -28]
6055b8Q8N5l57L06O9j91K19r1l96L54M4k75o1K61j2j30N4L16k81pk26K71M24l92
6079A4l39L45J87k29j61K66j02j63J32K87k70J83l37p4K66R8n13L87K58l01m9
6100a15j21L00n1MK19n58N14J05m35J44l6J26k74M5K83m6j94K66k44k49J96L3
6122h8J51k1k43L95j71M7q3J16l4J94k37o0J95l8J4k57j1K34L3j84J14J8M0m77
6146c53L83o2k3K00p0j29J27j71K17j7l22K47J1k28J55J91j25j60j00M08k24n6
6168a01j70M97l67L86l38J83j32J40j56m41K40J88J03k2J78l90K88L53n88J62
6188A3L5J16M5j77J71j37P1M9M5k00j25K67k16Rj5j5l5K22oP5j27K0q9J80j86
6213a0K0nj08l01N45j6j9q7j28J50K7J12l14L57n5j78j8J27k38L03p2j31r1qJ90
$$ y = [-28, 60, 115, -242, 64, 133, -58, 161, 70, -326, 28, 72, -203, -264, -3, -15, -145, -91, 225, -56, -63, -289, -18, 406, 14, -325, 20, 207, -22, -183, 83, -19, -182, -50, 237, -33, 150, -187, -261, 5, 103, -410, -23, 235, -66, -115, -236, 64, 13, 17, 236, -322, 192, 297, -138, 6, -30, 96, -178, -133, 150, 104, -90, 176, -68, -317, -121, -88, 63, 42, -201, 194, 23, 70, -13, 103, 69, 263, 26, -34, 161, 123, 137, -120, -131, 103, 136, -48, 66, 84, 124, -353, 30, -32, -55, 145, 75, -54, 73, -98, 119, 102, -220, 27, 38, -190, -35, 156, 31, -129, -229, 179, -45, -101, -271, 226, -141, 245, -93, 90, -42, 98, -58, -499, -259, -71, 32, 10, 188, -202, 86, 439, -149, 13, 48, 164, 209, 32, 203, 66, 137, 186, 231, 31, -94, 173, -43, -34, -49, -64, -99, 123, 117, 192, 65, 85, -4, 176, -10, 10, 5, -103, -404, 141, 125, 106, 19, -109, 41, 68, 180, -134, 223, 168, -10, -28, 99, -139, 164, 92, -39, -130, -138, 52]
6238E2n7j51J13k17J55J51K4J3q6j81K95k38r0L65n02L95k43K23J10j53q3O1p9
6261a23o2J34j66K46l70M17j9k39R4nJ45J28j48L1O2l00k9K20O3k30L01k23J78
6284A05j10j11L27j42j29J41n8j14J13k1J39j02k39K59j34J04m4o1J7L4k9J01
6306D6J36k41K16j56N0j12J38j73N6L38k99R8K94l72j44R2j13j18L80j17K65m64
6328b00K85j42K1rQ8n1j19MK19M5j86J90j60k87J83L39j80K5j77J34j06R5n1k18
6352b58L57l1k8NL2j37p4J09J98k52K59r6r1J91o5k93M88m73K47n5r5J34j38K00
6376A34j06N7o1J59l42J54n5j1Q4Q5j49N4J67r2j1k61J95O5j13N7Q1Q1J49m03
6400h2Q9J62K9j00J67j45J2q6J94k55J62j34l05L18k81M35m5k51J78k52L05J80
$$ y = [52, -5, -156, -43, -260, -105, 46, 70, 83, -3, -184, 111, -127, -217, 148, -354, 41, -202, 21, 131, -22, -105, -44, -123, -185, -51, -217, 29, -341, 76, 57, -182, -88, -93, 52, 180, 32, 63, 125, -175, -204, 16, 79, -151, 150, -73, 105, -5, -116, 211, 69, -60, 81, 23, -91, 22, 1, 140, 38, -201, 58, -76, 28, -16, -77, -60, -26, -55, 46, 182, -59, 157, 1, 51, -61, 77, -96, -40, 298, -1, 97, 391, 19, -125, -33, -146, -264, 116, -1, 264, -200, 85, -57, -36, -45, 43, -8, -127, -123, 96, 141, -45, 145, -15, -302, -119, 220, 40, 65, -112, 22, -84, 11, -40, -258, 99, 68, 40, 45, 77, -60, -134, -25, 173, -79, 180, 84, -7, 184, 119, -174, 314, -159, 88, 33, -62, 72, -66, 134, 28, 85, 24, 183, -159, -5, -60, -71, 13, 98, -51, 3, 170, 78, 67, -194, 1, 66, -47, 10, 91, 172, 321, -82, 7, 169, 198, 98, 265, 120, 132, 46, 240, -15, 147, 13, -292, 26, -255, 180, 135, -116, 62, -190, 115, 295]
6422B95j16k65pq1K85j37M7l18L11q0P0j72P9J39l1r0J03K0k73J95k02J38M3M
6446d3j00K11q1R5L3k4R1p8K92m82P0j08n8Q2P1J20m05L92j6J61k26qk29K06r
6471d3q2P9J33l56K43O9Q3j0M2L21l63k11K48q9k77K27K07k20l2J06k13r1K15
6494a4N0J62L4l70q8K62p9j35K13K61n83J81J31j32KJ53J89m38L72j2j38j15J23
6517B9j17K85j83n4K28p2j74j29L55J58l23J52m10P8j9J45n7j47J83J5j07K06
6539D2L0j40K81k71k57K03L20j43L1j31J8N2j73N1N8J2J8J11lj50P5k5N2j20k8
6564h7J91j24J01k90K62p3o7k3J39j1p3J73j46O7N9k67LJ35J10J36l24J92J60
6587B43k83J74m11K2K74J16l8J09l88J3L02j92K76l84O8j03K18j36Q6M1j53N0
$$ y = [295, 179, -86, -93, -174, 111, -26, 21, -297, 14, -66, 4, -168, -89, 50, 19, -71, 32, 52, -221, -26, -228, -90, -47, -43, -143, 68, -13, 82, 115, 91, 182, 104, 396, -86, -16, -124, -182, -100, -29, 91, -314, 78, 62, 223, -3, -11, -240, -34, -43, -125, -46, 87, -269, -26, 43, 126, 116, 158, 479, 116, -95, 153, 64, -213, 14, 221, 1, -31, 75, -138, -229, -14, 36, 198, 232, -138, -226, 36, -43, -178, 35, 296, -287, -106, 25, -107, -105, 48, 237, -201, 171, 159, 21, -94, 29, -88, 197, 14, -40, 188, 116, -58, -187, 168, 326, 3, 155, -255, -177, -196, -51, -108, -255, -72, -57, -164, 42, 72, -68, 213, -58, -315, -112, 208, 65, 96, -35, -17, 35, -138, -87, -29, -17, 1, 112, 109, -41, 34, 9, 61, -59, -87, 104, -20, 81, -209, 53, -20, -87, -110, 29, 18, -55, 118, -28, 39, 98, -169, -166, -31, 79, 215, -109, 83, 243, -40, 134, -277, -255, 19, 135, 97, 206, -182, -169, 133, -59, 217, -167, -99, -202, 16, -120, -34, 7, -146, -96]
6609i6J86j93m1J07j00K42pM3k69R8P0J07k82M1R0K07l26J61j95K5O0J85l07j62
6633c56L09J28j37k1J4M6j45J9J72j39N2Q1j89J14J40k12p6L75K00m23m2MP4J5
6657CK46n35M40j17j40RK52q1p4m9o6K06k26J57l83K94J9L9m7m8K78k22O3L1k0
6682B9Mj02n3J09M29l76j80LL12j69L1q8L27l15q6M74l57J82p9j58l1n5q5M60
6706B26o7j39j0Q8R8m36J99N9j78J30J50l13MK50j39J23J89j64j66j6k3J83K3
6729G1J29l18J80k44JM3j11K75J46j92k42Q8K42p7P7j01r4J67k52N65k93n7K09
6752B12J75n17M95n09L47l26N8K31j03p7N5P6k88Ll6j60N34L4l86J09K90k80J33
6775G0m0p3J36k33J22m4P0L9j0j80k8O7M4L85r3l54L34n07M26m9L2mj06mP4J79
$$ y = [-96, 90, -103, -144, -37, -137, 105, 98, 141, -128, -30, 40, 147, -135, -94, -4, 203, -123, 38, -157, -132, -72, 113, -194, -356, -47, 81, -56, -77, -63, -17, -162, -143, 29, -110, -58, 23, -166, -52, 88, -124, -200, 175, 375, -48, -90, -86, -12, 3, 249, -286, 154, 37, -103, -94, 158, 77, 3, -46, -112, 94, -132, 25, -358, -64, -45, -6, -53, -101, 177, -45, 18, 49, 29, 33, -69, -122, -13, 416, 40, -140, -137, 175, 6, 37, -51, 276, -39, -125, 349, -8, 174, 95, -63, -94, -149, -234, 226, 159, 20, 10, 98, 196, -240, -41, 18, -160, -30, 120, -193, -189, 61, -78, 45, 234, 70, -96, -112, -135, 48, 71, 200, -118, 62, -182, -181, -138, -249, 26, 172, -20, -262, -174, 68, -9, 68, -33, -127, 40, -212, 353, 60, 3, 212, 387, -130, 365, -144, 203, -123, -65, 166, 63, -14, 41, 117, -171, -168, -204, -364, 170, 204, -182, -73, 217, -63, 70, 30, -43, 93, -140, -18, -62, 8, 47, 37, -143, -171, -104, -60, 325, 232, -122, 212, -295, 131, 82, 114, 110, 4, 0, 74, 253]
6801B53l75N3K44k56O8p1q6K71j19q4J47k57R4K15j54J5L3n2P1j44M46k29j6j66
6825i9Q1Oj09L7Q7J06k3j93K16j20l1K6K02k35O0J90k69NJ49J07k99L18k45J25
6849I2n1k79J51j6Q8K9k2J74J31l77j3K98k05J38j27j37J25J76k73k11K66j70
6871b13L73k04j35J49K42j90j73J12O8J21J00l06J38N7k0k95K12N5j81j21K21
6892A0j47P2J05O2j71Mk66L74M7lK7l03O8J5L2O9R1P0j13k9L0J14P4k74P9j41
6918a04j76L66j77j55J99J17o3J13j0j00J01k74Q2K8j4Lj09N8Q3p1L1J53o5O0
6942G6k21L56J3m29LK15j6R5l5P2j26K0J28J33k65p8o4J93Q1k88J97j63j2J93
6966G8j42J00J70k70K04j43J63k73J42l00K43K9K11j66K3K01n07L16O8rN7l06
$$ y = [253, -122, -69, 175, -81, -13, -84, -170, 101, -18, -102, 45, -212, -118, 97, -57, -42, -9, -61, 10, -134, 312, 83, 67, -99, -18, -12, -121, -84, 3, 109, 86, -107, 109, -11, -42, -16, 186, -49, 11, 201, -68, -63, 86, 193, -106, 212, -33, 92, 41, -238, -87, -103, -15, 14, -8, 166, 297, -80, -93, 205, 0, 138, 11, -126, -1, 175, -98, -309, -43, -213, 160, -44, -179, -30, 212, 22, -151, -39, 29, 150, 250, -56, 82, 139, 119, -176, 36, 91, -90, -211, 10, -137, -65, 40, 102, -69, -65, -331, 43, 90, 87, 114, -189, -121, -106, -74, -5, 86, 156, 43, 14, 44, 158, 232, -42, 37, -104, -280, 86, -91, -246, -47, 70, 7, 120, 110, 10, 111, -163, -81, -53, -67, -64, -173, -115, -32, -103, -72, 81, 16, 76, -145, 211, 224, -205, -202, 13, -3, 92, 57, 129, 3, 23, 151, 284, 19, -59, -123, 70, 151, -137, 60, -103, -115, 78, -64, 36, 206, -64, 140, -3, 160, -113, 29, -271, -28, 1, 212, 46, 69, 270, -237, 79, 147, 138, 195, -111]
6988a11K39k11L55k73k29l8L31l2M3J35l71L92j51j95o1K20L3j82K44k43j07j98
7010d10K31K50K05l69m8J32k00M1J98j26J09r7J19q6N0O5J12j42m51M25N2L24
7032C84n00K12q5J78k61j75q3K60J42p8n1K52k29q2N5m8j36K77j66Q1K65k41J06
7055G7l41N22l81R3r6K81k05M5j53J05R4j53J53J39l62J84K19l26K91J4j78j7
7077El03R6J13j49J15j15K42j02j8R0l79L22j58K33P1l9j28K13j26q9K21Q1m50
7100b54K81o4r6P9po2K61ok13J38J78l59J15L18k32j15J97k66K36Pl62M34q6q6
7124C6R1q4n3O4R7k99k4K57j71K64k04J26j86L0J76m76L10p0J05J0K95m14K46
7147A26J31l78J59j57J0N4k2N3j20k2Q9J34j26PO6p7M13l63k17K64J1j24J13L8
$$ y = [-111, 128, -83, 272, -1, -230, -268, 63, 31, 74, 209, -162, 230, 79, -116, -177, 43, 76, -106, 138, -105, -212, -410, -179, 71, 276, -93, -141, -9, -209, -168, 30, -96, 13, -84, 35, -51, -1, 64, 176, 34, -417, 8, 60, 384, -116, 96, 11, 189, -72, -247, -330, -70, 72, -6, -57, 195, -34, -116, -61, -109, -245, 32, -134, -53, 212, -29, 77, -264, 258, -123, -30, -126, 155, -50, -5, -158, -53, 41, -112, 41, 180, -182, 2, 221, -105, 186, 200, 22, 5, -298, -202, -89, -238, -123, -238, 4, -98, -116, -26, -405, -83, -241, -8, 63, 24, -104, 109, -17, -106, 115, 196, -254, 27, -37, -133, -54, -61, -123, 138, 132, -81, 57, 235, -124, -9, 309, 77, -38, 159, -107, 129, 136, -226, 208, 122, 36, 127, 43, -10, 54, 151, -148, -172, 85, -86, 178, -26, 100, -86, -56, 120, -356, -46, -116, -11, -1, 294, -120, 126, 257, -121, 38, -119, -109, -55, -77, -24, -144, -166, -77, 57, -69, -62, 4, -73, 340, -23, -240, 24, 35, -89, 24, 62]
7171F2k1o0K36j33j23j31L90k34J35p4r0L30j19j46k46K89P8l25P3RL55m76L58
7194A37k46M3R4j01o1oK39p2K21k44m1J07j43nM0j91N07l94J77k35L9J99O4k89
7218a61L43j85j92L71k73M4J7O5M5r0k26J71K08k77P7l5J8qj0L8k17K11J96n4
7242G6J27oj43p3N7j25o7M26k95j24M2J22k33N23l84l1j3Q7J22j18K7Rj54j4N17
7267C55l92j3J53k35K10O5Kj26k1q9J44N8k43rR2K35j25k58J50Oj01K34J58l36
7291h6p2L42j13O5j68j16J44J57m49L30J1k00J0O3O3j33J12j7J78m7k78L92l55
7314a67K20j09J28m49K97P4r5L7J40k42J09o4K3J18J1m6j5N8R0j83OP8J33o8j37
7339e3mR9j25L09j59j51J59n0m8R8j34o8M39o43L41J7l1mq1m2k40P2L95j87K88
$$ y = [62, 41, -19, 217, 84, -39, -170, 220, -14, 121, 47, -43, 287, 168, 22, -224, 65, 143, -182, -109, -100, 255, -221, 137, -109, -66, 28, -73, -134, -140, 99, 27, 248, 4, -37, 70, -73, -78, -38, -229, 278, -116, 61, -174, -135, 64, 128, -161, 182, -3, -195, 176, -97, -53, -36, 29, 74, -16, -242, -71, 137, -140, -63, -98, -80, -88, -98, -60, -277, -66, 130, 76, 203, 197, 54, -19, 38, -87, -154, 272, -23, -147, -105, 17, -216, 307, -77, -108, -121, -34, 88, -30, -3, 6, -148, -162, 355, -37, -50, 103, -132, 78, 143, 145, 19, -2, -91, 53, 111, -132, -141, -49, 186, 61, -197, -47, -41, -142, 92, 250, -86, -158, 184, 71, 136, -32, -148, -4, 153, -296, 34, 45, -155, -145, -82, -19, -152, -40, -57, 121, 74, -204, 188, -167, 53, -56, 72, -377, -80, -6, -101, -64, 76, -166, -57, -121, -98, 20, 31, -15, -30, 28, 118, -65, -59, 19, 152, 84, -53, -57, 42, -83, 226, 67, -84, 75, 25, -23, 75, -59, -127, 312, -331, 10, 27, -4, -8, -89, -131, -371, -299, 96, -91, 197]
7364A97k11P2l84K73J48L7j85N5j76K48R1n66K74J61j25j75K46n3K06n00N98j61
7386G0J08p5O5j73M9J24k28J87k47J13L9K06m02m7K92O0l24J53J89k94J89J63
7408B17j87j42k1N6j07J88P9l18M18O2m55L54k56K65k09q9J21l1O6p5J53k53N
7431a59J74j03O4K19r3Kj29K30j67N6k2O5l22K45jK22k63k32K87n6j3J64l18k19
7455c69M55Oj59K41r2j03q0L09k93j55M58k42k15L78j3l51K97l0M5k18J87J82
7477B38k23k06qJ47J81m8Q8j75m1l4K26l10K13O5k97J84J19N2k08J28K21j80j76
7500d4J21k30j78J34L25j58J83j29j8Q1o1R4jk14J50o3J04l2N5j78J12Nl0o7k1
7525f0J64k22J03K82l24k40J79m1J35r8ml02M60q2m2K70J5l12K36J04k86K35j69
$$ y = [197, -14, 58, -326, -53, 95, 132, -53, 2, -174, 74, 165, -401, -127, 34, -91, -266, -20, -73, 133, -367, 231, 70, 178, 103, 168, -5, 44, 168, -60, 127, -120, -7, 32, 238, -164, -211, 81, 141, -183, -30, 159, -135, 54, 217, 30, -112, -133, -77, -184, 4, 83, -235, 183, 245, -210, 144, -112, 153, -56, -145, -24, -55, 11, -64, 89, -164, -159, 15, -88, -24, 195, 102, 104, -25, 205, 38, 94, 72, 137, -185, 60, 59, 281, 18, -214, 73, 17, 4, 168, -150, -369, 86, 92, -67, 174, 82, -21, -101, 208, -85, -240, 218, -24, -239, 139, 126, -225, 72, 42, 87, -131, 56, 238, 15, -191, -199, -52, 129, 81, 169, -6, -47, -81, 145, -165, 48, 113, -184, 0, 119, 171, -37, 91, 312, 132, -44, 77, -153, -331, -197, 128, -30, 153, 24, 6, 87, 26, 120, 119, -95, 55, -8, 96, 64, 119, -59, 53, 58, 28, -39, -60, 104, -118, -15, 267, -57, -297, -118, -159, -24, -122, -126, -428, 32, -50, -92, 178, 193, -119, 117, 221, -65, 170, 1]
7548AJ43k91K77k60J7L25k30k1j9k80L21L3J3k21K27j06J88j43j06K39k04N1K85
7571B39j3n19K92K47l58N5K03p2L30l91j19M0j23K63j75P1j10K00O9n2l31L01
7593D7O2k92L63r2q6J7K9N5k4J36k06nQ9N5Q6q5k38J61l60K18LJ96o0k83K33K5
7619D4j98M2P8Q5j70K0K54l97J95m3J55R5J02j8o3k67j75J65j14K02p0L44k84
7642a8j36L70Ml45q1L66l93J14j87J66K82j41M5j08J52J42l39L5l0lK52k81j94
7665c28L19l10M08J1q7J7J14j35L64o94L13J4k02K48%Jk5rM6R3k30o1K69p4k82
7690b20M7J21P1O3J89n60N19p8k28NmJ98j98K25j59M4N8k49O5o8J21j49K08j04
7714h3Nl0J88k5j42O1j31K0L79m82J35k0P4j79j39K43L79j92k81k1J96J59j09
$$ y = [1, 144, -147, 130, -130, -113, 212, -18, -39, -58, -338, -17, 16, 29, -192, 35, -71, 117, -26, -132, 107, -97, -46, 239, 226, -293, -1, 246, -112, -57, 146, 74, 404, 13, -106, -66, -189, 74, -101, -30, -140, 60, 129, 77, -254, 47, 109, -183, 180, 88, 2, 19, 48, 103, 79, 215, 9, 4, 93, 148, 234, 149, -89, 72, -288, -70, -67, 129, 69, -214, 19, 44, -154, -112, -34, 51, -119, -99, 155, -242, -47, -90, 65, 160, 262, 244, 181, -86, -261, -96, -210, -8, -78, 266, -18, -154, 216, 220, -125, -206, 160, -233, -119, -306, -140, 142, 1, 46, -62, 90, 232, -107, -72, -102, -105, 147, -134, -328, -9, -319, 89, 100, 13, 30, 144, 9, 373, -321, -8, 6, -196, 52, 52, 53, 28, 19, 65, 158, -72, -133, 136, 62, -220, -173, -52, 19, 82, 271, -289, 230, 152, -76, -71, -75, 123, -75, 150, -9, 35, 93, -156, -91, -159, -38, -187, 21, -83, -78, -108, 80, 55, -87, -26, -157, -137, 242, -240, -105, -125, -51, -230, -369, -126, 253, 61, -220, -241, -45, 114, 5]
7737ErK33j10m43N33Q0j91j63J97k86L48J3Lj12l7qJ30k37q6K53m5j29L5J77k48
7762i7K19p0j00o2K77Lm31M19k2J09m61J20K08l10K46k21K6J26J95l40Q8j52K36
7785FJ41ql79L54k74K31j49R8j33QJ28o8n1K96m21J86R3k96J44j36L34q6K25m03
7809a60K32k83K97P4j99J17p4k02qm8J10J64o7o8j09L37k17m9J53J32pl22kK21
7833B2J89j0J94k50p09M77m7M4K08j02j26K87j20J9j22k8j7J96j11K30l59J08
7855b7P3Q2n0j15k5R0k66m2K20K17k1k7qK16k24O0k24J55P0j86J07j43K73j80
7879B5j38Q0J18k42K40j4r6K64k11o8m6K86p1m4o7p0l3m7N7K01N5m44L01j89K77
7904A24j52N0jK57k62l9%L7J79l75P1K17k37Q8K0j84J36l6J48l5m6j38J29J8j03
$$ y = [5, -4, 229, 119, -324, 209, 289, 98, -65, 132, -154, 194, 207, 210, 98, 61, 53, 183, -54, -140, 113, 68, -61, -26, 151, -97, 122, 52, -48, -110, 167, 170, -261, 158, 136, 245, -216, -96, 112, -198, 48, -173, -147, -21, 174, -166, -78, -230, 6, 147, 139, -240, 114, -160, 71, -78, 20, -113, -105, 23, -45, -96, 200, -221, -35, 58, -238, -94, -230, 104, 18, 243, -160, 72, -211, 86, 160, -39, 78, 4, -198, -206, -254, -144, 20, -47, -115, -224, 113, -104, -153, 0, 132, 125, -197, -199, 22, 211, 201, 395, 145, -564, -87, -134, -90, 118, 16, -110, 177, 57, 76, -46, -74, -91, 105, -6, 224, -135, -27, 46, 128, 78, -37, -62, 28, -238, -280, -60, 157, 136, 109, 101, 317, 93, 153, -71, 84, 154, -32, 75, -68, 205, 25, -113, -33, 85, -157, 83, 69, -27, 237, 26, -42, -88, 198, 127, 83, 16, -54, -87, -134, -77, 124, 179, -265, 36, -153, 124, -28, 22, 21, 278, 16, -23, -23, 14, 193, -182, -111, 106, -131, -43, -23, -207, -71, -107, 41, 6, -40, -178, -49, -31, -134]
7929a34J91j09J27k32j0K55k06P2j23J53J47j52k84K39M9J66k5j82k0J41n8r2
7951h7m5J45k40J31J76P2Oq7K7J0l27K66J52Kr1R4j26Q6p4n4k24M3J79j84J00
7976e0k5J27M6j3l19K92K4k48L3P1m2j20L63q6KO5Qk49J05N3j55R9j05o8K29j24
8002h7K7Q1J02mn2J60j4j97j45N29l00k80J87R3j25O1m9J88j85j22J93L6j62j6
8026h1L6m3L21m29j2J47K43m71J98M2R7J04J28l61J88k10L57r7k8j8r7J78m43
8049b51J70J07J45k97L40j86oq2o8J57lP2k12M51n05J8J05j1j59L46J62j53N7
8072A97k38M1J21L6j10l7mq8L9o3O1P8j62r5K85k05m2K13O1J05l65N20j46k40
8096c8j30R5j64R5nK94k27K46j39R1o5J4j58l7K00r9K15j66m41K53K89k94K18
$$ y = [-134, 57, -52, 75, -157, -167, 88, -118, -46, -169, -16, 131, -21, -305, -66, -17, 149, 124, -58, -78, 63, 5, -87, -132, 13, -227, -96, 80, 152, 158, 71, 98, 108, -219, 47, 199, 201, 110, 204, 78, 164, 90, 36, -188, -145, 34, -150, -50, -75, 52, 98, 85, -234, 58, 82, -166, -133, -62, -104, -224, 139, 53, 55, 120, 128, -121, -16, 37, -118, -19, -124, -192, 37, -87, -60, 21, 123, 119, 67, 227, 213, 16, -129, 400, 100, -180, 7, 100, -25, 36, -13, 175, -10, -132, 61, 97, -65, -81, -45, -88, 233, -196, -208, -61, 182, -289, -91, -49, 48, 152, 280, -81, 107, -103, 254, 157, 129, 111, 14, 192, -251, -81, 26, 171, -126, 214, 28, 22, -60, -128, 29, 26, 98, -114, 337, -168, -150, -45, -56, -215, 131, 293, 140, 197, -41, 0, 121, 157, 47, 10, 6, -82, -43, -106, -45, 33, -129, -224, 61, -144, -186, 27, 88, 193, -172, 348, 202, -38, -168, -73, -237, -142, -147, 147, -80, 166, 27, 118, 53, 67, -91, -128, 72, -27, 188, 22, -419, -166, 123, -171, 47]
8119D7J28k06j55L4J71J23l19J08J44M9l58L11n0n9j27J03j78L36r0p2K92q7k
8142A43N3k13l02J52K01j31J69M4j53J4j55K15Q6j16J4L5k32q2J54K91j13k7p
8165D0k09K00q3J97N8k46j8K18o6j37p6K46k82J19o4NJ43J33k04K40k2J07l18
8188a9o0K73j20
$$ y = [47, 175, -31, -186, -152, 19, 142, -177, -69, 75, 124, -234, 77, 27, -32, -159, -56, -234, 102, 12, -60, 232, 145, 143, 196, -17, -319, -167, 34, -97, 72, 116, -37, -23, -178, 37, 123, 7, 21, 56, -176, -258, -104, 187, 74, 47, 40, -169, 31, -52, 145, 203, -43, -61, 157, 91, -46, -122, 124, -158, -39, -103, -98, 45, 178, -26, 214, 192, 299, -19, -79, 194, 74]
8191G4
$$ Imaginary data points
##PAGE= N=2
##DATA TABLE= (X++(I..I)), XYDATA
0@%%%%%%%%%%%%Qj6J6j6J6k4L2l2M0m8N6o5P3q8J04j20J36j55J79k05K33k63K96
35A57l31L71m18M66n17N75o39P10p88Q69r58J057j166J282j412J557j714J891
53I92k087K306k556K842l170L554m010M558n235O099p238Q807j1118J4849k1805
68a3212L8826j49889j64625M76264l0919l08370J24629O4063j39627K11093K0875
79A29108l74278J38090L98865k80204k68503K98832P2060j87710J08756k6081
89H935j83294K48282J48418l93527k6755L98598r9004k68527J60157N3717j10201
100f3201J53387k7098k70444J95295K65290l05653j58731L08079J1570j88621
110h0127J00605r611j24502K10261N4827l28835O5464L27090j64496k14016J87190
$$ y = [0, 0, 0, 0, 0, 0, 0, 0, 0, 0, 0, 0, 0, 8, -8, 8, -8, 8, -16, 16, -16, 24, -24, 32, -33, 40, -48, 56, -64, 72, -83, 96, -109, 124, -139, 157, -174, 197, -221, 245, -272, 303, -336, 374, -414, 455, -503, 554, -612, 670, -742, 815, -899, 992, -1095, 1211, -1345, 1497, -1673, 1881, -2129, 2429, -2806, 3293, -3945, 4862, -6256, 8593, -13212, 25614, -124275, -288900, 187364, 156445, -151925, -27296, 36767, -102860, 108233, 129108, -245170, -107080, 291785, 11581, -256922, 41910, 113970, -73740, 35016, 8935, -174359, 73923, 222341, -171186, -197941, 200657, 101653, -166874, -6717, 47000, -63201, 90186, 63088, -207356, -12061, 253229, -52424, -211155, 96924, 108494, -80127, 20478, 10867, -113635, 96626, 151453, -177382, -111918, 215172, 50676, -163340, 23850]
121B3850M3240j13583J10399l4624j87652J94651J65843k94479p0185K89205l7921
132H8744j80322R9482J1668q5203J48043j143k39723J13950K32169j94119j39382
143a45836J95166J4197j09913Q2120k8493j14368J63392P3500k41852J0191K32107
154A30211q8057j40370J14469Q744p1297J04971k2857j60511J23626J41853j87112
165d6330o9227J81484j8618j03588P5455j3966p5051J22569K1852j80858N1888
176e4390J68319j07746r7840J15181L333o5233P4097k2603j01153J09321P3835
187I5121j55844j4683J42907m2301p7782O8819j0754m9265Q9643o970j23233P0516
199a3826J05027j08231m9598J02165j2995n2834N4798j7120n9157Q2492K8972
$$ y = [23850, 67090, -46493, 63906, 29282, -158370, 36281, 202124, -92355, -162540, 126665, 88744, -91578, 7904, 19572, -65631, 82412, 81269, -158454, -44504, 187665, -6454, -145836, 49330, 63527, -46386, 35734, 7241, -107127, 56265, 129765, -112087, -101896, 130211, 42154, -98216, 16253, 24997, -46300, 58671, 35814, -124697, -1071, 140782, -46330, -115557, 65927, 47309, -56279, 19176, 5210, -69841, 52728, 74580, -106278, -54390, 113929, 6183, -91657, 23524, 26857, -38376, 35721, 13118, -88035, 21286, 95121, -60723, -75406, 67501, 25200, -52582, 16237, 5483, -43782, 45861, 38891, -84342, -13826, 91201, -17030, -66628, 35537, 22542, -30292, 24506, 7386, -51771, 30721, 59693]
210E9693j14029J9473R9676n6227n0229O2675j0408l5536N7640j2138p3395N9287
222F482N6779q5247j7959P6812k1049l9193L9728j1234l2209N2053M917o9500
234c9620K8192N8090n0642k5908M9531j2816k6018L7504j0677m0861M2318K3855
246C2948n6123J320M7933k3351k3576L1616j0253k0808L4674l347m0667K5894
258c740K9567l8096q167L4343j2298j8264K4481n132k3283K4953R402l1581P540
271a0275K4980j7762r636J9167o017j1617J7526k248j9121J4792J2710k1091k66
284h858J8390r116q209J2709k151r922J0845K876j3589N873R876j0816j506J0298
298F700n365m433Q795k064p669O962M260r332O22Q376n603k976O427j524l776
$$ y = [59693, -54336, -34863, 64813, 8586, -41643, 21032, 10624, -24912, 32728, 20590, -52805, 6482, 63261, -21986, -39945, 36867, 15818, -23375, 16353, 5119, -27090, 24963, 29880, -39620, -11428, 46662, -3980, -29888, 19643, 6827, -19191, 18313, 7636, -33225, 9093, 32948, -23175, -21855, 26078, 2727, -20849, 10767, 514, -20294, 14380, 11033, -29634, -3740, 25827, -12269, -20436, 13907, 1609, -16655, 7826, 2694, -20589, 4364, 13766, -17815, -10275, 14705, -3057, -12693, 6474, 457, -11160, 6366, 4118, -15003, -211, 12499, -8592, -8858, 9532, 416, -7793, 4916, 2765, -7157, 3688, 6564, -7025, -1152, 8724, -2092, -3598, 6700, 1335, -3098, 5697, 3633, -4036, 2926, 7186, -2146, -1524, 6852, 1249, -1727, 4700, 3176, -600]
313f00L801Q27m080J705K366l031q54L145j868j729L484j150k653K184J003k229
329C21L7J069m76j465R39J28j167M25l70K7Q63j780r2J424q75j350N76R59n11
348a318j557J719N11j937P59M95r58N43Qo77M55L20n63m97J393o0k195K748J011
367B00l618J022L462k434k078L457K11l123K512J607l779K039L761n082j52N898
383C903l703k947O078j174n723O404L430r997K320J0145p919n516J0587j578p703
398c393P748L54r182P649O823j4312k39J5963q274j0287J3941j426j1777J2168
412E756K211j7530Q543J6209j8175p606K0673m807j4332J4073q60j5480J6472
425E147P178k7039O506K6133j8703j5779K3918k055j8103J9081O08k6518J9599
$$ y = [-600, 3201, 4028, -52, 1653, 4019, 988, 134, 3279, 1411, -318, 3166, 2016, -637, 1547, 2550, 321, 358, 1427, 951, -514, 425, 553, -614, -189, -559, -532, 331, -1449, -1541, -117, -992, -2342, -1766, -807, -1318, -2875, -1156, -645, -2582, -1823, -1328, -2286, -1743, -1735, -2412, -1957, -1637, -2200, -2697, -1304, -1364, -3559, -811, 200, -3418, -2396, 1066, -1368, -3446, 11, 222, -2901, -389, 1218, -2561, -522, 3239, -1843, -1995, 3903, 200, -2747, 3331, 2157, -3566, 2838, 6268, -3729, -1409, 8736, 817, -4699, 5888, 4310, -3393, 4355, 4709, -4473, 3176, 9999, -4313, -4552, 11411, 3137, -7150, 6791, 5365, -6412, 5756, 7967, -9563, -1020, 15189, -2986, -10592, 10081, 5274, -9058, 5015, 4155, -11325, 5147, 12325, -14714, -8208, 17925, -778, -16557, 7361, 5306, -12797, 6284, 6892, -19626, -27]
438b7K0757l4810m741L5471j2537k1387K2151j734j9516K5521L540l9637J8928
451h021L7114l6453j8832L9278n148k3731K3272l136k8384L3147J7333n1618M313
464b0866N1018k5152k9653L2650j680k1033L0628m794m4710L5441L8917n5947
476a5181j6367N5888j0593l2798K8829n469k6877M3096O981o3874K1542O0612
488D5789m4437l4193M7910l291k6919L4930j2465m5881N3167L3168p7768m098
500c4088P3288k4083m2095L7287n604k6354M9709o433p2166M5289O3333o9662
512a1579l1981O6126p113l3518L4886j7688l8963O6819J7060r3321J7114Q5445
524E3287m4587m7597M7952m028k3622M7330k0893o5819O6588N3266r2375j8885
$$ y = [-27, 20730, -14080, -18821, 16650, 4113, -17274, 4877, 3143, -16373, 9148, 12688, -26949, -8021, 29093, -7360, -26192, 13086, 7938, -15793, 7479, 4343, -24041, 9106, 26439, -25179, -20866, 30152, 5000, -24653, 7997, 6317, -14716, 15912, 11118, -33592, 1849, 40766, -15181, -31548, 24340, 13747, -19051, 9778, 4309, -22568, 20528, 27509, -36365, -14823, 45789, 1352, -32841, 15069, 11778, -15141, 19789, 7324, -38557, 14610, 47778, -29990, -34088, 39200, 15117, -26978, 10309, 4705, -21649, 28060, 21627, -50539, -5250, 58083, -11579, -43560, 22566, 15453, -18065, 16821, -867, -39830, 26989, 44049, -49272, -32158, 53287, 8700, -38897, 9055, 5027, -18595, 28735, 7842, -57977, 8611, 61877, -30498, -49383]
536d9383Q3759j8015m1876L7127j6808k8780O9510l112r5344M2244Q5502o8560
548c736m4602O4500o091k6767M3899k9673n3148Q2380L2933j08099M415R5770
560E1781l6541m8002M4643j4166k1784O6980k3037q8224O9022P3280r2023l2662
572e0733P9599j2336l2053L9864l2717l6856Q8746O633j12740L2124R6688n7147
584I072m9029N2946r421j8055N4674l6160o9174Q5720M9479j06910j1819Q8865
596D0188k3387l7698L6510k7101k0984Q0341j7382j01452N7237Q4355p8219l9714
608d7306O4661j0468j9815M3387l9996m6851R0639K2558j11223J4434R1633m1987
620I666l9725M1887k1700j2466O8588l5077q2448P7589O3020r4484k2406P4883
$$ y = [-49383, 34376, 16361, -25515, 11612, -5196, -33976, 35534, 32422, -62922, -20678, 64824, -3736, -48338, 16162, 10071, -16696, 27203, -2470, -55618, 26762, 59695, -48404, -43989, 51781, 15240, -32762, 11881, -2285, -24069, 42911, 19874, -68350, 672, 73952, -18071, -50733, 28866, 16530, -15523, 24341, -8376, -45232, 43514, 50147, -62593, -30469, 66219, 9072, -39957, 12989, 3568, -14487, 40187, 4027, -65147, 20573, 70052, -36858, -48677, 40188, 16801, -20897, 15613, -11488, -32472, 47869, 30487, -70965, -13728, 70627, -7592, -47306, 17355, 6887, -12928, 30459, -9537, -56388, 34251, 56809, -54414, -39980, 51653, 9666, -30059, 11828, -9872, -22338, 46250, 11173, -71275, 6314, 69334, -25150, -47556, 27327]
632B7327j7603k4350L6857l7548k7158Q6451m705j02276L9740Q1841n8269l4673
644c4366M7307j6528r238N2159m2246n6941Q3478L4943r5969k39P3915k7216k5492
657a6433L2564l0046j2046P0508k3407q1721N6997O1268o8773k2198N1592j6038
669B267j0144L7385l9726l3242P7594Q776q7516K0733O6083l7952k3320L2449
681A3387k2495m706N2691l2622n8210O3486L8571p2274o392N2247k0666j1847
693h830K9008l2934j6424O3666r633o9832L4171N0932m4917j6144L3307j8680
705f310l464L7786l2484l6031N8634J6564o3557P340M5820k4552j1768K4183k3761
718a1600p050M6490j8305m8741L8976L2113m3900o728L1205j6190l727K6098k6759
$$ y = [27327, 9724, -14626, 22231, -15317, -42475, 43976, 39271, -63005, -23265, 58576, 307, -34366, 12941, -3587, -12825, 39334, -2912, -59853, 23625, 58568, -37401, -37640, 36275, 9059, -16433, 16131, -13915, -25961, 44547, 21140, -60581, -3584, 57684, -11089, -33287, 18305, 2267, -7877, 29508, -10218, -43460, 34134, 42910, -44606, -23873, 42210, 4258, -19062, 13387, -9108, -13814, 38877, 6255, -51955, 11531, 50102, -22172, -28564, 23683, 3017, -8830, 20178, -12756, -29180, 34486, 24853, -44979, -10808, 40124, -4793, -20937, 12370, -6310, -9774, 28012, -4472, -40503, 18131, 34695, -28862, -21522, 24298, -254, -12022, 12161, -11600, -18650, 27840, 9535, -39206, -230, 31883, -12017, -18745, 12460, -3730, -7457, 18641, -8118]
731h118j9092M7886P57n0179J7691L5126k6517q847K1145j6547k667L1202j9927
744A913l0157L7420J5735l9683L193K6742j6474l360J8665k0081q824L4420p297
757A2212l4710K1734K1730k6013k786J8084j3366j151J9634j6660j5923K8684
769A1469M422k9840Q330J9574j6225k373J3534j3264l656K1231q750j9955J8180
782B677J0641k0051Q38J3374j0000j130J2219j1966p293J9082j757j8541R564
795b343J1350j2972q35R801q689j706J2538p298j0310J3256L651j3559L540Q375
809D799p686m24P332o754l087J1104l231j0007P792N544r539J150O197n113p76
824b699O389l954m531P484N44p546L732L730m665M25L981l977p57N110k053m022
$$ y = [-8118, -27210, 20676, 21433, -28746, -11055, 24071, -2446, -11293, 9852, -6695, -9362, 21840, 1913, -28244, 9176, 24911, -14772, -11579, 15163, -1311, -4671, 13994, -6087, -14911, 19509, 12212, -22498, -764, 20966, -5047, -7833, 10251, -3115, -4266, 15368, -1292, -17215, 11469, 15891, -13949, -5619, 13955, -2270, -4643, 8891, -4373, -8029, 13202, 4452, -15503, 2677, 13318, -6733, -5895, 7479, -2521, -3651, 8568, -3398, -10691, 8391, 6634, -11907, -2343, 9007, -3965, -4800, 5001, -3688, -5394, 7144, -154, -10464, 2792, 6443, -7116, -3576, 4799, -2887, -3311, 4021, -2733, -5820, 5284, 2053, -7954, -162, 5382, -4157, -3007, 3190, -1923, -2699, 3690, -264, -4795, 2689, 3233, -4313, -581, 3149, -1516, -1091, 2890, -1087, -1844, 3266, 1213, -2809]
840b809M255J897m873J048L194k504n34K837k023j292L066k55k822J952J153k210
856H0N4K418k103r40K459r73j407J655N31j804J43J163j079m18J103k30q59Q07
874F00l48j017J070k93o78L23P43j049l68J318o08q32P42J78r48N59J27m08K73
893f16J34m95k2J68p4m56J105j45j460J229O88j670M29J313o65o13Q35J43q91
912a063J071P2j441J209R70j810M61J691j554m01K135q88j745K079J219l230Q37
929c88L008k761n32K705j504j272L043j176k770L232J747m669Q70L798l337r84
945i90M251k596k755N501k72o218L066M403n273q14M722l290j463N544l165n491
961d840P846J340q729K292O933n697k142O102m360l146Q959k300r585P858N784
$$ y = [-2809, 1446, 3343, -1530, -482, 2712, 208, -326, 2511, 488, -804, 2262, 2007, -815, 1137, 2290, 80, 134, 2552, 449, -491, 1968, 995, -412, 1243, 1774, -30, 113, 1276, 197, -221, 882, 652, -207, 600, 252, -765, 305, 12, -666, -343, 400, -649, -1017, 301, -307, -1139, -397, -219, -1167, -608, -481, -889, -616, -482, -977, -999, -831, -905, -1361, -256, -401, -1861, -632, 56, -1614, -1185, 128, -537, -1150, -315, -172, -1063, 8, 80, -1361, -152, 818, -992, -531, 1160, -394, -795, 1340, 452, -1293, 786, 2005, -1225, -388, 2620, -141, -673, 2032, 528, -744, 2299, 1123, -1647, 1585, 3332, -1337, -467, 3331, -6, -990, 3261, 665, -2090, 3411, 3139, -3079, -13, 4390, -883, -1697, 3025, -265, -1728, 3816, 651, -4840, 3006, 4346, -4383, -2091, 4842, -855, -2997, 3105, -1255, -4401, 4558, 2258, -7327, 531, 6315]
976F315r944m51P836n312j910Q113o167o242J2691K09j4223O155J0434j0518k064
991e078Q850o440k313J1872o620j1562J4202O466j7326K646J2093q526k007R764
1005F021r667m655J7733l937j8865J2627J2918j6257j916J2475q470j343J3174
1018I838j1592j0992K1314L293k3428O728J6459j2698k834J1092j1533j653K0404
1031A4398j0811k0587K0808J2680k3468o51J6334r586j354J3203j6241p738K8067
1044A5054m080k8692J4508J9003j8633l010J2720j2323R97K0910j8225j9025L0277
1057I481Q058l1585N065K0126j3479q88J2235j8389k610L1296j2916l1347K4927
1070b6J9390k7121j952J6957j3170L104J8289k3424j3275L6967J48l6902J2768
$$ y = [6315, -3629, -4080, 3756, -1556, -3466, 4647, -1520, -7762, 4929, 5138, -9085, -2930, 7504, -3014, -5078, 3772, -2668, -4981, 6891, 271, -11291, 2911, 9377, -7949, -5303, 6790, -1736, -3743, 6021, -3646, -8301, 9432, 5495, -13370, -743, 12175, -4082, -5998, 6477, -1993, -3336, 9838, -1754, -12746, 8568, 11861, -11567, -4839, 11620, -1078, -3912, 7180, -4353, -6006, 14398, 3587, -17000, 3808, 16488, -6980, -7631, 8703, -883, -2237, 10966, -5275, -13013, 15054, 10974, -17718, -3210, 15793, -2840, -5850, 6870, -5453, -4456, 16454, -1771, -20796, 9481, 17539, -14046, -8981, 11145, -2334, -3222, 9013, -9376, -11986, 19310, 6394, -24953, -26, 19364, -7757, -9709, 7248, -5922, -2818, 15471, -7953, -21228, 15739, 15887, -21015, -8247]
1083h247K3731j8103k199J2160j8289L735K9152k1771k7818L4443J5290l4236
1095a2152J279K0585j3378K902J4687k5742n300L9558r833l8102K1768K4097k4120
1108c751k602J3193j6145P145K5089k8960k0139M1784O369l9874Q556K3133j5955
1121b157J583J1944k5046K943L7877k1386l4945L3149J9611l1965O39J5400j4701
1134g054Q501J8338l2034r805M4718n215m1894J7973K4053k0514L35J0312k1506
1147a3792R069L0671k9140k5869L9880J1196l6255M808J8091j4387P443J2042
1159A3757l0126J78M1425j5894l7319K6443K0851k5438P55J0607j7286J1620K2393
1172B1966l2472j5086M2481J093l7689J1838J9435j5805N056Q563k5607P247L5115
$$ y = [-8247, 15484, -2619, -4818, 7342, -10947, -7212, 21940, 169, -27649, 6794, 22084, -12152, -10873, 9712, -3666, -764, 13923, -11819, -17119, 22439, 12606, -25496, -3728, 20369, -3751, -6353, 6840, -9305, -2160, 22929, -6031, -26170, 15614, 21983, -17891, -9335, 13798, -2157, -574, 11370, -13676, -10733, 27144, 5758, -29187, 3962, 23573, -8392, -7753, 7647, -7054, 1447, 19785, -12249, -22054, 22664, 17449, -24445, -6472, 17581, -2933, -2598, 7714, -13792, -4723, 25948, -3192, -29061, 10819, 22015, -14240, -9432, 8659, -5728, 1715, 13757, -16369, -16191, 25234, 9340, -27979, -1536, 19315, -6123, -5368, 5239, -12047, -427, 21966, -10506, -25592, 16889, 17982, -19707, -7869, 11566, -4239, 817, 9380, -16227, -8980, 26135]
1185B6135k4873k9198L3950J3453k8897L166J2419j4365J1391J4482l1236m288
1197a7861L9973r679l4451J9341J7387j8540L713P021k0099J1298K5332k7879
1209d444j8681L5615M813k9686P462J3065j2885Q487Q425k6185L644L2940j6567
1222F003k7553K3883J2662k0920M048P222j5190J1493J6049k6868q392L2643l302
1235A1778k6802J1858J1716j3159O546N088k0459Q616K4150k0526j8025K5324
1247F105N874k0709N814P184j1952R968R269k3149j00K7182j0004k1024J5548
1260FQ100j3102N410L816j4718R304J5796k0086r186K3574m08j8189P864O593
1274D774r654O871N282j6808L815J9381j2381j3796J5881M123j2545N265L193
$$ y = [26135, 1262, -27936, 6014, 19467, -9430, -6264, 6155, -8210, 3181, 17663, -13573, -17861, 22112, 12433, -22018, -2677, 14710, -3830, -117, 6904, -13195, -1897, 23435, -4444, -23125, 12490, 17303, -12383, -4921, 8144, -4741, 3746, 12171, -14014, -10370, 22570, 6003, -21550, 2333, 14995, -5925, -1877, 5345, -9845, 1648, 17697, -9171, -17563, 15080, 11778, -15024, -3166, 8550, -4609, 1937, 7025, -13434, -4818, 19332, -1194, -19219, 6105, 11979, -8730, -2916, 4268, -7684, 2284, 11553, -11596, -11696, 15486, 5482, -15542, 6, 8106, -4996, 414, 4230, -10488, -1184, 14612, -5474, -14660, 8914, 8506, -9683, -1819, 4774, -4880, 1991, 7273, -9535, -5720, 13661, 1280, -12516, 3365, 7488, -5057, 208, 3401]
1287C401r753P692Q996j6140l004J8679m355j3952R027M721q862N948K656j2035
1301f981N582J2168j1910p736J3846J197j1174N777K596p527O270M408j1777P06
1315d555J3125o268r175Q521K371p292M259J739p595M989O732r734k927J0671
1329D861k167p426N089J904n379L735K615p593J920P807o212m486P036L64n178
1344c110K783J384m417L550K884o168k65O527k761m588M565Q10l470K129J458
1359A311m052J788L947m368j417M531n29l576K778M24k729K255J507l633P51L334
1375B322k009k226L012J98k392J496J022k224J316J301k321l19K617r27j598J572
1391H40K02j146O58R24j976N69J591j401p33J443J30j423Q80K50j085N35M91o88
$$ y = [3401, -6352, 1340, 10336, -5804, -8808, 9871, 5516, -8436, 591, 5312, -3550, 2398, 5054, -6981, -1399, 10769, -1141, -8877, 4969, 6166, -5008, 769, 3365, -4162, 2108, 6516, -5261, -4555, 8570, 2302, -6873, 1648, 4019, -3273, 986, 2725, -4870, 119, 6851, -2883, -5810, 4861, 2694, -4732, 357, 2261, -3118, 617, 3232, -4361, -2441, 5366, -846, -5332, 1704, 2068, -3110, -327, 1057, -3360, 190, 3074, -3094, -3359, 3168, 407, -4181, 384, 1194, -2276, -147, 1311, -2741, -953, 2994, -1374, -2791, 1740, 1211, -2365, 413, 837, -1892, 363, 1870, -1763, -1012, 2322, 313, -1913, 1099, 1297, -1095, 401, 1423, -801, 515, 1816, -505, -824, 1793, 866, -732, 840, 1042, -104, 554, 1478, -498, 71, 1662, 261, -472, 971, 1101, -322, 558, 808, -277, 258, 749, 61]
1409F1k93J017p20o45O43M31r16M81N07j233M03Q72j010j58L60O5m51K79K46n34
1429e95K4L64n87R0J044q64l20N85p1q07P30L52p45M3J035o83l41O88l87l33R18
1450A40m35n92Q61n1p46N24P10p08k10J087k45q34Q39K52j129N22P84n30j72Q66
1470I33j169L29J088m74j077J153L26j497R84P14j458J24J723j590p56K360l88
1487A325k329J525Q22j917Q72J024k557Q76K566k393j698L348K10l236J652J041
1503A131k392R96K197l512j91M233j983l607L787R06l759J963J396l654J774L614
1519B899m598j728O007j198m471K936J244l352K451J829n114J075N921m534l785
1534d418N660O64m940K773J600m154L117L675p040r06Q446k946o240N302K007
$$ y = [61, -232, 785, 65, -580, 63, 494, -422, 59, 566, -667, -264, 608, -402, -560, -200, -135, -586, -307, -61, -595, -571, -207, -794, -704, 340, -524, -844, -259, -330, -1137, -407, -55, -800, -757, 278, -405, -746, -58, -445, -778, 140, -295, -887, -26, -77, -823, -299, 411, -297, -507, 580, 335, -499, 340, 592, -537, -15, 769, 239, 67, 933, -236, 93, 1181, 707, -370, 783, 1109, -388, 596, 1310, -148, -24, 1699, 109, -647, 1713, 1325, -1004, 521, 1343, -574, 298, 1322, -1235, -359, 2207, -186, -1884, 1464, 1674, -1562, 90, 1131, -1261, -265, 1932, -1580, -1771, 2462, 479, -3128, 659, 1565, -2194, -231, 1165, -2489, -715, 2899, -1699, -3427, 2580, 1382, -3089, -153, 1091, -2261, 190, 2019, -3095, -2020, 3901, -633, -4418, 1242, 1906, -3034, -261, 1339, -2815, 302, 3977, -3063, -3969, 4477, 1531, -4709, 593, 2600]
1549B600n091L143J462o147L451O661p444m291R587n22p261M353J940n473M814
1564A782K709r285J796J0654o236p294Q201J736o705L807J197o776N652O270j1301
1579c793k309J2807l069r096O007K267n559N059J719j0822M794J1677j0709p530
1593h557J2141J067q388M029J314o628P491M360j3919Q72J5224o739j0613R031
1607F85K581o544N481j74j0127Q393R853j4650n064J5984j775j0651O038J409
1621A439o487Q903J638j5631N902J5609j1302j0715J3415K103q687N667o97q987
1635g830J1063O565j7759q47J8477n150j2404Q459K427o524P990n55j4439R986
1649e41J3911j6065q326J6798L94j0785N955j15p439J1755L294j9086M084J9270
$$ y = [2600, -2491, 652, 2114, -4033, -582, 6079, -1365, -5656, 3931, 3409, -3852, 501, 2441, -3032, 1782, 4491, -4794, -2998, 7656, 1420, -5874, 2327, 4063, -2642, 1165, 2362, -4414, 1238, 7508, -3793, -6102, 6705, 3636, -5460, 547, 2814, -2745, 2314, 4033, -6789, -1995, 9682, -1027, -8557, 3584, 4651, -3737, 292, 1606, -5022, 2469, 6829, -7090, -6218, 9006, 2267, -8346, 685, 3266, -3278, 2203, 2029, -8098, 295, 10148, -4502, -9566, 6418, 4643, -6008, 30, 1439, -5048, 3855, 5493, -10138, -4236, 11373, 71, -10644, 2771, 4874, -3813, 1854, 1157, -7830, 3233, 9798, -7961, -8808, 9669, 4519, -7885, 574, 3001, -3523, 4467, 3912, -10527, -541, 13370, -2695, -11021, 5777, 6171, -4614, 1341, 1226, -6213, 5542, 8836, -10250, -6166, 13104]
1663A3104j0403j2490J1916J986o845P140k248j2229J2716J0388j9561m185J9542
1676H831l369j1996P640l53n626J1351o12j7917R301J6921j5095j0092J4696P88
1690D468p852O479k932r091J4093N282k0528J205J9686p397j2126R425Q63n582
1704d007R518l279j4422J2483J2988j8131o475J6981j201r488O725k330o362J3507
1718F507R00j9090O220J8098j1978j0213J1646N80n561P522m342j0538J4229P563
1732A1543j8881j530J7756n016r281O886j520m171J0962k483j5682J0293J4013
1745A2889j4645p145J3261j349n905O722m523o476J3288L069j8406L505J5793
1758A0078q106q316Q464j056l612Q492m467j1191J1806Q661j5648k511J3220l176
$$ y = [13104, 2701, -9789, 2127, 4113, -2732, 4408, 2160, -10069, 2647, 13035, -6526, -10711, 8831, 5462, -6534, 1106, 753, -4873, 6478, 5866, -12051, -2750, 14171, -924, -11016, 3680, 4468, -3384, 3095, 163, -8928, 5165, 10447, -10081, -8876, 10810, 3413, -8713, 712, 1575, -4007, 5511, 2232, -12190, 293, 13281, -4850, -11325, 5656, 4455, -5033, 1692, -638, -7000, 6507, 7407, -11683, -5463, 12635, 657, -9556, 2090, 2670, -2891, 4631, 289, -10249, 3980, 11543, -7338, -8868, 8888, 3872, -5409, 1477, -43, -4214, 6748, 4265, -11417, -1124, 12889, -1756, -8901, 4360, 3011, -2894, 3828, -695, -7171, 6117, 9186, -9220, -5715, 10078, 1972, -6344, 2120, 1064, -2548, 5944, 1477, -9714, 2092, 10753, -4895, -7406, 5814, 2638]
1772B638o197N969l083m657J1178q94j4439O429J2303r753o271Q936r39l723O385
1787C882m099p720J1248M633j4473P89J2069m976n614N830k127k987Q250k161
1801B544j0844P971Q298j0627l270R172k571l328N196l740m294R514P37j1187
1815f429L540R492o809m084O095j534k239O087l382o697P685M699j0041j53P951
1830D181l149l253M149k483k541P122j127q018M467O690o686k516N629j954k142
1845a631M611k979l651O221J487p469J246N990l535k170L580j790j676M661j886
1860A009n252M815L501n924n98M560j865j680K952j900k326M894n00m950K281
1875i83L469l342j504L303j247r67L170j938k838L536J515m277M71L446k225j080
$$ y = [2638, -3559, 2410, -673, -5330, 5848, 4954, -9485, -3056, 9247, -506, -6777, 2159, 1220, -2503, 3882, -217, -7937, 3311, 7944, -6529, -5740, 6329, 1353, -4261, 1569, -558, -3545, 4705, 2544, -8300, -329, 7969, -2658, -5928, 3244, 673, -2655, 2541, -1199, -5493, 4021, 4758, -6429, -2889, 6603, -206, -4290, 1805, 271, -1968, 4119, 737, -5960, 1725, 6424, -3617, -3770, 4181, 1032, -2221, 1928, -555, -3096, 4026, 2899, -5119, -652, 6038, -648, -3164, 2465, 511, -1631, 2980, 1, -3650, 2571, 4058, -3411, -2165, 3825, 290, -1880, 1700, -90, -1766, 2895, 1009, -4243, 572, 4073, -1851, -2449, 2111, 246, -1434, 1518, -382, -2708, 2186, 1686, -3264, -983, 2486, -856, -2360, 943, -304, -1271, 1899, -39, -2877, 659, 2174, -2103, -1632, 1814, -411, -1491]
1891a491K059j073j011K577m67l274K242K199k901j07K133j000q29K176j332j446
1907a545K397O47k838P68K065j866k53J130n28n46J601m64j575J318J113j936
1923e12j03J516p21q43J706r21o56J474q6j255K59J532j431k57J262r02n06J210
1941G66m14j056J033M20j309N01P87n78k68M76j45m52M76p9m83K07O01p17o0M93
1961A99l80l00N32k13m99P08j01l55K18L43m01j51J58J10n57N74K16q08M59j35
1981c83K10k45N93m89m7K67J2m81K40K76l29J24N37m19R3M90n88k00R71o63k88
2002c19N56n2k35K33L20p26J73O09j21q54Q68l13m30P56k38o54P18P71r07j83
2022b8P39j51r19Q68K2o36O35J69j300P66R42j218m46J406l53r54R61Q5j563J278
$$ y = [-1491, 568, -505, -1516, 1061, 594, -2680, -438, 1761, -1140, -1247, 886, -114, -943, 1233, -99, -1545, 852, 1499, -1339, -571, 1494, -372, -625, 505, -23, -569, 1032, 568, -1007, 311, 1424, -512, -615, 901, 180, -663, 1043, 122, -534, 940, 854, -401, -142, 1390, -41, -298, 964, 62, -444, 766, 352, -704, 329, 749, -560, -59, 728, 150, -118, 358, 213, -239, 237, 158, -325, -118, 483, -234, -294, 199, -181, -481, 51, -162, -661, 47, -54, -409, -191, 152, -249, -400, -242, -132, -689, -115, 101, -707, -248, -383, -173, -418, 175, -314, -361, -94, -82, -563, -323, -47, -376, -252, 285, -134, -41, 449, -139, -339, 632, -31, -319, 237, 185, -50, 183, 503, -223, -50, 559, 438, -416, 452, 139, -291, 465, 227, -427, 291, 1062, 155, -28, 711, 560, -359, 509, 531, -105, 530, 699, -601, 165, 1107, -111, -557, 849, 496, -458, 503, 588, -975, 303]
2042C03M01j417K34J444p68q90J269o86n83J095l7j816J455J309k423j09J918
2059F99p40j112J548o87j242J940J93k465J102K479k220r96K211r68j073K249
2075I18j168j945K609J533l463nK841j564p70J609r63q20K706q23l187K336K654
2092B498l091j011K932r65j204K274j522k146L948O92m595Q92M108k433j814K896
2108A459j427j207L510j453m379M275K747n049m72M273j417k133K893j921j777
2123b078M661l49n790K990M369m031j995L630j521q73L432k594l911N694J924
2138C558o631R02N002k801j823K835k085j058N178k108o106N115M355n769j521
2153b957M915k012r11K939l576k363P107j63p634K462O149m078k172L651k412
$$ y = [303, 704, -713, -479, 965, 197, -693, 576, -110, -693, 402, 365, -1451, 4, 1313, -1110, -1219, 699, -41, -1153, 395, -292, -1534, 406, 599, -1866, -764, 1715, -505, -1501, 710, -258, -1331, 918, -250, -2195, 414, 1947, -1516, -1521, 1320, -244, -1014, 595, -368, -1188, 1518, 695, -2492, -156, 2498, -593, -1604, 1328, 363, -841, 1433, -89, -2235, 1713, 2405, -2190, -1298, 2810, 377, -1437, 1459, 32, -1175, 2335, 882, -3497, 778, 3525, -1524, -1996, 2277, 860, -1273, 1620, -301, -2078, 2583, 2234, -3556, -566, 3803, -228, -2223, 1407, -114, -987, 2445, -149, -4060, 1634, 3558, -3073, -2171, 2831, 30, -1793, 1042, -1043, -2101, 3077, 969, -5137, -22, 4333, -1436, -2957, 1958, -54, -965, 1974, -1602, -3965, 3142, 2979, -4655, -2193, 3956, -122, -2294, 1357, -1055]
2168a055k15N072l884n219O907L361p919oN592k272j332L065l947j077P393j875
$$ y = [-1055, -1270, 3802, -82, -5301, 1606, 4967, -2952, -2958, 2634, 362, -970, 2095, -1852, -2929, 4464, 2589]
$$ [...]
8191h6
##END NTUPLES=NMR FID
##END=
