##TITLE=1H_NMG-1601
 CDCl3
 8 sc, 
 25.11.2024
##JCAMPDX= 6.0         $$ Bruker NMR JCAMP-DX V2.0
##DATA TYPE= NMR FID
##DATA CLASS= NTUPLES
##ORIGIN= UXNMR, Bruker Analytische Messtechnik GmbH
##OWNER= root
$$ XWIN-NMR		Version 3.5
$$ Mon Nov 25 14:16:59 2024 Russian Standard Time (UT+4h)  she@DPX200
##.OBSERVE FREQUENCY= 200.1315
##.OBSERVE NUCLEUS= ^1H
##.DELAY= (6, 6)
##.ACQUISITION MODE= SIMULTANEOUS
##.ACQUISITION SCHEME= undefined
##.AVERAGES= 8
##.DIGITISER RES= 18
##SPECTROMETER/DATA SYSTEM= spect
##.PULSE SEQUENCE= zg30
##.SOLVENT NAME= CDCl3
##.SHIFT REFERENCE= (INTERNAL, CDCl3, 0, 15.7039)
##AUDIT TRAIL= $$ (NUMBER, WHEN, WHO, WHERE, WHAT)
$$ ##TITLE= Audit trail, XWIN-NMR		Version 3.5
$$ ##JCAMPDX= 5.01
$$ ##ORIGIN= Bruker BioSpin GmbH
$$ ##OWNER= she
$$ F:/spectra/data/she/nmr/H-F/1/audita.txt
$$ ##AUDIT TRAIL=  $$ (NUMBER, WHEN, WHO, WHERE, WHAT)
(   1,<2024-11-25 14:15:58.32 +0400>,<she>,<DPX200>,
      <created by zg, POWCHK disabled, PULCHK disabled
       configuration hash MD5:
       00 E9 B6 7A A2 85 ED C7 34 08 36 98 17 FE 4E 26
       data hash MD5: 16K
       76 41 CF 95 39 28 7E 5D 23 9E C0 AB B0 44 B9 0B>)
$$ ##END=
$$ 
$$ hash MD5
$$ 3F 76 27 75 B2 1A 9D BB F0 75 A7 03 96 19 9C AB
##$RELAX= 
##$RELAX= 
##$RELAX= 
##$RELAX= 
##$RELAX= 
##$RELAX= 
$$ Bruker specific parameters
$$ --------------------------
##$DU= <F:/spectra>
##$EXPNO= 1
##$NAME= <H-F>
##$PROCNO= 1
##$TYPE= <nmr>
##$USER= <she>
##$AMP= (0..31)
100 100 100 100 100 100 100 100 100 100 100 100 100 100 100 100 100 100 
100 100 100 100 100 100 100 100 100 100 100 100 100 100 
##$AQSEQ= 0
##$AQ_mod= 1
##$AUNM= <au_zg>
##$AUTOPOS= <>
##$BF1= 200.13
##$BF2= 200.13
##$BF3= 200.13
##$BF4= 200.13
##$BF5= 200.13
##$BF6= 200.13
##$BF7= 200.13
##$BF8= 200.13
##$BYTORDA= 1
##$CFDGTYP= 0
##$CFRGTYP= 5
##$CHEMSTR= <none>
##$CNST= (0..31)
1 1 145 1 1 1 1 1 1 1 1 1 1 1 1 1 1 1 1 1 1 1 1 1 1 1 1 1 1 1 1 1 
##$CPDPRG= <>
##$CPDPRG1= <>
##$CPDPRG2= <>
##$CPDPRG3= <>
##$CPDPRG4= <mlev>
##$CPDPRG5= <mlev>
##$CPDPRG6= <mlev>
##$CPDPRG7= <mlev>
##$CPDPRG8= <mlev>
##$CPDPRGB= <>
##$CPDPRGT= <>
##$D= (0..31)
0 1.2 0 0 0 0 0 0 0 0.06 0 0.03 0 0 0 0 0.0002 0 0 0 0 0 0 0 0 0 0 0 0 
0 0 0 
##$DATE= 1732529757
##$DBL= (0..7)
120 120 120 120 120 120 120 120 
##$DBP= (0..7)
150 150 150 150 150 150 150 150 
##$DBP07= 0
##$DBPNAM0= <>
##$DBPNAM1= <>
##$DBPNAM2= <>
##$DBPNAM3= <>
##$DBPNAM4= <>
##$DBPNAM5= <>
##$DBPNAM6= <>
##$DBPNAM7= <>
##$DBPOAL= (0..7)
0.5 0.5 0.5 0.5 0.5 0.5 0.5 0.5 
##$DBPOFFS= (0..7)
0 0 0 0 0 0 0 0 
##$DE= 6
##$DECBNUC= <off>
##$DECIM= 24
##$DECNUC= <off>
##$DECSTAT= 4
##$DIGMOD= 1
##$DIGTYP= 9
##$DL= (0..7)
0 120 120 120 120 120 120 120 
##$DP= (0..7)
150 150 150 150 150 150 150 150 
##$DP07= 0
##$DPNAME0= <>
##$DPNAME1= <>
##$DPNAME2= <>
##$DPNAME3= <>
##$DPNAME4= <>
##$DPNAME5= <>
##$DPNAME6= <>
##$DPNAME7= <>
##$DPOAL= (0..7)
0.5 0.5 0.5 0.5 0.5 0.5 0.5 0.5 
##$DPOFFS= (0..7)
0 0 0 0 0 0 0 0 
##$DQDMODE= 0
##$DR= 18
##$DS= 0
##$DSLIST= <SSSSSSSSSSSSSSS>
$$ [...]
##$SUBNAM2= <"">
##$SUBNAM3= <"">
##$SUBNAM4= <"">
##$SUBNAM5= <"">
##$SUBNAM6= <"">
##$SUBNAM7= <"">
##$SUBNAM8= <"">
##$SUBNAM9= <"">
##$SW= 24.0689530833862
##$SWIBOX= (0..15)
0 0 2 0 0 0 0 0 0 0 0 0 0 0 0 0 
##$SW_h= 4816.95568400771
##$TD= 16384
##$TD0= 1
##$TE= 0
##$TE2= 300
##$TE3= 300
##$TEG= 300
##$TL= (0..7)
0 120 120 120 120 120 120 120 
##$TP= (0..7)
150 150 150 150 150 150 150 150 
##$TP07= 0
##$TPNAME0= <>
##$TPNAME1= <>
##$TPNAME2= <>
##$TPNAME3= <>
##$TPNAME4= <>
##$TPNAME5= <>
##$TPNAME6= <>
##$TPNAME7= <>
##$TPOAL= (0..7)
0.5 0.5 0.5 0.5 0.5 0.5 0.5 0.5 
##$TPOFFS= (0..7)
0 0 0 0 0 0 0 0 
##$TUNHIN= 0
##$TUNHOUT= 0
##$TUNXOUT= 0
##$USERA1= <user>
##$USERA2= <user>
##$USERA3= <user>
##$USERA4= <user>
##$USERA5= <user>
##$V9= 5
##$VALIST= <valist>
##$VCLIST= <CCCCCCCCCCCCCCC>
##$VD= 0
##$VDLIST= <DDDDDDDDDDDDDDD>
##$VPLIST= <PPPPPPPPPPPPPPP>
##$VTLIST= <TTTTTTTTTTTTTTT>
##$WBST= 1024
##$WBSW= 4
##$XGAIN= (0..3)
0 0 0 0 
##$XL= 0
##$YL= 0
##$YMAX_a= 155057
##$YMIN_a= -71002
##$ZGOPTNS= <>
##$ZL1= 120
##$ZL2= 120
##$ZL3= 120
##$ZL4= 120
##$ABSF1= 10
##$ABSF2= 0
##$ABSG= 5
##$ABSL= 3
##$ALPHA= 0
##$AQORDER= 0
##$ASSFAC= 0
##$ASSFACI= 0
##$ASSFACX= 0
##$ASSWID= 0
##$AUNMP= <proc_1d>
##$AZFE= 0.1
##$AZFW= 0.1
##$BCFW= 1
##$BC_mod= 2
##$BYTORDP= 1
##$COROFFS= 0
##$CY= 11.3945322036743
##$DATMOD= 1
##$DC= 2
##$DFILT= <>
##$DTYPP= 0
##$F1P= 15.6554695791079
##$F2P= 12.8336369535428
##$FCOR= 0.5
##$FTSIZE= 0
##$FT_mod= 4
##$GAMMA= 1
##$GB= 0.15
##$INTBC= 1
##$INTSCL= 1
##$ISEN= 128
##$LB= 0.24
##$LEV0= 0
##$LPBIN= 0
##$MAXI= 10000
##$MC2= 0
##$MEAN= 0
##$ME_mod= 0
##$MI= 1.114404
##$NCOEF= 0
##$NC_proc= 0
##$NLEV= 6
##$NOISF1= 3.799351
##$NOISF2= 2.8
##$NSP= 1
##$NTH_PI= 0
##$NZP= 0
##$OFFSET= 15.70392
##$PC= 1
##$PHC0= -26711.14
##$PHC1= 21.78744
##$PH_mod= 1
##$PKNL= yes
##$PPARMOD= 0
##$PSCAL= 0
##$PSIGN= 0
##$REVERSE= no
##$SF= 200.130013532006
##$SI= 16384
##$SIGF1= 3
##$SIGF2= 2
##$SINO= 400
##$SIOLD= 16384
##$SREGLST= <1H.CDCl3>
##$SSB= 0
##$STSI= 0
##$STSR= 0
##$SW_p= 3612.71676300578
##$SYMM= 0
##$S_DEV= 0
##$TDeff= 0
##$TDoff= 0
##$TI= <>
##$TILT= no
##$TM1= 0
##$TM2= 0
##$TOPLEV= 0
##$USERP1= <user>
##$USERP2= <user>
##$USERP3= <user>
##$USERP4= <user>
##$USERP5= <user>
##$WDW= 1
##$XDIM= 8192
##$YMAX_p= 0
##$YMIN_p= 0
$$ End of Bruker specific parameters
$$ ---------------------------------
##NTUPLES= NMR FID
##VAR_NAME=  TIME,          FID/REAL,        FID/IMAG
##SYMBOL=    X,             R,               I
##VAR_TYPE=  INDEPENDENT,   DEPENDENT,       DEPENDENT
##VAR_FORM=  AFFN,          ASDF,            ASDF
##VAR_DIM=   8192,          8192,            8192
##UNITS=     SECONDS,       ARBITRARY UNITS, ARBITRARY UNITS
##FACTOR=    0.0002076,     1,               1
##FIRST=     0,             0,               0
##LAST=      1.7004516,     0,               0
##MIN=       0,             -71002,          0
##MAX=       1.7004516,     155057,          0
$$ Real data points
##PAGE= N=1
##DATA TABLE= (X++(R..R)), XYDATA
0@%%%%%%%%%Qj6J6j6J6k4L2l2M0m8N6o6P5q9J04j21J38j56J79k04K30k60K93l28
33a73L67m11M59n12N71o35P03p78Q64r58J060j174J301j443J602j784J996k242
51a187K530k878L308l851M564n547P007r423J4357m2040J00218N2319j30720m132
65a5475P0601o29p6540l0284O284J7155J0840K8317K0929j6974k7385L4928L4376
78E6143l9608m4267J3591k367k2843J8495K6089j1927J1077M3136J4796k5419
90C6896m5531m3920J2575M6009j3282l9144L6729O2020j321k7617j0174j6368
102c128j5086P314P783j3928k0084J3020N5871K7372m6666k6710M1261J393n4518
115b6106Q66K6771l6671j0395P9048L1751p0519l1933O1623M0377n0286o7204
$$ plain form
0 0 0 0 0 0 0 0 0 0 0 8 -8 8 -8 8 -16 16 -16 24 -24 32 -34 41 -48 56 -65 73 -83 96 -108 122 -138 155 -173
33 -173 194 -217 242 -270 301 -334 369 -409 455 -503 557 -617 684 -759 843 -941 1055 -1187
51 -1187 1343 -1535 1773 -2078 2486 -3061 3946 -5477 8880 -33160 67058 119377 -11343 -15475
65 -15475 55126 54497 -22043 -52327 -46043 -28888 -18048 10269 31198 14224 -13161 21767 56143
78 56143 16535 -27732 -14141 -16508 -39351 -20856 5233 -6694 4383 47519 62315 36896
90 36896 -8635 -52555 -39980 6029 -7253 -46397 -9668 52352 51031 23414 13240 -3128
102 -3128 -18214 -10900 -3117 -17045 -37129 -24109 31762 59134 12468 -14242 27019 28412 -26106
115 -26106 -25240 1531 -35140 -45535 33513 65264 -5255 -37188 24435 64812 14526 -52678
127e2678O793N3154L972l6783N885L6114R327O846O722l8129l9866J6139J5990
140f514j8172M543K7571Q806M786O182j7131j8725k923p119N314K4455r033l4037
154c1997J2510M2107K948k5643o079J6502J3103j9256l8107m545K1157O142J6243
167E085L2904j3649l6925K0731K4178m9300m2639L4467L8632m348o741M598o32
180F361k998J078K510m662j8952l841K7430M648l4460k402L8377J1576j1288j88
194A3189j0460j8053Q328O131j9245r17K4683J1325J443J104j2597j0417O023
207E37k147r668L325J426l506J4802J5396q688r580J455O90K466o590k3417K469
222b1030L3144L805k1235Q635J3030j4257k439J4612j3756k1696J2466J8824o453
$$ plain form
127 -52678 -45885 7269 11241 -25542 -19657 16457 25784 32630 39352 1223 -38643 -22504 -6514
140 -6514 -24686 -20143 7428 16234 21020 27202 10071 -8654 -11577 -18696 -13382 11073 2040 -31997
154 -31997 -19487 22620 25568 -75 -6154 10348 23451 4195 -33912 -38457 -17300 -11158 5085
167 5085 37989 24340 -12585 8146 32324 -16976 -59615 -25148 13484 9136 2395 6993 6361
180 6361 3363 4441 6951 2289 -16663 -20504 6926 11574 -22886 -25288 13089 24665 13377 13189
194 13189 2729 -15324 -6996 -865 -20110 -21027 3656 14981 16424 17528 4931 -5486 537
207 537 -1610 -11278 -7953 -6527 -10033 4769 20165 11477 1897 3352 4042 6508 -82 -23499 -21030
222 -21030 12114 15919 -5316 3319 16349 2092 -347 14265 509 -21187 -8721 10103 3650
235C650j4091O97J9670J7270j2666j9574M332P04j6647L347J4816o626K244K6750
249B3876J479k5883p587M099l800K062N068l444M488Q966o375n204N601l228l372
264c254J1293N8j5009m813K158J130J0609O748o480M349R007j3782j4765K635
278a0116l000j487K0411R189j5825j070J2537p090j1984J757J260J611N963j404
292G52n014J575n00K162J1436l861j4905O165R207j4817p650J3962J947m278J1717
307G898L900j2829k636M991l392k025j127l743P808R530p488l773J0643j579r767
322c589L753M65r787K324Q297n95K939K731p225J158Q043r489r227J1204M782
337E784j0317K364O714o647n10R411L21l550j009m295j129K466o840j810J5689
$$ plain form
235 3650 -10441 -9744 9926 27196 14530 -5044 -712 -8 -16655 -13308 1508 -5118 -2874 23876
249 23876 25355 -528 -8115 -4016 -7816 -5754 -686 -4130 358 9324 2949 -2255 3346 118 -3254
264 -3254 8039 8097 -6912 -11725 -9567 -8437 2172 8920 2440 6789 15796 2014 -12751 -10116
278 -10116 -13116 -14603 5808 14997 -828 -1898 10639 3549 -8435 -6678 -5418 -3807 2156 752
292 752 -4262 -2687 -3187 -1025 10411 6550 -8355 -2190 7017 -7800 -15450 -1488 459 -3819 7898
307 7898 11798 -1031 -3667 1324 -2068 -4093 -5220 -8963 -1155 8375 887 -2886 7757 6178 -3589
322 -3589 164 629 -9158 -6834 1463 868 3807 6538 -687 471 8514 -975 -10202 1002 5784
337 5784 -4533 -2169 4545 -2102 -2612 6799 7120 3570 2561 -1734 -2863 -397 -7237 -9047 6642
352F642N201q779K690L060j3534m373R194j955l200R733K988n628Q95j748n844
367d658N028M435m935Q30K717p748q33P866l330k411J0913J541r735j2m85q197
383i014K695Q141k039J749O735n239n024M267m981o201Q757M627p825J519O103
398D270n095k008M325j515q87L109m542k039O052l826o202J0096N519j0358M07
413b694Q717o225o817N629J145l732K710J100r01L930j511n318N698K277j0582
428f574O02Q792m056m114Q313J576o120K037N97n017K619K311m650L099N887o520
444a218k829P135k449m621O470K134o469J682J775n394J282M303k467K296N295
459F925n353m414N157l057n357O984L574n795L648M778q336k772O762k095l151
$$ plain form
352 6642 11843 3064 5754 8814 -4720 -9093 101 -1854 -5054 4679 7667 2039 2934 1186 -4658
367 -4658 370 4805 -130 700 3417 -4331 -5164 2702 -628 -3039 7874 9415 -320 -332 -817 -9014
383 -9014 -6319 1822 -217 1532 8267 3028 -1996 2271 -2710 -8911 -154 4473 -3352 -1833 4270
398 4270 -825 -2833 1492 -23 -910 2199 -2343 -4382 1670 -2156 -8358 1738 7257 -3101 -2694
413 -2694 6023 -202 -7019 -1390 -245 -3977 -1267 -167 -1068 2862 1351 -3967 1731 4008 -6574
428 -6574 -5972 2820 -1236 -5350 2963 4539 -1581 456 1053 -3964 -1345 966 -3684 -585 5302 -1218
444 -1218 -4047 3088 639 -3982 2488 4622 -1847 -165 1610 -3784 -2502 1801 -666 1630 6925
459 6925 1572 -2842 2315 -742 -6099 885 4459 -1336 2312 7090 -1246 -4018 2744 649 -2502
474b502N083M45l090J856j496l825N266J783n104L644M260q001k201P282l644
489b44m872P827L029n885N51K080l646R49J194m551L252O151n741m138O984n59
505B381n977L804K696m720R34L107l746J19K489k760J547M440o248l140R208q37
521C297r639L703O652m894k339M223j427o84L112l125k218M197r99l485L825J96
537C95l827M306K802p017L56N598m108k275N549j600m407N767J126p210K046N115
553B616k907r78J656k446J059M188n343l467P974J365o181J139K929k324Q32N10
569F22m057K369N312m682k322N665k023m466O223Q72p927K728P087m311m705L841
585B26J356l72L41l164M9N872j856n720L969J769l919K553K454o083N77P872l668
$$ plain form
474 -2502 2581 3026 -64 1792 296 -3529 1737 3520 -1584 2060 6320 -1681 -3882 3400 -244
489 -244 -5116 2711 5740 -145 406 2486 -1160 -211 983 -3568 -316 5835 94 -4044 2940 2381
505 2381 -3596 208 2904 -1816 -882 2225 -1521 -1402 1087 -1673 -126 4314 -1934 -5074 4134 3297
521 3297 -6342 -2639 4013 -881 -3220 1003 -424 -1108 2004 -1121 -3339 858 -141 -3626 199 395
537 395 -3432 874 3676 -3341 -2985 2613 -1495 -3770 1779 179 -4228 1539 2665 -4545 -2499 2616
553 2616 -291 -1269 387 -2059 -1000 3188 -2155 -5622 2352 3717 -2464 -1325 1604 -720 112 622
569 622 -3435 -1066 4246 -436 -2758 2907 884 -3582 2641 3513 -4414 -1686 5401 1090 -3615 226
585 226 1582 1210 1551 -1613 -1564 4308 2452 -3268 701 2470 -1449 1104 3558 -2525 -1948 5924 2256
602B256o411M876K554l936J164J108l317K533L174m728o56L893k097j305L810
617B918k303l732M587J594m529R28J337j518L036M28p172K066R216n109q504O315
633d42N568n170k294J719j57K985P09o323m10O729j155m396R66J053J373K443
649C198m119m786N920L520o400l5N199l591j656O025l387o678N463O149m396l343
665b917J563J039J706j491n181L206O888l584m831L684Q15l393J223Q09j302L543
681A777O95n856J813N503o350l384Q513J709p141Q49M385k277k244L05N86L730
697B613Q06n994L44O212k587n682K391L521P44J156m551m132P469M816j0150l519
713f543R991J565n579j56Q42j703L630J234m270q82L434L04L70j637m413L433
$$ plain form
602 2256 -4155 721 3275 -661 503 1611 -1706 827 4001 -727 -1383 2510 413 -892 2918
617 2918 615 -3117 1470 3064 -1465 -537 800 -718 2318 2746 -4426 -2360 6856 1747 -6757 -442
633 -442 5126 -44 -2338 -619 -776 2209 2918 -3405 -3815 2914 1759 -2637 -1671 -618 755 3198
649 3198 -921 -5707 213 3733 -2667 -2702 2497 -1094 -2750 3275 -112 -6790 -1327 4822 426 -2917
665 -2917 -1354 -315 1391 -100 -5281 -2075 4813 1229 -3602 82 897 -2496 -1273 -464 -1766 1777
681 1777 2472 -3384 -1571 3932 -2418 -5802 2711 4420 -2721 -1872 2513 236 -2008 -1703 -1117 2613
697 2613 3419 -2575 -2231 3981 1394 -4288 -1897 1624 2368 3524 -1027 -5159 2310 7126 -3024 -6543
713 -6543 3448 5013 -566 -722 120 -1583 2047 3281 -989 -1871 1563 1867 2237 600 -3813 -380
729c80O477n035n976N845K992m063P02O34k959K531K539n710m98P145j366n582
745b704K590K919k934j113M90m96L434J411m810n79L206j537j167J959j432LM570
762C810k156o052L020L059m609J890O439m583n314N272K249n222j985K200L682
777A700L166l543o059K659M683m027j995L373K38P88K724m954m880N388K432m073
793b380J749L757m104j263L753k994l060M539K276k385M70L00k107O51l69j538
809b705L656K355m721p11M714k065l408K103j0k72N014j288p788K849P241l890
825A074n008L460J941r81Q48r53j871J790P02n34R82j605l389M442M581n426l161
842c108M767L12k867J793j014j992M546J876n026p24L563k718j318M129J46k802
$$ plain form
729 -380 6097 1062 -4914 931 3923 -140 562 1196 -1763 768 3307 -2403 -2901 4244 2878 -2704
745 -2704 -114 2805 -129 -1242 -752 -1248 2186 3597 -1213 -1792 1414 -123 -1290 669 -763 -760 3810
762 3810 1654 -4398 -1378 1681 -2928 -1038 5401 818 -4496 776 3025 -2197 -4182 -1982 1700
777 1700 4866 1323 -4736 -2077 2606 -1421 -3416 -43 195 983 3707 -1247 -6127 -739 1693 -2380
793 -2380 -631 3126 -978 -2241 1512 -1482 -4542 -3 2273 -112 358 658 -1449 -798 -1167 -2705
809 -2705 951 3306 -1415 -2126 2588 523 -2885 -782 -792 -1064 3950 2662 -5126 -2277 4964 1074
825 1074 -3934 -474 1467 486 1334 381 -1490 300 1002 468 1450 -155 -3544 898 5479 53 -3108
842 -3108 1659 1971 -896 897 -117 -2109 2437 4313 -713 -1437 2126 -592 -1910 2219 2365 -437
858d37J149R28j778O5j075n98M262J685m238m0J499m142q6N418j564l359M803
875B492K110n381j298J283k105J873M633j787k923J876m86j470P45j101n67M593
891B487J027m323j016P38j780K753L293l874j600N806j080o183Q43J896r94K709
907G02K679l296j465K078j551j497J966q10n96L251ol061R51L12j789K654K119
924B641m495j102M280j604k035L045o45k826M085K344n055j642L514j15r36L12
940b34j641N97L358j075j879K475p86k778K335O12m469J240M625q01o16J730k932
957b39k511L880J75l957K128L401k018k86Q16l084j27L624m8j020J207k251j518
974a828K763p78l388L811L971k466j113R12l776j582M200J70j903K822Q27k399
$$ plain form
858 -437 712 1640 -138 -73 -1148 -1746 2516 4201 -37 -77 1422 -2720 -2806 2612 1048 -2311 2492
875 2492 4602 -779 -2077 -794 -2899 -1026 3607 1820 -1103 773 287 -1183 -438 -1539 -2106 2487
891 2487 3514 -809 -1825 -1087 -2867 -114 3179 -695 -2295 3511 2431 -3752 -2909 -1013 -2007 702
907 702 3381 85 -1380 698 -853 -2350 -384 -1194 -1790 1461 1455 -1606 -655 -343 -2132 522 2641
924 2641 -1854 -2956 1324 -280 -2315 730 85 -2741 1344 3688 -1367 -3009 505 390 -546 -234
940 -234 -1875 -1278 2080 1005 -874 1601 815 -1963 372 984 -3485 -2245 2380 1579 963 2693 -239
957 -239 -2750 1130 1305 -2652 -524 2877 859 573 1389 -1695 -1822 1802 1754 734 1941 -310 -1828
974 -1828 935 157 -3231 580 4551 2085 972 1884 -1892 -3474 726 896 -1007 1815 2642 243
990B43L68K58l504Q69M287n67j684M14k022m19K623j216j100M113P12l518K68
1007A25P30m566K87N101o15j750K453K20k605J062o75k858K019K394k191K70J585
1024I86j937K26L002j404k753J647p8j936J567L54k719L128L484l466j614K635
1040A122j267j925J995l23k488K141J629j349J081J128k253M04J633l621j788
1055c881K926M10m62L497j95k694J243K90m014L91K912j344K85L586j675l369
1071b094K026Q01j439J517J11j714J252L27l101O92K883n59K64K616j867l984
1087b269J439P68k489J758K874r42P02J231l791j438K848p58j352L056M72l095
1103i86J380O56k183P29J950j225R12J232l132j823L135m57k038L053J495k975
$$ plain form
990 243 611 869 -2635 -1766 2521 1954 270 684 -1338 -1757 866 -350 -1450 2663 3375 -143 125
1007 125 855 -3711 -3424 1677 1062 -688 1765 1985 -620 442 -233 -3091 -1072 1322 -869 -599 986
1024 986 -951 -725 2277 873 -1880 -233 -311 -2247 -680 -326 -3045 83 3567 101 -1513 1122
1040 1122 -145 -2070 -75 -398 -2886 -745 884 -465 616 1744 -509 -105 1528 -2093 -3881
1055 -3881 -955 -545 -1007 2490 2295 -399 844 1134 -2880 -2489 423 -921 -636 2950 1275 -2094
1071 -2094 -68 733 -706 811 922 -792 460 787 -2314 -1622 1261 702 966 3582 1715 -2269
1087 -2269 -830 -62 -2551 -793 2081 1139 1841 3072 -719 -2157 691 -67 -1419 1637 2109 -986
1103 -986 394 1050 -1133 -404 1546 321 1233 2465 -667 -2490 645 188 -1850 1203 2698 -277
1119b77O90J787l072j143K623p12l93K011j111j670K637q3k706J362J060k041
1135a038L29J540k084J15K894j429j922K774o13k392J821J198k820O12K209j835
1151f41r59K226p14m35K057j282k059J850k17l020K115K690j561j8J329j828q38
1168a305J461j867r20M188J01l008J043J307k778L01K440j271k08K238j458j955
1184a691R21n88L4K942J88k564J786R36l845p23K636n89K71K562r92k202J978
1201A060l52k919J382K141j420L20J381k041n32K172r28j160K330n9j691P63l41
1218A06k332K077K584k537j07K832j415k129J535q70j438K559P41k264O66K150
1234B158j546p56P58j453K39K493j921j846K684J045j828M17R6j872J501J428
$$ plain form
1119 -277 413 2200 -872 -2015 608 -104 -497 1514 403 -1267 1370 1287 -1419 -57 1003 -1038
1135 -1038 -709 831 -1253 -1138 1756 327 -1595 1179 566 -1826 -5 1193 -1627 -1015 1194 -641
1151 -641 -1600 626 -88 -523 1534 252 -1807 43 -174 -3194 -1079 1611 50 32 1361 -467 -1305
1168 -1305 156 -1711 -2631 1557 1658 -1350 -307 1000 -1778 -1477 963 -308 -516 1722 264 -1691
1184 -1691 -770 -1358 -1324 1618 1806 -758 1028 1964 -1881 -2604 32 -557 -286 2276 1284 -918 1060
1201 1060 708 -2211 -829 1312 -108 212 1593 -448 -980 1192 264 -896 1434 1375 -316 447 106
1218 106 -2226 -149 2435 -102 -209 2623 1208 -921 614 -256 -1694 865 1606 -658 8 2158
1234 2158 612 -144 614 -839 -600 1893 -28 -1874 810 1855 27 444 540 -1332 169 1597
1250A597l267K68L903j322k830K022J89j520J065P89j833R28J234j802k23R01
1266I9j167O71K541j960k243K281N71k724P00J469l41J258N81l537m65L474j396
1283a88k609K664J938j757q3J15j863O84J327j219O74J547j623k75J652j902j877
1300b795L213J550k810M05J063j159J82Q52k300N59L981j613l462J590J926j538
1316c56m16M86j48J620M14k576l34K550j220j111K197m50j641K244O9k947J033
1333e86K087j778K67J166j663l52K961j216k683J880J785j765l91L81n39J861
1349A415J32k817K98L015j593j731K005L5j111J588K44l252J212K181j808p26
1365i13J980n64q99J610q90j876J648J315j589M7N56r75R14R70k791L14L261r37
$$ plain form
1250 1597 -1670 -1402 2501 1179 -1651 371 560 -960 105 894 -939 -11 1223 -579 -802 99
1266 99 -1068 -397 2144 184 -2059 222 793 -1931 -1231 238 -103 1155 1736 -1801 -2266 1208 -188
1283 -188 -2797 -133 1805 48 -35 80 -1783 -1099 228 -991 -317 1230 -393 -668 984 -918 -2795
1300 -2795 418 1968 -842 -437 626 -533 -351 501 -1799 -1240 2741 1128 -2334 -744 1182 -356
1316 -356 -772 -286 -434 1186 1600 -976 -1310 1240 20 -1091 1106 656 -985 1259 1328 -1619 -586
1333 -586 1501 -277 -10 1156 -507 -859 2102 886 -1797 83 1868 103 -288 93 -446 1415
1349 1415 1547 -1270 -972 2043 450 -1281 724 759 -352 1236 1480 -1772 -560 1621 -187 -913
1365 -913 1067 503 -396 1214 324 -1552 96 1411 -178 -131 425 -550 364 1334 -1457 -1143 2118 1181
1383A181k399J054M3j111J332J56j815J775K732l056k143K456L75j664M27M57
1399b00l24J367o04j580R69R20j687P67J723k358q29K810q77j907J646J108j223
1416b79Q59Rk344R42J987k218j182K694Q98j635K81n2l87J010o96j871J804J323
1434A143k110M8K081j424m91K148r60k124J753P70k068J098J136j588M18K374
1450B204j889j610K048L33j609j60L67n4J605o34j689J919J589k787o87K138j455
1467c71j137K251J44j525J644J012k121j59J052j372j22J554j082m68K027l63
1483I64j467J085L82r12O62m43j845J510J570k466k9K790o22j535J418o70k201
1500a809J687R24k035L19K205r61m48J104r72l82Q50o72j100J533j10j129J249
$$ plain form
1383 1181 -1218 -164 -121 -1232 100 256 -1559 216 2948 -108 -2251 205 580 -1084 -657 -200
1399 -200 -524 843 239 -1341 -372 548 -1139 -372 1351 -1007 -1836 974 97 -1810 -164 944 -279
1416 -279 580 589 -1755 -813 1174 -1044 -2226 468 1366 -269 12 -40 -427 583 -113 -1984 -180 1143
1434 1143 -967 -919 1162 -262 -753 1395 435 -1689 64 834 -1234 -136 1000 -588 -170 2204
1450 2204 315 -1295 753 1086 -523 -683 -316 -370 1235 601 -1088 831 2420 -367 -1054 1084 -371
1467 -371 -1508 743 887 -638 1006 2018 -103 -262 790 -582 -704 850 -232 -700 1327 964
1483 964 -503 582 964 52 714 271 -1574 -64 1506 -960 -989 1801 1179 -356 1062 392 -1809
1500 -1809 -122 802 -1233 -914 1291 330 -118 986 14 -368 482 -190 -1290 243 133 -996 253
1517B53P35j944Q91J556k140j191K527j026j743J929R22j592P76J218j388l65
1533e82J037j240k96R81p02j85J841n51j356J917J56k049M87O79j510M46J850
1550I23j329o43K464p61j620J169J75j877Q96J015j242k95K101l95m25N76r89
1567b57K38R24j354j407K111M95j986J269K124k075l88J598j108j279J239j35
1583Ij070J558P46j374M59R75j193k40R79j564n0J421n87o37J561R6j394J616
1601A311J7k457M99J836j964l17J962m36o59J375k2j565N96L36j384N63P49j260
1619h20N53J504q28m86J134q47r23J442p69j731J757J168k045O01J801j368q21
1636f78J409o15j491Q75M34o60Q01M70j126R04O97j287l05P83j312k42J775l10
$$ plain form
1517 253 988 -956 -65 1491 -649 -1840 687 -339 -2082 -153 769 -823 -47 1171 -217 -582
1533 -582 455 -785 -1081 -100 -802 -987 854 303 -1053 864 1020 -1029 -542 137 -1373 -927 923
1550 923 -406 -1049 1415 654 -966 203 378 -1499 -603 412 -830 -1125 976 581 156 732 -257
1567 -257 -19 905 -449 -1856 255 750 -1236 33 2157 82 -306 1292 184 -1095 144 9
1583 9 -1061 497 1243 -131 328 1303 110 -130 849 -715 -765 656 69 -568 993 1089 -305 1311
1601 1311 1328 -1129 -630 1206 -758 -1075 887 451 -208 1167 1145 -420 176 512 -872 -309 440 -820
1619 -820 -267 1237 409 -77 1057 210 -713 729 -40 -1771 -14 1154 -891 -290 1511 143 -678
1636 -678 731 116 -1375 -500 -66 -726 75 545 -581 323 1020 -267 -572 211 -1101 -1343 432 122
1654A22j325J742N25j616P92M02j805J08J485j088q50J897p8r00J488Q8j364J02
1672b75M5q43N13L01r49P71J828j291o96J452k62j641J053k4j488J059J525j392
1690c14O5J329o46n31Q91p74j387J059K57n55Q68N43q37P24O55j472m81J323j152
1709d35q00J901l9j472J349J405j699m6P78j443n2R78o36p60J971j87r31J109
1727I91L95j687J86O39j245K49O83n97L02J705j041j189J901j43k258O77O52j144
1745i24L73J504p29l6J094p03p34O49p14j130J288J86j038R60J060j135M0J205
1763A216j416q71J318o90j172J761J69j385J527J110j679l60Q39q98m17N91l64
1780g21l27J690o0r62Q22Lj353N37P01j666J00J554l97o01J597l08j199J138J44
$$ plain form
1654 122 -1203 539 1064 -552 240 642 -1163 -1055 430 -658 -1508 389 311 -589 899 987 -377 -275
1672 -275 -230 -1073 -560 -259 -1208 -437 1391 100 -596 856 594 -1047 6 -18 -1506 -447 1078 -314
1690 -314 -249 1080 434 -97 794 20 -1367 -308 -51 -606 262 805 -32 692 1347 -125 -606 717 -435
1709 -435 -1235 666 627 -845 504 1909 210 164 942 -501 -553 425 -211 -971 1000 813 -118 991
1727 991 1386 -301 -115 524 -721 -472 211 -386 -84 1621 580 -609 1292 1149 -1109 -432 220 -924
1745 -924 -551 953 224 188 1282 579 -155 494 -220 -1350 -62 124 -914 46 1106 -29 11 1216
1763 1216 -200 -1071 247 -443 -1615 146 315 -1070 457 1567 -112 -472 367 -531 -948 -357 -721
1780 -721 -1048 642 582 -380 442 445 -908 -371 330 -1336 -1236 318 -79 -680 917 609 -590 548 692
1799F92j903M39J004j186J60J344j62n00O80m2r20O78q45p77J233N72j345P34
1817a44J504j417j43J363r78j109R89J75r26O00L82o74Q16R32j610k38R47m07
1835F2p73J007n88l54J635j25j142Q06Q03j517K69M83j322n2J800q27r16J516
1853G65M74j409L82L61j071o8J171j134O8J402o87n28Q63l03q40J002l17j102
1871i71J084P27j518K15J280n99m70J167q56j001J062N02j545L20J077n67L72
1888B79K31j064J27J515j313j006J145K89q21P92J20j010O49Q56j191k95R52o71
1906d16k79R59k39j291J493O44j176j1N65m24o3K59q33M65J097j274l74J786n5
1925H33j450N98L05j308O38J065j252m9J538m37p16K50n6n56Q74L60j425M25J094
$$ plain form
1799 692 -1211 -772 232 -954 -794 550 388 -112 568 526 -394 284 -561 -1338 -105 467 -878 -144
1817 -144 1360 -57 -200 1163 185 -924 65 240 -686 -86 296 -378 438 1370 -240 -478 469 62
1835 62 -711 296 -292 -646 989 864 -278 528 1331 -186 83 566 -756 -808 992 165 -751 765
1853 765 1239 -170 212 573 -498 -566 605 -529 -461 941 254 -274 589 286 -554 448 131 -971
1871 -971 113 840 -678 -463 817 218 -252 915 59 -942 120 622 -923 -603 474 -93 279
1888 279 510 -554 -427 1088 -225 -1231 -86 203 -618 174 294 -716 -67 789 -402 -697 255 -416
1906 -416 -695 264 25 -1266 227 871 -305 -316 249 -175 -238 21 -812 -347 750 -524 -898 888 833
1925 833 -617 -19 286 -1022 -384 681 -571 -620 918 481 -235 15 -41 -597 277 637 -788 -363 731
1944G31p85j64N25o22L80J055j145j401J788M90j517N29O28n96O93M94j628l67
1962i12J467l05p11Q23K14n95O24K7j122N23O12p35o7P65q49n2J099q28p16J500
1982G62j87j127K32R89r11J92P40p48l11J418o03j125O02K13m21O63n42n33J215
2001E18L01j245l04J348m88o74P31k27q38J135M98j136J62R07j046k39Q64p51
2019d84k6J106k61q21K08L19m49M54j72p13J055Q43j872k48J789r18n97R36r4
2038E5m08N94j03j343P80R69o01m20R67n05o12P05l83n51J094K19o29N34k65q00
2058g03O47P77j599l3J996l33j633Q46N00q86M34L48p55L27J010j156j89R39m41
2077I6l85P26j38p95N86J90o41O76L08j085P11O37j105m65J688n38j087P34M52
$$ plain form
1944 731 -54 -218 307 -315 65 1120 -25 -1426 362 852 -665 -136 492 -104 589 1083 -545 -912
1962 -912 555 250 -461 362 576 -19 605 632 -490 33 645 -90 -157 608 -241 -293 806 -22 -738 762
1982 762 575 -552 -320 669 -242 -50 690 -58 -369 1049 446 -679 -77 136 -285 378 -164 -697 518
2001 518 819 -426 -730 618 130 -544 187 -40 -878 257 755 -381 -219 688 -358 -597 267 -484
2019 -484 -510 596 335 -486 -278 41 -408 46 -126 -839 216 1059 -813 -1061 728 -190 -787 149 55
2038 55 -353 241 138 -1205 -425 544 -57 -477 490 -15 -627 78 -305 -856 238 457 -172 362 97 -703
2058 -703 -56 721 -878 -911 1085 752 -881 -35 465 -421 13 361 -394 -67 943 -213 -402 537 96
2077 96 -289 437 299 -496 90 280 -361 315 623 -462 249 886 -219 -684 1004 466 -621 113 565
2096E65p23K04L59o72J94Q96q03l85P00j42l27N00m0n63Q14m1j172L56Q10q10
2116b80K90R38j071l34J130n20j196Q56P12o70L75R5p53K19N64o43j85J045l39
2135B33m49M88n80o00J001J63j000R28O24j285j87J036o02n45J227j96j097R67
2153A26L05j023J44M73m01P3P05n53j21M88k89m07P69l01m04Q26K61j586L16J264
2173F65r15n73J298k97p13O78k7o48O32L07r69M43O74r22P1P78q84n0R32m15n35
2194d70Q24j65p00O57O22j153k01J237p06l60Q05K30q13M44K48r04L51L55o35
2213c34M22R11p81l78L41l93n5N49j32n34J089j89j159O83O41r28J01J263p07
2232D10q95N35K85p92N42L77n82P17j68q07K30K43m39o4Q22k07l27P76l38j013
$$ plain form
2096 565 -158 46 405 -267 -73 823 20 -365 335 193 -134 366 326 -237 577 536 -636 -280 530 -280
2116 -280 10 948 -123 -457 673 153 -1043 -187 525 -145 230 325 -428 -209 355 -288 -473 572 233
2135 233 -216 272 -308 -908 93 256 -744 184 808 -477 -664 372 -230 -775 452 256 -841 126
2153 126 431 -592 -448 25 -376 -303 402 -151 -272 216 -73 -480 289 -12 -416 410 671 -915 -599 665
2173 665 -250 -823 475 178 -535 143 116 -532 100 407 -562 -119 555 -367 -296 482 -402 -452 480 65 -470
2194 -470 354 189 -511 146 768 -385 -586 651 -55 -415 390 620 -193 251 499 -405 -54 301 -334
2213 -334 88 999 218 -160 181 -212 -267 282 150 -384 705 516 -643 40 681 -247 -146 1117 410
2232 410 -485 50 335 -457 85 462 -120 597 429 -378 -148 95 -344 -408 414 207 -120 656 318 -695
2252f95N75M09r58O45P55p28m79R69n03p62Q36K14p56L81K31l87k2M22l65L01
2272H3K71m70j37O46o70o01J045Op49P36L31r68k0Q63p38r9N59l85k43P16j84
2293hm62O30J28o95J92M08n69J33P70q00k55J122o34o65R48Q3n76J46O96q45K5
2314b28M92n87l5R00l36m91O38l8r43N03M03n37L51M93n78J26L78p58r4P00L0
2335C89q28J058R8j295J99Q03l07J2N84k88m24L69m26n61P30j1k97P68J8q27L74
2356A38M88r80j16Q02k14l59Q95k84r80Q11K61q27J54Q38o48l95N61q1l00N63
2376C27l49l59R66l82p68O55K29j129O50N70n35j46P41m11n29N27np45N82L41
2396B30r67K42J061o68j20N13n89p5K23o7k01O95j35o82N26M27j073L61O66m69
$$ plain form
2252 -695 -120 289 -669 -24 731 3 -476 493 -10 -772 64 278 -478 -97 134 -253 -275 147 -218 83
2272 83 354 -116 -253 393 -277 -878 167 173 -576 160 491 -477 -497 366 -372 -471 88 -297 -540 176 -8
2293 -8 -470 160 288 -407 -215 193 -376 -243 527 -273 -528 594 -40 -705 243 326 -250 -104 592 -253 -228
2314 -228 264 -323 -358 542 206 -285 353 315 -628 -125 278 -259 92 585 7 133 511 -247 -341 359 389
2335 389 -439 619 717 -578 -379 424 117 129 713 425 1 370 -56 -617 113 102 -195 573 591 -236 138
2356 138 626 -354 -470 332 118 -241 654 370 -610 201 462 -365 -211 627 -21 -416 145 64 -236 327
2376 327 -22 -381 585 203 -565 90 319 -810 -160 410 -125 -271 470 59 -470 57 52 -693 -111 230
2396 230 -737 -495 566 -102 -222 291 -298 -373 -150 -217 -418 277 142 -540 -14 413 -660 -299 367 -102
2416a02l17Q64m04p21P62J44m89L81N29r41K17J96p69K08N82k54j14N39K13p68
2436b44L30j16o70O81O63q85P7Q33o85n64Q23J11n38N95O1r03K54L56l46J38P64
2457G35n70mK84o01l42O53Q2o01O98L28o47Q3N94r18k28Q97k71o33P30L8m72L71
2479B06K13o61M24L02m28l17M23l30j10O87l03n74R16J73o46q5N73p97L69K09
2499B44q13J78R59m65m49N58K36o86J16J40l94K69L56m28K31M98q10L9M49n02
2519b74n93J252nj066N43M07o19J52M55l69m04P45l09o88P52N0m63N78K55n58
2539a59K63K37q01j28Q67n71l4Q30m03o55Q98o6j103N30P11l88k87K57k81Q1N44
2560C42k64j61K62K86o38K3M66o30K18M19m61K09N80n78m22P29k54o82O70K11
$$ plain form
2416 -102 -419 445 41 -680 82 226 -263 118 647 -294 -77 119 -650 -442 140 -114 -228 311 524 -244
2436 -244 86 -30 -700 -19 644 -241 -164 669 -16 -580 243 354 -184 411 472 -431 -177 179 -167 -29 735
2457 735 165 161 445 -156 -498 155 237 -364 334 662 15 98 692 -226 -454 443 172 -461 269 307 -165 206
2479 206 419 -242 182 484 56 -261 162 -168 -278 409 106 -468 448 621 -25 -110 463 -334 35 244
2499 244 -569 -391 568 103 -346 212 448 -238 -122 18 -376 -107 249 -179 52 550 -260 -221 228 -274
2519 -274 -867 385 380 -686 -143 264 -355 -203 252 -117 -521 224 -85 -773 -21 29 -434 144 399 -159
2539 -159 104 341 -460 -588 279 -292 -326 504 101 -554 344 278 -825 -295 416 28 -259 -2 -283 -202 342
2560 342 78 -83 179 465 -173 -150 316 -314 -96 323 -138 71 651 73 -349 380 126 -556 114 325
2580C25o34K19Q56n98k57M08O6m32L90k40n11P12J26o97L58L90p68L20M46q39
2600c60L9O28k11o94P66J46k74O0K86o09J65M82p50j05O41j50j76O46l46k28K10
2621A66K66r39K93N18n52J65N39m22l79Q05m57o95P99J38n99K11P7j44K34M05
2641D29o63K71L55j30o58J97j6l53O04K0n14L33M61p60m4P00l84k76O78j82n33
2662d65M75M10o02J33K91n60J69L71o50k42J014k61m34N07J21n30K76kn15N15
2682B1L84q12R0Q32l96l05N36j29o36L82M05o97Q7M61j69P9K22m24q1O96l84o54
2704d92N35M0k49K90N8n53M46O66r34j28P11l72m81O20J05o16N45K21o09K27L35
2725C65l15k00K35j26k03N92p5o72O63N7n82L33J48m87q1R06p38j57R16k01o11
$$ plain form
2580 325 -309 -90 766 168 -89 319 385 -47 343 103 -408 304 430 -267 91 481 -287 33 479 -360
2600 -360 -321 307 96 -598 168 314 40 100 386 -223 -58 424 -326 -431 210 60 -116 530 184 -44 166
2621 166 432 -507 -214 304 -248 -83 456 34 -345 460 3 -692 107 245 -354 -143 -66 -210 24 429
2641 429 -234 37 392 262 -396 -199 -215 -568 36 56 -458 -125 336 -424 -468 232 -152 -428 250 68 -465
2662 -465 10 420 -182 -49 242 -318 -149 222 -428 -670 344 83 -351 156 277 -253 23 21 -494 21
2682 21 405 -407 -317 515 119 -186 350 221 -415 -33 372 -325 -238 223 54 133 355 -69 -150 546 162 -492
2704 -492 43 83 -166 124 182 -371 75 741 -193 -321 390 18 -463 157 262 -354 191 412 -197 30 365
2725 365 50 -150 85 -41 -244 348 273 -399 264 321 -261 72 220 -267 -348 558 -180 -337 579 378 -233
2746b33M20P3m74J54K22n74L43L77l11k96N26o5m80P88m82n19N19K90r39O14M53
2767D06n86K4M74m52l48M96r6l23L38J26l71L44L00q59M40L33n65n9L47m3m23
2788d97Q18k49n47O31J45p39P1M64n05m0P41n26r9O76J3n07J7K38l93L85J89o31
2810c45J23O74n65M0M25k15m03N51j52n07O23K82q43L18O07l83m60P32m37n56
2830d91O07K54m48K25J4l40K77J94k95Q8M29l73m89L49m4m35Q04np35O54J49q92
2852e03L81N96m92j93O31r7m20K03J64n35M13Q5n10M75J59o25j57P03m74j58Q49
2873D95j99n70K71L24o26K45L20m86K10O50q06pM07j96l24O14l9n92L01J65m18
2894b61J70L27m75J13N15o76j50N44j91o05Q08J55p10J96M25l62m8M91m10j88
$$ plain form
2746 -233 187 260 -214 -60 162 -412 -69 308 -3 -299 227 162 -318 470 -12 -531 -12 278 -661 -47 406
2767 406 -180 -156 318 -134 -482 14 -82 -405 -67 59 -312 32 332 -527 -87 246 -319 -378 -31 -74 -497
2788 -497 321 72 -475 156 301 -438 -367 97 -408 -448 293 -233 -332 344 357 -150 -133 105 -288 97 286 -345
2810 -345 -222 452 -113 -73 352 137 -266 285 133 -374 249 531 -312 6 613 230 -230 502 65 -491
2830 -491 116 370 -78 147 161 -179 98 292 -3 85 514 141 -348 1 -43 -478 326 321 -414 240 389 -503
2852 -503 -122 474 -18 -211 420 323 -97 106 270 -265 148 233 -277 198 357 -268 -425 278 -196 -354 495
2873 495 296 -274 -3 321 -305 -60 260 -226 -16 634 -172 -179 228 32 -292 322 283 -309 -8 157 -261
2894 -261 -91 236 -239 -126 389 -287 -437 107 -84 -689 119 274 -436 -240 185 -177 -225 266 -144 -332
2914c32K81o1k30J97L98m77K69P0m81L35O6n62J19R91m01l84L99q7o43L24L77
2935A68m74M10L32n24j53M67k31PK18j94p0K62M4o15K27M33o73L17O69n88k70
2956b38M95k84n36J087k3o54L01K50n23j73M55j80l80P25j37l1j71k3j80N72L7
2977C89o33L44L89o71o0M01n99J35N55j00l47M32J36q07O49j0l96K71M02m94j66
2998a80M97k85l37L57j84l13M74J24m85J21N00o51P1O79n35j67M79M5l77K92J21
3019B46l94j11L39m04J53M91l10k06K82k05k54L78kk04M68L7p04L08K79n25o4
3040d02M62J91l17J68j31l69J09M61m72M24Q1k63jk6j49K2M54j64k65L82M4l84
3062a45qK26k18J60O46n18m59N98l77l31N20K21m88K85k3k19K04K31k67p9L21
$$ plain form
2914 -332 -51 -112 -342 -145 253 -224 45 115 -366 -31 35 -527 -408 583 182 -202 197 110 -533 -209 168
2935 168 -306 104 436 -88 -241 226 -5 2 220 26 -44 218 262 -353 -126 307 -366 -49 620 32 -238
2956 -238 257 -27 -563 524 501 -153 148 398 -125 -298 157 -23 -403 322 185 154 -17 -40 -220 352 389
2977 389 -244 100 489 -182 -242 159 -440 -305 250 150 -197 235 371 -436 213 203 -193 78 480 -14 -180
2998 -180 317 32 -305 52 -132 -445 29 153 -332 -211 289 -362 -291 388 -147 -314 165 210 -167 125 246
3019 246 -148 -259 80 -324 -171 320 10 -196 86 -119 -373 5 3 -201 267 304 -400 -92 187 -338 -402
3040 -402 60 251 -66 102 -29 -398 -289 172 -300 124 205 -58 -59 -85 -234 -212 242 78 -187 195 239 -145
3062 -145 -153 73 -145 15 661 143 -316 282 -95 -426 94 315 -173 112 89 -130 74 305 38 -41 280
3083B80l47N3L64j30o08M31K05m76L55J30k80MM31o02j33Q56n55j96M85Q1l89
3104d1J69l0j80J70j3m24K78M64j97k79M58j65m88K05K81o64N55M10p16K02J07
3125A02l68m2N16k74l07N20P4l89j71N08m76K84K82k40R4J83o49p8L45R8l28M56
3147A40Qm25P2K18m90K33L89j17r3M85n20n08M61J14j57P4N56n14k83N69l15k83
3169c86P22l94J98mm0o28M89J20n34L04N95l25k20M45m34j16K21lj54K38J34m62
3191b34J82K50k24r1L79k76J83oj79k96M98K74p22N26j8l46n8M25k75j53M46o7
3213B18n47K18K46k12M20L3n54K59J48n22q6P82m87K0M63k24m17M13O5o89L06
3234a47M97k98p8K33l01j98L62L2j38L85j0p04K20j93r8L89L82l21k11N97r6p12
$$ plain form
3083 280 -67 -14 350 220 -388 43 248 -228 127 257 -23 -19 412 -190 -323 533 -22 -218 267 348 -41
3104 -41 128 98 -82 88 75 -349 -71 393 196 -83 375 210 -278 -73 208 -456 99 509 -207 -5 102
3125 102 -266 -308 208 -66 -373 147 221 -168 -339 169 -307 -23 259 19 113 296 -353 -431 -86 12 -316 140
3147 140 148 -277 -205 13 -477 -244 145 28 -65 420 -100 -608 -147 -33 -190 -116 440 -74 -357 212 -103 -386
3169 -386 336 -58 140 136 96 -532 -43 77 -457 -153 442 117 -103 342 -92 -208 13 10 -144 94 228 -234
3191 -234 -52 198 -26 -117 262 -14 169 163 -16 -312 186 460 -262 264 246 -100 -158 267 -8 -161 285 218
3213 218 -329 -111 135 -77 343 376 -178 81 229 -293 -379 403 -84 -64 399 175 -242 171 236 -453 -147
3234 -147 350 52 -26 207 -94 -292 70 102 -36 349 339 -365 -145 -338 -436 -47 335 14 -197 400 304 -408
3256d08K07R4j84L35K29l43j13L67k19k53L56J5j76M41l85m73N12j06k51K66L65
3277B76k70p0L76p05j06N43k5j98M73j85m12K34k9l56J45K96r8M8L52m21j03O86
3299D51l22m65M50r7k95K53L82o47K85K72j87k55M13j15m17L47J55l74q0K04o4
3320a06K05K20k69j51M84n78p8M98r5n70P73Pm33J23L43o13J40K50j05oL20k98
3342F1m31L67K86n30J91M05l32K95J26p22L10L8k40K79M78l63k11J45J32p36L10
3363a42N39m01O9L04l57l32L74m6m66N39Q4l42J79J89k68j4J8Qj04M37j68n20
3385d20L39J08m53O33K42q34L21L34l51j31Q0n5p6K88J06m07M16p5l78K61K21
3406A69l54M7L37l72j74L69l2j34K65O7m76J96J44k79K6K19j09j75K88j3j44L74
$$ plain form
3256 -408 -201 -107 -291 44 273 -70 -183 184 -35 -288 68 83 -93 348 -37 -510 2 -104 -355 -89 276
3277 276 6 -64 312 -393 -499 44 19 -179 294 109 -303 -69 -98 -454 -309 -13 -111 -63 289 -132 -235 451
3299 451 129 -336 114 17 -278 -25 357 -290 -5 267 80 -175 238 123 -294 53 208 -166 -246 -42 -106
3320 -106 99 319 50 -101 383 -195 -273 225 130 -440 333 340 -93 30 373 -240 -100 150 45 39 359 61
3342 61 -370 -3 283 -247 -56 349 17 312 438 -284 26 64 -176 103 581 218 7 152 284 -452 -142
3363 -142 397 -4 65 369 12 -320 54 8 -458 81 165 -177 2 191 -77 -91 -73 -65 -169 268 100 -420
3385 -420 -81 27 -426 207 449 -385 -64 270 -81 -212 -132 -187 -263 25 131 -276 140 65 -313 -52 169
3406 169 -185 -138 199 -173 -347 22 -10 -144 121 188 -288 -92 52 -227 -201 18 -91 -266 22 9 -135 239
3428B39j05k71J36p9k23O0N53l58LM08l15k74L55m5k62M13J0l73J46L39m70j76
3450b89O28l66j28M17j67k17J65K5k29K14J53k67J66K72n87o8L61k40Q8L07K8
3471B66j68K38l3p52L45K98k37n4L88k13k67L66j01j38L95j58j25N5J40m27N5
3492a27M84l30n5J13j70nK1J91k79RJ94k59K18N9J0k48M02k40j80J10j26r0M24
3515A26k3l29K47K04n13J33K65k06N3J3P9k38L32J99n58K37J29k33j67L10j61
3536a01j2J19j40O1N5J91m52L77k7m53K80K76l08j40N81j42k38J11Q6l07K73J77
3558B67l35N4L12l59j36L14n9r9J08j19k33M03Pj91J85l2k06L58J18n00k04P92
3580D45m39j15J07J6k8L91k4n47J24L69l91O0J81l0j52K20k13r8L20j23j16J24
$$ plain form
3428 239 134 -137 -1 -80 -303 -243 310 -48 -45 363 48 -226 129 84 -178 235 245 -128 18 357 -113 -289
3450 -289 339 -27 -155 262 95 -122 43 68 -161 53 206 -61 105 377 -210 -278 83 -157 -69 238 266
3471 266 98 336 303 -449 -104 194 -43 -97 291 78 -189 177 76 -62 333 175 50 105 245 -182 -127
3492 -127 357 27 -28 85 -85 -90 -69 122 -157 -148 46 -213 5 64 74 -174 228 -12 -192 -82 -208 -298 126
3515 126 103 -226 21 225 -288 -155 110 -96 -43 -30 49 -189 143 342 -216 21 150 -83 -250 60 -101
3536 -101 -113 6 -134 -73 -18 173 -279 98 71 -382 -102 174 -134 -274 307 165 -73 38 124 -183 90 267
3558 267 -68 -14 298 -61 -197 117 58 -41 67 -52 -285 118 125 -66 119 87 -119 239 357 -143 -347 445
3580 445 6 -109 -2 14 -14 377 353 -194 -70 299 -92 -32 149 119 -33 187 -26 -124 196 73 -43 81
3602H1k6j95l8M87l59j01K94n0l07L37m9k20J90J10k77P6J43k27J20J73ok1l0
3625A05j57j28J88K4k62N99j23k77l4J87j81j73L70Q4m44K65J26l07J03J65k30
3646a00P6K27l43k41L84M4k96L93q0k81L05Kl56J00K23k07J4J46j47k12M69J81
3668C01o61L78M8l54L38p0J0p6K56l38M0M26k13k26L45n1l33J97M3l41K44J82
3690A45j66m4J79j06j08J45J9j77o6L25k67J08K11l86J04M50j96J2P0j57r3K00
3712B02Mk37J93K00k66j48J80l82L31l4j7j14J81j12P7j02J24k64K11l9J38qK13
3735C31m06j05L70r7k21J72K14j79k14L07j86n5K37k36o1M5L56l75K98m4k76J74
3757D9P3l25J31K68l77P2K88j67k19K67j77P2K26%n42L88L53n95J3L96k87j0J38
$$ plain form
3602 81 55 -140 -178 309 -50 -151 143 93 -214 123 74 -146 44 154 -123 -47 96 -131 -11 162 156 135 105
3625 105 -52 -180 8 32 -230 369 246 -31 -65 122 -59 -232 138 222 -222 43 169 -138 -35 130 -100
3646 -100 -24 203 -140 -381 3 47 -249 144 64 -217 88 90 -266 -166 57 -150 -136 10 -137 -349 120 301
3668 301 -360 18 66 -288 50 -20 -10 -86 170 -168 -128 298 85 -141 204 153 -180 17 60 -281 -37 145
3690 145 -21 -65 114 8 -100 45 64 -113 -179 146 -121 -13 198 -188 -84 366 170 182 252 95 2 202
3712 202 206 -31 162 362 96 -52 128 -254 77 43 26 -88 93 -19 58 -44 80 -184 27 -12 126 118 331
3735 331 -75 -180 190 93 -128 44 258 79 -135 172 -14 -69 168 -68 -129 -84 272 -103 195 151 -125 49
3757 49 122 -203 -72 196 -181 -109 179 12 -207 60 -117 -45 181 181 -361 27 380 -215 -202 194 -93 -103 35
3780C5k88L2M01%k53O6J99m70O4L38j75l07M79j07l21L73q1n8L7J83l36nL07k36
3804a23l8J99j11k47L10J31k11J31Q4j19L3Q7k85K54K91n99K81J17o2l71M29M8
3826B29l32K69j28j75K23O2p7k06M06r6j30M3K49m81J71L31n27J76J95l61mK12
3848D9n7j49N16j99k75J74J00k17P3J97m17K53J71l08m9K56N5k82J05R0k70L39
3870A55m2l50K27K22l84QM50k36k87J96j2j30L3J58N3K4J11k32N5L1l49K20L3
3893d6n1j40J98L68k59j59Q6j5J71j10r7N4O3j00j39L73l34k42J90K79l44k7N44
3916B63m43P4M60l84j6J03K81m28P7K02n36K36K41l94R4N51j64k28K76j48l20
3937b03K39J41k74K24P5l42k7K68j13J3L9o3M9K97l06k11J83N5k39K47K89k75
$$ plain form
3780 35 -253 -221 180 180 -73 -7 192 -278 -214 124 -51 -358 121 14 -307 66 -15 -73 -36 147 -189 -194 113 -123
3804 -123 -161 38 -73 -320 -10 121 -90 41 125 6 39 126 -159 95 386 -213 68 185 123 -248 181 229
3826 229 -103 166 38 -137 86 148 71 -135 271 175 45 88 337 -144 27 358 -169 7 202 -159 -163 49
3848 49 -8 -157 359 160 -115 59 159 -58 15 212 -205 48 219 -89 -138 118 173 -109 -4 86 -184 155
3870 155 113 -237 -10 212 -172 -164 286 50 -237 -41 -53 -183 -150 8 61 85 196 -36 19 50 -299 -79 -46
3893 -46 -97 -237 -39 329 70 -89 -3 -18 153 43 -54 0 63 -37 -176 197 -137 -379 -189 90 -254 -281 263
3916 263 -180 -106 354 -30 -46 57 338 -90 -13 189 -347 -111 130 -264 -170 381 217 -11 265 117 -203
3937 -203 36 177 -97 127 202 -140 -167 101 -12 1 40 -23 26 323 17 -194 -11 44 -195 52 341 66
3959F6L2J42k14j26J44J18k92M49j24k23l8K7j52L71Q6l41K98j77j95n5M09j23
3981H2m7J05J3l94J85L16m33J28K44L5l63M53k00k84K47l3j01M8K22l20J84J43
4003B30n51J14L72k79j34K06J38l80K59J62k75o9L37k31j55L81j74k95N43r2k44
4024a37l9K85q5k06K71k58J60J70k95k46L26O8r1L3K6q5J14J15l71Q5N75m48j08
4047a41N22k81m36K24J93k37L63k96J53j9k9j6m8K76k36k53L56j08j38J63k5Q
4069ek1K13j74j23K25l28J11J88J80m93L82J18l41J51mr6L12k31j42M0K22p8k58
4092a52L2K01o3J13j0q5O2J93n91K76J66j76R7J8m5j51Q5P4l36L86j11n3RN9R6
4117I4l40N38m22j01K86%j80J45m3k62L69k2j81o2M89l74%K33m35RK09K06l16
$$ plain form
3959 66 98 240 26 -100 44 162 -130 319 195 -28 -66 -39 -191 180 266 -75 223 46 -149 -204 205 82
3981 82 35 140 153 -241 -56 260 -173 -45 199 234 -129 324 124 -160 87 54 -47 1 223 -97 87 230
4003 230 -321 -207 165 -114 -248 -42 96 -284 -25 137 -138 -207 130 -101 -256 125 -49 -344 199 107 -137
4024 -137 -176 109 24 -182 89 -169 -9 161 -134 -380 -54 14 -77 -44 -18 -103 11 126 -245 -160 415 -33 -141
4047 -141 381 100 -336 -112 81 -156 207 -89 64 45 16 0 -48 228 -8 -261 95 -13 -151 12 -13 -5
4069 -5 -26 187 13 -110 115 -213 -102 86 266 -227 155 273 -68 83 79 -17 295 64 -78 -38 184 106 -152
4092 -152 -120 81 18 131 121 36 98 291 -300 -24 142 -34 63 81 36 -115 -30 44 -292 94 -17 -70 -61 -2 94
4117 94 -246 292 -130 -231 55 55 -125 20 -23 -285 84 62 -119 -181 308 -66 -66 167 -268 -259 -50 156 -160
4140a60J53J27j41j17J42kl13J49K70P7k67L15l22K16j34l71K59K85j10j04J65
4161A17k46O1q3J03n1K21j2l02K61L2l10M1K46l56K05J99Q1l14KJ19k27J61K63
4184B11k79M8N6j38J21Op7J44J16o2j40n9K50k55J86N0k46Q8J16q1k34L91j49
4207F3p6J36L12o03P9L89m73J47K13l00k2K21j89qK33Q7k42M4N0m45J66M21k26
4230b3j92M40j85j5J65j55l7J21J38l52K08J3n8r3K89j65j55K19n5j51J17L2m36
4253c30K56J42k81K06J20l21q8N60j52j99K44j01j57K9Lj83L85r2J30k95K59j92
4275e7j11L00k77K4J61J24m80L84q2j35J5j8N4n3K77n6k32J17J07j25R5J53m06
4298b21K71K2j14j73L24j20j90L30k02j81L91k8k88L5L37l03o2K12M2j26J47P0
$$ plain form
4140 -160 -7 120 -21 -138 4 2 -311 -162 108 185 -82 233 -89 127 -7 -378 -119 166 56 -48 117
4161 117 -129 -68 -151 -48 -99 122 110 -192 69 101 -209 -168 78 -278 -73 126 207 -107 -105 14 -213 -52 211
4184 211 -68 -20 36 -102 19 25 -52 92 208 146 6 -53 197 -58 128 178 -68 20 136 55 -179 212 63
4207 63 -13 123 435 -168 -89 300 -173 -26 187 -113 -135 86 -103 -111 122 209 -33 11 61 -384 -218 203 -23
4230 -23 -215 225 40 25 190 35 -2 119 257 -95 113 126 68 -25 264 99 -56 163 108 -43 74 106 -330
4253 -330 -74 68 -213 -7 113 -208 -296 264 112 -87 157 56 -101 -72 -69 -252 133 41 171 -124 135 -57
4275 -57 -168 132 -145 -121 40 164 -316 68 -14 -149 -134 -152 -98 -151 126 70 -162 -45 62 -63 32 185 -221
4298 -221 50 72 -42 -215 109 -11 -201 129 -73 -254 137 109 -179 -144 193 -110 -172 40 82 -44 103 173
4320A73l71R5J60j97J15J26k85J47K67l66O6L17m9k54J72J7k31K58J7k29O2K58
4342B68k94j23M32k09l5r0P0j69J97Q4k55L63j43k34jJ47l6q8K49J09m54K99r1
4365dM2o8L09j96j89L01j46j22K25j31j10O1P0j55k9J36q0J82k13q0K22J73n10
4388c12J62J48O6j44J07K7j71J63K58m75r5L66k9k95K48k7j61M2K61l94J82M61
4410C88m50r3K51r2o5R9l7j23K34j97o2J95J16k60o3K72k03m8L44k45j61K71M8
4433A19k8L3r6l24K27J94k78K66J57l73R4K7J0k8J40p5r1J44m5j92K0K71ll00
4457a31L92p6j38J51j75R8m2L8l82L31J73k80q9N84m88l60M35J0J3J43j04k89
4479a86R8O1m3p0K61O7k04R5j36q5L29k48j3J94j09j44J76k0k09J97M1k32J95
$$ plain form
4320 173 -198 -103 57 -140 -25 101 -184 -37 230 -136 -70 247 198 -56 116 133 -98 160 177 -52 10 268
4342 268 -26 -149 283 74 39 -51 19 -150 47 131 -124 239 96 -138 -139 8 -28 -116 133 242 -212 87 -4
4365 -4 38 -30 279 83 -106 195 49 -73 152 21 -89 -28 42 -113 -142 -6 -86 96 -117 -197 25 198 -312
4388 -312 -150 -2 64 -80 27 54 -117 46 304 -171 -266 100 71 -224 24 -3 -164 -122 139 -255 -73 388
4410 388 -62 -155 96 4 -61 38 1 -122 112 -85 -147 48 164 -96 -159 113 -90 -138 206 -39 -200 71 119
4433 119 91 124 28 -296 -69 125 -153 113 270 -103 -9 18 28 0 140 65 -26 118 73 -119 -99 172 169 -131
4457 -131 261 185 47 198 23 121 79 117 -265 66 239 -41 -130 454 -34 -394 41 51 64 207 103 -186
4479 -186 -88 -27 -70 -140 121 188 -16 79 -57 -142 187 -61 -74 120 11 -133 43 23 -186 11 52 -180 15
4502A5O6j48L7KK05l96J62L74l30J56R4m58P8J28r9o5K19J5j29O5o8q4RK67j63
4527d8o2K53J4l51L08k9l0j17P8j80K21Mq8K2j25J39r3K46o1j97J11J53l32K09
4551D5O9j16j13L64m26K16J83k59j95K92Q4j59j45K42j52J22J44k78R8M0q4q4
4573a12%L19n75L44J01j29p8J37j39J0L28l14Q2K09J4j84K68l47l9L58r9k64K30
4596A20L8l01L80j34j01j5L05l44o0K64j96P0PK15l73m6L05j37O5M2k15J2K72
4619A73n1k54J33L86k05l11K81k01Q9Rj72K05n9K49n42K23L10m10k3J90q8J82
4641A14Oj90R2p4K8L3n1n4R4mJ12k07P5J45j09j12J43J00m80K65j14N2P7J2L1
4666a6l6R5j9j54J47rj64N5J24k11J37J39r5N0O3r1k8R3l20J07J21N0Pp5Q7N1
$$ plain form
4502 15 81 -67 -30 -28 177 -219 -57 317 -13 143 237 -221 -143 -15 -114 -179 40 55 -74 -9 -77 -161 -152 115 -48
4527 -48 -110 143 157 -194 114 85 55 -62 16 -164 57 61 -27 -5 -130 9 -84 162 101 -96 15 168 -164 45
4551 45 114 -2 -115 249 -177 39 222 -37 -232 60 144 -15 -160 82 -70 52 196 -82 16 56 -28 -112
4573 -112 -112 207 -368 -24 77 -52 -130 7 -132 -122 206 -108 -26 183 197 13 281 -66 -105 253 154 -110 120
4596 120 158 -143 237 103 2 -13 292 -52 -112 152 -44 26 33 248 -125 -171 134 -3 62 104 -111 -99 173
4619 173 122 -132 1 387 182 -129 152 -49 40 49 -123 82 23 272 -270 -47 263 -147 -170 20 -68 114
4641 114 120 -70 22 -52 -24 9 -42 -96 -2 -6 106 -101 -26 119 10 -102 41 141 -339 -74 -188 -136 -59 -47 -16
4666 -16 -52 43 24 -130 17 8 -156 -101 23 -188 -51 88 -7 43 106 15 -13 80 -240 -133 -12 38 45 -30 57 108
4692A08j66Mj54K96M3l07K21M6j39n3J86J01r6k25J56j1J5l9O3l8J32j15n9J89
4716A58k57J39j84M69l46m6K69j90p8J97j04l8J38k29J02N7j19j59L02N7k65L2
4738i5J62j05Ok8Nj00L25p2k57N6m3J25O4L4j65l5K52j74m0J88N1k82J01J00l58
4763b85K26K00l79J72J34q2k02L51j39j79J99J27l85K89P5j81J28l61J29J80J64
4784A81k4k44L46k40O6j54n8j22P8K06k64L21L41m86jO3j67M4K19J3l82L92j73
4807d5PO0J92l24J88K7q7l5J93j55l4m7J0R9P9j72k82J79L32j07j84L31m07j08
4831b90K83K11k54K47j2r2j12K66j99j56R5L1m0k3N4o8J77m2j86l4L97m13K6L67
4855B33j52k19L9K08k65K50j53J3J56p0p9Q1J50k97K9p1k2J13J41j81n0J77J11
$$ plain form
4692 108 -58 -54 -208 88 131 -176 45 91 -48 -101 85 186 90 -135 21 10 25 -14 49 11 143 28 -31 158
4716 158 -99 40 -144 325 -21 -67 202 12 -66 131 27 -11 127 -102 0 57 -62 -221 81 138 -127 -95
4738 -95 67 -38 -32 -60 -55 -155 170 98 -159 -103 -146 -21 43 77 -88 -123 129 -45 -85 103 154 -128 -27 73 -285
4763 -285 -59 141 -238 -66 68 -14 -216 135 -4 -183 16 143 -242 47 122 -59 69 -292 -163 17 181
4784 181 157 -87 259 19 85 -69 -127 -249 -171 35 -229 92 433 -53 -54 9 -158 -114 105 118 -264 128 -45
4807 -45 -38 22 214 -110 78 105 18 -17 176 21 -13 -60 -50 49 128 -44 -326 -147 185 78 -106 225 -182 -290
4831 -290 -7 204 -50 197 185 93 -19 247 48 -108 -13 18 -22 -45 9 -59 118 76 -110 -144 253 -160 -134 233
4855 233 81 -138 -99 109 -156 94 -59 -46 110 40 -39 42 192 -105 -76 -147 -169 -56 85 -96 -146 31 142
4878A42j93O8J19j71rN7Q2p9J66l27m9K77M4k76M0J13j89L78M0k70J55j4k3j48
4902f7L9M1k16J50Q0j87K38J80l87j06N41l07j67M33l54k34K10J52o3m5J30j1
4924E0j63K69k33J5K04n2k36J11J59l08J51J03j73K46J08j81j03L5J1k52L89o5
4946H5o8o6J78j70P0K38l50M6P6M0k26R7j4m6R5J06j46K00J23l51j74L12j37K0
4970f2R5J91n30J23k9J36J62L3k46M5L9J41p1O0p3q9P3n3J24j12J52o8k9j2J03
4995A03j96L6J35o7R8p0j83J58J88k29N2J75l21P5M9J05j93M7j60K08j94N8p2
5018a98J35P4R3j09J77k51NP6J1J0m1Q6q6R3m2j91K16p3K0j70J58LJ17M5M1l61
5044a62J53J15j90J43q3j66L52j15m8j49K33j34J14j45Np1O1J92r1j18J91j49
$$ plain form
4878 142 -51 17 136 -35 -44 13 95 16 182 -145 -194 83 127 -149 -109 4 -185 193 233 -37 118 104 81 -67
4902 -67 -28 13 -203 -53 27 -160 78 258 -129 -235 306 -1 -168 265 -89 -323 -113 39 -24 -69 61 50
4924 50 -113 156 -77 -62 142 90 -146 -35 124 -184 -33 70 -103 143 251 70 -33 2 13 -239 150 85
4946 85 17 -49 129 -41 29 267 -83 -37 39 79 -147 -50 -64 -110 -15 91 -55 145 268 -83 -257 55 -82 -62
4970 -62 33 224 -306 -183 -212 -76 86 119 -127 -82 -43 98 27 87 14 -75 -2 -55 69 -43 109 41 12 0 103
4995 103 -93 -57 78 11 109 39 -144 14 202 -27 25 200 -121 -46 3 108 -85 -38 -198 10 -184 -126 -198
5018 -198 -63 11 104 -5 172 -79 -74 2 13 23 -18 68 -18 75 33 -158 58 -15 5 -165 -7 -4 113 158 199 -162
5044 -162 -9 106 -84 59 -24 -190 162 47 -1 -150 83 -51 63 -82 -77 -148 -87 105 14 -104 87 -62
5066f2N4Q3j34J04j15K21k45O6m9J07n9R2j01K58j62r9rk3K20r3M4k76j3K41k5
5091B5j01J61N7K4m7L7r5j63K47j08j22J52P0o6r3p9j5n4K78O4j17q7O8l58M68
5116A46L00n58K1L87n80J92m4K10k78L03j42j14Q8J17o9K04m3k78K49j66L3q6
5138a08K40l49J38J41l38J89oL44l05r9J49j63J64N5r2p9J50M0p4o9K27k71J41
5161B5J62r2p2J44k38lJ97j30R5J80j74j36R8J27m29J77J20J57j84M1J76m44J37
5184f6J22j96K17r7rrM3l5%J07k11R6M6Q6j23K55j70j85J72k0k64K95l0P9j97
5209i4J91n8nk19L58j67J57Rk81o9J84J41r1l4R9j91J66Q0j47j32L91j82r7K94
5233C03k14j01J35n6l6K18k06j07j02J32P4J3j62J09L0L7J15k21nm0j05J39Kj02
$$ plain form
5066 -62 -8 75 -59 45 -70 151 -94 -28 -77 30 -29 63 -38 220 58 -41 -50 -73 147 54 98 -178 -191 50 25
5091 25 -76 85 142 166 119 156 61 -102 145 37 -85 67 137 71 -22 -101 -116 -170 108 172 55 -32 36 -322 146
5116 146 446 -112 -91 296 -284 -92 -136 74 -204 99 -43 -157 -69 48 -21 183 140 -138 111 -55 -22 -108
5138 -108 132 -217 -79 62 -276 -87 -93 251 -54 -153 -4 -167 -3 52 -40 -119 31 71 -3 -72 155 -116 25
5161 25 187 95 23 167 -71 -74 123 -7 88 268 94 -42 56 183 -246 -69 51 208 24 65 241 -203 -66
5184 -66 56 -140 77 -20 -29 -38 5 -30 -30 77 -134 -38 8 94 -29 226 56 -129 43 23 -241 54 24 103 -94
5209 -94 97 39 34 -185 173 6 163 172 -109 -178 6 147 56 22 121 -70 96 176 29 -103 288 106 9 303
5233 303 89 -12 123 67 31 249 43 -64 -166 -34 40 53 -109 0 30 67 182 -39 -44 -84 -189 -50 -48 -150
5257a50L73q7j62J89R3l19r8O4J76k68K78l4j69J83j8n1p6K31m7j06J22k46R5
5280b7P3k73J44J57l5j31rJ57j54M4K13r1j46L3m4j3K17k83n8J96K06K0k43J56
5304A09k59M3L30r3j94M5j06R6K3J35l49L4K29m0j07K27j59J18k13R3J89j00n6
5327eJ19j80J05J9N2j54L01l45Q3j50N0K14r5p8O5M8k43O6J54J78k70K82k65J77
5351A28j13k5k2Q5J6k14K19j15Pk4K47l12K77o9P4k70R7O2l03K95j14J72k17P1
5375d8N1r2J79k23p3K51L9k16J36Q4k15J02M2J38j45k1j36K00l5lj81K31n8k3
5399a6k74K25R0O4J49l27J19l6j0n7J58j25J04p0R4j12P4q0j68J21J21R5o9J25
5423A95l02J24K4j05J68nOo4j79J01j3j47L05r2J66j91k6K1J10j2q7J36J70n15
$$ plain form
5257 -150 223 136 -26 163 256 -63 -161 -97 79 -189 89 55 -114 69 51 0 -76 155 108 2 124 -122 -27
5280 -27 46 -227 -83 74 39 -92 -101 56 -98 -54 159 68 -78 -45 -89 -102 115 -168 -226 -30 176 196 -47 109
5304 109 -150 -107 223 130 -64 -19 -125 -29 -6 129 -220 -186 43 3 -104 123 -36 82 -131 -38 151 51 -5
5327 -5 114 -66 39 58 110 -44 257 -88 -5 -155 -105 109 14 -64 1 49 -194 -128 26 204 -66 216 -49 128
5351 128 15 -10 -32 53 69 -145 74 -41 -34 -58 189 -123 154 85 159 -111 -14 48 -255 40 -74 98 -119 -48
5375 -48 3 -89 90 -133 -206 45 84 -132 4 88 -127 -25 17 155 10 -11 -147 53 18 15 -166 65 7 -16
5399 -16 -290 -65 25 89 238 -89 30 -6 -16 -73 85 -40 64 -6 88 -24 50 -30 -198 -77 44 139 70 195
5423 195 -107 17 41 -64 104 99 105 41 -138 -37 -50 -197 108 16 182 -9 -35 -14 96 84 -3 133 303 -212
5447b12O6m9J17J51o2m6q4K34j02k45K07K75l58j4K44j62K11k05O4m4k6R1j07
5470e6J50Q1k6j72M8j34M9J54mk67L07j53l12K64L59j90q1J59k17K39k13o9J34
5493E0J06n2j03P6j63m0J72Oj76P8J83j19q9J37m6p3K84j82k36K23K6r3J47p5
5517D1l3j43K61j08n1K84k97J5J36m2k27L83j62j14K27j43P8p4J08j72Q3n9mn5
5541f8J07p3K8K2j57K84k45L60k90M5J20j07j2P3j49j37P1J72j29J01o8R4k33
5564a91K88J46l99K10J55l30n6J21j68J17M7J29O9o4N7k93J05M6j26J55q1qJ9
5587e2R9j31K20o0N0j18J18rk06J27K4n9O5J75k16r5kM0O5M3j98j3J84j86L59
5612B24l89L35k08N9MP2j91J18l0o7L90j87l08K45j03r5J80q8PK0R5j68J04J44
$$ plain form
5447 -212 -146 -195 -78 73 11 -35 -119 115 13 -232 -25 250 -108 -122 122 -40 171 -34 30 -14 -40 51 -56
5470 -56 94 175 149 -23 25 -109 -60 94 90 -177 130 -23 -335 -71 288 98 17 176 -41 198 -15 -84 50
5493 50 156 104 1 77 -86 -126 46 52 -124 -46 137 18 -71 66 20 -53 231 49 -187 36 62 -31 116 41
5517 41 8 -135 126 18 -33 251 -46 -31 105 63 -164 219 57 -57 170 27 105 31 139 -33 50 -9 -13 -68
5541 -68 39 -34 -6 16 -141 143 -102 258 -32 13 133 26 14 87 -62 -199 -128 44 -85 16 -52 42 -191
5564 -191 97 243 -156 54 209 -121 -177 -56 -224 -107 -60 69 138 74 131 -162 -57 -11 -137 18 -63 -71 -52
5587 -52 47 -84 136 76 126 8 126 117 -89 38 62 3 68 243 27 -68 -70 -30 35 78 -120 -133 51 -135 224
5612 224 -165 170 -38 21 25 97 -94 24 -6 -73 317 130 -178 67 -36 -131 49 -39 -32 -12 83 -85 19 163
5636A63q4Q9j82m5k8J71m1j18k23K52O8KK3k11J15o1J74q8J84j95K8m9J78n0p4
5661bp6P5J2M1j3m7Qn5j57K68l2p8J16j12jQ8N0q9j5K7Q7j14K3N3j51q3L58l1
5689A50k21k5J47r3j0J03k84L29J20k77K04j81j21N1P9J89k5q6k9Q4L3q5j6r7
5713f1M7J13k8k0j42J4J53j5o6P8n6m2J44m4j32N9J84l6k93K06n9r1O6J14k61
5738a68L94k32M6m7r6j8Q1J95k30j16M81k86k99K46J03MM3j32k54K42J33p4K4
5761D0J09J8l29J13K92l26l5oM4J60n5j86o5K68R0l31M17k76j10J15KQK41j63
5785C5J8O3k33jJ34J9j58L47j45o6j10J68p1j07J81M1o0j50K28m5J2L8k42L9J97
5810A32q9k02Q2j8o4J27l5m1R3K84l41LO3J15j79J72Nk96J60R6N5j83K77k20q2
$$ plain form
5636 163 79 168 -14 -59 -87 84 43 -75 -298 -46 22 24 47 -164 -49 -110 64 -24 160 -35 -7 -56 122 72 -2
5661 -2 -78 -3 9 50 37 -10 -2 -57 -214 54 22 -56 60 -52 -53 35 85 -4 -19 8 95 -19 4 57 -94 -177 181 150
5689 150 -71 -96 51 -42 -52 51 -233 96 216 -61 143 -38 -159 -108 -29 160 135 49 20 104 137 52 36 -61
5713 -61 -14 99 71 51 -91 -77 76 61 -5 73 17 -25 119 75 -57 2 186 150 -143 63 4 -87 -21 93 -168
5738 -168 226 -6 40 -7 -103 -121 -40 155 -75 -191 290 4 -295 -49 54 58 101 -31 -285 -43 90 16 40
5761 40 149 167 -162 -49 243 -83 -118 -124 -80 80 25 -161 -226 42 132 -199 218 -58 -168 -53 -51 -43 198 35
5785 35 53 116 -117 -118 16 35 -123 224 79 13 -97 71 0 -107 74 115 55 -95 133 88 100 138 -104 -65 132
5810 132 43 -159 -77 -95 -159 -32 -67 -108 -15 269 -72 -69 -6 109 -70 102 107 -189 -29 67 122 -61 216 -4 -86
5835h6J58j01J26j77J84l32J92O2o1k9J1K53k10N5j00QN2K5kj22J30n1n8k2M1
5860e4J00k4k4j98J81J08k7j7R1k44J68j88J03L3j26r8M2K78j38K8k87L27r1M2
5884a5RmJ9K1%m7J03J3m7l1J3N6p1J35k64o5J16q8n0M34k74j76K32k74L27J34
5910B06n8k64J33k19m6L34n2pk48L11j22k4j1J3P7q9K75k28J45Nj43p5J02j85
5934a70M9J67m8N8J08k42j18K79O6Q6k65J42k4r9Q5J9j60J52k89K34O1J4j35J30
5958A00j03J51r1o3O8N3j29K7nk2R4k17K89k52J59j97J68J56j64O3J6j92J76k29
5982a44J08n2R4rK7P6o3q0L31l67RP2NN0k1Q2k9k22Q4M9J01r2j79J84r8P8j9p4
6010i9J15j85L15j86q6jK85k68m0N4P1MP1o4J18j94O6J15K4j24N3n4J05k57n9
$$ plain form
5835 -86 72 -29 97 -80 104 -228 -36 26 -35 -64 -53 200 -10 45 -55 -47 5 30 28 -94 36 -15 -73 -95 -54
5860 -54 46 22 -2 -200 -19 89 62 45 136 -108 60 -128 -25 8 -118 -216 -174 104 -34 -6 -293 34 -57 -15
5884 -15 -6 -10 9 30 30 -17 86 99 52 21 34 90 19 154 -110 -175 -59 -147 -197 237 -37 -213 19 -255 72 206
5910 206 148 -116 17 -202 -248 86 34 27 -221 90 -32 -56 -67 -54 23 -66 209 -19 126 131 -12 -87 15 -170
5934 -170 -121 46 -2 56 164 -78 -196 83 149 235 -30 112 88 -11 74 93 -67 85 -204 30 91 105 -30 100
5958 100 -3 148 57 -6 62 115 -14 13 8 -14 80 -137 152 -100 59 -138 30 186 22 85 101 -91 85 -144
5982 -144 -36 -88 6 -3 24 100 37 -43 288 -79 -70 2 7 57 36 118 89 -133 -49 0 101 9 -170 14 -84 -6 -25 -99
6010 -99 16 -169 146 -40 -126 -127 158 -110 -150 -96 -25 -21 50 -14 104 -90 -24 91 115 -9 44 -10 95 -162 -221
6035b21L41r7j22O3J14j41J38o2J56j31J31j56L1l9k1p0k2JJ14r5J44k34J70m7
6059e5r4L8J31nj09N2R1qJ80j83l9J29K23n91J26K05p1j0N2k14J11r2J79j58J19
6084GJ16k29L9K0j11J44J11j74J7J35l6k3p1J66l6j67J98j32M2ol6R3l5J93k63
6109c8J25j23j0j29K69j05N5J30j93J0K5J09k68K08Qk11K9K75l86L82l01J41j28
6132a26M5J30q5K36k02R4k35K02k64K45J00k46L43j44k52LK36k12J82j83L58k47
6154b2r9P5l1M4K5K0M4n9J6o8K55l25M7J04j11L0n1R6m6j2J13r7O7O3k08KK62
6181A34j9R8m00K14K5j43Q8j61Q1J43n5L7Q3j1q5m4J03j43M4J20k25J77Q6k35
6205h8N4J74k15J70l8p4j7%P3J92j22n2o6M1M8K68m75N7J87k49J96J44k94M8j7
$$ plain form
6035 -221 120 23 -99 -36 78 -63 75 13 169 38 169 13 44 5 -16 -86 -108 -107 7 -88 56 -178 -8 -55
6059 -55 -149 -111 20 15 -94 -42 49 41 221 38 -1 128 351 -240 -114 91 20 10 62 -152 -41 -133 46 -112 7
6084 7 123 -106 -67 -47 -158 -14 97 -77 -60 75 39 16 -55 111 75 -92 106 -26 16 10 -26 67 32 225 -38
6109 -38 87 -36 -46 -175 94 -11 44 174 -19 -9 16 125 -143 65 73 -138 -109 166 -220 162 -139 2 -126
6132 -126 -81 49 -36 200 -2 92 -143 59 -205 40 140 -106 237 93 -159 -156 80 -132 50 -133 225 -22
6154 -22 -121 -46 -77 -33 -8 12 56 -3 13 -55 200 -125 -78 26 -85 -55 -106 -10 -56 -68 45 -52 15 78 -130 -128 134
6181 134 115 213 -187 27 52 -91 -3 -164 -83 60 5 42 125 114 29 -15 88 -55 -11 109 -116 61 147 -88
6205 -88 -34 140 -75 95 57 -17 -34 -34 39 231 109 57 -9 32 80 348 -127 -70 117 -132 64 208 -86 -38 -55
6230e5J01K1j35J85r1P8r8J48P0j45k10j9K32j51K80m15L6kL41j25k17K76L2q9
6254D8Pj8k2J3n4j71J23OO0O6n3J25j89J62j35p3J19J75k93J18l8lj93J95J20
6279I5k32R8K2q8L14J10l02j20J90j64k3m5L5N5L29l03r6j2Q9M2P2M9n4j05J35
6304I1k34M0O0p9j2J59J71l61m2K24K11l33J28j07k4J22NJ90j05k73J91k51O6
6327a63N5K36k53K32K0j53ol2K17nk05J42M0j15J81p3m05M06rk29K51R2j46j82
6351a04J73N6n3k16k0J45q7Q6j90J78O7j16M5J15M1r0j13R7L1J4j21j26J47K03
6375A62j64J68k21k1J0J16p5J69j03l5J35j82j33K88j62M7M0j37N3L8%q4K1M0
6399c0j34L83m8m37K40J47r2k26J40j00J08Oo2K23j77l3k24L77jj92J14O0j6l6
$$ plain form
6230 -55 46 67 -68 117 26 104 6 154 224 79 -131 -150 82 -69 211 -204 -168 -170 171 46 -171 105 137 48
6254 48 55 37 15 28 -26 -197 -74 -68 -8 58 5 130 -59 103 -32 -105 14 189 -104 14 -24 -27 -220 -25 95
6279 95 -137 -39 -17 -105 209 319 17 -103 87 -77 -100 -145 -110 -55 274 -29 -125 -137 -48 -6 66 115 61 -44 91
6304 91 -143 -103 -43 -122 -134 25 196 -165 -207 17 228 -105 23 -84 -108 14 19 209 104 -169 22 -229 -163
6327 -163 -108 128 -125 107 127 -26 -32 -64 153 148 -57 85 125 10 191 118 -287 119 110 -119 132 224 78 -104
6351 -104 69 125 72 -144 -164 -19 -106 -20 -210 -32 35 -81 -36 79 120 30 -83 14 45 59 -62 -188 -41 162
6375 162 -2 166 -55 -76 -66 50 -25 144 41 6 141 -41 -174 114 -48 -1 39 -98 -45 -7 -7 -91 -70 -30
6399 -30 -164 219 171 -266 -26 121 29 -197 -57 -157 -49 -43 -105 118 -59 -92 -316 61 60 -132 -18 42 26 -10
6423a0J99l77R3N3Kp7J36J69k47J7J97j43N4r3R2j80J50p2L8r2J26M8k55K78m8
6448E8j00rl0n7J08J00j0N9j70j0j0n1K8J61Q1j56N1J69k50M9J45l19K88j3m1
6473G1j44m2P6j02Q7J09K5p6M5k65K37K7k8R3o1j10j09J34N7j00P6q7K4J27n5
6498IR5j63j0J41j77J4Q1P1O0j40K2j77J26K03l35K43mj91K83k80O4MJ66j42K30
6523A93j32j6J51j40j31j5N9J92j0O7m43J55J67j63m2M7J04J6o3J50m1j94J45
6546E6O5k71K07j3m7n6J59j22n0J0k5J40L5K4j20m3J35q9k7M8o0M3O8j20k38N44
6572B53j14j58K5J23k8nj33p2J25m2M9o4J18P2m8k20K22k16k0J39q6o3Q8n6k0
6597a31J24o8qn4J38K6j06J62J80m18L08k47l9J39J5P7k7j91J01k4N5J5o6K32
$$ plain form
6423 -10 189 -188 -95 -42 -40 -117 19 188 -59 -42 155 12 66 -27 65 -115 35 -37 1 -91 35 83 -172 106 58
6448 58 -42 -51 -81 -138 -30 70 60 119 -51 -61 -71 -122 -94 67 148 -8 43 212 -38 11 156 -163 125 112 71
6473 71 -73 -115 -39 -141 -54 55 80 4 49 -216 21 48 20 113 52 -58 -167 -33 24 -76 0 -87 -63 64 9
6498 9 104 -59 -69 72 -105 -91 -10 61 121 -19 3 -174 -48 155 -180 63 59 -132 151 -129 -65 -61 105 -37 193
6523 193 61 45 196 56 -75 -90 -31 161 151 218 -225 -70 97 -66 -108 -61 43 59 -4 146 105 -89 56
6546 56 121 -150 57 44 -3 -59 100 -22 -72 -62 -87 53 88 112 -8 -51 84 -5 -32 16 -44 -1 67 -53 -291 253
6572 253 139 -19 6 129 101 96 -37 -109 16 -26 23 -41 77 149 101 -119 103 -113 -133 6 -80 -143 -55 -111 -131
6597 -131 -7 -75 -83 -137 1 27 -79 83 263 -155 153 -94 -133 6 21 98 71 -120 -19 -43 12 27 -39 193
6621A93j85j6p9O4m2O5m2J86j85R1j48N7M5q3J24r9J36p5p3m4L7O8N8p0Q0k14
6647a51J52j14J08l03K57j65J80o0K5J17j38K47l3P5j37J9m06L08n4P3q6R2J33
6670A39r6MJ13j39N4j44J22m5n6j25K23N0k65J52Q1l6n7J43j36Pj55L85l31J12
6694@m4L6j9kL2r8%o9J43n4o2J13J91k22l3J10R0P2m61K89J94r0j30L7j01K2J42
6721H6p9J92j06k3j27L1PQ8r9J08o4j07J88L2k2J04o9n7%j93k3J90j73J34j73
6746a55N1R4Q8J63o7r9j91J14k25K48j84L5K03j37P2j4M5K1k7k6P7K7O7j50J1
6771D1j21m1Q0J04K9j02Q3j05q4L7N8q8J11R9n7q1j57J98Q2nn5j8J43j08J22j36
6797B9j36J54j04Q4Q9Q2l2J13m16j21K62o4k7K61j33j50nJ48r6J22l9o9L6J67
$$ plain form
6621 193 8 -8 -87 -23 -65 0 -42 144 -41 50 -98 -41 4 -79 45 -54 82 7 -66 -110 -73 -5 53 -17 63 -151
6647 -151 1 -113 -5 -308 -51 -216 -36 -96 -71 46 -92 155 122 197 60 79 -327 -19 -73 0 -86 6 139
6670 139 43 47 160 21 75 -69 53 8 -48 -173 50 100 -165 -13 68 32 -25 118 -18 -11 -166 219 -112 0
6694 0 -44 -8 -27 -29 3 -95 -95 -164 -21 -75 -137 -24 167 -55 -88 22 112 184 -277 12 206 116 -14 23 -78 -56 86
6721 86 7 199 93 70 -57 -26 -19 69 -30 78 14 -93 95 127 105 209 140 83 83 -110 -133 57 -116 18 -155
6746 -155 -104 -10 78 241 174 75 -116 -2 -227 21 -163 -128 75 -62 10 -4 41 62 35 9 86 113 180 30 41
6771 41 -80 -121 -41 63 92 -10 73 -32 -116 -79 -21 -109 2 101 44 -37 -194 4 86 81 26 8 151 43 165 29
6797 29 -107 47 -57 27 116 198 166 279 -137 -258 4 -60 -87 174 41 -109 -114 34 -62 60 21 -48 -12 155
6821A55l34M31Qk29N9m7J20j83N7o6l90L89j28Q0L37j85J01k98J56J6j86K79m1
6844A01j07J04o5n1j21J47qO1j40L14j40j7l35K42rK5r9p7P4J40k8j94J02k6K9
6869g8J39J06q0j26p5K05K01kj76J1j84m3K45k68j2K3J40m5j51L39j14o7J23k37
6893a26J40k47K10J86j79J35l69K05L16k32j30K71l81K10j65L91l04J12n1k4J14
6914H2j43J30k6Oj03K3J28k29J92j78J03m2k78L45q3J8J8j49P7K92l10J06N7J63
6938A99j48J4J10k41K66j5k45K06j79o0j68K63K7m3K7j73P6oj3J28j39J05j98
6961b07K17K2J18j54J18k04K4J22j2J03j75J48K4K1k47K4J0pJ0k19L72p8j92K81
6985A19r9o2j18J43P9j13p6J99j12k9j5K83j04j44M5j18P7J28k25L9J58l00L00
$$ plain form
6821 155 -179 252 260 31 90 43 163 -20 37 -29 -419 -30 -158 -78 259 74 175 -123 33 49 -137 142 101
6844 101 -6 98 33 -18 -139 8 0 61 -79 235 95 78 -257 -15 -24 1 -98 -175 -101 39 11 -183 -81 -107 -78
6869 -78 61 167 87 -39 -114 91 292 290 114 125 -59 -102 143 -125 -137 -114 26 -19 -170 169 55 -12 111 -126
6893 -126 14 -233 -23 163 -16 119 -250 -45 271 39 -91 180 -201 9 -156 235 -69 43 -8 -32 82
6914 82 -61 69 43 49 -54 -31 97 -132 60 -118 -15 -57 -335 10 -73 -55 -37 -186 -109 183 -127 -21 36 199
6938 199 51 65 175 -66 200 185 -60 146 -33 -93 -261 2 29 -14 13 -160 -84 -90 -103 25 -114 -9 -207
6961 -207 10 32 150 -4 114 -90 -66 56 44 147 -28 120 144 165 -82 -58 -48 -55 -45 -264 108 30 -162 119
6985 119 20 -42 -160 -17 62 -51 -127 72 -40 -69 -84 199 95 -49 -4 -122 -45 83 -142 -103 55 -245 55
7008E5k77J46J01j8o8K42k32L0j59K00K4K5j60L7J64L3k33J50j23K2l5J07O0j27
7032c6p8j33K30k56L12Jk21K61k07n0J55M8OJ9Op3l1P7k21L7K04nm8k5M2j43N6
7059g3M0p5k7qJ91K8k11K14m8K5j22j72L33O7j02N8j55j48K13N3k20J44j30M5
7083h0R8o4k4O0Q5j56J06j25K75m69L47O9rJ2N9o2pk95J04K42k25R8j08R7J35
7108A63j88n9J17j17J16rRO0N6k08J31r1l5%j39J04J51J7Mj94L2n0J02QLJ1j12
7135a18n9K16J32j96l9j20P6q9lK64J3m1l4l8J95k87J58k0J10j49Q7j53K79l94
7159b10K43N9j25J11J13m24K89k7R3j36m3j0L1K3L42m19Q7p1J13J7j96J46k36
7182b30K32j11J82k0j72J66j32K1J7p3M0M0J3l1P1j69K17k4k16J45j36J41r6N1
$$ plain form
7008 55 -222 -76 25 7 -61 181 -51 -21 -180 20 44 69 -91 -54 110 143 -90 60 -63 -41 -76 31 91 -36
7032 -36 -114 -247 -17 -273 39 40 -181 80 -127 -177 -22 26 32 51 57 -16 -47 30 -191 -154 50 45 -3 -28 14 -129 -73
7059 -73 -33 -108 -135 -143 48 76 -135 79 31 56 -66 -238 95 162 60 118 -37 -185 28 81 -139 5 -125 -80
7083 -80 18 -46 -70 -10 75 -81 25 -100 175 -294 53 122 113 125 184 122 115 -180 -76 166 -59 39 -69 28 163
7108 163 -25 -84 33 -84 32 23 32 92 148 -60 71 -20 -55 -55 -194 -90 61 78 82 -112 -80 -130 -28 -20 -17 -6 -118
7135 -118 -177 39 171 -25 -64 -184 -108 -197 -200 64 77 36 2 -36 159 -128 30 10 120 -29 58 -95 184 -210
7159 -210 33 92 -33 78 191 -233 56 29 122 -14 -57 -67 -36 -13 329 -90 -3 -74 39 56 -140 6 -230
7182 -230 2 -109 73 53 -119 47 -85 -64 -47 -120 -80 -40 -27 -58 13 -156 61 37 -179 -34 -170 -29 -125 -74
7206g4K4J06j88J66M2j89LK34rJ5o5o7n3J73j46Nj83K36p9p0J66Q5j70n1J34q9
7232d4K02j05j70J05L9k30K60n1n0j89M78m47K16J6K5k12J37l9J44k41L14o7j20
7255b9L2m9Q3n2J94m00J09K23M5k27j71J27K94k12L6j5LOP3J7j04M0j97M02l45
7280a17P1J4K9K6N9K1j40L8J16O0k21mR5j3J3j98K63k1j30o7K56J08k63K20m2
7305A73k21N6j03K49m4p9k01J36n8J07p5o5M9M9J13j34r0K00j13J93L1k0k26J04
7329C1j6o1Qp4J72j75K42r9j80J36rm5j10J45J98L4n0r0j75q4J39R2Q7j16N6k
7355E4M7L3k45J61K6j42J63j54r8J3J71j41J87n2j87J12J91k88J35pp2N4K08o5
7379A04l40L52o3N3j28O5q8J27JO5j57N9J14l61q8L01J83l26J29ll3oo4NJ17O9
$$ plain form
7206 -74 -50 56 -132 34 76 -113 -110 124 115 130 65 -2 -55 118 -28 -23 -206 30 -49 -119 47 132 -38 -89 45 -44
7232 -44 158 53 -117 -12 27 -203 57 6 -44 -233 245 -202 14 30 55 -157 -20 -59 85 -156 158 91 -29
7255 -29 3 -46 37 -15 179 -221 -112 111 156 -71 -242 -115 179 -33 3 -12 -9 -3 70 87 -17 23 -174 228 -117
7280 -117 -46 -32 -3 23 82 103 -37 1 117 177 -44 -48 47 34 47 -151 112 91 -39 -106 150 258 -5 215 173
7305 173 -48 8 -95 154 110 31 -170 -34 -92 15 -60 -125 -76 -27 86 -48 -138 62 -51 142 173 153 -73 31
7329 31 15 -46 -38 -112 60 -115 127 28 -152 -16 -25 -70 -180 -35 163 197 147 57 -118 -202 -63 29 116 0 56 54
7355 54 101 134 -111 50 76 -66 97 -57 -155 -142 29 -112 75 23 -164 -52 139 -149 -14 -21 -93 -39 169 104
7379 104 -236 116 53 106 -22 43 -45 82 83 148 -9 50 164 -197 -285 16 199 -127 2 -1 -34 -40 -104 -99 18 87
7405H7M8j04N0q9K4J50m46L23N5k25J60N9k3m1j27L26k16N5qkj35O2K6P9o0l30
7431c02J75J96M3j46L16j22j13J79k99N9k39K14N2J65rk13K49l46R1J9%l4Q6L5
7455E6q7RN0J74l01L5R6j2mJ44k40K4J43k0Nj53J50j28pp7J1J71k81K53j18oJ17
7482Dk1%J39j05j3j40K65j80O7J9j29o8Q9J78R8k53J29R4j35Lj41L10m21J68J32
7507H9j40K6N9k7j44%OJ7K16k20J9K80k83J6K74k59j18J73O6Q9j81J16O6j90M2
7532hP1m7M4j21N3J04J9P7j99M3n1N3O6l6k50J78J92k50J05J18j78Q8q8L1j18
7557a04K22o5p7j00K33k7j5j69J22K59l59J47p2q8J31k1n2PO0n3l3n3J61o4k7
7582c7j4J18j45J40o0j75J53Q5j5K1j85K20l08M4J99%p1p1P0M0L1N7k62J89J70
$$ plain form
7405 87 135 31 81 -8 16 166 -280 43 98 -127 33 92 69 28 -99 227 11 66 58 56 -79 -17 9 88 28 -302
7431 -302 -127 69 112 -34 282 160 47 226 -73 -14 -253 -39 13 178 169 -44 205 -141 -50 -31 -31 -65 21 56
7455 56 -31 -22 28 202 -99 -64 32 20 16 160 -80 -56 87 67 72 -81 69 -59 -66 -143 -132 39 -242 11 -107 -113 4
7482 4 -17 -17 122 17 4 -136 129 -51 16 35 -94 -162 -73 105 203 -50 79 173 38 41 -100 210 -211 -43 89
7507 89 -51 -25 34 7 -137 -137 -131 -114 102 -118 -99 181 -102 -86 188 -71 -189 -16 50 139 -42 74 140 -50 -8
7532 -8 63 16 60 -61 -8 96 115 192 -7 36 -15 38 104 68 -182 -4 188 -62 43 161 -17 71 -17 14 -104
7557 -104 118 53 -24 -124 109 82 67 -102 20 279 -80 67 -5 -93 38 17 -35 -28 32 -21 -54 -107 54 -10 -37
7582 -37 -51 67 -78 62 2 -173 -20 65 50 71 -114 106 -202 -158 41 41 -30 -101 -31 9 40 97 -165 24 194
7607A94k50O4O1j12J85j19j28J59R5l18J59j3J13J49l28J27kj11K04j59N0p4J33
7630G9j46J32r6JJ11J41j82J40l8j65k0o4LK85j90l8j08J60O4J19j79R8q9j04
7654h6O2O8jj74K58r0m0P0R3j10J79k83J05o1J1r1q6r4L43j26J02ok6R9j71qk3
7681h6K71k28J52k09O8L5q1mo4J16N1r8O8j06J30O5n3l4j64K46j53J05j29o9J89
7706A8r2P9r2P2j34q8K64N4j29J3P7P4k10J59j98J90K07j65o3K20l09Q6j99J37
7730b9R4K8j52R0n5K8L6K5j67J24r4j28J71R4j53K8J26k3j14J24O6o2r8M5J44
7755A48k01N3j34K68k19N8J44j60L1K84k31O5j78M5K37l8o5n3j3j82m2Q0o1L35
7779A71j39k33K54k17P2m3N1J13JLm2K02q5j93m7J30L6N1P2K4k96K71l0K0k06
$$ plain form
7607 194 -56 8 69 -43 142 23 -105 54 149 -169 -10 -23 90 239 -89 38 36 -75 129 -30 20 -54 79
7630 79 -67 65 -31 -30 81 222 40 180 142 -23 -43 -107 -104 181 -9 -47 -155 5 69 188 9 107 18 -86
7654 -86 -24 44 43 -131 127 37 -3 67 160 50 229 -54 51 -10 1 -90 -176 -270 73 -53 49 43 17 116 -55 -63 -86
7681 -86 185 -43 109 -100 -32 3 -78 -82 -146 -30 21 -77 -9 -115 15 80 27 -7 -171 75 -78 27 -102 -171 18
7706 18 -74 5 -87 -15 -149 -237 27 81 -48 -35 42 116 -94 65 -133 57 264 99 36 256 -53 33 -166 -29
7730 -29 65 93 -59 31 -24 4 40 65 -102 22 -72 -200 -29 65 -88 -60 66 43 -71 53 119 57 -41 4 148
7755 148 -53 0 -134 134 -85 -27 117 -43 -12 272 41 106 -72 -27 210 172 107 54 41 -141 -183 -103 -164 171
7779 171 32 -201 53 -164 -92 -135 -84 29 30 33 -9 193 108 -85 -132 -2 34 85 157 181 -115 156 126 146 -60
7804f0J31j23nJj40K27J32j31o9L1j16K54j91q9K01P3J89l66Q3p7O4n4n0O2J37
7829A14r5k36J74K49j74k35L37j77J25J65l33Q1J3j18q9J68L1j60L15j22R3m0
7851H6k81J85N5j08K20L3j74jq5n2N1O9o0J5J53j2j08N6l23L46J34n5k41O3M1
7876GR9j52j25J80o6K5r1N1k9R6J3N3L6M4j02J32k21J2j73K20J79k48M9J24q2
7901C1j18L4j26J56n3K80r2j83J3N6QK47l75K53j99J69J02j17j50k3J69j42m6
7924a06l9p2J39P0J1R1m4j03K91j78J4r3j07K22n8j16R7n4M8j68J47J23j04KJ60
7949A73j83O4j54R4J42j35q8J20P3q8R2Q4j40l3j02L9J08Q6j27k15K37j15o5K28
7973I5k14m7K09k7j76L31k17J11k98K54J23j3Kj62J73j03k08J36J40j42j83Q6
$$ plain form
7804 -60 71 -52 -57 -56 -196 31 163 32 -37 -6 -122 132 -59 -148 53 126 315 -51 32 -45 19 -35 -85 -23 114
7829 114 19 -217 -43 206 32 -203 134 -43 82 247 -86 -5 8 -110 -199 -31 0 -160 155 33 126 86
7851 86 -195 -10 45 -63 157 190 16 15 -70 -122 -71 -2 -62 -47 106 94 -14 42 -281 65 199 144 -97 -34 7
7876 7 106 -46 -171 9 -57 -32 -123 -72 -101 -5 8 61 97 141 39 171 -50 -38 -211 9 188 -60 -11 113 31
7901 31 -87 -53 -179 -23 -76 204 112 -71 -58 -2 6 253 -122 131 -68 101 203 86 -64 -87 82 -60 -106
7924 -106 -145 -217 -78 -8 3 94 50 -53 238 60 74 -19 -126 96 38 -78 19 -35 13 -155 -8 115 11 13 173
7949 173 -10 54 -100 -6 136 1 -87 33 106 18 110 194 54 21 -81 -42 66 152 25 -190 47 -68 -133 95
7973 95 -119 -166 43 16 -160 171 -46 65 -233 21 144 131 133 -29 144 41 -167 -31 109 -33 -216 -130
7995a30P3j33J22n2L03o1p8K67m02O2k9J7n2%J06J7J40k29J19O6k48Q9J42j46
8019c7J2L55m11J47k8n2q4Kj2N4%K3P2L6qK7k6m5j7O2p8j08J47j01J6R7j18OJ81
8048A12k38L85k84O2n9N8K96m20R5Pj1j57J60O9Pn8J09J5j65n3J20r8q7J52kJ17
8074A32j96J18j38J12J88m37K66j08K5j9Q5j3j20r2J78N8M8j68N0J98j70p8Q2
8097AM1N3l3J36k12K06k98N9j28J09K36j85K3j48n0K24J72k99Pk5K96l34P9%k
8122g2rQ1N3r9K0K1j33J93J5j36K12k3j22mK1R9o9j03Q3q1j00kR3P4R1J8k35M6
8150f8L4k6q0L4M0J16N2j47K5J9n0J82r6O3r2n4j07L27k05QJ12jj80J24J35j35
8176C0o5J23j53J73j84l2K6J27l5j11J08j04J39pj34
$$ plain form
7995 -130 -57 -190 -68 -120 183 122 44 311 -91 -29 -58 -41 -93 -93 13 30 170 -59 60 126 -122 -33 109 -37
8019 -37 -25 330 -81 66 38 -14 -98 -96 -108 -54 -54 -31 41 77 69 96 70 25 8 70 -8 -116 31 -70 -54 43 -75 -69 112
8048 112 -126 259 -25 37 -22 36 332 -88 7 14 3 -154 6 75 82 24 133 148 -17 -70 50 -48 -135 17 15 132
8074 132 -64 54 -84 28 216 -221 45 -63 -38 -57 28 15 -105 -197 -19 39 87 -81 -31 167 -3 -81 1
8097 1 42 95 62 198 -14 192 -106 -47 -175 -66 170 -15 8 -140 -190 34 206 -93 -86 -111 185 -149 -70 -70 -72
8122 -72 -81 0 53 -46 -26 -5 -138 55 70 -66 146 123 1 -3 18 117 48 -55 28 -53 -153 -155 -62 12 103 121 -114 -68
8150 -68 -34 -60 -140 -106 -66 50 102 -45 -20 -1 -51 131 35 98 6 -48 -155 172 -33 -25 87 86 -94 30 165 30
8176 30 -35 88 -65 108 -76 -108 -82 45 10 -101 7 -97 42 35 -99
8191i9
$$ Imaginary data points
##PAGE= N=2
##DATA TABLE= (X++(I..I)), XYDATA
0@%%%%%%%%Qj6J6j6J8k6L2m0M8n6O8p7R0j06J24j45J67j91K17k46K80l18L59m03
32b13M54n07N64o29P01p80Q64r57J061j176J301j440J595j770J967k188K444k739
50a448L085l500M006m641N461o570Q166j0666J5163k5759R2351P9409j84967k0004
64d9914P6515N86q5756q877M0818L8457J0787J4935K148k2611l0572K3556K4150
77C4222m1820m6870K6947K3314j1491J7612L3124j2444n299K4837o969m7322l7971
90e0130j2551L2890N3854l710l6631L0457N2306k3684n3521j2902j584m119J4938
103a4387J4616o713o758J9280M0982O719n6215l5219L8288J1372n0522k48M4995
116F190j2708j1577O3142K0441p9384l4915O2997L0962o0510n5640K9149O5405
$$ plain form
0 0 0 0 0 0 0 0 0 0 8 -8 8 -8 10 -16 16 -24 24 -32 36 -41 49 -57 67 -78 89 -102 115 -131 149 -169 190 -213
32 -213 241 -266 298 -331 370 -410 454 -503 558 -618 683 -757 838 -932 1035 -1153 1291 -1448
50 -1448 1637 -1863 2143 -2498 2963 -3607 4559 -6107 9056 -16703 75648 155057 -29910 -49914
64 -49914 26601 27187 -58569 -67446 -26628 11829 22616 37551 39699 17088 -13484 10072 34222
77 34222 -7598 -54468 -27521 -4207 -15698 1914 35038 22594 17295 42132 35163 -12159 -50130
90 -50130 -62681 -29791 24063 20353 -16278 14179 66485 42801 -10720 -23622 -25206 -29325 -14387
103 -14387 229 -6484 -13242 6038 47020 53739 -2476 -37695 593 11965 -38557 -38805 6190
116 6190 -6518 -18095 45047 65488 -13896 -48811 14186 45148 -15362 -71002 -41853 23552
128B3552N669m1067L486L9108O16j9783q281l0366k7925K9544L4333j1350K05
141b259K7754K158j4393n736j7447j7521O930Q399O651J8426n316k8308J3357
154g305M0895n746l6175o936J7367O164j9858k6587R961L7131J2453Q93J3081
167C5338j9082m1570J2405K7238l7118l1252M8578M6772j6199k2160K152m13n501
180h12p85M92l614j0108J230K4795O684k9932j677L9166P192k7947r828l422j2107
195b0673J0104J5155j1350L25K5960P259j3387q027j1223r114Q617M830p317N064
209c777Q475j345Q362R833j4231j5376L097L201q24l218j1716O783L1886K826
223B3976k8133Q33J6096j3508r382J3742p282j7980J5483K2099q862j4972M532
$$ plain form
128 23552 29221 -11846 -8360 30748 31364 11581 3300 -27066 -54991 -25447 8886 -2464 -2259
141 -2259 25495 27653 13260 7524 -9923 -27444 -20514 -12115 -5464 12962 7646 -20662 -7305
154 -7305 33590 27844 -8331 -15267 2100 8264 -11594 -38181 -28220 8911 21364 22257 35338
167 35338 16256 -25314 -12909 14329 -22789 -54041 -5463 41309 25110 2950 5102 4689 -812
180 -812 -1597 -1105 -4719 -14827 -13597 11198 17882 -12050 -13727 25439 32631 4684 -5144 -8566 -20673
195 -20673 -10569 4586 -6764 -6439 19521 26780 13393 5366 -5857 -14971 -6354 -1524 -8841 -3777
209 -3777 4698 3353 11715 21548 7317 -8059 -4962 -1761 -2585 -5803 -17519 -10736 21150 23976
223 23976 -4157 -3324 12772 -736 -10118 3624 -3658 -21638 -6155 15944 7082 -7890 -3358
236c358J6995P655j8605k2324O010J0124r478M105J9425k599n419J6447l394l0959
250a5375o888J4907K598J297P085k071L64O547o586q355N836N48n001P108R55
265B969j4462k129J0689M705O477M240r530l399N565j1844j3822R413Q516Q00
279a812J4617O228j9895o817J2837m879j3074N194P378O66M312j432o134K035
293g76L229k51N579l018j4999L899J2357j0426p747J6303O516q498N068K973j4612
308d403m299Q693q85l153K863Q6N311P811p859p565Q591j68j1463K238N053o099
324e248K106J0664o64k955J563n936k393P218n640q866J1305P648j0700j017Q884
339E969m703k919Q398p32p903j113j057j139M715j435j175J2787M219j4025l047
$$ plain form
236 -3358 13637 21292 2687 -19637 -13627 -3503 -12981 -8876 10549 7950 2531 18978 15584 -15375
250 -15375 -22263 -7356 -4758 -3461 3624 1553 1917 8464 1878 -6477 -641 -93 -5094 2014 2969
265 2969 -11493 -13622 -2933 1772 8249 12489 2959 -440 5125 -6719 -20541 -11128 -2612 -1812
279 -1812 12805 19033 -862 -7679 5158 279 -12795 -7601 -223 443 4755 3323 -2811 -776
293 -776 2453 2202 7781 4763 -10236 -6337 6020 -4406 -12153 4150 10666 2168 7236 10209 -4403
308 -4403 -8702 -9 -894 -4047 -1184 -1098 4213 12024 4165 -3400 5191 5023 -6440 -4202 851 -5248
324 -5248 -3142 7522 6858 3903 5466 -470 -2863 4355 -1285 -10151 1154 8802 -1898 -2915 5969
339 5969 1266 -1653 6745 6013 -1890 -3003 -4060 -5199 -484 -1919 -3094 9693 13912 -113 -3160
354c160M778r601m100J3141K444n398O747K978q693k137J449l690L724N956n439
369a001k281M078m564j854Q916m05n077O870J494j2267j633M630m054K948R990
384E790j635l038L944m986p314M531R3n202Q265O212q595j513P303l740m429N026
400G12L0k800K246j763l075N754j76n962P642O242j0770l355R530l631q279O596
416a059M220m535J763K590k232J448k73n165L386L429q043q90J0685j785o633
431c094O754K881q165p9L276m296J476M566l482N01N599n512m565O959J43o008
447c046N255L200p128l46L915l668L87N723j671j246L839m842n683N158Q64m835
463d124N967N027o864O1M752o692m024P610P47m794L917J899m824N84P31l062
$$ plain form
354 -3160 1618 -7983 -12083 1058 3502 -1896 4851 7829 -864 -3001 -1552 -5242 -1518 4438 -1001
369 -1001 -3282 796 -3768 -5622 3294 2889 -2188 4682 6176 -6091 -7724 -3094 -7148 -4200 5790
384 5790 4155 1117 5061 75 -7239 -2708 -2615 -7817 448 6660 -1935 -3448 3855 115 -4314 712
400 712 742 -2058 188 -1575 -4650 1104 928 -5034 2608 8850 -1920 -5275 4255 624 -7655 -1059
416 -1059 3161 -1374 389 2979 747 2195 1922 -3243 143 3572 -4471 -5361 5324 3539 -3094
431 -3094 3660 6541 -1624 -1703 1573 -2723 -1247 3319 -163 338 5937 425 -4140 2819 2962 -3046
447 -3046 2209 5409 -1719 -2065 1850 -1818 -1431 4292 2621 1375 5214 372 -5311 -153 711 -4124
463 -4124 1843 6870 6 67 4819 -1873 -5897 1713 2460 -2334 1583 3482 -1342 -758 -27 -3089
479c089L890L167n334M59M684o499l550Q133m58n862O486L880p707j548M190k888
495b046n20K786k531J189N871m876n600O431J774o839K576M386m647n96M056k630
511a216j385L465j618m79L812m111m042P817J223r497K285Q663m437m479M764
526G65K55k596K834j731l214M212R40m251K765K409m410K029L897o312j335O588
542B845k007m181N192M32n178M049K690o937P31O555k801k963K562j048o53M016
558C304l416l989P149K641p470k36M754k120q97J762k821R83N382l742m154N446
574B576K08n768M310L005p258Q78P659l802n884M297K836k298m4j581m91M540
590C183q60n879K658L989l925L39L500m660j275P470k247p377M209M464m681j43
$$ plain form
479 -3089 801 3968 -1366 -907 3777 -2722 -6272 1861 1403 -4459 2027 5907 -1800 -3348 842 -2046
495 -2046 -2566 220 -2311 -1122 4749 -127 -5727 704 2478 -4361 -1785 2601 -2046 -2642 1414 -1216
511 -1216 -2601 864 -754 -1233 2579 -1532 -5574 2243 3466 -6031 -3746 4917 480 -3999 765
526 765 1020 -1576 1258 -473 -3687 525 1465 -2786 -21 2388 -2022 7 3904 -2408 -3743 2845
542 2845 838 -3343 1849 2281 -2897 1152 3842 -3095 -2364 4191 1390 -1573 989 -59 -712 3304
558 3304 -112 -4101 3048 5689 -1781 -2017 2737 617 -280 1482 -1339 -356 5026 1284 -2870 2576
574 2576 2784 -2984 1326 4331 -2927 -2049 5610 1808 -4076 221 3057 759 715 -866 -1357 3183
590 3183 2323 -3556 -898 3091 -834 -495 3005 -1655 -2930 4540 2293 -5084 -875 3589 -1092 -1235
606a235K466k639R71L168l762k251M797o35l294L304n87l843L526K744m649l67
622b286L105j631P36J580n420N33Q558l624r215O024P252o328l663L721R32P32
638A006M77n023m90O710p5o178J570K863k34Q52k649m274N510M649o635j765O229
655B543j853l956N319q53o482M791O576n488m529L055K001N0j074l363K308O628
671E673l504o300L729K545l718O50K621j317J217J187n323Q05N654m048m412P853
687C312K785q281n78N822j928l079J572J591J920j45n045n06O182j418o297L128
703i65N043j321j263k530l346O312M807r242m148J0506K567q101p30K910p70J578
719A307J563m258j025M059M07j589j262k130K614N531m381o548N467M440m853
$$ plain form
606 -1235 1231 -1408 -437 2731 -1031 -3282 1515 880 -2414 890 303 -3540 -14 2730 -1919 -2286
622 -2286 819 -812 -76 1504 -3916 -3383 5175 1551 -7664 -1640 5612 -716 -4379 -658 274 1006
638 1006 1483 -3540 -4030 2680 2605 -3573 -2003 860 626 1478 -1171 -5445 65 4714 -1921 -3686 2543
655 2543 690 -3266 2053 1200 -5282 -491 6085 597 -3932 -877 1124 1174 100 -3263 -955 5673
671 5673 2169 -4131 -402 2143 -1575 -925 1696 379 1596 2783 -2540 -1735 3919 -129 -4541 3312
687 3312 6097 -2184 -2762 3060 1132 -1947 -375 1216 3136 2991 -2054 -2560 3622 2204 -4093 -965
703 -965 4078 2757 1494 -1036 -4382 1930 6737 -2505 -6653 3853 6420 -1681 -2411 499 -271 1307
719 1307 2870 -1388 -2413 1646 2053 464 -798 -2928 -314 5217 836 -5712 -245 4195 -658
734f58j354K725k068O50L024m277j394O786l98p063K154M079l243j631K209K63
750a96J511R54m479j491M277k47k366K290l4j490L527j510o039K917M933l657
766a100l97N834l749o352M799L905n359j705M456K813L75l810n413K944N943l187
782ck976L968J011j168R45l252m007N335M194m494k74L824l446k531L997r83l133
799b993M194L086l708j135J111j763L42J261p29K114K289m558k023M741o15m213
815b599K320K025j325K898q94o886K167P843l393o473M143L429k392k70j62j754
831a323J558J361j240K33o16k313L341L933n063m132N408J502l991J077Q79k008
847a394L034K060n476j662M633q25k396L789O71l799K98J791j893N7O50m13K834
$$ plain form
734 -658 -2012 713 -1355 -705 2319 -1958 -3352 3434 3036 -4027 -1873 2206 -1037 -2668 -459 -196
750 -196 1315 2269 -2210 -3701 576 329 -2037 253 219 -1271 2256 746 -5293 -2376 2557 -1100
766 -1100 -1497 4337 588 -5764 -965 2940 -2419 -4124 332 3145 3520 -290 -5703 -2759 3184 -3
782 -3 -2979 989 2000 832 1777 -1475 -5482 -147 4047 -447 -721 3103 -343 -2874 1123 140 -2993
799 -2993 1201 4287 579 -556 555 -1208 -866 395 -334 1780 4069 -489 -2512 2229 1614 -2599
815 -2599 -279 1746 421 3319 2425 -4461 -2294 5549 2156 -4317 -174 3255 863 593 431 -1323
831 -1323 235 1596 356 589 -27 -2340 1001 4934 -129 -4261 1147 2649 -1342 -265 614 -1394
847 -1394 1640 3700 -1776 -3438 1195 370 -2026 1763 2434 -1365 -1067 724 -1169 -1112 -462 -875 1959
864A959J250m662j439K763j853p77N359l54m451L134K106n740j587L467j73P37
880b61L945k142m374J833J070j858N87R14p08L004R40n148j498K990k17J228K886
897C191l189l057M678J56o439J013M757o92Q12K151l731k414K730j65j808K037
913C0N34j330K328M02l594O04J765j383J081K071l763j538M559l93l045K911O59
930A898l205K866K155n031k264M569Q40k130N14l17JK933q01k943J371P03l208
947b049J734J873l019K89M921q08l023R00j411k233L252J945l964J001L892j969
963A331k027J092j489l34L856m8k706L47o24j595K482Q25k873K540M072l900l055
980b106J448j632j211M655J385l084J480J324l336o17J206j944P79M424j103l139
$$ plain form
864 1959 3209 -1453 -2892 -129 -1982 -2759 2600 2246 -2205 929 3035 -2705 -4292 -825 -998 -261
880 -261 3684 1542 -2832 -999 71 -1787 -1200 -286 -994 2010 2950 -2198 -3696 -706 -923 305 3191
897 3191 2 -3055 1623 1779 -4660 -3647 1110 418 1230 3381 -350 -2764 -34 -199 -2007 30
913 30 564 -766 1562 1964 -1630 -1026 739 -644 437 2508 -1255 -2793 1766 1373 -1672 1239 1898
930 1898 -1307 1559 3714 -1317 -3581 988 1828 -302 212 -105 -104 2829 2028 -915 456 1159 -2049
947 -2049 -315 1558 -1461 -1172 3749 2941 -82 818 -593 -2826 426 2371 -1593 -592 3300 1331
963 1331 -696 396 -1093 -1427 2429 2381 -325 22 -602 -2197 285 1110 -1763 777 4849 949 -2106
980 -2106 -658 -2290 -3501 1154 2539 -545 935 2259 -1077 -1694 -488 -2432 -1653 2771 1668 -1471
996a471M25l63k18K327P7j942K597J045m483n42K025k512K48N396J35l633J287
1013C98N95k938K37J108k234J815L094k060j146K240j358q45K957j392l302J735
1029a096J467k122J047J644j867J530L189l399l208L112j41k358K018R37k255
1044a502J522K657j700o51J026j953n70J741k311j350L958J417j414J615L3l614
1060a096K74J415l002N43L956n29j398K705j480l443J877K037j907M9J018j595
1076e76J36J286j947r2L981m82j885J805j781l919J688K837j825Q79L199j648
1092A656j415P91k614j697L579O94j790K159P79l318K33J936j766l02K784j221
1108D88q68J337k322j808L580R19k469J953J709l198p38K042k282j129L176L96
$$ plain form
996 -1471 -1046 -1409 -1627 700 777 -1165 1432 2477 -2006 -2548 -523 -3035 -2787 2609 2744 -889 398
1013 398 993 -1945 -1708 -600 -2834 -1019 2075 15 -1131 1109 -249 -1094 1863 471 -2831 -1096
1029 -1096 371 -1751 -704 940 -927 603 3792 393 -2815 297 156 -2202 -184 753 -1502
1044 -1502 20 2677 977 326 1352 -601 -1171 570 -1741 -3091 867 2284 870 2485 2518 -1096
1060 -1096 -822 593 -2409 -1866 2090 1561 163 2868 1388 -2055 -178 1859 -48 1 1019 -576
1076 -576 -440 846 -1101 -1193 2788 2306 421 2226 445 -3474 -1786 1051 -774 105 3304 1656
1092 1656 241 1032 -1582 -3279 300 994 -796 1363 2142 -1176 -943 993 -773 -1075 1709 488
1108 488 -380 957 -1365 -3173 407 1326 -1143 810 2519 -679 -1417 625 -1657 -2786 390 786
1124G86j496J326j17k178J935O76k647M55K245j818k39J786j524l93K926j131
1140E92k531K149O42k995J283K112k333l99K673j261j322K151Nj525J661p78k391
1157b267J773P32k041J610L063k001j764J782j361j353J663O9j176L289P35m037
1173a284K32K369j884m73K662p59j245J567p52k361J440J005m85K264J80l372
1189h96O75J736k993r38L505N33j115J766p19k921J486Q18k911J193L086j508
1205G97p09J267j220j381K507p2k114J858L21k260O51P34j928J581K808k485j371
1222a016K577q90k719J144J021j600K133J371k653j02K325j375j670J436n24m86
1238a028K201q91k196K202J539k517m05R93j256P26J857k494o15M089r10l555
$$ plain form
1124 786 -710 616 499 -1679 256 932 -1715 -1260 985 -833 -1072 714 -810 -1203 1723 592
1140 592 -1939 210 852 -2143 -860 1252 -1081 -1480 1193 -68 -1390 761 766 -759 902 124 -2267
1157 -2267 -494 238 -1803 -193 2870 869 -895 887 -474 -1827 -164 -95 -1271 2018 2753 -1284
1173 -1284 -1052 1317 -567 -1040 1622 863 -382 1185 433 -1928 -488 517 32 2296 2476 -896
1189 -896 -221 1515 -1478 -2416 1089 1622 507 2273 1554 -1367 119 937 -1974 -781 2305 797
1205 797 88 1355 135 -1246 1261 1189 -925 933 1254 -1006 -355 379 -1549 32 2840 355 -1016
1222 -1016 1561 671 -2048 -904 117 -1483 650 2021 -632 -734 1591 216 -1454 -18 -542 -1028
1238 -1028 1173 282 -1914 288 1827 -690 -1095 -102 -1358 -632 1225 -1269 -1884 2205 1295 -2260
1254b260J547J403j786M73J355j751K22J610j238q29J616m69m34K011j332k467
1270b329K026J381k429J02K330n99o6M19k649o57L692k48l053K395K220k449r19
1287h33N29r45O24J657o38o17J621j282j207J717q03j908L047J978l333o73K001
1304I35r17n81J275j225k19L358j199l808J564K651j695q56J283Q0M24Q2k220
1321a068k51K511l49j770J847L39j911J339Q38k888N03K753j463j305J797q51
1337G1q81K121l15k848J458K331j950r92J012J25M35M46k284l32L135p14k353
1354a535J832J026k177J079P72k776L43K989j326j574K115j04j659R02K54j908
1370a747J346J861j891o14J155p53K51R98j765o5K810n23l250J108J133j127Q06
$$ plain form
1254 -2260 -713 690 -1096 -623 732 -1019 -797 813 -425 -1254 362 -107 -541 1470 138 -2329
1270 -2329 -303 1078 -1351 -1249 1081 482 416 835 -1814 -2471 1221 973 -2080 315 2535 86 -833
1287 -833 -304 -1249 -625 1032 394 -223 1398 116 -1091 626 -177 -2085 962 2940 -393 -1066 935
1304 935 18 -563 712 -513 -732 2626 1427 -2381 -817 1834 139 -717 566 646 1070 1152 -1068
1321 -1068 -1319 1192 843 -927 920 1259 -652 687 1525 -1363 -860 1893 430 -875 922 71
1337 71 -810 1311 996 -1852 -394 1937 -13 -1005 7 132 567 1013 -1271 -1603 1532 818 -1535
1354 -1535 297 1323 -854 225 997 -1779 -1436 1553 227 -1347 768 664 -995 -93 161 -1747
1370 -1747 -401 1460 -431 -1045 110 -643 -392 606 -1159 -1224 1586 1063 -2187 -1079 54 -1073 -267
1387b67R61j865J046K615k853k748K852J262j886J94J069m14P17k62j641N12J631
1404I23j477j43J859j650j311K692J6k371J556J833j753n29P08j649N6K940j724
1421b4j526K817J034k520l38Q63m48N33j76j498J482J647j784o06K050p02j581
1438g77J668k55k287J532J914k130J62J708j407j80J894j629j896J923J069k032
1454g23J22P60K27Q19j52j925J183J783k829j144K504l84j433K144O09k251R96
1471C06J154j943r16J720p68o01K081o39j279J834n4j776O98P24r15R0J79j369
1489a474P83K315j816r15K551l35k307R27K21j872J231J698j619n00K400o70j395
1506g77P66l30p57J045j62j295J416Q79j462R45Q15j699q3J587j401j597K378
$$ plain form
1387 -267 694 -1171 -125 2490 -363 -3111 -259 1003 -883 -689 380 -34 683 421 -1220 -708 923
1404 923 -554 -697 1162 -488 -1799 893 909 -1462 94 1927 174 -355 353 -1296 -1240 1700 -24
1421 -24 -1550 1267 2301 -219 -557 306 -142 391 215 -1283 199 1846 62 -544 1506 804 -777
1438 -777 891 636 -1651 -119 1795 -335 -173 1535 128 -52 1842 213 -1683 240 1309 -723
1454 -723 -601 159 386 1205 1053 -872 311 2094 -735 -1879 625 241 -1192 952 1561 -690 306
1471 306 1460 -483 -1399 321 -447 -1048 1033 394 -885 949 895 -881 -183 541 -374 -284 -105 -1474
1489 -1474 -691 1624 -192 -1107 1444 1109 -1198 -271 -50 -1922 -691 1007 -612 -1112 1288 618 -777
1506 -777 -11 -341 -1098 -53 -215 -1510 -94 785 -677 268 1083 -616 -699 888 -513 -2110 268
1523B68L03k025J513J458j762r9J454j543p29J226n47l82J302k13n24J590m42
1540H48j812J383L79k237M89J679j136J6J922p38j183J562l1k296R40P35j505
1557i85M84J807j150m89J604oj174L61m40m58R97o43j325K049Q77j868L71K084
1575B096j876j136J601k75j907J533N40r77J219Q77j797j29J197j042r09J301
1591C16p55m39J705l46r10J180Q3j476Q96M67k420N20K250j330r26K125L3j420
1609d47R49M74j876J53P85j114N90J093p95l51J521n86j170Q42m63r23J378J9
1627G9j537J237J585j552m65J846j275j387J465L60j981J007Q49o42P04M44j205
1644d68K34J033j618m06J186m59n05J756r3j323J261Q52k096p5J065j331j44J825
$$ plain form
1523 268 571 -1454 59 1517 -245 -344 1110 -433 -1162 64 -483 -865 437 224 -300 1290 848
1540 848 -964 419 798 -1439 -950 729 -407 -391 1531 793 -390 1172 1141 -1155 -215 520 -985
1557 -985 -501 1306 156 -333 1271 1265 91 452 12 -446 551 -92 -1417 632 1509 -359 12 2096
1575 2096 220 -916 685 410 -1497 36 576 -401 818 1695 -102 -231 966 -76 -985 316
1591 316 -439 -878 827 481 -429 751 834 -642 254 721 -1699 -1179 1071 -259 -1185 940 973 -447
1609 -447 502 976 -900 -747 38 -1076 -486 607 -188 -539 982 396 -774 68 -395 -1318 60 79
1627 79 -1458 -221 1364 -188 -653 1193 -82 -1469 -4 356 -1625 -618 231 -411 293 737 -468
1644 -468 -234 799 -819 -1225 -39 -498 -1003 753 660 -663 598 1450 -646 -721 344 -987 -1131 694
1662F94n57j007J974L46j811P87M37j502oQ70p87J75J141o09q4J679r81j611J365
1681E13j11j500P00Q55j273O54K092j218r21J378o54j608J271J42j432J032R42
1698H62o77L32Q05j133j39O55j244p04J797m44j011J675M91j961J086J108j571
1715g3p00J019q41n25J507l25n73J409M31j665O31K51j731L30J098j072k2J298
1733D47k84m8J082p97j674J408J77j939L55J611r15R4J525m14r56N85j25j176
1751a044M88J43j028J353Q49j341M88R28r97p67J584j209j136J529R3j008J273
1768A98P31j286N39J074j572j117J321l45n98J334K9n97J366r7j380L67L91j249
1786h91J53J044r33l70K057k57j203J033R7j318P58L58j473K03J445n77l46J483
$$ plain form
1662 694 137 -870 1104 1450 -361 426 863 -639 -645 225 -562 -387 754 145 61 1740 759 -852 513
1681 513 402 -1098 -398 457 -816 -162 1930 712 -209 1169 515 -1093 178 320 -1112 -80 862
1698 862 185 517 1322 189 50 705 -539 -1243 554 110 -901 774 1265 -696 390 1498 -73
1715 -73 -773 246 -595 -1120 387 62 -511 898 1329 -336 295 546 -1185 -855 243 -829 -851 447
1733 447 163 115 1197 400 -1274 134 311 -1628 -1273 338 -577 -483 1042 628 -328 257 132 -1044
1751 -1044 -556 -413 -1441 -88 761 -580 -92 836 -161 -928 656 -553 -1689 -160 -67 -1075 198
1768 198 929 -357 182 1256 -316 -1433 -112 -457 -1055 279 308 -289 1077 980 -400 -33 358 -891
1786 -891 -738 306 -627 -997 1060 803 -400 633 730 -588 170 528 -945 -742 703 126 -220 1263
1804A263m52j087P86j05r81N20L6q12R25J217j434K03J474j315r11J568o27j448
1822a180R82R38j216M74Q64o16L16M97j653m72J653m26j024J058k3o17J160K61
1840I76j399J48J012j061n58J024o41k23J676j82j518J030O44j376l61J205q78
1857d82l57J226n41k73J138l71j007P85o4j052P74L56j140O73J342j291m10J707
1875A013o60j002Q25l11j309J290O14r99j44J350k62m39M6q67K03J351o99j287
1893a287J074Q22j085M75M26j111M28J149j171o51J196k36n73J122j91j309J191
1910B69P38j441k74J048j50l97L32k96N1R99o30r69J420L90k046M94R53q98O7
1929c40J269q29n80J388j54j428O74M98j027P75N36j182M0J136m04o54O24k88
$$ plain form
1804 1263 811 -276 510 405 -576 -56 -20 -832 93 1310 -124 79 1553 238 -673 895 268 -1180
1822 -1180 -198 740 -476 -2 862 246 562 1059 -594 -1066 587 161 -863 195 172 -445 715 976
1840 976 -423 -275 737 -324 -882 142 -499 -722 954 772 -746 284 928 -448 -809 396 -482
1857 -482 -839 387 -154 -427 711 340 -667 118 54 -998 -224 132 -1008 -335 1007 -284 -694 1013
1875 1013 353 -649 176 -135 -1444 -154 460 -539 -683 667 405 -34 12 -855 -652 699 0 -1287
1893 -1287 -213 609 -476 -1 425 -686 -258 891 -280 -931 265 29 -544 578 387 -922 269
1910 269 1007 -434 -708 340 190 -207 125 -171 -120 879 249 -720 700 1090 -956 -462 491 -407 -340
1929 -340 929 100 -480 908 754 -674 0 498 -529 246 782 -400 -360 776 372 -282 342 54
1947E4j07Q67q26j203J607O88j415Q6J251r13j25P12j030l98J307O7j335Q28M31
1966E46q44M38K67j018L74O53n51l35P39l13l13Q39m93r02J084N88j731K26J187
1985D41p18j87Q02n22m05J041j91j165N09O72m75n5J22m88P64P84j235q01J428
2004C21j01j067R97l81o92J010R11j880K34J207q27n39Q55j18m48J118j81j268
2022h49L55R54o86J22L70n78M08P08j602k40J931l02j230R33L79j124N18M55j028
2041e06N9J493o56r48J128l34q41P00K72n86O68L38p94KK77n49K41J004j199n57
2061g88K005j81k023O12J164r14K31L63m00J93N56q37l77P88R0q25O15L91j220
2080e57P23L91p99L9Q54q72K98O11r45n98J459O1j486N28J264j197j33P29n48
$$ plain form
1947 54 -53 814 -12 -1215 392 1080 -335 -249 1002 89 -36 676 -354 -752 555 622 -713 115 546
1966 546 -298 140 407 -611 -237 416 -135 -470 269 -44 -357 482 -11 -913 171 759 -972 -746 441
1985 441 -277 -464 338 -184 -589 452 261 -904 -395 277 -198 -253 -131 -619 145 929 -306 -1107 321
2004 321 220 -847 150 -231 -923 87 998 -882 -648 559 -268 -807 48 -70 -518 600 419 -849
2022 -849 -494 460 -226 -104 266 -312 96 804 -798 -1038 893 591 -639 294 673 -451 67 522 -506
2041 -506 -447 1046 390 -558 570 236 -605 95 367 -219 449 787 -7 -5 272 -277 -36 968 -231 -788
2061 -788 1217 1036 -987 -375 789 -125 106 469 69 262 818 -19 -396 392 482 -343 272 663 -557
2080 -557 166 557 -242 -203 651 -221 77 688 -257 -855 604 665 -821 -293 971 -226 -359 370 -178
2099a78l23J012n73n97O73L57p59N26O9n96P79k49j081M14J189q52j34J055p95
2118f3q82J022J99j151P04Q89r11k09O74p47p1M99k21k65P66O1j005N34K05q62
2138h34R25N40j262K33J274r67q31J112K6r30J030L37j211L85O64r22l79J161
2156C51mn76P01k42o35N72J1o33Q79J70j033O30N25j200r4J438n11r19R59J65
2176E54p76J86K31n44M33M89m03k29O20m95m35P73m60m04R22k13l96N27N3q79
2196d46N80M53q42k13J242l37q81J068J50r23KM92o66L67L85m54q8P89o83l93
2216c98L37n5l78P18Q8o16P13j6j262P05Q65r75n12J218j68j209O76M45m03J05
2236a22O39m10j23J21j045L40P71l20l53R92j83p00L22Qq27L87P52q47M98P92
$$ plain form
2099 -178 -501 511 -62 -659 14 371 -388 138 207 -389 390 141 -940 -526 663 -189 -323 732 -63
2118 -63 -945 77 276 -875 -171 718 -193 -402 272 -475 -546 -47 -268 -533 233 294 -711 -177 28 -834
2138 -834 91 631 -631 -398 876 -91 -922 190 216 -714 316 653 -558 -173 491 -431 -810 351
2156 351 347 -229 472 230 -405 167 178 -455 424 594 -439 191 716 -484 -578 860 349 -570 389 554
2176 554 -222 -36 195 -349 84 573 170 -59 561 66 -369 404 -56 -460 462 249 -147 380 433 -446
2196 -446 134 587 -255 -468 774 437 -444 624 774 -149 -147 345 -321 46 431 -23 -111 678 -5 -398
2216 -398 -61 -116 -494 224 312 -304 409 393 -869 -164 701 -274 -786 432 264 -945 -269 176 -227 -122
2236 -122 517 107 -16 105 -940 -600 171 -149 -502 490 307 -393 -71 -63 -890 -503 249 -598 -100 692
2256F92q75o03J082k61q28P46M44r01L13L93q22M65N15m95M1L28n72k41P56l25
2276a48n36Q58M47q10O5P74r37j13R42o49m90Q69O9o13L92M31p43L14L15o69Q9
2297a43N54o47N0Q94o30l27O62k34r07J001L96r19L39P36q49l12O95l39k30J081
2317H71l32q68N15P4p89N17M49n54L52N63q57j83M63m45n3Q06M3r46O27K23r84
2338e08j20J287m78l15P65n40l41J12n0l97N69L27n28K30N24q74k96R01m58m99
2358f89Q27Q0m90N49J89j288O31N13p17MP50m30n49O41m9k58M83M0n99M27Ro42
2380e68K12N13n96J41P83n42l49O33p5p96P60j0o20L96O20o60j41R75n72p26N32
2401i0J71n67L75K82l54M60Q6p21L13O07p95j25R53m04p46P73K3p50N42O73j004
$$ plain form
2256 692 -183 -786 296 35 -793 -47 397 -504 -191 202 -620 -155 360 -135 -94 234 -338 -579 177 -148
2276 -148 -684 174 621 -189 -124 650 -287 -400 542 -107 -597 272 341 -272 120 551 -192 122 437 -232 -143
2297 -143 411 -236 -186 708 78 -249 413 179 -728 273 669 -250 89 825 -24 -336 359 20 -210 871
2317 871 539 -329 186 260 -529 -12 437 -117 235 798 -59 -242 221 -224 -277 529 572 -374 253 476 -508
2338 -508 -628 659 181 -134 631 91 -250 -138 -188 -585 -16 311 -217 13 537 -337 -633 268 -190 -689
2358 -689 138 218 -272 277 466 -822 -191 322 -395 -391 359 -71 -620 21 -28 -286 197 237 -362 65 74 -568
2380 -568 -356 157 -439 -298 485 -57 -406 227 152 -644 116 106 -514 -118 502 -158 -299 676 104 -622 -90
2401 -90 81 -486 -111 171 -183 277 363 -358 -45 562 -233 -358 595 191 -555 218 241 -509 33 706 -298
2422b98K78M96p53n8P89p99j15Q96K18p58J93J71p61M11J35k93M98M66o82m29
2442c95J076n39n72P36K55r62L43N24q33P6P63o25K7P54l24n42N09k55o42P09
2462H3J07m68M76L51p30O1O09n39m62R92j09r67O68L36o57L25L81o49k9N81p38
2483c78r1N23j72k32Q75l64n70M03L56q93M32K83m03P0M60k36m63Q59l23o75P18
2504A79M8q00L40N6n3R1N32m68j14M40l11l19N54l15m59Q38K84j166K79P48n38
2525a54k40Q24n61l9L87l90m31O15L68o86L75L77n94l5K78m14j62P57n9l61N24
2546C79j58n98N70L92j070J85Q36l83m53N94k38k72O19P0r63N92K00r10K88O52
2566C32k61p7M36k55k43N91l97n71N16J9m55N03M46o75K5O48l72o61M33K69l95
$$ plain form
2422 -298 -20 476 -277 -335 454 -345 -460 436 654 -104 89 260 -501 -90 45 -248 250 716 34 -395
2442 -395 681 142 -430 306 561 -401 -58 466 -367 -291 472 -153 -126 628 304 -238 271 16 -626 83
2462 83 190 -278 198 549 -181 -120 489 -50 -512 480 371 -596 72 408 -249 76 457 -192 -221 360 -378
2483 -378 -469 54 -118 -350 525 161 -409 -6 350 -543 -111 172 -231 -161 299 63 -400 459 136 -539 179
2504 179 227 -573 -233 -177 -230 -139 393 -75 -189 251 -60 -379 175 -140 -599 239 523 -643 -364 384 -154
2525 -154 -394 430 -131 -170 217 -173 -604 11 379 -307 68 445 -149 -184 94 -320 -482 275 216 -145 379
2546 379 221 -377 193 585 -485 -300 536 153 -300 294 56 -216 403 473 -490 102 302 -608 -320 332
2566 332 71 -6 430 175 -68 523 126 -445 71 90 -365 138 584 -91 -66 582 210 -451 -18 251 -144
2587a44J86j9l59M73N65j019K44M36n12p7M43l55l51R48j87p86M29N13m36j55
2607a63M99q12L7P05m31m81P94K46o54O32j47o23L76J29o27K23O89m39j82M14
2627A85k27k62N78j64q80P53M32p91K4O12l98R0N55p42l28P46k5q55M05N10m27
2648b09M40R4n58K6O35n69n03Q02j40n40R78j14p52N22M30m84l65L91Oj63M02
2669C29n29O6Q25l03o64L56K68l68N6N2l06J60P71p86l0P01l01p16Q05M9r45L68
2691a42P46o49q2O88m19N3L12m78m35O97j14o89M01O18m82Q2L24p74J95M22n03
2712b29k69P28j52l87M51M02q39K52N41m98n35O39pl34K99j69l08P85J19r57P12
2733B44J20p21n8M74m92N5P83m16n79J132l01q00M68L21o17oO41m48j10P41l30
$$ plain form
2587 -144 42 23 -336 137 702 -317 -73 363 -149 -226 217 -138 -489 459 272 -514 -85 428 -8 -163
2607 -163 336 -476 -439 266 -165 -646 148 394 -260 372 225 -398 -22 107 -520 -297 392 -47 -229 185
2627 185 -42 -304 274 110 -770 -17 415 -376 -352 260 -138 -48 507 -235 -563 183 158 -697 -292 218 -209
2648 -209 231 325 -233 -207 428 -141 -644 158 18 -522 456 342 -410 112 542 58 -307 84 90 -73 329
2669 329 -200 -134 691 388 -276 80 348 -20 36 88 -218 -58 713 -73 -103 598 297 -419 386 435 -510 -142
2691 -142 604 -45 -127 561 142 195 507 29 -406 291 177 -512 -111 507 25 107 431 -343 -148 274 -229
2712 -229 -498 230 78 -309 142 544 -295 -43 498 0 -535 104 97 -237 62 -107 -415 370 489 -468 244
2733 244 364 -357 -415 59 -433 -378 405 -11 -590 542 241 -559 -91 230 -387 -393 248 -200 -310 431 101
2754A01l47L62j39l03M81j29o40N54K58l38k5O00o30k07P45k71n77L69L67m58
2774b27K00L03m79J36K70l86r8M65k17l47M52J54m29L58K87o49L94R0n09k36J058
2795E90p32m07J096k72m25N16J61o45J23K74n01j13O71m80J44N38k10k93N15l71
2815A79m67M09J92p05L35O70p17M1P43l80r52P87l7l32J69M81n69R2L60n24J47
2836g8N78o72L8K59k96k03M58J27l47L43K52o65J44L45p46j42J003l71l32N83
2856B78j22p10M32J97n92M17L10m63K49L18m34j94O09k10m82N74K24o05J34L49
2876B79o67K53M27m41k23N39k12l95M42R3n88N32R7m84L02K30k41J61K16m13k73
2897c66M67K7o79Q16k5n66L73L11n53L7N56m22q3L93n4k98M1K92l16K57J73p44
$$ plain form
2754 101 -246 116 -23 -326 155 26 -614 -60 198 -140 -165 435 -195 -402 343 72 -505 -136 231 -227
2774 -227 -27 276 -203 -67 203 -183 -281 184 -33 -380 72 226 -203 155 442 -207 187 277 -232 -468 590
2795 590 -142 -549 547 275 -150 366 527 -118 5 279 -222 -335 336 -144 0 538 328 35 550 179
2815 179 -288 121 313 -392 -57 613 -104 -63 680 300 -652 135 98 -234 -65 416 -153 -61 299 -225 -78
2836 -78 500 -172 -134 125 -171 -374 84 211 -136 207 459 -206 -62 283 -463 -605 398 27 -305 278
2856 278 156 -554 -122 75 -517 -100 210 -253 -4 314 -120 -314 295 85 -397 177 401 -204 -70 279
2876 279 -388 -135 292 -149 -372 167 -45 -440 2 95 -493 39 136 -348 -46 184 -57 104 320 -93 -366
2897 -366 101 128 -551 265 240 -326 47 358 -195 -158 398 -24 -107 286 232 -66 -25 267 -49 208 381 -363
2919c63K74M53n41q0P64n21n0O56l93m60N77L6o94L69N85m92j64N53l30n20L83
2940D2Q9j56K00K22m51J90Mk98J5O43n22j56N45l85n19M79J69o13P66K10n85N7
2962e4L48n47n8M67l1j54K39K12m16J66j30m26N82K13n91l1M77m72MK01J53n52
2984d00R29l73n92M26J19n92j9P15l52q8O30l47n08M20J57n07L91p8m52M99J09
3005H7l07J49M04m55m72N88M5n14N92P9n61J33P24q42J68N62l55k11M90k63k11
3026a70K80j10k83N79n8k24j2K13o72j84J036l92k77N55J59n14J36J17m92K74
3046c9M51j07k99N11m42n20O03k46j07M79K3m49J72J52m70J57M74m42K86L02j50
3067C39o66N00q1m67K74L87l73K37K17n83J2L42j54n3L76j27m93N16%m90L86K12
$$ plain form
2919 -363 -89 364 -177 -257 507 -14 -64 592 199 -261 316 352 -342 27 612 120 -44 509 179 -341 42
2940 42 131 -25 175 397 -54 136 140 -158 -143 500 -22 -178 367 -18 -537 -58 111 -502 264 474 -111 -54
2962 -54 294 -253 -311 156 125 -29 210 422 6 172 42 -384 198 411 -180 -211 266 -206 -202 -1 152 -400
2984 -400 529 156 -436 -10 109 -483 -502 213 -139 -227 403 56 -452 -32 125 -382 9 -69 -521 -22 87
3005 87 -220 -71 333 -122 -594 -6 39 -475 117 196 -365 -232 492 -350 -182 380 25 -186 304 41 -170
3026 -170 110 0 -283 296 238 14 2 215 -457 -641 395 3 -274 281 440 -74 62 179 -313 -39
3046 -39 412 305 6 517 75 -445 158 -88 -195 284 307 -142 30 182 -288 -131 343 -99 187 489 339
3067 339 -327 173 92 -375 -101 286 -87 150 367 -216 -204 138 -16 -69 307 180 -313 203 203 -287 99 311
3089C11m33R4M08o22N5L64j33j58R0J11m90L08L72o13J42M74m46r3L17m11J33
3110b20M85j31l94N20k34m35L41L58n71Q2O35n49k48L56O3l72M16N9l31L62J2
3131B04n15J00M44j36j52L93m01k64N09l36l04O00L14m84J63J90o09k62N48j17
3151a15j34L65l8k25K17n0n31M55Q8l09L98J41l69k44L15l05K34M65j74q0NM5
$$ plain form
3089 311 -122 -28 380 -242 -187 177 44 -114 -24 87 -403 -95 277 -336 -194 280 -166 -259 58 -353 -220
3110 -220 265 134 -260 260 26 -409 -68 290 -281 -199 436 -113 -361 -5 58 -314 102 161 -170 192 204
3131 204 -311 -211 233 97 -55 338 -63 -327 182 -154 -458 142 456 -28 135 325 -284 -546 2 -115
3151 -115 -249 116 78 -147 70 20 -511 -56 32 -277 121 262 -107 -351 -36 -341 -107 358 184 104 109 154
$$ [...]
8191e8
##END NTUPLES=NMR FID
##END=
